##TITLE=1H_LY-11Dix.5.B
 CD3CN, 8 sc, 
 4.06.2021
##JCAMPDX= 6.0         $$ Bruker NMR JCAMP-DX V2.0
##DATA TYPE= NMR FID
##DATA CLASS= NTUPLES
##ORIGIN= UXNMR, Bruker Analytische Messtechnik GmbH
##OWNER= root
$$ XWIN-NMR		Version 3.5
$$ Fri Jun  4 12:26:34 2021 Russian Standard Time (UT+4h)  she@DPX200
##.OBSERVE FREQUENCY= 200.131506
##.OBSERVE NUCLEUS= ^1H
##.DELAY= (6, 6)
##.ACQUISITION MODE= SIMULTANEOUS
##.ACQUISITION SCHEME= undefined
##.AVERAGES= 8
##.DIGITISER RES= 18
##SPECTROMETER/DATA SYSTEM= spect
##.PULSE SEQUENCE= zg30
##.SOLVENT NAME= CD3CN
##.SHIFT REFERENCE= (INTERNAL, CD3CN, 0, 15.7039)
##AUDIT TRAIL= $$ (NUMBER, WHEN, WHO, WHERE, WHAT)
$$ ##TITLE= Audit trail, XWIN-NMR		Version 3.5
$$ ##JCAMPDX= 5.01
$$ ##ORIGIN= Bruker BioSpin GmbH
$$ ##OWNER= she
$$ F:/spectra/data/she/nmr/H-F/1/audita.txt
$$ ##AUDIT TRAIL=  $$ (NUMBER, WHEN, WHO, WHERE, WHAT)
(   1,<2021-06-04 12:25:12.62 +0400>,<she>,<DPX200>,
      <created by zg, POWCHK disabled, PULCHK disabled
       configuration hash MD5:
       00 E9 B6 7A A2 85 ED C7 34 08 36 98 17 FE 4E 26
       data hash MD5: 16K
       C3 B0 8D EE 74 0D E3 59 A4 78 7E 4B EB 77 03 BF>)
$$ ##END=
$$ 
$$ hash MD5
$$ 30 77 F0 1D AE BA 1C 9C 2E D7 59 51 EE 9A 8D CD
##$RELAX= 
##$RELAX= 
##$RELAX= 
##$RELAX= 
##$RELAX= 
##$RELAX= 
$$ Bruker specific parameters
$$ --------------------------
##$DU= <F:/spectra>
##$EXPNO= 1
##$NAME= <H-F>
##$PROCNO= 1
##$TYPE= <nmr>
##$USER= <she>
##$AMP= (0..31)
100 100 100 100 100 100 100 100 100 100 100 100 100 100 100 100 100 100 
100 100 100 100 100 100 100 100 100 100 100 100 100 100 
##$AQSEQ= 0
##$AQ_mod= 1
##$AUNM= <au_zg>
##$AUTOPOS= <>
##$BF1= 200.13
##$BF2= 200.13
##$BF3= 200.13
##$BF4= 200.13
##$BF5= 200.13
##$BF6= 200.13
##$BF7= 200.13
##$BF8= 200.13
##$BYTORDA= 1
##$CFDGTYP= 0
##$CFRGTYP= 5
##$CHEMSTR= <none>
##$CNST= (0..31)
1 1 145 1 1 1 1 1 1 1 1 1 1 1 1 1 1 1 1 1 1 1 1 1 1 1 1 1 1 1 1 1 
##$CPDPRG= <>
##$CPDPRG1= <>
##$CPDPRG2= <>
##$CPDPRG3= <>
##$CPDPRG4= <mlev>
##$CPDPRG5= <mlev>
##$CPDPRG6= <mlev>
##$CPDPRG7= <mlev>
##$CPDPRG8= <mlev>
##$CPDPRGB= <>
##$CPDPRGT= <>
##$D= (0..31)
0 1.2 0 0 0 0 0 0 0 0.06 0 0.03 0 0 0 0 0.0002 0 0 0 0 0 0 0 0 0 0 0 0 
0 0 0 
##$DATE= 1622795112
##$DBL= (0..7)
120 120 120 120 120 120 120 120 
##$DBP= (0..7)
150 150 150 150 150 150 150 150 
##$DBP07= 0
##$DBPNAM0= <>
##$DBPNAM1= <>
##$DBPNAM2= <>
##$DBPNAM3= <>
##$DBPNAM4= <>
##$DBPNAM5= <>
##$DBPNAM6= <>
##$DBPNAM7= <>
##$DBPOAL= (0..7)
0.5 0.5 0.5 0.5 0.5 0.5 0.5 0.5 
##$DBPOFFS= (0..7)
0 0 0 0 0 0 0 0 
##$DE= 6
##$DECBNUC= <off>
##$DECIM= 32
##$DECNUC= <off>
##$DECSTAT= 4
##$DIGMOD= 1
##$DIGTYP= 9
##$DL= (0..7)
0 120 120 120 120 120 120 120 
##$DP= (0..7)
150 150 150 150 150 150 150 150 
##$DP07= 0
##$DPNAME0= <>
##$DPNAME1= <>
##$DPNAME2= <>
##$DPNAME3= <>
##$DPNAME4= <>
##$DPNAME5= <>
##$DPNAME6= <>
##$DPNAME7= <>
##$DPOAL= (0..7)
0.5 0.5 0.5 0.5 0.5 0.5 0.5 0.5 
##$DPOFFS= (0..7)
0 0 0 0 0 0 0 0 
##$DQDMODE= 0
##$DR= 18
##$DS= 0
##$DSLIST= <SSSSSSSSSSSSSSS>
$$ [...]
##$SUBNAM2= <"">
##$SUBNAM3= <"">
##$SUBNAM4= <"">
##$SUBNAM5= <"">
##$SUBNAM6= <"">
##$SUBNAM7= <"">
##$SUBNAM8= <"">
##$SUBNAM9= <"">
##$SW= 20.0188882624521
##$SWIBOX= (0..15)
0 0 2 0 0 0 0 0 0 0 0 0 0 0 0 0 
##$SW_h= 4006.41025641026
##$TD= 16384
##$TD0= 1
##$TE= 0
##$TE2= 300
##$TE3= 300
##$TEG= 300
##$TL= (0..7)
0 120 120 120 120 120 120 120 
##$TP= (0..7)
150 150 150 150 150 150 150 150 
##$TP07= 0
##$TPNAME0= <>
##$TPNAME1= <>
##$TPNAME2= <>
##$TPNAME3= <>
##$TPNAME4= <>
##$TPNAME5= <>
##$TPNAME6= <>
##$TPNAME7= <>
##$TPOAL= (0..7)
0.5 0.5 0.5 0.5 0.5 0.5 0.5 0.5 
##$TPOFFS= (0..7)
0 0 0 0 0 0 0 0 
##$TUNHIN= 0
##$TUNHOUT= 0
##$TUNXOUT= 0
##$USERA1= <user>
##$USERA2= <user>
##$USERA3= <user>
##$USERA4= <user>
##$USERA5= <user>
##$V9= 5
##$VALIST= <valist>
##$VCLIST= <CCCCCCCCCCCCCCC>
##$VD= 0
##$VDLIST= <DDDDDDDDDDDDDDD>
##$VPLIST= <PPPPPPPPPPPPPPP>
##$VTLIST= <TTTTTTTTTTTTTTT>
##$WBST= 1024
##$WBSW= 4
##$XGAIN= (0..3)
0 0 0 0 
##$XL= 0
##$YL= 0
##$YMAX_a= 154476
##$YMIN_a= -156342
##$ZGOPTNS= <>
##$ZL1= 120
##$ZL2= 120
##$ZL3= 120
##$ZL4= 120
##$ABSF1= 10
##$ABSF2= 0
##$ABSG= 5
##$ABSL= 3
##$ALPHA= 0
##$AQORDER= 0
##$ASSFAC= 0
##$ASSFACI= 0
##$ASSFACX= 0
##$ASSWID= 0
##$AUNMP= <proc_1d>
##$AZFE= 0.1
##$AZFW= 0.1
##$BCFW= 1
##$BC_mod= 2
##$BYTORDP= 1
##$COROFFS= 0
##$CY= 11.3945322036743
##$DATMOD= 1
##$DC= 2
##$DFILT= <>
##$DTYPP= 0
##$F1P= 15.9154993809931
##$F2P= -4.1035820241983
##$FCOR= 0.5
##$FTSIZE= 0
##$FT_mod= 4
##$GAMMA= 1
##$GB= 0.15
##$INTBC= 1
##$INTSCL= 1
##$ISEN= 128
##$LB= 0.24
##$LEV0= 0
##$LPBIN= 0
##$MAXI= 10000
##$MC2= 0
##$MEAN= 0
##$ME_mod= 0
##$MI= 1.114404
##$NCOEF= 0
##$NC_proc= 0
##$NLEV= 6
##$NOISF1= 3.799351
##$NOISF2= 2.8
##$NSP= 1
##$NTH_PI= 0
##$NZP= 0
##$OFFSET= 15.70392
##$PC= 1
##$PHC0= -11195.92
##$PHC1= 4.801012
##$PH_mod= 1
##$PKNL= yes
##$PPARMOD= 0
##$PSCAL= 0
##$PSIGN= 0
##$REVERSE= no
##$SF= 200.130013532006
##$SI= 16384
##$SIGF1= 3
##$SIGF2= 2
##$SINO= 400
##$SIOLD= 16384
##$SREGLST= <1H.CDCl3>
##$SSB= 0
##$STSI= 0
##$STSR= 0
##$SW_p= 3612.71676300578
##$SYMM= 0
##$S_DEV= 0
##$TDeff= 0
##$TDoff= 0
##$TI= <>
##$TILT= no
##$TM1= 0
##$TM2= 0
##$TOPLEV= 0
##$USERP1= <user>
##$USERP2= <user>
##$USERP3= <user>
##$USERP4= <user>
##$USERP5= <user>
##$WDW= 1
##$XDIM= 8192
##$YMAX_p= 0
##$YMIN_p= 0
$$ End of Bruker specific parameters
$$ ---------------------------------
##NTUPLES= NMR FID
##VAR_NAME=  TIME,          FID/REAL,        FID/IMAG
##SYMBOL=    X,             R,               I
##VAR_TYPE=  INDEPENDENT,   DEPENDENT,       DEPENDENT
##VAR_FORM=  AFFN,          ASDF,            ASDF
##VAR_DIM=   8192,          8192,            8192
##UNITS=     SECONDS,       ARBITRARY UNITS, ARBITRARY UNITS
##FACTOR=    0.0002496,     1,               1
##FIRST=     0,             0,               0
##LAST=      2.0444736,     0,               0
##MIN=       0,             -156342,         0
##MAX=       2.0444736,     154476,          0
$$ Real data points
##PAGE= N=1
##DATA TABLE= (X++(R..R)), XYDATA
0 0 0 0 0 0 0 0 0 0 0 0 0 0 0 8 -8 8 -8 16 -16 16 -24 25 -32 40 -48 54 -64 72 -81 97 -110 126 -143 161 -183
35 -183 206 -231 260 -291 326 -362 402 -449 497 -550 607 -671 740 -814 898 -989 1089 -1199
53 -1199 1322 -1460 1614 -1787 1983 -2209 2474 -2787 3163 -3625 4207 -4968 6008 -7524 9959
68 9959 -14674 41586 -124353 28137 96738 -156342 111984 -670 -101320 130112 -70705
79 -70705 -34720 118018 -123682 48974 54567 -121947 108971 -21312 -85277 139574 -96215
90 -96215 -19223 121893 -134641 48593 69191 -133861 103301 -3701 -91514 121593 -70282
101 -70282 -27247 102817 -107581 42772 47360 -105665 96739 -23095 -69325 118415 -86981
112 -86981 -9835 102606 -121383 52520 53775 -118642 98328 -11257 -80705 114110 -68541
123 -68541 -21887 93276 -98552 40567 41482 -95162 86239 -22168 -58193 103002 -78039
134 -78039 -3487 85604 -106983 52203 39368 -103036 92293 -16807 -68359 103653 -64874
145 -64874 -16548 82069 -89118 36825 35884 -82347 75266 -20169 -48439 87764 -67906
156 -67906 -278 69424 -92063 49947 28846 -87711 84398 -20731 -56910 93341 -62823
167 -62823 -11506 73566 -82054 35990 31360 -74789 69248 -19431 -43464 78260 -61543
178 -61543 2336 60207 -82527 47975 21698 -76935 78445 -24748 -47881 85822 -61234
189 -61234 -5577 65673 -77655 36795 26600 -69331 64391 -18641 -38356 70186 -55076
200 -55076 3499 51130 -72002 43928 14875 -65136 70686 -25825 -38178 75197 -57571
211 -57571 -279 56195 -71394 36125 21697 -61731 59672 -18356 -33865 62840 -49765
222 -49765 4053 43979 -63926 40900 11082 -56393 64021 -26634 -30801 67098 -55930
233 -55930 4540 49452 -67501 38053 17094 -58227 58432 -19294 -31504 58929 -47206
244 -47206 5259 40144 -58920 38549 7991 -50062 58968 -27200 -25171 60409 -52830 8215
256 8215 42575 -62730 37996 12696 -52946 54864 -19561 -27161 53875 -43869 5719 35446
268 35446 -52840 35036 5762 -43551 52584 -25233 -19912 52128 -48667 10737 35712 -57231
280 -57231 37300 8675 -47400 52271 -20493 -23836 50000 -42190 6774 32254 -49608 33858
292 33858 4656 -39962 48767 -24648 -16709 47387 -46352 12451 31278 -53190 37441 5197
304 5197 -43664 50319 -21617 -20713 47019 -41167 7998 30182 -46830 31748 4053 -36687 44348
317 44348 -22434 -14459 41984 -41425 12442 26421 -47382 34575 3005 -38322 45552 -20836
329 -20836 -17237 42562 -38227 7786 27175 -42672 28852 3934 -33343 39727 -19649 -12677
341 -12677 37107 -37551 11987 23057 -42931 32543 1294 -34298 42900 -21130 -14836 39902
353 39902 -37230 8750 25273 -41145 28465 3355 -31503 37725 -19342 -11277 34737 -35534
365 -35534 11990 20545 -39377 31094 -516 -30536 39785 -21370 -11500 36330 -35834 10137
377 10137 22499 -38336 27110 2030 -28361 34574 -18292 -9294 30827 -32167 11907 17154
389 17154 -35038 28577 -1953 -25901 35646 -21003 -8056 32146 -33741 11335 18849 -35268
401 -35268 26646 50 -25400 32723 -18524 -7225 28441 -30985 12333 15132 -32391 27290
413 27290 -3416 -22526 33233 -21510 -5228 29029 -32859 13244 16043 -33550 26800 -1528
425 -1528 -23210 31246 -18730 -5845 26457 -29232 12071 13374 -29578 25279 -3722 -19864
437 -19864 29812 -19947 -3629 25546 -30005 12922 13788 -30275 24691 -2074 -20792 28685
449 28685 -17286 -5371 24218 -26549 10839 12431 -26951 22653 -3132 -17846 27008 -18439
461 -18439 -3058 23341 -27776 12377 12324 -28259 23698 -2558 -19491 27578 -16968 -4858 23288
474 23288 -25716 10470 11924 -25706 21627 -3296 -16807 25761 -17623 -2672 21732 -26154
486 -26154 12097 11003 -26229 22449 -3135 -17588 25897 -16417 -4105 21578 -23979 9874
498 9874 10742 -23524 19951 -3172 -15174 23384 -16020 -2214 19383 -23540 11130 9349 -23149
511 -23149 20672 -3922 -15307 23959 -16015 -3040 19790 -22771 9929 9671 -22003 19107
523 19107 -3632 -13859 22137 -15727 -1459 17975 -22403 11338 7872 -21595 20325 -5038
535 -5038 -13739 22992 -16335 -1631 18530 -22302 10479 8394 -20856 18772 -4284 -12782 21055
548 21055 -15042 -948 16365 -20646 10775 6537 -19312 18742 -5395 -11724 20928 -15445
560 -15445 -855 16541 -20456 9875 7193 -18798 17278 -4145 -11357 18993 -13817 -577
572 -577 14575 -18803 10111 5499 -17333 17506 -5562 -10386 19286 -14829 -69 14901 -19326
585 -19326 10258 5897 -17569 17105 -4961 -10352 18350 -13895 98 13643 -18010 10314
597 10314 4418 -16168 16975 -6166 -9091 18032 -14509 959 13346 -18168 10378 4456 -16064
610 -16064 16367 -5444 -9039 16997 -13118 602 12109 -16475 9665 3530 -14390 15437
622 15437 -5826 -7748 16080 -13196 1283 11480 -16386 9920 3418 -14428 15431 -5439
634 -5439 -8065 15797 -12519 782 11162 -15516 9371 3155 -13516 14823 -5753 -7284 15204
647 15204 -12772 1559 10716 -15744 10053 2894 -13960 15238 -5687 -7855 15462 -12253 804
660 804 10906 -14955 9030 3085 -13130 14049 -5294 -7123 14413 -11745 1261 10185 -14665
673 -14665 9123 2905 -13187 14001 -4812 -7558 14369 -10931 381 10231 -13834 8023 3258
686 3258 -12451 12950 -4319 -7042 13452 -10577 733 9553 -13677 8437 2896 -12503 13382
699 13382 -4535 -7325 13808 -10690 356 9891 -13546 8043 3181 -12202 12830 -4396 -6900
712 -6900 13134 -10520 907 9315 -13326 8423 2669 -12017 12885 -4641 -6756 13060 -10376
725 -10376 865 9270 -12996 7923 2826 -11623 12048 -4123 -6397 12148 -9570 945 8402
738 8402 -12180 7725 2219 -10913 11798 -4360 -5848 11952 -9717 1076 8338 -12233 7571
751 7571 2418 -10815 11484 -4035 -5735 11389 -9399 1262 7730 -11841 7831 1835 -10290
764 -10290 11629 -4683 -5247 11411 -9942 1717 7777 -12123 8084 1959 -10424 11428 -4420
777 -4420 -5262 10953 -9420 1722 7268 -11389 7843 1477 -9768 10997 -4633 -4713 10597 -9353
791 -9353 1938 7132 -11296 7594 1635 -9690 10545 -4149 -4755 10143 -8673 1689 6654
804 6654 -10693 7268 1345 -9133 10286 -4287 -4266 9961 -8890 1932 6529 -10830 7502
817 7502 1284 -9164 10473 -4339 -4293 9924 -8941 1963 6438 -10702 7495 1185 -8849
830 -8849 10286 -4554 -3996 9643 -9019 2273 6185 -10610 7681 1019 -8823 10222 -4547
843 -4547 -4075 9616 -8677 1933 6250 -10105 7043 1118 -8412 9550 -4248 -3777 9123 -8317
857 -8317 2007 5951 -9873 6910 992 -8255 9530 -4220 -3827 9240 -8232 1772 6059
870 6059 -9842 6628 1179 -8080 9287 -4154 -3545 9001 -8357 2037 5761 -9897 7073
883 7073 842 -8120 9702 -4484 -3635 9217 -8578 1953 5965 -9833 6869 927 -7838 9395
897 9395 -4493 -3430 8881 -8388 2130 5686 -9562 6828 776 -7616 9155 -4504 -3336
910 -3336 8748 -8118 1989 5625 -9227 6485 798 -7400 8758 -4245 -3137 8393 -7865
923 -7865 2062 5310 -8982 6417 446 -7093 8851 -4527 -2885 8375 -8064 2308 5139
936 5139 -9144 6632 297 -7002 8983 -4718 -2701 8291 -8173 2444 4835 -8923 6847
949 6847 -81 -6653 8979 -5042 -2353 8076 -8318 2733 4700 -8788 6868 -200 -6498
962 -6498 8792 -4904 -2371 7751 -7847 2627 4403 -8222 6533 -400 -6002 8351 -4975
975 -4975 -1981 7474 -7731 2775 4167 -8111 6539 -518 -5983 8260 -4834 -1865 7257 -7590
989 -7590 2827 3839 -7847 6590 -976 -5608 8402 -5198 -1493 7168 -7848 3214 3561 -7938
1003 -7938 6896 -1214 -5427 8485 -5445 -1290 7041 -7856 3294 3289 -7637 6948 -1418 -5133
1017 -5133 8225 -5469 -1017 6655 -7711 3406 3057 -7323 6823 -1557 -4935 7971 -5336
1030 -5336 -993 6408 -7364 3359 2873 -7037 6612 -1626 -4711 7701 -5284 -828 6211 -7167
1044 -7167 3428 2518 -6846 6755 -1922 -4548 7782 -5546 -511 6232 -7444 3604 2438 -6909
1058 -6909 6866 -2082 -4404 7815 -5608 -325 5968 -7417 3905 2090 -6856 7060 -2300
1071 -2300 -4210 7838 -5805 -274 5957 -7357 3787 2066 -6658 6882 -2112 -4119 7435
1084 7435 -5503 -248 5629 -7000 3697 1917 -6343 6695 -2185 -4007 7278 -5378 -254
1097 -254 5488 -6824 3708 1884 -6281 6503 -2159 -3828 7104 -5406 -70 5314 -6744 3915
1111 3915 1545 -6246 6732 -2420 -3660 7134 -5610 254 5181 -6918 4129 1330 -6174 6850
1125 6850 -2667 -3469 7097 -5661 433 4862 -6835 4315 1125 -5984 6720 -2686 -3172 6801
1139 6801 -5562 546 4526 -6492 4326 855 -5673 6612 -2701 -3021 6521 -5391 595 4317
1153 4317 -6232 4169 719 -5314 6352 -2837 -2719 6250 -5365 927 3947 -6224 4510 464
1167 464 -5267 6438 -3119 -2468 6253 -5560 1156 3755 -6165 4724 71 -5086 6551 -3371
1181 -3371 -2132 6092 -5714 1550 3492 -6208 4879 -177 -4866 6587 -3572 -2003 6001 -5596
1195 -5596 1565 3270 -5972 4758 -194 -4568 6215 -3491 -1727 5685 -5474 1583 3089 -5767
1209 -5767 4661 -246 -4445 6018 -3360 -1642 5391 -5326 1709 2924 -5637 4615 -401 -4226
1223 -4226 6002 -3537 -1496 5322 -5366 1927 2727 -5670 4793 -584 -4048 5985 -3786 -1155
1237 -1155 5247 -5562 2184 2549 -5649 4979 -789 -3987 6008 -3804 -999 5029 -5523 2323
1251 2323 2436 -5505 4824 -876 -3694 5795 -3806 -888 4796 -5345 2340 2274 -5378 4672 -768
1266 -768 -3601 5497 -3626 -823 4592 -5129 2262 2128 -5107 4580 -889 -3422 5385 -3641 -594
1281 -594 4424 -5217 2460 2059 -5122 4653 -1060 -3291 5449 -3767 -460 4292 -5228 2689 1789 -5085
1297 -5085 4802 -1277 -3075 5422 -4015 -196 4250 -5343 2754 1709 -4963 4778 -1342 -2966 5225
1312 5225 -3908 -72 3970 -5242 2785 1649 -4784 4592 -1326 -2816 5029 -3743 -104 3790 -4959
1327 -4959 2706 1525 -4577 4436 -1327 -2627 4848 -3747 64 3721 -4902 2712 1377 -4440 4441
1342 4441 -1497 -2500 4756 -3841 336 3534 -5018 2921 1185 -4332 4525 -1796 -2221 4798 -4057
1357 -4057 586 3383 -5090 3138 980 -4291 4560 -1842 -2033 4596 -4098 728 3185 -4924 3122
1372 3122 786 -4011 4525 -1933 -1906 4432 -3995 781 3077 -4773 2975 817 -3769 4239 -1887
1387 -1887 -1741 4212 -3886 848 2877 -4612 3025 650 -3700 4180 -1973 -1565 4118 -3957 1025
1402 1025 2802 -4565 3107 405 -3553 4255 -2187 -1369 4042 -4109 1320 2637 -4670 3260 226
1417 226 -3426 4308 -2361 -1171 3994 -4133 1395 2436 -4544 3313 114 -3297 4220 -2325 -1015
1432 -1015 3841 -4092 1369 2390 -4353 3151 108 -3127 4042 -2206 -1007 3600 -3899 1343 2264
1447 2264 -4191 3054 69 -2981 3897 -2262 -931 3556 -3852 1363 2182 -4070 3088 -19 -2892
1462 -2892 3813 -2341 -713 3450 -3926 1562 2026 -4022 3231 -284 -2831 3937 -2469 -631 3411
1477 3411 -3898 1629 1900 -3939 3179 -400 -2601 3859 -2530 -494 3344 -3832 1558 1768 -3799
1492 -3799 3096 -352 -2514 3662 -2376 -475 3178 -3689 1431 1716 -3565 2939 -347 -2377 3524
1507 3524 -2305 -470 3029 -3579 1448 1661 -3457 2905 -392 -2251 3449 -2388 -370 2980 -3516
1522 -3516 1559 1498 -3378 3013 -589 -2149 3449 -2566 -188 2971 -3588 1660 1380 -3304 3012 -740
1538 -740 -2009 3401 -2583 -28 2817 -3549 1743 1263 -3262 2940 -749 -1903 3308 -2493 -71
1553 -71 2705 -3355 1604 1128 -3086 2831 -691 -1766 3150 -2425 -30 2584 -3258 1564 1112 -2938
1569 -2938 2773 -714 -1712 3057 -2382 15 2419 -3190 1674 974 -2853 2804 -889 -1578 3040 -2538
1585 -2538 142 2347 -3183 1829 817 -2810 2868 -1027 -1481 2962 -2568 305 2196 -3114 1909
1600 1909 661 -2676 2819 -1091 -1404 2928 -2463 299 2140 -3025 1796 641 -2606 2689 -1002
1615 -1002 -1311 2826 -2331 258 2013 -2866 1713 592 -2507 2628 -931 -1287 2717 -2240 203
1630 203 1919 -2760 1659 527 -2355 2598 -1046 -1208 2651 -2295 296 1837 -2769 1773 486
1645 486 -2313 2596 -1124 -1126 2612 -2292 389 1734 -2682 1858 352 -2260 2573 -1155 -1090 2543
1661 2543 -2236 415 1702 -2580 1735 333 -2182 2460 -1057 -1090 2439 -2035 339 1611 -2456
1676 -2456 1581 367 -2102 2320 -959 -1077 2364 -1932 239 1574 -2357 1499 376 -2024 2240
1691 2240 -899 -1025 2239 -1914 287 1486 -2325 1558 325 -1970 2294 -951 -999 2197 -1914 377
1707 377 1429 -2293 1615 251 -1891 2268 -1035 -935 2161 -1919 411 1383 -2235 1598 233 -1897
1723 -1897 2174 -950 -918 2061 -1800 369 1346 -2138 1463 225 -1846 2064 -846 -947 1979 -1660
1739 -1660 300 1310 -2057 1374 279 -1768 1975 -788 -882 1909 -1605 312 1223 -2032 1387 259
1755 259 -1740 2020 -803 -852 1843 -1622 371 1171 -1983 1444 209 -1717 1987 -856 -769 1809
1771 1809 -1657 456 1116 -1953 1433 165 -1613 1916 -800 -787 1763 -1630 407 1125 -1818 1362
1787 1362 179 -1539 1778 -805 -714 1655 -1504 321 1072 -1788 1234 271 -1580 1686 -628 -761
1803 -761 1585 -1421 295 1072 -1727 1248 216 -1508 1693 -710 -749 1663 -1475 393 1009 -1788
1819 -1788 1243 113 -1476 1762 -747 -648 1612 -1500 453 992 -1763 1360 28 -1463 1754 -707
1835 -707 -596 1539 -1515 411 933 -1720 1273 154 -1374 1652 -724 -613 1427 -1406 378 953
1851 953 -1671 1180 224 -1406 1474 -628 -629 1466 -1297 325 935 -1582 1115 239 -1341 1485 -675
1868 -675 -636 1459 -1292 238 930 -1590 1065 233 -1324 1528 -614 -586 1417 -1299 330 986 -1618
1885 -1618 1104 169 -1266 1489 -630 -615 1415 -1305 316 964 -1590 1087 219 -1269 1433 -650
1901 -650 -596 1406 -1309 291 1026 -1541 979 289 -1257 1361 -546 -613 1368 -1209 218 999 -1508
1918 -1508 896 302 -1300 1288 -512 -620 1363 -1206 206 979 -1468 915 285 -1242 1326 -544
1934 -544 -583 1344 -1224 250 934 -1484 975 215 -1200 1377 -610 -525 1358 -1250 291 916 -1471
1951 -1471 965 201 -1173 1343 -595 -515 1301 -1230 285 872 -1420 949 207 -1176 1309 -548
1967 -548 -554 1290 -1144 202 892 -1359 877 226 -1137 1263 -532 -555 1285 -1115 179 891 -1339
1984 -1339 866 220 -1126 1280 -534 -530 1270 -1126 224 855 -1336 915 157 -1087 1312 -622
2000 -622 -488 1274 -1173 289 781 -1356 949 94 -1086 1311 -626 -484 1226 -1152 258 776
2016 776 -1325 939 58 -991 1392 -634 -506 1253 -1103 217 819 -1281 880 146 -1054 1267
2032 1267 -558 -532 1230 -1067 203 804 -1268 886 151 -1070 1288 -547 -527 1232 -1065 221
2048 221 776 -1251 914 76 -1040 1298 -622 -473 1220 -1119 294 742 -1283 981 30 -1044
2064 -1044 1310 -671 -451 1198 -1123 337 686 -1272 1003 -6 -1026 1326 -660 -456 1214 -1089
2080 -1089 297 716 -1251 952 44 -1037 1285 -590 -477 1179 -1048 245 726 -1226 916 75
2096 75 -1044 1285 -561 -506 1164 -1049 247 696 -1233 942 59 -1015 1268 -605 -452 1133 -1094
2113 -1094 334 644 -1244 1026 -15 -1018 1315 -639 -420 1126 -1083 382 611 -1212 1048 -62
2129 -62 -977 1313 -665 -376 1119 -1087 378 664 -1221 974 31 -948 1255 -647 -395 1110 -1035
2146 -1035 339 628 -1201 977 30 -1026 1253 -563 -409 1089 -1035 325 629 -1201 961 7
2162 7 -986 1248 -576 -388 1055 -1048 403 568 -1206 1047 -59 -953 1278 -674 -339 1054 -1084
2179 -1084 449 533 -1182 1086 -119 -911 1252 -699 -259 1023 -1114 481 512 -1199 1069 -120
2195 -120 -937 1238 -682 -289 1019 -1077 450 518 -1177 1024 -87 -911 1220 -654 -298 1040 -1066
2212 -1066 420 536 -1194 1003 -56 -912 1205 -647 -257 1004 -1085 465 493 -1166 1054 -142
2228 -142 -850 1233 -721 -190 980 -1133 550 443 -1172 1091 -202 -783 1216 -821 -125 940
2244 940 -1170 598 399 -1163 1116 -216 -791 1191 -818 -125 952 -1149 586 450 -1156 1061
2260 1061 -186 -787 1184 -766 -115 960 -1130 574 458 -1188 1025 -161 -799 1180 -763 -143
2276 -143 954 -1126 572 411 -1163 1057 -198 -728 1191 -819 -52 935 -1183 615 376 -1135
2292 -1135 1088 -273 -670 1168 -865 13 845 -1209 714 318 -1118 1123 -338 -649 1172 -903
2308 -903 10 851 -1172 706 331 -1094 1098 -310 -652 1161 -871 3 878 -1146 654 351 -1095
2325 -1095 1070 -312 -689 1165 -834 -11 892 -1155 619 346 -1086 1043 -326 -627 1171 -871
2341 -871 35 857 -1167 678 285 -1068 1095 -379 -571 1152 -925 93 794 -1174 716 203 -983
2358 -983 1125 -463 -510 1152 -969 135 790 -1168 745 218 -962 1099 -470 -505 1125 -960 118
2375 118 777 -1141 735 214 -981 1084 -444 -545 1121 -943 78 819 -1121 658 228 -954
2391 -954 1057 -473 -523 1118 -916 139 790 -1132 691 191 -934 1069 -491 -435 1122 -955 176
2408 176 725 -1108 753 86 -861 1103 -550 -368 1083 -1014 235 681 -1111 771 50 -822 1121
2425 1121 -582 -353 1063 -989 231 661 -1076 760 50 -816 1090 -595 -371 1071 -984 189
2441 189 714 -1069 732 89 -833 1061 -545 -372 1047 -960 220 699 -1046 749 26 -817 1096
2458 1096 -579 -363 1037 -956 247 638 -1029 758 -34 -751 1086 -664 -260 1015 -991 309
2474 309 555 -1004 812 -92 -711 1092 -658 -218 964 -1001 312 535 -973 800 -93 -681 1089
2491 1089 -657 -248 959 -983 299 564 -963 796 -52 -708 1060 -622 -283 979 -931 266
2507 266 564 -923 784 -71 -705 1052 -630 -252 965 -942 273 521 -907 773 -136 -668 1038
2524 1038 -657 -188 905 -932 353 442 -908 813 -191 -609 1033 -697 -136 900 -936 356
2540 356 388 -857 825 -196 -576 1008 -686 -117 880 -929 350 419 -858 809 -155 -603 1008
2557 1008 -632 -172 859 -908 328 420 -872 792 -151 -616 980 -669 -188 863 -878 336
2573 336 387 -857 782 -179 -585 952 -676 -119 812 -887 394 327 -816 811 -235 -516 940
2590 940 -695 -49 763 -864 437 289 -809 807 -250 -477 917 -691 -24 733 -861 451 260
2607 260 -807 823 -231 -505 920 -664 -72 732 -848 396 287 -791 776 -219 -513 911 -646
2624 -646 -89 720 -861 410 301 -807 780 -217 -497 898 -642 -63 697 -811 457 246 -771
2641 -771 807 -260 -458 865 -667 13 657 -829 488 197 -747 797 -286 -424 861 -651 28
2658 28 598 -812 498 174 -740 779 -294 -409 848 -649 1 618 -804 459 201 -759 770
2675 770 -244 -434 846 -639 0 623 -813 459 240 -750 779 -242 -449 846 -612 -5 604
2692 604 -801 476 211 -719 759 -275 -394 803 -641 49 565 -818 494 162 -710 748 -302
2709 -302 -367 762 -659 89 531 -796 509 130 -663 750 -318 -355 767 -652 101 540 -807 490
2727 490 174 -684 730 -287 -351 780 -631 77 554 -800 475 186 -696 739 -257 -376 758 -632
2745 -632 82 579 -803 467 176 -678 730 -276 -351 734 -634 122 509 -815 499 131 -644 712
2763 712 -339 -303 708 -648 150 478 -758 511 96 -603 706 -329 -246 687 -662 177 482 -762
2781 -762 498 104 -607 687 -299 -269 667 -617 152 483 -756 478 124 -619 670 -288 -283 681 -609
2800 -609 120 489 -744 458 126 -606 649 -282 -257 652 -619 141 467 -715 463 96 -558 656
2818 656 -301 -221 624 -609 170 443 -697 479 82 -511 641 -315 -183 609 -612 176 406 -682
2836 -682 488 70 -521 629 -319 -191 608 -618 166 436 -680 460 76 -524 636 -310 -196 607
2854 607 -610 153 447 -706 450 100 -540 625 -308 -216 632 -604 141 430 -678 460 81 -517
2872 -517 619 -322 -179 627 -623 179 413 -665 463 32 -482 621 -337 -138 584 -622 198 390
2890 390 -658 467 28 -462 607 -359 -149 586 -610 181 371 -644 454 37 -464 596 -338 -151
2908 -151 594 -614 159 398 -636 440 48 -474 597 -331 -183 586 -579 153 390 -629 425 46
2926 46 -455 582 -345 -150 578 -567 172 351 -600 430 19 -424 552 -339 -116 533 -555 184 309
2945 309 -576 429 -18 -398 549 -348 -114 510 -539 187 294 -555 422 -8 -379 541 -326 -111 509
2964 509 -526 182 313 -551 420 7 -385 543 -306 -133 530 -516 160 318 -541 411 1 -391 537
2983 537 -312 -143 496 -508 170 312 -533 410 -9 -396 519 -307 -125 467 -492 182 256 -502 416 -40
3003 -40 -346 519 -321 -96 464 -482 197 265 -484 422 -42 -355 521 -301 -98 466 -480 179 269 -496 421
3024 421 -36 -366 540 -304 -129 481 -491 150 273 -504 400 -14 -372 525 -291 -138 472 -487 153 269
3044 269 -501 412 -11 -378 507 -298 -124 449 -469 187 242 -473 418 -38 -352 512 -289 -99 447 -458
3064 -458 188 240 -474 418 -45 -345 505 -313 -96 432 -450 178 226 -486 394 -31 -352 492 -287 -93 439
3085 439 -468 167 243 -493 378 -5 -359 497 -269 -130 438 -465 169 251 -498 402 1 -373 491 -267 -114
3106 -114 432 -453 169 242 -470 405 -26 -347 461 -276 -90 410 -442 180 231 -472 392 -38 -345 460 -282
3127 -282 -86 394 -447 196 220 -473 387 -34 -334 454 -268 -85 394 -448 176 227 -483 385 -4 -340 479
3148 479 -253 -94 411 -447 175 234 -483 382 7 -352 460 -266 -108 411 -448 177 232 -473 374 -2 -323
3169 -323 440 -273 -80 383 -439 175 209 -464 373 -43 -326 426 -278 -74 372 -431 185 201 -456 358 -28
3190 -28 -298 427 -274 -66 373 -436 194 221 -460 365 -20 -313 418 -255 -75 385 -438 169 226 -466 351
3211 351 -5 -329 437 -261 -95 392 -434 157 250 -461 353 2 -315 420 -266 -67 379 -432 182 227 -445
3232 -445 356 -32 -286 413 -281 -60 369 -433 186 211 -430 341 -26 -278 415 -271 -35 363 -421 199
3252 199 210 -439 359 -37 -310 427 -278 -67 393 -435 170 211 -460 342 -50 -304 429 -278 -74 385 -456
3273 -456 173 220 -461 342 -29 -320 428 -280 -90 367 -427 186 226 -412 346 -56 -287 446 -295 -20 366
3294 366 -442 177 189 -437 373 -29 -222 432 -294 -54 430 -408 198 186 -454 344 -93 -300 460 -209 -21
3315 -21 439 -444 164 211 -451 354 82 -302 454 -306 -70 400 -441 171 211 -447 361 -22 -302 449 -277
3336 -277 -75 395 -441 157 215 -435 361 -41 -283 453 -278 -58 363 -436 184 200 -415 356 -53 -267 422
3357 422 -276 -38 351 -407 180 177 -404 354 -69 -284 425 -289 -56 357 -420 170 190 -412 348 -58 -299
3378 -299 439 -282 -70 377 -416 173 198 -433 373 -38 -292 459 -262 -71 387 -402 168 203 -418 364 -45
3399 -45 -290 432 -279 -69 365 -407 172 178 -403 366 -71 -274 418 -267 -58 329 -405 187 159 -394 365
3420 365 -79 -261 427 -288 -53 347 -401 196 168 -399 365 -66 -279 425 -269 -44 361 -399 196 188 -412
3441 -412 381 -57 -301 435 -270 -60 364 -413 182 179 -424 372 -56 -291 448 -281 -56 357 -406 194 175
3462 175 -426 371 -57 -282 421 -282 -47 346 -398 193 145 -409 379 -75 -261 404 -287 -40 322 -412
3482 -412 212 162 -397 384 -64 -267 420 -273 -40 339 -411 206 163 -426 380 -55 -283 429 -288 -43 359
3503 359 -428 199 160 -448 370 -63 -303 428 -279 -44 344 -430 212 169 -439 389 -61 -289 434 -276 -40
3524 -40 321 -414 225 165 -411 382 -68 -246 410 -297 -15 317 -419 226 148 -412 379 -72 -261 400 -286
3545 -286 -17 325 -417 242 149 -422 383 -77 -269 418 -299 -32 331 -435 231 174 -430 387 -65 -266 426
3566 426 -295 -27 350 -422 233 155 -425 395 -69 -257 422 -301 -14 339 -437 227 139 -408 379 -86 -229
3587 -229 404 -299 17 301 -433 239 123 -404 381 -103 -225 385 -307 6 297 -424 234 119 -410 370
3607 370 -110 -238 403 -312 6 316 -439 247 150 -405 399 -93 -246 433 -314 17 330 -446 253 154 -409
3628 -409 400 -96 -230 427 -332 21 317 -455 261 125 -407 390 -117 -218 399 -338 45 299 -446 256
3648 256 109 -376 393 -140 -204 390 -325 50 289 -452 266 95 -374 392 -140 -187 407 -342 70 302 -450
3669 -450 274 95 -405 415 -143 -209 422 -350 59 321 -465 267 105 -399 421 -146 -215 416 -379 63 306
3690 306 -472 278 98 -388 411 -163 -195 413 -369 60 280 -439 296 49 -368 422 -182 -153 398 -364 92
3711 92 264 -423 295 30 -348 406 -184 -158 398 -365 101 268 -422 306 37 -351 423 -196 -154 422 -381
3732 -381 88 284 -442 315 43 -380 441 -201 -170 417 -394 86 271 -465 312 20 -374 437 -206 -160 430
3753 430 -400 89 260 -436 329 28 -333 434 -230 -136 407 -396 114 247 -421 320 2 -338 423 -229
3773 -229 -131 394 -398 109 234 -412 326 -19 -321 444 -246 -136 412 -402 127 250 -445 345 2 -340
3793 -340 454 -249 -136 429 -408 123 229 -449 355 -24 -341 467 -251 -113 427 -402 137 228 -420 372
3813 372 -37 -308 462 -267 -97 394 -406 152 192 -419 360 -58 -292 436 -290 -92 358 -401 169 161 -406
3834 -406 367 -82 -275 436 -297 -83 388 -414 178 177 -406 389 -68 -285 460 -287 -79 378 -411 199 168
3855 168 -425 403 -79 -297 488 -302 -72 393 -417 191 161 -423 406 -82 -286 477 -297 -61 374 -432
3875 -432 199 138 -418 407 -122 -276 471 -315 -52 351 -417 216 119 -397 408 -117 -246 447 -321 -47 343
3896 343 -411 239 123 -393 430 -122 -264 467 -321 -27 342 -424 234 124 -408 438 -153 -279 483 -342
3916 -342 -29 353 -443 264 120 -427 437 -152 -272 473 -343 -18 335 -436 267 79 -422 441 -169 -245
3936 -245 471 -339 13 305 -438 274 89 -382 444 -170 -218 461 -338 29 295 -432 295 67 -389 449
3956 449 -174 -208 454 -361 31 303 -442 303 76 -394 456 -183 -237 463 -379 43 315 -463 300 68 -409
3977 -409 473 -202 -234 470 -370 53 302 -467 314 48 -403 473 -211 -203 462 -372 70 295 -439 321 39
3998 39 -374 477 -193 -178 428 -372 87 251 -438 340 9 -373 465 -227 -183 447 -388 90 258 -449 336
4019 336 12 -370 463 -224 -176 435 -416 103 276 -461 352 20 -390 486 -234 -187 440 -413 121 272 -471
4040 -471 358 -1 -382 487 -243 -158 451 -402 124 258 -458 360 -13 -359 467 -254 -127 416 -410 136
4060 136 226 -435 360 -49 -339 467 -260 -106 392 -435 138 219 -445 352 -28 -330 471 -267 -103 419 -443
4081 -443 161 229 -457 376 -29 -329 470 -277 -115 426 -445 172 231 -453 391 -42 -343 476 -297 -89 412
4102 412 -457 185 230 -454 379 -43 -309 455 -288 -74 396 -434 188 194 -449 370 -72 -289 442 -301 -54
4123 -54 380 -436 204 190 -415 393 -57 -269 449 -299 -35 386 -444 198 183 -426 404 -65 -278 472 -303
4144 -303 -30 403 -456 205 196 -443 407 -75 -289 469 -329 -41 386 -457 212 185 -432 397 -84 -274 464
4165 464 -337 -30 381 -466 202 165 -419 389 -110 -242 438 -335 -8 370 -437 233 159 -405 396 -109 -230
4186 -230 435 -335 3 362 -430 234 140 -408 396 -126 -230 449 -354 -3 355 -464 233 135 -419 405 -129
4207 -129 -236 459 -368 1 357 -471 237 144 -408 404 -144 -215 455 -376 16 363 -451 253 127 -383 400
4228 400 -146 -195 427 -354 50 326 -434 255 98 -364 393 -158 -177 416 -360 51 309 -431 247 79 -361
4249 -361 387 -170 -174 418 -374 44 310 -442 263 84 -364 406 -174 -173 433 -377 41 324 -456 264 92
4270 92 -359 409 -193 -169 448 -387 44 319 -452 272 87 -353 401 -192 -146 417 -378 67 296 -426 265
4291 265 55 -336 390 -202 -137 400 -367 68 259 -418 266 44 -308 383 -217 -140 394 -370 70 258 -417
4312 -417 282 38 -324 404 -213 -135 415 -383 86 288 -418 285 44 -316 413 -219 -134 410 -392 79 276
4333 276 -425 299 43 -325 409 -203 -143 388 -374 84 247 -410 288 5 -298 403 -225 -119 370 -371
4353 -371 90 225 -389 287 -1 -280 381 -225 -112 369 -367 111 244 -370 301 -4 -282 408 -226 -100
4373 -100 386 -370 114 221 -387 299 -1 -292 409 -228 -99 388 -377 113 207 -406 301 -26 -301 420
4393 420 -252 -106 375 -384 114 216 -382 311 -19 -276 404 -254 -81 367 -381 127 200 -381 309 -30
4413 -30 -266 387 -245 -80 353 -359 148 179 -366 303 -46 -255 387 -240 -53 339 -371 143 174 -372 316
4434 316 -48 -259 381 -255 -71 333 -384 154 168 -390 332 -45 -265 413 -261 -62 352 -385 163 177 -365
4455 -365 340 -51 -255 388 -261 -39 328 -361 184 159 -355 336 -56 -235 367 -251 -31 309 -362 182
4475 182 132 -351 323 -69 -212 369 -261 -19 290 -368 187 121 -372 328 -77 -223 389 -252 -21 286 -375
4496 -375 201 129 -366 345 -88 -231 381 -275 -10 294 -380 204 135 -358 354 -80 -219 382 -274 -6 276
4517 276 -376 206 111 -356 340 -105 -222 351 -268 5 258 -357 210 93 -327 327 -104 -192 332 -269 20
4538 20 240 -350 217 86 -338 322 -103 -179 348 -262 17 261 -365 222 79 -327 350 -109 -171 354 -283
4559 -283 39 251 -388 243 81 -349 345 -115 -180 340 -285 40 235 -388 238 62 -326 335 -119 -176 324
4580 324 -302 52 218 -370 239 54 -311 321 -131 -138 327 -278 62 220 -347 246 46 -313 328 -130 -133
4601 -133 312 -274 68 219 -352 252 51 -300 332 -132 -128 328 -292 71 206 -371 259 48 -307 340 -151
4622 -151 -134 325 -305 76 200 -369 258 37 -300 332 -150 -129 303 -315 81 198 -354 261 33 -277 323
4643 323 -153 -104 291 -298 100 183 -334 258 9 -261 317 -165 -77 294 -300 102 174 -326 258 11 -267
4664 -267 312 -174 -81 285 -320 109 175 -356 255 1 -269 343 -184 -87 288 -318 112 168 -354 278 -4
4685 -4 -251 333 -191 -64 298 -315 129 158 -325 284 -7 -243 324 -198 -50 267 -309 132 150 -307 260
4706 260 -37 -225 304 -195 -57 245 -302 133 127 -307 268 -31 -214 291 -197 -45 254 -308 144 124 -308
4727 -308 260 -38 -214 299 -208 -41 266 -314 142 133 -308 272 -36 -205 321 -205 -25 263 -312 154 126
4748 126 -309 271 -40 -181 319 -210 -34 248 -310 140 117 -281 255 -57 -175 278 -204 -14 215 -286
4768 -286 149 111 -273 264 -64 -167 282 -211 -13 207 -294 156 92 -262 260 -74 -151 288 -212 -7 226
4789 226 -281 158 98 -278 266 -78 -157 303 -218 5 221 -289 169 90 -262 262 -99 -160 291 -233 -3
4810 -3 212 -293 163 78 -259 245 -85 -144 276 -227 7 181 -263 173 60 -243 261 -89 -128 269 -205 26
4832 26 202 -256 174 40 -224 266 -98 -119 270 -225 16 197 -273 181 48 -236 260 -103 -132 282 -223
4853 -223 12 192 -269 182 38 -244 267 -123 -140 273 -221 17 171 -279 167 28 -225 262 -122 -116 261
4874 261 -211 37 154 -252 181 28 -194 250 -109 -99 253 -215 31 157 -243 170 11 -199 244 -127
4894 -127 -106 233 -211 39 151 -249 172 4 -190 255 -128 -116 240 -230 34 158 -249 178 10 -201 254
4915 254 -140 -96 239 -226 45 150 -245 179 -4 -202 263 -133 -90 232 -209 72 144 -229 182 -10 -173
4936 -173 249 -130 -78 232 -201 56 119 -219 170 -7 -174 243 -135 -74 208 -211 52 105 -218 174 -31
4957 -31 -161 252 -130 -66 222 -215 67 118 -223 186 -19 -179 253 -135 -73 218 -205 80 123 -218 213 -24
4979 -24 -174 260 -139 -64 214 -212 76 115 -211 192 -32 -163 241 -135 -54 203 -217 64 99 -208 182 -36
5001 -36 -170 225 -148 -53 193 -199 69 92 -206 185 -37 -160 219 -140 -49 193 -202 76 36 -247 207 -37
5023 -37 -157 232 -138 -45 193 -213 97 78 -210 206 -46 -148 242 -145 -41 190 -213 96 86 -195 200
5044 200 -41 -153 222 -145 -38 180 -204 94 68 -203 193 -39 -137 209 -144 -35 166 -191 103 57 -173
5065 -173 184 -46 -131 218 -139 -6 175 -190 108 68 -184 189 -44 -121 208 -151 -19 163 -206 106 68
5086 68 -194 193 -46 -127 223 -156 -16 165 -200 107 55 -197 191 -57 -127 213 -156 -9 150 -199 116
5107 116 47 -186 187 -62 -104 195 -142 -9 147 -180 116 53 -170 183 -45 -91 186 -134 13 122 -174
5128 -174 114 45 -165 173 -62 -112 184 -140 0 127 -177 105 42 -173 167 -62 -93 193 -143 8 140
5149 140 -191 124 45 -163 191 -62 -87 195 -141 23 134 -181 121 47 -159 179 -58 -71 184 -129 20
5170 20 122 -174 123 36 -156 161 -64 -78 159 -147 11 111 -176 107 23 -143 153 -78 -76 159 -141 16
5192 16 108 -174 115 35 -138 172 -72 -60 171 -144 45 114 -177 122 38 -139 178 -83 -62 174 -142 29
5214 29 126 -176 120 21 -138 166 -79 -55 169 -152 33 108 -177 112 17 -137 158 -83 -59 165 -151 25
5236 25 102 -172 101 18 -105 149 -75 -41 152 -140 38 114 -152 112 16 -109 162 -74 -36 157 -149 51
5258 51 110 -164 116 19 -115 170 -83 -40 162 -148 66 110 -163 118 4 -125 161 -97 -49 148 -150 48
5280 48 108 -151 118 2 -115 151 -89 -43 147 -149 38 98 -147 95 -10 -95 137 -82 -30 143 -126 58
5302 58 90 -140 111 7 -92 146 -86 -25 129 -141 50 87 -147 115 -9 -99 148 -93 -28 143 -161 49
5324 49 86 -138 122 -8 -100 160 -104 -26 139 -148 47 80 -145 112 -7 -98 145 -95 -13 131 -130 52
5346 52 73 -126 110 -17 -88 131 -95 -16 131 -131 49 66 -132 117 -4 -80 137 -86 -15 115 -135 55
5368 55 61 -125 112 -24 -75 132 -105 -30 129 -139 50 53 -126 116 -20 -87 139 -105 -13 129 -146 48 62
5391 62 -123 126 -23 -80 149 -102 -6 126 -130 54 66 -119 122 -22 -89 146 -88 -3 132 -138 61 60 -119
5414 -119 118 -25 -81 124 -98 -7 104 -131 55 47 -127 114 -34 -67 135 -105 -7 109 -138 68 45 -119
5436 -119 117 -23 -68 145 -106 -10 109 -128 78 50 -130 132 -40 -79 147 -103 12 114 -139 77 54 -111
5458 -111 120 -35 -71 138 -107 -1 114 -132 80 23 -120 120 -46 -53 124 -99 -4 91 -119 76 28 -116
5480 -116 99 -47 -51 122 -94 18 90 -119 77 27 -107 119 -34 -57 132 -95 16 94 -113 85 28 -105
5502 -105 128 -42 -56 132 -98 8 87 -132 71 18 -114 111 -44 -59 122 -104 18 83 -126 74 14 -103
5524 -103 116 -47 -58 117 -104 13 78 -112 77 20 -95 118 -45 -43 110 -93 29 84 -109 85 23 -87
5546 -87 105 -46 -43 121 -93 31 77 -125 87 16 -98 105 -51 -52 119 -117 20 65 -123 84 9 -99 121
5569 121 -58 -33 121 -116 38 81 -116 92 10 -92 113 -42 -37 111 -103 32 73 -118 89 17 -91 111
5591 111 -55 -39 97 -98 39 66 -118 89 6 -87 119 -56 -24 107 -110 40 64 -117 86 -1 -98 116 -58
5614 -58 -27 96 -113 49 64 -118 92 14 -95 114 -63 -25 96 -110 40 65 -107 107 14 -79 112 -54 -19
5637 -19 96 -109 36 56 -103 86 5 -82 105 -58 -29 77 -93 40 50 -99 85 6 -82 96 -48 -9 90
5660 90 -92 49 47 -99 89 7 -69 106 -54 -9 97 -98 45 48 -109 89 4 -73 109 -57 -10 93 -91 60
5684 60 57 -94 96 1 -70 108 -53 -15 75 -101 28 40 -96 80 -10 -73 91 -63 -8 70 -96 41 39 -93 91
5709 91 -1 -57 99 -43 -1 79 -92 39 42 -93 76 -4 -62 93 -66 -11 73 -93 51 50 -85 79 -1 -63 101
5734 101 -62 -11 87 -98 33 42 -99 89 -12 -68 105 -51 -5 76 -101 48 35 -97 54 -17 -68 92 -60
5757 -60 -6 83 -93 52 38 -87 92 -6 -43 88 -50 -3 72 -96 29 33 -72 68 -8 -55 93 -58 -8 72 -77
5782 -77 45 34 -86 75 -5 -57 94 -64 -13 80 -90 38 39 -93 68 -25 -55 72 -69 -12 72 -90 52 28
5806 28 -96 84 -12 -48 92 -61 1 71 -80 46 33 -81 79 -7 -45 78 -52 -3 73 -84 41 40 -83 66
5830 66 -19 -52 72 -59 -8 71 -78 41 30 -87 72 -27 -57 78 -60 0 60 -82 44 37 -78 78 -9 -39 83
5855 83 -64 5 68 -79 47 31 -73 73 -22 -41 80 -61 -5 71 -70 43 35 -62 74 -9 -59 88 -58 -4 48
5880 48 -71 43 13 -72 60 -26 -46 84 -45 -18 63 -61 31 38 -62 74 -7 -38 75 -43 3 61 -69 39 33
5905 33 -63 72 -12 -45 92 -46 -5 60 -65 48 24 -63 70 -9 -30 89 -48 11 60 -68 42 18 -62 78 -16
5930 -16 -44 64 -42 -1 56 -62 34 26 -54 57 -10 -41 74 -39 0 46 -59 28 32 -47 68 -1 -29 77 -33 8
5956 8 53 -63 41 20 -72 62 -12 -46 77 -44 -3 55 -61 42 20 -71 76 -22 -41 83 -51 8 49 -77 44
5981 44 9 -74 61 -20 -38 68 -44 -1 43 -71 36 14 -72 64 -14 -42 65 -40 7 44 -56 39 21 -58 61
6006 61 -19 -41 60 -35 5 34 -63 41 20 -62 65 -15 -30 64 -47 9 49 -61 42 16 -63 64 -6 -41 55 -42 -1
6033 -1 45 -64 37 17 -65 63 -23 -41 65 -33 15 46 -59 46 13 -54 67 -9 -31 64 -38 12 50 -45 36 17 -63
6060 -63 66 -5 -35 45 -41 1 34 -58 37 14 -58 47 -25 -39 47 -36 -10 45 -48 35 10 -51 58 -6 -40 59 -38 -6 41
6089 41 -59 36 21 -56 60 -11 -43 63 -29 11 43 -56 47 22 -52 70 1 -22 53 -42 10 31 -45 43 10 -55 41 12
6117 12 -36 46 -39 -3 26 -59 27 14 -49 42 -7 -30 44 -30 5 47 -45 37 22 -44 53 -14 -13 51 -33 7 47 -54 42 24
6147 24 -58 54 -16 -12 56 -43 7 38 -63 43 20 -46 53 -4 -25 60 -37 11 32 -56 28 13 -53 54 -30 -31 42 -33 -19
6176 -19 50 -30 61 57 -82 29 -2 -64 39 -21 8 49 -43 46 22 -34 51 -9 -16 56 -34 9 36 -54 29 20 -35 52 -22 -33
6206 -33 51 -32 8 43 -59 37 14 -51 49 -28 -25 56 -41 -5 46 -53 34 3 -46 39 -19 -19 42 -33 -3 39 -50 33 20 -35
6236 -35 60 -12 -18 46 -31 15 40 -32 36 23 -39 47 -23 -20 56 -45 -11 33 -47 23 5 -32 46 -19 -26 58 -38 17 45 -43 40
6267 40 2 -41 52 -19 -23 42 -35 11 47 -47 32 4 -44 44 -22 -20 47 -47 10 21 -46 29 8 -29 52 -12 -11 49 -32 6 35 -41
6299 -41 25 2 -42 47 -13 -18 47 -31 5 27 -48 35 -2 -40 44 -16 -18 48 -40 7 36 -42 46 1 -33 65 -5 -6 46 -41 17 40
6331 40 -33 44 4 -33 56 -17 -9 57 -29 5 40 -39 44 8 -43 51 -12 -20 60 -31 7 22 -36 38 0 -38 42 -18 -16 38 -46 2
6363 2 34 -45 23 3 -43 60 -19 -19 56 -33 15 28 -37 37 -2 -41 54 -17 -8 51 -36 19 28 -35 46 14 -37 32 -31 -12 46 -46
6395 -46 -1 18 -64 50 13 -58 21 -19 -21 51 -41 4 26 -68 47 -22 -35 62 -32 -51 53 28 41 -52 -46 -29 -4 -146 -4
6424 -4 -15 3 35 -43 58 66 -33 60 11 -46 46 -15 17 52 -34 7 20 -45 16 -9 -48 40 -19 -12 42 -35 28 19 -50 43 -6 -18
6456 -18 50 -27 -12 42 -45 30 20 -49 37 5 -43 42 -47 -28 64 -67 9 4 -43 41 37 -16 8 -30 5 -12 -5 28 16 -4 8
6487 8 15 -7 42 -48 15 16 19 9 -9 -48 64 -20 -2 32 -43 15 8 -25 35 47 -66 13 -1 15 104 -36 -45 36 -16 6 13 91
6519 91 28 -19 -73 68 -48 46 70 -22 9 -5 -28 77 -21 -31 2 -10 43 24 -38 41 5 -69 6 -2 0 87 -38 -1 35
6548 35 -27 55 36 -89 66 -17 3 70 -35 2 78 -79 26 3 10 64 1 14 77 -46 4 44 -46 19 3 12 55 3
6576 3 -17 32 -24 -14 48 -34 22 7 -42 33 -9 -31 41 -34 11 45 -37 28 9 -32 30 -13 -24 47 -34 -3 25 -36 17 11 -27
6607 -27 45 -9 -6 53 -21 12 34 -34 33 12 -25 44 -11 -16 52 -26 11 35 -33 16 6 -33 51 -16 -20 37 -37 10 20 -42 20 13
6639 13 -25 39 -19 -14 46 -32 9 26 -37 30 5 -25 33 -11 -12 33 -25 -2 26 -30 26 8 -31 36 -13 -10 39 -26 -2 28 -37 22
6671 22 2 -11 35 -19 -7 34 -40 7 27 -38 24 -8 -27 37 -30 -11 37 -44 8 17 -35 28 3 -24 34 -18 -10 33 -34 17 31
6702 31 -25 16 -2 -20 11 55 40 40 -28 2 17 -41 26 -1 -17 38 -8 -10 37 -30 12 26 -26 25 3 -20 36 -21 -17 32 -29 8
6734 8 18 -29 27 -17 -17 38 -12 -8 46 -30 13 22 -22 32 6 -3 39 -8 8 49 -13 31 29 -24 21 7 -24 41 -11 -3 27 -34 10 25
6768 25 -30 29 -1 -6 39 -17 -1 29 -24 12 21 -21 30 3 -14 41 -12 -1 41 -32 18 12 -35 30 -4 -10 37 -12 8 50 -25 19
6800 19 29 -16 45 0 -3 43 -18 4 31 -18 19 6 -22 26 -9 -8 34 -36 1 29 -29 16 12 -24 21 -11 -17 24 -18 -2 23 -33
6832 -33 12 1 -16 26 -14 -14 43 -25 -7 27 -22 22 5 -34 44 -16 -12 44 -25 19 35 -31 29 11 -25 34 -2 -17 31 -28 -5
6863 -5 25 -39 24 8 -23 27 -11 -16 34 -31 -6 33 -29 19 14 -27 35 -2 -2 34 -25 11 30 -17 27 14 -15 32 -8 -4 23 -33 4
6896 4 26 -25 28 18 -21 36 -7 -12 35 -20 17 25 -33 33 3 -21 42 -11 -7 32 -29 4 12 -32 27 2 -32 23 -22 -19 28 -28 12
6929 12 18 -24 34 14 -22 37 -5 -6 37 -16 11 30 -32 31 8 -20 32 -18 -11 33 -20 25 20 -37 28 -12 -24 28 -14 3 33 -29
6961 -29 20 13 -39 23 4 -25 36 -13 -6 33 -19 11 8 -32 22 9 -16 40 -6 -1 35 -18 30 30 -14 38 10 -21 42 -16 10 36 -26
6994 -26 26 21 -26 40 5 -17 30 -24 3 17 -36 6 20 -28 29 -1 -24 39 -17 -2 28 -32 23 17 -36 36 -1 -21 32 -17 -5
7025 -5 33 -21 21 13 -28 37 -4 -19 36 -21 10 22 -31 33 27 -15 40 -4 -18 35 -21 4 24 -31 25 6 -40 25 -9 -19 32 -16
7057 -16 2 20 -31 16 9 -24 38 -8 7 34 -19 14 19 -31 22 22 -11 41 -11 3 32 -13 13 21 -32 27 13 -36 34 -9 -7 28 -21
7090 -21 15 27 -33 26 11 -26 36 -16 -8 38 -28 9 21 -40 29 9 -22 22 -18 -12 26 -21 8 21 -25 21 4 -21 34 -8 2
7121 2 44 -17 9 30 -21 30 19 -20 47 -4 -7 36 -22 5 22 -38 28 -1 -28 28 -20 -11 36 -24 14 27 -57 27 -1 -36 23 -21
7153 -21 -13 37 -23 20 25 -25 29 -6 -24 35 -13 -6 29 -22 14 19 -14 28 16 -22 43 -6 5 46 -19 23 14 -26 34 2 -16 28 -29
7186 -29 -9 30 -23 16 2 -37 21 -7 -27 34 -31 -8 28 -31 14 17 -41 28 -5 -23 31 -20 3 29 -38 20 14 -34 28 -3 -16
7217 -16 43 -1 5 35 -38 25 19 -25 28 -5 -14 45 -23 2 35 -34 24 16 -27 41 -10 -21 35 -21 -2 17 -35 15 15 -34 25 -7 -12
7250 -12 34 -16 0 25 -36 17 16 -28 39 -15 -17 38 -11 3 37 -34 26 14 -25 43 -14 -9 41 -26 2 24 -40 27 -2 -34 28 -17
7282 -17 -25 35 -37 -1 34 -41 21 6 -46 28 -14 -30 29 -36 -4 24 -34 7 6 -26 34 -16 -4 46 -24 2 30 -32 25 7 -13
7313 -13 40 -8 -9 41 -22 18 30 -35 31 5 -32 40 -22 -17 38 -31 5 27 -36 24 -1 -24 49 -12 -11 37 -35 0 33 -29 26 -2
7345 -2 -26 33 -20 -13 36 -23 7 20 -38 18 5 -23 38 -17 -15 41 -27 19 28 -21 35 9 -22 35 -4 -6 32 -36 11 10 -34 24 -4
7378 -4 -30 40 -17 -10 40 -48 -5 24 -34 28 -4 -15 41 -22 -15 39 -33 8 33 -36 28 -7 -34 32 -24 -10 25 -34 17 27 -25 30
7410 30 5 -20 45 -18 -1 33 -30 9 7 -26 25 -10 -10 36 -33 -9 25 -40 13 5 -34 22 -9 -13 41 -36 -21 28 -36 13 19 -23 47
7443 47 -7 -22 46 -22 2 38 -36 18 11 -29 39 -6 -22 50 -28 2 34 -36 18 15 -28 33 -11 -32 36 -25 0 29 -29 16 6
7474 6 -33 33 -12 -24 35 -22 -12 25 -35 12 10 -28 28 -14 -19 34 -22 7 34 -26 21 22 -27 37 0 -13 42 -29 -1 34 -37 27
7506 27 14 -21 51 -11 -14 39 -34 -8 2 -45 11 7 -34 30 -11 -16 34 -22 -8 24 -38 20 0 -38 38 -19 -16 30 -30 2 34 -39
7538 -39 19 5 -15 40 -10 -12 35 -21 8 41 -24 18 1 -18 43 -4 -14 44 -22 5 16 -36 27 4 -40 34 -20 -13 32 -35 -7
7569 -7 24 -36 25 2 -27 38 -22 -19 24 -28 15 16 -31 20 6 -23 38 -9 -8 27 -24 15 40 -40 30 1 -29 33 -18 -14 36 -11 4
7602 4 24 -37 32 6 -26 37 -24 -19 27 -37 -2 23 -42 23 0 -22 33 -15 -8 32 -41 10 30 -31 31 -3 -28 37 -16 -2 29 -31
7634 -31 13 23 -18 32 4 -27 22 -8 -8 28 -22 17 25 -31 34 -11 -21 44 -13 -2 30 -30 22 18 -41 23 -7 -33 44 -17 -1 26
7666 26 -31 14 14 -43 35 0 -32 38 -19 -12 22 -32 13 13 -32 33 -6 -25 35 -16 -8 36 -32 16 20 -32 29 -6 -13 36 -26 -1 40
7699 40 -35 3 16 -35 23 -11 -23 30 -23 7 30 -31 2 1 -35 24 -8 -19 30 -29 -5 25 -33 13 10 -30 29 -19 -30 26 -22
7730 -22 7 32 -24 23 7 -21 30 -11 -10 28 -20 1 21 -34 23 11 -34 21 -5 -22 27 -24 -7 16 -44 14 8 -31 36 -15 -17 33
7762 33 -32 -4 16 -28 14 6 -20 28 -6 -17 28 -29 1 42 -37 22 14 -20 32 -2 -10 31 -17 8 36 -32 19 15 -15 40 -13 -13 39
7795 39 -17 3 27 -34 14 10 -31 33 -19 -15 24 -31 1 17 -31 20 2 -24 30 -10 -17 22 -13 10 26 -39 32 16 -15 35 -2 -7
7827 -7 36 -17 6 32 -28 25 6 -25 25 -13 -14 27 -16 5 26 -37 16 -3 -28 31 -7 -12 31 -42 11 16 -35 28 6 -15 17 -19
7859 -19 -17 29 -30 17 20 -20 31 8 -19 28 -17 -12 35 -29 14 39 -18 34 10 -23 31 -19 -4 27 -36 -4 21 -29 24 1 -25 22
7891 22 -13 -8 35 -28 6 20 -28 22 0 -22 31 -17 -7 24 -26 7 18 -34 26 1 -30 38 -16 -3 30 -36 21 22 -19 28 6
7922 6 -10 42 -12 -3 31 -20 24 27 -29 24 -5 -14 36 -23 -20 21 -37 10 7 -30 21 -8 -27 37 -23 -2 19 -35 18 21 -21 34 -7 -25
7956 -25 27 -17 4 27 -28 22 17 -28 39 -12 -14 27 -22 0 33 -19 16 22 -32 42 0 -4 44 -30 2 17 -34 19 10 -31 23 -6 -22
7989 -22 39 -24 -4 19 -32 4 10 -25 27 -10 -12 27 -29 12 26 -25 15 11 -22 34 -5 -7 34 -31 2 28 -41 22 12 -40 38 -16
8021 -16 -34 38 -29 3 37 -20 33 7 -16 22 -15 -32 19 -10 20 27 -26 30 -2 -35 23 -12 -2 28 -30 -7 3 -37 24 14 -6
8052 -6 14 11 -17 38 0 46 39 -31 5 7 -20 47 -19 12 19 -19 -5 10 -7 14 6 -48 24 -23 -32 18 -7 1 20 -19 14 5 -6 13 -7
8087 -7 7 27 2 24 28 -21 21 1 -31 15 11 35 29 -22 24 10 -42 17 -31 -38 69 25 12 50 2 0 3 -12 68 -27 -21 16 -9 6
8121 6 31 -44 -10 34 -44 27 -31 -51 41 -15 -21 16 -39 1 -12 -35 -46 11 -16 71 7 -34 13 -56 13 27 -39 34 -5 -11 41 -31
8153 -31 -9 24 -38 14 30 -26 33 15 -2 30 -15 1 8 6 12 4 5 10 -24 -19 47 -43 -13 56 -72 13 10 -13 8 -6 -45 25 6 6
8187 6 32 -3 -5 22
8191B2
$$ Imaginary data points
##PAGE= N=2
##DATA TABLE= (X++(I..I)), XYDATA
0 0 0 0 0 0 0 0 0 0 0 0 0 0 0 -8 8 -8 8 -8 9 -16 16 -24 24 -30 32 -40 43 -49 57 -66 75 -86 97 -108 123 -139
36 -139 155 -171 192 -213 236 -262 290 -322 354 -390 430 -473 520 -574 632 -697 768 -850 939
55 939 -1043 1160 -1299 1461 -1656 1892 -2189 2569 -3081 3798 -4869 6628 -9958 18218 -73738
70 -73738 -67291 154476 -129158 17776 97486 -139353 87110 20522 -111505 128456 -61970
81 -61970 -44516 118638 -113994 35118 69371 -130509 105944 -5868 -104393 141477 -74755
92 -74755 -47213 132714 -120548 25078 83455 -128554 84649 12259 -98278 115992 -55324
103 -55324 -38673 103876 -100313 32968 56407 -111630 93194 -9887 -85462 123997 -72211
114 -72211 -32676 114059 -112354 30507 69228 -117751 83832 6353 -88806 107798 -52853
125 -52853 -33568 93511 -91891 30638 49311 -97289 83190 -11816 -71325 107637 -67474
136 -67474 -22144 95809 -101779 35239 55794 -105050 79864 722 -77930 97265 -49879
147 -49879 -28196 82927 -80705 27560 41713 -83469 72037 -12144 -59200 90893 -60037
158 -60037 -13471 79766 -90154 36327 43709 -92413 74939 -4756 -67798 89764 -47982
169 -47982 -23158 74958 -74807 26396 36799 -75908 65503 -11629 -51156 81086 -55737
180 -55737 -8782 69103 -82159 36958 34497 -82729 72386 -9264 -59033 83326 -48587
191 -48587 -17655 68417 -71152 26440 33122 -68833 59890 -11304 -44686 70987 -50164
202 -50164 -5248 57968 -72044 36332 26254 -71384 66059 -13001 -48962 74468 -47381
213 -47381 -12073 60803 -65209 26334 28154 -62337 54597 -11071 -39240 62871 -45348
224 -45348 -2470 50306 -64480 34540 20189 -62633 61353 -16281 -40926 69007 -47497
235 -47497 -6837 55208 -63691 28101 24931 -59482 52596 -11225 -35585 58630 -43055 -1180
247 -1180 44870 -59086 33482 15677 -55705 57503 -17979 -34271 62530 -46645 -2614 49026
259 49026 -59859 28540 21148 -53985 49263 -11936 -31672 53042 -39462 -152 39274 -52468
271 -52468 30955 12522 -48206 51045 -18659 -27602 55432 -44400 1113 42946 -55531 29107
283 29107 17039 -49923 47029 -12913 -28342 49700 -37888 1228 36229 -49303 29341 10397
295 10397 -43780 47736 -19226 -23460 51187 -42917 3920 38152 -53094 29882 13874 -46469
307 -46469 45654 -14184 -25450 47318 -36743 1459 33613 -45672 27072 9366 -39231 42928
319 42928 -17714 -19914 44908 -39200 5181 32955 -47715 28121 11024 -41050 41988 -14254
331 -14254 -22622 43081 -33659 1589 30676 -41360 24118 8867 -35097 38012 -16342 -17164 40269
344 40269 -35964 5912 29162 -43811 27324 8485 -37863 40272 -15001 -20303 41160 -33137
356 -33137 2520 29105 -39872 23318 7773 -32823 36264 -16053 -15403 37342 -33854 6721
368 6721 25705 -40537 26550 5905 -33725 38074 -16120 -17069 38218 -32055 3553 26210 -36793
381 -36793 22163 6249 -29281 33033 -15289 -12822 32891 -31004 7359 21884 -35944 24866
393 24866 3221 -28916 35037 -16845 -13662 34445 -30706 5478 22946 -34445 22103 4208
405 4208 -26659 31482 -15817 -10875 30674 -29595 8020 19199 -33070 24325 789 -25610
417 -25610 33369 -18021 -10485 32017 -30663 7338 20643 -32944 22128 2553 -24597 30187
429 30187 -15645 -9508 28240 -27601 7982 17014 -29954 22360 -44 -22317 30081 -17170
441 -17170 -8446 28589 -28224 7363 18160 -29884 20642 1972 -22483 27614 -14149 -8810
453 -8810 25794 -25032 6916 15676 -26960 20150 -257 -20175 27645 -16034 -7435 26308 -26531
466 -26531 7529 16653 -28367 20106 1425 -21417 26726 -13885 -8408 24856 -24008 6626
478 6626 14746 -25634 19441 -480 -19041 26086 -15316 -6527 24396 -25073 7620 14979 -26326
491 -26326 19330 580 -19729 25138 -13272 -7578 22865 -22186 6333 13331 -23399 17806
503 17806 -564 -17115 23511 -13987 -5579 21679 -22537 7490 12621 -23727 18449 -506
515 -506 -17776 23628 -13063 -6387 21352 -21175 6480 12062 -21976 17272 -1222 -15804 22424
528 22424 -13769 -4519 20038 -21721 8201 10927 -22490 18531 -1724 -16210 22984 -13654
540 -13654 -5177 20124 -20771 7103 10795 -20945 16964 -1604 -14593 20873 -13080 -3700 17983
553 17983 -19898 8103 9210 -20137 17357 -2420 -14332 20992 -12934 -4235 18087 -18974
565 -18974 6882 9536 -18977 15472 -1738 -12999 18907 -12094 -2993 16150 -18197 7917
577 7917 7864 -18488 16356 -2866 -12799 19578 -12686 -2997 16588 -18399 7497 8221 -18178 15537
591 15537 -2447 -12053 18321 -12083 -2194 14908 -17602 8299 6677 -17260 15985 -3555 -11245
604 -11245 18363 -12640 -1884 14860 -17461 7951 6894 -16709 14904 -2844 -10754 16729
616 16729 -11420 -1559 13262 -15967 7913 5688 -15323 14479 -3610 -9760 16299 -11681 -1033
629 -1033 13075 -16028 7912 5876 -15437 14038 -3037 -9851 15699 -10867 -1157 12402 -15191
642 -15191 7714 5175 -14619 13862 -3630 -9055 15582 -11401 -497 12359 -15783 8050
654 8050 5422 -15114 13936 -3018 -9559 15328 -10511 -1181 11937 -14699 7252 5156 -13959
667 -13959 13060 -3117 -8689 14531 -10537 -759 11622 -14641 7249 5450 -14072 12660 -2372
680 -2372 -9140 14013 -9490 -1457 11319 -13520 6405 5332 -13179 11792 -2413 -8439 13408
693 13408 -9544 -856 11052 -13739 6814 5250 -13577 12085 -2320 -8827 13674 -9246 -1227
706 -1227 11124 -13371 6358 5123 -13012 11649 -2486 -8111 13235 -9433 -678 10643 -13439
719 -13439 6688 4825 -12894 11721 -2494 -8011 13052 -9193 -905 10435 -12869 6111 4856
732 4856 -12103 10856 -2239 -7413 12006 -8721 -534 9574 -12252 6273 4282 -11608 10813
745 10813 -2600 -7201 11976 -8799 -562 9696 -12070 6010 4394 -11329 10299 -2523 -6762
758 -6762 11464 -8661 -31 9122 -11933 6416 3675 -11131 10680 -3148 -6465 11777 -9096
771 -9096 139 9286 -12128 6264 3829 -10963 10273 -2863 -6133 11153 -8676 307 8516
784 8516 -11590 6284 3307 -10346 10136 -3104 -5763 10937 -8691 260 8482 -11309 5917
797 5917 3540 -10036 9550 -2703 -5646 10237 -8181 307 7977 -10754 5914 3141 -9606
810 -9606 9495 -3108 -5404 10257 -8399 530 8009 -10902 6052 3094 -9735 9504 -3137
823 -3137 -5334 10262 -8330 639 7852 -10733 6047 2755 -9457 9484 -3364 -4955 10138
836 10138 -8449 902 7660 -10797 6081 2719 -9386 9424 -3106 -5080 9907 -7942 511
849 511 7378 -10168 5601 2667 -8795 8926 -3023 -4755 9479 -7808 553 7164 -9952
862 -9952 5626 2632 -8786 8927 -2919 -4973 9456 -7651 339 7259 -9690 5398 2561
875 2561 -8513 8778 -3178 -4689 9387 -7841 788 7124 -9966 5850 2374 -8805 9091
888 9091 -3289 -4820 9635 -7770 632 7103 -9714 5638 2170 -8489 8876 -3289 -4484
901 -4484 9317 -7692 754 6794 -9533 5555 2022 -8250 8778 -3169 -4451 9083 -7417
914 -7417 577 6578 -9187 5313 2062 -7872 8421 -3124 -4205 8723 -7315 718 6253 -8944
928 -8944 5559 1734 -7769 8555 -3407 -4044 8740 -7552 993 6257 -9042 5767 1521 -7735
942 -7735 8624 -3632 -3881 8637 -7543 1344 5875 -8952 6003 1069 -7511 8668 -3964
955 -3964 -3534 8610 -7625 1478 5670 -8849 5951 1024 -7352 8376 -3669 -3348 8116 -7211
969 -7211 1443 5182 -8331 5780 695 -6814 8225 -3808 -3089 7882 -7213 1566 5028 -8291
983 -8291 5803 754 -6676 8032 -3817 -2925 7590 -7120 1822 4622 -8087 6181 307 -6534
997 -6534 8173 -4232 -2616 7580 -7416 2206 4503 -8173 6385 3 -6431 8225 -4398
1010 -4398 -2429 7395 -7296 2441 4160 -8009 6355 -229 -6074 8009 -4472 -2100 7144 -7137
1024 -7137 2508 3858 -7780 6269 -282 -5863 7770 -4255 -1954 6808 -6921 2473 3631 -7492
1038 -7492 6134 -386 -5594 7610 -4246 -1801 6465 -6869 2753 3344 -7457 6362 -626 -5441
1052 -5441 7768 -4617 -1698 6567 -7044 2910 3271 -7447 6510 -785 -5346 7664 -4738
1065 -4738 -1335 6345 -7172 3270 3083 -7436 6641 -1053 -5288 7738 -4747 -1344 6271 -6963
1079 -6963 3183 3037 -7235 6292 -944 -5014 7353 -4527 -1210 5962 -6706 3120 2809 -7043
1093 -7043 6196 -925 -4897 7186 -4419 -1142 5813 -6652 3034 2770 -6830 6106 -1045 -4711
1107 -4711 7108 -4497 -905 5579 -6768 3374 2596 -6863 6299 -1296 -4519 7152 -4816
1120 -4816 -676 5532 -6865 3611 2360 -6769 6442 -1485 -4337 6996 -4889 -343 5326 -6825
1134 -6825 3683 2191 -6499 6262 -1642 -4068 6703 -4752 -130 4938 -6617 3751 1980
1147 1980 -6296 6082 -1642 -3834 6437 -4605 -61 4673 -6300 3675 1676 -5947 5989 -1789
1161 -1789 -3475 6226 -4796 343 4482 -6479 3914 1445 -5857 6186 -2087 -3331 6222 -4936
1175 -4936 619 4232 -6496 4233 1153 -5700 6256 -2419 -2958 6133 -5216 926 4055 -6461
1189 -6461 4416 867 -5601 6287 -2458 -2853 5907 -5063 990 3859 -6177 4214 719 -5212
1203 -5212 6045 -2522 -2643 5685 -4929 1035 3687 -5996 4115 710 -5018 5780 -2484 -2394 5503
1218 5503 -4911 1099 3525 -5854 4197 482 -4934 5843 -2615 -2219 5404 -5063 1354 3413
1232 3413 -5869 4321 200 -4728 5960 -2946 -1995 5410 -5239 1590 3257 -5927 4483 103
1246 103 -4610 5848 -3040 -1770 5272 -5196 1597 3066 -5649 4413 -75 -4386 5678 -2975
1260 -2975 -1592 5058 -5106 1613 3034 -5469 4173 -15 -4149 5426 -2884 -1530 4824 -4893 1623
1275 1623 2805 -5303 4158 -150 -3969 5333 -3068 -1306 4812 -5020 1727 2704 -5276 4309 -321
1290 -321 -3918 5360 -3191 -1075 4683 -5156 1988 2529 -5224 4446 -617 -3739 5458 -3409 -961
1305 -961 4655 -5111 2061 2383 -5126 4371 -628 -3512 5226 -3408 -783 4525 -4989 1982 2251 -4898
1321 -4898 4221 -639 -3376 4995 -3221 -727 4269 -4814 1932 2116 -4711 4098 -741 -3168 4945
1336 4945 -3284 -660 4145 -4758 2043 1963 -4619 4161 -880 -2963 4900 -3523 -412 4076 -4815
1351 -4815 2249 1689 -4513 4381 -1190 -2812 4926 -3732 -162 3980 -4915 2414 1592 -4397 4310
1366 4310 -1355 -2594 4809 -3728 -29 3745 -4722 2509 1353 -4263 4227 -1375 -2444 4643 -3635
1381 -3635 -25 3639 -4490 2316 1218 -3995 4048 -1414 -2251 4461 -3576 120 3435 -4462 2388
1396 2388 1127 -3853 4057 -1548 -2072 4469 -3670 220 3264 -4440 2575 905 -3767 4162 -1771
1411 -1771 -1852 4438 -3915 440 3185 -4440 2748 702 -3656 4234 -1937 -1746 4316 -3903 598 3032
1427 3032 -4378 2767 617 -3499 4080 -2003 -1664 4236 -3735 553 2881 -4156 2654 588 -3377
1442 -3377 3867 -1889 -1535 4052 -3602 569 2767 -4003 2577 458 -3242 3867 -1888 -1473 3964
1457 3964 -3559 631 2639 -3981 2599 367 -3060 3866 -2066 -1292 3916 -3677 809 2445 -4016
1472 -4016 2843 231 -3043 3911 -2142 -1205 3804 -3682 878 2308 -3848 2857 57 -2907 3883
1487 3883 -2184 -1177 3676 -3539 912 2248 -3713 2696 91 -2758 3670 -2104 -1136 3530 -3290
1502 -3290 855 2120 -3537 2587 45 -2679 3520 -2030 -1045 3419 -3234 854 2013 -3445 2580
1517 2580 -75 -2574 3539 -2052 -946 3289 -3263 1020 1828 -3453 2702 -240 -2435 3650 -2218
1532 -2218 -844 3249 -3297 1115 1682 -3352 2781 -351 -2297 3560 -2292 -707 3134 -3303 1166
1547 1166 1644 -3219 2723 -373 -2248 3408 -2149 -699 2938 -3111 1144 1563 -3066 2561 -414
1562 -414 -2128 3281 -2110 -654 2861 -2987 1137 1475 -3004 2511 -433 -2055 3174 -2095 -485
1577 -485 2746 -2989 1245 1306 -2937 2626 -623 -1934 3232 -2175 -339 2643 -3084 1389 1171 -2896
1593 -2896 2616 -717 -1750 3186 -2262 -212 2518 -3053 1459 1068 -2804 2660 -713 -1744 3028
1608 3028 -2208 -186 2380 -2922 1360 1059 -2648 2535 -666 -1711 2854 -2042 -200 2267 -2787
1623 -2787 1350 1032 -2600 2418 -625 -1675 2765 -1959 -179 2190 -2650 1374 896 -2525 2442
1638 2442 -690 -1576 2745 -2005 -54 2149 -2699 1395 799 -2477 2455 -760 -1465 2675 -2032 51
1654 51 2013 -2709 1464 728 -2428 2434 -755 -1410 2606 -1969 6 1927 -2575 1391 736 -2331
1670 -2331 2302 -628 -1372 2418 -1856 -34 1865 -2428 1279 740 -2238 2179 -568 -1403 2316 -1723
1686 -1723 -57 1818 -2320 1222 744 -2160 2079 -601 -1300 2264 -1740 21 1766 -2338 1287
1701 1287 674 -2181 2077 -625 -1222 2227 -1774 111 1700 -2324 1328 576 -2107 2103 -663 -1156
1717 -1156 2200 -1754 130 1652 -2286 1253 618 -2031 1994 -595 -1115 2090 -1673 78 1568
1732 1568 -2168 1205 632 -1974 1900 -507 -1123 1971 -1578 11 1553 -2056 1106 637 -1899 1801
1748 1801 -500 -1064 1914 -1569 97 1532 -2023 1134 598 -1887 1808 -577 -999 1882 -1529 158
1764 158 1501 -2050 1200 557 -1834 1707 -631 -878 1916 -1578 219 1401 -1987 1134 524 -1788
1780 -1788 1714 -556 -909 1805 -1514 135 1366 -1969 1077 444 -1656 1682 -541 -877 1689 -1378
1796 -1378 45 1358 -1858 972 590 -1559 1552 -511 -775 1621 -1382 105 1310 -1784 976
1811 976 538 -1627 1499 -527 -791 1676 -1423 161 1323 -1835 1002 437 -1573 1565 -570 -791
1827 -791 1647 -1373 235 1182 -1837 1064 395 -1515 1533 -585 -750 1653 -1365 197 1146 -1787
1843 -1787 938 454 -1400 1506 -487 -762 1574 -1384 82 1235 -1667 909 504 -1460 1356 -489
1859 -489 -770 1498 -1276 58 1178 -1629 862 459 -1350 1377 -489 -741 1529 -1259 49 1211
1875 1211 -1601 857 439 -1391 1380 -494 -735 1517 -1332 151 1203 -1615 900 406 -1368 1404
1891 1404 -518 -726 1540 -1252 89 1195 -1560 798 416 -1318 1366 -455 -742 1516 -1202 3
1907 3 1225 -1488 716 476 -1322 1274 -387 -784 1466 -1113 -57 1163 -1450 696 479 -1295
1923 -1295 1270 -372 -777 1447 -1109 -37 1166 -1428 701 460 -1279 1262 -421 -745 1421 -1148
1939 -1148 7 1104 -1452 774 380 -1274 1298 -490 -717 1440 -1164 43 1094 -1425 774
1954 774 369 -1235 1266 -465 -680 1399 -1126 41 1067 -1401 738 391 -1250 1236 -389 -723
1970 -723 1343 -1036 -7 1043 -1336 698 406 -1205 1210 -370 -722 1339 -1012 -28 1030 -1331
1986 -1331 701 395 -1212 1197 -397 -703 1317 -1030 38 988 -1341 780 313 -1200 1259 -450
2002 -450 -653 1313 -1083 113 959 -1364 809 286 -1223 1251 -465 -648 1285 -1079 124 920
2018 920 -1346 755 290 -1222 1209 -408 -684 1266 -1001 41 934 -1298 745 330 -1184 1193
2034 1193 -372 -686 1249 -984 33 944 -1289 741 348 -1193 1181 -368 -668 1230 -985 88
2050 88 903 -1293 806 276 -1167 1248 -433 -612 1252 -1053 158 878 -1329 862 246 -1160 1236
2067 1236 -459 -567 1218 -1070 189 835 -1334 868 224 -1158 1242 -447 -594 1198 -1034 155
2083 155 869 -1311 815 290 -1157 1182 -385 -609 1197 -991 116 873 -1282 804 313 -1168
2099 -1168 1161 -357 -606 1179 -992 143 878 -1284 811 283 -1127 1169 -438 -542 1181 -1049
2115 -1049 234 833 -1338 863 232 -1130 1195 -478 -488 1158 -1076 268 771 -1329 910 191
2131 191 -1106 1190 -493 -484 1149 -1066 255 769 -1336 843 271 -1104 1164 -435 -532 1143 -1007
2148 -1007 199 812 -1284 816 291 -1093 1102 -432 -521 1117 -1008 213 804 -1275 823 250
2164 250 -1083 1106 -456 -453 1113 -1053 285 770 -1300 867 168 -1047 1148 -532 -406 1102 -1091
2181 -1091 340 706 -1303 905 113 -992 1164 -559 -364 1098 -1108 347 707 -1300 894 154
2197 154 -999 1128 -529 -391 1068 -1078 312 736 -1252 861 152 -994 1151 -519 -422 1076
2213 1076 -1074 288 750 -1249 837 153 -973 1121 -567 -374 1073 -1090 365 706 -1252 913
2229 913 67 -951 1155 -640 -307 1070 -1139 420 652 -1232 934 -26 -892 1190 -698 -222 1046
2246 1046 -1167 462 623 -1250 937 -27 -860 1198 -688 -246 1068 -1139 411 618 -1214 914
2262 914 -3 -857 1153 -670 -254 1054 -1161 381 666 -1200 903 17 -885 1151 -644 -271 1042
2279 1042 -1143 417 630 -1176 939 -59 -830 1174 -742 -222 1048 -1154 496 579 -1160 979
2295 979 -138 -773 1164 -795 -100 1022 -1202 547 524 -1176 1002 -183 -774 1176 -778 -111 1005
2312 1005 -1188 507 514 -1156 973 -151 -773 1177 -767 -160 998 -1161 462 516 -1160 976 -99
2329 -99 -777 1155 -752 -171 1000 -1145 458 511 -1108 1010 -159 -765 1165 -785 -124 959 -1162
2346 -1162 545 469 -1104 1023 -235 -697 1156 -855 -53 927 -1147 609 350 -1096 1064 -310
2362 -310 -677 1161 -872 -24 926 -1147 592 331 -1071 1043 -304 -672 1159 -817 -35 900 -1128
2379 -1128 585 351 -1062 1047 -252 -685 1169 -809 -94 896 -1086 559 340 -1036 1046 -271
2395 -271 -647 1136 -840 -55 877 -1103 590 285 -1036 1078 -350 -625 1125 -878 22 803 -1088
2412 -1088 682 212 -986 1086 -428 -561 1129 -900 62 776 -1063 715 175 -994 1085 -405
2428 -405 -536 1100 -875 73 763 -1056 683 164 -973 1090 -396 -567 1128 -832 32 779 -1051
2445 -1051 640 195 -965 1061 -385 -548 1104 -829 40 720 -1058 703 171 -964 1076 -392
2461 -392 -513 1067 -867 91 673 -1020 759 101 -883 1109 -486 -461 1029 -890 180 625 -1023
2478 -1023 794 66 -858 1068 -507 -417 1032 -864 189 595 -991 784 50 -880 1052 -477 -431
2495 -431 1025 -853 164 616 -997 727 73 -889 1052 -439 -464 993 -804 150 590 -1006 729
2512 729 76 -846 1059 -449 -429 988 -814 175 545 -967 772 32 -802 1044 -507 -362 919
2529 919 -852 261 494 -950 813 -47 -782 1037 -530 -332 895 -824 283 465 -929 789
2545 789 -58 -744 1023 -545 -343 893 -815 274 485 -956 754 -17 -781 986 -494 -350 882
2562 882 -801 237 493 -921 751 -16 -757 993 -467 -341 861 -808 268 469 -924 742
2578 742 -42 -700 993 -510 -275 816 -821 317 391 -900 784 -106 -659 952 -563 -204 773
2595 773 -841 340 384 -855 781 -125 -631 934 -556 -185 747 -845 371 398 -884 758 -95
2612 -95 -646 925 -524 -219 765 -794 339 400 -858 751 -74 -652 906 -509 -190 769 -823 319
2630 319 423 -855 730 -105 -636 896 -507 -151 725 -830 365 356 -837 749 -141 -566 873 -550
2648 -550 -110 699 -826 388 305 -810 762 -152 -546 835 -566 -68 673 -814 398 312 -797 772
2666 772 -148 -564 844 -546 -105 690 -806 374 347 -794 716 -118 -558 847 -532 -111 711 -801
2684 -801 356 340 -818 716 -115 -568 832 -540 -95 685 -786 352 298 -763 730 -165 -494 807
2702 807 -562 -45 637 -805 395 277 -746 715 -185 -445 799 -592 -17 631 -791 421 247
2719 247 -742 732 -188 -451 791 -582 -33 646 -769 376 273 -727 702 -175 -478 782 -581
2736 -581 -66 650 -790 355 288 -739 677 -163 -461 791 -577 -58 659 -762 370 277 -730 685
2754 685 -183 -407 776 -600 -8 626 -757 403 229 -693 689 -222 -377 759 -593 21 573 -745
2772 -745 418 185 -645 675 -265 -350 751 -619 11 566 -732 390 207 -645 644 -225 -360 722
2790 722 -593 -2 580 -719 364 214 -649 634 -199 -379 743 -563 -24 581 -707 358 221
2807 221 -618 627 -223 -349 723 -560 1 532 -684 374 180 -604 618 -255 -322 686 -568 21
2825 21 504 -668 381 135 -550 627 -277 -300 679 -569 50 499 -674 377 147 -540 628 -265
2843 -265 -308 686 -537 19 501 -648 379 150 -568 631 -259 -319 700 -551 3 531 -665 361
2861 361 164 -565 629 -248 -323 693 -548 20 503 -661 371 121 -550 641 -296 -310 676 -552
2879 -552 40 474 -641 392 104 -519 632 -301 -263 652 -564 66 452 -621 399 84 -498 627
2897 627 -303 -271 646 -540 70 449 -619 372 95 -503 616 -277 -293 660 -527 35 459 -619 368
2916 368 102 -531 598 -261 -296 645 -516 36 444 -604 365 85 -508 606 -268 -275 620 -509 55
2935 55 413 -586 368 68 -462 588 -281 -229 568 -506 94 377 -560 383 41 -448 572 -281 -217 551
2955 551 -492 83 362 -537 380 47 -457 555 -268 -231 544 -491 74 384 -558 360 66 -473 538
2974 538 -241 -242 545 -464 68 359 -554 351 59 -468 540 -240 -221 548 -471 78 353 -534 365 52
2994 52 -441 529 -247 -198 501 -470 100 313 -517 378 23 -423 529 -260 -182 491 -461 99 308 -509 369
3015 369 38 -420 519 -246 -179 494 -455 99 318 -522 379 62 -446 512 -222 -223 514 -442 94 339 -524
3036 -524 365 62 -438 518 -224 -209 513 -454 95 328 -535 349 57 -428 513 -229 -181 478 -445 100 304
3057 304 -512 361 31 -408 500 -244 -175 460 -454 114 295 -500 360 29 -396 491 -236 -172 474 -437 110
3078 110 302 -499 361 56 -398 495 -242 -185 482 -449 97 329 -503 343 68 -405 475 -226 -191 481 -439
3099 -439 103 328 -506 328 62 -414 479 -220 -175 467 -437 96 288 -498 331 41 -375 468 -235 -147 452
3120 452 -440 114 291 -493 329 35 -369 464 -243 -142 441 -448 119 296 -474 337 47 -370 454 -239
3140 -239 -171 453 -444 94 317 -489 314 62 -387 445 -234 -170 455 -428 91 315 -492 308 59 -399 447
3161 447 -232 -167 466 -428 90 302 -490 308 51 -362 448 -233 -137 443 -436 105 289 -468 321 33 -346
3182 -346 439 -236 -125 415 -424 112 272 -456 306 21 -334 432 -231 -129 439 -430 94 294 -462 304
3202 304 43 -346 429 -234 -164 436 -415 82 297 -448 302 52 -357 437 -227 -152 451 -416 96 307 -444
3223 -444 296 38 -348 430 -237 -129 437 -407 91 278 -429 300 17 -319 436 -247 -121 430 -411 106
3243 106 258 -427 301 2 -316 425 -258 -126 422 -426 89 276 -437 299 15 -339 446 -239 -151 435
3263 435 -419 73 288 -438 299 23 -373 468 -235 -134 457 -393 66 293 -439 302 12 -357 470 -241
3283 -241 -85 440 -420 119 262 -455 324 -34 -350 453 -255 -128 408 -392 120 257 -427 309 -28 -339
3303 -339 433 -242 -171 375 -430 55 267 -469 345 -45 -313 451 -221 -174 409 -422 129 285 -481 289 68
3324 68 -387 427 -258 -141 460 -411 80 277 -449 308 26 -373 429 -241 -157 431 -387 102 265 -444 326
3345 326 3 -349 441 -238 -133 411 -405 111 236 -425 314 -2 -319 422 -234 -109 393 -389 127 234
3365 234 -430 328 2 -322 443 -230 -126 396 -386 113 239 -430 329 7 -338 433 -234 -152 405 -399
3385 -399 105 247 -440 332 17 -357 431 -228 -152 405 -394 113 251 -447 329 18 -343 434 -230 -119
3405 -119 399 -398 142 227 -431 335 1 -305 417 -227 -106 376 -388 136 206 -416 334 -21 -318 423 -246
3426 -246 -112 380 -396 124 221 -430 321 -3 -323 417 -252 -117 379 -410 129 239 -456 315 18 -346
3446 -346 432 -236 -133 404 -406 131 249 -447 332 16 -332 425 -234 -118 392 -405 141 244 -441 321
3466 321 -7 -326 418 -243 -104 372 -403 154 217 -423 317 -25 -300 407 -251 -86 370 -405 135 227 -436
3487 -436 320 -6 -311 411 -246 -97 393 -415 141 235 -450 335 11 -324 432 -243 -111 414 -416 145
3507 145 268 -441 326 22 -322 422 -251 -100 389 -424 142 232 -451 319 -2 -322 409 -255 -87 370
3527 370 -428 163 216 -421 321 -29 -295 420 -269 -78 369 -424 149 227 -418 316 -21 -287 414 -273 -58
3548 -58 383 -439 156 225 -436 338 -19 -297 435 -260 -73 404 -438 152 239 -439 332 -13 -305 432 -280
3569 -280 -87 396 -440 152 231 -434 332 -19 -287 433 -278 -73 392 -427 158 216 -412 330 -38 -266 407
3590 407 -293 -43 366 -429 160 198 -408 335 -51 -265 412 -283 -37 366 -424 169 196 -394 357 -49 -259
3611 -259 415 -299 -58 385 -439 170 213 -423 350 -58 -295 419 -311 -55 386 -453 161 194 -428 355 -70
3632 -70 -262 439 -310 -43 383 -424 175 197 -407 343 -73 -244 426 -321 -29 358 -422 196 166 -401 372
3653 372 -86 -230 410 -315 -20 353 -424 191 156 -404 361 -109 -246 435 -336 -24 358 -452 208 169 -423
3674 -423 357 -99 -258 452 -342 -50 363 -451 214 165 -428 388 -108 -258 463 -355 -7 375 -450 214
3694 214 153 -413 395 -126 -233 443 -338 18 329 -435 248 120 -398 384 -145 -214 430 -341 21 305 -436
3715 -436 251 106 -377 388 -141 -213 429 -349 23 312 -436 263 101 -395 415 -141 -223 443 -351 22 333
3736 333 -452 260 126 -388 418 -151 -218 443 -360 30 326 -447 278 110 -415 418 -158 -216 432 -352 37
3757 37 304 -439 278 78 -382 430 -170 -207 428 -361 51 282 -438 287 63 -367 421 -181 -192 428 -359
3778 -359 73 275 -437 291 59 -379 440 -178 -183 430 -372 64 294 -466 299 68 -385 443 -191 -198 432
3799 432 -384 74 290 -473 320 60 -391 445 -203 -208 426 -393 90 269 -462 321 26 -377 431 -218 -153
3820 -153 402 -388 115 259 -441 342 17 -338 447 -219 -128 383 -364 141 228 -445 343 -10 -335 443 -224
3841 -224 -119 396 -400 134 229 -454 355 -8 -351 450 -225 -123 396 -432 144 240 -467 367 5 -378 464
3862 464 -238 -131 397 -432 154 230 -469 368 -15 -347 456 -258 -115 379 -408 176 221 -444 378 -33 -331
3883 -331 447 -250 -69 368 -419 175 190 -449 377 -46 -323 442 -261 -73 364 -432 197 190 -463 392 -40
3904 -40 -326 442 -266 -66 377 -444 203 196 -470 410 -48 -344 471 -283 -69 379 -464 195 193 -471 409 -51
3926 -51 -326 459 -288 -42 367 -453 226 182 -448 423 -68 -297 440 -308 -34 353 -437 226 138 -444 411
3947 411 -92 -278 427 -319 -4 328 -451 246 138 -444 415 -104 -285 436 -315 -12 342 -459 262 148
3967 148 -456 416 -102 -283 471 -332 -5 358 -481 246 138 -463 436 -98 -281 459 -341 0 343 -484
3987 -484 268 129 -460 433 -126 -271 440 -366 16 329 -469 286 126 -419 420 -140 -231 425 -361 42
4007 42 314 -459 304 104 -422 436 -146 -225 431 -363 44 324 -469 290 104 -421 443 -159 -233 450 -381
4028 -381 51 328 -497 304 104 -441 452 -160 -225 470 -399 45 323 -498 300 86 -439 454 -167 -205 456
4049 456 -399 66 296 -492 319 77 -404 458 -193 -183 425 -385 90 284 -459 331 58 -370 450 -216
4069 -216 -173 446 -398 87 275 -467 324 48 -391 442 -214 -168 448 -402 99 295 -497 331 39 -398 471
4090 471 -224 -177 454 -417 84 287 -499 340 18 -387 473 -239 -162 452 -422 106 270 -469 346 22 -347
4111 -347 476 -248 -139 437 -410 124 247 -450 346 -10 -341 460 -258 -136 414 -412 132 242 -448 348
4131 348 -28 -336 439 -264 -124 414 -418 127 235 -455 359 -33 -345 475 -272 -139 439 -432 138 242
4151 242 -464 352 -21 -346 484 -268 -123 425 -439 152 244 -450 369 -41 -328 483 -288 -107 409 -416
4171 -416 147 207 -432 363 -55 -310 468 -286 -87 403 -436 158 204 -407 361 -65 -296 446 -292 -92 382
4192 382 -418 179 195 -428 370 -71 -295 468 -298 -82 411 -433 178 199 -432 385 -71 -314 470 -295 -76
4213 -76 404 -444 176 186 -439 397 -90 -286 483 -312 -66 380 -424 182 163 -413 380 -105 -263 457 -321
4234 -321 -39 358 -429 201 132 -385 393 -113 -254 453 -312 -38 347 -411 196 128 -376 403 -128 -250 450
4255 450 -310 -37 358 -412 208 137 -397 406 -140 -264 453 -330 -49 357 -421 210 120 -404 412 -139 -268
4276 -268 467 -332 -35 347 -424 210 112 -396 401 -136 -236 445 -333 -13 314 -407 230 86 -377 396
4296 396 -138 -213 435 -323 -2 297 -391 232 89 -350 411 -141 -222 428 -321 2 311 -395 234 82 -362
4317 -362 402 -154 -234 426 -335 0 306 -422 231 73 -372 405 -158 -222 446 -348 12 309 -406 252 69
4338 69 -371 399 -165 -209 409 -326 33 280 -408 262 63 -347 402 -167 -183 391 -324 43 255 -382 263
4359 263 39 -340 385 -174 -174 387 -320 47 253 -389 258 14 -348 395 -182 -179 398 -352 41 262 -400
4380 -400 276 44 -349 402 -185 -166 413 -356 64 263 -416 279 47 -349 406 -184 -174 390 -345 64 247
4401 247 -397 283 30 -331 398 -198 -156 376 -352 75 234 -385 266 2 -311 384 -187 -141 352 -347 76
4422 76 209 -379 279 11 -300 377 -200 -143 364 -345 78 223 -391 288 13 -298 401 -213 -128 371 -360
4443 -360 101 238 -399 303 12 -328 396 -219 -122 381 -361 105 209 -397 288 -7 -297 399 -217 -106
4463 -106 350 -362 119 197 -387 292 -12 -273 367 -222 -87 328 -352 116 176 -377 299 -20 -257 363 -224
4484 -224 -86 334 -356 120 193 -372 294 -16 -269 365 -228 -69 331 -371 140 198 -394 302 -24 -275 391
4505 391 -247 -76 339 -380 138 187 -386 310 -42 -259 363 -248 -63 324 -377 156 174 -364 304 -40 -249
4526 -249 355 -244 -53 300 -363 147 150 -344 294 -55 -224 350 -248 -24 291 -364 160 149 -340 306 -47
4547 -47 -223 336 -256 -32 295 -373 165 154 -357 310 -85 -233 355 -266 -26 305 -390 170 156 -362 300
4568 300 -74 -220 365 -262 -7 311 -368 183 131 -348 303 -79 -188 350 -277 1 286 -366 169 114 -337
4589 -337 300 -87 -179 324 -269 11 264 -361 188 113 -325 290 -100 -180 326 -287 2 258 -365 201 104
4610 104 -327 313 -120 -179 337 -301 5 273 -378 201 123 -328 316 -113 -167 352 -289 28 284 -374 210
4631 210 106 -318 313 -120 -165 336 -310 33 247 -364 197 76 -298 295 -139 -140 322 -298 44 229 -341
4652 -341 203 62 -283 305 -134 -131 313 -298 44 226 -352 201 66 -268 303 -140 -121 327 -298 62 228
4673 228 -352 219 62 -274 320 -147 -121 334 -305 58 243 -353 227 56 -279 318 -168 -124 324 -316 70
4694 70 210 -347 219 28 -277 303 -169 -106 303 -289 78 195 -332 213 11 -246 304 -177 -85 295 -283
4715 -283 82 194 -314 226 14 -231 312 -156 -80 281 -297 80 189 -316 232 2 -225 327 -172 -84 301
4736 301 -312 77 176 -315 229 -6 -239 311 -190 -87 279 -316 95 174 -311 239 -8 -223 308 -180 -78
4757 -78 281 -282 97 169 -295 237 -17 -211 292 -186 -49 267 -287 99 140 -287 232 -35 -197 294 -186
4778 -186 -48 255 -288 110 132 -287 246 -31 -208 311 -185 -47 242 -292 101 133 -295 255 -30 -206 307
4799 307 -201 -52 251 -284 116 123 -293 268 -40 -203 296 -198 -45 256 -275 128 126 -263 247 -50 -178
4820 -178 275 -186 -31 220 -276 128 99 -263 239 -54 -169 266 -176 -33 208 -268 127 91 -261 248 -55
4841 -55 -167 269 -195 -9 220 -270 130 91 -261 251 -68 -175 285 -200 -16 219 -273 156 87 -271 272
4862 272 -59 -166 278 -199 -16 213 -267 159 86 -256 251 -69 -157 251 -196 -7 196 -278 152 61 -247
4883 -247 237 -79 -151 248 -186 6 186 -247 148 49 -239 240 -76 -138 245 -185 22 177 -256 150 57
4904 57 -249 253 -66 -133 261 -181 16 176 -261 161 46 -238 259 -81 -143 247 -197 21 170 -257 167
4925 167 52 -234 241 -89 -135 235 -194 13 151 -238 166 36 -221 236 -84 -118 222 -192 35 153 -234
4946 -234 170 38 -213 240 -89 -114 218 -186 44 146 -228 164 34 -211 230 -85 -102 231 -196 40 151
4967 151 -243 169 46 -215 250 -92 -104 218 -218 50 153 -257 186 24 -223 246 -96 -106 217 -197 45
4988 45 124 -239 176 23 -201 228 -100 -86 198 -186 58 122 -233 176 27 -173 216 -92 -77 198 -193 58
5010 58 116 -227 162 13 -195 214 -107 -86 194 -175 51 124 -236 172 16 -186 227 -108 -72 205 -205 60
5032 60 118 -238 179 -6 -194 222 -116 -64 192 -200 75 126 -220 175 -10 -176 220 -108 -66 191 -189 77
5054 77 106 -220 163 1 -170 201 -115 -64 172 -195 61 86 -220 158 -10 -156 204 -120 -54 175 -199 71
5076 71 97 -208 170 -15 -163 207 -126 -49 173 -209 85 114 -222 177 -25 -161 209 -139 -47 184 -211 75
5098 75 94 -219 181 -28 -152 213 -125 -35 175 -201 82 91 -192 159 -27 -139 197 -135 -46 156 -185 77
5120 77 80 -200 151 -31 -136 185 -124 -34 155 -183 77 86 -189 158 -21 -126 188 -121 -17 163 -183 89
5142 89 72 -187 180 -34 -127 197 -140 -22 162 -198 87 81 -193 167 -43 -124 184 -138 -23 154 -183 84
5164 84 63 -186 176 -36 -120 181 -138 -20 144 -174 84 62 -169 159 -43 -104 179 -129 1 146 -163 87
5186 87 58 -159 174 -41 -97 180 -133 -5 142 -186 89 57 -167 159 -55 -103 182 -139 -15 134 -193 88
5208 88 37 -171 159 -56 -101 187 -151 -2 146 -180 99 42 -165 162 -67 -104 173 -153 -6 135 -175 106
5230 106 41 -152 164 -55 -78 169 -137 2 132 -158 87 31 -141 158 -63 -79 154 -130 -10 116 -153
5251 -153 94 26 -154 145 -72 -84 173 -147 -16 112 -169 100 25 -163 156 -73 -79 176 -146 9 130 -172
5273 -172 94 21 -141 172 -73 -75 180 -137 13 124 -140 103 29 -133 152 -66 -86 162 -125 -5 106 -137
5295 -137 98 26 -132 143 -71 -68 143 -151 0 94 -151 92 8 -133 142 -72 -63 155 -125 13 99 -151 98
5318 98 8 -129 149 -69 -70 158 -128 19 104 -155 116 7 -131 159 -84 -60 164 -133 17 90 -149 92
5340 92 7 -116 164 -78 -64 147 -126 12 76 -151 103 1 -124 138 -81 -52 138 -126 21 83 -126 99
5362 99 12 -111 154 -79 -54 136 -124 22 74 -122 113 -7 -104 144 -79 -61 150 -129 39 87 -141 107
5384 107 0 -121 150 -71 -52 144 -128 43 74 -136 118 -7 -108 154 -80 -53 136 -124 32 75 -135
5405 -135 115 -6 -103 152 -78 -54 120 -122 33 73 -130 105 5 -101 147 -68 -49 131 -122 43 66 -134
5427 -134 110 -12 -104 141 -85 -35 126 -136 41 64 -146 113 -25 -112 150 -93 -32 131 -133 48 54 -154
5449 -154 123 -26 -109 147 -91 -25 124 -143 48 55 -137 118 -27 -95 142 -90 -22 118 -123 53 52 -130 107
5472 107 -13 -87 131 -81 -32 109 -124 53 41 -123 113 -21 -89 127 -85 -17 102 -139 50 38 -137 105
5494 105 -31 -93 124 -103 -18 106 -135 63 48 -128 118 -28 -89 139 -84 -8 104 -122 58 33 -135 107
5516 107 -34 -74 127 -89 -8 101 -127 68 36 -119 102 -22 -74 112 -100 -13 97 -121 57 41 -106 100
5538 100 -25 -78 121 -93 -8 90 -125 62 37 -127 108 -41 -80 121 -114 2 98 -129 59 31 -110 109
5560 109 -40 -60 119 -112 -10 101 -140 75 43 -123 107 -42 -59 123 -105 -1 86 -132 71 21 -125 107
5582 107 -45 -55 106 -102 -3 80 -129 68 34 -109 97 -50 -53 106 -114 10 79 -122 67 23 -105 121 -43
5605 -43 -55 113 -107 2 78 -127 78 29 -109 118 -40 -55 106 -98 24 88 -127 81 18 -120 108 -58
5627 -58 -62 113 -121 12 83 -128 74 9 -98 104 -46 -56 112 -112 12 73 -128 64 18 -100 96 -43 -35
5650 -35 97 -102 16 63 -115 65 20 -90 112 -51 -37 106 -99 17 79 -113 64 25 -88 104 -57 -31
5672 -31 98 -114 10 68 -116 62 18 -86 107 -64 -37 100 -105 17 55 -110 63 7 -92 108 -54 -29 113
5695 113 -100 26 69 -113 69 11 -78 90 -52 -41 89 -94 25 58 -107 63 14 -76 96 -52 -32 101 -96
5718 -96 19 54 -93 63 4 -81 87 -62 -29 101 -102 21 67 -106 73 -3 -84 112 -70 -29 104 -113 26
5741 26 71 -101 76 2 -72 103 -56 -26 93 -104 20 56 -104 63 -2 -81 93 -55 -33 84 -99 11 49
5764 49 -94 49 6 -85 78 -66 -34 82 -93 16 59 -107 58 -11 -72 95 -58 -28 87 -93 25 51 -104
5787 -104 68 -2 -64 96 -51 -37 102 -88 31 53 -96 73 11 -74 94 -55 -21 88 -95 25 56 -94 69
5810 69 -7 -73 92 -62 -30 81 -91 18 58 -87 68 -3 -66 85 -39 -18 74 -79 36 55 -87 57 -4 -54
5834 -54 94 -48 -23 83 -84 25 48 -83 76 -3 -67 94 -60 -16 84 -89 34 51 -91 69 -12 -67 92
5857 92 -54 -26 74 -91 29 29 -86 59 -14 -67 80 -54 -23 72 -81 31 36 -88 72 -7 -67 84 -35 -15
5881 -15 69 -68 28 41 -82 77 2 -50 86 -42 -20 80 -71 20 50 -72 55 4 -66 74 -52 -18 76 -77
5905 -77 25 42 -82 65 -2 -66 82 -46 -19 69 -85 29 30 -88 73 -11 -61 77 -40 -21 59 -84 26 40
5929 40 -81 64 -6 -52 79 -43 -26 73 -70 35 39 -71 56 -6 -60 69 -44 -15 65 -82 20 28 -73 52
5953 52 7 -52 71 -48 -11 67 -77 31 35 -78 62 -11 -56 70 -53 -14 63 -86 28 37 -86 64 -1 -50 70
5978 70 -56 -5 64 -94 32 38 -83 74 -2 -45 73 -43 -8 55 -75 34 20 -76 59 -15 -52 61 -56 -4 53
6003 53 -67 18 35 -85 47 -13 -57 57 -57 -16 60 -64 35 29 -82 61 -9 -40 69 -50 2 53 -71 35 39
6028 39 -72 55 -10 -52 51 -54 1 52 -69 28 28 -72 57 -14 -48 57 -56 -6 56 -81 26 25 -80 36 -17
6053 -17 -51 56 -52 -15 38 -80 14 37 -70 51 0 -48 63 -48 -7 45 -54 32 30 -64 39 -12 -39 54 -40 -4 60
6080 60 -64 13 22 -73 55 -8 -44 64 -48 -8 46 -76 24 22 -65 40 -13 -58 56 -55 -9 51 -78 14 18 -67 38
6107 38 -19 -44 47 -43 -1 45 -74 16 32 -48 42 -15 -42 57 -34 -16 47 -49 23 27 -60 38 -6 -37 61 -34 -8 53 -62 20
6137 20 18 -54 54 -9 -34 59 -50 -16 36 -67 22 21 -54 43 -15 -35 52 -45 -11 46 -58 15 26 -48 50 -16 -42 51 -38
6166 -38 -4 52 -58 32 26 -52 51 -2 -27 71 -64 -1 19 -72 58 15 -37 49 30 -38 41 -46 -8 41 -61 22 22 -56 45
6195 45 -14 -33 60 -38 5 53 -50 38 17 -52 53 -15 -30 67 -42 2 44 -49 29 22 -54 54 -6 -31 55 -49 -11 43
6223 43 -48 47 25 -53 53 -21 -19 58 -35 -1 36 -59 20 10 -47 43 -21 -42 52 -56 -6 55 -51 32 0 -56 42 -15 -25
6252 -25 51 -32 -5 43 -50 28 27 -48 57 -23 -30 60 -43 2 23 -55 31 15 -62 48 -22 -27 53 -48 -1 33 -62 25 5 -57
6282 -57 45 -28 -37 45 -36 -1 46 -59 24 -1 -54 51 -19 -36 50 -33 2 34 -47 26 15 -49 48 -25 -25 49 -38 12 42 -51
6312 -51 31 7 -57 47 -14 -23 44 -40 -4 35 -65 37 -2 -48 46 -18 -37 36 -43 -9 29 -69 32 3 -59 51 -28 -27 49
6341 49 -45 8 29 -57 20 12 -48 36 -25 -28 47 -38 15 30 -45 34 15 -46 54 -11 -34 51 -34 -2 46 -60 43 14 -41 51
6371 51 -11 -30 36 -45 11 38 -62 43 -4 -62 46 -18 -38 48 -50 -1 34 -48 42 -1 -55 64 -19 -5 42 -29 8 36
6399 36 -48 8 30 -36 36 -16 -22 16 -43 5 57 -25 35 5 -24 46 -54 39 45 -48 -45 83 -44 -54 46 -41 -13 -62 26 80
6429 80 -26 -11 22 -8 17 4 -66 67 -26 -26 46 -34 29 28 -54 36 -6 -44 58 -20 -13 58 -51 21 31 -50 37 9 -38 48
6459 48 -17 -24 36 -43 33 45 -48 52 -2 8 54 -15 0 42 -54 16 13 -65 20 -32 -92 56 21 16 28 -5 19 45 -70 56
6489 56 -14 -45 5 1 -5 40 -46 5 18 -24 18 4 -35 31 -16 -8 39 -58 11 -27 1 63 -27 26 32 -63 2 40 -25 -32 4 -16 -50
6522 -50 -22 -22 19 -10 -23 48 -28 43 66 -30 41 -81 -42 57 -19 -9 -25 -13 21 14 -61 50 -2 -19 34 -8 -6 43 -9 57 27
6553 27 -40 41 -28 -48 72 -32 -22 27 -40 35 9 -82 22 2 -28 46 -34 -32 49 -29 -35 7 9 20 -53 -30 46 -47 26 38
6583 38 -72 8 14 -47 38 -15 -35 43 -25 -6 24 -39 20 7 -47 30 -9 -28 32 -33 -18 35 -47 13 -3 -38 34 -7 -32 32
6613 32 -38 -3 23 -57 22 -1 -34 33 -26 -34 44 -36 -1 20 -44 25 9 -32 49 -14 -22 50 -34 0 23 -43 24 7 -38 43 -19
6644 -19 -21 43 -30 -4 29 -36 12 11 -31 41 -4 -23 46 -26 1 24 -38 21 -1 -33 35 -20 -24 42 -30 -3 30 -49 25 0 -36 33
6676 33 -15 -16 44 -34 10 28 -37 24 -7 -33 46 -12 -15 48 -25 -4 20 -37 22 7 -32 33 -20 -13 32 -26 -3 21 -43 33 -32 -31
6708 -31 34 -31 -15 36 -15 0 14 -41 26 -4 -27 33 -22 -19 40 -30 3 11 -40 31 -4 -24 38 -22 -14 38 -30 8 27 -29 29 -12
6740 -12 -29 45 -18 -13 34 -43 7 20 -47 27 -14 -31 33 -20 -7 38 -29 14 12 -37 16 -5 -36 39 -21 -22 41 -33 -2 8 -36 17
6772 17 -7 -36 33 -26 -16 38 -28 9 23 -38 20 -7 -29 39 -17 -18 26 -35 10 12 -35 27 -6 -49 34 -36 -20 18 -38 10 12 -38
6804 -38 19 -12 -35 32 -21 -21 26 -41 5 5 -40 29 -2 -29 48 -20 -21 26 -31 12 16 -34 26 -8 -25 32 -27 -12 26 -32 11 19 -41
6837 -41 35 -13 -25 30 -15 -6 28 -34 10 11 -37 26 -14 -33 40 -37 -5 26 -39 10 5 -41 35 -7 -32 35 -23 -3 31 -35 17 9
6869 9 -25 26 -16 -22 35 -28 -17 19 -32 11 1 -34 25 -13 -28 28 -38 -9 18 -33 4 10 -32 14 -13 -30 31 -34 -6 23 -39 11
6901 11 0 -47 23 -12 -18 33 -44 -3 13 -48 19 -6 -33 28 -18 -25 38 -34 -3 27 -37 18 2 -28 32 -20 -23 40 -28 10 16 -41
6933 -41 11 2 -33 19 -22 -8 22 -29 1 14 -32 33 1 -31 33 -21 -15 32 -22 7 17 -39 21 -2 -36 28 -13 -5 27 -40 6 18
6965 18 -33 26 -3 -26 38 -14 -12 30 -36 3 23 -39 33 -7 -30 30 -23 -11 34 -44 1 17 -36 25 -4 -27 28 -27 -12 32 -32
6996 -32 -3 16 -44 29 -13 -30 26 -20 -8 23 -25 10 14 -38 23 6 -19 24 -16 -9 37 -39 21 8 -38 31 -2 -28 23 -25 -14
7027 -14 24 -42 3 14 -42 13 1 -20 32 -41 -6 17 -49 -10 6 -37 25 -10 -34 29 -33 -8 28 -42 -1 18 -36 19 -1 -25
7057 -25 33 -25 -5 26 -29 15 4 -40 25 -4 -27 28 -20 -13 20 -33 4 9 -33 14 -14 -38 27 -34 -5 26 -48 12 -1 -32 26
7088 26 -24 -20 31 -40 3 29 -38 10 2 -37 32 -15 -12 30 -34 -2 19 -31 26 19 -24 25 -12 -21 48 -23 2 21 -36 16 -3 -35 11
7121 11 -15 -27 21 -31 -3 14 -41 19 2 -31 17 -18 -30 29 -29 1 25 -38 7 -2 -29 30 -17 -11 28 -31 1 21 -38 28 0
7152 0 -34 34 -21 -13 28 -42 1 22 -36 28 2 -22 24 -21 -14 19 -39 8 17 -32 24 4 -35 23 -24 -17 17 -37 11 17 -39 17 -1
7185 -1 -30 27 -22 -9 25 -37 8 19 -33 29 -4 -28 29 -24 -15 27 -34 16 12 -47 20 6 -35 35 -28 -1 29 -49 5 4 -35 19
7217 19 -12 -36 26 -32 -4 31 -44 9 7 -35 13 -12 -37 34 -27 -10 27 -31 14 11 -35 26 4 -34 31 -21 -9 31 -39 8 22
7248 22 -26 31 -5 -23 37 -25 -8 27 -42 9 9 -42 22 -19 -33 28 -24 -5 36 -45 11 17 -38 33 -6 -26 41 -31 -11 29 -39
7279 -39 15 3 -39 31 -12 -25 40 -26 1 24 -44 26 12 -39 29 -10 -26 34 -33 -6 27 -46 28 13 -36 28 -12 -29 34 -34
7309 -34 -10 16 -40 17 -4 -34 21 -11 -31 36 -38 1 9 -69 25 -1 -45 30 3 -27 36 -34 -3 27 -40 22 15 -40 38 -11 -30
7340 -30 41 -23 -3 22 -35 23 8 -45 37 -8 -20 37 -29 -12 17 -39 22 9 -36 30 -12 -33 35 -30 3 19 -37 20 6 -41
7370 -41 25 -27 -24 34 -44 -2 11 -44 25 -5 -33 37 -24 -27 34 -24 6 23 -43 28 -1 -40 32 -22 -14 44 -35 8 11 -27 33 -2
7402 -2 -39 20 -28 -29 23 -35 3 18 -46 22 5 -29 26 -24 -27 27 -32 17 27 -32 28 13 -20 54 -15 -10 32 -32 10 17 -41 30 -4
7435 -4 -36 33 -25 -19 27 -39 7 14 -30 31 -3 -35 32 -21 -26 16 -43 6 5 -45 40 -1 -36 36 -29 -18 27 -31 5 10 -48 11 2 -41
7469 -41 34 -25 -22 22 -35 10 18 -37 38 9 -32 37 -14 -9 19 -37 10 8 -41 28 -7 -24 42 -25 -13 27 -39 5 14 -48 30 -12 -39
7502 -39 24 -35 -12 18 -37 20 4 -44 34 -12 -33 38 -19 -8 25 -41 6 6 -39 24 -11 -21 35 -29 0 24 -36 9 4 -35 21
7533 21 -16 -26 29 -27 -11 25 -41 10 -3 -22 24 -12 -24 22 -34 -13 16 -42 4 3 -31 27 -9 -25 26 -44 -6 28 -52 16 -6
7564 -6 -38 31 -15 -20 29 -38 1 21 -35 17 0 -35 22 -16 -31 28 -31 -16 22 -38 12 8 -37 29 -15 -27 31 -32 -10 16 -49 5
7596 5 -8 -30 24 -21 -21 18 -42 -6 19 -43 17 10 -35 35 -30 -12 33 -28 9 17 -31 28 5 -35 39 -17 -17 45 -30 3 16 -43 19
7629 19 1 -30 43 -19 -14 22 -30 9 21 -34 24 1 -39 35 -18 -14 15 -37 4 18 -32 15 3 -34 29 -14 -15 26 -35 9 5 -38
7661 -38 21 -6 -40 38 -18 -21 41 -27 9 20 -27 21 -1 -34 20 -18 -25 19 -33 3 2 -47 16 -14 -32 26 -34 -7 33 -39 5 20
7693 20 -32 30 -6 -26 31 -16 -4 32 -42 10 20 -32 22 -3 -20 33 -23 -7 27 -30 1 25 -29 11 -9 -21 25 -13 2 28
7723 28 -35 8 12 -31 25 -8 -23 26 -18 -14 23 -44 3 6 -35 11 -6 -12 28 -30 -19 18 -44 5 6 -33 22 -11 -26 29 -34 -6 27
7756 27 -41 11 12 -37 18 1 -30 32 -27 -10 28 -36 6 3 -36 18 -15 -37 40 -22 -11 19 -47 8 -3 -30 17 -18 -26 30 -39 -15
7788 -15 28 -35 11 -2 -35 33 -16 -18 33 -20 -1 18 -29 14 11 -39 33 -10 -32 31 -37 -14 34 -40 12 7 -32 23 -21 -18 29 -30
7820 -30 6 24 -36 7 4 -30 16 -17 -10 34 -36 -10 10 -38 17 6 -43 24 -14 -14 25 -36 -6 19 -31 15 10 -23 39 -10 -20 32
7852 32 -30 -2 17 -37 19 0 -33 24 -22 -15 26 -28 5 15 -40 13 10 -28 27 -21 -22 29 -34 6 18 -42 15 -3 -31 21 -18 -22
7884 -22 39 -23 5 24 -32 17 3 -20 33 -7 -14 32 -27 0 13 -41 35 4 -38 25 -25 -16 24 -32 5 19 -28 29 -9 -28 27
7915 27 -27 -16 26 -34 -2 5 -44 13 -11 -33 14 -24 -20 25 -44 3 7 -50 10 -1 -38 22 -20 -19 31 -17 16 12 -38 27 -2 -37 24
7948 24 -32 -25 24 -36 -2 19 -39 21 -4 -34 19 -20 -19 17 -31 5 -2 -38 8 -1 -32 23 -29 -19 19 -38 6 5 -49 18 -10 -37 21
7981 21 -26 -10 12 -41 7 25 -41 28 -8 -25 23 -20 4 38 -33 8 20 -43 20 -4 -31 22 -23 -13 19 -43 18 13 -40 19 -18
8012 -18 -30 19 -34 -8 19 -25 8 11 -40 22 0 -33 14 -8 13 27 -22 17 -1 -25 28 -21 -32 14 -20 1 15 -22 18 9 -45
8043 -45 29 12 -31 53 -30 -1 23 -27 29 9 -3 28 6 -8 42 -23 18 16 -32 20 -13 -20 37 -64 -28 -13 -15 37 22 -11 -10 -3
8075 -3 -6 36 -47 -59 45 -30 -20 3 12 22 -11 -35 56 12 -39 34 -43 -13 21 -33 24 -16 -28 34 -49 -26 50 -62 -1 3 -41
8106 -41 -8 -4 -27 1 -24 -40 73 -63 21 -5 -28 -1 2 12 33 -33 -39 12 -31 32 47 -31 71 20 -26 7 -5 15 13 -33 -4
8137 -4 10 -35 42 4 -28 22 -18 -20 13 -24 35 21 -23 56 48 -53 0 -40 -29 28 -46 -14 23 -70 -8 -18 -53 -5 -16 -8 19 -44
8169 -44 8 22 -14 9 10 -43 16 -5 -9 -43 -16 -14 3 -38 -9 4 -39 15 -29 -18 46 -40
8191d0
##END NTUPLES=NMR FID
##END=
