##TITLE=1H_LY-11Dix.4.B
 CD3CN, 8 sc, 
 4.06.2021
##JCAMPDX= 6.0         $$ Bruker NMR JCAMP-DX V2.0
##DATA TYPE= NMR FID
##DATA CLASS= NTUPLES
##ORIGIN= UXNMR, Bruker Analytische Messtechnik GmbH
##OWNER= root
$$ XWIN-NMR		Version 3.5
$$ Fri Jun  4 10:14:30 2021 Russian Standard Time (UT+4h)  she@DPX200
##.OBSERVE FREQUENCY= 200.131506
##.OBSERVE NUCLEUS= ^1H
##.DELAY= (6, 6)
##.ACQUISITION MODE= SIMULTANEOUS
##.ACQUISITION SCHEME= undefined
##.AVERAGES= 8
##.DIGITISER RES= 18
##SPECTROMETER/DATA SYSTEM= spect
##.PULSE SEQUENCE= zg30
##.SOLVENT NAME= CDCl3
##.SHIFT REFERENCE= (INTERNAL, CDCl3, 0, 15.7039)
##AUDIT TRAIL= $$ (NUMBER, WHEN, WHO, WHERE, WHAT)
$$ ##TITLE= Audit trail, XWIN-NMR		Version 3.5
$$ ##JCAMPDX= 5.01
$$ ##ORIGIN= Bruker BioSpin GmbH
$$ ##OWNER= she
$$ F:/spectra/data/she/nmr/H-F/1/audita.txt
$$ ##AUDIT TRAIL=  $$ (NUMBER, WHEN, WHO, WHERE, WHAT)
(   1,<2021-06-04 10:13:01.70 +0400>,<she>,<DPX200>,
      <created by zg, POWCHK disabled, PULCHK disabled
       configuration hash MD5:
       00 E9 B6 7A A2 85 ED C7 34 08 36 98 17 FE 4E 26
       data hash MD5: 16K
       D4 F6 01 0B AB 45 7D 29 6F B0 D6 45 44 97 8A 5E>)
$$ ##END=
$$ 
$$ hash MD5
$$ E5 08 77 CE 2F 16 77 B9 30 BA 52 E8 8E 37 29 A8
##$RELAX= 
##$RELAX= 
##$RELAX= 
##$RELAX= 
##$RELAX= 
##$RELAX= 
$$ Bruker specific parameters
$$ --------------------------
##$DU= <F:/spectra>
##$EXPNO= 1
##$NAME= <H-F>
##$PROCNO= 1
##$TYPE= <nmr>
##$USER= <she>
##$AMP= (0..31)
100 100 100 100 100 100 100 100 100 100 100 100 100 100 100 100 100 100 
100 100 100 100 100 100 100 100 100 100 100 100 100 100 
##$AQSEQ= 0
##$AQ_mod= 1
##$AUNM= <au_zg>
##$AUTOPOS= <>
##$BF1= 200.13
##$BF2= 200.13
##$BF3= 200.13
##$BF4= 200.13
##$BF5= 200.13
##$BF6= 200.13
##$BF7= 200.13
##$BF8= 200.13
##$BYTORDA= 1
##$CFDGTYP= 0
##$CFRGTYP= 5
##$CHEMSTR= <none>
##$CNST= (0..31)
1 1 145 1 1 1 1 1 1 1 1 1 1 1 1 1 1 1 1 1 1 1 1 1 1 1 1 1 1 1 1 1 
##$CPDPRG= <>
##$CPDPRG1= <>
##$CPDPRG2= <>
##$CPDPRG3= <>
##$CPDPRG4= <mlev>
##$CPDPRG5= <mlev>
##$CPDPRG6= <mlev>
##$CPDPRG7= <mlev>
##$CPDPRG8= <mlev>
##$CPDPRGB= <>
##$CPDPRGT= <>
##$D= (0..31)
0 1.2 0 0 0 0 0 0 0 0.06 0 0.03 0 0 0 0 0.0002 0 0 0 0 0 0 0 0 0 0 0 0 
0 0 0 
##$DATE= 1622787181
##$DBL= (0..7)
120 120 120 120 120 120 120 120 
##$DBP= (0..7)
150 150 150 150 150 150 150 150 
##$DBP07= 0
##$DBPNAM0= <>
##$DBPNAM1= <>
##$DBPNAM2= <>
##$DBPNAM3= <>
##$DBPNAM4= <>
##$DBPNAM5= <>
##$DBPNAM6= <>
##$DBPNAM7= <>
##$DBPOAL= (0..7)
0.5 0.5 0.5 0.5 0.5 0.5 0.5 0.5 
##$DBPOFFS= (0..7)
0 0 0 0 0 0 0 0 
##$DE= 6
##$DECBNUC= <off>
##$DECIM= 32
##$DECNUC= <off>
##$DECSTAT= 4
##$DIGMOD= 1
##$DIGTYP= 9
##$DL= (0..7)
0 120 120 120 120 120 120 120 
##$DP= (0..7)
150 150 150 150 150 150 150 150 
##$DP07= 0
##$DPNAME0= <>
##$DPNAME1= <>
##$DPNAME2= <>
##$DPNAME3= <>
##$DPNAME4= <>
##$DPNAME5= <>
##$DPNAME6= <>
##$DPNAME7= <>
##$DPOAL= (0..7)
0.5 0.5 0.5 0.5 0.5 0.5 0.5 0.5 
##$DPOFFS= (0..7)
0 0 0 0 0 0 0 0 
##$DQDMODE= 0
##$DR= 18
##$DS= 0
##$DSLIST= <SSSSSSSSSSSSSSS>
$$ [...]
##$SUBNAM2= <"">
##$SUBNAM3= <"">
##$SUBNAM4= <"">
##$SUBNAM5= <"">
##$SUBNAM6= <"">
##$SUBNAM7= <"">
##$SUBNAM8= <"">
##$SUBNAM9= <"">
##$SW= 20.0188882624521
##$SWIBOX= (0..15)
0 0 2 0 0 0 0 0 0 0 0 0 0 0 0 0 
##$SW_h= 4006.41025641026
##$TD= 16384
##$TD0= 1
##$TE= 0
##$TE2= 300
##$TE3= 300
##$TEG= 300
##$TL= (0..7)
0 120 120 120 120 120 120 120 
##$TP= (0..7)
150 150 150 150 150 150 150 150 
##$TP07= 0
##$TPNAME0= <>
##$TPNAME1= <>
##$TPNAME2= <>
##$TPNAME3= <>
##$TPNAME4= <>
##$TPNAME5= <>
##$TPNAME6= <>
##$TPNAME7= <>
##$TPOAL= (0..7)
0.5 0.5 0.5 0.5 0.5 0.5 0.5 0.5 
##$TPOFFS= (0..7)
0 0 0 0 0 0 0 0 
##$TUNHIN= 0
##$TUNHOUT= 0
##$TUNXOUT= 0
##$USERA1= <user>
##$USERA2= <user>
##$USERA3= <user>
##$USERA4= <user>
##$USERA5= <user>
##$V9= 5
##$VALIST= <valist>
##$VCLIST= <CCCCCCCCCCCCCCC>
##$VD= 0
##$VDLIST= <DDDDDDDDDDDDDDD>
##$VPLIST= <PPPPPPPPPPPPPPP>
##$VTLIST= <TTTTTTTTTTTTTTT>
##$WBST= 1024
##$WBSW= 4
##$XGAIN= (0..3)
0 0 0 0 
##$XL= 0
##$YL= 0
##$YMAX_a= 150655
##$YMIN_a= -154088
##$ZGOPTNS= <>
##$ZL1= 120
##$ZL2= 120
##$ZL3= 120
##$ZL4= 120
##$ABSF1= 10
##$ABSF2= 0
##$ABSG= 5
##$ABSL= 3
##$ALPHA= 0
##$AQORDER= 0
##$ASSFAC= 0
##$ASSFACI= 0
##$ASSFACX= 0
##$ASSWID= 0
##$AUNMP= <proc_1d>
##$AZFE= 0.1
##$AZFW= 0.1
##$BCFW= 1
##$BC_mod= 2
##$BYTORDP= 1
##$COROFFS= 0
##$CY= 11.3945322036743
##$DATMOD= 1
##$DC= 2
##$DFILT= <>
##$DTYPP= 0
##$F1P= 15.9154993809931
##$F2P= -4.1035820241983
##$FCOR= 0.5
##$FTSIZE= 0
##$FT_mod= 4
##$GAMMA= 1
##$GB= 0.15
##$INTBC= 1
##$INTSCL= 1
##$ISEN= 128
##$LB= 0.24
##$LEV0= 0
##$LPBIN= 0
##$MAXI= 10000
##$MC2= 0
##$MEAN= 0
##$ME_mod= 0
##$MI= 1.114404
##$NCOEF= 0
##$NC_proc= 0
##$NLEV= 6
##$NOISF1= 3.799351
##$NOISF2= 2.8
##$NSP= 1
##$NTH_PI= 0
##$NZP= 0
##$OFFSET= 15.70392
##$PC= 1
##$PHC0= -11205.84
##$PHC1= 15.60099
##$PH_mod= 1
##$PKNL= yes
##$PPARMOD= 0
##$PSCAL= 0
##$PSIGN= 0
##$REVERSE= no
##$SF= 200.130013532006
##$SI= 16384
##$SIGF1= 3
##$SIGF2= 2
##$SINO= 400
##$SIOLD= 16384
##$SREGLST= <1H.CDCl3>
##$SSB= 0
##$STSI= 0
##$STSR= 0
##$SW_p= 3612.71676300578
##$SYMM= 0
##$S_DEV= 0
##$TDeff= 0
##$TDoff= 0
##$TI= <>
##$TILT= no
##$TM1= 0
##$TM2= 0
##$TOPLEV= 0
##$USERP1= <user>
##$USERP2= <user>
##$USERP3= <user>
##$USERP4= <user>
##$USERP5= <user>
##$WDW= 1
##$XDIM= 8192
##$YMAX_p= 0
##$YMIN_p= 0
$$ End of Bruker specific parameters
$$ ---------------------------------
##NTUPLES= NMR FID
##VAR_NAME=  TIME,          FID/REAL,        FID/IMAG
##SYMBOL=    X,             R,               I
##VAR_TYPE=  INDEPENDENT,   DEPENDENT,       DEPENDENT
##VAR_FORM=  AFFN,          ASDF,            ASDF
##VAR_DIM=   8192,          8192,            8192
##UNITS=     SECONDS,       ARBITRARY UNITS, ARBITRARY UNITS
##FACTOR=    0.0002496,     1,               1
##FIRST=     0,             0,               0
##LAST=      2.0444736,     0,               0
##MIN=       0,             -154088,         0
##MAX=       2.0444736,     150655,          0
$$ Real data points
##PAGE= N=1
##DATA TABLE= (X++(R..R)), XYDATA
0@%%%%%%%%%%%%%Qj6J6j6K4l2L2m0M8n6P2q6R6j08J28j51J74j99K27k59K96l37
$$ 0 0 0 0 0 0 0 0 0 0 0 0 0 0 8 -8 8 -8 16 -16 16 -24 24 -32 40 -46 50 -58 70 -81 93 -106 121 -138 158 -179
35a79L80m28M81n38O02o72P48q29R18j018J126j246J375j514J669j839K027k234
$$ -179 201 -227 254 -284 318 -354 394 -435 483 -535 591 -655 720 -794 875 -964 1063 -1171
53a171K463k714K995l315L676m089M568n131N800o613P628q934J0681j3155J6969
$$ -1171 1292 -1422 1573 -1742 1934 -2155 2413 -2718 3082 -3531 4097 -4837 5844 -7311 9658
68I658k3838N4038j62698J53562O0891k45701K69064j21405r3570K35991k12489
$$ 9658 -14180 39858 -122840 30722 91613 -154088 114976 -6429 -99999 135992 -76497
79g6497M0139J62261k54065J71889J9614j87935K27167j15587p3640K20561k23225
$$ -76497 -36358 125903 -128162 43727 63341 -124594 102573 -13014 -86654 133907 -89318
90h9318O8536J37971k46717J77494J7058j95536K36551j14809q3027K21178k06121
$$ -89318 -20782 117189 -129528 47966 65024 -130512 106039 -8770 -91797 129381 -76740
101g6740M4709J47363k30105J50218K7615j76695K03034r6778p1517J92257j86243
$$ -76740 -32031 115332 -114773 35445 63060 -113635 89399 -7379 -78896 113361 -72882
112g2882N2524J20640k09932J53503Q355j63142K05593j09265o3699J96366j92591
$$ -72882 -20358 100282 -109650 43853 52208 -110934 94659 -14606 -78305 118061 -74530
123g4530N0745J28512k12763J44665K0868j66259J92554q8826p0663J80551j66649
$$ -74530 -23785 104727 -108036 36629 57497 -108762 83792 -5034 -75697 104854 -61795
134f1795L8911J13748j84954J28519J1015j40321J75427r3316n2215J65794j66054
$$ -61795 -22884 90864 -94090 34429 45444 -94877 80550 -12766 -64981 100813 -65241
145f5241M8434J04014j82972J31946J0235j41932J73986q5978o0083J63964j52716
$$ -65241 -16807 87207 -95765 36181 46416 -95516 78470 -7508 -67591 96373 -56343
156e6343L3568J05128j66501J12901J4833j27843J53508p7361n0264J44780j41870
$$ -56343 -22775 82353 -84148 28753 43586 -84257 69251 -8110 -58374 86406 -55464
167e5464M0045Q9950j56674J16078L922j21055J55816q4086m8074J48248j44079
$$ -55464 -15419 74531 -82143 33935 37857 -83198 72618 -11468 -59542 88706 -55373
178e5373L7773R4563j57614J09795J2044j22039J46068p1981n0093J37396j28850
$$ -55373 -17600 76963 -80651 29144 41188 -80851 65217 -6764 -56857 80539 -48311
189d8311L2561Q3807j41008J02380L939j07199J37822p5280l9337J29167j29177
$$ -48311 -15750 68057 -72951 29429 33368 -73831 63991 -11289 -50626 78541 -50636
200e0636L8255P9121j40456J02902M937j07839J35502o8897m4666J25959j18206
$$ -50636 -12381 66740 -73716 29186 34123 -73716 61786 -7111 -51777 74182 -44024
211d4024K8828P7404j28445R0848P057r7338J21787o4388l7004J13623j12561
$$ -44024 -15196 62208 -66237 24611 31668 -65670 56117 -8271 -45275 68348 -44213
222d4213L3636O8101j23297R4009R14r5148J23948o7026l7348J15612j13059L1450
$$ -44213 -10577 57524 -65773 28236 29150 -65998 57950 -9076 -46424 69188 -43871 -12421
234a2421P1475j23110Q9233N589r4995J17856o0158l8141J08526j04027K9905
$$ -12421 59054 -64056 25177 30766 -64229 53627 -6531 -44672 63854 -40173 -10268
245a0268O4177j14192Q6184K53q6537J13709o3158l1512J04822j04972L2862O2076
$$ -10268 53909 -60283 25901 26154 -60383 53326 -9832 -41344 63478 -41494 -8632 53444
257E3444j14120Q6057J752q7580J11153n7197l4631J00936r6871K6983N9964j05100
$$ 53444 -60676 25381 27133 -60447 50706 -6491 -41122 59814 -37057 -10074 49890 -55210
269e5210P7698K064p9390J02142n4667k9179R2348r3201L0662N3713j02338P9787
$$ -55210 22488 24552 -54838 47304 -7363 -36542 55806 -37395 -6733 46980 -55358 24429
281B4429r75p8304J03036n5664k9970R3578r2685K8186N5782j01164P6189K047
$$ 24429 23454 -54850 48186 -7478 -37448 56130 -36555 -8369 47413 -53751 22438 24485
293B4485p7695R8205n1342k9208Q8339q7910K8320N1248r6055P5010j793p2966
$$ 24485 -53210 44995 -6347 -35555 52784 -35126 -6806 44442 -51613 23397 21604 -51362
305e1362R6481n3311k5713Q6385q8371L0031N0476r6286P3993J43p3265R3544
$$ -51362 45119 -8192 -33905 52480 -35891 -5860 44616 -51670 22323 22466 -50799 42745
317D2745m8804k7522Q3257q1903K5548M8199q9060O7875K18o7129Q6401m6628
$$ 42745 -6059 -33581 49676 -32227 -6679 41520 -47540 20335 20553 -46576 39825 -6803
329f803k3045P6861p9438K7629M4433q6811O8178j074o6274Q6148m5969k4122
$$ -6803 -29848 47013 -32425 -4796 39637 -47174 21004 19930 -46344 39804 -6165 -30287
341c0287P6756p7778K5339M5472q5050O4727J017o4560Q2056m3620k2857P3088
$$ -30287 46469 -31309 -5970 39502 -45548 19179 20196 -44364 37692 -5928 -28785 44303
353D4303p4847K5841M2139q1924O4566j518o1765Q0999m5156k0454P2301p5557
$$ 44303 -30544 -4703 37436 -44488 20078 18560 -43205 37794 -7362 -27816 44485 -31072
365c1072K6442M2303q1633O3087j35o1459P8308m1791k1189O9203p0783K3925
$$ -31072 -4630 37673 -43960 19127 18992 -42467 35841 -5950 -27139 42064 -28719 -4794
377d794M0329p6479N8444j25n6473P2853m0404j7949O4631o8410K4924L7394p4347
$$ -4794 35535 -40944 17500 17375 -39098 33755 -6649 -24598 40033 -28377 -3453 33941 -40406
390d0406N8021o01n5512P1604l9269j8434O4006o6566K2638L7867p1907N4788
$$ -40406 17615 17014 -38498 33106 -6163 -24597 39409 -27157 -4519 33348 -38559 16229
402A6229M07n3321O8323l7880j6844O0970o5014K3727L5579p0312N4996j372n1474
$$ 16229 16636 -36685 31638 -6242 -23086 37884 -27130 -3403 32176 -38136 16860 15488 -35986
415c5986O8105l9320j5535O0788o5446K4123L5517p0143N4168m54n1083O6028
$$ -35986 32119 -7201 -22736 38052 -27394 -3271 32246 -37897 16271 15817 -35266 30762
427C0762l7322j5557N8563o2301K2548L3796o6178N1226j105m7505O2453l6324
$$ 30762 -6560 -22117 36446 -25855 -3307 30489 -35689 15537 14432 -33073 29380 -6944
439f944j3386N5172o0396K3051L1904o4245N0100j334m6235O1058l5205j3876
$$ -6944 -20330 34842 -25554 -2503 29401 -34844 15256 13922 -32313 28745 -6460 -20336
451b0336N4229n8085K1142L1588o1805M7522p84m4195N8308l4277j2440N1979
$$ -20336 33893 -24192 -3050 28538 -33267 14255 13471 -30724 27584 -6693 -19133 32846
463C2846n6953K1935K9648o0482M8106k594m3165N8888l5464j1790N2152n7445
$$ 32846 -24107 -2172 27476 -33006 15100 12506 -30659 28229 -7235 -19025 33127 -24318
475b4318K2099K9724o0179M7462k495m2407N7770l4627j1593N0565n5440K1488
$$ -24318 -2219 27505 -32674 14788 12293 -30114 27656 -6971 -18564 32001 -23439 -1951
487a951K8110n7545M5875l195l9873N5445l4221j0080M8313n3845K1421K6528
$$ -1951 26159 -31386 14489 11294 -28579 26866 -7355 -17435 30878 -22967 -1546 24982
499B4982n5409M4829l607l8692N4019l2958j0379M7039n1583J9767K6042n2768
$$ 24982 -30427 14402 10795 -27897 26122 -6836 -17215 29824 -21759 -1992 24050 -28718
511b8718M2356l564l6542N1730l2320r218M5102n0392K0370K4383n1651M2707
$$ -28718 13638 10074 -26468 25262 -7058 -16276 28826 -21566 -1196 23187 -28464 14243
523A4243m894l5673N1934l3161q631M5225n0625K0392K4224n1294M2368m957l5159
$$ 14243 9349 -26324 25610 -7551 -16182 29043 -21582 -1190 23034 -28260 14108 9151 -26008
536b6008N1118l2519q228M3928m9391K0241K2819m9387M1516n785l3394M9815
$$ -26008 25110 -7409 -15637 28291 -21100 -859 21960 -27427 14089 8304 -25090 24725
548B4725l2208p467M2293m7900J9915K1674m7601M0284n673l2235M8100l0938
$$ 24725 -7483 -14950 27343 -20557 -642 21032 -26569 13715 8042 -24193 23907 -7031
560g031p582M0842m5610J8406K1033m5180L8188n308l0711M5665k9689o743L8766
$$ -7031 -14613 26229 -19381 -975 20058 -25122 13066 7758 -22953 22712 -6977 -13720 25046
573B5046m4121J8728J9614m4034L8214o233l0049M5639k9916o624L8665m3908
$$ 25046 -19075 -347 19267 -24767 13447 7214 -22835 22804 -7112 -13736 24929 -18979
585a8979J8802J9297m3707L7997o426k9542M5030k9656o027L7605m3077J9054
$$ -18979 -177 19120 -24587 13410 6984 -22558 22472 -7184 -13211 24394 -18683 371
597C71J7940m2589L7826p133k8454M4220k9401n387L6397m2066J8774J7085m1195
$$ 371 18311 -24278 13548 6415 -22039 22181 -7220 -12607 23790 -18276 498 17583 -23612
610b3612L6774o946k7500M2648k7981n540L4744l9960J7759J6287l9142L5002
$$ -23612 13162 6216 -21284 21364 -6617 -12157 22587 -17373 386 16673 -22469 12533
622A2533o506k6185M0540k6783n116L2931l8334J7661J5171l7868L4623o909k5581
$$ 12533 6027 -20158 20382 -6401 -11517 21414 -16920 741 15912 -21956 12667 5758 -19823
635a9823L9959k6675m843L2532l7985J7738J4917l7561L4397p041k5245L9394
$$ -19823 20136 -6539 -11382 21150 -16835 903 15820 -21741 12656 5615 -19630 19764
647A9764k6404m234L1548l7465J8361J3781l6988L4565p826k4537L9164k6480
$$ 19764 -6640 -10874 20674 -16791 1570 15351 -21637 12928 5102 -19435 19729 -6751
659f751l718L0883l6937J8235J3182l6155L3789p609k3715L7804k5388l549K9487
$$ -6751 -10469 20414 -16523 1712 14894 -21261 12528 4919 -18796 19008 -6380 -9929 19558
672A9558l5428J7466J2546l4567L2317p091k2595L5925k4201l244K7843l4033
$$ 19558 -15870 1596 14142 -20425 11892 4801 -17794 18131 -6070 -9314 18529 -15504
684a5504J7218J1797l3369L1674p135k1976L5067k3839l048K7207l3507J7273
$$ -15504 1714 13511 -19858 11816 4681 -17295 17772 -6067 -9115 18092 -15415 1858
696A858J1525l2966L1426p232k1659L4535k3821k430K6538l3258J7907J0677l2604
$$ 1858 13383 -19583 11843 4611 -17048 17487 -6334 -8764 17774 -15484 2423 13100 -19504
709a9504L1665q072k0992L4429k4234j716K6239l3297J8070J0380l2251L1082
$$ -19504 12161 4089 -16903 17526 -6708 -8424 17815 -15482 2588 12968 -19283 11799
721A1799p893k0337L3354k3437j337K5063l2242J7592R804l1045K9884p450j9391
$$ 11799 3906 -16431 16923 -6514 -7851 17212 -15030 2562 12366 -18679 11205 3755 -15636
734a5636L1850k2363j218K3810l0972J6958R372k9825K8845p138j8614L0730k1850
$$ -15636 16214 -6149 -7367 16443 -14529 2429 11801 -18024 10821 3683 -14931 15799 -6051
747f051j086K3107l0350J6726R287k9241K8329p025j8193K9975k1755n80K2528
$$ -6051 -7137 15970 -14380 2346 11633 -17608 10721 3696 -14497 15478 -6277 -6857 15671
760A5671l0160J7194Q786k8949K8438p665j7705K9881k2210P6K2364l0302J7498
$$ 15671 -14489 2705 11491 -17458 10980 3315 -14390 15491 -6719 -6643 15721 -14581 2917
773B917Q590k8799K8027p630j7200K9151k1717L92K1616k9471J7053Q116k7828
$$ 2917 11507 -17292 10735 3105 -14095 15056 -6661 -6269 15347 -14124 2929 11045 -16783
786a6783K7004p328j6374K7964k0824M84K0692k8410J6253P916k6727K5796o774
$$ -16783 10221 2893 -13481 14483 -6341 -5857 14835 -13575 2678 10594 -16133 9663 2889
799B889j5715K6768j9934M13J9816k7504J5779P744k5935K5128o576j5237K6097
$$ 2889 -12826 13942 -5992 -5579 14237 -13267 2512 10256 -15679 9449 2873 -12364 13733
812A3733j9758N47J9330k7056J5858P296k5359K5149p195j4710K5957k0305J156
$$ 13733 -6025 -5478 13852 -13204 2654 9950 -15409 9740 2545 -12165 13792 -6513 -5357
825e357J9249k7253J6186P150k5186K4955p447j4319K5549k0098J473J8706k6618
$$ -5357 13892 -13361 2825 9975 -15211 9744 2297 -12022 13527 -6571 -5098 13608 -13010
838a3010J6007O615k4353K4218p506j3632K4810j9467J455J8088k5582J5156O354
$$ -13010 2997 9612 -14741 9477 1971 -11661 13149 -6318 -4863 13225 -12357 2799 9153
851I153k3324K3104p062j2974K3757j8579J263J7384k4535J4313O128k2255K2306
$$ 9153 -14171 8933 1871 -11103 12654 -5925 -4662 12722 -11813 2500 8628 -13627 8679
864H679o934j2409K3100j8274J322J6872k4085J4184N868k1594K2100p375j1799
$$ 8679 1745 -10664 12436 -5838 -4516 12356 -11729 2455 8323 -13271 8829 1454 -10345
877a0345K2888j8747J785J6664k4145J4642N469k1402K2296p859j1484K2708j8908
$$ -10345 12543 -6204 -4419 12245 -11900 2742 8211 -13191 9105 1246 -10238 12470 -6438
890f438K166J6332k3731J4653M873k0649K1940q293j0886K2256j8646K374J5849
$$ -6438 -4272 12060 -11671 2982 7855 -12794 9146 853 -10033 12223 -6423 -4049 11800
903A1800k3026J4127M640j9842K0960p980j0308K1358j7764K203J5131k1946J3403
$$ 11800 -11226 2901 7541 -12301 8659 679 -9629 11729 -6035 -3832 11299 -10647 2756
916B756M295j8918K0161p709r758K0639j7324K197J4607k1336J3086L923j8208
$$ 2756 7051 -11867 8294 585 -9173 11466 -5858 -3661 10946 -10390 2696 6619 -11589
929a1589J9997p971r311K0330j7472K561J4194k1335J3525L523j7952K0221q495
$$ -11589 8408 437 -8874 11456 -6016 -3455 10739 -10596 2929 6452 -11500 8721 226
942B26q994K0283j7742K871J3824k1033J3843K940j7556K0192q907q525J9894
$$ 226 -8768 11515 -6227 -3356 10468 -10565 3278 6218 -11338 8854 -53 -8578 11316
955A1316j7668L150J3444k0497J3640K565j6988J9626q687q313J9206j6780K964
$$ 11316 -6352 -3202 10242 -10255 3385 5950 -11038 8588 -99 -8412 10794 -5986 -3022
968c022J2803j9447J2916K297j6101J8768q440p847J8562j6129K793J2255j8762
$$ -3022 9781 -9666 3250 5547 -10554 8214 -226 -8073 10489 -5640 -2847 9408 -9354
981i354J2533K109j5610J8343q283p444J8067j5984K981J1767j8523J2800J571
$$ -9354 3179 5288 -10322 8021 -262 -7706 10361 -5623 -2642 9125 -9398 3402 4973
994D973j5321J8663q667p261J7981j6175L354J1342j8427J3201J096j4934J8723
$$ 4973 -10348 8315 -352 -7613 10368 -5807 -2453 8889 -9538 3663 4759 -10175 8548
1007H548r175o856J7790j6231L607J0917j8029J3281Q02j4623J8318r029o639
$$ 8548 -627 -7483 10307 -5924 -2317 8600 -9429 3852 4654 -9969 8349 -680 -7319
1020g319J7211j5598L478J0486j7154J2671O25j3949J7512q629o360J6440j4804
$$ -7319 9892 -5706 -2228 8258 -8896 3775 4400 -9549 7963 -666 -7026 9414 -5390
1033e390L385R963j6532J2198N95j3516J6968q293o213J5971j4276L349R399j6138
$$ -5390 -2005 7958 -8574 3624 4219 -9297 7671 -622 -6835 9136 -5140 -1791 7608 -8530
1047h530J2269K45j3223J6968q510n850J5823j4508L660R119j6114J2565j45j2975
$$ -8530 3739 3984 -9239 7729 -781 -6631 9192 -5316 -1656 7463 -8651 3914 3769 -9206
1061i206J7132q833n516J5489j4615M159Q708j6071J2830l98j2701J6970q901
$$ -9206 7926 -907 -6423 9066 -5549 -1390 7318 -8753 4077 3679 -9022 7948 -953
1074i53n376J5121j4181M115Q285j5440J2439m16j2225J6179q507n075J4401j3527
$$ -953 -6329 8792 -5389 -1274 7011 -8429 4010 3594 -8631 7548 -959 -6034 8367 -5160
1088e160L980P922j4782J1924m01j1887J5547p972m974J3766j2947L981P547j4439
$$ -5160 -1180 6742 -8040 3884 3483 -8404 7143 -829 -5803 7963 -4984 -1003 6544 -7895
1102g895J1699n60j1482J5356q069m667J3529j2989M329P174j4501J2031q19j1327
$$ -7895 3804 3244 -8238 7118 -951 -5618 7911 -5078 -749 6425 -8076 3955 3136 -8191
1116h191J5394q333m236J3317j3273M766O851j4439J2361j241j1116J5435q497
$$ -8191 7203 -1130 -5366 7951 -5322 -556 6295 -8144 4217 2976 -8140 7295 -1202
1129a202l956J2959j3233N000O621j4168J2080j207j0703J4837q217l736J2295
$$ -1202 -5158 7801 -5432 -432 6189 -7979 4101 2894 -7809 7028 -1189 -4925 7370
1142G370j2626M957O242j3677J1693j071j0446J4170p708l666J1807j2028M683
$$ 7370 -5256 -299 5943 -7734 3959 2888 -7558 6612 -1096 -4762 7045 -4983 -300
1155c00N980j3103J1319j159j0117J3816p577l363J1459j2050M921N840j3100
$$ -300 5680 -7423 3896 2737 -7380 6436 -1141 -4504 6955 -5095 -174 5666 -7434
1168g434J1379j378r874J3841p838l032J1315j2221N335N477j3157J1706j670
$$ -7434 3945 2567 -7307 6534 -1304 -4336 6979 -5242 93 5570 -7587 4119 2449
1181B449r668J3848q154k650J1195j2379N508N281j2961J1691j778r446J3504
$$ 2449 -7219 6629 -1525 -4175 7020 -5359 149 5430 -7531 4160 2382 -7064 6440
1194F440p945k459J0719j2032N435N082j2462J1225j740r065J2995p621k468J0373
$$ 6440 -1505 -3964 6755 -5277 158 5240 -7222 4003 2263 -6802 6193 -1428 -3896 6477
1208F477j1463N074M989j1981J0646j518q662J2380p451k211J0115j1308N037
$$ 6477 -4986 88 5077 -6904 3742 2224 -6438 5942 -1509 -3720 6395 -4913 124
1221A24M838j1791J0624j644q514J2302p572j926R996j1519N312M681j1740J0754
$$ 124 4962 -6829 3795 2151 -6363 5939 -1633 -3559 6437 -5082 230 4911 -6829 3925
1235C925k048q182J2443q018j597R963j1734N614M529j1760J0780k116p895J2173
$$ 3925 1877 -6305 6138 -1880 -3477 6486 -5248 366 4895 -6865 3915 1799 -6096 6077
1249F077q081j367R772j1507N481M323j1341J0460k051p670J1726p734j346R477
$$ 6077 -2004 -3371 6401 -5106 375 4698 -6643 3817 1766 -5904 5822 -1912 -3258 6219
1263F219j1081N072M406j0889R817j853p317J1241p414j366R181j0742M939M313
$$ 6219 -4862 210 4616 -6273 3544 1691 -5626 5615 -1799 -3165 6016 -4726 213 4526
1277D526j0665R575j836p061J1104p569j210R164j0784N034M137j0592R745k105
$$ 4526 -6139 3436 1600 -5461 5643 -1926 -3136 6028 -4756 278 4415 -6177 3568 1463
1291A463o847J1106p897q03R060j1070N398L956j0558R942k456o701J1226q038
$$ 1463 -5384 5722 -2175 -2978 6082 -4988 410 4366 -6192 3750 1294 -5407 5819 -2219
1305b219p12Q892j0903N471L731j0295R732k550o368J0957p961p01Q789j0531
$$ -2219 -2931 5961 -4942 529 4260 -6035 3697 1147 -5221 5736 -2225 -2926 5863 -4668
1319d668N091L711r899R246k319o185J0484p548p28Q496j0164M820L635r537Q947
$$ -4668 423 4134 -5765 3481 1162 -5023 5461 -2087 -2815 5681 -4483 337 3972 -5565 3382
1334C382k354n972J0376p463p23Q336j0091M889L510r448R015k575n755J0476
$$ 3382 1028 -4944 5432 -2031 -2754 5582 -4509 380 3890 -5558 3457 882 -4873 5603
1348E603p801n04Q278j0192N187L189r383R349k954n624J0569q085k72Q243j0247
$$ 5603 -2198 -2702 5576 -4616 571 3760 -5623 3726 772 -4852 5717 -2368 -2640 5603 -4644
1363d644N267L025r127R312l215n439J0472q011k13Q033j0016N171L006q915Q927
$$ -4644 623 3648 -5479 3833 618 -4821 5651 -2360 -2573 5460 -4556 615 3621 -5294 3633
1378C633l036n298J0126p626l88P835r492M827K834q565Q651k931n183R918p438
$$ 3633 597 -4701 5425 -2201 -2589 5246 -4246 581 3415 -5150 3501 570 -4613 5305 -2133
1393b133l70P717r367M692K747q361Q646l085n042R911p524j72P490r477N042
$$ -2133 -2503 5214 -4153 539 3286 -5075 3571 486 -4556 5355 -2169 -2341 5149 -4328 714
1408G14K479q342Q952l456m873J0077p854j4P407r501N283K184q223R111l662
$$ 714 3193 -5149 3803 347 -4526 5551 -2303 -2317 5090 -4411 872 3056 -5167 3944 282
1423B82m726R920p916J64P296r347N217K081p987Q913l601m741R673p496M4P052
$$ 282 -4444 5476 -2440 -2276 5020 -4327 890 2971 -5016 3897 296 -4445 5228 -2268 -2224 4828
1439D828q939M953K083p748Q506l408m613R403p188n6O885q639M802J962p649
$$ 4828 -4111 842 2925 -4823 3683 275 -4338 5065 -2123 -2179 4706 -3933 869 2831 -4818
1454d818Q404l286m554R246p082L5O711q614M927J674p545Q697l589m446R368
$$ -4818 3586 300 -4254 4992 -2090 -2055 4656 -3958 969 2643 -4902 3795 206 -4240 5128
1469E128p355K83O591q798N210J534p504Q804l778m254R272p465M51O356q686
$$ 5128 -2227 -1944 4647 -4151 1059 2593 -4911 3893 115 -4139 5133 -2332 -1881 4475 -4211
1484d211N409J384p487Q770l656m272R001p203L74O231q314N154J352p250Q423
$$ -4211 1198 2582 -4905 3865 209 -4063 4938 -2265 -1891 4340 -3974 1180 2532 -4718 3705
1499C705l444m274Q676o765K83O049q032M940J389p135Q144l287m214Q537o567
$$ 3705 261 -4013 4663 -2102 -1819 4230 -3802 1138 2527 -4608 3536 249 -3965 4572 -1995
1514a995K60N851p891M995J193p085Q208l389l996Q517o797N42N700q053N274
$$ -1995 -1735 4116 -3775 1220 2413 -4672 3536 147 -3849 4668 -2129 -1587 4113 -3940 1334
1529A334R62p057Q446l592l837Q419o925Q35N429q101N530Q17o928Q443l711l731
$$ 1334 2296 -4761 3685 93 -3744 4675 -2250 -1415 4014 -4087 1443 2260 -4668 3775 64 -3667
1545c667Q295o848P91N285p835N413Q55o778Q065l476l644P918o529P22N195p541
$$ -3667 4628 -2220 -1429 3856 -3979 1434 2289 -4489 3576 100 -3544 4374 -2155 -1433 3762 -3779
1561c779N145R12o643P766l258l676P710o224O86N085p394M999Q66o491P646l374
$$ -3779 1366 2278 -4365 3401 143 -3533 4177 -2047 -1361 3724 -3670 1329 2195 -4296 3350 -24
1577b4l426P676o342R15M939p545N224P15o477P735l515l162P619o581J197M755
$$ -24 -3450 4226 -2116 -1201 3738 -3807 1417 2132 -4345 3390 -125 -3287 4332 -2249 -1052 3703
1593C703p625N437N09o357P842l666l004P471o653J341M651p581N354N99o159
$$ 3703 -3922 1515 2024 -4333 3509 -157 -3161 4310 -2343 -1002 3649 -3932 1422 2021 -4138
1608d138P558l542k968P184o353J233M528p279N132P10o015P157l314k927O964
$$ -4138 3420 -122 -3090 4094 -2259 -1026 3502 -3777 1355 2065 -3950 3207 -107 -3034 3930
1623C930o130J128M562p058M842P44n861O914l254k747O778o111J371M425p146
$$ 3930 -2200 -1072 3490 -3568 1274 2018 -3843 3071 -183 -2930 3848 -2263 -892 3533 -3613
1638c613M930O31n806O962l386k536O735o251J602M222p212N146L79n660P056
$$ -3613 1317 1948 -3858 3104 -282 -2818 3917 -2334 -732 3490 -3722 1424 1803 -3857 3199
1653C199l622k267O705o450J726M123p158N145L47n506O918l516k222O444o279
$$ 3199 -423 -2690 4015 -2435 -709 3414 -3744 1401 1748 -3758 3160 -356 -2578 3866 -2413
1668b413J653M087o923M876M67n303O611l351k271O272o006J463M114o685M595
$$ -2413 -760 3327 -3596 1280 1747 -3556 3055 -296 -2567 3705 -2301 -838 3276 -3409 1186
1683A186O19n193O283l215k184O113n876J456M057o556M560M82n142O299l322
$$ 1186 1805 -3388 2895 -320 -2504 3609 -2267 -811 3246 -3310 1250 1732 -3410 2889 -433
1698d33k033O133n983J626L942o585M638K29m944O386l579j769O116o156J813
$$ -433 -2466 3667 -2316 -690 3252 -3333 1305 1534 -3410 2976 -603 -2372 3744 -2412 -599
1713e99L810o623M719J46m813O333l582j680O012o063J680L724o352M534J90m651
$$ -599 3211 -3412 1307 1453 -3360 2973 -609 -2289 3723 -2340 -660 3064 -3288 1246 1436 -3215
1729c215O127l427j735N855n844J438L830o113M162M02m516N802l234j791N705
$$ -3215 2912 -515 -2250 3605 -2239 -801 3029 -3084 1078 1480 -3036 2766 -468 -2259 3446
1744C446n589J337L778n941M088L40m442N708l276j710N703n602J426L663n898
$$ 3446 -2143 -806 2972 -2969 1119 1459 -2983 2725 -551 -2261 3442 -2160 -734 2929 -2969
1759b969M182J04m329N798l496j463N674n724J603L501n880M283j14m186N881
$$ -2969 1213 1317 -3012 2786 -710 -2173 3501 -2223 -620 2881 -2999 1284 1170 -3016 2865
1774B865l601j360N602n687J599L379n735M161r9l994N687l497j379N484n485
$$ 2865 -736 -2096 3506 -2181 -582 2797 -2938 1223 1124 -2870 2817 -680 -2059 3425 -2060
1789b060J375L381n522L942P3l957N426l205j502N290n182J214L310n257L771
$$ -2060 -685 2696 -2826 1116 1189 -2768 2658 -547 -2049 3241 -1941 -727 2583 -2674 1097
1804A097M7l851N329l177j526N239n075J226L236n169L778j04l732N336l351j340
$$ 1097 1144 -2707 2622 -555 -2081 3158 -1917 -691 2545 -2624 1154 1050 -2682 2654 -697 -2037
1820b037N193n124J444L009n151L959l46l662N443l491j177N120n150J527K857
$$ -2037 3156 -1968 -524 2485 -2666 1293 947 -2715 2728 -763 -1940 3180 -1970 -443 2414
1835B414n057L950m51l506N337l397j163M957m981J445K762m892L787l35l424
$$ 2414 -2643 1307 856 -2650 2687 -710 -1873 3084 -1897 -452 2310 -2582 1205 870 -2554
1850b554N120l156j287M784m661J221K707m619L591k62l370M958l007j315M657
$$ -2554 2566 -590 -1877 2907 -1754 -533 2174 -2445 1146 884 -2486 2472 -535 -1850 2807
1865B807m518J201K647m526L584l40l313M932l050j211M540m497J388K432m493
$$ 2807 -1711 -510 2137 -2389 1195 855 -2458 2474 -576 -1787 2753 -1744 -356 2076 -2417
1880b417L758o00l204N006l225j048M493m548J537K272m449L796p03l101M910
$$ -2417 1341 741 -2463 2543 -682 -1730 2763 -1785 -248 2024 -2425 1371 668 -2433 2477
1895B477l185r23M317m445J543K164m346L708o17l094M772k933j068M174m158
$$ 2477 -708 -1631 2686 -1759 -216 1948 -2398 1310 693 -2401 2371 -562 -1630 2544 -1614
1910a614J330K154m148L490m78l050M583k734j148M077m005J239K145m050L383
$$ -1614 -284 1870 -2278 1212 734 -2316 2267 -467 -1615 2462 -1543 -304 1841 -2209 1174
1925A174m23k999M480k711j073L959l987J353K010l998L490o07k883M477k884
$$ 1174 751 -2248 2232 -479 -1552 2407 -1580 -227 1783 -2215 1275 668 -2215 2262 -622
1940f22q38L862m082J576J862m021L584p19k787M411k883p12L719m049J664J739
$$ -622 -1460 2402 -1680 -104 1758 -2263 1321 602 -2185 2226 -657 -1369 2350 -1699 -35 1704
1956A704l970L579p15k747M307k754p47L627l871J501J768l817L323n51k681M077
$$ 1704 -2266 1313 598 -2149 2158 -596 -1343 2284 -1587 -86 1682 -2135 1188 637 -2044 2033
1972B033k558p71L498l724J400J796l762L188m23k666L933k443p53L382l668J458
$$ 2033 -525 -1296 2202 -1522 -122 1674 -2088 1100 677 -1989 1944 -499 -1252 2130 -1538 -80
1988h0J710l710L211n31k544L895k563n47L284l767J677J563l729L327o52k438
$$ -80 1630 -2080 1131 600 -1944 1951 -612 -1159 2125 -1642 35 1598 -2131 1196 544 -1894
2004a894L862k668l48L146l795J830J416l655L337p34k328L763k627l03L046l684
$$ -1894 1968 -700 -1048 2098 -1697 133 1549 -2106 1231 497 -1831 1932 -695 -998 2048 -1636
2020a636J725J450l548L123n78k281L569k443l56K946l537J602J494l472K955
$$ -1636 89 1539 -2009 1114 536 -1745 1824 -619 -975 1971 -1566 36 1530 -1942 1013
2035A013m57k264L434k311l92K902l453J549J469l381K898m91k163L346k384j90
$$ 1013 556 -1708 1726 -585 -977 1925 -1528 21 1490 -1891 1007 516 -1647 1699 -685 -875
2051h75K801l519J703J345l372K990o46k024L338k498j5K672l548J842J188l285
$$ -875 1926 -1593 110 1455 -1917 1073 427 -1597 1741 -757 -772 1900 -1648 194 1382 -1903
2067a903L031p90j857L293k585P3K635l525J795J188l174K872p06j802L129k448
$$ -1903 1128 338 -1519 1774 -811 -738 1897 -1628 167 1355 -1819 1053 347 -1455 1674 -774
2083g74L0K566l380J642J266l082K694n83j800L019k335l5K567l282J523J314
$$ -774 -744 1822 -1558 84 1350 -1732 962 379 -1421 1598 -737 -772 1795 -1487 36 1350
2099A350l006K550n31j730K930k306K6K502l265J598J180k970K636o82j621K961
$$ 1350 -1656 894 363 -1367 1563 -743 -717 1785 -1480 118 1298 -1672 964 282 -1339 1622
2115A622k464K01K433l310J689J044k865K679q67j436K946k585L12K386l338J722
$$ 1622 -842 -641 1792 -1518 171 1215 -1650 1029 162 -1274 1672 -913 -601 1785 -1553 169
2131A69J018k813K606q20j394K866k489K25K344l185J595J051k721K473p05j422
$$ 169 1187 -1626 980 160 -1234 1632 -857 -632 1712 -1473 122 1173 -1548 925 220 -1202
2147a202K756k352J19K369l063J419J138k645K348o45j420K687k285J03K335l016
$$ -1202 1554 -798 -679 1690 -1373 46 1184 -1461 887 242 -1178 1509 -776 -673 1662 -1354
2163a354J450J055k591K374p79j329K722k374J99K276l027J555Q92k541K456r49
$$ -1354 96 1151 -1440 934 155 -1174 1548 -826 -627 1649 -1378 177 1069 -1472 984 35
2179C5j180K745k504L52K188l048J635P73k481K497j007j134K733k473L15K148
$$ 35 -1145 1600 -904 -552 1636 -1412 223 996 -1485 1012 5 -1129 1604 -869 -554 1594
2195A594k962J552P86k381K388r27j152K671k361J86K156k858J430Q80k356K273
$$ 1594 -1368 184 970 -1411 977 50 -1102 1569 -792 -606 1550 -1308 122 1002 -1354 919
2211I19q18j210K615k245R7K138k743J387Q21k305K320r09j216K658k301J74K112
$$ 919 101 -1109 1506 -739 -642 1496 -1247 140 961 -1344 976 67 -1149 1509 -792 -618 1494
2228A494k764J469P04k236K362j098j053K675k417L41J996k778J605N38k203K440
$$ 1494 -1270 199 903 -1333 1029 -69 -1122 1553 -864 -523 1473 -1305 300 838 -1365 1075
2244A075j182j000K669k404L64J953k750J571M96k149K430j135j006K590k296
$$ 1075 -107 -1107 1562 -842 -478 1475 -1275 296 792 -1357 1073 -62 -1068 1522 -774
2259g74K74J924k664J462N80k129K350j000j112K561k167J35J915k552J396N98
$$ -774 -500 1424 -1240 222 802 -1327 1023 23 -1089 1472 -695 -560 1355 -1197 199 797
2275G97k089K305j007j096K540k189J80J903k530J453N11k073K363j106j034K501
$$ 797 -1292 1013 6 -1090 1450 -739 -559 1344 -1186 267 778 -1295 1068 -38 -1072 1429
2291A429k226L37J793k555J602L45k050K448j231r52K505k239M18J691k542J634
$$ 1429 -797 -460 1333 -1222 380 725 -1325 1123 -108 -1060 1445 -794 -376 1315 -1227 407
2307D07K75k010K397j179r09K448k196L82J669k490J562L36k019K347j023j018
$$ 407 682 -1328 1069 -110 -1019 1429 -767 -385 1284 -1206 356 692 -1327 1020 -3 -1021
2323a021K401k076K47J683k414J464M13j977K288r72j057K351k021K67J642k397
$$ -1021 1380 -696 -449 1234 -1180 284 697 -1280 1008 36 -1021 1330 -691 -424 1218 -1179
2339a179J505M26k013K281j015r90K314k079L79J563k388J642K46j973K335j122
$$ -1179 326 752 -1261 1020 5 -985 1329 -750 -371 1192 -1196 446 692 -1281 1054 -68
2355f8q83K253k117N40J483k431J692J79j951K330j119q37K201k073N56J398k398
$$ -68 -951 1302 -815 -275 1208 -1223 469 648 -1303 1027 -92 -929 1272 -801 -245 1153 -1245
2372a245J686K21j972K278j010q78K182j969M09J433k325J569L09j974K203q88
$$ -1245 441 662 -1310 968 -42 -920 1262 -707 -298 1135 -1190 379 688 -1286 917 29
2388B9q99K104j919L73J452k331J548L55j955K171q69r21K049j913M61J374k331
$$ 29 -870 1234 -685 -312 1140 -1191 357 712 -1243 928 59 -862 1187 -726 -265 1109 -1222
2405a222J657K64j932K194j018p83K035k002O06J280k319J735J59j882K165j047
$$ -1222 435 699 -1233 961 -57 -840 1195 -807 -201 1079 -1240 495 654 -1228 937 -110
2421a10o90J963j985O60J249k303J701J46j858K147j009p10J960j915N88J267
$$ -110 -800 1163 -822 -162 1087 -1216 485 631 -1227 920 -89 -799 1161 -754 -166 1101
2437A101k295J586K76j846K023q74p38J926j869N07J285k268J539L45j853J974
$$ 1101 -1194 392 668 -1178 845 -29 -767 1159 -710 -203 1082 -1186 353 698 -1155 819
2453H19q02p60J858j847N04J282k249J551L03j784J983r27o48J819j913O68J184
$$ 819 17 -743 1115 -732 -228 1054 -1195 356 659 -1125 858 -69 -717 1102 -811 -143 1041
2470A041k254J629K12j700J933r98n58J781j918P33J123k208J623J63j658J890
$$ 1041 -1213 416 628 -1072 861 -137 -695 1086 -832 -99 1024 -1184 439 602 -1056 834
2486H34r83n14J759j890O87J170k179J479K37j648J819q67n61J712j783N82J203
$$ 834 -149 -663 1096 -794 -107 1063 -1116 363 600 -1048 771 -96 -657 1055 -728 -146 1057
2503A057k156J375L53j649J773q15n94J698j752N26J189k107J367L37j586J745
$$ 1057 -1099 276 629 -1020 753 -62 -656 1042 -710 -184 1005 -1102 265 602 -984 761
2519G61q44n22J644j790N97J137k061J415K05j491J748r28m53J599j809P01J073
$$ 761 -83 -605 1039 -751 -154 983 -1078 337 542 -949 799 -129 -582 1017 -792 -91 982
2536I82k021J421J17j415J724j007l81J594j793O57J095k001J365J73j426J641
$$ 982 -1039 382 499 -916 808 -199 -580 1014 -779 -122 973 -1028 337 510 -916 725
2552G25q92m11J582j720N51J126j928J247K21j436J640q04n06J587j645M70J144
$$ 725 -167 -578 1004 -716 -165 961 -967 280 501 -935 705 -99 -605 982 -663 -193 951
2569I51j891J177K59j385J620q22m84J571j664M91J079j838J239J69j307J595
$$ 951 -940 237 496 -889 731 -91 -575 996 -668 -177 902 -936 303 472 -835 760
2585G60r08l88J544j722N63J017j778J270N6j248J591r53l31J506j723O08J002
$$ 760 -148 -536 1008 -714 -151 866 -912 358 414 -834 757 -196 -527 979 -744 -136 866
2602H66j763J244O8j258J579r30l80J534j619M95J029j728J168J34j285J547q50
$$ 866 -897 347 415 -843 736 -194 -574 960 -659 -164 865 -863 305 439 -846 701 -149
2619a49m59J584j564L66J087j688J092J83j287J520p75m97J556j542L63J048j665
$$ -149 -608 976 -588 -222 865 -823 269 452 -835 685 -90 -587 969 -573 -210 838 -827
2636h27J102J43j244J561q68m45J528j541M17R54j643J181O5j178J546r39l73
$$ -827 275 418 -826 735 -133 -578 950 -591 -174 780 -863 318 383 -795 751 -188 -561
2653e61J495j554M65R16j609J195K6j191J564r19m08J486j495M29R42j581J118
$$ -561 934 -620 -155 761 -848 347 373 -818 746 -173 -581 905 -590 -161 781 -800 318
2670C18P7j202J520q14n03J503j415L35R80j592J062J65j259J505p45n58J505
$$ 318 395 -807 713 -101 -604 899 -516 -181 799 -793 269 434 -825 680 -65 -623 882
2687H82j348K69R51j549J071J29j229J507p61n24J469j396L50R18j543J096O9
$$ 882 -466 -197 754 -795 276 405 -824 683 -78 -602 867 -529 -179 739 -804 292 361
2704C61j172J520q12m52J378j381M52Q14j526J158K8j170J510q10m54J369j339
$$ 361 -811 709 -103 -555 823 -558 -106 708 -818 340 368 -802 708 -102 -556 813 -526
2721e26M26P95j486J137L4j194J490p34n08J363j295L56Q76j514J067J42j259
$$ -526 -100 695 -791 346 380 -814 676 -58 -566 797 -498 -142 734 -780 287 429 -830
2738h30J465o22o01J357j235K94Q95j511J051J71j258J449o43n70J361j254L35
$$ -830 635 13 -588 769 -466 -172 723 -788 263 434 -824 625 -18 -588 773 -481 -146
2755a46Q35j494J088J31j230J430o41m93J269j251M16P60j467J144K0j172J439
$$ -146 689 -805 283 414 -816 614 -27 -520 749 -502 -86 674 -793 351 371 -801 638
2772F38o70m71J235j250M37P51j456J106O6j171J391o42m78J234j216L85P88j467
$$ 638 -32 -503 732 -518 -81 670 -786 320 386 -785 606 -36 -514 720 -496 -111 677 -790
2790g90J081J46j250J377n48n54J245j173L09Q50j464J022K25j273J336m96n68
$$ -790 291 437 -813 564 16 -538 707 -466 -157 693 -771 251 476 -797 539 43 -525
2807e25J248j192L28Q49j488J032K07j241J328n45m94J201j196M06P70j466J077
$$ -525 723 -469 -141 708 -780 252 459 -782 546 1 -493 708 -488 -82 688 -778 299
2824B99J25j174J300n89m11J161j227M31P50j459J078J21j157J275n59m12J142
$$ 299 424 -750 550 -39 -450 711 -516 -85 665 -794 284 405 -752 523 -36 -448 694
2841F94j212M29P64j462J034J85j180J264n21m73J183j179L49Q40j472R55K93
$$ 694 -518 -89 675 -787 247 432 -748 516 -5 -478 705 -474 -125 715 -757 198 491
2858D91j229J222m70n00J199j174L16Q63j469R59K75j200J213m88m71J151j173
$$ 491 -738 484 14 -486 713 -461 -145 718 -751 208 483 -717 496 8 -463 688 -485
2875d85L70P98j428R63K02j106J197n69l86J124j197M26P65j435R85J80j086J175
$$ -485 -115 683 -745 218 420 -686 511 -58 -444 680 -517 -91 674 -761 224 404 -682 493
2893D93n81l35J098j168M15P42j387R49J76j069J173n42l84J125j169L42Q17j382
$$ 493 -88 -423 675 -493 -78 664 -723 226 402 -667 506 -36 -420 705 -464 -122 695 -687
2911f87Q64K72j116J158m95m49J157j151K96Q50j404Q68K71j098J153n17m28J148
$$ -687 177 449 -667 491 -4 -453 704 -447 -151 699 -705 163 434 -664 489 -28 -456 692
2929F92j150K96Q31j351Q71K01j026J125n56l68J106j155L54P84j309Q66J45r80
$$ 692 -458 -162 669 -682 189 390 -636 489 -67 -435 671 -484 -130 654 -655 211 356 -624
2947f24J128n99l19J085j124L59P34j278Q50J30r48J115n90l42J103j116L04P80
$$ -624 504 -95 -414 671 -453 -94 640 -638 212 342 -606 509 -81 -423 680 -436 -132 648
2965F48j273P94J84r79J114n33m07J134j099K42Q24j282P85K12r89J122n16m53
$$ 648 -625 169 353 -626 488 -45 -452 682 -417 -175 649 -633 152 364 -625 497 -19 -472
2983d72J145j080K21P98j220P57J90r54J118n56l88J088j050K50P49j181P92J10
$$ -472 673 -407 -186 612 -608 149 339 -615 503 -53 -441 647 -403 -153 596 -585 207 317
3001C17q90J090n85l50J063j054K83P10j145P87O7q66J070n77l38J056j024K54
$$ 317 -573 517 -68 -418 645 -409 -126 584 -561 226 293 -573 497 -80 -418 638 -386 -132
3019a32P13j150P45J16q90J072n10m24J087r88J98P41j152P33J57r41J102m98
$$ -132 581 -569 176 292 -598 474 -36 -460 627 -361 -163 578 -574 159 316 -625 477 -21
3037b1m52J120r87J52P55j133P33J51r21J096m96m36J059r72J96P01j106P67J07
$$ -21 -473 647 -340 -188 567 -566 167 318 -603 493 -3 -439 620 -352 -156 545 -561 206 313
3056C13q82J070n28m06J019r52K46O30j062P81N2q55J040n29l63R92r30K54O09
$$ 313 -569 501 -27 -433 586 -366 -120 510 -552 229 281 -574 466 -63 -426 566 -364 -110 499
3075D99j061P87N4q78J043m76l95J000r09K20O37j078P49J10r03J052m42m44J024
$$ 499 -562 225 279 -599 444 -32 -427 573 -336 -116 521 -557 192 302 -601 451 9 -435 589
3094E89q99J76O53j082P47J44r29J049m33m29R78q70J97N96j047P75Q6q70J031
$$ 589 -310 -134 519 -563 184 328 -601 448 15 -414 564 -306 -109 487 -560 215 301 -569 462
3113D62m70l87R27q73K45N56j023P90M1q31J009m79l38Q73q58L04N04j010Q09
$$ 462 -8 -395 532 -341 -96 460 -563 227 268 -563 446 -33 -371 502 -356 -52 452 -558 251
3132B51L1q45R77m38l44Q65q21K75N25j017P77O8q77R90m07l91R01q32K42N64
$$ 251 282 -563 414 -24 -368 497 -324 -49 476 -541 236 304 -573 417 10 -381 520 -312 -70 494
3152D94j057P61J09q94R94l85l90Q79q16K37N41j044P53J12q59R57m02l40Q40
$$ 494 -563 198 307 -587 407 22 -368 511 -305 -68 473 -571 182 294 -565 392 -10 -350 490
3171D90q40K98M99j002P72O5p96R11m24k81P70q22L35M53r58P74J6p69R11m36
$$ 490 -350 -52 447 -555 217 282 -514 397 -27 -308 462 -360 -25 428 -530 244 260 -509 402 -34
3191c4k73P72q02L26M55r64P38O1p94Q80l94k84P84q11K87N29j019P24J21q35
$$ -34 -307 465 -337 -11 444 -520 218 279 -515 365 -29 -313 471 -340 -53 476 -543 181 302 -533
3211e33Q85l66l20Q00q07K99N06j010P29R6p92Q75l82k75P64q18L17M71r76P26
$$ -533 352 -14 -334 466 -341 -42 464 -546 183 279 -513 362 -20 -295 469 -349 -32 439 -537 189
3231A89P7p47Q45m08k07O94q07L64M13r26P24L9o93Q13m25k00O88p94L45M32r18
$$ 189 266 -481 364 -44 -251 443 -364 0 413 -513 211 250 -443 370 -55 -255 433 -361 -16 416 -502
3252e02O99M8o96P97m12k06P07p97L24M80r51O89P4p30Q03l83k40P45p87K96M84
$$ -502 197 245 -451 346 -66 -272 435 -362 -38 442 -509 180 254 -476 327 -56 -296 449 -338 -42 442
3273D42r40O65Q1p09Q08l96k21P44q12K87M85r17O42P0o72P96m13j77O79p81L21
$$ 442 -498 167 248 -461 347 -49 -270 474 -338 -51 434 -483 159 229 -443 353 -60 -237 442 -339 -18
3294a8M02q57O64Po07P67m39j48O47p60L09M00q13O36nn81P52m57j48O62p60L07
$$ -18 384 -473 191 198 -409 358 -81 -229 418 -342 -33 367 -446 190 185 -396 356 -101 -249 413 -347 -40
3316d0M28q26O14K7o16P65m33j78O95p52K80M46q38O01M1o24P54m14j91P10p45
$$ -40 388 -438 176 203 -413 352 -81 -259 436 -316 -36 410 -428 173 214 -410 344 -70 -261 449 -296
3337b96K60M22q07N89J0n81P59m28j67O67p35K64L81p61N97m6n00P23m55j17O25
$$ -296 -36 386 -421 168 178 -403 356 -72 -239 428 -307 -43 338 -423 174 128 -372 351 -104 -221 404
3358D04p22K88L46p17N82n0m82O92m41j18O04o86K73L60p13N74l0n30P11m26j60
$$ 404 -318 -30 316 -401 181 131 -351 341 -100 -218 386 -300 -27 333 -380 194 164 -366 345 -81 -241
3379b41O55o89K39L89p32N50rn33P14m16j83O67o73K07L94p23N57k1n35P10l93
$$ -241 414 -275 -36 353 -379 171 162 -371 343 -73 -256 411 -262 -55 339 -384 173 152 -383 327 -66
3400f6j85O48o63K20L55o73N32m3m72O83m27j27N78o29K42L17o47N55p8m55O69
$$ -66 -251 397 -266 -46 309 -364 168 125 -347 336 -91 -218 360 -269 -27 290 -357 198 120 -335 334
3421C34m07j32N60o00K38K81o41N51n4m65O64l85j64N81n97K09L25o49N31k9n22
$$ 334 -73 -205 355 -245 -7 274 -367 184 130 -335 329 -56 -220 361 -236 -27 298 -351 180 151 -371
3442c71O87l70k11O15n88J93L34o57N33j6n27O82l42k18N99n65J83L33o60N29
$$ -371 316 -54 -265 350 -238 -45 289 -368 165 149 -378 304 -38 -256 343 -222 -39 294 -366 163
3462A63j1n08O54l48j64N55n70K24K84o19N21n0m63O30l35j60N30n41K25K49o15
$$ 163 152 -356 298 -50 -214 341 -229 -5 279 -340 181 131 -332 298 -37 -197 333 -208 17 266 -349
3483c49N27k9m93O37l19j89N23n29K04K84o38N39k3n06O31k93k20N49n22J80L17
$$ -349 178 149 -344 293 -26 -215 308 -221 -17 267 -371 168 145 -361 270 -23 -243 306 -216 -36 281
3504B81o42N25jn46O55k65k49N51n18J76L13o26N11On27O34k66k21N11n10K10
$$ 281 -361 164 163 -383 272 7 -242 309 -209 -33 280 -346 165 171 -356 278 12 -209 302 -208 2
3525BK64o09N07%n00N83k63j75M75m90K03K61n91M83Jm84N77k66j81M71n00K22
$$ 2 266 -343 164 164 -336 247 -16 -191 284 -206 -3 258 -333 150 151 -333 244 -22 -203 268 -232 -10
3547a0K63n99M92J7n01N85k59j97M90n01K01L02o26M84M3n14N90k50k10N09n10
$$ -10 253 -346 146 163 -338 247 -12 -209 281 -220 -19 283 -343 141 184 -330 260 10 -200 309 -201
3568b01J78L23o45M82N4n18N64k33j99M90n11J91K97o02M54L5m78N38k38j69M62
$$ -201 -23 300 -345 137 191 -327 237 4 -195 295 -216 -25 272 -330 124 159 -319 219 -19 -188 274
3589B74m94K12K66n90M50L7m44M96k30j43M35m85K06K69n77M41M8m67N13k27j57
$$ 274 -220 -8 258 -332 118 155 -289 207 -23 -166 269 -216 -10 259 -318 123 171 -296 217 -10 -167
3610a67M58m98J93K91n83M22O7m86N31k19j86M89n14J70L29o34M40Q6m97N18k30
$$ -167 291 -207 -14 277 -306 116 183 -303 228 9 -177 312 -202 -32 297 -337 103 189 -308 210 -20
3631b0j71M81n14J81L05n95M36N9m64N03k27j50M48m83J79K86n54L97O0m27M82
$$ -20 -191 290 -224 -43 262 -333 103 162 -302 201 -26 -176 272 -211 -32 254 -300 97 157 -270 212
3652B12k40j33M34m78J81K86n49M11L7m21M85k59j30M47m76J68K96n73M06O3m40
$$ 212 -28 -161 273 -205 -24 262 -287 124 161 -260 225 -34 -164 283 -193 -25 271 -302 104 167 -273
3673b73M95k54j56M85n06J63L21n86L99O7m60N26k57j74N11n13J62L22n76M00
$$ -273 222 -32 -188 297 -209 -46 275 -311 88 155 -305 221 -36 -210 301 -212 -50 272 -304 96
3693I6M9m36N26k71j64N04n08J65K91n31L87K8l96M97k70j41M69m92J72K81n22
$$ 96 145 -291 235 -36 -200 304 -204 -39 252 -279 108 136 -260 237 -33 -174 295 -197 -25 256 -266
3714b66L87jl80N04k85j20M34m70J71K73n16L86ll99N19k93j39M93m99J62K98
$$ -266 121 120 -260 244 -41 -161 273 -197 -26 247 -269 117 114 -285 234 -59 -198 295 -204 -42 256
3735B56n44L94J5m18N40k93j39N00n05J42L12n49M07km09N53k90j51M96n04J66
$$ 256 -288 106 121 -297 243 -50 -189 311 -194 -52 260 -289 118 116 -293 260 -30 -181 315 -189 -23
3756b3K81n21M05j9l91N28l08j34M58m73J79K41m99M18m4l69N25l14r5M19m73
$$ -23 258 -263 142 123 -268 260 -48 -182 276 -197 -18 223 -276 142 98 -271 254 -60 -155 264 -209
3777b09J71K52m90M15n6l54N22l14j19M55m76J82K53n15M19l4l95N54l13j36M79
$$ -209 -38 214 -276 139 83 -271 251 -63 -182 273 -203 -21 232 -283 136 102 -293 261 -52 -188 291
3798B91m86J77K69n28M20m3l95N65l19j24M78m84J65K45n21M49o1l79N39l10j17
$$ 291 -195 -18 251 -277 143 100 -295 270 -49 -173 305 -179 -14 231 -290 159 98 -281 258 -52 -169
3819a69M49m76J86K07m79M32p0l41N15l26r5M24m62K10J83m63M41p3l57N05l05
$$ -169 280 -196 -10 197 -282 150 80 -261 254 -72 -167 257 -205 5 188 -275 166 93 -264 241 -64
3840f4r9M20m49K04J94m94M66p6l86N41l03j23M45m67K04K18n22M67p0m02N50
$$ -64 -163 257 -192 12 206 -288 178 102 -284 257 -46 -169 276 -191 13 231 -291 176 106 -296 254
3861B54k91j39M43m66K12K01n29M82p0m02N59l05j18M33m63K11J79n05M74o5l74
$$ 254 -37 -176 267 -199 13 214 -315 167 97 -305 254 -51 -169 264 -199 12 191 -314 160 95 -279
3882b79N32k99j01L96m55K26J76m90M82r0l65N25k99j00L91m55K48J62n00M73
$$ -279 253 -46 -147 249 -206 20 196 -294 188 98 -267 258 -41 -141 250 -205 43 205 -295 178
3902A78p6l71N32l14j06M23m84K46J90n38M93o2m20N54l14r6M27n02K67J94n55
$$ 178 102 -269 263 -51 -157 266 -218 28 218 -320 173 111 -309 245 -69 -165 262 -240 27 221 -334
3923c34N03p8m00N69l25r3M32n08K66J86n42M92p6l77N47l17p1L94m99K67J72
$$ -334 169 91 -309 260 -65 -158 274 -234 32 218 -324 168 92 -285 262 -55 -126 268 -231 36 208
3944B08n22M85p6l47M90k99o2L75m89K68J62n26N05p6l69N24l34m9L83m97K81
$$ 208 -314 171 95 -252 238 -61 -123 252 -237 31 193 -333 172 96 -273 251 -83 -132 251 -246 35
3965C5J76n28M88p0l83N32l38o9M21n12K82K03n80N29r1l96N49l43m9M37n37K86
$$ 35 211 -317 171 101 -282 250 -88 -157 264 -248 34 237 -343 186 95 -301 248 -95 -144 293 -244 42
3987D2J86n60N17q9l85N54l43m4M03n16K77J76n44M98q3l58N20l43l4L92n18K81
$$ 42 228 -332 185 96 -289 265 -78 -122 281 -235 42 218 -326 172 89 -269 251 -92 -126 266 -252 29
4009B9J61n14M85q0l49N23l52k8L97n38K87J92n32N01q5l61N29l49n5M34n58K95
$$ 29 190 -324 161 81 -268 255 -97 -125 272 -266 21 213 -319 182 97 -264 265 -84 -139 295 -263 32
4031C2K06n63N09r1l70N58l67n1M37n35K67K17n64M91r3l54N49l71m3M33n47K80
$$ 32 238 -325 184 93 -277 281 -86 -137 300 -235 32 249 -315 176 83 -271 278 -93 -136 297 -250 30
4053C0J89n34M78j04l21N27l71k6M15n26K56J75m92M64j03l10N33l81l0M06n21
$$ 30 219 -315 163 59 -262 265 -106 -132 283 -243 13 188 -304 160 57 -253 280 -101 -131 275 -246
4074b46K72J84n01M75j10l10N19l76n0M45n43K66K07n27M87j18l37N51l92m5M54
$$ -246 26 210 -291 184 74 -236 283 -93 -143 302 -241 25 232 -295 192 74 -263 288 -104 -149 305
4095C05n52K68K07n34M88j04l50N49l89k7M33n46K64J96n11M96j50l12N52l87
$$ 305 -247 21 228 -306 182 78 -272 277 -112 -139 294 -252 12 208 -303 193 43 -269 283 -104
4115a04m6M49n35K60J77m93M78j50k95N39l88k7M28n24K67J56m73M76j51k86N40
$$ -104 -150 299 -236 24 201 -292 186 36 -259 280 -108 -135 293 -231 36 192 -281 195 44 -242 298
4136B98l99l3M19n20K68J83n17N02j42l29N65m09m2M34n22K73J81n18N09j43l39
$$ 298 -101 -134 285 -235 33 216 -301 201 59 -270 295 -114 -156 278 -244 29 210 -308 201 58 -281
4157b81N75m08m1M51n40K82J67n15N19j70l03N61m06k3M15n09K79J31m69M89j55
$$ -281 294 -114 -155 296 -244 38 205 -310 209 39 -264 297 -109 -132 283 -226 53 184 -285 204 49
4178D9l00N41l81k5L88n07K89J14m54M98j77k80N27l81k8M03n21K88J25m69N12
$$ 49 -251 290 -91 -116 272 -235 54 168 -286 212 35 -245 282 -99 -127 276 -245 43 168 -301 211
4199B11j56l24N60l89l9M03n15K86J55m96N09j59l18N71m11l0M19n06K82J31m91
$$ 211 55 -269 291 -98 -137 266 -249 37 192 -304 205 46 -272 299 -112 -142 277 -229 53 184 -307
4220c07N28j73l15N57l90k7M00n05K89J18m71N06j59l16N29l71j0L72m79K80J06
$$ -307 221 48 -267 290 -100 -127 273 -232 57 175 -296 210 51 -265 264 -107 -117 255 -224 56 162
4241A62m53M79j51k91N05l56j4L63m80K90R5m48N00j61l00N28l67k2L73m85K98
$$ 162 -291 188 37 -254 251 -105 -119 244 -236 54 149 -299 201 40 -260 268 -99 -121 252 -233 65
4262F5J10m72N12j60l21N49l75k7L81m89L02J09m74N11j65l08N34l75k0L70m88
$$ 65 175 -297 215 55 -266 283 -92 -119 262 -227 75 184 -290 221 56 -252 282 -93 -113 257 -231
4283b31L07J03m86N12j39l09M91l53j5L61m78K99J01m54M72j42k83M80l40kL30
$$ -231 76 179 -307 205 66 -243 248 -105 -120 241 -237 62 163 -291 181 39 -244 236 -104 -106 224
4304B24m41K90Q8m39M71j38k86M81l44ML30m68L06J09m72M78j33k93M92l55mL43
$$ 224 -217 73 161 -278 193 55 -231 250 -94 -90 240 -228 78 187 -285 193 60 -233 259 -96 -100 243
4326B43m70K95J10m68M81j35l03N00l57oL51m81L07J08m72M76j41k80M86l48j
$$ 243 -227 68 178 -290 191 56 -247 253 -104 -110 241 -240 67 175 -297 179 38 -242 244 -104 -105
4347a05L37m72L08R4m46M59j35k48M40l33K1L05m45K89J01m33M49j34k54M29l22
$$ -105 232 -240 68 162 -284 175 40 -208 232 -101 -80 225 -220 69 170 -263 186 52 -202 227 -95
4368i5L1L06m62K90J02m43M51j46k54M60l49J8L24m68K97J11m56M52j39k59M77
$$ -95 -64 242 -220 70 172 -271 180 34 -220 240 -109 -91 233 -235 62 173 -283 169 30 -229 248
4389B48l66K2L38m81L00J06m46M65j48k56M65l64L3L19m67K82J11m20M48j51k38
$$ 248 -118 -96 242 -239 61 167 -279 186 38 -218 247 -117 -84 235 -232 50 161 -259 189 38 -200
4410b00M39l44L6K95m46K86R1m07M37j61k11M19l45L3L04m51K85R0l94M12j54
$$ -200 239 -105 -69 226 -220 66 157 -250 187 26 -185 234 -111 -78 226 -225 60 150 -244 168 14
4431A4k16M33l63L5L17m49K81R4m07M31j51k24M56l74L5L36m59K69J00m11M39
$$ 14 -202 231 -132 -97 220 -229 52 146 -261 170 19 -205 251 -123 -88 248 -211 58 158 -253 186
4452A86j68k19M54l69K9L34m57K75Q8m00M32j75k06M47l66L5L18m48K69Q4l73
$$ 186 18 -201 253 -116 -87 247 -210 65 153 -247 185 10 -196 251 -115 -80 238 -210 59 143 -230
4473b30M07j76j85M31l62K7L07m26K61O9l56M11j85j83M26l66M2L02m32K80P2
$$ -230 177 1 -184 247 -115 -88 219 -207 54 123 -233 178 -7 -190 236 -130 -88 214 -218 62 134
4494A34l73M29j84k03M49l75L5L25m51K87O9l83M51k10j88M46l86N6L17m59K88
$$ 134 -239 190 6 -197 252 -123 -88 237 -214 73 142 -241 210 0 -188 258 -128 -72 245 -214 74
4515G4O3l81M34j97j80M34l72M7K96m20K58O0l64M30j97j79M42l77M1K90m12K64
$$ 74 137 -244 190 -7 -187 247 -125 -78 218 -202 56 116 -248 182 -15 -194 248 -129 -88 202 -210 54
4537E4N6l38M27k02j81M35l67L3K87m16K73N8l55M45k06j83M39l88N8K84m27L04
$$ 54 110 -228 199 -3 -184 251 -116 -83 204 -212 61 119 -236 209 3 -180 259 -129 -71 213 -214 90
4559I0K9l58M55k24j92M59l90M5L01m26L01L0l76M69k29j79M51l92O4K69m16L06
$$ 90 119 -239 216 -8 -200 259 -131 -86 215 -211 90 120 -256 213 -16 -195 256 -136 -72 197 -219 87
4581H7Pl41M60k31j69M41l75O6K61m19L12kl31M44k20j57M20l64O6K48l98L11
$$ 87 94 -247 213 -18 -187 254 -121 -55 206 -213 99 97 -234 210 -10 -167 253 -111 -45 203 -195 116
4603A16k1l32M55k21j72M27l79P2K45m03L14kl48M78k52j73M53l98P3K63m28L33
$$ 116 95 -237 218 -3 -175 252 -127 -55 190 -213 101 99 -249 229 -23 -196 257 -141 -68 195 -233 100
4625A00j2l49M77k44j70M30l73R0K48m22L58l0l54M73k40j61M25l73R2K24l92
$$ 100 88 -261 216 -28 -198 232 -141 -51 197 -225 133 103 -251 222 -18 -179 246 -127 -35 189 -203
4646b03L25k5l27M44k45j24L99l64R2K18m09L38k8l27M49k35j48L97l59R4K12
$$ -203 122 97 -230 214 -31 -155 244 -120 -28 190 -219 119 91 -236 213 -22 -170 227 -132 -38 174
4667A74m00L35j9l24M52k48j41M06l79J14K05m20L69l2l37M72k44j51M11l84J27
$$ 174 -226 109 90 -234 218 -30 -171 235 -144 -30 175 -245 124 92 -245 227 -17 -168 243 -141 -14
4688a4K10m27L61l5l35M72k66j10L72l71J30K00m09L56m5l13M23k35j16L62l48
$$ -14 196 -231 130 95 -240 232 -34 -144 228 -143 -13 187 -222 134 89 -224 199 -36 -152 210 -138
4709a38J34J64l84L37m1l03M27k40j03L73l68J26J85m02L51m8l06M37k29j12L61
$$ -138 -4 160 -224 113 72 -231 196 -44 -147 226 -142 -16 169 -233 118 70 -236 201 -28 -140 221
4730B21l67J42J87m25L73m1l17M54k73r0L80l90J53J92m35L74l7l18M33k44j01
$$ 221 -146 -4 183 -242 131 90 -227 227 -46 -136 244 -146 7 199 -236 138 101 -217 216 -28 -129
4751a29L52l86J62J77m07L56n4k89M17k43r9L49l71J65J71l96L38m1k79M04k43
$$ -129 223 -163 -1 176 -231 125 71 -218 199 -44 -143 206 -165 0 171 -225 113 72 -207 197 -46
4772d6q4L42l65J61J67l86L30n2k70M12k54p3L50l92J61J78l99L47n0k87M35k65
$$ -46 -130 212 -153 8 175 -211 119 67 -203 209 -45 -118 232 -160 1 179 -220 127 77 -210 225 -40
4794d0q2L62l99J60J83m06L41m6k86M32k89n5L53m03J81J55l84L46o7k64M16k79
$$ -40 -122 240 -159 1 184 -222 119 73 -213 219 -70 -125 228 -175 6 161 -223 123 56 -208 208 -71
4816g1o0L55l93J74J69l81L39q0k41L95k67m4L32l83J80J55l62L15q2k44L96k72
$$ -71 -131 224 -169 5 174 -207 132 52 -189 206 -61 -105 227 -156 24 179 -183 132 50 -194 202 -70
4838g0l2L36l98J80J47l63L33q3k44M15k96k9L34l92J61J74l91L32o4k48M12l08
$$ -70 -102 234 -164 16 163 -200 133 50 -194 221 -75 -104 230 -162 -1 173 -218 114 50 -198 214 -94
4860i4k3L41m02J78J66m02L68q9k29M05l01k7L49m07J81J53l59L31r1k18L86l06
$$ -94 -117 224 -178 0 166 -236 132 43 -186 219 -82 -109 240 -167 14 167 -192 139 48 -170 216 -90
4882i0j5L43l92J71J42l44L23j01k11L77k85j6L17l77J73J40l55L24r9j99L83
$$ -90 -105 238 -154 17 159 -185 138 37 -174 203 -82 -98 219 -158 15 155 -200 124 25 -174 209
4903B09k95j8L15l81J83J39l56L38j06k23M14l10j9L45m03J82J37l63L63j21k13
$$ 209 -86 -104 211 -170 13 152 -204 134 28 -195 219 -91 -110 235 -168 14 151 -212 151 30 -183
4924a83M20l12k2L39m03J86J22l42L44j16j85L77l04k8L30l81J70J11l15L31j23
$$ -183 237 -75 -97 242 -161 25 147 -195 149 33 -152 225 -79 -107 223 -158 12 123 -192 139 16
4945A6j87L74k93j0L08l65J67J19l23L22j13j86L95l09j9L18l70J65J24l32L51
$$ 16 -171 203 -90 -100 208 -157 10 129 -194 128 15 -171 224 -85 -104 214 -156 9 133 -199 152
4966A52j39j85M01k97l7L27l75J81J15l52L63j29k03M24l25j1L18l87J89J07l37
$$ 152 13 -172 229 -68 -105 222 -153 28 143 -209 154 25 -178 246 -79 -90 228 -159 30 137 -200
4987b00L54j27k09M16l13l2L09l67J81J01l12L49j56j68L86l09j0K90l46J83J02
$$ -200 154 27 -182 234 -79 -111 198 -169 12 113 -199 150 -6 -174 212 -97 -107 183 -163 20 122
5008A22l15L45j44j77L83l00lK89l55J97P7l32L72j35j96L88k99lK94l64J99P9
$$ 122 -193 152 8 -169 214 -86 -89 200 -155 42 119 -213 159 24 -172 216 -83 -86 208 -156 43 122
5030A22l22L60j55j79M00l21MK96l80K05Q8l20L62j52j93M01l03kK77l61K09P9
$$ 122 -200 160 5 -174 226 -95 -91 205 -175 30 118 -202 160 8 -185 216 -87 -89 188 -173 36 115
5052A15l13L53j46j86L84k87%K72l60K18P1l03L48j44j80L60k74J3K42l29K05
$$ 115 -198 155 9 -177 207 -80 -80 192 -168 50 121 -182 166 22 -158 202 -72 -59 183 -146 59
5073E9N7l07L58j45j89L77k94J6K55l50K15O3l08L53j42j91L82l04K2K64l62K36
$$ 59 116 -191 167 22 -167 210 -84 -68 187 -163 52 115 -193 160 18 -173 209 -95 -73 191 -171 65
5095F5M8l12L57j42j87L80k91MK56l41K23M5k94L49j51j65L58k86K4K43l34K19
$$ 65 113 -199 158 16 -171 209 -82 -78 178 -163 60 105 -189 160 9 -156 202 -84 -60 183 -151 68
5117F8L9k88L31j27j78L48k76K6K28l28K09L7k74L29j44j51L41k96M0K29l31K22
$$ 68 107 -181 150 23 -155 193 -83 -57 171 -157 52 89 -185 144 0 -151 190 -106 -66 163 -168 54
5139E4L6k89L44j49j43L45k97L6K32l46K23O7l01L36j46j52L51l05M0K50l53K32
$$ 54 90 -199 145 -4 -147 198 -99 -63 169 -177 46 113 -188 148 2 -150 201 -104 -64 186 -167 65
5161F5M1k88L31j49j32L35l05O0K15l38K24M3k76L15j43j32L30k87M2K15l31K16
$$ 65 106 -182 149 0 -132 203 -102 -42 173 -165 59 102 -174 141 -2 -134 196 -91 -49 166 -165 51
5183E1M3k79L09j33j20L11k93N1K14l22K17M1k66L04j28j21L13k96M9K34l45K22
$$ 51 94 -185 124 -9 -129 182 -111 -60 154 -168 49 90 -176 128 0 -121 192 -104 -55 179 -166 56
5205E6M6k71L11j41j35L31k97N6K21l57K45M6k81L18j57j28L18k85O2K15l44K17
$$ 56 102 -169 142 1 -134 197 -100 -44 177 -180 65 111 -170 148 -9 -137 181 -104 -42 173 -171 46
5227D6O0k65K94j51j08L12k99N6K16l26J99N8k51K83j41j05K97k76N2K17l19K02
$$ 46 106 -159 135 -16 -124 188 -111 -55 161 -165 34 92 -159 124 -17 -122 175 -101 -49 168 -151 51
5249E1M9k56K94j34j14L05k98P1K17l37J90N8k45K87j54j03L11l13P1K26l39K04
$$ 51 100 -156 138 4 -110 195 -103 -32 185 -152 38 96 -149 138 -16 -119 192 -121 -50 176 -163 41
5271D1N2k56K93j41j17L24l06M9K25l29K02N7k61L07j60j04L11k94N9K19l24J96
$$ 41 93 -163 130 -11 -128 196 -110 -61 164 -165 37 94 -167 140 -20 -124 187 -107 -48 171 -153 43
5293D3M5k47K87j40j06K95k75N7K14l13J95M4k37K75j59q9L12k97M9K19l20J87
$$ 43 88 -159 128 -12 -118 177 -98 -41 173 -140 55 99 -138 137 -22 -111 201 -96 -47 172 -148 39
5315C9M8k44K85j58r5L16l02O5K12l29J96L9k40L21j76r7L06k99O1K17l27K03
$$ 39 87 -157 128 -30 -125 191 -111 -46 166 -163 33 72 -168 153 -23 -120 186 -113 -52 165 -162 41
5337D1M4k38L04j65j12L27k98M8K11k99J86L5k24K76j63p7K92k78M6K00k85J87
$$ 41 85 -153 151 -14 -126 201 -97 -49 162 -137 49 84 -140 136 -27 -104 188 -90 -44 156 -129 58
5359E8J6k15K80j61r7K83k69O7J89k89J85J4k17K88j70q1L02k80M2K02k95J99
$$ 58 74 -141 139 -22 -119 164 -105 -38 151 -138 47 61 -156 132 -38 -119 183 -97 -55 147 -148 51
5381E1L3k54L26j77j04L20k94N4J98l01K16Lk29L00j65j11L23k90N8J96k93J96
$$ 51 84 -170 156 -21 -125 195 -99 -45 153 -148 68 71 -158 142 -23 -134 189 -101 -43 153 -140 56
5403E6K5k24K88j61r7K94k78O2J83k86J96J5k28K87j55r5K87k68N3J89k80J95
$$ 56 81 -143 145 -16 -113 181 -97 -35 148 -138 58 73 -155 132 -23 -118 169 -99 -46 143 -137 58
5425E8Rk21K86j56j09K97k68P3J80k80K05ok25L12j75r1K99k81O0J86l11K34M
$$ 58 67 -154 132 -24 -133 164 -104 -31 149 -131 74 68 -157 155 -20 -111 188 -93 -33 153 -158 76 80
5448H0k34L12j85q2K90k71O3J81l18K32Ok32L05j61j08K94k79P5J55k68K10pk04
$$ 80 -154 158 -27 -109 181 -90 -27 154 -164 68 74 -158 147 -14 -122 172 -107 -32 123 -145 65 58 -146
5471a46L01j86q4K74k50O4J67k85K20nk11K93j73o8K55k66Q6J56k87K25qk24L04
$$ -146 155 -31 -115 159 -91 -27 140 -145 75 70 -141 152 -21 -89 166 -100 -14 142 -145 80 72 -152 152
5494A52j65r8K86k81R1J64l02K32j6k22K97j70q0K84k90R6J62l10K27jk21L01
$$ 152 -13 -111 175 -106 -15 149 -153 79 63 -159 138 -32 -112 172 -118 -22 140 -170 57 56 -165 136
5516A36j74o4K68k77J01J41l04K43j3k15K99j71o4K51k66R8J53k90K27j3j93K61
$$ 136 -38 -102 166 -111 -10 131 -173 70 57 -158 141 -30 -94 157 -109 -11 142 -148 79 66 -127 134
5538A34j56o3K42k62R9J46k91K28j9j99K81j85m0K66l07J16J45k96K38k1k05K85
$$ 134 -22 -85 157 -105 -6 140 -151 77 58 -141 140 -45 -85 181 -126 -10 135 -161 77 56 -149 136
5560A36j83m1K50k91J24J47l16K44j7k08L03j96l8K50k82J23J34l01K32j2j99
$$ 136 -47 -88 162 -129 -5 142 -174 70 53 -155 148 -48 -86 164 -118 5 139 -162 70 58 -141
5581a41K78j72l9K39k86J26J31k83K30l0j83K67j76k7K24k79J26J22k77K27l0
$$ -141 137 -35 -74 165 -121 5 136 -147 83 53 -130 137 -39 -66 158 -121 5 127 -150 77 47
5602D7j67K49j83j7K36k98J33J36l00K42m3j77K78k06j4K45k98J38J43l05K62
$$ 47 -120 129 -54 -71 165 -133 0 136 -164 78 35 -142 136 -70 -84 161 -137 1 144 -161 101
5623A01l5j98K85k07j0K46l05J41J31l05K39l7j70K74k07rK25k87J32J28k82K38
$$ 101 66 -132 153 -54 -64 182 -123 18 149 -156 83 46 -124 150 -57 -66 159 -128 4 132 -150 88
5645H8m1j70K59k01jK29k90J37J05k60K27m0j64K56j91j0K18k89J35J23k70K35
$$ 88 47 -123 136 -65 -66 163 -127 10 115 -145 82 42 -122 134 -57 -67 151 -138 -3 120 -150 85
5667H5m1j55K50j99pK28k86J36J27k67K16m4j55K67k15qK38k97J41J12k72K38
$$ 85 44 -111 139 -60 -67 161 -125 11 138 -129 87 43 -112 155 -60 -68 170 -127 14 126 -146 92
5689I2o2j65K82k17MK26l10J56J09k65K29m6j57K53j92RK14k74J21J16k63K18
$$ 92 30 -135 147 -70 -66 160 -150 6 115 -150 79 33 -124 129 -63 -54 160 -114 7 123 -140 78
5711G8m2j32K39k01%K04k61J20J25k64K21n7j26K42j99jK11k75J32J02k49K23
$$ 78 36 -96 143 -58 -58 146 -115 5 130 -134 87 30 -96 146 -53 -54 157 -118 14 116 -133 90
5733I0o9j33K68k20J2K03k78J30R9k37K25q4j39K75k15KK25k82J30J06k40K13
$$ 90 21 -112 156 -64 -52 151 -127 3 102 -135 90 6 -133 142 -73 -71 154 -128 2 108 -132 81
5755H1o6j27K59k18K4J97k66J30Q9k23K05o2j27K47j97J1J88k50J27P4k17K18
$$ 81 15 -112 147 -71 -47 150 -116 14 103 -120 85 23 -104 143 -54 -43 145 -105 22 96 -121 97
5777I7p0j15K33k01QJ98k55J29O1k12K22q9j14K53k09PJ95k56J32P7k25K14p1
$$ 97 27 -88 145 -56 -48 150 -105 24 85 -127 95 6 -108 145 -64 -57 138 -118 14 91 -134 80 9
5800Ij24K55k09PJ95k57J49N9k05K14q2j06K37k00J6J85k46J33O2k15K31r4j14
$$ 9 -115 140 -69 -62 133 -124 25 84 -121 93 11 -95 142 -58 -42 143 -103 30 92 -123 108 14 -100
5823a00K30j88J6J69k42J47M8k08K10q0r7K19j76KJ69k35J46M6k08K19q1j08K35
$$ -100 130 -58 -42 127 -115 32 80 -128 82 2 -95 124 -52 -50 119 -116 30 76 -132 87 6 -102 133
5846A33j97PJ82k45J50N2k08K39r9j11K37j98K2J78k58J56N4k23K40r9j02K34
$$ 133 -64 -57 125 -120 30 82 -126 113 14 -97 140 -58 -36 142 -116 40 94 -129 111 12 -90 144
5868A44k11L7J64k47J58K4j88K23q7j06K20k01M5J36k26J56J4j87K22r0r9K21
$$ 144 -67 -30 134 -113 45 69 -119 104 17 -89 131 -70 -25 111 -115 41 55 -132 90 0 -99 122
5890A22j89L6J41k31J55M2j96K04r0r2K16j75K6J49k33J67K5j99K26q6r8K04j78
$$ 122 -67 -31 110 -121 34 76 -120 84 -6 -98 118 -57 -31 118 -115 52 77 -122 104 18 -80 124 -54
5913e4K7J53k46J73K8k07K39j08r5K27k09O8J17k41J71K9j98K20j10o9K02j95
$$ -54 -27 126 -120 53 81 -126 113 5 -90 137 -72 -4 113 -128 43 72 -126 94 -16 -85 117 -78
5935g8N2J26k26J82nj77K15r1p1J88j76N0J17k29J79Nj76K14r7o2J78j98Q0J08
$$ -78 -26 100 -126 56 51 -126 89 -2 -73 115 -61 -11 106 -123 56 61 -115 99 2 -60 118 -80 0 108
5959A08k10J64Pj81K24j10o7J92k12P9J16k36J91Ok00K32j11n6J73k01R1J05k38
$$ 108 -102 62 69 -112 112 2 -65 127 -85 -6 110 -126 65 71 -129 103 -8 -64 109 -92 -1 104 -134
5982a34J90Mj91K19j01o4J84k00R6R2k22J91j5j49J96j02m1J65j96Q9Q3k06J65
$$ -134 56 60 -131 88 -13 -77 107 -93 3 95 -127 64 49 -100 96 -6 -47 118 -78 11 94 -112 53
6005E3J4j60J94j05n3J65j79Q0Q4k05J79j5j52J89j05l7J62k00J00Q4k16J84j8
$$ 53 67 -93 101 -4 -57 108 -71 9 93 -112 67 52 -100 89 -16 -53 109 -91 9 93 -123 61 43
6028D3j49J92j19k6J69k01J07P5k24J98j8j51J92j30oJ66k06J09Q6k19J74j4j41
$$ 43 -106 86 -33 -59 110 -91 16 91 -133 65 47 -104 88 -42 -48 118 -88 21 107 -112 62 48 -93
6051i3J95j26j5J50j88J05O8k08J80k1j36J86j19rJ41k02J10N9j92J64k5j19J81
$$ -93 102 -24 -39 111 -77 28 96 -112 68 47 -89 97 -22 -31 110 -92 18 77 -115 49 24 -95 86
6074H6j21mJ43k06J07Q1j91J77l7j26J92j42OJ34j95J13P4k04J74l1j18J91j50
$$ 86 -35 -39 104 -102 5 86 -105 72 35 -91 101 -41 -35 99 -96 17 91 -113 61 30 -88 103 -47
6097d7NJ50k06J25N5j93J85l6j20J87j51J9J31j97J22M7j89J70m5r8J76j53L4
$$ -47 -42 108 -98 27 82 -111 74 38 -82 105 -46 -27 104 -93 29 76 -113 57 12 -86 90 -63 -29
6120b9J22j96J18M6j70J70n1q6J72j38J2J19j83J08O1j91J87o0q0J74j46J2J30
$$ -29 93 -103 15 61 -109 61 10 -76 96 -42 -30 89 -94 14 75 -116 71 11 -69 105 -41 -29 101
6143A01j98J35L3j59J75o7r0J79j57K3J33k18J39N2j83J78o8q4J82j64K5J34k08
$$ 101 -97 38 71 -88 87 20 -70 109 -48 -25 108 -110 29 81 -102 76 8 -76 106 -58 -33 101 -107
6166a07J31M1j63J69p7p2J82j63L1J33j95J20K3j51J72p8o9J87j69M4J17j94J22
$$ -107 24 65 -98 71 -6 -78 104 -59 -28 105 -90 30 53 -98 74 -4 -73 114 -55 -11 106 -88 34
6189C4K9j49J82q4p7J88j77M2J10j86J29J5j51J83q7o9J77j67M5J06j99J41K6
$$ 34 63 -86 96 12 -65 123 -54 -12 98 -88 41 56 -95 88 1 -68 109 -58 -13 93 -106 35 61
6212F1j67J91r2p0J87j76L9J14j84J41J7j59J89r5n6J59j61M9J02j87J41Rj35
$$ 61 -106 85 -7 -77 110 -66 -27 87 -97 44 61 -98 91 -4 -60 99 -62 -13 89 -98 43 52 -83
6235h3J66q8n4J64j57N4R1j71J44k1j42J85r3m2J56j55M5R8j74J27mj36J83j16
$$ -83 83 -5 -59 105 -52 2 93 -78 66 45 -97 88 -5 -47 109 -46 -1 97 -77 50 46 -90 93 -23
6259b3l9J71j71M4J05j87J53rj60K22j16n6J79j67N1R3j84J49j1j46J96q9o9J65
$$ -23 -62 109 -62 -18 87 -100 53 44 -116 106 -10 -66 113 -54 -3 90 -94 55 44 -102 94 5 -64 101
6283A01j68Q2P7j69J56l3j47J92q7o6J63j52M8Q2j62J46k1j42J83j08m2J64j60
$$ 101 -67 15 92 -77 79 46 -101 91 4 -62 101 -51 -3 79 -83 63 42 -100 83 -25 -67 97 -63
6306f3N6P4j69J49k3j19J92j14m4J62j59N9O7j65J52j0j59K27j23n2J81j89Q1
$$ -63 -7 67 -102 47 24 -95 97 -17 -61 101 -58 1 68 -97 55 45 -114 113 -10 -62 119 -70 11
6329A1P2j84J73k6j49K16j20n5J87j89O4P7j65J60k5j35J95j21m6J52j52O0O6
$$ 11 83 -101 72 46 -103 113 -7 -62 125 -64 0 77 -88 72 47 -88 107 -14 -60 92 -60 0 66
6352F6j66J62l5j37K10j30l8J57j62P8N0j55J62l5j19J74j12l0J51j54Q5N3j80
$$ 66 -100 62 27 -110 100 -30 -68 89 -73 5 55 -100 62 27 -92 82 -30 -60 91 -63 22 75 -105
6375a05J76l6j27K05j34k4J52j63Q1M9j83J75l2j32K06j27k2J39j83R3N8j86J94
$$ -105 71 35 -92 113 -21 -45 107 -56 25 74 -109 66 34 -98 108 -19 -41 98 -85 8 66 -120 74
6398G4m2j31J94j27j5J33j66Q9L8j44J66o1r4J75j22j6J34j61R0N0j55J71n4j06
$$ 74 32 -99 95 -32 -47 86 -80 9 47 -97 69 8 -86 89 -33 -49 85 -76 14 64 -91 80 26 -80
6422h0J80j17j3J30j67J04L7j75J84n8j05J86j38j0J46j75J03L2j74J85n8j03
$$ -80 100 -17 -30 100 -67 37 74 -101 83 25 -80 106 -32 -42 104 -71 32 64 -110 75 17 -86
6444h6J82j33j0J46j86J15M2j76J91o5j07J91j37k2J50j90J21K6j54J70l3j20
$$ -86 96 -37 -47 99 -87 28 70 -106 85 20 -87 104 -33 -55 95 -95 26 52 -102 68 35 -85
6466h5J93j46J0J25j73J15J2j40J70o1r1J70j24OJ10j59J09K9j70J86o7r6J77
$$ -85 108 -38 -28 97 -76 39 51 -89 81 20 -71 99 -25 -19 91 -68 41 70 -100 86 19 -77 100
6489A00j44J8J26j82J12L0j58J64n6q5J72j42J1J35j88J21K7j62J88q0q1J71j45
$$ 100 -44 -26 100 -82 30 60 -98 66 10 -75 97 -45 -34 101 -87 34 61 -101 87 7 -74 97 -48
6512d8K8J30j90J20K7j56J72p5p2J80j55K7J03j75J33J3j43J70p7p0J57j41J3
$$ -48 -20 110 -80 40 67 -89 83 8 -64 116 -39 -12 91 -84 49 62 -81 89 12 -58 99 -42 -29
6535b9J14j73J17J8j39J57n6q3J72j45K9J05j82J27J6j34J70q2p3J83j60K3J26
$$ -29 85 -88 29 47 -92 65 9 -74 98 -47 -18 87 -95 32 48 -86 84 2 -71 112 -48 -25 101
6558A01j87J36K1j61J88r2n1J58j60L6J08j78J32Qj43J75q5n7J55j58M4J05j78
$$ 101 -86 50 71 -90 98 6 -45 113 -47 -11 97 -81 51 59 -84 91 6 -51 104 -54 -10 95 -83
6581h3J17J5j46J71p6o4J65j53M0J08j92J49oj42J66p3n4J57j59M9R5j71J27J0
$$ -83 34 49 -97 74 -2 -66 99 -54 -14 94 -98 51 45 -97 69 -4 -58 99 -60 -11 84 -87 40 50
6605E0j28J65r7n3J70j50M4Q9j75J25J1j08J54r7n8J65j58M3J10j94J29nj14J73
$$ 50 -78 87 -10 -63 107 -43 1 90 -85 40 51 -57 97 0 -58 107 -51 -8 102 -92 37 32 -82 91
6629I1j12k9J57j72M1J09j81J45j9j18J74j07l4J57j62M9R7j73J30j8j07J68j10
$$ 91 -21 -50 107 -65 -24 85 -96 49 30 -88 86 -21 -55 102 -60 -11 86 -87 43 25 -82 86 -24
6652b4l1J51j55N8Q0j53J18lj13J69j06k9J51j65M7J01j66J30j8j06J54j02l8
$$ -24 -55 96 -59 -1 79 -74 44 41 -72 97 -9 -38 113 -52 -5 96 -70 60 42 -64 90 -12 -50
6675e0J63j65M2J02j70J24k0j02J76j20l7J66j67N5Q5j62J21j4r9J67j22l0J59
$$ -50 113 -52 -10 92 -78 46 26 -76 100 -20 -57 109 -58 -3 82 -80 41 27 -72 95 -27 -57 102
6698A02j49M6Q5j56J27k2j00J74j31k3J58j66N6P7j36J18k8j03J64j04m4J59j50
$$ 102 -47 -1 84 -72 55 33 -67 107 -24 -47 111 -55 1 78 -58 60 32 -71 93 -11 -55 104 -46
6721d6M4P5j48J31k9j04J68j09m2J64j56N1P0j46J24k8j01J76j16l1J50j52N1
$$ -46 -2 73 -75 56 27 -77 91 -18 -60 104 -52 -1 69 -77 47 19 -82 94 -22 -53 97 -55 -4
6744dP2j40J27k6j05J73j24k8J52j44L9Q4j56J37k5j01J62j18k3J49j49N1O5j38
$$ -4 68 -72 55 29 -76 97 -27 -55 97 -47 -8 76 -80 57 32 -69 93 -25 -48 101 -48 3 68 -70
6768g0J21k9j00J71j06l7J39j50O9N6j38J22l4q7J65j12l4J46j48O0N1j37J37
$$ -70 51 22 -78 93 -13 -50 89 -61 8 64 -74 48 14 -73 92 -20 -54 92 -56 4 55 -82 55
6791E5k7j18J92j23l2J52j53O2O9j48J42l9j06J87j30k1J37j46N5N7j42J37m0
$$ 55 28 -90 102 -21 -53 99 -54 8 77 -71 71 32 -74 113 -17 -38 99 -47 8 65 -77 60 20
6814B0r1J70j17k3J46j78P3O4j46J38m6r8J77j17j8J37j58O8N4j31J46n1r0J53
$$ 20 -71 99 -18 -41 105 -73 0 64 -82 56 10 -88 89 -28 -46 91 -67 1 55 -76 70 19 -71 82
6838H2j04j4J27j56P3O7j59J55m5j02J73j25nJ44j73P4O6j64J52k5j17J69j18
$$ 82 -22 -36 91 -65 8 75 -84 71 26 -76 97 -28 -33 111 -62 12 78 -86 66 41 -76 93 -25
6861b5j8J46j64O4O2j49J48m4j02J73j25j6J36j54P3N4j56J54l9r4J60j10j2J14
$$ -25 -43 103 -61 3 65 -84 64 20 -82 91 -34 -50 86 -68 5 59 -97 57 18 -76 84 -26 -38 76
6885G6j46Q0N5j49J52l3j08J59j13j1J28j44O8M7j44J46m4q8J60j25j1J49j78
$$ 76 -70 10 65 -84 68 35 -73 86 -27 -38 90 -54 14 61 -83 63 19 -69 91 -34 -45 104 -74
6908g4Q6N5j69J58l8j08J72j25kJ36j67Q3N4j63J53m0r7J82j33QJ31j77R0M2j42
$$ -74 12 67 -102 56 18 -90 82 -43 -45 91 -76 7 61 -102 51 11 -86 96 -37 -29 102 -75 15 57 -85
6933h5J50n1q3J70j28MJ20j65Q6O1j48J36m7q8J59j25J4J12j66J04L6j42J40m2
$$ -85 65 14 -69 101 -27 -23 97 -68 18 79 -69 67 20 -68 91 -34 -20 92 -74 30 66 -76 64 22
6957B2q8J58j31RJ10j69J04M7j56J56n5q7J63j36RJ25j69R8N6j61J72p6o3J71
$$ 22 -66 92 -39 -30 80 -89 15 62 -94 62 7 -80 83 -53 -44 81 -88 10 66 -95 77 1 -62 109
6981A09j58J6J30j77J13M0j61J54n8q0J83j46RJ41j86R7M4j55J53n7p6J68j41
$$ 109 -49 -33 97 -80 33 73 -88 66 8 -72 111 -35 -26 115 -71 26 70 -85 68 11 -65 103 -38
7004c8K0J11j61R4L1j28J26n1o9J58j48J8J27j67J01M1j46J48o0p1J61j42K4J22
$$ -38 -18 93 -68 26 57 -71 55 4 -65 93 -55 -37 90 -77 24 65 -81 67 7 -64 97 -45 -21 101
7028A01j75J03M1j54J58p2o7J78j61L3J25j92J17M0j55J52o1p4J74j62L1J26j75
$$ 101 -74 29 70 -84 74 2 -65 113 -48 -15 110 -82 35 75 -80 72 11 -63 111 -51 -20 106 -69
7051f9R4K2j22J41o7o3J68j74M7J07j57Q9L7j37J42o6n5J68j67L7J10j63J11K3
$$ -69 25 47 -75 66 -1 -64 104 -70 -23 84 -73 16 53 -84 58 -8 -63 105 -62 -25 85 -78 33 56
7075E6j35J54q1m8J62j61L9J13j80J22J7j35J63r4n3J68j59L0J24j92J21L6j43
$$ 56 -79 75 -6 -54 108 -53 -14 99 -81 41 58 -77 86 -8 -61 107 -52 -22 102 -90 31 67 -76
7098g6J58r8m6J66j55L2J11j75J06J6j39J79r4m8J63j62L5J19j72J08K5j25J43
$$ -76 82 -16 -62 104 -51 -19 92 -83 23 39 -100 79 -15 -63 100 -62 -27 92 -80 28 53 -72 71
7121G1o6n7J54j69N7R8j64J08K0j24J56r2m9J67j72N9R6j84J26Rj26J75j07m4
$$ 71 5 -52 102 -67 -10 88 -76 32 52 -72 84 -8 -57 110 -62 -3 93 -91 35 44 -82 93 -14 -58
7145e8J63j66L7J22j94J30Qj29J75j02n0J64j59N0R8j80J36Oj45J70r3m2J69j75
$$ -58 105 -61 -24 98 -96 34 42 -87 88 -14 -64 100 -59 -9 89 -91 45 51 -94 76 -17 -59 110 -65
7169f5N5J17j91J24Jj25J78j05l2J57j65M5R0j61J22qj19J66j00m1J64j59M2R2
$$ -65 -10 107 -84 40 41 -84 94 -11 -43 114 -51 -6 84 -77 45 37 -82 84 -16 -57 107 -52 -10 82
7193H2j66J28oj22J76j12l2J46j65O5J03j96J47j2j29J74j05l1J66j86N8J03j81
$$ 82 -84 44 38 -84 92 -20 -52 94 -71 -6 97 -99 48 36 -93 81 -24 -55 111 -75 -17 86 -95
7216i5J49j6j31J88j12l0J54j64O3Q3j67J25lj14J81j28k7J60j74N2Q9j60J21
$$ -95 54 38 -93 95 -17 -47 107 -57 6 89 -78 47 44 -70 111 -17 -44 116 -58 -6 83 -77 44
7239D4qj26J79j13k8J60j76O1Q2j70J44rj32J85j08m1J58j71O6Q6j76J55k9j20
$$ 44 36 -90 89 -24 -52 108 -68 -7 75 -95 49 40 -92 93 -15 -56 102 -69 -3 83 -93 62 33 -87
7263h7J89j29j4J49j76O6R0j83J57k0j21J77j13k3J47j73P1Q1j82J55k5j24J74
$$ -87 102 -27 -41 108 -68 -2 88 -95 62 42 -79 98 -15 -38 109 -64 7 88 -94 61 36 -88 86
7286H6j11k7J49j72P1R0j77J51l0j31J91j22k0J54j76P5P8j76J54k2j23J81j17
$$ 86 -25 -52 97 -75 -4 86 -91 60 30 -101 90 -32 -52 102 -74 1 79 -97 57 35 -88 93 -24
7309b4j6J31j47P3O8j81J62k1j38J99j14l2J49j82Q5P7j79J55k8j17J83j22k1
$$ -24 -40 91 -56 17 85 -96 66 45 -93 106 -8 -40 109 -73 12 89 -90 65 37 -80 103 -19 -40
7332d0J40j73Q3P6j87J68l4j24J83j26j5J47j89R9O8j79J64k1j33J86j19j0J43
$$ -40 100 -73 10 86 -101 67 33 -91 92 -34 -49 98 -91 8 76 -103 61 40 -93 93 -26 -36 107
7355A07j85R0O4j71J54k1j22J86j26mJ29j82J00N9j74J67m1j07J79j32pJ36j88
$$ 107 -78 12 76 -95 59 38 -84 102 -24 -28 101 -81 19 78 -96 71 30 -77 102 -30 -37 99 -89
7378h9J02O4j82J67l9j06J80j34JJ38j91J09M9j81J78m8j16K01j34oJ35j90R7
$$ -89 13 77 -105 62 23 -83 97 -37 -36 102 -89 20 69 -112 66 18 -98 103 -31 -37 98 -92 5
7401EO7j72J67m6r3J75j47OJ42j86R7O6j82J64l8j08J83j37JJ44j95J05O6j86
$$ 5 72 -100 67 21 -72 103 -44 -38 104 -82 15 81 -101 63 25 -83 100 -37 -36 108 -87 18 84 -102
7425a02J63l9r6J73j41KJ34j87J02N4j71J77n0r8J67j44L0J24k02J21O0j80J79
$$ -102 61 22 -74 99 -42 -40 94 -93 9 63 -108 69 19 -79 88 -56 -26 98 -104 17 77 -103 76
7448G6o3r4J89j54J8J29j92J21M9j63J66m8j01J82j44J0J36k01J18M4j65J59n3
$$ 76 13 -81 108 -46 -28 101 -91 30 79 -84 82 34 -67 115 -29 -19 117 -84 34 78 -87 72 19
7471A9j04J85j45J9J28j93J10M3j57J54m8r5J87j45OJ33k02J27N0j81J87n5r5
$$ 19 -85 100 -45 -26 102 -91 19 62 -95 59 11 -84 103 -42 -36 97 -105 22 72 -109 78 23 -72
7494g2J78j53K8J22j95J24L5j59J68n9q8J73j50K0J34j94J17M8j76J83o5r9J91
$$ -72 106 -47 -19 103 -92 32 67 -92 76 17 -71 102 -48 -28 106 -88 29 77 -99 84 19 -80 111
7517A11j57K1J26j95J15M8j73J75o6q5J86j60K7J20j86J08N1j67J74p5p2J79j56
$$ 111 -46 -25 101 -94 21 69 -104 71 5 -80 106 -54 -27 93 -93 15 66 -101 73 -2 -74 105 -51
7540e1K7J22j99J35K9j51J64o5p2J76j56K4J33k04J36J4j53J69p5q1J90j69L8
$$ -51 -24 98 -101 34 63 -88 76 11 -61 115 -41 -17 116 -88 48 62 -91 78 3 -78 112 -57 -19
7563a9J16j88J23L1j67J90q9p1J79j56K0J27j96J34J8j58J76p3p3J72j64M6J12
$$ -19 97 -91 32 63 -104 86 -3 -74 105 -51 -31 96 -100 34 52 -106 70 -3 -76 96 -68 -22 90
7586I0j88J25K5j51J75p0p5J70j58M4J13j81J15K2j50J90q5o8J67j65L4J10j76
$$ 90 -98 27 52 -99 76 6 -69 101 -57 -13 100 -81 34 56 -94 96 11 -57 110 -55 -21 89 -87
7609h7J19J7j49J90r5o3J72j61L7J02j81J37J7j55J86q4p0J66j54L3J05j73J31
$$ -87 32 49 -100 90 -5 -68 104 -57 -20 82 -99 38 55 -100 86 2 -68 98 -56 -23 82 -91 40
7632D0Oj41J89r3p0J70j47L8J04j79J33Mj53J83o8p4J73j55L3R7j67J20Nj37J68
$$ 40 46 -95 94 1 -69 101 -46 -8 96 -83 50 54 -99 84 16 -58 115 -40 -7 90 -77 43 48 -89 79
7657G9p6o6J58j42M2R9j76J18%j34J75q3o2J71j53K7J08j84J43Pj50J95j07n6
$$ 79 3 -63 95 -47 -5 94 -82 36 36 -98 77 -6 -68 103 -50 -23 85 -99 44 51 -99 96 -11 -67
7681f7J75j63M7R3j70J42qj46J99r4p0J71j60M5J05j77J38qj41J82q5q1J76j50
$$ -67 108 -55 -8 85 -85 57 49 -97 102 8 -62 109 -51 -6 99 -78 60 52 -89 93 8 -73 103 -47
7705d7L8R5j83J47J1j71J97r3n6J65j63M8R3j79J43mj46J84p9o5J65j55L9J08
$$ -47 -9 86 -97 50 61 -110 87 -6 -62 103 -60 -12 81 -98 45 41 -105 79 0 -65 100 -55 -16 92
7729I2j70J29Jj42J77q8n9J63j60O1R3j87J57j2j47J84q9n2J51j57M6R6j72J42
$$ 92 -78 51 52 -90 87 -1 -60 103 -57 4 97 -90 67 55 -92 92 3 -49 102 -55 -9 87 -85 57
7753E7rj41J79r3m9J50j63N7R6j83J49lj35J61q3m4J52j54M7R5j86J52rj39J82
$$ 57 48 -93 86 -7 -56 94 -69 -12 84 -99 50 47 -88 73 -10 -54 98 -56 -9 86 -100 52 43 -96 86
7778H6q9n6J63j53O2Q7j88J48rj33J86j02m7J56j68O5Q5j86J51Jj45J77j05m0
$$ 86 -3 -59 104 -49 13 100 -88 60 51 -82 104 2 -45 111 -57 8 93 -93 58 59 -86 91 -14 -54
7802e4J56j68N8R3j86J54j6j25J71r8l8J44j58O3Q0j75J63k3j23J67r6l7J46j64
$$ -54 102 -66 -8 85 -101 53 37 -88 83 -15 -53 91 -67 -4 76 -99 64 41 -82 85 -11 -48 98 -66
7826f6Q2P3j86J62k8j25J77r9m3J53j56O4Q1j71J45k3j31J91j13l6J51j68P9O4
$$ -66 16 89 -97 65 37 -88 89 -10 -53 100 -56 8 89 -82 63 40 -91 100 -13 -49 102 -66 13 77
7850G7j85J66j4j44J80j01k8J45j81R0P6j83J58k8j09J76j12k5J39j75Q8O6j81
$$ 77 -108 58 44 -100 80 -21 -49 96 -85 5 81 -102 56 28 -81 95 -17 -42 97 -78 10 76 -105
7873a05J61j4j22J70j06k4J58j99R3N9j67J62k0j24J70j10k6J55j69O4O4j68J57
$$ -105 56 42 -80 90 -16 -40 118 -81 12 71 -96 66 46 -78 92 -18 -44 111 -58 6 70 -98 59
7896E9l2j22J82j11k1J40j79R4O3j73J50k9j00J73j19j7J40j67R0N3j81J68l4
$$ 59 27 -95 87 -24 -45 95 -84 10 73 -100 50 21 -79 94 -25 -42 98 -69 21 74 -107 61 27
7919B7j03J71j32mJ43j72Q2O0j67J66m2j15J88j27j7J50j83Q8O2j71J56k9j10
$$ 27 -76 95 -37 -41 102 -70 12 72 -95 71 29 -86 102 -25 -42 108 -75 13 75 -96 60 31 -79
7942g9J65j14j2J34j74R6N5j61J59o3q9J72j23nJ32j72R0M8j56J54l8j05J80j29
$$ -79 86 -28 -40 94 -80 16 71 -90 69 6 -83 89 -34 -39 93 -79 11 59 -97 57 19 -86 94 -35
7966c5mJ48j92J02M2j47J50m7r1J69j35%J44j78Q4N9j57J57n0q7J69j41MJ30j70
$$ -35 -39 109 -83 19 61 -86 64 17 -74 95 -40 -40 104 -74 10 69 -88 69 19 -68 101 -40 -36 94 -76
7991g6R9L6j48J52o3q5J81j30pJ35j81R7N3j48J41l9r9J72j33JJ38j72R9L7j50
$$ -76 23 59 -89 63 0 -85 96 -34 -41 94 -87 10 63 -85 56 17 -82 90 -43 -42 96 -76 23 60 -90
8016i0J52n8q1J73j37J4J28j77J06L3j65J71n8q5J70j20pJ24j78J05M5j55J61
$$ -90 62 4 -77 96 -41 -27 101 -76 30 63 -102 69 11 -74 96 -24 -31 93 -85 20 65 -90 71
8039G1o0q8J74j44J1J33j84J01K8j39J63o1q6J71j32J2J29j73R6L9j56J65n9q4
$$ 71 11 -77 97 -47 -36 97 -87 14 42 -97 66 5 -81 90 -42 -30 99 -74 22 61 -95 70 11 -73
8063g3J68j32JJ23j60J05K6j48J68o9p6J68j45K2J21j71J04J5j38J64o6p6J62
$$ -73 95 -37 -36 87 -73 32 58 -90 78 9 -67 101 -44 -22 99 -72 32 47 -91 73 7 -69 93
8086I3j39J4J16j53Q7K7j41J72o9p9J65j38J5J21j60R9L8j48J56o7q0J74j33J0
$$ 93 -46 -32 84 -69 18 45 -96 76 7 -72 93 -45 -30 91 -69 30 68 -80 76 9 -71 103 -30 -20
8110b0J04j47R2K0j30J64o9p9J73j51J9J15j62R6L7j45J61o8p2J65j46J3J14j54
$$ -20 84 -63 29 49 -81 83 14 -65 108 -43 -24 91 -71 25 62 -83 78 10 -62 103 -43 -30 84 -70
8134g0R5K6j37J63q3n1J44j32J9J10j54J17qj31J66p8n5J51j31K3R8j60J19Nj28
$$ -70 25 51 -86 77 -6 -57 87 -45 -26 84 -70 47 39 -92 74 -4 -59 92 -39 -16 82 -78 41 46 -82
8159h2J63q6m4J51j41L0R1j63J12K3j36J59o8o8J53j41K5R8j46J00J9j41J69p4
$$ -82 81 -5 -49 102 -39 -9 82 -81 31 54 -82 77 9 -59 94 -47 -22 76 -70 30 49 -92 77 3
8183Co8J53j36K9R9j57J13R
$$ 3 -65 88 -48 -19 80 -77 36 45
8191D5
$$ Imaginary data points
##PAGE= N=2
##DATA TABLE= (X++(I..I)), XYDATA
0@%%%%%%%%%%%%%qJ6j6J6j6J8k6L2l9M7n4O2p2Q3r3J08j24J41j61J83k05K31k61
$$ 0 0 0 0 0 0 0 0 0 0 0 0 0 0 -8 8 -8 8 -8 10 -16 16 -23 24 -30 32 -40 43 -50 58 -66 75 -86 97 -108 123 -138
36a38K93l27L64m06M50m99N54o14O78p47Q23r06R98j097J207j330J469j622J791
$$ -138 155 -172 192 -214 236 -263 291 -323 355 -392 431 -475 523 -574 633 -697 772 -850 941
55I41j986K208k465K765l121L553m086M764n655O878q658J1471j6524K8000r0961
$$ 941 -1045 1163 -1302 1463 -1658 1895 -2191 2573 -3082 3796 -4862 6609 -9915 18085 -72876
70g2876Q926K14605k80144J51917P0688k33393K33757p6626j32558K51428j99037
$$ -72876 -63950 150655 -129489 22428 93116 -140277 93480 16854 -115704 135724 -63313
81f3313J1450J77728k38245J38963M9104k03422K25648r8810j01450K37157k05489
$$ -63313 -51863 125865 -112380 26583 75687 -127735 97913 -897 -102347 134810 -70679
92g0679K5390J73065k45932J46582N0994k09900K21691q1535j15484K32076j82126
$$ -70679 -45289 127776 -118156 28426 79420 -130480 91211 9676 -105808 126268 -55858
103e5858N448J67348k17195J19492N1152j83445J93881p6405r3495K03659j73421
$$ -55858 -50410 116938 -100257 19235 70387 -113058 80823 4418 -89077 114582 -58839
114e8839K1732J44198k09960J31050L5967j78793K01678q3895r6010K10156j73177
$$ -58839 -37107 107091 -102869 28181 64148 -114645 87033 3138 -92872 117284 -55893
125e5893J2478J51705k05134J15813M8839j73790J79685o5016r2865J85435j49463
$$ -55893 -43415 108290 -96844 18969 67808 -105982 73703 8687 -84178 101257 -48206
136d8206J1691J29204j79465J10542L1255j51968J71893p4539p8078J77726j52173
$$ -48206 -36515 92689 -86776 23766 55021 -96947 74946 407 -77671 100055 -52118
147e2118J9068J26358j80439J09027L5879j54139J65022o1874q4624J69336j33150
$$ -52118 -33050 93308 -87131 21896 57775 -96364 68658 6784 -77840 91496 -41654
158d1654P411J18800j60359R3698L2721j35891J48036o0609o9666J53532j30259
$$ -41654 -34243 84557 -75802 17896 50617 -85274 62762 2153 -67513 86019 -44240
169d4240J7531J06343j57327J00479K4954j35018J52956o2849p2368J56523j28988
$$ -44240 -26709 79634 -77693 22786 47740 -87278 65678 2829 -69539 86984 -42004
180d2004J1372J10737j53445R0042L2027j29725J39191n2999o8577J40786j16013
$$ -42004 -30632 80105 -73340 16702 48729 -80996 58195 5196 -63381 77405 -38608
191c8608J3308R6011j39691Q9354K1394j17807J35287n9055o0052J37086j17937
$$ -38608 -25300 70711 -68980 20374 41768 -76039 59248 193 -59859 77227 -40710
202d0710J6318R5340j39056Q6752K5045j18444J28668m9450o3035J28913j04815
$$ -40710 -24392 70948 -68108 18644 43689 -74755 53913 4463 -58572 70341 -34474
213c4474J0243Q9124j25264P7013K1575j05670J18227n0055n3056J19750j03905
$$ -34474 -24231 64893 -60371 16642 38217 -67453 50774 719 -52337 67413 -36492
224c6492J7054Q2322j25126Q1184J8702j06509J20396m9957n5182J21505j02227
$$ -36492 -19438 62884 -62242 18942 37644 -68865 51531 1574 -53608 67897 -34330
235c4330J2389Q4476j21904P4872K2335j02974J12142m4397n1705J11746r6004
$$ -34330 -21941 62535 -59369 15503 37838 -65136 47006 2609 -49096 62650 -33354
246c3354J4840P5870j14716P5315J5610r6209J11126m8608m7457J10277r7103
$$ -33354 -18514 57356 -57360 17955 33565 -62644 48482 -126 -47583 62694 -34409
257c4409J6019P6082j14348P2610J9254r5778J04807m2000m8271J03724q7954
$$ -34409 -18390 57692 -56656 15954 35208 -60570 44237 2237 -46034 57690 -30264
268c0264J2400P0660j04205O6787J5951q7023R7797m2688m1130R7592q7835J6928
$$ -30264 -17864 52796 -51409 15378 31329 -55694 42103 -585 -41715 55877 -31958 -15030
280a5030O7017j04204O8612J4694q7611R8680m1760m3051R8180q5508J3637O7835
$$ -15030 51987 -52217 16395 31089 -56522 42158 398 -42653 55527 -29981 -16344 51491
292E1491j01543O4018J6684q4191R3108l9427l9821R2575q2515J5594O2440r7859
$$ 51491 -50052 13966 30650 -53541 39567 140 -39681 52894 -29621 -14027 48413 -49446
304d9446O5096J2711q0734R2734m1629l7462R1852q3200J5501O3153r6824O2086
$$ -49446 15650 28361 -52373 40361 -1268 -38730 53122 -30078 -14577 48576 -48248 13838
316A3838J5232p9539Q7821l6760l7934Q6255p6031J3216N8726q9204N7556J2944
$$ 13838 29070 -50469 37352 592 -37342 48913 -27118 -13902 44824 -44380 13176 26120
328B6120p2527Q2351l7533l3009Q2190p5362J5405N6409q8358N7755J2786p2698
$$ 26120 -46407 35944 -1589 -34598 47592 -27770 -12365 44044 -44314 13441 26227 -46471
340d6471Q1546l5770l4145Q1562p2742J2753N6446q5243N4080J3164o9499P7942
$$ -46471 35075 -695 -34840 46722 -26020 -13267 43179 -42064 12016 25180 -44319 33623
352C3623l4711l1685P7822p1128J4585N2985q3332N4863J0554o7249P8141l6438
$$ 33623 -1088 -32773 45049 -26079 -11494 41491 -41841 13022 23576 -43673 34468 -1970
364a970l0627P7885p1088J3762N3241q1917N2377J2134o5721P4056l3159l0076
$$ -1970 -32597 45288 -25800 -12038 41203 -40714 11663 23797 -41924 32132 -1027 -31103
376c1103P3517o6286J2217M9912p5921M8987J0050o0368P0123l3385k6762P0018
$$ -31103 42414 -23872 -11655 38257 -37664 11323 21373 -38995 31128 -2257 -29019 40999
388D0999o5146J3521M8166p4668M8226J0134n9651O8712l1818k7595O8916o2186
$$ 40999 -24147 -10626 37540 -37128 11098 21232 -38419 30293 -1525 -29120 39796 -22390
400b2390J1365M7233p1391M5601R702n6780O6039l1745k5187O6576o1781J2811
$$ -22390 -11025 36208 -35183 10418 20120 -36660 29379 -2366 -27553 39023 -22758 -9947
412i947M5183p0356M6461P761n5756O6638l2748k4676O6562o1820J2499M5298
$$ -9947 35236 -35120 11341 19102 -36654 29984 -2764 -27440 39122 -22698 -10199 35099
424C5099o9415M4749Q484n4279O3978l0911k4057O3386n8389J1827M2381o5314
$$ 35099 -34316 10433 18917 -35362 28616 -2295 -26352 37034 -21355 -9528 32853 -32461
436c2461M2827O945n0633O1046l0851k1670O0808n7213J2195M0904o3537M1857
$$ -32461 10366 17311 -33322 27724 -3127 -24797 36011 -21202 -9007 31897 -31640 10217
448A0217O878m9832N9490k9083k2120N9056n4497J0819L9728o0732L9816O315
$$ 10217 17095 -32737 26753 -2330 -24450 34606 -19891 -9072 30656 -30076 9740 16055
460A6055m7369N7525k9177k0339N7205n4147J2260L7902o0387M1139M956m7178
$$ 16055 -31314 26211 -2966 -23305 33900 -20247 -7987 29915 -30472 10667 15623 -31555
472c1555N8234k9893k0200N7405n4074J2009L7624n9510M0457M862m6201N6684
$$ -31555 26679 -3214 -23414 33991 -20083 -8074 29550 -29960 10497 15359 -30842 25842
484B5842k8918j9394N5070n2073J2088L5447n6849L9388L539m3690N4843k8769
$$ 25842 -3076 -22470 32600 -19473 -7385 28062 -28787 10601 14140 -29550 25293 -3476
496c476j7936N2925n0586J2367L3795n5207L8531L536m2764N3068k7174j8014
$$ -3476 -21412 31513 -19073 -6706 27089 -28118 10413 13949 -28815 24253 -2921 -20935
508b0935N1083m7904J1155L2219n2412L6991K767m0632N1392k7073j6511M9336
$$ -20935 30148 -17756 -6601 25618 -26794 10197 12964 -27668 23724 -3349 -19860 29476
520B9476m7539J2294L0778n2001L7805J729m0313N1910k7588j6460M9303m7353
$$ 29476 -18063 -5769 25009 -26992 10813 12542 -27771 24139 -3449 -19909 29394 -17959
532a7959J2247L0453n1453L7408J703l9464N0661k7151j5632M7585m6113J2687
$$ -17959 -5712 24741 -26712 10696 12399 -27065 23596 -3555 -19187 28398 -17715 -5028
544e028K8686m9737L7044P64l8005M9287k6739j4694M5828m4672J2615K7542m8047
$$ -5028 23658 -26079 10965 11729 -26276 23011 -3728 -18422 27406 -17266 -4651 22891 -25156
557b5156L5724P65l6805M7446k5200j4601M3870m2180J1669K6231m5729L3968
$$ -25156 10568 11333 -25472 21974 -3226 -17827 26043 -16137 -4468 21763 -23966 10002
569A0002N98l4834M5391k4690j3265M2135m1544J2421K4977m5241L4353J09l4567
$$ 10002 10600 -24234 21157 -3533 -16798 25337 -16207 -3786 21191 -24050 10303 10412 -24155
582b4155M5354k4693j3071M1774m1408J2466K4634m4759L4136j06l3811M4580
$$ -24155 21199 -3494 -16565 25209 -16199 -3733 20901 -23858 10278 10172 -23639 20941
594B0941k4587j2229M0382m0870J3235K3398m3843L4088p55l2766M3570k4381
$$ 20941 -3646 -15875 24507 -16363 -3128 20270 -23573 10515 9760 -23006 20564 -3817
606c817j1549L9092l9748J3134K2553m2405L2855n40l1712M1560k3007j1106L7222
$$ -3817 -15366 23726 -16022 -2888 19665 -22740 10115 9575 -22137 19423 -3584 -14690 22532
619B2532l7699J2472K1501m0406L1190n98l0117L9614k2167j0082L5550l6753
$$ 22532 -15167 -2695 18806 -21600 9590 8992 -21125 18489 -3678 -13760 21790 -14963
631a4963J2775K0495l9728L0964q51k9550L9277k2076r785L5137l6602J2769K0192
$$ -14963 -2188 18307 -21421 9543 8692 -20858 18419 -3657 -13442 21695 -14907 -2138 18054
644A8054l9373L0757r67k8801L8587k2179q853L4140l6647J3601J9292l8949L1091
$$ 18054 -21319 9438 8471 -20330 18257 -3922 -12775 21365 -15282 -1681 17611 -21338 9753
657I753j527k8201L8130k2215q416L3307l5979J3540J8777l7787L0089j435k7190
$$ 9753 8226 -19975 18155 -4060 -12476 20831 -15148 -1608 17169 -20618 9471 8036 -19154
670a9154L6492k1362p961L1872l4394J3012J8032l6089K8537j419k5783L4672
$$ -19154 17338 -4024 -11985 19887 -14507 -1495 16537 -19552 8985 7566 -18217 16455
682A6455k0593p140L0528l3365J2952J7271l5238K7938j552k5136L4051k0333
$$ 16455 -4138 -11278 19250 -14115 -1163 16108 -19130 8808 7256 -17880 16171 -4162
694d162o750L0028l3115J2953J6908l4901K7718j760k4438L3687k0574n976K9359
$$ -4162 -10912 19116 -13999 -1046 15862 -19039 8679 6919 -17519 16168 -4406 -10382 18977
707A8977l3301J3628J6124l4602K8204k459k3841L3712k1081n580K9038l3148
$$ 18977 -14324 -696 15428 -19174 9030 6571 -17270 16442 -4639 -10219 18819 -14329
719a4329J3561J5891l3735K7452k444k2878L2411k0626n142K7916l1994J3185
$$ -14329 -768 15123 -18612 8840 6396 -16482 15929 -4697 -9839 18077 -13917 -732
731g32J5333l2294K6198k382k1833L0857j9835m755K6805l0717J2750J4771l1138
$$ -732 14601 -17693 8505 6123 -15710 15147 -4688 -9443 17362 -13355 -605 14166 -16972
744a6972K5216k482k1093L0051j9436m473K6325l0153J2469J4444l0587K4695
$$ -16972 8244 5762 -15331 14720 -4716 -9189 17136 -13017 -548 13896 -16691 8004
756H004k666k0358K9669j9561l854K5887l0268J2858J3848l0357K5052l250j9863
$$ 8004 5338 -15020 14649 -4912 -8766 17121 -13147 -289 13559 -16798 8254 5004 -14859
769a4859K9844k0063l506K5738l0350J2797J3664k9735K4618l307j9128K9003
$$ -14859 14985 -5078 -8584 17154 -13196 -399 13265 -16470 8148 4841 -14287 14716
781A4716j9762l272K4842k9429J2475J3198k8491K3657l271j8295K7740j9058
$$ 14716 -5046 -8318 16524 -12905 -430 12768 -15723 7934 4663 -13632 14108 -4950
793d950l195K3957k8122J1836J2832k7271K2501l108j7602K6589j8391k970K3276
$$ -4950 -8145 15812 -12310 -474 12358 -14913 7588 4480 -13122 13467 -4924 -7894 15382
806A5382k7260J1491J2466k6585K1913l231j7122K6171j8175k608K2776k7010
$$ 15382 -11878 -387 12079 -14506 7407 4176 -12946 13225 -4950 -7558 15218 -11792
818a1792J1757J1764k6292K2198l886j6646K6445j8653k293K2705k7116J1823
$$ -11792 -35 11729 -14563 7635 3749 -12897 13548 -5105 -7398 15307 -11809 14
830A4J1395k5915K2137m034j6106K5939j8510j991K1896k6491J1710J0829k4949
$$ 14 11409 -14506 7631 3597 -12509 13430 -5080 -7071 14825 -11666 44 10873 -14076
843a4076K1660m076j5553K5032j7826k086K0995k5251J1169J0467k3784K0657
$$ -14076 7584 3508 -12045 12987 -4839 -6925 14070 -11181 -12 10455 -13329 7328
855G328l908j5003K3954j7020k169K0209k4021J0777R915k2924K0087m000j4583
$$ 7328 3420 -11583 12371 -4649 -6818 13391 -10630 147 10062 -12862 7225 3225 -11358
868a1358K3406j6735j898J9769k3553J0820R279k2501K0213m654j4139K3561j7060
$$ -11358 12048 -4687 -6585 13184 -10369 451 9730 -12771 7442 2788 -11351 12210 -4850
881d850j450J9541k3751J1207Q794k2385K0417n004j3712K3429j7078j153J8858
$$ -4850 -6300 13241 -10510 697 9491 -12894 7523 2519 -11193 12236 -4842 -5995 12863
894A2863k3315J1374Q041k1718K0345n220j3178K2868j6776j109J8178k2455J0934
$$ 12863 -10452 922 8963 -12755 7590 2370 -10808 12060 -4716 -5825 12353 -10102 832
907H32P693k0678J9533n000j2675K1763j5986j087J7263k1375J0606P329j9816
$$ 832 8525 -12153 7380 2380 -10295 11468 -4518 -5605 11658 -9717 889 8218 -11598
920a1598J8844n016j2255K1128j5561r90J6712k0753J0683O799j9451J8774n391
$$ -11598 7246 2230 -10025 11103 -4458 -5448 11264 -9489 1194 7993 -11458 7316 1925
933A925j1839K0972j5783m42J6447k0856J1106O261j9405J9080n805j1551K0948
$$ 1925 -9914 11058 -4725 -5167 11280 -9576 1530 7791 -11614 7466 1661 -9890 11058
946A1058j5857L6J5899k0820J1447N695j9012J9076o091j1007K0586j5721K24
$$ 11058 -4799 -4763 11136 -9684 1763 7458 -11554 7522 1431 -9576 11010 -4711 -4487
959d487J5243k0307J1308N429j8413J8472n707j0626J9561j4926J64J4379j9239
$$ -4487 10756 -9551 1757 7186 -11227 7245 1538 -9088 10473 -4453 -4289 10090 -9149
972i149J0871N077j7534J7851n559j0333J8784j4364K07J3862j8661J0737M881
$$ -9149 1722 6799 -10735 7116 1557 -8776 10008 -4356 -4149 9713 -8948 1789 6670
985F670j7042J7423n708r933J8411j4348O57J3453j8647J1206M463j7102J7610
$$ 6670 -10372 7051 1343 -8590 9821 -4527 -3870 9583 -9064 2142 6605 -10497 7113
998G113n986r637J8304j4530J210J3081j8673J1573L867j6868J7795o319r255
$$ 7113 1127 -8510 9794 -4736 -3526 9555 -9118 2455 6322 -10546 7249 930 -8325
1011h325J8048j4479J586J2566j8474J1506L658j6382J7315o084q893J7318j3838
$$ -8325 9723 -4756 -3170 9396 -9078 2428 6086 -10296 7019 935 -7958 9360 -4478
1024d478J456J1894j7631J1042L516j5633J6530n723q488J6455j3334J452J1457
$$ -4478 -3022 8872 -8759 2283 5799 -9834 6696 973 -7515 8940 -4394 -2942 8515
1037H515j6999J0708L433j5166J6026n521q228J5800j3080J807J1056j6861J0903
$$ 8515 -8484 2224 5657 -9509 6517 996 -7232 8568 -4512 -2705 8351 -8510 2393
1050B393L164j4975J6068n901p955J5796j3274K201J0782j6882J1271K744j4841
$$ 2393 5557 -9418 6650 749 -7206 8590 -4684 -2483 8299 -8583 2688 5432 -9409
1063i409J6096o220p433J5610j3538K644J0534j6841J1335K447j4562J5879o087
$$ -9409 6687 467 -6966 8644 -4894 -2250 8284 -8557 2778 5225 -9337 6542 455
1076D55p150J5037j3097K687J0037j6254J0860K382j3874J5153n800o777J4369
$$ 455 -6695 8342 -4755 -2068 7969 -8285 2575 4957 -8917 6236 436 -6341 8028
1089H028j2568K540R624j5645J0424K471j3361J4433n511o405J3748j2316K599
$$ 8028 -4540 -2000 7624 -8021 2403 4874 -8487 5946 435 -5970 7778 -4538 -1939
1102a939R324j5252J0389K214j3082J4334n713o083J3557j2543L027R182j5353
$$ -1939 7385 -7867 2522 4736 -8346 5988 275 -5808 7749 -4794 -1767 7415 -7938
1115g938J0619J905j2859J4413o196n655J3512j2790L495Q837j5401J0923J589
$$ -7938 2681 4586 -8273 6140 -56 -5711 7801 -4989 -1494 7343 -8058 2865 4454
1128D454j2664J4270o353n262J3327j2738L500Q621j4935J0537J483j2112J3672
$$ 4454 -8210 6060 -293 -5555 7772 -4966 -1466 7155 -7780 2757 4240 -7872 5800
1141E800o110m877J2677j2337L472Q343j4484J0017J625j1618J3018n746m738
$$ 5800 -310 -5187 7490 -4847 -1375 6968 -7516 2501 4126 -7492 5526 -220 -4958
1154d958J2120j1798L350P961j4013R810J525j1235J2743n914m424J2034j1930
$$ -4958 7162 -4636 -1286 6675 -7338 2472 3997 -7238 5505 -409 -4833 7201 -4729
1167d729L492P816j3931J0004J206j1067J2833o264m067J1932j2235L945P652
$$ -4729 -1237 6579 -7352 2652 3858 -7209 5624 -640 -4707 7225 -5010 -1065 6587
1180F587j4005J0216Q51j0818J2941o610l827J1868j2212M101P386j3815J0093
$$ 6587 -7418 2798 3649 -7169 5772 -838 -4665 7203 -5009 -908 6478 -7337 2756
1193B756P89j0437J2507o514l555J1475j1820L928P092j3263R705P72j0104J2026
$$ 2756 3545 -6892 5615 -899 -4454 7021 -4799 -871 6221 -7042 2663 3435 -6669 5357
1207E357o109l554J1009j1258L614O906j2631R189O69r612J1736o129l411J0806
$$ 5357 -752 -4306 6703 -4555 -941 5965 -6666 2523 3192 -6420 5316 -813 -4224 6582
1221F582j1126L706O719j2550R238M94r418J1771o418l203J0845j1263L924O430
$$ 6582 -4544 -838 5881 -6669 2569 3063 -6355 5416 -1002 -4205 6640 -4623 -699 5731
1235E731j2465R579L1r265J1997o773k932J0822j1474M086O361j2297R467j85
$$ 5731 -6734 2845 2876 -6389 5608 -1165 -4097 6725 -4749 -663 5698 -6599 2868 2683
1249B683q945J1877o780k839J0526j1120M009O103j1913R152j52q625J1426o474
$$ 2683 -6262 5615 -1165 -4004 6522 -4598 -589 5514 -6399 2753 2601 -6024 5402 -1072
1263a072k913J0266j0555L552N948j1287Q688j23q330J1017o223k823R972j0320
$$ -1072 -3985 6281 -4274 -722 5226 -6061 2627 2504 -5826 5191 -1032 -3855 6117 -4203
1277d203L481N835j1008Q585l50q164J1084o331k748R904j0360L719N619j1016
$$ -4203 -722 5113 -5895 2690 2340 -5824 5260 -1071 -3819 6085 -4275 -556 5063 -5953
1291e953Q785o74p946J1240o789k411R973j0589L950N384j1020R047q93p891J1219
$$ -5953 2832 2158 -5788 5452 -1337 -3748 6225 -4364 -414 4970 -6050 2997 2104 -5787 5432
1306E432o766k243R679j0462L995N115j0654Q931j067p670J1045o527k372R383
$$ 5432 -1334 -3577 6102 -4360 -365 4750 -5904 3027 1960 -5710 5335 -1192 -3564 5819
1320E819r949L715M995j0211Q473r07p367J0572o269k376R118r562L565M794r928
$$ 5819 -4130 -415 4580 -5631 2842 1935 -5432 5140 -1129 -3505 5613 -3949 -384 4410 -5518
1335e518Q395r23p345J0418o198k254Q993r533L667M631r854Q594j291p239J0584
$$ -5518 2877 1954 -5391 5027 -1171 -3425 5568 -3965 -298 4333 -5521 3073 1782 -5457 5127
1350E127o446j985Q903r743M111M326r972Q898j563p141J0738o649j867Q820r651
$$ 5127 -1319 -3304 5599 -4144 -33 4293 -5679 3219 1656 -5485 5253 -1396 -3263 5557 -4094
1365d094M192L998r810Q964j652o995J0550o528j772Q586r421L993L938r448Q623
$$ -4094 98 4096 -5714 3250 1598 -5397 5153 -1375 -3147 5439 -3982 11 3949 -5499 3124
1380C124j499o818J0115o090j870Q176q990L878L829r198Q415j427o726R926o023
$$ 3124 1625 -5193 4922 -1168 -3038 5138 -3852 26 3855 -5343 3072 1645 -5081 4845 -1178
1395a178j876Q046q767L901L636r093Q478j570o616R882o233j539P974q990M289
$$ -1178 -3054 4992 -3775 126 3762 -5331 3147 1577 -5039 4843 -1390 -2929 5045 -3945 344
1410C44L385r193Q821j914o566J0024o376j303P800r067M570L146r182Q875k076
$$ 344 3729 -5464 3357 1443 -5123 4901 -1475 -2778 5022 -4045 525 3671 -5511 3364 1288
1425A288o337R975o400j214P614q880M510L019r021Q629j811o195R548o053j262
$$ 1288 -5049 4926 -1474 -2688 4926 -3954 556 3575 -5446 3183 1372 -4823 4725 -1328 -2590
1440b590P343q547M235K990q667Q323j669o112R240n796j289P088q363M224L029
$$ -2590 4753 -3794 441 3431 -5236 3087 1418 -4694 4546 -1250 -2539 4549 -3814 410 3439
1455C439q571Q181j672n976R093n859j097O939q388M566K779q667Q424j914n897
$$ 3439 -5132 3049 1377 -4599 4494 -1365 -2462 4477 -3911 655 3434 -5233 3191 1277 -4620
1470d620R193o137q24O960q546M764K590q612Q508k148n716R148o198n50O782
$$ -4620 4573 -1564 -2388 4572 -3974 790 3380 -5232 3276 1128 -4588 4560 -1638 -2188 4594
1485D594q620M823K596q541Q246j996n532Q852n892o43O515q283M572K582q304
$$ 4594 -4026 797 3393 -5148 3098 1102 -4430 4422 -1470 -2113 4402 -3881 691 3273 -5031
1500e031P913j710n412Q475n621o97O347q054M356K641q089P721j616n352Q263
$$ -5031 2882 1172 -4240 4235 -1386 -2083 4264 -3790 566 3207 -4882 2839 1223 -4129 4134
1515D134n565n44O153q059M548K526q005P806j909n183Q312n829k83O114q217
$$ 4134 -1431 -1975 4178 -3881 667 3193 -4812 2994 1085 -4098 4214 -1615 -1898 4216 -4001
1530d001M847K355q043P888k123m940Q230o029N8O026q270M950K170p951P866
$$ -4001 846 3201 -4842 3046 923 -4017 4213 -1816 -1758 4268 -4002 948 3118 -4833 3033
1545C033k170m839Q073n836Q3N853q067M687K180p654P484j993m655P797n566
$$ 3033 863 -3976 4097 -1739 -1656 4197 -3870 817 2997 -4657 2827 834 -3821 3976 -1590
1560a590l8N678p802M430K256p456P201j756m558P523n452n9N566p627M394K127
$$ -1590 -1628 4050 -3752 678 2934 -4522 2679 923 -3635 3888 -1564 -1623 3943 -3684 710 2837
1576B837p278P258j960m424P521n705J48N565p761M596J991p163P339k326m205
$$ 2837 -4441 2817 857 -3567 3954 -1751 -1603 3962 -3799 797 2788 -4375 2964 638 -3567
1591c567P554n929M47N456p804M794J798p114P323k470l996P499n960M78N425
$$ -3567 3987 -1942 -1495 3961 -3843 951 2749 -4365 2958 488 -3508 3991 -1969 -1491 3934
1606C934p596M565J720o892P065k313l866P221n667M07N286p356M243J768o623
$$ 3934 -3662 903 2623 -4269 2796 483 -3383 3838 -1829 -1422 3864 -3492 751 2519 -4104
1621d104O776k149l804P079n441J93N183p115M069J738o397O649k247l581P006
$$ -4104 2672 523 -3281 3798 -1643 -1450 3733 -3382 687 2425 -3972 2677 430 -3151 3855
1636C855n637L12N148p124M200J612o310O735k466l417O941n836O20N010p159
$$ 3855 -1782 -1470 3678 -3446 754 2366 -3944 2791 325 -3092 3849 -1987 -1367 3643 -3516
1651c516M445J356o175O813k749l287O965n877O88M951p040M378J292o049O597
$$ -3516 929 2285 -3890 2923 174 -3113 3852 -2025 -1337 3614 -3426 952 2244 -3805 2792
1666B792k692l144O819n667N82M865o768M103J274n872O356k480l158O652n353
$$ 2792 100 -3044 3775 -1892 -1310 3555 -3213 890 2164 -3708 2648 168 -2990 3662 -1691
1681a691L55M773o496L790J314n650O192k417l077O535n304L78M629o469L898
$$ -1691 -1336 3437 -3059 731 2045 -3605 2587 170 -2907 3628 -1676 -1298 3331 -3138 760
1696G60J230n559O251k576k978O545n448N09M513o433M132R69n471O415k860k843
$$ 760 1990 -3569 2682 106 -2872 3673 -1775 -1266 3247 -3186 946 1915 -3556 2859 -1 -2844
1712b844O533n567O87M436o385M165Q58n374O328k863k821O389n324O31M291o123
$$ -2844 3689 -1878 -1191 3245 -3140 1025 1883 -3491 2837 -26 -2847 3542 -1782 -1151 3140 -2983
1728b983L967Q51n237O090k680k860O290n001L42M256n833L640R01n073N861k456
$$ -2983 984 1835 -3402 2688 8 -2852 3438 -1563 -1221 3035 -2798 842 1743 -3330 2531 75
1744G5k848O120m825K95M153n745L593Q45m968N889k493k795O055m867M18L981
$$ 75 -2773 3347 -1478 -1183 2970 -2775 818 1663 -3305 2584 91 -2704 3351 -1516 -1098 2883
1760B883n727L793O46m875O016k738k650O024n008O14L830n700L985M69m826O026
$$ 2883 -2844 949 1595 -3280 2736 -2 -2652 3372 -1636 -1022 2808 -2892 1093 1562 -3264 2762
1776B762k813k585N905m896O31L738n486L830M22m705N842k678k596N745m614
$$ 2762 -51 -2636 3269 -1627 -996 2742 -2744 1086 1508 -3197 2645 -33 -2629 3116 -1498
1791a498M91L689n289L569N55m610N528k384k603N538m341M02L537n147L506N47
$$ -1498 -1007 2682 -2607 962 1517 -3093 2435 51 -2552 2986 -1355 -953 2584 -2563 943 1490
1807A490m580N488k287k590N445m308M52L414n102L586L69m448N568k474k399
$$ 1490 -3090 2398 111 -2479 2966 -1342 -890 2524 -2578 1008 1377 -3071 2497 23 -2376
1822b376N348m455P00L233n139L808K29m394N608k618k290N253m445Q15L088n018
$$ -2376 2972 -1483 -783 2450 -2689 1119 1348 -3046 2562 -56 -2346 2907 -1538 -723 2365 -2653
1838b653L815J41m276N441k526k224N069m259P58L050m850L596K66m236N155k230
$$ -2653 1162 1303 -2973 2468 -58 -2282 2787 -1472 -714 2336 -2514 1082 1348 -2888 2267 37
1854C7k254M839l958O60K952m681L419L11m147N001k127k194M725l877O73K838
$$ 37 -2217 2622 -1336 -676 2276 -2405 1014 1325 -2822 2179 52 -2142 2583 -1294 -621 2217
1870B217m636L437K39m039M965k192k012M584l982Q98K666m679L669M7l970N043
$$ 2217 -2419 1018 1257 -2782 2183 -9 -2021 2563 -1419 -521 2145 -2534 1135 1182 -2788 2255
1886B255k354j850M502m048J056K534m622L695k7l808M897k363j743M369l971
$$ 2255 -99 -1949 2553 -1495 -439 2095 -2527 1168 1141 -2667 2230 -133 -1876 2493 -1478
1901a478J042K525m527L508J46l801M638k092j800M175l694R12K476m332L290
$$ -1478 -436 2089 -2438 1070 1216 -2585 2053 -39 -1839 2336 -1358 -446 2030 -2302 988
1916I88K21l730M458j935j809M081l567Q43K439m256L200K36l642M376j961j679
$$ 988 1209 -2521 1937 2 -1807 2274 -1293 -450 1989 -2267 933 1169 -2473 1903 -58 -1737
1932a737M001l617R81K320m261L327M2l483M417k168j470L966l770J154K221m245
$$ -1737 2264 -1353 -372 1948 -2313 1014 1056 -2427 1990 -178 -1648 2318 -1452 -298 1923 -2322
1948b322L395n7l362M356k250j316L833l762J218K155m156L300k5l287M191k103
$$ -2322 1073 1016 -2346 2010 -240 -1556 2277 -1485 -267 1888 -2268 1032 1007 -2280 1911 -192
1964a92j346L713l557J050K181l971L032R1l189L984j969j347L644l443R21K226
$$ -192 -1538 2175 -1382 -332 1849 -2122 910 1001 -2188 1796 -173 -1520 2124 -1319 -398 1828
1980A828l881K879J44l074L845j955j248L558l429J001K122l830K931pk946L885
$$ 1828 -2053 826 970 -2104 1741 -214 -1462 2096 -1333 -332 1790 -2040 891 884 -2062 1823
1996A823k149j053L541l596J185K017l823L000j50k793L839k277q57L436l624
$$ 1823 -326 -1379 2162 -1434 -249 1768 -2055 945 795 -1998 1841 -436 -1293 2143 -1481
$$ [...]
8191g0
##END NTUPLES=NMR FID
##END=
