##TITLE=1H_LY-11Dix.3.B
 CD3CN, 8 sc, 
 3.06.2021
##JCAMPDX= 6.0         $$ Bruker NMR JCAMP-DX V2.0
##DATA TYPE= NMR FID
##DATA CLASS= NTUPLES
##ORIGIN= UXNMR, Bruker Analytische Messtechnik GmbH
##OWNER= root
$$ XWIN-NMR		Version 3.5
$$ Thu Jun  3 11:05:09 2021 Russian Standard Time (UT+4h)  she@DPX200
##.OBSERVE FREQUENCY= 200.131506
##.OBSERVE NUCLEUS= ^1H
##.DELAY= (6, 6)
##.ACQUISITION MODE= SIMULTANEOUS
##.ACQUISITION SCHEME= undefined
##.AVERAGES= 8
##.DIGITISER RES= 18
##SPECTROMETER/DATA SYSTEM= spect
##.PULSE SEQUENCE= zg30
##.SOLVENT NAME= CD3CN
##.SHIFT REFERENCE= (INTERNAL, CD3CN, 0, 15.7039)
##AUDIT TRAIL= $$ (NUMBER, WHEN, WHO, WHERE, WHAT)
$$ ##TITLE= Audit trail, XWIN-NMR		Version 3.5
$$ ##JCAMPDX= 5.01
$$ ##ORIGIN= Bruker BioSpin GmbH
$$ ##OWNER= she
$$ F:/spectra/data/she/nmr/H-F/1/audita.txt
$$ ##AUDIT TRAIL=  $$ (NUMBER, WHEN, WHO, WHERE, WHAT)
(   1,<2021-06-03 11:03:33.79 +0400>,<she>,<DPX200>,
      <created by zg, POWCHK disabled, PULCHK disabled
       configuration hash MD5:
       00 E9 B6 7A A2 85 ED C7 34 08 36 98 17 FE 4E 26
       data hash MD5: 16K
       15 88 21 72 95 0D 4A 29 E3 D1 DF 6D 76 73 54 BE>)
$$ ##END=
$$ 
$$ hash MD5
$$ 5B 4E 91 12 09 7C AA 8D 39 4D D2 78 F7 23 C6 9D
##$RELAX= 
##$RELAX= 
##$RELAX= 
##$RELAX= 
##$RELAX= 
##$RELAX= 
$$ Bruker specific parameters
$$ --------------------------
##$DU= <F:/spectra>
##$EXPNO= 1
##$NAME= <H-F>
##$PROCNO= 1
##$TYPE= <nmr>
##$USER= <she>
##$AMP= (0..31)
100 100 100 100 100 100 100 100 100 100 100 100 100 100 100 100 100 100 
100 100 100 100 100 100 100 100 100 100 100 100 100 100 
##$AQSEQ= 0
##$AQ_mod= 1
##$AUNM= <au_zg>
##$AUTOPOS= <>
##$BF1= 200.13
##$BF2= 200.13
##$BF3= 200.13
##$BF4= 200.13
##$BF5= 200.13
##$BF6= 200.13
##$BF7= 200.13
##$BF8= 200.13
##$BYTORDA= 1
##$CFDGTYP= 0
##$CFRGTYP= 5
##$CHEMSTR= <none>
##$CNST= (0..31)
1 1 145 1 1 1 1 1 1 1 1 1 1 1 1 1 1 1 1 1 1 1 1 1 1 1 1 1 1 1 1 1 
##$CPDPRG= <>
##$CPDPRG1= <>
##$CPDPRG2= <>
##$CPDPRG3= <>
##$CPDPRG4= <mlev>
##$CPDPRG5= <mlev>
##$CPDPRG6= <mlev>
##$CPDPRG7= <mlev>
##$CPDPRG8= <mlev>
##$CPDPRGB= <>
##$CPDPRGT= <>
##$D= (0..31)
0 1.2 0 0 0 0 0 0 0 0.06 0 0.03 0 0 0 0 0.0002 0 0 0 0 0 0 0 0 0 0 0 0 
0 0 0 
##$DATE= 1622703813
##$DBL= (0..7)
120 120 120 120 120 120 120 120 
##$DBP= (0..7)
150 150 150 150 150 150 150 150 
##$DBP07= 0
##$DBPNAM0= <>
##$DBPNAM1= <>
##$DBPNAM2= <>
##$DBPNAM3= <>
##$DBPNAM4= <>
##$DBPNAM5= <>
##$DBPNAM6= <>
##$DBPNAM7= <>
##$DBPOAL= (0..7)
0.5 0.5 0.5 0.5 0.5 0.5 0.5 0.5 
##$DBPOFFS= (0..7)
0 0 0 0 0 0 0 0 
##$DE= 6
##$DECBNUC= <off>
##$DECIM= 32
##$DECNUC= <off>
##$DECSTAT= 4
##$DIGMOD= 1
##$DIGTYP= 9
##$DL= (0..7)
0 120 120 120 120 120 120 120 
##$DP= (0..7)
150 150 150 150 150 150 150 150 
##$DP07= 0
##$DPNAME0= <>
##$DPNAME1= <>
##$DPNAME2= <>
##$DPNAME3= <>
##$DPNAME4= <>
##$DPNAME5= <>
##$DPNAME6= <>
##$DPNAME7= <>
##$DPOAL= (0..7)
0.5 0.5 0.5 0.5 0.5 0.5 0.5 0.5 
##$DPOFFS= (0..7)
0 0 0 0 0 0 0 0 
##$DQDMODE= 0
##$DR= 18
##$DS= 0
##$DSLIST= <SSSSSSSSSSSSSSS>
$$ [...]
##$SUBNAM2= <"">
##$SUBNAM3= <"">
##$SUBNAM4= <"">
##$SUBNAM5= <"">
##$SUBNAM6= <"">
##$SUBNAM7= <"">
##$SUBNAM8= <"">
##$SUBNAM9= <"">
##$SW= 20.0188882624521
##$SWIBOX= (0..15)
0 0 2 0 0 0 0 0 0 0 0 0 0 0 0 0 
##$SW_h= 4006.41025641026
##$TD= 16384
##$TD0= 1
##$TE= 0
##$TE2= 300
##$TE3= 300
##$TEG= 300
##$TL= (0..7)
0 120 120 120 120 120 120 120 
##$TP= (0..7)
150 150 150 150 150 150 150 150 
##$TP07= 0
##$TPNAME0= <>
##$TPNAME1= <>
##$TPNAME2= <>
##$TPNAME3= <>
##$TPNAME4= <>
##$TPNAME5= <>
##$TPNAME6= <>
##$TPNAME7= <>
##$TPOAL= (0..7)
0.5 0.5 0.5 0.5 0.5 0.5 0.5 0.5 
##$TPOFFS= (0..7)
0 0 0 0 0 0 0 0 
##$TUNHIN= 0
##$TUNHOUT= 0
##$TUNXOUT= 0
##$USERA1= <user>
##$USERA2= <user>
##$USERA3= <user>
##$USERA4= <user>
##$USERA5= <user>
##$V9= 5
##$VALIST= <valist>
##$VCLIST= <CCCCCCCCCCCCCCC>
##$VD= 0
##$VDLIST= <DDDDDDDDDDDDDDD>
##$VPLIST= <PPPPPPPPPPPPPPP>
##$VTLIST= <TTTTTTTTTTTTTTT>
##$WBST= 1024
##$WBSW= 4
##$XGAIN= (0..3)
0 0 0 0 
##$XL= 0
##$YL= 0
##$YMAX_a= 101422
##$YMIN_a= -102978
##$ZGOPTNS= <>
##$ZL1= 120
##$ZL2= 120
##$ZL3= 120
##$ZL4= 120
##$ABSF1= 10
##$ABSF2= 0
##$ABSG= 5
##$ABSL= 3
##$ALPHA= 0
##$AQORDER= 0
##$ASSFAC= 0
##$ASSFACI= 0
##$ASSFACX= 0
##$ASSWID= 0
##$AUNMP= <proc_1d>
##$AZFE= 0.1
##$AZFW= 0.1
##$BCFW= 1
##$BC_mod= 2
##$BYTORDP= 1
##$COROFFS= 0
##$CY= 11.3945322036743
##$DATMOD= 1
##$DC= 2
##$DFILT= <>
##$DTYPP= 0
##$F1P= 15.9154993809931
##$F2P= -4.1035820241983
##$FCOR= 0.5
##$FTSIZE= 0
##$FT_mod= 4
##$GAMMA= 1
##$GB= 0.15
##$INTBC= 1
##$INTSCL= 1
##$ISEN= 128
##$LB= 0.24
##$LEV0= 0
##$LPBIN= 0
##$MAXI= 10000
##$MC2= 0
##$MEAN= 0
##$ME_mod= 0
##$MI= 1.114404
##$NCOEF= 0
##$NC_proc= 0
##$NLEV= 6
##$NOISF1= 3.799351
##$NOISF2= 2.8
##$NSP= 1
##$NTH_PI= 0
##$NZP= 0
##$OFFSET= 15.70392
##$PC= 1
##$PHC0= -11560.17
##$PHC1= 12.20099
##$PH_mod= 1
##$PKNL= yes
##$PPARMOD= 0
##$PSCAL= 0
##$PSIGN= 0
##$REVERSE= no
##$SF= 200.130013532006
##$SI= 16384
##$SIGF1= 3
##$SIGF2= 2
##$SINO= 400
##$SIOLD= 16384
##$SREGLST= <1H.CDCl3>
##$SSB= 0
##$STSI= 0
##$STSR= 0
##$SW_p= 3612.71676300578
##$SYMM= 0
##$S_DEV= 0
##$TDeff= 0
##$TDoff= 0
##$TI= <>
##$TILT= no
##$TM1= 0
##$TM2= 0
##$TOPLEV= 0
##$USERP1= <user>
##$USERP2= <user>
##$USERP3= <user>
##$USERP4= <user>
##$USERP5= <user>
##$WDW= 1
##$XDIM= 8192
##$YMAX_p= 0
##$YMIN_p= 0
$$ End of Bruker specific parameters
$$ ---------------------------------
##NTUPLES= NMR FID
##VAR_NAME=  TIME,          FID/REAL,        FID/IMAG
##SYMBOL=    X,             R,               I
##VAR_TYPE=  INDEPENDENT,   DEPENDENT,       DEPENDENT
##VAR_FORM=  AFFN,          ASDF,            ASDF
##VAR_DIM=   8192,          8192,            8192
##UNITS=     SECONDS,       ARBITRARY UNITS, ARBITRARY UNITS
##FACTOR=    0.0002496,     1,               1
##FIRST=     0,             0,               0
##LAST=      2.0444736,     0,               0
##MIN=       0,             -102978,         0
##MAX=       2.0444736,     101422,          0
$$ Real data points
##PAGE= N=1
##DATA TABLE= (X++(R..R)), XYDATA
0 0 0 0 0 0 0 0 0 0 0 0 0 0 0 0 -8 8 -8 8 -8 16 -16 16 -24 24 -32 34 -41 48 -56 65 -73 84 -97 108 -122 138
36 138 -155 175 -195 219 -243 270 -301 334 -369 408 -451 496 -548 602 -665 731 -807 890 -980
55 -980 1085 -1201 1333 -1486 1665 -1876 2129 -2442 2836 -3352 4061 -5095 6771 -10054 29064
70 29064 -79954 15496 65064 -102978 73560 -953 -68206 90319 -49374 -26200 85599
81 85599 -85949 28152 43750 -84533 69381 -8747 -59148 92166 -61803 -14495 81267
92 81267 -89556 32603 44973 -89302 72652 -6925 -61335 88294 -54643 -18963 77447
103 77447 -80119 28283 39388 -77140 65242 -11373 -50530 80293 -57305 -7844 68756
114 68756 -80940 37228 32307 -78087 70955 -16560 -50994 84054 -58243 -9773 70367
125 70367 -78520 33019 32637 -73752 63868 -13943 -44733 74294 -53484 -3931 59066
136 59066 -72342 36637 22000 -66402 66038 -21387 -38833 74470 -57124 -1112 58125
147 58125 -73475 36392 23446 -65338 62544 -17727 -37853 68382 -51278 -1363 50717
158 50717 -65147 35644 16726 -56848 60156 -23032 -30490 64744 -54781 4836 47912
169 47912 -66640 39623 14684 -57680 61631 -23608 -31576 64268 -52352 3886 46133
180 46133 -62626 37031 12706 -52454 56967 -24658 -25526 58757 -51360 9042 39649 -60548
192 -60548 40420 6989 -50145 58535 -27333 -23388 58580 -51713 9160 38968 -58916 37824
204 37824 7367 -46841 54239 -24933 -20651 52281 -47587 10922 32273 -53980 38518 2431
216 2431 -41527 53540 -28614 -16532 50857 -49732 13483 31205 -54388 39745 2374 -41525
228 -41525 52356 -27324 -16312 47876 -47082 13880 28137 -50451 39065 -1106 -37309 50630
240 50630 -29773 -12131 45179 -47656 17787 24992 -50267 40996 -3444 -36374 50729 -30412
252 -30412 -11123 44309 -46182 17319 23237 -47490 38761 -4351 -32986 47027 -29147 -7738
264 -7738 39379 -44221 19384 18804 -44673 39529 -7452 -30054 46913 -30784 -5933 38275 -44544
277 -44544 20208 17930 -44098 39124 -7217 -28803 44882 -29846 -4742 35212 -42488 21160
289 21160 14614 -41059 39622 -10314 -25853 44105 -32103 -1706 33866 -43632 23519 13423
301 13423 -40995 40340 -11265 -25322 43363 -31581 -1061 31960 -41517 23526 11190 -38228
313 -38228 38752 -12540 -22194 40728 -31576 1628 29207 -40465 24743 8586 -36667 38857
325 38857 -13891 -20609 39754 -31371 2707 27695 -39584 24491 7662 -34959 37534 -13928
337 -13928 -18706 37617 -30549 4090 24825 -38058 25552 5048 -32939 37879 -15983 -16473 37070
350 37070 -32154 5950 24067 -38525 26631 4263 -32492 37839 -16258 -15696 35554 -31509
362 -31509 6961 22068 -36937 26826 2376 -30089 36799 -17677 -13227 33851 -31681 8835
374 8835 20125 -36186 27543 1047 -29074 36014 -17683 -12075 32241 -30624 9257 18503 -34269
387 -34269 26788 -231 -26924 34561 -17865 -10167 30115 -30004 10658 16390 -33224 27259
399 27259 -1810 -25334 34287 -18947 -8566 29356 -30457 11744 15315 -32982 27777 -2527
411 -2527 -24552 33686 -19108 -7372 27868 -30004 12672 13522 -31547 28068 -4324 -22704 33151
424 33151 -20156 -5654 26570 -30133 13880 12339 -30902 28030 -4917 -21612 32057 -19836
436 -19836 -4866 24997 -28661 13876 10679 -28848 27212 -5882 -19584 30434 -19974 -3100
448 -3100 23321 -28215 14637 9333 -27757 27106 -6803 -18379 29776 -20192 -2135 22221
460 22221 -27856 15194 8287 -26897 26963 -7638 -17028 29023 -20725 -815 21098 -27621
472 -27621 16085 6845 -25937 27190 -8892 -15596 28398 -21495 674 20148 -27631 16776
484 16776 5899 -25124 26935 -9412 -14519 27363 -21104 1431 18649 -26438 16736 4620
496 4620 -23371 25940 -10124 -12589 25950 -21228 2688 17369 -25865 17050 3670 -22442
508 -22442 25457 -10338 -11570 24836 -21007 3425 16181 -25175 17202 2696 -21193 25092
520 25092 -11157 -10207 24011 -21440 4651 15084 -25040 18055 1651 -20494 25150 -12092
532 -12092 -9108 23478 -21900 5665 14280 -24667 18548 688 -19655 24808 -12668 -7992 22549
545 22549 -21773 6484 13201 -23832 18440 -266 -18275 23950 -13075 -6614 21374 -21486
557 -21486 7301 11979 -23172 18402 -963 -17347 23244 -13079 -5697 20376 -20991 7586
569 7586 10855 -22117 18228 -1891 -15961 22721 -13702 -4372 19477 -21331 8563 9935 -21872
582 -21872 18757 -2683 -15139 22671 -14438 -3475 18841 -21530 9358 9048 -21311 19100
594 19100 -3608 -14106 22225 -15180 -2336 18078 -21538 10140 8183 -20581 19061 -4440
606 -4440 -13121 21442 -15405 -1324 17055 -21064 10579 7234 -19685 18632 -4991 -12069 20636
619 20636 -15285 -493 16146 -20388 10633 6314 -18728 18065 -5535 -10807 19922 -15460
631 -15460 523 15224 -20308 11215 5439 -18233 18362 -6198 -9966 19691 -15923 1250
643 1250 14556 -20338 11674 4615 -17509 18438 -7004 -8828 19201 -16597 2263 13747 -20382
656 -20382 12411 3877 -16902 18448 -7583 -8090 18488 -16677 2907 12908 -19661 12602 3117
669 3117 -15899 17908 -8087 -7193 17620 -16467 3517 12119 -18890 12502 2382 -14963 17192
682 17192 -8414 -6178 16826 -16202 4241 11233 -18400 12623 1559 -14259 16977 -8850
694 -8850 -5266 16407 -16333 4866 10467 -18202 12849 744 -13472 16939 -9426 -4219 15838
707 15838 -16721 5674 9525 -18053 13422 -37 -12771 17040 -9970 -3575 15304 -16772
719 -16772 6060 8792 -17313 13433 -645 -11702 16436 -10374 -2758 14388 -16513 6512
731 6512 8109 -16489 13292 -1125 -10923 15683 -10448 -2156 13576 -15946 6823 7375 -15666
744 -15666 13049 -1817 -10164 15187 -10681 -1382 13090 -15747 7261 6681 -15297 12975 -2518
757 -2518 -9417 14962 -11013 -531 12535 -15821 7805 5767 -14953 13305 -3231 -8619 14964
770 14964 -11413 192 12024 -15886 8029 5107 -14335 13282 -3694 -7754 14483 -11643
782 -11643 760 11184 -15608 8376 4484 -13584 13146 -4025 -7087 13820 -11609 1072
794 1072 10462 -14937 8402 3960 -12698 12697 -4400 -6388 13056 -11613 1690 9839 -14531
807 -14531 8721 3336 -12219 12559 -4927 -5868 12722 -11648 2345 9273 -14253 9104 2485
820 2485 -11782 12648 -5652 -5085 12640 -11949 3017 8767 -14215 9355 1747 -11294 12657
833 12657 -6013 -4316 12215 -11990 3535 7951 -13896 9519 1073 -10560 12572 -6251 -3773
846 -3773 11664 -11805 3637 7246 -13221 9408 720 -9724 12104 -6369 -3263 10907 -11593
859 -11593 3871 6599 -12553 9534 173 -9146 11852 -6714 -2862 10483 -11481 4263 6170
872 6170 -12058 9620 -504 -8570 11687 -7283 -2178 10205 -11560 4908 5583 -11888 9912
885 9912 -1191 -8153 11630 -7618 -1537 9883 -11450 5248 4845 -11466 9930 -1880 -7491
898 -7491 11490 -7776 -982 9397 -11278 5324 4278 -10918 9691 -2132 -6743 11029 -7694
911 -7694 -621 8657 -10889 5385 3634 -10225 9613 -2416 -6119 10631 -7810 -300 8168
924 8168 -10631 5507 3208 -9612 9592 -2844 -5610 10265 -8078 245 7673 -10518 6048
937 6048 2667 -9274 9747 -3496 -5202 10138 -8384 732 7337 -10292 6370 2021 -8920
950 -8920 9711 -3995 -4640 9867 -8448 1248 6893 -10044 6444 1477 -8459 9504 -4173
963 -4173 -4167 9486 -8128 1455 6291 -9561 6290 996 -7791 9241 -4298 -3577 9096 -8051
977 -8051 1604 5787 -9206 6268 682 -7288 9066 -4389 -3150 8602 -8080 1923 5235
990 5235 -8897 6559 130 -6845 9170 -4903 -2808 8381 -8227 2313 4862 -8663 6843
1003 6843 -342 -6435 9027 -5346 -2296 8088 -8267 2736 4411 -8332 6974 -862 -6084
1016 -6084 8827 -5479 -1900 7743 -7999 2910 3991 -7890 6726 -1191 -5560 8475 -5438
1029 -5438 -1496 7294 -7691 2998 3509 -7540 6613 -1373 -5130 8222 -5404 -1188 6901 -7493
1043 -7493 3046 2976 -7134 6695 -1772 -4703 8125 -5650 -772 6570 -7622 3378 2645 -6888
1057 -6888 6862 -2144 -4298 8010 -5941 -412 6163 -7527 3803 2152 -6627 7038 -2525
1070 -2525 -3935 7803 -6123 -96 5920 -7319 3902 1819 -6250 6856 -2732 -3591 7396 -5960
1084 -5960 231 5474 -6986 3957 1465 -5906 6616 -2881 -3286 7136 -5790 362 5066 -6662
1098 -6662 3959 1066 -5578 6491 -3048 -2823 6893 -5895 706 4729 -6602 4179 647 -5328
1112 -5328 6658 -3303 -2525 6725 -6001 1051 4321 -6528 4476 262 -4990 6705 -3699 -2125
1126 -2125 6565 -6165 1335 3972 -6351 4675 -18 -4742 6566 -3770 -1842 6157 -6014
1139 -6014 1515 3582 -5963 4641 -357 -4392 6373 -3857 -1643 5882 -5764 1616 3297 -5672
1153 -5672 4505 -531 -4040 6080 -3923 -1302 5613 -5669 1841 2893 -5507 4692 -845 -3826
1167 -3826 6056 -4065 -956 5387 -5727 2109 2555 -5348 4823 -1231 -3478 6062 -4320 -603
1181 -603 5113 -5779 2455 2195 -5263 4967 -1453 -3207 5912 -4446 -360 4828 -5624 2558
1195 2558 1846 -4927 4918 -1643 -2887 5618 -4419 -110 4494 -5459 2628 1660 -4671 4730 -1706
1210 -1706 -2638 5333 -4277 73 4093 -5203 2798 1308 -4447 4729 -1892 -2339 5197 -4384 337
1225 337 3878 -5135 2987 981 -4278 4811 -2134 -2057 4989 -4515 747 3511 -5165 3295 619 -4109
1241 -4109 4916 -2443 -1825 4909 -4555 959 3183 -4998 3457 355 -3869 4781 -2540 -1497 4622
1256 4622 -4506 1148 2885 -4788 3471 137 -3653 4659 -2501 -1348 4314 -4282 1281 2571 -4531
1271 -4531 3448 -84 -3346 4518 -2623 -1093 4116 -4237 1457 2249 -4445 3586 -298 -3190 4468
1286 4468 -2759 -824 3908 -4304 1693 1914 -4310 3797 -676 -2956 4539 -3006 -560 3722 -4362
1301 -4362 1985 1694 -4227 3881 -845 -2699 4394 -3113 -310 3462 -4247 2189 1368 -4027 3932
1316 3932 -1009 -2539 4214 -3059 -152 3218 -4046 2201 1166 -3766 3789 -1157 -2296 4031 -3024
1331 -3024 43 2957 -3953 2341 923 -3664 3781 -1294 -2078 3934 -3098 233 2740 -3911 2508
1346 2508 600 -3511 3920 -1525 -1823 3865 -3280 559 2519 -3983 2765 372 -3388 4026 -1727
1361 -1727 -1632 3751 -3319 757 2214 -3862 2966 136 -3204 4001 -1880 -1405 3599 -3337 866 2037
1377 2037 -3682 2955 -13 -3012 3843 -1892 -1265 3315 -3207 1032 1816 -3539 2979 -206 -2845
1392 -2845 3759 -2013 -1101 3223 -3161 1170 1604 -3441 3064 -419 -2660 3718 -2181 -776 3116
1407 3116 -3261 1445 1338 -3428 3259 -703 -2535 3827 -2314 -557 2951 -3323 1662 1081 -3352
1422 -3352 3353 -898 -2254 3772 -2472 -363 2780 -3306 1760 869 -3208 3384 -961 -2084 3574
1437 3574 -2474 -242 2529 -3203 1824 711 -2975 3331 -1099 -1927 3423 -2501 -87 2356 -3098
1452 -3098 1969 586 -2858 3282 -1240 -1742 3316 -2566 146 2178 -3048 2194 281 -2800 3395
1467 3395 -1487 -1539 3301 -2705 422 2042 -3086 2316 42 -2677 3423 -1686 -1287 3211 -2775 673
1483 673 1781 -3114 2461 -137 -2532 3385 -1732 -1067 3055 -2764 735 1548 -2941 2460 -273 -2310
1499 -2310 3307 -1749 -903 2827 -2724 850 1385 -2836 2496 -353 -2139 3222 -1850 -785 2658
1514 2658 -2685 1031 1198 -2705 2638 -562 -1997 3176 -2070 -548 2571 -2788 1253 1032 -2684
1529 -2684 2750 -799 -1887 3144 -2203 -291 2422 -2810 1494 796 -2655 2802 -1021 -1709 3133
1544 3133 -2272 -113 2314 -2759 1563 603 -2540 2769 -1074 -1482 2979 -2249 67 2097 -2716
1559 -2716 1601 422 -2376 2764 -1118 -1325 2876 -2237 148 1905 -2655 1659 311 -2210 2738
1574 2738 -1257 -1117 2764 -2410 324 1747 -2673 1878 163 -2153 2803 -1431 -982 2654 -2536
1589 -2536 572 1610 -2652 2069 -58 -2048 2837 -1633 -792 2587 -2576 808 1465 -2635 2159
1604 2159 -183 -1950 2735 -1702 -600 2461 -2519 927 1289 -2533 2158 -335 -1825 2667 -1692
1619 -1692 -444 2327 -2486 1002 1149 -2483 2116 -414 -1648 2596 -1706 -258 2146 -2525 1140
1634 1140 930 -2467 2247 -519 -1515 2628 -1843 -129 2008 -2595 1348 774 -2356 2410 -680 -1372
1650 -1372 2585 -2031 67 1907 -2652 1517 648 -2332 2478 -855 -1286 2520 -2088 190 1794
1665 1794 -2573 1640 495 -2232 2427 -948 -1166 2372 -2083 342 1685 -2497 1649 377 -2154
1680 -2154 2353 -996 -1041 2280 -2020 472 1515 -2453 1718 212 -2071 2378 -1099 -859 2286 -2105
1696 -2105 601 1384 -2482 1837 80 -1985 2449 -1212 -687 2203 -2236 797 1214 -2512 2018 -90
1712 -90 -1883 2528 -1363 -568 2103 -2309 915 1088 -2449 2103 -190 -1752 2436 -1467 -442 1964
1728 1964 -2287 1041 963 -2363 2124 -283 -1683 2346 -1461 -347 1838 -2196 1132 832 -2247 2121
1744 2121 -420 -1559 2299 -1517 -173 1776 -2206 1271 700 -2249 2180 -537 -1435 2300 -1617
1759 -1617 0 1683 -2273 1418 519 -2229 2301 -709 -1301 2332 -1749 143 1566 -2372 1538
1774 1538 385 -2169 2350 -800 -1176 2264 -1808 261 1411 -2304 1633 253 -2059 2364 -897
1789 -897 -1058 2179 -1806 336 1306 -2204 1688 213 -1892 2286 -946 -937 2050 -1837 458 1180 -2198
1806 -2198 1750 94 -1893 2293 -1058 -725 1945 -1860 652 1039 -2200 1853 -67 -1802 2327
1821 2327 -1230 -655 1994 -1995 797 984 -2216 1947 -256 -1714 2370 -1317 -514 1904 -2020 913
1837 913 839 -2171 2000 -366 -1573 2346 -1384 -389 1821 -2030 975 752 -2094 2016 -395 -1466
1853 -1466 2261 -1388 -287 1683 -2012 1048 651 -2027 2033 -498 -1373 2211 -1476 -202 1622
1868 1622 -2021 1145 557 -1981 2056 -621 -1287 2181 -1582 -38 1556 -2072 1311 428 -1964 2170
1884 2170 -774 -1183 2212 -1675 106 1482 -2089 1406 295 -1910 2186 -877 -1041 2168 -1730
1899 -1730 236 1396 -2096 1461 218 -1856 2165 -902 -950 2082 -1719 299 1282 -2056 1487 127
1915 127 -1749 2148 -949 -855 2003 -1763 373 1191 -2040 1526 68 -1687 2134 -1049 -768 1952
1931 1952 -1818 509 1112 -2033 1649 -70 -1611 2192 -1204 -628 1956 -1913 654 1052 -2048 1730
1947 1730 -184 -1534 2190 -1304 -480 1885 -1967 774 937 -2048 1797 -280 -1479 2182 -1344
1962 -1344 -400 1818 -1960 817 865 -1987 1753 -343 -1372 2105 -1377 -302 1741 -1987 877 789
1978 789 -1949 1777 -374 -1289 2077 -1420 -203 1669 -2002 971 703 -1904 1844 -506 -1191 2085
1994 2085 -1538 -44 1620 -2079 1111 609 -1912 1918 -609 -1101 2066 -1633 91 1535 -2124
2009 -2124 1244 489 -1892 1961 -724 -1006 2038 -1703 183 1470 -2124 1291 434 -1822 1930 -752
2025 -752 -913 1968 -1713 273 1373 -2099 1325 361 -1757 1924 -807 -834 1922 -1730 341 1319
2041 1319 -2078 1384 281 -1684 1943 -892 -706 1874 -1818 499 1230 -2113 1508 159 -1657
2056 -1657 1986 -1018 -614 1843 -1887 629 1116 -2121 1596 15 -1595 2012 -1162 -481 1816 -1955
2072 -1955 739 1057 -2118 1630 -51 -1512 1996 -1160 -385 1742 -1956 801 973 -2064 1649 -107
2088 -107 -1422 1971 -1203 -323 1676 -1955 855 917 -2028 1672 -155 -1349 1926 -1261 -222 1605
2104 1605 -1986 962 804 -2020 1754 -289 -1298 1949 -1367 -98 1543 -2051 1091 718 -1994
2119 -1994 1810 -431 -1175 1937 -1479 53 1482 -2089 1223 611 -1976 1862 -497 -1106 1925 -1512
2135 -1512 147 1427 -2079 1237 523 -1901 1864 -551 -1011 1892 -1520 219 1351 -2068 1276
2150 1276 474 -1861 1853 -586 -944 1829 -1546 276 1260 -2048 1336 365 -1779 1894 -697 -856
2166 -856 1805 -1652 374 1212 -2067 1426 279 -1714 1925 -819 -751 1770 -1713 528 1145 -2077
2182 -2077 1538 168 -1678 1957 -928 -651 1762 -1777 608 1080 -2046 1573 81 -1606 1929
2197 1929 -985 -556 1708 -1771 674 1012 -2043 1563 7 -1547 1929 -995 -511 1658 -1762 692
2213 692 926 -1997 1562 -54 -1464 1912 -1070 -396 1627 -1837 770 875 -1980 1642 -141 -1389
2229 -1389 1930 -1164 -283 1556 -1891 916 769 -1941 1748 -274 -1285 1937 -1295 -187 1513
2244 1513 -1930 1015 704 -1905 1766 -372 -1240 1891 -1347 -92 1464 -1913 1046 620 -1869 1750
2260 1750 -432 -1185 1870 -1344 -25 1436 -1897 1051 572 -1817 1723 -474 -1081 1850 -1372 54
2276 54 1356 -1917 1120 484 -1787 1771 -530 -991 1848 -1443 148 1292 -1922 1197 356 -1700
2292 -1700 1859 -676 -882 1833 -1569 263 1218 -1958 1295 280 -1639 1884 -782 -813 1776 -1629
2308 -1629 342 1153 -1912 1369 198 -1582 1861 -860 -745 1756 -1630 395 1138 -1880 1345 140
2324 140 -1540 1825 -875 -670 1722 -1608 468 1087 -1851 1365 66 -1479 1844 -941 -579 1718
2340 1718 -1644 518 1006 -1848 1417 -50 -1389 1853 -1050 -431 1666 -1745 626 887 -1842 1492
2356 1492 -170 -1292 1890 -1151 -350 1610 -1795 701 815 -1792 1536 -230 -1202 1864 -1241 -269
2372 -269 1565 -1804 753 785 -1732 1556 -275 -1160 1818 -1256 -216 1527 -1759 803 738 -1672
2388 -1672 1537 -366 -1098 1806 -1304 -138 1489 -1783 850 655 -1658 1547 -449 -1004 1783 -1367
2404 -1367 -15 1439 -1811 924 534 -1627 1609 -564 -898 1795 -1437 97 1365 -1849 985
2419 985 440 -1557 1641 -631 -799 1774 -1489 168 1286 -1830 1055 391 -1494 1648 -672 -748
2435 -748 1726 -1509 174 1268 -1771 1042 346 -1433 1618 -723 -694 1673 -1546 243 1234 -1769
2451 -1769 1073 305 -1399 1586 -804 -634 1650 -1556 323 1147 -1746 1126 170 -1335 1617 -907
2467 -907 -493 1644 -1633 442 1082 -1743 1189 55 -1266 1643 -964 -384 1586 -1648 509 995
2483 995 -1727 1228 -18 -1195 1662 -1008 -341 1553 -1668 520 941 -1687 1233 -31 -1125 1614
2499 1614 -1044 -292 1485 -1681 538 901 -1634 1255 -82 -1099 1588 -1080 -273 1460 -1662 606
2515 606 853 -1596 1272 -166 -1021 1559 -1161 -148 1419 -1663 728 748 -1575 1332 -269 -959
2531 -959 1577 -1194 -35 1359 -1681 777 622 -1527 1359 -389 -873 1577 -1248 25 1304 -1699
2547 -1699 801 582 -1507 1349 -395 -812 1541 -1253 45 1263 -1667 815 517 -1448 1376 -406
2563 -406 -775 1517 -1263 60 1221 -1631 829 492 -1389 1384 -480 -718 1486 -1315 148 1151
2579 1151 -1625 946 382 -1342 1424 -604 -640 1472 -1363 230 1095 -1593 970 246 -1289 1414
2595 1414 -685 -545 1418 -1409 336 1023 -1604 1023 168 -1250 1421 -711 -497 1416 -1374 345
2611 345 958 -1552 1036 126 -1188 1423 -732 -443 1401 -1401 355 913 -1522 1041 104 -1158
2627 -1158 1421 -750 -401 1339 -1402 415 851 -1495 1090 4 -1077 1430 -850 -341 1300 -1418
2643 -1418 496 751 -1460 1147 -92 -1012 1394 -931 -233 1249 -1433 577 663 -1413 1192 -174
2659 -174 -969 1429 -953 -178 1210 -1411 618 611 -1376 1183 -212 -908 1401 -959 -142 1193 -1388
2676 -1388 633 565 -1359 1198 -219 -871 1375 -964 -113 1144 -1365 639 484 -1304 1214 -309
2692 -309 -805 1366 -1017 -50 1071 -1391 707 409 -1265 1238 -378 -731 1341 -1059 31 982
2708 982 -1348 805 307 -1210 1292 -465 -660 1324 -1087 91 965 -1330 816 243 -1154 1275
2724 1275 -507 -622 1288 -1079 130 895 -1294 850 198 -1135 1273 -518 -597 1293 -1069 117
2740 117 853 -1263 837 152 -1102 1277 -559 -551 1247 -1090 175 802 -1244 872 79 -1035 1291
2757 1291 -619 -468 1218 -1079 258 717 -1211 956 -9 -952 1301 -704 -382 1188 -1127 316
2773 316 645 -1187 984 -70 -924 1266 -714 -339 1137 -1122 360 592 -1149 968 -128 -878
2789 -878 1277 -745 -334 1112 -1106 357 552 -1141 974 -132 -848 1248 -754 -291 1081 -1089
2805 -1089 397 510 -1111 1004 -209 -805 1259 -772 -225 1035 -1086 461 431 -1063 1029 -286
2821 -286 -715 1227 -851 -148 958 -1090 540 345 -1041 1064 -350 -676 1211 -881 -104 912
2837 912 -1077 557 275 -993 1070 -386 -631 1198 -881 -58 889 -1084 569 274 -977 1063
2853 1063 -394 -607 1181 -866 -48 850 -1035 602 210 -935 1078 -434 -553 1164 -893 1
2869 1 813 -1022 635 163 -886 1074 -493 -484 1122 -918 79 730 -1020 695 75 -836 1072 -556
2887 -556 -433 1093 -941 144 660 -991 729 4 -801 1068 -607 -358 1050 -953 192 609 -985
2904 -985 744 -30 -783 1092 -582 -352 1045 -913 204 588 -947 743 -63 -732 1071 -622 -304
2921 -304 1011 -950 227 549 -968 758 -85 -689 1031 -658 -259 937 -935 308 464 -934
2937 -934 815 -192 -649 1084 -711 -207 855 -965 400 380 -889 815 -208 -553 1017 -719
2953 -719 -132 768 -929 436 360 -871 899 -224 -555 1006 -689 -82 813 -941 438 321 -877
2970 -877 833 -273 -531 1012 -711 -42 780 -954 457 270 -853 887 -260 -501 951 -742
2986 -742 -24 702 -915 453 196 -843 896 -344 -422 955 -752 98 610 -959 575 125 -805
3003 -805 880 -369 -411 863 -813 102 608 -898 617 67 -703 900 -421 -348 871 -801 137
3020 137 576 -868 605 83 -718 859 -437 -330 844 -785 168 544 -870 606 53 -714 861
3037 861 -450 -317 842 -765 190 500 -856 623 0 -670 840 -467 -238 798 -777 256 450
3054 450 -850 667 -37 -618 861 -492 -180 746 -788 310 381 -833 694 -88 -564 838 -539
3071 -539 -126 693 -808 335 349 -822 715 -101 -566 827 -540 -123 653 -794 369 325 -795 719
3089 719 -123 -557 802 -548 -103 657 -784 388 309 -794 711 -141 -516 792 -548 -51 626 -777
3107 -777 439 232 -775 730 -192 -465 779 -568 19 579 -776 468 165 -730 732 -246 -400
3124 -400 757 -600 73 503 -800 508 134 -730 756 -262 -390 728 -596 75 479 -770 514
3141 514 111 -688 764 -267 -371 713 -604 100 472 -761 547 125 -678 758 -279 -351 690
3158 690 -593 132 442 -745 564 73 -657 749 -320 -296 672 -615 192 394 -740 591 7 -627
3176 -627 732 -358 -237 627 -616 239 316 -732 607 -51 -581 746 -380 -188 616 -620 262 297
3194 297 -720 618 -47 -541 733 -371 -172 586 -640 293 283 -711 637 -57 -546 732 -382 -168
3212 -168 549 -635 291 263 -674 657 -92 -513 705 -429 -124 523 -644 348 222 -664 660 -139
3230 -139 -476 669 -452 -60 481 -628 384 154 -636 653 -193 -423 671 -468 -4 454 -613
3247 -613 414 122 -620 652 -205 -380 656 -458 16 423 -630 418 93 -602 657 -214 -362 659
3265 659 -476 18 410 -632 401 83 -582 659 -222 -333 620 -484 52 375 -625 451 62 -547
3283 -547 665 -263 -309 587 -497 81 344 -575 465 17 -500 653 -308 -227 562 -514 170 306 -571
3302 -571 494 -20 -498 627 -320 -199 534 -510 180 284 -565 484 -51 -469 622 -335 -178 532
3320 532 -522 182 271 -579 482 -51 -446 605 -329 -149 507 -521 188 255 -553 491 -70 -408 612
3339 612 -348 -116 496 -531 228 227 -543 498 -97 -354 576 -378 -55 441 -540 273 168 -520 527 -140
3359 -140 -318 549 -403 -34 414 -529 292 140 -489 516 -164 -307 547 -426 11 406 -531 319 134 -487
3379 -487 498 -168 -302 530 -418 10 393 -550 298 121 -485 507 -184 -259 525 -414 50 376 -538 325
3399 325 94 -459 519 -202 -222 505 -434 87 317 -517 361 47 -413 510 -245 -169 463 -462 120 292 -512
3420 -512 377 26 -393 478 -272 -137 454 -480 139 272 -507 391 8 -378 483 -278 -127 444 -458 156
3440 156 289 -491 377 0 -372 478 -283 -101 449 -475 179 260 -496 399 -6 -338 471 -289 -55 415
3460 415 -477 202 217 -488 387 -62 -299 454 -328 -22 377 -488 235 184 -463 408 -88 -256 432 -352 12
3481 12 342 -487 263 146 -441 411 -96 -234 440 -349 37 345 -486 273 162 -432 418 -106 -226 422
3501 422 -361 51 328 -474 287 140 -426 412 -127 -226 420 -377 61 316 -482 289 106 -418 397 -153
3521 -153 -166 393 -397 114 265 -481 314 62 -380 410 -182 -126 373 -394 163 253 -462 343 28 -347 405
3542 405 -205 -91 362 -404 160 223 -466 349 20 -341 391 -204 -87 345 -405 181 206 -461 348 7 -326
3563 -326 389 -230 -81 339 -424 174 196 -441 335 -6 -305 367 -236 -35 322 -419 207 169 -435 361 -41
3584 -41 -274 379 -263 -7 297 -414 235 142 -415 372 -57 -231 363 -281 39 265 -418 270 101 -398 364
3605 364 -83 -237 346 -307 35 261 -420 257 95 -391 365 -105 -211 355 -302 51 250 -422 264 101
3625 101 -387 356 -104 -187 341 -312 70 235 -406 278 52 -357 373 -132 -155 337 -319 102 207 -389 302
3646 302 30 -331 370 -166 -127 322 -336 116 165 -396 307 -19 -319 361 -203 -111 297 -352 125 159 -379
3667 -379 307 -24 -299 358 -190 -94 307 -347 147 170 -381 319 -14 -284 367 -208 -83 307 -338 153 161
3688 161 -363 322 -37 -255 361 -233 -39 306 -343 179 132 -354 322 -89 -245 357 -253 -17 259 -370
3708 -370 194 132 -370 372 -126 -204 340 -298 18 258 -430 194 117 -329 330 -102 -191 346 -272 18 252
3729 252 -359 202 64 -324 334 -128 -183 344 -306 27 250 -373 221 76 -318 336 -137 -160 331 -309 49
3750 49 235 -357 241 31 -316 336 -177 -137 328 -322 77 215 -345 249 -2 -271 340 -208 -90 317 -332
3771 -332 87 180 -345 271 -46 -299 372 -187 -67 289 -331 110 175 -347 282 -29 -225 357 -214 -67 315
3792 315 -349 132 169 -333 283 -31 -221 336 -242 -55 299 -354 143 151 -340 287 -52 -218 336 -268 -31
3813 -31 306 -358 150 140 -324 290 -91 -187 329 -288 22 273 -356 189 110 -303 302 -114 -154 341 -284 34
3835 34 270 -342 199 84 -295 309 -118 -122 330 -302 55 260 -362 188 74 -298 309 -127 -131 333 -305 38
3857 38 245 -367 201 68 -286 307 -144 -117 327 -340 64 237 -347 223 59 -260 315 -165 -84 319 -335
3878 -335 99 217 -350 245 30 -240 325 -195 -62 303 -331 131 196 -351 260 -7 -231 311 -224 -39
3898 -39 294 -361 132 179 -368 266 -16 -241 302 -225 -32 293 -362 132 172 -346 262 -28 -210 328 -230
3919 -230 -15 294 -356 142 163 -344 282 -26 -200 330 -242 12 288 -355 170 134 -322 304 -59 -162 325
3940 325 -279 26 261 -361 196 126 -304 293 -94 -147 308 -284 38 243 -364 217 100 -311 302 -105 -152
3961 -152 301 -293 46 260 -370 208 97 -314 309 -113 -136 323 -307 70 257 -372 222 79 -306 318
3981 318 -133 -122 336 -300 71 240 -372 232 58 -282 321 -147 -102 301 -330 91 213 -367 253 25 -258
4002 -258 319 -178 -85 292 -338 108 169 -367 268 7 -250 319 -200 -67 294 -339 133 189 -349 289 13
4023 13 -251 332 -197 -60 309 -323 151 189 -347 294 -8 -249 335 -209 -56 305 -343 147 158 -361 288
4044 288 -32 -255 352 -231 -29 293 -357 162 129 -355 305 -69 -216 353 -246 -5 280 -365 189 107 -338
4065 -338 323 -80 -192 350 -274 3 255 -357 205 96 -325 335 -90 -189 354 -276 10 263 -344 205
4085 205 81 -320 334 -118 -193 360 -289 31 270 -364 209 87 -319 341 -136 -180 347 -303 18 249 -349
4106 -349 220 57 -311 349 -164 -150 359 -299 47 234 -358 252 29 -286 355 -170 -119 348 -301 81 214
4127 214 -353 267 9 -275 355 -176 -108 349 -323 88 191 -356 263 -8 -279 354 -204 -111 332 -350 99
4148 99 211 -362 254 -7 -259 366 -228 -130 336 -310 128 167 -325 290 -18 -249 380 -212 -92 324 -331
4169 -331 112 167 -319 286 -81 -272 313 -179 -34 286 -330 84 164 -301 274 -80 -199 368 -288 -38 298
4190 298 -342 158 125 -325 304 -91 -209 362 -277 -36 288 -353 157 108 -329 308 -105 -195 367 -280 -28
4211 -28 298 -345 164 116 -315 325 -121 -187 380 -286 -5 288 -356 187 99 -293 337 -134 -164 368 -297 -2
4233 -2 272 -332 193 50 -279 327 -167 -148 352 -300 29 251 -350 202 41 -275 324 -176 -142 350 -310
4254 -310 39 231 -332 233 50 -266 344 -183 -132 361 -325 36 254 -337 225 35 -264 355 -176 -114 374
4275 374 -313 67 238 -342 253 -3 -259 339 -208 -113 346 -343 79 203 -341 246 -21 -240 342 -228
4295 -228 -92 326 -330 98 175 -322 265 -40 -225 361 -233 -64 318 -329 122 174 -328 282 -57 -209 363
4316 363 -231 -67 327 -330 130 177 -314 281 -55 -221 372 -251 -60 333 -349 132 157 -324 292 -76 -205
4337 -205 365 -281 -45 312 -346 145 138 -319 299 -93 -192 359 -268 -18 285 -350 165 109 -298 300 -119
4358 -119 -165 354 -281 -3 275 -336 182 96 -293 322 -120 -144 351 -296 24 265 -356 202 85 -288 313
4379 313 -123 -154 343 -301 23 259 -349 196 63 -290 321 -138 -146 336 -292 37 253 -341 211 60 -281
4400 -281 319 -150 -128 328 -299 64 215 -337 231 41 -268 331 -167 -108 331 -299 88 202 -335 233 15
4421 15 -256 321 -188 -96 305 -307 85 177 -337 246 -1 -251 323 -188 -102 298 -316 82 170 -342 255 -11
4443 -11 -256 324 -196 -91 291 -317 106 170 -328 267 -4 -230 338 -206 -86 290 -314 129 159 -312 272
4464 272 -35 -226 342 -206 -57 278 -313 144 123 -303 289 -56 -207 321 -218 -37 257 -316 148 105 -313
4485 -313 291 -68 -208 324 -226 -41 247 -315 150 101 -304 295 -64 -202 323 -226 -27 250 -317 176
4505 176 99 -303 312 -72 -194 331 -236 -17 246 -311 179 93 -279 309 -98 -177 318 -237 7 217 -311
4526 -311 194 74 -287 303 -107 -179 302 -245 18 199 -309 196 50 -281 305 -124 -151 309 -248 36 191
4547 191 -306 207 39 -276 307 -114 -145 306 -243 50 201 -306 224 32 -271 330 -140 -139 309 -261 53
4568 53 183 -330 219 17 -283 317 -135 -127 281 -272 58 159 -309 238 -18 -266 315 -171 -123 282 -263
4589 -263 80 147 -311 241 -18 -252 317 -159 -99 270 -270 100 134 -296 261 -14 -240 313 -170 -86 275
4610 275 -278 100 138 -312 256 -39 -241 325 -183 -73 273 -280 117 126 -311 281 -46 -247 319 -188 -81
4631 -81 252 -288 104 102 -309 275 -52 -221 325 -186 -60 246 -290 143 90 -289 288 -62 -190 299 -205
4652 -205 -32 226 -274 155 90 -267 300 -74 -199 302 -222 -22 230 -289 163 87 -282 294 -83 -189 307
4673 307 -217 -12 223 -292 178 55 -292 297 -114 -192 313 -222 -11 219 -309 182 43 -284 304 -104
4693 -104 -158 315 -228 11 208 -298 198 43 -263 303 -108 -139 293 -226 27 195 -287 206 37 -247 298
4714 298 -125 -143 287 -246 42 170 -276 201 27 -248 294 -126 -130 279 -242 41 165 -287 209 11 -254
4735 -254 306 -152 -115 293 -247 62 180 -295 219 5 -248 300 -144 -103 286 -243 80 167 -288 226 6
4756 6 -227 312 -152 -67 266 -236 102 152 -258 240 -39 -220 342 -161 -85 213 -325 94 104 -253 242 -33
4778 -33 -245 301 -203 -79 239 -278 97 135 -277 227 -31 -200 293 -195 -51 258 -280 121 132 -277 253
4799 253 -40 -180 293 -188 -25 249 -279 131 121 -267 245 -52 -184 286 -199 -25 232 -280 140 108 -268
4820 -268 240 -76 -168 267 -219 -18 207 -293 138 75 -264 247 -66 -138 273 -208 -1 207 -290 153 78
4841 78 -254 253 -74 -140 277 -214 18 207 -283 165 84 -251 256 -94 -140 273 -232 18 201 -293 172
4862 172 60 -244 262 -108 -129 261 -235 36 193 -294 163 50 -251 244 -147 -115 258 -249 51 170 -296
4883 -296 175 33 -227 250 -138 -96 278 -251 91 141 -289 188 26 -223 248 -39 -64 217 -277 88 154
4904 154 -258 215 24 -195 263 -127 -55 272 -263 86 151 -283 195 16 -209 244 -157 -61 226 -269 74
4925 74 137 -288 196 1 -191 238 -154 -55 220 -257 100 138 -263 201 -16 -177 240 -167 -37 214 -248
4946 -248 105 124 -269 204 -19 -173 227 -163 -26 203 -251 127 102 -262 203 -32 -154 241 -168 -33 271
4967 271 -241 108 86 -265 207 -50 -142 220 -171 -6 198 -280 136 102 -247 213 -44 -143 245 -190 8
4988 8 186 -260 140 94 -230 215 -53 -118 226 -191 14 175 -242 148 73 -212 202 -60 -108 205 -180 27
5010 27 171 -252 143 58 -213 196 -75 -112 209 -201 36 149 -255 145 47 -218 206 -82 -94 214 -206 45
5032 45 151 -257 151 47 -208 213 -86 -83 207 -196 57 150 -229 158 48 -198 216 -91 -78 191 -190 62
5054 62 131 -232 161 17 -176 207 -90 -70 190 -197 48 122 -230 145 8 -175 195 -110 -69 188 -213 69
5076 69 111 -231 150 11 -168 198 -105 -50 186 -206 57 111 -219 167 13 -147 212 -121 -38 184 -204 82
5098 82 116 -204 164 -7 -150 198 -127 -52 170 -191 81 97 -210 157 -19 -150 193 -135 -35 165 -204
5119 -204 74 90 -194 154 -31 -131 198 -121 -24 152 -190 92 83 -194 168 -25 -115 197 -120 -9 170 -182
5141 -182 99 71 -175 173 -34 -125 188 -136 -14 167 -194 101 62 -179 179 -56 -124 192 -143 -12 146
5162 146 -208 103 54 -188 167 -69 -108 182 -154 -10 140 -184 98 38 -163 162 -61 -90 175 -138 0
5183 0 128 -180 112 27 -149 172 -61 -91 179 -141 8 116 -170 97 33 -153 171 -66 -87 165 -152 5
5205 5 115 -168 106 6 -160 174 -90 -78 177 -143 17 110 -181 107 11 -136 163 -96 -71 172 -153 13
5227 13 106 -156 120 7 -130 169 -78 -61 168 -137 25 104 -141 113 0 -138 161 -81 -47 162 -143 36
5249 36 99 -153 106 -8 -115 160 -96 -54 148 -140 28 90 -155 112 -16 -129 164 -103 -63 155 -157 28
5271 28 74 -160 111 -15 -103 169 -104 -30 139 -152 49 93 -140 124 -24 -112 164 -94 -33 144 -137 38
5293 38 76 -124 119 -28 -95 149 -105 -29 129 -135 37 54 -129 102 -46 -108 141 -107 -39 128 -139 46
5315 46 49 -130 122 -39 -93 156 -117 -27 126 -147 61 41 -130 135 -50 -77 159 -109 -13 117 -132 60 39
5338 39 -118 128 -38 -75 152 -128 -24 116 -129 62 27 -114 122 -56 -74 142 -116 -15 104 -135 56
5359 56 27 -111 115 -61 -63 128 -111 -5 97 -124 67 18 -104 120 -59 -59 148 -111 2 115 -129 82
5381 82 26 -107 134 -60 -73 143 -108 8 83 -124 85 11 -103 129 -62 -53 121 -121 17 66 -120 74 4
5404 4 -102 143 -74 -51 120 -139 53 76 -125 91 2 -92 113 -115 -139 135 -132 20 100 -94 104 -14 -95
5427 -95 128 -61 -48 126 -109 35 77 -112 90 -6 -93 126 -69 -28 117 -110 46 61 -115 87 -9 -88 121
5450 121 -80 -29 114 -129 37 42 -133 93 -24 -83 125 -76 -37 102 -121 40 43 -106 91 -25 -74 122 -80
5473 -80 -18 90 -116 50 39 -103 94 -29 -62 117 -80 -4 99 -87 64 57 -81 152 -13 -110 95 -102 1
5496 1 74 -119 47 23 -100 92 -44 -65 112 -91 6 76 -118 68 26 -99 100 -49 -51 107 -87 14 72 -109
5520 -109 78 20 -87 133 -58 -73 69 -39 78 43 -102 62 34 -53 120 -27 -28 71 -80 23 53 -105 70
5543 70 14 -87 94 -45 -37 90 -95 13 43 -107 74 4 -86 92 -53 -42 65 -96 35 51 -92 67 -2
5566 -2 -71 94 -63 -27 117 -100 48 45 -107 103 25 -84 73 31 27 71 -65 54 36 -81 79 -16 -69 88 -66
5591 -66 -16 54 -91 25 15 -107 80 -25 -72 81 -58 -23 45 -83 20 17 -68 55 16 -49 112 -38 -27 90
5615 90 -102 27 52 -74 48 -14 -31 66 -55 31 74 -82 43 27 -78 106 -30 -49 68 -57 11 65 -84 58
5639 58 7 -82 66 -30 -55 65 -56 11 44 -81 56 1 -77 71 -38 -33 57 -62 23 35 -81 58 -8 -67 90
5664 90 -27 -21 78 -52 21 28 -70 77 0 -54 83 -36 -12 62 -53 32 32 -72 80 -2 -55 80 -39 -26 55 -69
5690 -69 24 18 -75 59 -14 -53 68 -40 -14 49 -72 36 14 -75 64 -19 -45 67 -48 -14 43 -59 39 22 -59 64
5716 64 -28 -38 77 -43 -4 55 -53 29 6 -67 65 -22 -42 77 -40 4 38 -67 49 -1 -61 54 -27 -41 66
5741 66 -61 -1 10 -80 41 -24 -62 80 -21 -2 82 -58 -5 2 -73 63 8 -83 84 -34 -45 91 -42 -3 24 -65
5767 -65 39 -10 -30 65 -25 -20 59 -53 29 24 -40 56 -6 -35 73 -38 -14 36 -59 19 10 -53 44 -30 -34 62 -36 -11 41 -56
5797 -56 21 19 -48 55 -26 -44 55 -51 -8 45 -47 30 10 -43 57 -20 -25 59 -46 14 34 -47 38 6 -45 50 -25 -22 47 -38
5827 -38 17 34 -55 28 6 -41 41 -36 -15 35 -41 4 15 -63 29 -8 -45 49 -36 -20 37 -66 18 21 -61 35 -4 -42 37 -39
5857 -39 -12 34 -44 21 22 -49 35 -11 -30 50 -29 -2 26 -41 20 10 -45 47 -6 -25 43 -49 2 37 -48 25 -4 -50 39 -23 -31
5888 -31 40 -44 2 21 -53 34 4 -42 40 -29 -22 42 -45 10 12 -50 28 0 -43 44 -24 -28 45 -43 8 30 -56 22 5 -39 54 -20
5920 -20 -10 54 -44 17 17 -31 35 -3 -24 21 -44 -12 6 -53 22 18 -55 44 -21 -36 51 -23 -2 29 -49 28 9 -52 52 -8 -38
5951 -38 46 -23 1 38 -53 33 25 -47 47 -19 -34 43 -32 4 40 -48 37 11 -47 54 -16 -25 56 -39 5 31 -52 37 7 -45 43
5982 43 -31 -38 46 -45 5 34 -54 36 -7 -61 54 -27 -21 53 -43 16 23 -61 47 0 -40 59 -20 -16 50 -39 19 30 -47 51 -2
6013 -2 -36 59 -34 -11 43 -57 26 26 -49 50 -6 -44 59 -41 -33 38 -56 16 19 -65 54 -25 -61 66 -51 -15 43 -60 28
6042 28 13 -64 47 -11 -47 68 -40 -6 48 -59 32 10 -52 74 -22 -29 74 -38 -2 36 -54 47 8 -51 66 -25
6068 -25 -32 66 -41 -3 35 -56 41 5 -56 70 -32 -39 36 -47 1 24 -97 16 31 -67 12 -36 -56 50 -87 51 27
6095 27 -42 65 11 -56 80 -28 -19 77 -45 4 27 -61 58 3 -57 73 -33 -18 71 -51 19 34 -70 63 -11 -54
6121 -54 78 -60 -16 52 -63 30 29 -73 52 -15 -46 88 -45 -18 51 -72 33 20 -66 56 -22 -52 92 -65 -13
6146 -13 77 -76 44 24 -69 77 -17 -47 85 -56 -1 63 -81 39 28 -68 83 -15 -32 81 -63 -1 63 -79 43
6171 43 15 -71 74 -29 -42 70 -68 -2 52 -81 42 14 -79 72 -40 -40 72 -73 5 55 -90 45 15 -74 71
6196 71 -40 -25 86 -71 23 53 -88 57 14 -77 87 -34 -30 86 -70 16 57 -96 75 12 -80 79 -37 -41 83
6221 83 -93 18 50 -98 77 -5 -85 82 -54 -37 88 -96 22 49 -106 70 -5 -72 77 -59 -8 87 -94
6244 -94 41 49 -105 83 -2 -63 99 -61 -13 90 -77 37 51 -98 85 -10 -60 100 -66 -5 89 -94 42 43
6268 43 -100 86 -14 -71 108 -57 -5 82 -107 49 30 -108 79 -17 -66 111 -88 -7 70 -117 63 33 -96
6291 -96 97 -19 -50 120 -81 -8 70 -109 65 32 -93 107 -27 -59 103 -82 9 83 -104 75 13 -113 95
6314 95 -40 -48 100 -88 6 61 -124 73 5 -104 112 -42 -54 95 -104 22 61 -139 79 7 -112 103 -52
6337 -52 -56 109 -92 28 78 -125 76 19 -97 115 -54 -35 110 -93 41 63 -114 101 7 -101 123 -53 -35
6360 -35 103 -116 42 61 -129 99 -1 -109 123 -70 -36 108 -111 55 60 -125 108 -11 -98 132 -64 -33
6382 -33 97 -122 54 47 -129 105 -21 -91 133 -85 -19 104 -120 59 56 -115 119 -25 -82 137 -94 -20 106
6405 106 -116 60 42 -131 114 -21 -89 127 -95 -15 95 -130 71 43 -117 129 -34 -89 129 -100 -7 88
6427 88 -139 87 33 -125 126 -36 -75 128 -102 1 89 -138 80 42 -128 132 -45 -71 135 -106 27 98
6449 98 -135 95 29 -118 138 -55 -71 133 -113 20 99 -145 94 6 -132 133 -60 -61 125 -127 21 88 -152
6472 -152 90 12 -126 135 -68 -55 129 -125 21 93 -139 113 -2 -116 138 -66 -56 140 -125 32 88 -146
6494 -146 117 10 -104 154 -75 -41 138 -133 52 81 -141 122 0 -111 153 -78 -32 147 -114 55 76
6515 76 -136 117 8 -93 150 -111 -46 120 -149 45 64 -149 125 -13 -95 143 -85 -25 130 -142 60 67
6537 67 -139 125 -15 -103 151 -88 -18 134 -143 63 68 -141 126 -27 -87 147 -98 -17 123 -152 74 52 -150
6560 -150 143 -29 -85 150 -109 -18 121 -159 81 53 -145 151 -40 -96 162 -121 -11 115 -158 90 53 -142
6582 -142 147 -35 -81 160 -114 6 123 -148 81 46 -126 150 -44 -68 153 -112 14 122 -155 99 37
6603 37 -145 152 -73 -76 149 -138 12 103 -158 97 23 -132 146 -77 -70 149 -145 16 103 -159 107 21 -132
6626 -132 160 -69 -66 169 -142 25 106 -169 115 21 -134 170 -75 -52 165 -139 39 120 -164 126 14 -132
6648 -132 158 -82 -46 159 -142 20 87 -168 117 2 -133 155 -97 -49 149 -156 42 99 -172 127 -3
6669 -3 -131 160 -90 -50 153 -156 48 95 -169 139 -2 -110 163 -95 -36 163 -165 58 102 -157 142 -9
6691 -9 -112 169 -95 -36 150 -161 76 86 -161 132 -10 -115 167 -110 -24 150 -165 67 59 -176 122 -21
6713 -21 -121 154 -124 -26 149 -179 71 70 -166 149 -33 -108 168 -122 -5 145 -166 77 70 -162 159 -29
6735 -29 -100 178 -125 8 150 -176 93 65 -166 151 -41 -102 182 -132 9 131 -177 99 59 -168 157 -57
6757 -57 -103 171 -147 11 127 -194 92 51 -169 146 -55 -81 154 -149 11 134 -178 103 43 -152 163 -58
6779 -58 -76 180 -137 20 121 -181 109 42 -147 169 -64 -73 182 -168 25 129 -193 120 27 -155 167 -77
6801 -77 -66 168 -162 26 131 -187 120 26 -152 170 -89 -72 172 -168 33 109 -198 122 17 -161 175 -76
6823 -76 -56 171 -163 37 109 -179 134 12 -141 183 -93 -46 171 -156 54 102 -184 140 6 -140 179 -101
6845 -101 -49 173 -168 60 94 -191 132 -5 -134 181 -115 -41 155 -180 55 87 -194 140 -24 -139 197
6866 197 -125 -49 163 -177 66 80 -192 154 -17 -123 186 -118 -27 170 -178 74 84 -179 157 -22 -116 188
6888 188 -127 -24 164 -176 81 69 -186 164 -37 -129 191 -129 -17 164 -194 80 68 -186 168 -34 -130
6909 -130 205 -144 -28 144 -208 68 68 -196 177 -97 -108 200 -161 16 139 -199 106 63 -172 191 -54
6930 -54 -96 198 -150 12 151 -192 115 60 -172 186 -59 -97 195 -161 12 143 -196 114 44 -172 181 -73
6952 -73 -102 178 -174 8 120 -193 124 21 -183 176 -95 -90 197 -173 29 124 -198 122 24 -168 197 -92
6974 -92 -79 186 -169 36 128 -201 140 12 -149 202 -98 -70 197 -182 45 121 -194 147 3 -153 193 -106
6996 -106 -68 177 -182 41 99 -196 137 -11 -156 191 -121 -74 186 -172 42 102 -194 158 -10 -145 201
7017 201 -119 -65 173 -187 64 90 -191 149 -17 -141 202 -110 -53 185 -180 72 84 -189 165 -27 -131
7038 -131 212 -140 -34 171 -198 68 73 -191 158 -45 -139 198 -140 -46 152 -192 82 64 -191 173 -48 -124
7060 -124 196 -144 -20 166 -181 86 61 -158 147 -59 -103 205 -147 -15 167 -184 112 62 -163 186 -66
7081 -66 -121 210 -149 9 156 -195 95 35 -170 194 -73 -109 196 -169 -5 141 -208 107 27 -193 181 -90
7103 -90 -105 200 -168 -3 129 -214 119 36 -175 186 -81 -94 192 -169 13 133 -197 117 25 -154 199 -83
7125 -83 -86 201 -156 21 135 -193 128 19 -164 187 -107 -85 189 -177 28 122 -211 127 -3 -157 199 -115
7147 -115 -80 179 -179 38 124 -197 133 -8 -156 195 -112 -56 188 -178 46 108 -191 158 -11 -147 208
7168 208 -110 -37 189 -177 60 113 -184 167 1 -141 208 -112 -41 180 -181 57 94 -188 161 -15 -131
7189 -131 198 -135 -39 165 -188 69 84 -192 163 -35 -142 188 -147 -27 156 -196 74 72 -184 168 -48
7210 -48 -124 196 -148 -21 168 -197 82 73 -191 176 -46 -108 201 -141 -6 149 -196 98 65 -181 178 -57
7232 -57 -112 193 -145 -13 148 -205 100 43 -194 178 -65 -106 185 -152 -11 133 -194 98 43 -187 167 -62
7254 -62 -101 192 -158 2 139 -200 114 35 -163 184 -75 -83 187 -164 17 133 -196 138 42 -168 196 -85
7276 -85 -80 176 -166 31 121 -181 138 20 -172 185 -85 -74 182 -172 28 118 -200 127 8 -167 181 -83
7298 -83 -76 167 -165 32 113 -187 145 20 -152 194 -91 -64 182 -179 47 98 -188 152 11 -148 191 -93
7320 -93 -47 183 -172 63 101 -186 148 -15 -142 197 -115 -50 156 -178 60 87 -199 149 -22 -148 188 -133
7342 -133 -48 158 -186 58 83 -221 170 -9 -137 192 -120 -18 166 -198 68 25 -184 154 -14 -122 156
7363 156 -114 -32 167 -214 115 29 -115 126 -92 -111 232 -128 29 148 -181 118 37 -174 178 -9 -141
7384 -141 202 -57 8 103 -220 85 23 -190 165 -98 -89 180 -138 11 160 -213 122 56 -169 170 -44 -108
7406 -108 179 -128 15 139 -179 119 49 -175 179 -36 -89 183 -144 19 127 -188 132 31 -166 175 -43
7427 -43 -81 178 -144 18 115 -198 120 20 -165 183 -74 -83 179 -158 37 103 -198 124 21 -166 179 -77
7449 -77 -71 168 -162 45 103 -195 140 8 -151 191 -84 -68 176 -155 51 104 -168 148 -2 -137 183 -110
7471 -110 -86 196 -173 52 62 -203 78 -32 -115 191 -112 13 175 -118 10 99 -192 87 -58 -206 178
7492 178 -119 -38 112 -168 51 104 -167 151 -12 -146 164 -92 -45 130 -171 90 76 -171 155 -8 -120
7513 -120 181 -130 -20 151 -170 86 69 -179 162 -34 -126 183 -122 -16 137 -162 82 63 -187 161 -39
7534 -39 -120 168 -129 -20 126 -178 93 52 -166 167 -34 -107 184 -125 -5 124 -171 102 51 -156 177 -48
7556 -48 -101 174 -132 21 125 -176 113 40 -152 175 -65 -90 167 -150 15 110 -176 98 33 -160 151 -75
7578 -75 -95 163 -147 9 118 -172 109 19 -163 167 -73 -74 152 -158 0 103 -167 124 17 -158 169 -76
7600 -76 -67 156 -153 40 65 -172 166 29 -127 171 -104 -75 160 -143 7 101 -180 151 13 -135 155 -25
7622 -25 -45 155 -175 78 143 -178 77 -6 -163 224 -81 -69 172 -158 52 83 -173 129 -12 -129 158 -106
7644 -106 -37 149 -160 58 82 -156 136 -3 -105 164 -110 -20 151 -153 65 76 -154 142 -21 -111 171 -109
7666 -109 -14 142 -149 73 66 -169 134 -31 -96 157 -133 -15 128 -173 76 59 -162 130 -47 -88 168 -119
7688 -119 1 130 -161 86 59 -151 147 -43 -85 159 -121 2 130 -163 90 49 -133 151 -43 -68 172
7709 172 -121 11 121 -161 104 56 -137 152 -69 -79 156 -128 17 116 -167 87 35 -138 153 -76 -60 150
7731 150 -144 30 103 -162 104 34 -133 142 -71 -51 150 -138 35 99 -162 104 20 -121 163 -77 -40 154
7753 154 -145 47 105 -157 110 13 -114 151 -81 -38 150 -138 48 91 -165 104 2 -115 151 -92 -52 127
7775 127 -155 38 85 -162 110 0 -115 143 -99 -33 122 -164 56 80 -149 120 -22 -97 161 -96 -12 130
7797 130 -157 64 70 -148 126 -14 -80 150 -97 -7 120 -146 75 67 -142 127 -14 -82 140 -118 -3 113
7819 113 -151 74 56 -140 120 -34 -89 136 -117 3 118 -170 77 50 -138 123 -49 -77 134 -116 16
7840 16 110 -145 85 46 -124 136 -34 -63 141 -117 26 105 -135 90 26 -119 138 -46 -53 135 -123 31 105
7863 105 -149 103 13 -118 129 -68 -51 140 -118 30 81 -148 98 24 -111 125 -63 -38 128 -125 26 86
7885 86 -153 95 20 -108 138 -63 -42 122 -127 38 87 -138 98 14 -93 134 -64 -32 129 -129 48 71
7907 71 -129 119 0 -98 142 -87 -28 124 -142 52 62 -131 105 -21 -97 119 -98 -19 115 -138 64 51
7929 51 -144 114 -25 -83 126 -91 -17 101 -130 54 54 -120 116 -9 -86 145 -93 -3 106 -133 65 48 -124
7952 -124 114 -25 -83 141 -90 4 100 -125 72 39 -113 121 -28 -69 123 -106 -2 82 -149 71 20 -114
7974 -114 124 -53 -66 123 -107 12 90 -126 83 22 -118 105 -57 -62 120 -106 20 93 -129 86 18 -105
7996 -105 110 -61 -47 127 -109 19 94 -122 86 14 -104 118 -56 -43 118 -105 7 66 -124 91 -6 -100
8018 -100 126 -66 -53 116 -113 17 68 -122 89 -8 -91 124 -66 -38 113 -111 42 73 -110 104 -15 -81
8040 -81 131 -83 -30 124 -122 41 65 -113 105 -12 -73 122 -85 -22 115 -119 50 60 -107 85 -28 -70
8062 -70 122 -87 -37 92 -122 37 35 -112 85 -34 -71 117 -91 -14 99 -129 54 40 -117 106 -32 -58 138
8085 138 -87 5 103 -114 68 33 -105 116 -56 -50 131 -91 -1 94 -111 76 31 -102 110 -47 -54 127 -106
8108 -106 6 82 -121 58 0 -107 116 -64 -55 122 -112 3 72 -117 72 10 -99 118 -49 -53 118 -95 12
8131 12 81 -107 88 15 -84 109 -49 -28 121 -102 30 71 -104 86 -1 -85 111 -66 -34 105 -109 27 57
8154 57 -110 90 -16 -72 113 -81 -23 101 -104 37 56 -116 96 -17 -73 126 -83 -16 100 -109 33 54
8176 54 -102 93 -10 -63 116 -80 -14 113 -91 52 50 -98 101 -17 -52
8191e2
$$ Imaginary data points
##PAGE= N=2
##DATA TABLE= (X++(I..I)), XYDATA
0 0 0 0 0 0 0 0 0 0 0 0 0 0 0 0 0 -8 8 -8 8 -8 8 -16 16 -16 22 -24 26 -32 38 -41 48 -54 59 -67 76 -86 97
37 97 -107 119 -133 147 -164 180 -200 220 -242 267 -296 324 -356 395 -434 478 -529 585 -651 723
57 723 -810 911 -1032 1182 -1369 1610 -1933 2388 -3072 4189 -6329 11653 -47521 -46823 101422
72 101422 -83220 10196 64885 -93023 60122 13531 -78473 90563 -41110 -36601 85541
83 85541 -75443 17342 51716 -86944 67104 -836 -70717 93355 -48785 -31678 88355
94 88355 -80944 19466 53873 -88817 63178 4319 -70660 87126 -41254 -31048 78951
105 78951 -71169 18270 44019 -78170 61184 -3752 -58995 83301 -47939 -20747 74784
116 74784 -76636 25796 40926 -81004 66265 -4410 -61451 84388 -45842 -23474 72957
127 72957 -71564 21975 39314 -72763 59321 -5756 -51982 74673 -45800 -14479 62748
138 62748 -68980 29453 30400 -69829 63271 -11717 -49791 75619 -47952 -13550 63487
149 63487 -67661 26766 31216 -66715 57323 -9300 -45875 67617 -42936 -9377 54545
160 54545 -62033 29178 22841 -60714 58014 -15609 -39737 67688 -47198 -5163 53682
171 53682 -64579 31253 22491 -61704 58099 -13885 -39456 65069 -44489 -5297 49771
182 49771 -59973 29930 18528 -55132 55519 -17027 -32928 60387 -46327 607 44806
193 44806 -60178 34199 15236 -54195 56696 -18754 -32273 59632 -45401 -114 43571
204 43571 -56387 31601 14305 -49691 51434 -18217 -27308 53106 -43374 4346 37574 -53354
216 -53354 33970 8847 -46597 52417 -21877 -24623 53416 -44942 5931 37340 -53814 33433
228 33433 9121 -45422 49961 -20661 -22387 50006 -42944 7522 32805 -50921 34407 5046
240 5046 -41711 49834 -23599 -18230 48198 -45082 10584 30878 -51219 35957 3807 -40778
252 -40778 49505 -23534 -17539 45948 -43125 10612 28413 -47670 34293 2197 -36298 45796
264 45796 -24368 -13389 41884 -42521 13691 24719 -46006 36059 -576 -34881 45803 -25721
276 -25721 -11971 41380 -42523 14145 24225 -44873 34732 -1024 -32825 43433 -25355 -9409
288 -9409 38180 -41323 16470 20464 -43377 36068 -4279 -30387 43890 -27830 -6979 37892
300 37892 -42630 17761 19495 -43311 36275 -4577 -29229 42432 -27132 -5546 35096 -40914
312 -40914 18223 16833 -40258 35524 -6498 -25842 40598 -28094 -3101 32656 -40612 19898
324 19898 14928 -39095 35628 -7486 -24388 39373 -28204 -2203 31366 -39291 19782 13730
336 13730 -37041 34370 -8275 -22205 37120 -28184 187 28828 -38647 21578 11182 -35837
348 -35837 35209 -10648 -20646 37476 -29574 1512 28441 -38965 22136 10449 -35217 34549
360 34549 -10952 -18948 35899 -29268 3005 26192 -37609 22749 8015 -32965 34328 -12582
372 -12582 -16579 34661 -29873 4694 24677 -37226 23097 7168 -31552 33336 -12712 -15179
384 -15179 32875 -28972 5314 22605 -35402 22982 5675 -29381 32096 -13543 -13024 31111
396 31111 -29128 6896 20903 -34608 23792 3968 -28186 32217 -14831 -11801 30641 -29626
408 -29626 7969 20163 -34361 23993 3223 -27004 31477 -15410 -10180 29252 -29357 9362
420 9362 18133 -33371 24745 1356 -25498 31245 -16551 -8524 28427 -29589 10173 17134 -32537
433 -32537 24459 716 -24155 30008 -16232 -7438 26401 -28339 10721 15195 -30713 24043
445 24043 -643 -22042 28972 -16940 -5885 25157 -28066 11499 13866 -29831 24170 -1567
457 -1567 -20953 28396 -17334 -4795 24248 -27866 12140 12757 -28890 24280 -2765 -19616 28031
470 28031 -18054 -3465 23152 -27836 13255 11308 -28110 24711 -4175 -18238 27839 -18965
482 -18965 -2331 22404 -27709 13772 10311 -27192 24392 -4732 -16994 26604 -18757 -1337
494 -1337 20776 -26591 14005 8718 -25345 23924 -5971 -15321 25750 -19103 -282 19707 -26090
507 -26090 14313 7925 -24330 23369 -6501 -14109 24827 -19103 624 18630 -25413 14747
519 14747 6622 -23260 23372 -7627 -12809 24403 -19767 1862 17819 -25485 15485 5507 -22581
532 -22581 23630 -8658 -11775 24133 -20196 2759 16880 -25262 15920 4508 -21619 23422
544 23422 -9305 -10586 23292 -20214 3470 15639 -24325 16035 3346 -20154 22922 -10006
556 -10006 -9287 22265 -20234 4233 14703 -23609 16069 2707 -19080 22260 -10276 -8431 21191
569 21191 -19776 4879 13477 -22630 16326 1465 -17946 22044 -11298 -7263 20784 -20184
581 -20184 5840 12743 -22454 16815 418 -17341 22110 -12026 -6285 20333 -20387 6695
593 6695 11744 -22062 17155 -755 -16309 22079 -12768 -5206 19720 -20406 7313 10677 -21379
606 -21379 17175 -1596 -15105 21555 -13055 -4232 18697 -20090 7658 9655 -20368 17058
618 17058 -2152 -13997 20807 -13150 -3548 17576 -19569 7907 8671 -19239 16922 -3098 -12841
631 -12841 20299 -13816 -2622 16932 -19549 8691 7968 -18844 17244 -3900 -12300 20156 -14273
644 -14273 -1886 16466 -19393 9313 6969 -18223 17449 -5068 -11347 20055 -14906 -805
656 -805 15964 -19443 9840 6102 -17727 17390 -5645 -10395 19554 -14865 -66 14960 -18933
669 -18933 9999 5097 -16761 17130 -6083 -9377 18863 -14765 400 13917 -18287 10002
681 10002 4284 -15653 16840 -6531 -8410 18093 -14932 995 13051 -17901 10421 3562 -14927
694 -14927 16841 -7198 -7755 17638 -15214 1684 12423 -17549 10967 2705 -14229 16841 -8143
707 -8143 -6873 17269 -15619 2702 11797 -17401 11561 1842 -13836 16818 -8633 -6173 16814
720 16814 -15415 3266 10885 -16752 11548 843 -12921 16442 -8995 -5239 16145 -15149
732 -15149 3649 9982 -16169 11345 270 -12011 15958 -8988 -4502 15292 -14851 3920
744 3920 8993 -15526 11468 -316 -11162 15793 -9338 -3889 14695 -14898 4349 8321 -14995
757 -14995 11794 -976 -10446 15663 -9971 -3206 14131 -15013 5157 7686 -14683 12304 -1739
770 -1739 -9989 15580 -10489 -2631 13679 -14849 5645 6966 -14078 12267 -2534 -9278 15094
783 15094 -10700 -1858 13107 -14501 5973 6187 -13546 11987 -2984 -8623 14577 -10455 -1327
796 -1327 12332 -13936 6017 5373 -12831 11742 -3379 -7702 14192 -10553 -704 11656 -13841
809 -13841 6309 4704 -12370 11892 -3740 -7036 13879 -10817 -99 10921 -13847 6909
821 6909 3972 -11897 12299 -4442 -6519 13693 -11296 419 10390 -13690 7446 3402 -11384
834 -11384 12245 -5018 -5923 13137 -11433 1072 9738 -13281 7803 2760 -10919 11992 -5302
847 -5302 -5422 12568 -11063 1524 9089 -12655 7731 2123 -10288 11566 -5480 -4765 12030
860 12030 -10769 2005 8325 -12347 7873 1523 -9854 11501 -5653 -4194 11683 -10744 2337
873 2337 7565 -12103 8169 809 -9299 11684 -6141 -3575 11337 -11085 2881 6986 -12005
886 -12005 8609 298 -8798 11691 -6544 -3115 10772 -11071 3411 6276 -11560 8974 -223
899 -223 -8287 11443 -6820 -2704 10257 -10759 3669 5758 -10867 8814 -664 -7723 10867
912 10867 -6811 -2175 9609 -10309 4028 5146 -10442 8710 -1169 -7286 10607 -6846 -1737
925 -1737 9168 -10024 4268 4468 -10111 8734 -1668 -6699 10463 -7113 -1081 8738 -10177
938 -10177 4719 3823 -9944 9052 -2123 -6238 10458 -7317 -620 8177 -10170 5103 3246
951 3246 -9507 9212 -2542 -5675 10188 -7523 -257 7630 -9906 5353 2823 -9022 9077
964 9077 -2666 -5268 9569 -7376 41 6998 -9388 5470 2341 -8459 8848 -2988 -4924
977 -4924 9153 -7232 366 6566 -9025 5567 1937 -8092 8590 -3310 -4414 8841 -7238
990 -7238 913 6061 -8928 5954 1332 -7916 8774 -3639 -3966 8709 -7352 1368 5597 -8851
1004 -8851 6182 767 -7478 8875 -3976 -3448 8428 -7415 1732 5015 -8710 6368 428
1017 428 -7049 8716 -4100 -3097 7938 -7265 1865 4497 -8213 6357 115 -6538 8382
1030 8382 -4180 -2755 7396 -7110 2086 4154 -7825 6319 -137 -6172 8098 -4262 -2450
1043 -2450 6971 -6880 2489 3680 -7580 6500 -594 -5849 8042 -4589 -1994 6849 -6944
1056 -6944 2850 3290 -7447 6656 -1043 -5528 7975 -4780 -1463 6467 -7031 3256 2808 -7300
1070 -7300 6759 -1416 -5145 7901 -4859 -1187 6075 -6852 3342 2405 -6944 6631 -1552 -4657
1084 -4657 7506 -4856 -875 5613 -6645 3430 2097 -6556 6556 -1645 -4374 7162 -4756
1097 -4756 -627 5176 -6438 3607 1792 -6194 6508 -1993 -4007 6986 -4931 -267 4881 -6413
1111 -6413 3969 1454 -6087 6576 -2292 -3683 6799 -5128 190 4575 -6390 4256 960
1124 960 -5860 6698 -2662 -3360 6664 -5202 557 4264 -6334 4341 716 -5570 6509 -2759
1138 -2759 -2968 6319 -5068 795 3796 -6071 4415 438 -5260 6362 -2739 -2681 5977 -4924 904
1153 904 3487 -5770 4356 176 -4874 6222 -2884 -2384 5662 -4990 1242 3188 -5719 4548
1167 4548 -71 -4628 6181 -3163 -2078 5475 -5064 1554 2819 -5601 4788 -472 -4399 6177
1181 6177 -3454 -1652 5275 -5212 1910 2585 -5487 4848 -753 -4112 6063 -3507 -1382 4949
1195 4949 -5063 2094 2246 -5231 4787 -944 -3755 5826 -3553 -1127 4687 -4914 2115 2013 -4950
1210 -4950 4638 -1032 -3448 5490 -3536 -786 4319 -4874 2306 1736 -4759 4662 -1305 -3194 5407
1225 5407 -3668 -521 4072 -4893 2568 1469 -4612 4727 -1579 -2815 5286 -3937 -77 3846 -4971
1240 -4971 2878 1140 -4485 4863 -1788 -2580 5116 -3974 245 3549 -4897 2992 908 -4185 4740
1255 4740 -1968 -2264 4880 -3952 430 3258 -4731 3025 756 -3968 4511 -1954 -1988 4527 -3882 610
1271 610 2963 -4541 3061 504 -3737 4456 -2076 -1750 4316 -3916 912 2759 -4501 3194 291
1286 291 -3525 4430 -2295 -1441 4152 -3995 1255 2442 -4478 3473 -32 -3382 4481 -2519 -1136
1301 -1136 4027 -4130 1467 2239 -4371 3487 -288 -3118 4363 -2627 -844 3743 -4127 1691 1982
1316 1982 -4287 3475 -391 -2888 4179 -2614 -680 3466 -3963 1735 1725 -4013 3441 -520 -2629
1331 -2629 4014 -2655 -421 3258 -3977 1893 1569 -3858 3495 -677 -2427 3917 -2777 -164 3048
1346 3048 -3991 2180 1333 -3769 3599 -985 -2200 3886 -3036 133 2912 -4058 2408 1076 -3702
1361 -3702 3654 -1176 -1996 3723 -3087 462 2684 -4048 2529 831 -3545 3637 -1327 -1795 3615
1376 3615 -3044 588 2453 -3908 2531 701 -3329 3480 -1348 -1502 3404 -3041 741 2245 -3817
1391 -3817 2608 516 -3160 3502 -1420 -1351 3230 -3087 932 2033 -3766 2724 300 -2947 3544
1406 3544 -1711 -1116 3132 -3265 1214 1838 -3789 2956 100 -2848 3519 -1916 -867 3004 -3352
1421 -3352 1448 1652 -3673 3077 -179 -2686 3501 -2021 -664 2844 -3309 1617 1508 -3549 2981
1436 2981 -302 -2470 3346 -2020 -448 2677 -3182 1694 1270 -3408 2973 -443 -2268 3251 -2070
1451 -2070 -270 2504 -3212 1722 1087 -3296 2993 -602 -2052 3194 -2193 -30 2290 -3325 1976
1466 1976 874 -3238 3152 -824 -1870 3202 -2409 162 2150 -3328 2177 663 -3055 3233 -1048
1481 -1048 -1638 3069 -2559 427 2039 -3294 2293 547 -2885 3164 -1171 -1479 2895 -2496 590
1496 590 1837 -3145 2328 367 -2743 3020 -1273 -1271 2777 -2495 724 1690 -3074 2314 182 -2607
1512 -2607 2965 -1334 -1053 2626 -2527 915 1484 -3066 2426 -61 -2427 3062 -1537 -839 2590 -2660
1528 -2660 1112 1306 -3068 2574 -219 -2225 3083 -1713 -577 2449 -2794 1310 1121 -2976 2716
1543 2716 -380 -2086 3047 -1802 -464 2253 -2752 1406 1003 -2797 2657 -524 -1894 2875 -1909
1558 -1909 -325 2113 -2676 1502 870 -2680 2610 -649 -1764 2738 -1916 -125 2013 -2606 1587
1573 1587 667 -2553 2625 -864 -1580 2760 -2019 103 1928 -2688 1738 508 -2508 2699 -1033
1588 -1033 -1348 2758 -2174 319 1779 -2755 1894 288 -2408 2793 -1185 -1141 2688 -2311 462 1635
1604 1635 -2752 1913 172 -2207 2738 -1281 -989 2508 -2335 579 1459 -2648 1986 91 -2055
1619 -2055 2647 -1368 -866 2394 -2326 654 1385 -2499 2006 -28 -1892 2576 -1484 -658 2281 -2412
1635 -2412 901 1292 -2471 2095 -182 -1842 2611 -1622 -502 2200 -2459 1074 1087 -2513 2180 -422
1651 -422 -1685 2622 -1815 -260 2184 -2569 1202 969 -2519 2234 -540 -1540 2585 -1817 -90
1666 -90 2022 -2563 1269 820 -2379 2220 -615 -1361 2510 -1870 -27 1898 -2508 1318 761 -2245
1682 -2245 2207 -652 -1213 2366 -1929 117 1763 -2485 1436 643 -2139 2259 -841 -1130 2328 -2052
1698 -2052 287 1693 -2519 1581 479 -2096 2276 -1056 -967 2308 -2193 510 1593 -2566 1731
1713 1731 314 -2055 2324 -1168 -809 2266 -2221 658 1485 -2539 1763 158 -1905 2300 -1238
1728 -1238 -626 2194 -2227 762 1360 -2502 1757 112 -1769 2242 -1234 -481 2044 -2225 815 1201
1744 1201 -2399 1820 -19 -1649 2232 -1363 -371 1944 -2317 945 1119 -2369 1890 -159 -1540
1759 -1540 2234 -1527 -220 1863 -2390 1144 990 -2347 2044 -327 -1433 2240 -1666 -66 1829
1774 1829 -2408 1286 883 -2289 2054 -463 -1311 2172 -1715 122 1730 -2397 1371 755 -2235 2051
1790 2051 -567 -1197 2126 -1708 213 1642 -2317 1389 586 -2111 2012 -663 -1092 2012 -1746 288
1806 288 1486 -2377 1442 504 -2045 2059 -715 -896 2043 -1916 451 1371 -2399 1574 350 -1961
1822 -1961 2159 -906 -793 2023 -1985 604 1317 -2383 1733 243 -1879 2178 -1052 -681 1948 -2054
1838 -2054 736 1206 -2341 1792 93 -1782 2145 -1145 -586 1872 -2036 795 1116 -2266 1741 6
1854 6 -1674 2064 -1182 -438 1799 -2031 884 1006 -2224 1780 -104 -1582 2083 -1232 -330 1764
1870 1764 -2064 969 911 -2186 1852 -222 -1452 2124 -1374 -180 1701 -2166 1119 809 -2194 1965
1886 1965 -354 -1371 2125 -1502 -63 1623 -2198 1229 678 -2122 2005 -501 -1271 2097 -1583
1901 -1583 15 1554 -2202 1263 619 -2043 1971 -543 -1169 2013 -1575 114 1468 -2143 1308
1916 1308 522 -1971 1967 -618 -1072 1990 -1608 208 1424 -2112 1361 426 -1899 2008 -731 -957
1932 -957 1976 -1697 333 1333 -2163 1488 271 -1865 2087 -881 -857 1990 -1819 427 1247 -2176
1948 -2176 1549 143 -1771 2113 -1011 -736 1940 -1897 551 1178 -2152 1610 76 -1691 2088
1963 2088 -1060 -655 1880 -1865 599 1109 -2069 1622 -5 -1578 2074 -1110 -565 1840 -1877 662
1979 662 1043 -2032 1635 -82 -1494 2053 -1191 -460 1802 -1923 753 931 -2021 1712 -237 -1420
1995 -1420 2091 -1350 -331 1778 -2025 862 860 -2017 1788 -358 -1318 2112 -1461 -191 1726 -2063
2011 -2063 984 768 -1971 1848 -463 -1230 2118 -1523 -110 1695 -2046 1029 696 -1886 1824 -521
2027 -521 -1128 2043 -1556 -23 1615 -2030 1060 625 -1841 1826 -589 -1049 2009 -1598 45 1532
2043 1532 -2043 1120 501 -1774 1870 -726 -935 2015 -1719 165 1485 -2095 1230 415 -1737 1927
2059 1927 -837 -824 2014 -1815 321 1403 -2089 1360 289 -1675 1993 -960 -730 2001 -1869 395
2075 395 1353 -2077 1375 215 -1591 1954 -1021 -642 1919 -1879 452 1272 -2035 1401 133 -1533
2091 -1533 1920 -1072 -572 1899 -1895 503 1209 -2004 1397 43 -1452 1911 -1157 -449 1855 -1954
2107 -1954 636 1116 -2020 1513 -65 -1390 1974 -1271 -321 1834 -2007 742 1014 -1991 1609 -200
2123 -200 -1269 1998 -1397 -204 1781 -2091 844 939 -1961 1638 -275 -1201 1960 -1467 -154 1690
2139 1690 -2056 894 849 -1903 1639 -363 -1141 1931 -1504 -81 1659 -2043 934 794 -1851 1640
2155 1640 -421 -1070 1882 -1510 25 1601 -2021 1025 702 -1816 1693 -533 -966 1928 -1604 124
2171 124 1554 -2067 1110 570 -1787 1764 -641 -862 1922 -1699 236 1467 -2106 1208 457 -1748
2187 -1748 1823 -746 -789 1894 -1749 296 1372 -2094 1243 386 -1650 1819 -821 -703 1849 -1778
2203 -1778 348 1331 -2032 1286 339 -1611 1797 -839 -667 1803 -1754 417 1279 -1980 1327 242
2219 242 -1524 1819 -953 -590 1795 -1802 513 1211 -2003 1385 125 -1486 1821 -1079 -469 1781
2235 1781 -1872 625 1076 -2013 1461 -32 -1426 1879 -1156 -368 1736 -1917 697 1000 -1981 1523
2251 1523 -93 -1334 1887 -1191 -294 1687 -1912 740 932 -1919 1540 -124 -1254 1869 -1236
2266 -1236 -273 1631 -1890 753 869 -1857 1560 -195 -1209 1830 -1301 -199 1588 -1909 855
2281 855 804 -1845 1594 -321 -1152 1820 -1387 -104 1530 -1909 971 663 -1812 1653 -476 -1049
2297 -1049 1867 -1472 46 1500 -1933 1050 557 -1773 1707 -544 -959 1866 -1492 135 1401
2312 1401 -1936 1102 470 -1710 1738 -605 -905 1844 -1490 141 1332 -1915 1107 431 -1653 1729
2328 1729 -627 -839 1789 -1540 174 1258 -1888 1172 339 -1607 1768 -733 -802 1745 -1584 260
2344 260 1201 -1861 1266 231 -1522 1810 -870 -696 1749 -1650 404 1123 -1855 1371 99 -1497
2360 -1497 1828 -959 -599 1738 -1654 492 1036 -1819 1391 -20 -1423 1855 -1023 -519 1720 -1652
2376 -1652 511 960 -1818 1377 -65 -1345 1831 -1029 -480 1653 -1652 542 873 -1769 1430 -129
2392 -129 -1285 1839 -1071 -425 1610 -1684 590 809 -1688 1508 -215 -1191 1854 -1180 -324 1562
2408 1562 -1696 737 719 -1662 1577 -341 -1125 1856 -1282 -240 1516 -1694 815 616 -1625 1596
2424 1596 -468 -1073 1812 -1335 -149 1447 -1713 846 548 -1607 1573 -512 -1024 1823 -1290 -119
2440 -119 1389 -1669 849 471 -1554 1586 -535 -940 1808 -1322 -83 1367 -1654 892 409 -1500
2456 -1500 1621 -578 -868 1781 -1358 15 1264 -1667 984 316 -1431 1675 -713 -798 1762 -1458
2472 -1458 89 1177 -1657 1065 212 -1377 1676 -822 -717 1710 -1496 187 1121 -1634 1121 127
2488 127 -1342 1684 -855 -676 1694 -1464 229 1074 -1570 1114 93 -1284 1663 -876 -608 1695
2504 1695 -1430 272 1023 -1585 1129 55 -1247 1667 -899 -543 1643 -1454 306 932 -1562 1164
2520 1164 -70 -1173 1694 -991 -452 1568 -1518 415 845 -1555 1242 -159 -1098 1696 -1076 -391
2536 -391 1490 -1547 506 743 -1503 1314 -234 -1045 1688 -1108 -314 1473 -1525 556 737 -1447
2552 -1447 1309 -257 -1000 1649 -1096 -288 1434 -1494 605 696 -1440 1300 -307 -971 1632 -1124
2568 -1124 -243 1386 -1496 622 594 -1423 1315 -370 -905 1605 -1167 -124 1316 -1520 704 491
2584 491 -1390 1370 -471 -840 1614 -1201 -47 1219 -1517 803 398 -1332 1422 -551 -725 1602
2600 1602 -1260 24 1169 -1506 854 355 -1288 1433 -569 -722 1526 -1247 64 1107 -1484
2615 -1484 864 295 -1258 1414 -619 -697 1509 -1248 92 1067 -1473 879 255 -1236 1386 -655
2631 -655 -636 1463 -1266 182 992 -1456 949 151 -1189 1427 -699 -531 1443 -1279 273 917 -1445
2648 -1445 1004 65 -1097 1448 -789 -455 1387 -1314 363 832 -1439 1056 4 -1056 1436 -804
2664 -804 -405 1324 -1327 374 762 -1393 1067 -40 -1038 1417 -831 -376 1279 -1323 412 738
2680 738 -1385 1070 -66 -1001 1397 -831 -335 1233 -1290 481 665 -1344 1117 -137 -935 1392
2696 1392 -884 -239 1183 -1308 562 594 -1305 1151 -212 -862 1373 -915 -125 1089 -1327 648
2712 648 481 -1292 1178 -288 -821 1348 -957 -99 1028 -1330 678 418 -1263 1191 -314 -775
2728 -775 1315 -964 -39 1008 -1300 685 390 -1229 1201 -318 -763 1288 -931 -12 959 -1280
2744 -1280 734 375 -1196 1207 -358 -698 1268 -956 50 902 -1280 787 283 -1160 1220 -425
2760 -425 -638 1199 -995 130 810 -1271 844 172 -1107 1236 -509 -568 1166 -1022 223 735 -1259
2777 -1259 876 126 -1069 1224 -514 -508 1145 -1013 257 694 -1223 909 99 -1040 1227 -524
2793 -524 -487 1116 -1006 271 683 -1200 901 61 -1008 1215 -538 -451 1063 -1013 318 615 -1199
2810 -1199 938 -3 -966 1195 -592 -376 1022 -1026 379 522 -1173 991 -79 -912 1186 -657
2826 -657 -294 954 -1066 463 471 -1145 1013 -136 -842 1188 -675 -222 920 -1030 508 411 -1123
2843 -1123 1031 -172 -797 1158 -688 -199 902 -1043 518 402 -1091 1005 -164 -797 1114 -682
2859 -682 -157 833 -1039 551 352 -1080 1029 -232 -768 1125 -718 -105 798 -1025 598 270 -1042
2876 -1042 1051 -292 -669 1084 -767 -6 756 -1023 671 192 -994 1077 -342 -592 1073 -785
2892 -785 57 686 -1024 683 160 -943 1065 -387 -545 1032 -799 90 666 -1015 700 121 -929
2909 -929 1063 -394 -547 993 -809 93 621 -991 707 90 -907 1048 -469 -506 973 -818 159
2926 159 606 -981 727 49 -862 1064 -462 -385 939 -853 250 539 -981 789 1 -819 1042
2943 1042 -485 -302 910 -873 269 481 -954 825 -81 -793 1021 -537 -298 817 -902 354
2959 354 423 -938 790 -84 -730 1001 -580 -284 803 -863 336 394 -919 804 -120 -692 974
2976 974 -582 -208 799 -859 366 394 -885 810 -162 -671 990 -616 -134 777 -871 446 304
2993 304 -863 855 -257 -584 933 -627 -15 679 -847 514 282 -876 833 -323 -597 881
3009 881 -699 -1 665 -880 487 201 -831 835 -303 -505 905 -684 28 627 -883 511 185
3026 185 -798 846 -285 -438 889 -695 42 615 -890 531 178 -776 856 -305 -427 854 -700
3043 -700 82 587 -866 558 141 -724 838 -366 -364 808 -741 134 522 -858 617 73 -697 818
3061 818 -425 -308 763 -756 196 484 -833 611 11 -656 814 -455 -238 760 -754 250 478
3078 478 -835 622 8 -626 807 -430 -207 755 -746 258 440 -838 617 8 -598 820 -454
3095 -454 -180 721 -783 258 422 -817 610 -25 -564 776 -483 -140 677 -811 316 378 -806
3112 -806 648 -80 -518 753 -539 -90 637 -807 366 321 -755 678 -131 -450 741 -571 -8
3129 -8 620 -793 414 299 -751 661 -159 -433 722 -563 20 591 -792 417 266 -755 644
3146 644 -175 -422 716 -567 29 587 -808 408 239 -741 647 -185 -375 699 -590 53 533 -821
3164 -821 432 205 -698 669 -224 -327 685 -616 111 487 -796 479 168 -635 668 -279 -253 642
3182 642 -649 181 453 -762 530 130 -604 672 -295 -243 620 -651 208 437 -746 516 92 -600
3200 -600 632 -337 -213 615 -655 216 436 -771 511 75 -592 631 -327 -188 601 -643 234 404
3218 404 -746 512 45 -542 637 -350 -119 588 -662 276 344 -734 542 7 -474 638 -369 -68
3236 -68 537 -663 314 298 -698 573 -53 -441 621 -417 -54 499 -673 327 259 -664 569 -74 -415
3255 -415 592 -441 -25 486 -671 347 250 -665 575 -86 -418 592 -433 -9 490 -646 360
3272 360 234 -641 569 -106 -371 582 -440 30 463 -650 395 184 -631 566 -150 -324 583 -457
3290 -457 72 415 -643 404 117 -565 579 -202 -275 559 -488 107 362 -650 421 91 -534 563
3308 563 -226 -230 543 -509 123 347 -624 445 93 -519 569 -234 -221 539 -511 126 354 -603 444
3327 444 78 -487 575 -252 -204 526 -504 156 331 -584 451 24 -477 552 -289 -180 497 -517 181
3346 181 285 -573 443 -32 -429 538 -334 -119 476 -534 212 237 -571 452 -63 -385 543 -332 -71
3365 -71 454 -522 236 218 -539 469 -61 -330 554 -357 -54 450 -525 245 228 -514 473 -75 -339 541 -356
3386 -356 -58 425 -526 250 191 -509 459 -110 -335 519 -397 -37 410 -532 274 172 -477 454 -152 -281
3406 -281 500 -403 22 375 -507 301 114 -444 477 -200 -241 502 -420 61 353 -496 318 89 -419 477
3426 477 -209 -198 506 -410 75 342 -510 316 74 -421 476 -217 -198 482 -446 71 313 -495 313 48 -392
3447 -392 471 -248 -181 470 -450 86 319 -486 310 25 -366 484 -273 -133 456 -452 128 268 -469 358
3467 358 -5 -322 474 -296 -96 440 -457 164 245 -441 360 -58 -282 470 -328 -71 414 -469 171 218 -435
3488 -435 367 -82 -277 459 -338 -66 407 -471 165 204 -437 352 -90 -260 457 -349 -39 403 -466 186
3508 186 192 -410 371 -104 -248 449 -357 -8 379 -456 217 179 -388 385 -137 -194 450 -377 35 352 -442
3529 -442 240 126 -352 386 -186 -152 415 -408 67 313 -458 251 78 -339 384 -211 -141 414 -407 71 299
3550 299 -441 262 76 -333 383 -205 -124 409 -396 82 300 -431 269 62 -312 399 -217 -114 405 -409
3570 -409 102 290 -429 283 40 -277 383 -236 -86 385 -415 138 243 -412 290 -9 -271 377 -274 -45
3590 -45 357 -427 154 209 -408 294 -38 -236 365 -290 -20 338 -429 181 197 -385 314 -52 -215 375 -281
3611 -281 1 348 -412 175 184 -376 316 -53 -201 379 -286 1 329 -416 186 184 -368 317 -88 -205 364
3632 364 -312 15 300 -423 207 144 -351 324 -115 -177 349 -336 49 276 -418 228 98 -329 327 -135 -125
3653 -125 349 -335 80 259 -401 252 80 -305 347 -150 -111 359 -330 94 242 -381 266 64 -293 332
3673 332 -170 -109 347 -343 85 240 -398 249 55 -303 344 -171 -106 340 -340 92 214 -397 260 5 -282
3694 -282 344 -211 -96 328 -361 123 173 -359 287 -24 -262 358 -230 -57 296 -359 133 150 -409 290 -45
3715 -45 -232 360 -249 -88 329 -324 152 136 -352 299 -44 -213 353 -249 -33 304 -356 177 120 -350 301
3736 301 -77 -212 357 -257 -16 285 -363 172 113 -338 320 -94 -194 369 -265 14 265 -363 198 95
3756 95 -309 339 -113 -150 359 -278 39 252 -336 240 64 -288 348 -139 -136 341 -289 27 205 -302 187
3777 187 -25 -294 335 -148 -123 345 -305 61 201 -339 250 9 -278 339 -198 -127 338 -305 64 213 -344
3798 -344 247 4 -267 361 -186 -94 332 -317 92 197 -329 265 -24 -248 372 -206 -84 335 -316 115
3818 115 159 -331 281 -61 -215 365 -238 -55 285 -340 136 125 -310 292 -80 -217 357 -263 -48 264 -342
3839 -342 154 112 -294 293 -114 -191 367 -275 -40 286 -336 161 115 -296 299 -114 -183 371 -263 -14 303
3860 303 -330 176 99 -276 318 -131 -164 374 -278 3 279 -322 190 64 -280 320 -166 -150 360 -285 18
3881 18 240 -331 192 30 -265 330 -187 -128 349 -310 47 218 -325 221 19 -239 343 -186 -111 344 -311
3902 -311 65 229 -324 232 25 -225 356 -193 -107 345 -322 68 217 -322 240 8 -237 352 -212 -105
3922 -105 331 -329 80 204 -326 241 -32 -233 331 -243 -72 310 -335 108 166 -314 260 -64 -202 350
3942 350 -243 -34 323 -327 117 144 -296 273 -74 -164 363 -246 -16 322 -332 147 139 -290 290 -73 -169 370
3964 370 -263 -25 291 -337 146 132 -301 295 -93 -176 356 -286 -1 293 -348 147 119 -297 302 -109 -168
3985 -168 347 -294 -3 293 -339 181 96 -282 300 -140 -140 348 -308 43 267 -337 216 70 -276 332 -141
4006 -141 -109 346 -303 65 243 -345 226 50 -269 333 -171 -115 333 -321 61 232 -361 219 32 -279 324
4027 324 -172 -113 341 -335 74 219 -359 241 21 -277 350 -182 -91 344 -323 92 208 -350 260 18 -252
4048 -252 354 -207 -74 335 -346 121 209 -335 263 -18 -241 339 -226 -54 305 -338 143 160 -339 289 -59
4069 -59 -246 347 -246 -45 287 -349 154 142 -355 288 -73 -229 351 -240 -34 302 -349 158 142 -344 299
4090 299 -69 -213 357 -265 -27 297 -349 173 125 -333 333 -75 -210 373 -263 -16 280 -353 197 111 -323
4111 -323 336 -87 -192 357 -288 2 243 -351 216 72 -309 333 -123 -175 340 -289 33 237 -355 221
4131 221 52 -307 364 -154 -154 353 -286 35 240 -351 208 47 -311 353 -144 -133 358 -282 65 233 -364
4152 -364 258 39 -312 368 -163 -167 358 -294 72 204 -356 267 -11 -270 416 -147 -135 352 -310 56 148
4173 148 -357 279 9 -316 351 -204 -82 292 -278 119 223 -309 284 -27 -254 377 -212 -93 307 -310
4193 -310 122 166 -328 312 -38 -256 375 -194 -84 310 -312 141 151 -352 306 -44 -259 381 -212 -86 304
4214 304 -324 141 136 -337 318 -79 -246 364 -230 -63 283 -318 151 107 -344 340 -87 -232 373 -233 -36
4235 -36 275 -326 182 98 -326 341 -101 -204 377 -244 -9 272 -315 205 82 -296 357 -114 -203 359 -258
4256 -258 3 243 -336 205 64 -318 350 -124 -210 370 -278 -5 255 -349 214 55 -321 364 -137 -184 365
4277 365 -275 9 233 -329 234 40 -295 359 -137 -177 369 -268 47 232 -323 256 21 -268 377 -148
4297 -148 -143 349 -289 69 199 -336 249 -15 -283 373 -171 -130 336 -292 81 175 -343 252 -14 -274 365
4318 365 -193 -138 329 -304 82 193 -348 283 -10 -276 396 -175 -117 340 -303 103 169 -333 296 -22 -255
4339 -255 383 -193 -96 344 -297 125 155 -309 297 -44 -244 372 -223 -71 309 -307 137 138 -321 309 -70
4360 -70 -229 365 -228 -63 289 -324 136 121 -324 309 -83 -220 360 -242 -50 281 -322 166 112 -310 312
4381 312 -79 -212 368 -247 -34 287 -323 174 120 -314 330 -90 -199 372 -241 -8 284 -335 180 95 -296
4402 -296 325 -106 -182 351 -270 -9 242 -333 195 58 -293 313 -144 -166 316 -278 16 232 -329 208 53
4423 53 -277 322 -138 -146 331 -279 38 231 -332 231 56 -269 333 -132 -131 327 -270 62 232 -325 232 39
4445 39 -282 327 -145 -123 320 -289 72 210 -340 228 28 -267 334 -159 -115 310 -290 84 193 -341 236
4466 236 2 -256 319 -173 -79 295 -306 102 166 -327 247 5 -235 319 -180 -70 278 -302 113 174 -312
4487 -312 263 -12 -231 333 -187 -71 290 -307 122 163 -318 275 -21 -234 317 -190 -48 281 -320 130
4507 130 148 -341 272 -37 -230 308 -213 -48 263 -327 131 135 -323 274 -47 -194 315 -218 -26 256 -306
4528 -306 156 120 -296 283 -50 -186 319 -212 2 237 -306 174 104 -294 291 -57 -155 295 -227 2 235
4549 235 -319 186 107 -297 291 -82 -177 295 -241 2 229 -334 182 90 -296 286 -91 -170 305 -256 36
4570 36 228 -329 196 78 -291 301 -84 -149 286 -246 65 221 -321 221 74 -269 298 -103 -129 289 -256
4591 -256 63 201 -325 209 47 -265 297 -109 -117 273 -270 69 191 -335 225 39 -274 301 -123 -113 271
4612 271 -281 72 189 -334 243 41 -263 293 -145 -113 277 -286 99 191 -327 240 41 -249 304 -131 -90
4633 -90 278 -275 118 171 -313 254 16 -250 316 -148 -83 255 -289 125 150 -317 253 -14 -232 289 -169
4654 -169 -52 236 -297 122 136 -305 259 -16 -218 296 -183 -47 245 -294 133 137 -304 260 -13 -201 309
4675 309 -184 -38 246 -303 161 128 -302 286 -17 -196 305 -202 -25 255 -297 164 122 -299 268 -48 -189
4696 -189 288 -205 -18 221 -303 153 109 -301 267 -64 -177 277 -218 2 219 -297 170 81 -284 267 -67
4717 -67 -158 287 -213 23 206 -297 191 83 -265 286 -67 -145 287 -221 30 219 -301 202 86 -270 302
4738 302 -86 -139 291 -232 38 199 -297 188 56 -262 284 -115 -146 267 -256 28 182 -311 206 37 -241
4759 -241 267 -108 -125 282 -241 41 196 -274 207 23 -227 289 -123 -104 288 -265 108 95 -307 217 41
4780 41 -247 283 -136 -75 255 -245 67 165 -293 223 5 -235 280 -145 -95 259 -273 75 157 -296 215 -4
4802 -4 -221 289 -165 -75 269 -267 84 145 -275 227 -7 -204 280 -159 -58 257 -263 97 137 -271 243 -27
4824 -27 -186 282 -166 -34 258 -251 119 140 -258 231 -39 -179 284 -189 -28 246 -266 116 127 -270 227
4845 227 -61 -176 275 -192 -28 244 -286 115 107 -268 239 -59 -165 284 -201 -30 234 -285 126 89 -255
4866 -255 248 -63 -149 289 -208 0 232 -262 131 91 -236 250 -83 -128 274 -210 5 212 -273 160 81
4887 81 -207 250 -90 -139 268 -237 -24 186 -246 140 69 -218 217 -91 -107 266 -204 42 147 -227 119
4908 119 30 -201 255 -128 -111 268 -227 33 199 -265 172 47 -218 267 -107 -81 283 -231 42 185 -251
4929 -251 177 27 -205 256 -133 -76 263 -230 43 162 -262 167 6 -190 247 -163 -72 242 -248 46 150
4950 150 -246 178 6 -175 234 -153 -62 234 -239 73 151 -243 183 -23 -188 278 -164 -81 242 -255 93
4971 93 133 -223 204 -29 -163 259 -167 -26 236 -246 80 135 -229 181 -32 -163 245 -168 -39 232 -255
4992 -255 84 102 -222 185 -42 -138 241 -177 -31 208 -240 100 97 -224 195 -44 -134 241 -175 -4 206 -237
5014 -237 109 96 -200 203 -48 -118 242 -183 6 204 -222 111 102 -197 199 -63 -113 243 -184 -3 195 -236
5036 -236 111 77 -205 199 -64 -122 233 -198 8 178 -233 116 74 -197 202 -73 -100 226 -193 18 176
5057 176 -221 116 62 -175 208 -84 -80 223 -175 35 158 -209 134 44 -170 200 -74 -66 218 -178 32 160
5079 160 -216 141 47 -166 194 -89 -89 200 -194 28 140 -214 139 21 -182 201 -104 -82 210 -201 33
5100 33 135 -209 143 25 -155 199 -97 -67 192 -184 38 132 -193 148 26 -143 199 -108 -48 196 -174
5121 -174 59 112 -190 150 7 -127 198 -115 -47 184 -184 50 103 -196 146 -16 -143 189 -120 -53 180
5142 180 -182 56 96 -208 150 -13 -151 185 -126 -40 167 -182 67 98 -186 169 -12 -135 194 -113 -26
5163 -26 169 -175 74 72 -177 166 -31 -121 198 -121 -31 145 -171 79 74 -183 153 -36 -131 170 -122 -22 135
5186 135 -175 84 55 -166 154 -23 -109 180 -134 -15 140 -176 90 51 -171 163 -33 -113 191 -118 6
5207 6 140 -166 108 48 -160 167 -51 -99 188 -121 12 121 -158 103 43 -161 171 -44 -108 164 -120 -5
5229 -5 104 -171 100 26 -143 166 -60 -90 155 -131 3 97 -166 108 29 -130 150 -61 -86 157 -125 11
5251 11 103 -150 118 22 -146 172 -61 -68 165 -127 31 102 -142 108 20 -131 174 -56 -86 156 -121 35 105
5274 105 -161 116 7 -154 161 -76 -77 148 -139 18 70 -158 113 0 -136 156 -71 -62 126 -131 37 67
5296 67 -140 117 -4 -114 149 -70 -49 129 -111 42 69 -130 135 2 -112 148 -78 -37 130 -119 58
5317 58 75 -139 130 -9 -119 162 -75 -39 133 -142 49 57 -146 119 -33 -108 157 -85 -34 119 -122 67
5339 67 49 -138 125 -31 -97 140 -86 -29 116 -114 62 53 -119 115 -13 -79 147 -77 -19 111 -115 77 50
5362 50 -125 122 -28 -81 147 -65 -4 104 -119 63 32 -119 113 -26 -94 140 -96 -22 92 -133 64 39
5384 39 -129 127 -35 -92 135 -90 6 98 -110 78 41 -128 129 -34 -71 135 -93 10 102 -106 84 27 -119
5407 -119 137 -29 -40 146 -76 -35 78 -127 103 11 -167 116 -40 -90 119 -107 4 81 -132 78 14 -107
5429 -107 124 -53 -46 123 -98 9 67 -131 85 7 -91 128 -54 -65 113 -111 20 84 -115 93 13 -90 141
5452 141 -49 -45 120 -103 36 67 -113 95 0 -86 125 -53 -45 112 -97 29 63 -110 91 -9 -89 108 -68
5475 -68 -21 94 -96 42 48 -117 80 -14 -81 103 -71 -22 131 -113 42 59 -56 57 -8 -92 109 -44 -19 103
5499 103 -98 45 47 -94 97 -13 -72 125 -82 -13 90 -104 62 46 -94 96 -19 -63 114 -81 -7 77 -110
5522 -110 64 37 -83 145 -21 -40 121 -119 -55 48 -141 58 30 -102 97 -17 -55 84 -79 16 76 -102
5544 -102 55 24 -91 98 -27 -41 110 -77 18 77 -106 68 15 -74 90 -23 -46 108 -96 34 50 -94 52
5567 52 23 -69 87 -25 -52 65 -92 32 52 -64 50 65 -68 122 -67 -32 72 -90 9 59 -105 73 5
5590 5 -70 91 -42 -22 79 -86 48 52 -83 50 0 -78 101 -38 -22 101 -81 9 63 -91 57 10 -86 77
5614 77 -56 -27 54 -102 45 36 -124 84 -5 -82 53 -72 -12 75 -103 17 28 -92 56 -7 -25 67 -51 -10 61
5639 61 -83 45 37 -71 64 -6 -38 88 -58 11 64 -84 57 29 -62 79 -5 -30 65 -52 20 52 -80 45 24
5664 24 -62 64 -27 -32 60 -73 11 44 -89 51 22 -75 56 -37 -34 56 -87 14 38 -86 48 5 -65 74 -24 -8
5690 -8 57 -65 40 45 -73 48 8 -59 69 -30 -22 69 -64 40 33 -74 50 -1 -46 56 -32 -11 49 -78 32 25 -66
5717 -66 54 -6 -38 61 -51 -11 47 -66 34 15 -77 48 -16 -50 59 -45 -8 57 -58 46 28 -68 71 -14 -31
5742 -31 67 -32 41 34 -64 44 17 -61 74 -2 -21 30 -50 10 0 -96 76 7 -139 55 -20 -24 37 -62 -2 42 -71 46
5770 46 2 -36 52 -16 -19 56 -48 31 34 -50 47 15 -45 67 -27 -11 39 -47 16 34 -52 59 6 -35 69 -24 8 55 -48
5799 -48 30 33 -48 56 3 -32 57 -45 -5 48 -53 18 14 -46 49 -15 -40 51 -37 -3 40 -41 36 12 -44 48 -19 -17 49 -34
5829 -34 5 44 -49 40 27 -31 49 -11 -10 47 -29 21 56 -36 45 10 -40 54 -20 -3 65 -39 25 33 -48 47 7 -44 54 -23 -16
5860 -16 41 -48 14 14 -55 39 -4 -38 49 -42 -10 40 -52 19 21 -42 49 4 -22 49 -45 0 31 -44 32 21 -42 42 -8 -9 59 -35
5892 -35 5 50 -35 28 27 -34 49 -10 -29 54 -28 2 42 -48 27 6 -56 36 -23 -30 46 -46 -2 24 -67 23 -2 -54 41 -13 -23
5923 -23 35 -52 13 28 -51 32 -2 -48 37 -33 -6 38 -38 26 44 -60 33 1 -32 49 -17 -5 50 -40 19 21 -49 23 -3 -40
5953 -40 29 -45 -12 38 -53 24 9 -39 27 -6 -33 41 -46 -3 28 -56 16 22 -56 44 -8 -36 51 -39 6 34 -57 38 22 -52
5983 -52 54 -6 -23 50 -43 18 46 -57 33 22 -42 55 -14 -34 52 -51 7 22 -64 37 9 -45 42 -16 -28 41 -50 14
6011 14 26 -66 26 1 -53 46 -22 -19 46 -55 14 40 -56 39 17 -40 54 -19 -13 58 -44 22 27 -48 54 17 -33 72 -12 -3
6041 -3 58 -49 26 30 -60 45 -4 -53 56 -39 -5 42 -72 30 26 -64 51 -12 -51 45 -46 -8 36 -70 33 10 -56 56
6069 56 -17 -36 62 -36 -2 53 -65 47 16 -53 52 -18 -37 74 -48 29 60 -70 33 35 -34 89 35 -124 105 -39
6095 -39 32 63 -72 49 13 -75 67 -26 -31 58 -61 12 35 -84 44 11 -68 71 -39 -47 55 -59 14 37 -68 65
6121 65 0 -49 78 -31 -19 70 -70 20 42 -70 65 4 -59 87 -29 -18 62 -62 35 39 -71 72 3 -56 72
6146 72 -45 -15 67 -70 24 36 -94 70 -8 -58 71 -56 -26 63 -77 29 31 -88 63 -7 -61 79 -32 -1 79
6171 79 -84 35 37 -64 79 -19 -42 80 -47 11 77 -74 43 34 -78 79 -17 -57 80 -69 -7 62 -91 37
6195 37 19 -72 76 -30 -54 80 -71 0 51 -104 43 13 -93 60 -46 -51 89 -88 4 67 -95 59 14 -74
6219 -74 79 -36 -35 91 -85 19 67 -94 58 24 -74 106 -30 -34 90 -75 18 61 -94 65 3 -75 90 -59
6243 -59 -33 89 -87 11 44 -103 56 -3 -76 89 -59 -38 86 -92 28 54 -113 68 -6 -77 109 -55 -25 97
6267 97 -92 26 53 -99 86 -3 -63 101 -60 -13 96 -91 49 62 -106 90 -11 -70 122 -70 -25 94 -116
6290 -116 32 53 -102 73 -29 -71 100 -72 -14 84 -111 41 46 -112 84 -31 -69 98 -81 -12 94 -106 51
6313 51 56 -106 101 -32 -63 111 -90 0 94 -108 50 41 -109 110 -26 -54 119 -86 -2 88 -117 69 39 -102
6337 -102 114 -38 -66 112 -103 4 95 -124 67 33 -112 102 -41 -57 97 -108 7 64 -130 75 24 -95
6359 -95 109 -62 -42 117 -103 27 89 -124 87 16 -110 123 -45 -37 121 -107 32 85 -119 99 16 -95 125
6382 125 -56 -40 115 -115 41 79 -134 93 8 -100 128 -62 -36 114 -127 27 69 -141 91 -8 -95 122
6404 122 -87 -34 106 -121 45 76 -126 103 -2 -98 133 -84 -14 117 -119 52 64 -128 114 -2 -84 133
6426 133 -73 -9 119 -133 55 56 -135 102 -24 -78 138 -95 -15 113 -145 54 55 -137 123 -21 -85 119 -105
6449 -105 -18 102 -136 70 50 -136 126 -40 -89 139 -108 -7 101 -140 81 51 -127 135 -37 -65 141 -107
6471 -107 22 116 -133 94 49 -125 130 -57 -58 130 -114 3 92 -140 76 33 -140 135 -52 -61 134 -127 7
6494 7 98 -161 82 9 -133 129 -77 -65 128 -132 18 93 -159 98 13 -121 158 -61 -57 132 -136 17 78
6517 78 -155 103 10 -111 121 -76 -37 146 -122 32 93 -152 99 -1 -116 133 -80 -47 125 -141 31 81
6539 81 -148 108 -4 -117 142 -94 -50 130 -135 34 71 -148 109 -6 -115 155 -84 -27 146 -146 49
6560 49 73 -140 124 -2 -116 148 -86 -27 147 -134 68 84 -148 132 -5 -108 158 -91 -24 134 -151 63
6582 63 66 -151 130 -31 -115 157 -101 -29 130 -157 50 39 -160 129 -38 -99 156 -112 -18 133 -145 74 57
6605 57 -139 149 -37 -93 155 -128 -2 123 -154 78 53 -152 139 -50 -85 158 -119 -1 129 -170 86
6626 86 48 -157 151 -48 -88 161 -126 -2 128 -162 82 39 -152 141 -71 -88 156 -137 -2 121 -164 97
6648 97 38 -151 160 -54 -72 164 -131 19 129 -160 96 31 -128 171 -70 -69 179 -126 23 120 -163 109
6670 109 24 -145 156 -89 -65 158 -147 26 115 -173 107 7 -139 159 -91 -74 160 -156 23 99 -172 113
6692 113 11 -140 171 -84 -70 167 -153 37 101 -164 117 4 -117 176 -97 -39 166 -149 41 87 -164
6713 -164 124 -3 -127 173 -104 -49 159 -159 46 89 -180 127 -13 -127 172 -119 -44 154 -170 55 80
6734 80 -169 132 -30 -122 174 -109 -39 152 -179 62 86 -168 141 -39 -119 179 -120 -24 149 -172 66 77
6756 77 -170 155 -31 -105 179 -113 -25 164 -170 82 72 -157 148 -39 -105 180 -127 -15 156 -167 75 62
6778 62 -160 154 -34 -108 185 -139 -22 135 -185 81 56 -164 156 -62 -91 184 -143 -5 140 -188 92
6799 92 60 -155 166 -62 -96 172 -147 -5 138 -172 93 42 -155 161 -56 -97 185 -156 2 135 -184 96
6821 96 44 -158 160 -66 -95 171 -162 0 125 -188 105 27 -151 161 -78 -74 185 -159 11 119 -190 114
6843 114 17 -153 176 -86 -81 182 -165 31 127 -176 130 26 -157 185 -96 -68 186 -161 43 121 -192 136
6865 136 5 -156 187 -96 -68 179 -175 42 109 -198 122 -3 -152 180 -101 -64 163 -181 37 103 -207
6886 -207 130 5 -146 193 -102 -55 183 -178 60 95 -182 139 -10 -140 191 -113 -42 171 -172 77 100
6907 100 -174 158 -8 -121 192 -126 -63 133 -186 80 120 -214 181 -41 -139 197 -129 -25 170 -199 75
6928 75 74 -202 154 -43 -135 181 -126 -28 162 -202 89 63 -194 167 -34 -116 187 -133 -19 145 -195 94
6950 94 78 -182 175 -37 -106 204 -134 -12 149 -189 93 50 -182 182 -56 -111 194 -151 -4 144 -193 112
6972 112 42 -187 174 -66 -116 179 -154 13 135 -200 114 26 -184 186 -69 -90 199 -162 6 134 -188
6993 -188 118 34 -181 188 -67 -94 204 -142 32 129 -195 135 36 -168 202 -77 -87 185 -162 32 123 -196
7015 -196 123 19 -161 188 -87 -81 176 -184 28 105 -207 138 -2 -181 196 -95 -67 186 -187 52 111 -211
7037 -211 152 1 -159 200 -107 -53 185 -167 58 107 -191 169 1 -154 196 -93 -57 173 -174 67 105
7058 105 -207 160 -11 -151 201 -104 -51 153 -168 87 72 -198 140 -39 -146 194 -117 -57 155 -199 64
7079 64 76 -193 170 -23 -145 197 -128 -33 153 -194 86 69 -196 179 -51 -134 204 -126 -19 158 -184 102
7101 102 79 -185 184 -45 -128 204 -129 -15 154 -200 114 52 -188 181 -57 -124 192 -152 -19 129 -198
7122 -198 103 56 -199 175 -62 -124 194 -144 2 145 -198 110 51 -187 198 -64 -113 199 -145 11 138
7143 138 -196 128 35 -178 193 -55 -103 197 -155 20 120 -205 133 25 -176 203 -90 -93 199 -160 16
7164 16 127 -201 131 24 -171 187 -101 -95 181 -174 26 126 -205 137 10 -167 187 -109 -82 182 -168
7185 -168 47 118 -194 139 13 -160 201 -93 -54 193 -176 60 110 -197 151 2 -153 195 -99 -64 185
7206 185 -183 60 99 -202 157 -10 -151 195 -117 -65 172 -183 66 92 -194 149 -21 -150 200 -136 -54
7227 -54 175 -189 58 84 -184 165 -23 -139 197 -127 -26 169 -188 82 83 -191 180 -23 -127 195 -119
7248 -119 -17 161 -188 80 78 -183 165 -32 -130 196 -135 -12 159 -191 90 59 -192 171 -49 -122 194 -156
7270 -156 -8 148 -196 104 54 -180 177 -48 -109 192 -144 4 147 -198 108 55 -190 179 -60 -99 201
7291 201 -148 13 139 -201 120 56 -170 177 -65 -90 175 -162 12 133 -198 117 47 -180 170 -70 -86
7312 -86 175 -161 10 116 -200 113 19 -163 180 -94 -80 167 -166 28 124 -196 124 20 -157 184 -86
7333 -86 -63 182 -171 49 131 -182 145 12 -141 203 -95 -62 182 -168 37 119 -197 101 47 -136 173 -118
7355 -118 -102 179 -206 37 92 -226 129 13 -148 133 -118 -54 194 -222 81 76 -180 154 -52 -156 130 -181
7377 -181 -27 103 -132 45 107 -138 143 -31 -221 137 -94 6 151 -201 61 56 -175 189 -39 -113 208
7398 208 -138 -5 157 -192 86 74 -197 147 -26 -119 174 -127 -34 157 -199 82 75 -192 148 -51 -116 171
7420 171 -146 -18 152 -197 81 63 -180 151 -45 -99 173 -143 4 147 -192 98 65 -166 162 -48 -87
7441 -87 179 -136 9 139 -191 107 55 -159 157 -60 -87 172 -156 23 123 -199 103 43 -179 155 -83
7462 -83 -95 166 -164 15 143 -206 99 22 -138 141 -77 -67 193 -207 74 69 -157 176 78 -120 142 -36
7484 -36 -104 104 -125 -23 161 -230 140 33 -195 163 -78 -62 167 -158 41 100 -182 135 27 -141 169
7505 169 -91 -65 156 -178 44 97 -198 123 1 -139 164 -104 -55 148 -178 46 95 -183 127 -4 -127
7526 -127 177 -108 -33 155 -162 74 84 -184 148 -13 -133 169 -109 -33 143 -165 67 77 -179 145 -27
7547 -27 -115 169 -119 -20 128 -184 68 64 -185 138 -30 -127 165 -127 -20 139 -186 72 64 -168 153 -46 -106
7570 -106 166 -131 -6 131 -178 86 58 -162 152 -38 -103 170 -121 3 131 -175 90 56 -164 153 -51
7591 -51 -103 174 -130 -8 136 -174 103 33 -156 145 -67 -84 171 -128 -8 101 -193 88 18 -164 148 -77
7613 -77 -119 152 -125 2 88 -184 108 24 -172 133 -68 -53 146 -131 -1 129 -99 170 8 -167 180 -94
7635 -94 -62 155 -150 25 101 -158 123 10 -137 158 -88 -70 153 -150 23 97 -182 109 7 -136 165 -85
7657 -85 -72 151 -150 32 85 -168 124 -1 -125 168 -95 -43 159 -146 50 80 -150 145 -10 -111 171 -89
7679 -89 -21 151 -145 60 77 -153 135 -22 -121 162 -110 -28 145 -159 59 69 -157 137 -32 -110 156 -114
7701 -114 -26 130 -160 80 67 -147 134 -26 -116 167 -106 -19 137 -160 73 59 -152 144 -35 -87 176 -103
7723 -103 -11 135 -147 80 48 -137 144 -51 -95 159 -125 -3 123 -145 98 46 -129 152 -69 -85 157 -147
7745 -147 4 114 -161 90 35 -134 146 -67 -80 154 -130 17 123 -156 97 6 -137 150 -70 -62 159 -123
7767 -123 21 117 -143 100 26 -116 160 -68 -48 151 -132 23 106 -145 100 19 -110 157 -88 -37 159 -120
7789 -120 35 94 -149 105 -5 -111 152 -92 -46 151 -141 39 85 -150 111 -7 -114 149 -96 -40 140
7810 140 -151 44 75 -140 119 -16 -105 154 -96 -30 141 -137 53 82 -134 129 -15 -91 157 -97 -4 154
7832 154 -140 63 67 -134 123 -27 -88 155 -112 -19 131 -136 64 59 -139 114 -30 -83 156 -115 -11 123
7854 123 -145 61 39 -121 131 -43 -66 144 -108 7 119 -131 83 50 -114 133 -48 -67 146 -113 4
7875 4 114 -136 71 41 -115 126 -55 -66 140 -115 14 100 -139 77 15 -113 123 -72 -67 128 -138 9 95
7898 95 -142 79 18 -129 119 -62 -56 133 -117 24 99 -137 85 -1 -105 135 -70 -42 137 -120 41 84 -131
7921 -131 109 15 -97 125 -74 -34 114 -115 39 77 -134 96 3 -108 124 -79 -39 120 -130 36 56 -133
7943 -133 104 -13 -111 119 -87 -38 111 -132 40 61 -124 106 -17 -87 128 -83 -28 112 -121 56 62 -125
7965 -125 117 -23 -78 139 -90 -3 117 -131 61 51 -125 118 -22 -68 131 -97 -11 96 -128 73 42 -127
7987 -127 114 -32 -84 122 -91 -11 89 -134 59 35 -116 123 -38 -61 125 -106 6 98 -124 71 43 -115
8009 -115 118 -26 -62 140 -93 16 84 -109 86 32 -109 130 -42 -49 131 -103 29 88 -119 93 19 -106
8031 -106 119 -57 -54 119 -108 26 76 -124 98 -4 -108 116 -61 -43 111 -122 20 54 -133 88 -16 -107
8053 -107 119 -52 -47 110 -121 37 64 -115 102 7 -86 134 -66 -27 104 -110 44 47 -115 104 -8 -96 122
8076 122 -74 -24 103 -112 41 45 -131 110 -13 -92 105 -86 -32 103 -120 50 34 -113 105 -34 -91 124
8098 124 -87 -20 91 -116 55 23 -103 113 -26 -72 120 -85 -9 95 -125 57 28 -105 120 -37 -73 126
8120 126 -83 2 83 -116 63 31 -98 119 -34 -78 111 -95 -8 65 -111 67 13 -107 113 -53 -68 105 -104
8143 -104 6 64 -111 61 -7 -102 106 -51 -55 107 -98 28 70 -106 94 14 -84 119 -59 -36 99 -86 17
8166 17 69 -100 91 3 -85 113 -62 -35 107 -103 26 43 -117 82 -11 -100 110 -63 -38 100 -111 27 43
8189 43 -119 91
8191I1
##END NTUPLES=NMR FID
##END=
