##TITLE=1H_LY-11Dix.2B
 CD3CN, 8 sc, 
 1.06.2021
##JCAMPDX= 6.0         $$ Bruker NMR JCAMP-DX V2.0
##DATA TYPE= NMR FID
##DATA CLASS= NTUPLES
##ORIGIN= UXNMR, Bruker Analytische Messtechnik GmbH
##OWNER= root
$$ XWIN-NMR		Version 3.5
$$ Wed Jun  2 09:36:52 2021 Russian Standard Time (UT+4h)  she@DPX200
##.OBSERVE FREQUENCY= 200.131506
##.OBSERVE NUCLEUS= ^1H
##.DELAY= (6, 6)
##.ACQUISITION MODE= SIMULTANEOUS
##.ACQUISITION SCHEME= undefined
##.AVERAGES= 8
##.DIGITISER RES= 18
##SPECTROMETER/DATA SYSTEM= spect
##.PULSE SEQUENCE= zg30
##.SOLVENT NAME= CDCl3
##.SHIFT REFERENCE= (INTERNAL, CDCl3, 0, 15.7039)
##AUDIT TRAIL= $$ (NUMBER, WHEN, WHO, WHERE, WHAT)
$$ ##TITLE= Audit trail, XWIN-NMR		Version 3.5
$$ ##JCAMPDX= 5.01
$$ ##ORIGIN= Bruker BioSpin GmbH
$$ ##OWNER= she
$$ F:/spectra/data/she/nmr/H-F/1/audita.txt
$$ ##AUDIT TRAIL=  $$ (NUMBER, WHEN, WHO, WHERE, WHAT)
(   1,<2021-06-02 09:35:25.59 +0400>,<she>,<DPX200>,
      <created by zg, POWCHK disabled, PULCHK disabled
       configuration hash MD5:
       00 E9 B6 7A A2 85 ED C7 34 08 36 98 17 FE 4E 26
       data hash MD5: 16K
       0A 43 1A D8 F9 6B 0F AD 57 24 73 44 47 69 CA 6B>)
$$ ##END=
$$ 
$$ hash MD5
$$ 43 A8 67 DA B3 12 1D 6E D9 7B 96 A0 4B 0C C2 83
##$RELAX= 
##$RELAX= 
##$RELAX= 
##$RELAX= 
##$RELAX= 
##$RELAX= 
$$ Bruker specific parameters
$$ --------------------------
##$DU= <F:/spectra>
##$EXPNO= 1
##$NAME= <H-F>
##$PROCNO= 1
##$TYPE= <nmr>
##$USER= <she>
##$AMP= (0..31)
100 100 100 100 100 100 100 100 100 100 100 100 100 100 100 100 100 100 
100 100 100 100 100 100 100 100 100 100 100 100 100 100 
##$AQSEQ= 0
##$AQ_mod= 1
##$AUNM= <au_zg>
##$AUTOPOS= <>
##$BF1= 200.13
##$BF2= 200.13
##$BF3= 200.13
##$BF4= 200.13
##$BF5= 200.13
##$BF6= 200.13
##$BF7= 200.13
##$BF8= 200.13
##$BYTORDA= 1
##$CFDGTYP= 0
##$CFRGTYP= 5
##$CHEMSTR= <none>
##$CNST= (0..31)
1 1 145 1 1 1 1 1 1 1 1 1 1 1 1 1 1 1 1 1 1 1 1 1 1 1 1 1 1 1 1 1 
##$CPDPRG= <>
##$CPDPRG1= <>
##$CPDPRG2= <>
##$CPDPRG3= <>
##$CPDPRG4= <mlev>
##$CPDPRG5= <mlev>
##$CPDPRG6= <mlev>
##$CPDPRG7= <mlev>
##$CPDPRG8= <mlev>
##$CPDPRGB= <>
##$CPDPRGT= <>
##$D= (0..31)
0 1.2 0 0 0 0 0 0 0 0.06 0 0.03 0 0 0 0 0.0002 0 0 0 0 0 0 0 0 0 0 0 0 
0 0 0 
##$DATE= 1622612125
##$DBL= (0..7)
120 120 120 120 120 120 120 120 
##$DBP= (0..7)
150 150 150 150 150 150 150 150 
##$DBP07= 0
##$DBPNAM0= <>
##$DBPNAM1= <>
##$DBPNAM2= <>
##$DBPNAM3= <>
##$DBPNAM4= <>
##$DBPNAM5= <>
##$DBPNAM6= <>
##$DBPNAM7= <>
##$DBPOAL= (0..7)
0.5 0.5 0.5 0.5 0.5 0.5 0.5 0.5 
##$DBPOFFS= (0..7)
0 0 0 0 0 0 0 0 
##$DE= 6
##$DECBNUC= <off>
##$DECIM= 32
##$DECNUC= <off>
##$DECSTAT= 4
##$DIGMOD= 1
##$DIGTYP= 9
##$DL= (0..7)
0 120 120 120 120 120 120 120 
##$DP= (0..7)
150 150 150 150 150 150 150 150 
##$DP07= 0
##$DPNAME0= <>
##$DPNAME1= <>
##$DPNAME2= <>
##$DPNAME3= <>
##$DPNAME4= <>
##$DPNAME5= <>
##$DPNAME6= <>
##$DPNAME7= <>
##$DPOAL= (0..7)
0.5 0.5 0.5 0.5 0.5 0.5 0.5 0.5 
##$DPOFFS= (0..7)
0 0 0 0 0 0 0 0 
##$DQDMODE= 0
##$DR= 18
##$DS= 0
##$DSLIST= <SSSSSSSSSSSSSSS>
$$ [...]
##$SUBNAM2= <"">
##$SUBNAM3= <"">
##$SUBNAM4= <"">
##$SUBNAM5= <"">
##$SUBNAM6= <"">
##$SUBNAM7= <"">
##$SUBNAM8= <"">
##$SUBNAM9= <"">
##$SW= 16.9725357007746
##$SWIBOX= (0..15)
0 0 2 0 0 0 0 0 0 0 0 0 0 0 0 0 
##$SW_h= 3396.73913043478
##$TD= 16384
##$TD0= 1
##$TE= 0
##$TE2= 300
##$TE3= 300
##$TEG= 300
##$TL= (0..7)
0 120 120 120 120 120 120 120 
##$TP= (0..7)
150 150 150 150 150 150 150 150 
##$TP07= 0
##$TPNAME0= <>
##$TPNAME1= <>
##$TPNAME2= <>
##$TPNAME3= <>
##$TPNAME4= <>
##$TPNAME5= <>
##$TPNAME6= <>
##$TPNAME7= <>
##$TPOAL= (0..7)
0.5 0.5 0.5 0.5 0.5 0.5 0.5 0.5 
##$TPOFFS= (0..7)
0 0 0 0 0 0 0 0 
##$TUNHIN= 0
##$TUNHOUT= 0
##$TUNXOUT= 0
##$USERA1= <user>
##$USERA2= <user>
##$USERA3= <user>
##$USERA4= <user>
##$USERA5= <user>
##$V9= 5
##$VALIST= <valist>
##$VCLIST= <CCCCCCCCCCCCCCC>
##$VD= 0
##$VDLIST= <DDDDDDDDDDDDDDD>
##$VPLIST= <PPPPPPPPPPPPPPP>
##$VTLIST= <TTTTTTTTTTTTTTT>
##$WBST= 1024
##$WBSW= 4
##$XGAIN= (0..3)
0 0 0 0 
##$XL= 0
##$YL= 0
##$YMAX_a= 135593
##$YMIN_a= -127120
##$ZGOPTNS= <>
##$ZL1= 120
##$ZL2= 120
##$ZL3= 120
##$ZL4= 120
##$ABSF1= 10
##$ABSF2= 0
##$ABSG= 5
##$ABSL= 3
##$ALPHA= 0
##$AQORDER= 0
##$ASSFAC= 0
##$ASSFACI= 0
##$ASSFACX= 0
##$ASSWID= 0
##$AUNMP= <proc_1d>
##$AZFE= 0.1
##$AZFW= 0.1
##$BCFW= 1
##$BC_mod= 2
##$BYTORDP= 1
##$COROFFS= 0
##$CY= 11.3945322036743
##$DATMOD= 1
##$DC= 2
##$DFILT= <>
##$DTYPP= 0
##$F1P= 15.9154993809931
##$F2P= -4.1035820241983
##$FCOR= 0.5
##$FTSIZE= 0
##$FT_mod= 4
##$GAMMA= 1
##$GB= 0.15
##$INTBC= 1
##$INTSCL= 1
##$ISEN= 128
##$LB= 0.24
##$LEV0= 0
##$LPBIN= 0
##$MAXI= 10000
##$MC2= 0
##$MEAN= 0
##$ME_mod= 0
##$MI= 1.114404
##$NCOEF= 0
##$NC_proc= 0
##$NLEV= 6
##$NOISF1= 3.799351
##$NOISF2= 2.8
##$NSP= 1
##$NTH_PI= 0
##$NZP= 0
##$OFFSET= 15.70392
##$PC= 1
##$PHC0= -11564.3
##$PHC1= 13.80099
##$PH_mod= 1
##$PKNL= yes
##$PPARMOD= 0
##$PSCAL= 0
##$PSIGN= 0
##$REVERSE= no
##$SF= 200.130013532006
##$SI= 16384
##$SIGF1= 3
##$SIGF2= 2
##$SINO= 400
##$SIOLD= 16384
##$SREGLST= <1H.CDCl3>
##$SSB= 0
##$STSI= 0
##$STSR= 0
##$SW_p= 3612.71676300578
##$SYMM= 0
##$S_DEV= 0
##$TDeff= 0
##$TDoff= 0
##$TI= <>
##$TILT= no
##$TM1= 0
##$TM2= 0
##$TOPLEV= 0
##$USERP1= <user>
##$USERP2= <user>
##$USERP3= <user>
##$USERP4= <user>
##$USERP5= <user>
##$WDW= 1
##$XDIM= 8192
##$YMAX_p= 0
##$YMIN_p= 0
$$ End of Bruker specific parameters
$$ ---------------------------------
##NTUPLES= NMR FID
##VAR_NAME=  TIME,          FID/REAL,        FID/IMAG
##SYMBOL=    X,             R,               I
##VAR_TYPE=  INDEPENDENT,   DEPENDENT,       DEPENDENT
##VAR_FORM=  AFFN,          ASDF,            ASDF
##VAR_DIM=   8192,          8192,            8192
##UNITS=     SECONDS,       ARBITRARY UNITS, ARBITRARY UNITS
##FACTOR=    0.0002944,     1,               1
##FIRST=     0,             0,               0
##LAST=      2.4114304,     0,               0
##MIN=       0,             -127120,         0
##MAX=       2.4114304,     135593,          0
$$ Real data points
##PAGE= N=1
##DATA TABLE= (X++(R..R)), XYDATA
0@%%%%%%%%%%%%%Kj0J6j6J6j7K5l2L8m6N2o1P3q8J02j16J34j53J72j96K25k55
$$ 0 0 0 0 0 0 0 0 0 0 0 0 0 0 2 -8 8 -8 8 -9 16 -16 22 -24 28 -33 40 -48 54 -62 72 -81 91 -105 120 -135
35a35K87l23L63m06M52n04N63o27O94p67Q46r35J033j139J256j382J521j675J849
$$ -135 152 -171 192 -214 238 -266 297 -330 364 -403 443 -492 541 -598 658 -724 797 -878 971
54I71k041K253k495K771l086L452l886M408n046N850o901Q339j0439J3818k0377
$$ 971 -1070 1183 -1312 1459 -1627 1825 -2061 2347 -2699 3151 -3750 4589 -5850 7968 -12409
69a2409N2963j35616M8426J81123k10800L4826J44810j62324J0377J60583j69468
$$ -12409 40554 -95062 -46636 134487 -76313 -41487 103323 -59001 -48624 111959 -57509
80e7509j134J66516j51867k9857J92275j50564p0860K15548r8206j31027J91108
$$ -57509 -58643 107873 -43994 -73851 118424 -32140 -103000 112548 14342 -116685 74423
91G4423l9876j27676J49267k7779j20671J54178k0230j43656J49874J2048j63781
$$ 74423 34547 -93129 56138 28359 -92312 61866 41636 -102020 47854 59902 -103879
102a03879J37236M6295j82389J07426R4258j77378N4693J10319j41050L4210R7818
$$ -103879 33357 79652 -102737 4689 98947 -78431 -23738 86581 -54469 -20259 77559
113G7559j38281L6453J17530j48046P623J44629j33542k8367J56841j08523o2344
$$ 77559 -60722 -24269 93261 -54785 -47162 97467 -36075 -64442 92399 -16124 -78468
124g8468J58157p0904q6055J34173m3966p9557J22905m5447q8557J36440k7873
$$ -78468 79689 8785 -77270 56903 12937 -66620 56285 10838 -77719 58721 30848
135C0848j19513J29431R619j33361J04763L7823j33886P8967N9371j22797N4428
$$ 30848 -88665 40766 50385 -82976 21787 59610 -74276 4691 64062 -58735 -4307
146d307O2024j11465N1132O5526j22490M4606R4094j27173J0918J15071j06581
$$ -4307 57717 -53748 -2616 62910 -59580 -14974 79120 -48053 -37135 77936 -28645
157b8645j8070J16263q5425l5070J12446o7833m4321J06254n9740m9016J12008
$$ -28645 -46715 69548 -15877 -50947 61499 -6334 -50655 55599 -4141 -53157 58851
168E8851n6511p0247J22566l1236r6157J09187m6j01495Q7340J6460r7315P4060
$$ 58851 2340 -67907 54659 23423 -72734 36453 36407 -65088 22252 38712 -58603 15457
180A5457K5533r5949O5944L3274j00339O1343M9941j10386M3889P5166j05081
$$ 15457 40990 -54959 10985 44259 -56080 5263 55204 -55182 -11293 63873 -41208
191d1208J4815Q6167q6009l761Q2974p3982j0736Q4120o9490j9515R1328o5402
$$ -41208 -26393 59774 -26235 -29996 52978 -21004 -31740 52380 -17110 -36625 54703 -10699
203a0699l6066J00876n1814n8275J01094k7930p3017Q7931q427p4396P5956J12
$$ -10699 -46765 54111 2297 -55978 45116 17186 -55831 32100 23673 -50723 25233 25345
215B5345p5235P2062P638q2988P0065K3474r3946N7956M4771r5610L6781N9855
$$ 25345 -49890 22172 29810 -53178 16887 40361 -53585 4371 49142 -46468 -9687 50168
227E0168q5321J8663O3557p5133Q540O4918p0268J882P1175o9480j0746Q3105
$$ 50168 -35153 -16490 47067 -28066 -19526 45392 -24876 -22994 48181 -21299 -32045 51060
239E1060o1371l1881Q7619m1890m7492P9095k5540n1293P2287j7094n5607O9343
$$ 51060 -10311 -42192 45427 3537 -43955 35140 9600 -41693 30594 13500 -42107 27236
251B7236r225o2309O8038R04p2546O4847J8735q1863M9401L6865p6642L2390M1233
$$ 27236 18011 -44298 23740 24644 -47902 16945 35680 -46183 3218 40083 -36559 -4169 37064
264C7064o9521K6333M4987p0020J9191N4042o8658Q131O2054o5632m935P2104
$$ 37064 -32457 -6124 38863 -31157 -11966 42076 -26582 -18451 43603 -22029 -26964 45140
276D5140n6000k3574P2095l8592l1464O3501l1328l1877O4692k8429m1999O6991
$$ 45140 -10860 -34434 37661 -931 -32395 31106 -222 -32099 32593 4164 -37835 29156
288B9156j6637n1596O2757n297n9117N7916R549o4702M4708K1957n9069L4203
$$ 29156 12519 -39077 23680 18383 -40734 17182 26731 -37971 6737 28694 -30375 3828
300C828K2185n7811L4813K9837o5054K5792M3635o2777J2144N0205n7598J619
$$ 3828 26013 -31798 3015 32852 -32202 -6410 37225 -25552 -13408 36797 -20801 -19182
312a9182N6560n0437j1632N6663l8843j5901N2942l7850j9372O0507l3746l4205
$$ -19182 37378 -13059 -24691 31972 -6871 -22772 30170 -7680 -27052 33455 -291 -34496
324c4496O2549j8628m3019N5072q774m6475N1107J518n0894M1986J0150m7818
$$ -34496 28053 9425 -33594 21478 12704 -33771 17336 18854 -32040 9946 20096 -27722
336b7722L6868J1356n1762L7511K3098n9270K4912L6487n2742J2304L7958m8078
$$ -27722 9146 20502 -31260 6251 29349 -29921 -5009 31478 -21264 -8960 28998 -19080
348a9080O909M2764m5107k440M5079l8486o485M5627l9393j2844N5276l3135k8755
$$ -19080 -12171 30593 -14514 -16954 28125 -10361 -16846 28781 -10612 -23456 31820 -1315 -30070
361c0070N4344j7933l3112M6525j3209l4284M6976p412m1294M2988J594m2170
$$ -30070 24274 6341 -26771 19754 6545 -27739 19237 11825 -29469 13519 15113 -27057
373b7057L9213N270m7837L7999J8073n3060K4682K8513m5077J5266K6947m2851
$$ -27057 12156 17426 -30411 7588 25661 -27399 -2717 25796 -19281 -4015 22932 -19919
385a9919J4221L2856m4408N058L8713l8853j520M0486l7373q610M7287l0728k1349
$$ -19919 -5698 27158 -17250 -12192 26521 -12332 -13852 26634 -10739 -19349 27938 -2790 -24139
398b4139M5251j8540k3105L9555j7533k4711M3644j3297l4142M2355l083l7682
$$ -24139 21112 2572 -20533 19022 1489 -23222 20422 7125 -27017 15338 12255 -25427
410b5427L7628K462m1506L5049J2259m4739K5245J9257l9665J9984J9172m0834
$$ -25427 12201 14663 -26843 8206 20465 -24274 971 20228 -19437 547 19719 -21115
422b1115J9281K6764m3939R752L4428l8414J522L5877l4863m626L9429k9412j2920
$$ -21115 -1834 24930 -19009 -9257 25171 -13243 -11721 24156 -10707 -15333 24096 -5316 -18236
435a8236L8343k2010j5188L6642k0940j9265M0826j5442k8595L8877n601l1738
$$ -18236 20107 -1903 -17091 19551 -1389 -20654 20172 4730 -23865 15012 9411 -22327
447b2327L4041k47l3896L1283O066l6209K5902J1095l5169K3151J3886l8320K0659
$$ -22327 11714 11467 -22429 8854 14920 -21289 4613 15708 -19461 3690 17576 -20744 -85
460h5K2086m0140J1902K8374l5702M959K9796l2629L60L2535k9692n422L3743
$$ -85 22001 -18139 -6237 22137 -13565 -8606 21190 -11439 -11079 21456 -8236 -13658 20085
473B0085k5764r476L5297k3164j5714L7849j6664k3102L5426q574k5675L1555
$$ 20085 -5679 -15155 20142 -3022 -18736 19113 2449 -20653 14773 6199 -19476 12079
485A2079m186k7528K9667N87l0092K6802N510l1975K4005J0703l4336J9682J7361
$$ 12079 7893 -19635 10032 10619 -19473 7329 12839 -19136 4869 15572 -18764 918 18279
498A8279l4389J2910K1563l1705Q081K3575l0040M442K6245k9009K7K9443k7077
$$ 18279 -16110 -3200 18363 -13342 -5261 18314 -11726 -7284 18961 -10048 -10021 19422 -7655
511g655n413L2374k3401j1660L3243j7946j6318L1989j3107j9343L0611r082k2005
$$ -7655 -13068 19306 -4095 -15755 17488 -458 -16776 15213 2106 -17237 13374 4292 -17713
524a7713K9566n186k5204K8501n9k8888K5393O543l0180K0181J1008k9384J6198
$$ -17713 11853 6667 -18537 9964 9905 -18983 6410 12953 -17227 2954 13962 -15422 776
537G76J4231k9187J2366J7793k8282Q410K0426k7704M741K4419k6725j545K7567
$$ 776 15007 -14180 -1814 15979 -12303 -3893 16533 -11171 -6430 17989 -8736 -10281 17286
550A7286k2095o903K7070j8529r330K7777j6488j3601K8730j2094j7209K7662
$$ 17286 -4809 -11712 15358 -3171 -12501 15276 -1212 -14813 13917 1823 -15386 12276
562A2276q808k0162K8004m243k4989K5340K621k5644K0279N258k4992J9148Q188
$$ 12276 3468 -16694 11310 7067 -17922 7418 10039 -15605 4674 9932 -15060 4088 12276
575A2276k7588J5982J3576k7049J1129J6024k6203Q242J9901k5935K017K3106
$$ 12276 -15312 670 14246 -12803 -1674 14350 -11853 -3611 16290 -9645 -7628 15478
587A5478k1131k464K1725j8973l487K3932j8619q871K6246j3519j3132K4472j0335
$$ 15478 -5653 -8117 13608 -5365 -8852 15080 -3539 -12410 13836 317 -12815 11657 1322
600A322j5091K5162p020j9831K3420r41k0540J9592M78k0721K0359L503k5009
$$ 1322 -13769 11393 4373 -15458 7962 7021 -13519 6073 6551 -14170 6189 9692 -15317
613a5317J7545R933k4705J2433J1916k3700J0564J5257k4368N452J8584k0632
$$ -15317 2228 12161 -12544 -111 11805 -11895 -1331 13926 -10442 -4990 13594 -7038
625g038J784J7780j9791P90K1193j9711n371K3582j4119r351K1236j1440j0471
$$ -7038 -5254 12526 -7265 -6475 14718 -4993 -10364 13218 -901 -10252 10984 -456 -10927
638a0927K2165r147j4799K1154m101j5705J8587l051j6947J9907N27k1477J6737
$$ -10927 11238 2091 -12708 8446 4345 -11360 7227 4176 -12771 7136 7663 -13814 2923
651B923O594k0501J2379P359k0035J2074J0416k1919Q068J4125j9508M982J4152
$$ 2923 9517 -10984 1395 8754 -11281 793 11209 -10710 -2642 11483 -8025 -3043 11109
664A1109j9619L922J8175j9666k209K0260j4465n113J8050j3186n716K0092j1944
$$ 11109 -8510 -4588 13587 -6079 -8288 11972 -2493 -7606 10444 -2742 -8458 11634 -310
677c10j0534K0143p061j2046J7993n868j3558J9204k356j7677J6194K894j6564
$$ -310 -10844 9299 2238 -9808 8185 2317 -11241 7963 5607 -12070 4124 7018 -9546
690i546J2687K912j6533J3468N778j9414J0135J0030j7765O926J0472j7695N968
$$ -9546 3141 6053 -10480 2988 8766 -10648 -513 9517 -8248 -1322 9150 -8545 -2577
703b577J3844j8120J094J6009j4281j245J4752j4008j912J7637j3502o833J8691
$$ -2577 11267 -6853 -5759 10250 -4031 -5276 9476 -4532 -6444 11193 -2309 -9142 9549
716I549r040r073J6923p547j0344J7903m940j3941J6096o98j3875J3692N6j4606
$$ 9549 509 -8564 8359 812 -9532 8371 3431 -10510 5586 4888 -8987 4705 4761 -9845
730i845J4080L002j7328J1139P105j6202P968P915j5860O824J0422j6160L368
$$ -9845 4235 7237 -10091 1048 8153 -8049 -81 7834 -8026 -1202 9220 -6940 -3572
743c572J2412j3926J223J2462j3669p1J4966j2991m152J5965r637o215J5065q256
$$ -3572 8840 -5086 -3863 8599 -5070 -5141 9825 -3166 -7318 8647 -990 -7205 7860 -396
757c96p482J5845o573j0296J5352l564j1353J4209k113j2775J4080O38j4763J1943
$$ -396 -7878 7967 1394 -8902 6450 2886 -8467 5742 3629 -9146 4934 5572 -9191 2752
771B752L738j4586R678N131j4616Q407P273j4978N867R244j4040L794J0438j3532
$$ 2752 6490 -8096 1582 6713 -7903 504 7777 -7201 -1334 7910 -6130 -2336 8102 -5430
785e430J755J2199j2532j175J3072j0419l123J3099r079m779J3671p532o888J3760
$$ -5430 -3675 8524 -4008 -5183 7889 -2530 -5653 7446 -1633 -6412 7259 -273 -7161 6599
799F599n546q667J3485l570j0268J2974j274j1671J1709Q55j2383J0517K778j2993
$$ 6599 1053 -7614 5871 2301 -7967 5007 3733 -7938 3771 4626 -7757 2760 5538 -7455
813g455R130M634j3433P580O565j3631N614Q561j3151L240R891j2116J294J0829
$$ -7455 1675 6309 -7124 456 7021 -6610 -996 7565 -5586 -2346 7545 -4571 -3277 7552
827G552j1245p79J1791r740k786J2049q275m374J2411o956o470J2664m552q123
$$ 7552 -3693 -4472 7319 -2421 -5207 6842 -1433 -5807 6604 -352 -6822 5842 1290 -6833
841f833J1612k737q862J1169j282j0292J0483J016j1056Q991K504j1329Q319M177
$$ -6833 4779 2042 -6820 4349 3067 -7225 3258 4274 -6782 2209 4713 -6616 1703 5880
855E880j2532O565O725j2001M231P526j1255L281Q607j1569J259J0481j0144j064
$$ 5880 -6652 -87 6638 -5363 -1132 6394 -4861 -1580 7027 -4542 -3283 7198 -2946 -4010
869d010J0528q956k110J1436q251m677J2047n578o377J0721m096o598J0946l239
$$ -4010 6518 -2438 -4548 6888 -1363 -6040 6007 429 -5948 4773 677 -5921 5025 1786
883A786q798J0656l21r591Q756R35r565Q504K304j1169P018N114j0584M595N380
$$ 1786 -7012 3644 3323 -6268 2488 3423 -6142 2362 4666 -6503 515 5629 -4955 -360 5020
898E020r887M519O571j1038K546Q895r758Q5Q854q615m26R859q663k981J0920
$$ 5020 -4867 -348 6223 -4815 -2269 6626 -3132 -3047 5807 -2808 -3234 6625 -2038 -5019 5901
913E901o209m572R775n254m748J0594m719p317J0744j657q363Q697n35q115Q793
$$ 5901 -308 -4880 4895 -359 -5107 5487 768 -6549 4195 2538 -5825 2872 2337 -5778 3015
928C015N81r862P589L244r572N441L605r049N538M901j0424L508P251r026J255
$$ 3015 3596 -6266 1323 4567 -5005 436 4041 -5008 530 5431 -4993 -1485 5766 -3260 -2005
943b005O990q152J065P988q546j055R277o623k638Q465o054k857R717n624n484
$$ -2005 4985 -3167 -2102 5886 -2660 -3715 5562 -1061 -3699 4766 -1288 -4145 5572 -52 -5536
958e536R938k933o454Q363k188o365Q978j335q454Q189J275q463O477J716q484
$$ -5536 4402 1469 -4985 3378 1190 -5175 3803 2468 -5986 2203 3478 -4985 1492 3208 -5276
973e276O611L296r829M596N588q533K566N221q035K619O649q648L15Q062o823
$$ -5276 1335 4631 -5198 -602 4986 -3547 -981 4240 -3795 -1176 5473 -3175 -2860 5202 -1621
988a621j312P412o225j590Q602n844m046Q789l459m747P594l168m934Q532k298
$$ -1621 -2933 4479 -1746 -3336 5266 -578 -4624 4165 706 -4041 3553 385 -4549 3983 1685
1003A685p114Q047J61p329O498M90p439O897J930q865N304L950q053L710L896
$$ 1685 -5429 2618 2779 -4550 1948 2438 -5001 1896 3826 -5039 265 4215 -3838 -128 3768
1018C768p911L775N361q679J626O928p094J9O505o537l56P468o269k329P973m389
$$ 3768 -4143 -368 4993 -3686 -2060 4868 -2226 -2207 4298 -2239 -2595 4873 -1396 -3725 4248 -141
1034a41l318P139l931l744P938l004n600P505r18o022O325m09o172O546O50p437
$$ -141 -3459 3680 -251 -3995 3943 939 -4661 2844 1926 -4096 2229 1820 -4352 2194 2844 -4593
1050d593N553K435p226M375K804p342M101M045p878K647N430p057J271N495o732
$$ -4593 960 3395 -3831 544 3348 -3994 107 4152 -3726 -1079 4351 -2706 -1435 4060 -2672
1065b672P33O464o495q33P069n323j969O916m600k713P314l766m103P177k253
$$ -2672 -1939 4525 -1970 -2803 4266 -1057 -3026 3890 -710 -3423 3891 125 -3978 3199 946
1080I46m748O532j449n307O353l72o084N730R92o372M799J832o594M171K927o774
$$ 946 -3802 2730 1281 -4026 2327 1955 -4129 1601 2593 -3779 1020 2852 -3742 429 3356 -3418
1096c418L147L896o592K135M593o367J222N306o087J51N949n521q68O363m886
$$ -3418 -271 3625 -2967 -832 3761 -2606 -1384 3922 -2165 -2014 3935 -1586 -2454 3909 -977
1111i77j969O553m044k818O688l213l796O612k174m619O215j106n077N825k43
$$ -977 -2946 3607 -437 -3255 3433 220 -3576 3036 862 -3757 2458 1352 -3725 2100 1857
1126A857n726N355J016o099M360J950o062L671K714o198K847L768o049J625M268
$$ 1857 -3869 1486 2502 -3597 763 2713 -3349 322 3036 -3162 -315 3453 -2596 -971 3297
1141C297n554J014M828n488o3N632m792j288N653l983j766N854l714k822O297
$$ 3297 -2257 -1243 3585 -1903 -1966 3666 -1126 -2414 3239 -744 -2510 3344 -370 -3192 3105
1156C105k523l840N723j684m088N743j159n030N603L37n620M440J120n396M201
$$ 3105 582 -3258 2465 781 -3307 2436 1277 -3753 1850 2187 -3433 1007 2127 -3269 932
1171I32J666o044L537L080n898K177L452n398J852L974n723P74N164m801o85M850
$$ 932 2598 -3446 91 3171 -2727 -550 2902 -2496 -644 3330 -2393 -1619 3545 -1256 -1941 2909
1187B909m036p88N172m129j897N930k861l124N189k046l064N402j877m280N542
$$ 2909 -1127 -1915 3257 -872 -2769 3161 300 -2824 2365 319 -2745 2657 780 -3500 2042
1202B042k60m875M356L06m545M469N43n614M167K302n652K645K589n121K604L014
$$ 2042 1782 -3093 1263 1569 -2976 1493 2036 -3578 589 2891 -2761 -116 2473 -2648 -44 2970
1218B970n741J688M464n056J72M211m293K23M590m638r94N516l193k414M860k431
$$ 2970 -2771 -1083 3381 -1675 -1503 2708 -1585 -1362 3228 -1410 -2404 3112 -81 -2495 2365 -66
1234f6k231M991k432l390N310q22m084M181l11l819M385n1m946M156J648n067
$$ -66 -2297 2694 262 -3128 2182 1360 -2724 1457 1146 -2673 1712 1661 -3285 871 2519 -2548
1250b548K709J900m519K817K235n352K108L635m865Q38L579m351P92M069m772
$$ -2548 161 2061 -2458 359 2594 -2758 -650 2985 -1880 -1042 2537 -1814 -1022 3047 -1725
1265a725l47N047l572j452M415k998j410M811k977k646N191j506l375M225r42
$$ -1725 -2072 2975 -597 -2049 2366 -632 -2042 2769 -208 -2854 2337 831 -2544 1681 739
1280G39l239M426n70m371M070R74m365K876J212m060K967J643m898K250K993m390
$$ 739 -2500 1926 1356 -3015 1055 2029 -2336 540 1752 -2308 659 2302 -2596 -346 2647 -1743
1296a743J076K925m052J062L475m394lM296l425q97L873l093q64M424l113k134
$$ -1743 -667 2258 -1794 -732 2743 -1651 -1654 2642 -783 -1680 2193 -900 -1764 2660 -453 -2587
1312b587M776j785k724M057j361k709M274j019l745M046L58l865L121O19l770
$$ -2587 2189 404 -2320 1737 376 -2333 1941 922 -2823 1223 1581 -2284 837 1456 -2314
1327b314L149J248m491K371K396m065J340K413l727J248K940m041K67L671l248
$$ -2314 835 2083 -2408 -37 2359 -1706 -366 2047 -1680 -432 2508 -1533 -1266 2405 -843
1342h43n38L466k897p14L875k819j711M164j805k239L687j452k342L930j095l177
$$ -843 -1381 2085 -812 -1526 2349 -470 -2181 1983 178 -2061 1626 174 -2168 1762 667 -2510
1358b510L784q5l437L148L22l459L109Q56l994K510J728l811J804J995l664J489
$$ -2510 1274 1189 -2248 900 1222 -2237 872 1728 -2266 244 1972 -1839 -35 1960 -1704 -215
1374b15K479l812P40L086l328pL145k946m09L409k680j097L582k085j657L476
$$ -215 2264 -1548 -808 2278 -1050 -1057 2088 -858 -1267 2142 -538 -1635 1947 -138 -1795 1681
1390A681j616j983L513j149k551L378n27k846L094j4l035K852M57l313K562J021
$$ 1681 65 -1918 1595 446 -2105 1273 746 -2100 994 980 -2055 797 1254 -2059 503 1524
1406A524l476K144J532l489J673J967l413J209K318l349O74K756l098N1K988k724
$$ 1524 -1952 192 1724 -1765 -92 1875 -1538 -329 1989 -1360 -686 2070 -1028 -977 2011 -713
1422g13m39L103k452r87L347j918j610L207j326j892L069r87k305L077l62k729
$$ -713 -1152 1951 -501 -1488 1859 -59 -1669 1538 212 -1680 1389 402 -1903 1174 812 -1917
1438a917K658K32k725K385N25l051K180J214l139J545J579k894J296J747l109
$$ -1917 741 973 -1752 633 1158 -1893 287 1501 -1638 -93 1486 -1408 -112 1635 -1474
1453a474R69K417k952J83K568k497l3K625k528n02L094k089j203K906j514j290
$$ -1474 -505 1912 -1040 -857 1711 -786 -819 1806 -722 -1224 1870 -219 -1422 1484 -30 -1320
1469a320K874j450j853L102o86k382K546j07k237K366pk666K330Q40k876J528
$$ -1320 1554 104 -1749 1353 667 -1715 831 724 -1513 853 846 -1820 510 1350 -1526 2
1485BJ181k509J415J285k863J107K073k679K33K100k131K32K122k460j66K760
$$ 2 1183 -1326 89 1374 -1489 -382 1691 -988 -755 1345 -786 -554 1568 -892 -1058 1702
1501A702j970r71K515j448q62K526j621j417K936q62k016K318l73j725K314m53
$$ 1702 -268 -1239 1276 -172 -1034 1492 -129 -1546 1390 528 -1488 830 457 -1268 1046 593
1517E93k312K451M46k625J598Q39k203J545Q20k651J328J720k520M15J715j983
$$ 593 -1719 732 1178 -1447 151 990 -1213 332 1152 -1499 -171 1549 -971 -556 1159 -824
1533h24M78J735k352M6K498j872q16K153j269o28K148j544j108K627q76j719K087
$$ -824 -346 1389 -963 -917 1581 -291 -1107 1046 -223 -851 1297 -247 -1355 1272 396 -1323 764
1550G64m36j430K115n69j996K294K82k310J546N41j901J567N18k416J473J345
$$ 764 328 -1102 1013 444 -1552 742 1024 -1286 260 801 -1100 467 985 -1431 42 1387
1566A387k375O60J388j932O90J482k279K88K134j838n02J890j345l67J938j565
$$ 1387 -988 -328 1060 -872 -182 1300 -979 -691 1443 -395 -897 993 -352 -719 1219 -346
1582c46q59K353q98j425J880m98j238J919n41j704K017J50j936J418L44j677J506
$$ -346 -1205 1148 250 -1175 705 207 -1031 888 347 -1357 660 810 -1126 292 636 -1041 465
1599D65L85k133J378J108k108P11J148j782P53J274k105M38J759j775j64J642
$$ 465 850 -1283 95 1203 -905 -194 954 -828 -75 1199 -906 -468 1291 -484 -648 994
1615I94j477j13J791j596o05K115j020j088J743p09r52J804o62j469J885m8j646
$$ 994 -483 -596 1195 -401 -1006 1109 89 -999 744 35 -917 887 225 -1244 641 593 -1053
1632a053J398J79j525J420L22j874J211R33j817O77R68j613P09J110j847L88J532
$$ -1053 345 524 -1001 419 741 -1133 78 1011 -806 -129 839 -774 -65 1045 -802 -414 1118
1649A118j595m7J459j380p8J599j428m63J832j062p78J620q25q13J719p53j197
$$ 1118 -477 -524 935 -445 -523 1076 -352 -815 1017 -45 -823 797 -28 -841 878 125 -1072
1666a072J761k61j414J438qj396J380J81j639J220N87j645Q55P78j544P00R97
$$ -1072 689 428 -986 452 444 -952 428 609 -1030 190 777 -868 -13 765 -779 -79 918
1683I18j633L84J295j447L7J330j277j20J435j188m16J565r70o74J547p67q31
$$ 918 -715 -331 964 -483 -446 884 -393 -513 922 -266 -682 883 -87 -761 786 19 -812
1700h12J533n57j042J495l18j200J398o3j325J249J67j401J119L76j481R58O61
$$ -812 721 164 -878 617 299 -901 497 434 -891 358 525 -876 243 619 -862 96 757
1717G57j527O65Q85j406M28R94j366K39J202j275j09J328j035l25J314r17n35
$$ 757 -770 -105 780 -626 -198 796 -570 -331 871 -404 -513 815 -220 -545 769 -148 -683
1734f83J450o80q74J355l62r09J231k99j046J281Mj299J050K99j195Q81L12j292
$$ -683 767 87 -787 568 206 -703 528 229 -817 464 468 -831 219 518 -677 204 516 -776
1752g76Q77O26j407N38Q09j175M00P82j261L23J120j234j08J163q84j98J080r12
$$ -776 101 727 -680 -142 667 -508 -108 674 -587 -264 856 -378 -486 677 -207 -405 675 -237
1770b37l36J332p28p53J224l43p30J087l88q98J249m2j204R22K97j034P59K40
$$ -237 -573 759 31 -722 502 159 -571 516 128 -770 479 437 -767 155 452 -582 177 417
1788D17j154Q37O07j320M08Q14j037L27P03j161K87J080j128j75J090p48j67R48
$$ 417 -737 100 707 -613 -205 609 -428 -101 602 -559 -272 808 -320 -495 595 -153 -320 628
1806F28r06k52J272p08p02J120l27o12R94m50p63J224j15j118Q76K18q95P73R6
$$ 628 -278 -530 742 34 -668 452 125 -487 507 57 -706 518 403 -715 161 379 -516 257 353
1825C53j094Q84N38j284L97P46r14K92O26j100K95J039j068k20J050o78j90R09
$$ 353 -741 143 681 -603 -206 540 -374 -82 544 -556 -261 778 -290 -510 540 -138 -328 581
1843E81q43k65J258o40p52J064k53o11R36m04p44J177j08j063Q47J89q44P49N7
$$ 581 -262 -527 731 91 -661 403 150 -461 475 71 -673 504 396 -667 180 369 -475 274 331
1862C31j029Q61M70j196M11O42q80L57N19j042L50R38j043j42R63o88j57Q79q05
$$ 331 -698 163 633 -563 -152 490 -390 -33 486 -556 -206 732 -311 -453 510 -178 -335 544 -261
1881b61k59J170o11o65J025k77n89R23l74p24J098p1j017Q13J92q46P17J20r89
$$ -261 -520 650 39 -626 399 122 -467 456 82 -642 456 385 -632 181 373 -473 244 364 -625
1900f25P97M41j130M43N55q81L92N14j031L68Q36j007k1Q61p36p4Q06p93j54J052
$$ -625 172 613 -517 -74 481 -400 -8 506 -525 -157 679 -328 -349 512 -224 -298 508 -285 -439 613
1920F13o43m94R32l98n18R08l64o45J043j29r12Q02J15q29P42J36r45P51L85j051
$$ 613 -30 -524 408 10 -508 400 36 -609 434 305 -607 195 310 -519 223 359 -586 165 550 -501
1940e01M45N73q89L67N49r83K78P87q86KP85p99L6P80p78j73R73o11m14Q91m64
$$ -501 -56 517 -372 -5 544 -439 -161 626 -260 -258 527 -272 -236 544 -234 -407 566 -45 -459 432 -32
1961c2m25Q90m25n78R72k40p33Q61o9p42P75N5r06P41K93r29N11M70r37M39N61
$$ -32 -457 433 8 -570 402 162 -571 290 221 -521 254 309 -597 144 437 -492 19 489 -448 -9 552
1982E52r24K24P09q68R2P88q29k1Q64q08j71R29o16l70R36n11m47R15m16n67R21
$$ 552 -372 -148 561 -307 -215 573 -256 -277 587 -221 -392 537 -79 -449 487 -24 -471 444 28 -539 382
2003C82k58o68Q83j34p71Q07L9q30P16J75q71O33L16r16M84M94r14L43N87q88
$$ 382 124 -544 339 205 -566 241 280 -550 166 341 -530 103 419 -497 -13 481 -433 -90 497 -391
2023c91K31P40q69J5Q29p43j43Q56o80k35R42n79m72R53l68n79Q87k97o43R14
$$ -391 -160 580 -289 -274 555 -188 -331 525 -155 -390 552 -27 -499 454 86 -493 394 97 -546 368
2043C68j30q35Q33P5q25O89J09q40P08K82r69N25M61q67L56M96q82L51O56r25
$$ 368 238 -597 236 311 -514 175 284 -556 152 434 -535 -10 451 -416 -60 436 -446 -95 561 -364
2063c64J06P79p32m1P33p23q6R04o75l77R40m01m81Q23l84n24R56k42p96Q52K8
$$ -364 -258 521 -211 -252 481 -242 -328 576 -99 -476 464 63 -418 405 21 -503 453 211 -585 267 295
2084B95p83P04M8q30P63K52r94N33M72q57M02M04q57L90O14r67J29Q01p50KO89
$$ 295 -488 216 264 -566 197 449 -545 -12 460 -397 5 409 -448 -58 556 -411 -282 519 -231 -229 460
2105D60p72MQ66p18l09Q82m27l27P41m58m05R37l15p26Q57n2o61O76q7p62Q35
$$ 460 -312 -308 558 -160 -469 413 -14 -341 400 -58 -463 474 159 -567 290 238 -423 253 166 -596 239
2126B39K01j006N72M44q59N05K94q60M21O29r25P8P72p01lO43p79M1Q93p63l36
$$ 239 440 -566 6 450 -409 96 390 -470 -49 580 -345 -267 505 -196 -199 444 -335 -294 599 -164 -500
2147e00R88m97l39P75m90m15R49l33p28Q52o4n83O51j49o43Q04P3q74N74L11p36
$$ -500 488 -9 -348 427 -63 -478 471 138 -590 262 198 -385 266 117 -526 278 351 -523 51 362 -374
2168c74M60K59q18N04M97r08J90O51o93J04N64p53P3Q15p34k49Q46m50l13P44
$$ -374 86 345 -473 31 528 -380 -190 461 -232 -128 436 -317 -244 571 -163 -412 434 -16 -329 415
2188D15m89l82R10l44o42P94q8n96O79j05o67P68P6q54N73K86p14M56K51p74M60
$$ 415 -74 -456 454 110 -532 262 174 -422 257 152 -515 253 329 -525 48 334 -380 76 327 -447 13
2209A3M56q38K26N77o91J37N56p38P6P54o81k01P75m73k53P27m78l43Q31l41n58
$$ 13 469 -369 -143 434 -257 -120 436 -302 -226 528 -153 -354 421 -52 -305 422 -56 -399 432 91 -467
2230d67P68j47n77O97r4o79P05J00q01N68K53p37M53L02p92M13M63p88K14N55
$$ -467 301 154 -423 274 180 -499 206 306 -495 73 326 -411 42 344 -448 -35 428 -360 -146 409
2250D09o89J36N85p01L9P01o33j39O90m90k07P18m59l27P60l32m71P22j76n38
$$ 409 -280 -144 441 -260 -221 480 -153 -292 398 -92 -299 419 -40 -367 393 61 -410 312 136 -402
2270d02O78r9o16O52M0o79N33J68o99M83K80p51L83M24p60K44N04p04J50N73o52
$$ -402 276 177 -439 213 253 -426 107 275 -424 59 339 -412 -29 395 -365 -121 383 -321 -171 402 -250
2291b50J3O52n98j03O96n18k09P05m28k99O95l24l90O72k28m71O52j08n44O03
$$ -250 -237 415 -183 -286 410 -108 -317 388 -40 -339 356 32 -358 314 86 -385 267 159 -385 218
2311B18j1n98N49Q6o29M70K22o67L66L20o63L14L73o62J81N00o13P0N43n71k0
$$ 218 207 -391 158 244 -385 85 307 -360 6 326 -337 -23 350 -312 -131 369 -244 -174 369 -202 -222
2332b22O11n30j58O55l92k60O28l51l01O57k81m38O56j24m95N50n6m93N45K4n94
$$ -222 389 -141 -299 356 -36 -296 332 -19 -320 337 56 -382 274 150 -345 205 149 -344 201 225 -369
2353c69M60J79n71L52J88n60L55K92o53K13M40n29R4M02n16Q1N02n37r0N92l81
$$ -369 91 270 -301 51 239 -321 34 326 -327 -114 326 -203 -109 293 -223 -142 360 -177 -267 325 -56
2374e6j93N30l51k06O16l24l90O22j35m05M89r9m22N50l5n70M73J58n32L43J43
$$ -56 -249 281 -70 -276 340 16 -374 248 113 -292 197 98 -324 226 191 -379 94 252 -280 63 206
2395B06n23L71K49o11K30L82m98J14L22m69J39M16n23m5N16l41j33M41l38j18
$$ 206 -317 54 303 -308 -78 304 -194 -80 242 -227 -88 328 -195 -240 276 -65 -198 243 -95 -213
2415b13N28l27l08N39j31l41M37j42l30N11p1m88M36J16m58L10J04m60L78J94
$$ -213 315 -12 -320 219 88 -253 184 42 -288 223 152 -336 100 216 -242 68 172 -288 90 284
2435B84n69K15L42m44J11K78m37J35M05m96m3M80l25j06L71l20q4M87l19k55M81
$$ 284 -285 -70 272 -172 -61 217 -220 -85 320 -176 -219 261 -64 -170 201 -119 -203 284 -35 -290 191
2456A91j36k68L86j59k48M52r0m19L71J06l78K69N8l89L55J42m96K10K86l88J09
$$ 191 55 -213 173 14 -234 218 128 -291 80 186 -192 77 135 -254 101 243 -253 -43 243 -145 -36
2477c6K39m03J41L54m52k3M23l05q4L37l12o5M54l07k26M41j30k52L56j43k37
$$ -36 203 -200 -59 295 -157 -180 243 -62 -146 191 -121 -186 268 -39 -265 176 46 -206 150 7 -230
2498b30M06q3l53L45N5l24K64M1l37K95J25m10J85K31l35J17J77l40J34K73l70
$$ -230 176 93 -260 85 140 -184 80 121 -216 79 204 -206 -21 210 -125 -8 169 -171 -37 236 -134
2519a34KL34k64n7L03k70o9L65k48j75L71j38k17L27j29k30L69o1l18L26L2l09
$$ -134 -132 202 -62 -119 184 -86 -155 210 -38 -213 158 20 -197 130 1 -229 140 79 -239 87 119 -190
2541a90K60L9l07K56J21l62J79J80l11J29J80l14J12K38l20J5K78k35m6K63k22
$$ -190 70 109 -198 58 179 -183 -4 176 -135 -6 174 -140 -28 210 -110 -95 183 -52 -98 165 -57
2562e7o5K86j82j39K89j33j71K97j03k16K98l7k60K66J6k78K34O9k96K03J25l11
$$ -57 -122 164 -18 -157 132 -1 -172 125 22 -194 104 67 -193 73 89 -189 45 114 -182 21 146 -165
2584a65J50J79l00J04K11k81M3K37k51rK55k21m8K60j89j05K68j36j43K57q3j84
$$ -165 -15 164 -136 -32 179 -102 -59 178 -73 -82 173 -48 -96 164 -25 -130 138 2 -141 116 33 -151
2606a51K57n3k04K01K0k18J87L7k37J69R9k46J26J34k52R9J68k51N1K19k43qK23
$$ -151 106 53 -151 50 70 -148 39 76 -161 8 107 -139 -13 121 -131 -32 136 -115 -64 155 -88 -96 127
2629A27j92k6K44j88p7K74j51j31K40r7j56K48o7k13K57Jk36J81M2k05J72M7k45
$$ 127 -65 -91 153 -35 -112 162 11 -120 120 23 -133 115 48 -165 92 93 -143 38 80 -125 47 94 -151
2652a51J52J32k48O5J56k04N4J75k32K1K22j88n8K10j30o0K11j56j19K70q2j76
$$ -151 1 133 -115 -50 106 -98 -44 131 -101 -80 142 -46 -104 106 -24 -84 127 -29 -148 122 40 -136
2674a36K16k8j60K10n1k08K19N1k48J56O9k08J49Q4k62J31J68k45L3J81k08M1
$$ -136 80 52 -108 102 51 -157 62 113 -135 21 90 -118 31 115 -147 -16 152 -93 -60 121 -87 -46
2696d6J77k20j9K62j72j13K35j10q5J98j20j34K58m9k05J83Pj73K01j7k11J98
$$ -46 131 -89 -108 154 -18 -131 104 -6 -91 107 -13 -147 111 62 -143 40 47 -126 75 58 -153 45
2718D5P3k48J19J00j95J17J06k51J00J87k38PJ86j83J7J94k18l2K60j66j13K39
$$ 45 118 -130 -11 89 -106 11 117 -134 -34 153 -85 -78 108 -75 -58 136 -82 -114 146 -20 -133 106
2740A06j13r7K32j21j51K55m4k05J81L6k07K02J7k50J91J05k56J02J27k11J02
$$ 106 -7 -104 128 7 -144 111 67 -138 43 79 -128 74 91 -159 32 137 -119 -17 110 -101 1
2761AJ24k46O2K26k53j6K15j76k0K18j98p1K83j62j42K49r4j40K50r5j83K69j9
$$ 1 125 -121 -59 167 -86 -102 113 -63 -83 135 -63 -134 149 -13 -155 94 0 -140 110 15 -168 101 82
2784H2k38K05K9k17K01L0k53J89J22k72R6J56k37R5J68k67N4K22k26m5K46j92
$$ 82 -156 49 78 -139 62 92 -161 28 150 -122 -26 130 -107 -12 156 -111 -57 165 -61 -106 140 -52
2806e2o3K57k02q9K84j39j63K62p9j67K55o7k19K71qk52K19M6k41J93O9k73J71
$$ -52 -115 142 -60 -149 135 -4 -167 95 16 -151 104 37 -182 89 81 -171 48 94 -147 46 115 -158 13
2829A3J34k85J18J63k71R8J93k58K9K33k37j4K47k01q4K79j92j11K98j56j61K82
$$ 13 147 -138 -20 143 -128 -30 163 -95 -66 167 -70 -84 163 -38 -122 157 -35 -146 152 -4 -165 117
2851A17r0k00K65n0k31K63jk67K34O1k88K12R4k86J67J53k98J15J88k92Q5K15
$$ 117 27 -173 92 42 -189 74 73 -194 40 101 -187 25 119 -167 0 153 -145 -30 158 -134 -49 166
2873A66k76L3K47k52pK63k25o8L04k17j03K91j65j57L06j16j92K93o6k38K65j6
$$ 166 -110 -77 170 -82 -89 174 -51 -119 185 -32 -135 156 -9 -166 140 24 -168 125 59 -179 86 70
2895G0k66K45M4k91K33R0k98J75J43l04J35J83l05J01K19k85L5K62k71oK77k44
$$ 70 -196 49 93 -198 35 125 -173 2 145 -159 -24 159 -146 -45 174 -111 -76 186 -85 -91 186 -58
2917e8o7L15k15j13K97j63j55L16j33k03L09p6k36K84l6k40K49J9k81K28P8l06
$$ -58 -125 190 -25 -138 159 -4 -159 157 24 -179 130 54 -182 102 66 -174 75 94 -187 41 119 -187
2939a87K01J16l03J62J59l10J20K09k91M5K58k78J0K74k60m2K99k10r8K95j75
$$ -187 14 130 -173 -11 148 -162 -42 167 -124 -79 179 -99 -89 185 -75 -117 182 -28 -126 169 -6
2960fj47L25j49k02L22q6k36K73l2k52K87Lk95K40P7k96J93J08l02J66J65l24
$$ -6 -153 172 23 -179 143 57 -179 94 62 -190 97 100 -195 45 122 -174 19 127 -175 -9 156 -168
2982a68J15K21l04N6K38k58J3K66k72l2L12k31q8L01j91j19L06j46j94L23q4k37
$$ -168 -53 168 -136 -80 158 -100 -87 179 -93 -125 187 -44 -132 169 -22 -141 165 19 -175 148 64 -173
3004a73K90m3k44K65lk97K61O9l02K00J00l05J84J48l29J44K05l21P3K46k93M1
$$ -173 117 74 -170 95 92 -205 56 125 -177 23 123 -182 2 150 -179 -35 170 -151 -78 168 -125 -84
3026h4K68k86k6L16k38r6L08j95j23L33j78j70L31j13k16L05o4k60L08j9l02K73
$$ -84 184 -102 -128 188 -50 -146 162 -33 -156 177 -1 -171 160 47 -169 136 72 -188 120 101 -201 72
3048G2O7l31K33J06l35K05J47l51J51K17l32Q6K41l09L9K76l00jL21k66q2L27
$$ 72 139 -192 41 147 -188 17 164 -187 -36 181 -151 -65 176 -133 -94 182 -118 -119 202 -64 -146 181
3070A81k30j00L37j99j66L36j18k36L40q1k57L28m0k97L07L3l35K52R9l43K22
$$ 181 -49 -149 188 -11 -177 159 41 -195 145 64 -193 135 95 -202 105 138 -197 55 154 -189 33
3091C3J33l52J74J95l53J28K21l31P9K71l25QL18k93m7L44k71q7L44k22j53L76
$$ 33 166 -186 -12 183 -170 -42 179 -152 -73 198 -127 -119 199 -94 -141 203 -68 -155 189 -33 -186 190
3113A90j72k06L55j24k40L47p0k94L39ql13K88M5l36K54J12l53K10J65l70J66
$$ 190 18 -188 167 43 -197 150 80 -214 125 117 -196 92 137 -199 55 167 -186 24 189 -181 -15
3134a5J94l41J18K40l49O5K86l15j0L25k91n3L38k54j10L67k13j71L59j53k14
$$ -15 179 -162 -44 196 -153 -88 198 -117 -127 198 -93 -146 192 -62 -172 195 -18 -189 170 17 -197
3155a97L52j00k59L51n2l04L28Nl21K87O6l52K49J17l58K07J61l61J66K01l50
$$ -197 155 55 -204 147 95 -209 119 124 -197 90 156 -196 53 170 -188 19 180 -181 -15 186 -164
3176a64J08K53l41M9L03l26j3L37k90p8L54k46j27L71k02j81L69j51k37L68j06
$$ -164 -56 197 -144 -95 208 -118 -131 206 -84 -162 192 -54 -181 190 -12 -193 176 25 -212 156 50
3197E0k62L56o0l06L26K0l27K82Q3l65K44J38l83K08K03l95J54K30l64J00K90
$$ 50 -212 144 84 -222 104 124 -203 79 162 -203 41 179 -204 4 207 -188 -34 196 -168 -68 222
3218B22l68M0L24l29l0L31k72q6L70k47j45L78k00j96L74j31k49L65q1k91L41
$$ 222 -146 -106 218 -111 -141 190 -82 -168 202 -45 -190 188 -12 -208 166 35 -214 151 70 -221 120
3239A20ol36L02N8l54K87R5l81K46J62l83J92K00l76J43K47l83P0L11l50J1L35
$$ 120 114 -222 80 138 -216 71 166 -215 31 193 -190 2 202 -174 -31 216 -167 -97 214 -136 -125 210
3261B10l27k7L65l01j10L92k39j61L75j83k11M00j53k62L84o6l14L54j4l36L22
$$ 210 -117 -144 221 -80 -190 202 -37 -198 177 -6 -217 183 30 -232 152 86 -228 126 112 -224 98
3282I8M3l63K80J26l84K30J62l88J95K22m06J32K72l69N9L03l38J3L51l47n2L66
$$ 98 141 -222 58 184 -200 30 192 -196 -1 221 -185 -53 219 -150 -91 212 -126 -113 238 -109 -161 205
3304B05k80j12L85k40j59L98k02k18L98j29k75L75o8l09L72l2l44L40N7l82K88
$$ 205 -75 -187 198 -42 -201 197 -5 -223 175 46 -229 146 78 -231 141 109 -235 105 162 -220 68
3325F8J03l74K49J59m05J80K41l94J14K76l69Q0L08l71J6L49l34n2L61k83j10
$$ 68 171 -203 46 205 -200 -20 221 -173 -59 217 -152 -72 236 -135 -119 230 -104 -156 205 -78 -188
3346a88L97k56j64M01j87k29L90j33k59L82p8l25L81j6l38L11M5l58L04R3l99
$$ -188 209 -47 -211 190 3 -226 164 31 -228 154 76 -249 132 116 -222 89 134 -224 80 173 -226
3367b26K61J70m01K02J95l80J41K57l86P8L09l54K9L19l27k4L58l15q4L77k43
$$ -226 35 205 -196 6 201 -179 -38 219 -167 -89 220 -134 -105 214 -113 -137 221 -94 -178 199 -44
3388d4j55L92k15j97M03j59k60L84p9k96L55n0l05L34J9l63L07R7l83K67J30l82
$$ -44 -199 193 -22 -219 184 25 -235 149 70 -226 129 79 -226 108 127 -236 71 168 -215 52 182 -200
3410b00K16J86l98J67K50l87J11K79l68N4L14l44rL49l09p7L62k49j35L84k17
$$ -200 16 202 -196 -29 221 -166 -55 224 -144 -90 224 -120 -129 220 -89 -166 196 -53 -188 196 -21
3431b1j95M05j83k26L81j20k69L83o4l36L63Jl53L11O4l64K95J09m00K45J72l88
$$ -21 -216 189 6 -220 161 41 -228 155 91 -245 118 119 -234 77 141 -223 72 181 -219 26 198 -190
3453a90J79K16l92J40K65l81P2L13l47nL50l24m5L53k84r9L79k43j57L91j91k25
$$ -190 -11 205 -187 -47 218 -163 -91 222 -125 -130 220 -104 -149 204 -80 -179 200 -43 -200 191 0 -225
3475b25L98j26k70L82q1l07L56j9l36L31K9l61L10Q2l79K61J58m10K10K00l82
$$ -225 173 47 -223 159 78 -229 127 108 -228 103 132 -229 81 163 -216 45 203 -207 3 203 -179
3496a79J41K59l90R7L08l75L0L31l39j6L59l12q6L92k72j46L99k21j93M00j65
$$ -179 -38 221 -169 -72 236 -139 -109 222 -117 -133 226 -86 -172 220 -52 -198 201 -20 -213 187 22
3517B2k42L91j09l02L80m5l30L57%l67L31P3l88K81J38m15K45J86m21K04K40m21
$$ 22 -220 171 62 -240 140 95 -235 122 122 -245 86 159 -229 52 190 -225 20 206 -215 -11 229 -192
3539a92J33K91l90P6L13l74QL69l36p5L87k80j11L87k58j61M25k04k46M22j51
$$ -192 -59 232 -158 -82 231 -143 -135 234 -102 -177 210 -70 -181 206 -52 -213 212 8 -238 184 33
3560C3k60L99j06l08L94l2l71L52N5l92L11R8m13K82J79m38K10K31m18J65K58
$$ 33 -227 172 66 -242 152 120 -251 101 156 -236 75 173 -240 42 221 -217 -7 224 -194 -29 229
3581B29m21J22L25m09K4L73l62k7L78l29q8M37l05j71M38k27k13M33j93k65M47
$$ 229 -192 -70 255 -154 -130 243 -119 -146 232 -97 -185 252 -53 -224 214 -13 -226 207 14 -251 196
3602A96j25l20L97l7l58L80nl82L56Q8m31K97J47m26K47J92m47K17K72m57J21
$$ 196 71 -249 148 111 -247 133 128 -254 102 190 -241 56 203 -223 24 216 -231 -14 258 -199 -78
3623g8L24m06O2L51m16J7M18l89p8M35l04j37M38k81j97M86k27k76M47j42k92
$$ -78 246 -160 -98 253 -163 -146 272 -117 -195 240 -64 -201 237 -44 -241 245 18 -258 189 47 -245
3644b45M31j10l52M26nm22L84O7m21L39J09m65L08J94m74K20K50m37J64K91m61
$$ -245 186 76 -276 150 145 -277 107 174 -247 92 201 -264 44 238 -236 -16 234 -203 -39 252 -209
3665b09J15L81m47J1M07l84l1M18l74j08M88l08k05M70k16k66M78j85l13M80j05
$$ -209 -94 287 -160 -149 258 -126 -157 261 -113 -221 267 -41 -246 224 8 -258 220 35 -278 202 97
3686I7l85M32k0l94M12J1m35L94J07m83L05J84m64K53K32m95K03L10m56R0L62
$$ 97 -288 144 124 -270 142 153 -282 112 219 -264 41 225 -239 14 246 -249 -46 264 -192 -102 260
3707B60m35N8L90m35j4M60l91j15M60l03j72M87k71k43M97j86l31M90j24l70M73
$$ 260 -175 -117 273 -162 -176 284 -107 -222 238 -65 -237 250 -21 -264 233 47 -284 206 82 -288 185
3728A85p0m18M51L3m81L86J26m89L48J63n18K90K63n12J98L18m92J47L59m78O4
$$ 185 115 -303 148 181 -300 86 212 -277 71 234 -284 6 269 -243 -45 273 -219 -72 287 -191 -127
3749a27M29m33m6M59l94j00M77l46j66N18k94k55N25k14l10N01j52l76M94n7m39
$$ -127 302 -131 -177 282 -112 -212 265 -81 -247 271 -23 -278 247 33 -277 224 72 -304 190 133 -306
3770c06M50K8m81M23R8n14L65J89n32K94K57n36K30L23n11J34L86m88O9M29m69
$$ -306 144 172 -309 114 212 -302 63 252 -280 14 271 -265 -35 288 -223 -89 297 -191 -122 307 -162
3791a62rM72m20j01N09l81j58N33l26k43N28k21l06N13j71l60N13q7m40M76J6
$$ -162 -171 301 -119 -220 289 -92 -250 283 -43 -286 242 21 -285 228 57 -303 210 123 -317 159 175
3812A75m76M21P5m95L87J58n35L14K54n38K33L13n47J89L88n37Q1M46m79MM72
$$ 175 -301 120 195 -300 87 245 -290 24 278 -260 -27 286 -261 -72 316 -221 -140 306 -173 -169 303
3833C03m43p3N31l99j92N60l12k56N45k59l05N49j67m21N31o8m38M68j1m70M65
$$ 303 -140 -213 318 -81 -273 287 -25 -281 264 5 -300 249 82 -339 192 124 -314 154 143 -327 138
3854A38P5n43L90J87n29L07K41n47K59L29n60J58M05n03O9M20m88J6N12m80j05
$$ 138 213 -330 60 247 -282 25 266 -281 -22 307 -253 -95 310 -193 -124 296 -192 -176 336 -144 -249
3875b49N41l66j83N36l28k46N85k64l60N56j28m03N01r6m33N21ln25M48J29n18
$$ -249 292 -74 -257 279 -49 -295 290 26 -334 222 94 -309 192 96 -337 184 181 -344 104 233 -285
3896b85L64J57n39L52K54n89K41L55n43J63L74n36J15M65n26k7N10m16j10N04
$$ -285 79 236 -303 49 303 -286 -45 310 -233 -70 304 -232 -117 348 -178 -205 305 -111 -221 283
3916B83l91j57N79l44k86N68k16l29N26j84l82N71q9m91M98L5m95M34P4n33M28
$$ 283 -108 -265 314 -30 -316 252 36 -293 233 49 -333 238 149 -342 156 191 -304 130 204 -329 99
3937I9J83o00L30K80n59K44L07n49J93M11n60O3M67m66j1M70m59n3N48m25j97
$$ 99 282 -318 12 292 -267 -23 284 -265 -72 339 -221 -158 309 -157 -168 302 -157 -210 338 -87 -284
3958b84N62l02k60N46k70l18N92j78m41N42m4m69N03k4m91M84R6n69L87K17n56
$$ -284 278 -24 -284 262 -8 -326 266 88 -353 189 145 -324 179 155 -336 148 244 -325 62 279 -277
3979b77L11K58n78K65L76o16J49M35n30P0M60n20J3N33m81j25N61l84j78N54l57
$$ -277 34 292 -286 -21 355 -261 -112 323 -207 -137 323 -197 -184 349 -132 -257 304 -80 -258 296 -61
4000f1k40N99k77l60N70j64l97N46j11m56N31jn30M80R6n40M20J58n86L94K46
$$ -61 -301 298 21 -339 231 67 -330 216 105 -351 180 179 -351 129 225 -315 105 263 -323 71 317
4021C17o09K77L40n65J81L87n75J27M87n56qN47m92p3N43m42j53N94l56k79N92
$$ 317 -292 -15 325 -240 -59 328 -247 -120 367 -189 -197 350 -142 -215 328 -114 -267 327 -29 -308 284
4042B84k82l31N87j89m17N73r3m82N32on10M75Q0n55M23J91n86L48K59n64K54
$$ 284 2 -329 258 69 -348 225 132 -350 182 176 -334 141 221 -334 89 280 -306 42 301 -263 -9
4063iL37n86J94M05n66J01M56n03j0N31m90r3N66m11k05N84l41k66N99k80l47
$$ -9 328 -258 -64 341 -225 -124 332 -171 -181 350 -140 -233 333 -78 -283 301 -40 -306 293 13 -334
4084c34N88j84m19N75r9m76N27%n28M82Q4n49M22J75n78L52K63n81K71L32n80
$$ -334 254 70 -349 226 127 -349 178 178 -350 132 216 -333 89 264 -314 38 301 -280 -9 323 -257
4105b57J99M11n63Q3M72n11lN14m76q6N57m25j90N83l32k65N57k60l32N88j86
$$ -257 -58 353 -210 -127 345 -166 -169 345 -131 -217 340 -85 -275 308 -24 -289 268 8 -324 264 78
4126G8m28N52n7m71M91Pn16M88R4n78L98K17n64L07K70n58K65L54n91J57M32n32
$$ 78 -350 202 145 -326 165 172 -344 144 238 -340 58 275 -289 18 288 -270 -5 349 -242 -85 347 -185
4148a85N5M51m91NN18m72j23N71l73k15N52l26k57N81k73l63N78j36m22N24q8
$$ -185 -130 321 -170 -165 353 -119 -242 329 -44 -259 293 -33 -290 291 18 -345 233 97 -325 199 111
4169A11m62N42ln57M80J36n66L85J84n69L75K57o21K60L83n60J43L97n34R4M85
$$ 111 -351 191 188 -369 111 247 -319 66 250 -319 56 313 -308 -48 335 -225 -82 315 -219 -125 360
4190C60n33m3N57m30j31N33m02j61N87l62l00O00k18l69N31j63l88N64j02n05
$$ 360 -173 -216 341 -89 -220 313 -89 -250 337 -25 -325 275 57 -312 219 56 -332 232 130 -375
4210c75N19O0n24M32R9n48M26J97o28L43L18n73K25L38n77K02M46o07N8N21n01
$$ -375 144 204 -320 112 211 -337 89 286 -342 1 319 -254 -29 309 -268 -66 380 -227 -169 352 -149
4231a49l5N03m59q7N96m41k31O04k94k97N68k63l34N94j90m66N74k9m82M78ln05
$$ -149 -184 319 -140 -227 369 -72 -303 301 7 -290 278 15 -319 275 85 -381 193 164 -318 160 157 -348
4253c48M94J01o11M02K37n59L02K64n77K94L60o29J58M65n29M2M67n24QN49n02
$$ -348 146 247 -364 38 275 -284 18 282 -295 -1 359 -270 -112 353 -176 -134 333 -191 -183 366 -136
4274a36j26N91l89k19N88l51k72O33k79m08O02j37m38N45q9m69N48%n61M70J37
$$ -136 -262 329 -60 -279 309 -42 -314 319 40 -368 234 97 -341 204 115 -354 194 194 -367 103 240
4295B40n67L96J80n63L47K79o06K34L87n57J50M05n45R3M97n45l6N47m31j32N43
$$ 240 -327 69 249 -314 33 312 -294 -60 327 -230 -80 325 -220 -127 370 -175 -211 336 -95 -227 316
4316C16l94j97O07l50l14O10k37l74N78j73m37N84p2n18N24N2n53M49J34n89M26
$$ 316 -78 -275 332 -18 -332 278 41 -333 245 72 -365 219 147 -371 153 205 -348 101 235 -354 72
4337G2K24o14L22L12n76K15L77n78J52M54n48J5N23m96m4N35m44j41N69l65k56
$$ 72 296 -318 4 316 -260 -45 332 -246 -94 360 -188 -173 350 -146 -190 345 -99 -240 329 -36 -292
4358b92N95k98l06N63k01m02N73j08m70N25j3n23M93P8n64M38J76n97L71K75o15
$$ -292 303 5 -301 262 61 -341 232 124 -346 179 166 -357 136 214 -350 88 264 -333 38 313 -302
4379c02K85L40n84J86M15n56R2M80n31mN35m76r7N53m14j85N79l30k74N77k54
$$ -302 -17 323 -261 -75 340 -216 -124 356 -175 -179 356 -120 -217 336 -78 -263 316 -14 -288 289 35
4400C5l48N55j71m06N46q9m81N17K0n26M45J12n38M12J84n95L28K94n79K51L42
$$ 35 -313 242 71 -335 211 122 -359 158 178 -348 97 209 -329 83 267 -328 0 294 -285 -34 308
4421C08n66J70M39n61M5N26n00n3N35m53j11N64m11k20N98l05l10N74k18l63N76
$$ 308 -258 -88 351 -210 -165 361 -139 -192 343 -110 -221 343 -68 -288 310 5 -305 269 51 -312 264
4442B64j62m56N47l9m83M49N4n11M51J20n80L78K47n57K58K98n46K32L61n67J07
$$ 264 102 -354 193 154 -329 120 174 -337 114 234 -346 32 279 -278 -20 278 -268 -36 325 -242 -135
4463a35M66m90qM83m53l9N32m54j70N86l30k65N45k58l04N75k26m06N65o9m69
$$ -135 331 -159 -167 316 -137 -176 356 -98 -268 318 -12 -277 268 10 -294 281 55 -351 214 145 -324
4484c24M80j9m70M90N1n67M23J97n41K84K39n13K75K94n60J67M12m97M6M33m64
$$ -324 156 137 -333 157 208 -359 64 261 -280 4 243 -270 5 299 -261 -94 318 -179 -133 300 -164
4505a64J9M82m65r4N40l55j94N00k96k28N48k66l59N63j31m00M71o7m14M93j5
$$ -164 -145 337 -128 -222 318 -37 -231 269 -27 -255 293 27 -332 231 100 -300 171 104 -310 183 168
4526A68n23M50J29n31L45J81n13L22K59n92K54L66n14J15L56m75J00M35m79m1
$$ 168 -355 95 224 -307 38 219 -294 28 287 -305 -51 315 -199 -84 272 -203 -103 332 -147 -188
4546a88M99l85j30M82l45j58N29l17k80N40j77l49M75j33l56M97p7m61M59O9m84
$$ -188 311 -74 -204 278 -67 -225 304 -13 -293 247 70 -279 196 63 -293 204 127 -334 125 194 -290
4567b90L68J01m84L68J70n38K77L00n12J92L17n04J69L86n02L4M65m37m9M60l90
$$ -290 78 179 -305 63 233 -305 -28 272 -240 -48 269 -235 -66 320 -182 -148 317 -120 -169 291 -99
4588i9q1M88l52k06N24k45k76M72j94l08N04j46l98M80j0m36L86N0m48L98J05
$$ -99 -180 308 -44 -250 274 29 -247 225 31 -277 227 81 -317 163 153 -283 103 153 -295 103 208
4609B08n10L11K28m89K30K51m82K06L32m97R9M06m52J9M28m18m4M73l74j46N18
$$ 208 -302 9 237 -252 -22 229 -253 -47 285 -212 -113 293 -159 -140 288 -130 -174 299 -75 -221 297
4630B97k94k25M85k51k62N01j87l44M75q3l90M25j1m32M13N0m61L50J42m66K76
$$ 297 3 -222 263 12 -250 251 64 -280 195 112 -278 147 136 -296 117 167 -294 56 198 -268 8
4651HJ94m55K08K86m67J48L32m43P7L83m22kM35l97m4M35l36j52M85k90k16M79
$$ 8 202 -253 -45 241 -226 -78 254 -189 -112 271 -151 -153 282 -115 -159 276 -60 -212 273 -17 -233 246
4673B46k13k79M67j45l46M62q5l78M09J3m27L74P1m47L31J51m68K67K16m73K14
$$ 246 33 -246 221 76 -270 192 107 -271 138 151 -276 98 169 -278 53 204 -264 3 219 -254 -40
4694d0K74m54J33L50m41M6L81l98JM03l68p0M30l00j58M44k41k08M67k21k81M60
$$ -40 234 -220 -87 263 -178 -132 249 -149 -148 255 -113 -183 247 -53 -211 233 -8 -216 251 30 -251 209
4716B09j23l47M30n9l68M01Qm31L71J03m58L13J49m45K60K09m76J99K90m42J10
$$ 209 86 -261 169 110 -258 143 151 -280 91 194 -264 49 198 -247 13 222 -254 -55 235 -207 -97
4737i7L22m04Q2L46m12kM42l67r1M17k96j28M37k72k12M64j70k92M16j22k90M11
$$ -97 225 -179 -97 249 -163 -165 277 -90 -181 236 -60 -188 249 -23 -235 229 59 -233 183 61 -229 182
4759A82q7l57L98K6m05L33O4l92L21J17m58K70K25m55J72K51m09J49L08m47P7
$$ 182 95 -262 136 162 -243 90 154 -238 83 200 -258 12 237 -218 -46 205 -204 -55 253 -194 -117
4780a17L85l86l5L85l30o1M14l17j61M62k33k13L95j72k25M24j52l24M24k9l69
$$ -117 268 -118 -153 232 -98 -159 255 -62 -223 239 6 -207 188 16 -209 215 63 -261 163 134 -235
4801b35L28K7l44L30N7m26L10J68m23J96K06l98J94K39m39J16L44l87KL48l38
$$ -235 93 120 -224 106 163 -263 47 215 -208 -12 194 -204 -10 229 -210 -94 250 -137 -135 213 -125
4822a25QL68l49j09M52k66j76L94k13j78M18k03k73M30p7l22L48l7l10L63j2l90
$$ -125 -117 251 -98 -207 245 -21 -197 197 -16 -194 224 21 -252 178 101 -221 127 90 -220 143 131 -259
4844b59L26J19l98K41J42l78K42J70m15J62K73l82Q0K70l40P2L13l65l2L88k82
$$ -259 67 186 -212 29 171 -207 35 205 -210 -48 225 -157 -77 193 -147 -75 238 -127 -159 229 -53
4865e3j05L51k42j21L90k37k09M18j34k65L55r4k74L82o1l49L54M6l67K80O8l45
$$ -53 -158 193 -49 -170 220 -17 -226 192 58 -207 148 54 -220 162 101 -248 106 152 -215 65 133 -212
4887b12K75J14m02K17K06l73J33K25l57J14K85l74L5L23k91m7L16k59o8L59k70
$$ -212 63 177 -225 -8 198 -175 -42 183 -174 -60 225 -149 -114 209 -82 -129 187 -72 -140 219 -51
4908e1j35L79j87j93L51j46k04L57j02k85L55l3l02K98Nl15K94O4l62K45J35l54
$$ -51 -186 193 6 -187 164 18 -186 171 69 -216 139 106 -196 102 107 -208 86 150 -212 33 168 -186
4930a86J84J71l47J56K14l57R6K75l34L2K87l06pL25k85o3L34k24j18L37j90j66
$$ -186 -2 169 -178 -22 192 -165 -69 206 -128 -96 191 -115 -122 203 -82 -145 189 -35 -153 184 -6 -172
4952a72L46j46k10L35r9k44L28m8k79K96%l05K76N3l34K57J06l36J85J63l45J52
$$ -172 174 28 -182 153 54 -190 138 90 -189 107 107 -198 78 131 -203 54 160 -176 9 172 -173 -21
4974b1J98l37R9K50l26M0K84k97MK92k68n6L33k40j02L17j83j50L32j52j83L28
$$ -21 177 -160 -61 189 -137 -97 187 -110 -106 186 -82 -138 195 -45 -147 170 -13 -163 169 17 -166 162
4996A62j11k24L01n2k40K69j0k80K65M8l11K11J03k93J82J18l09J62J74l17R0
$$ 162 51 -173 128 76 -164 105 95 -185 80 128 -183 28 131 -162 20 138 -171 -9 165 -152 -62
5017f2K23k87O0K30k87K4K78k59m4K94k23q0K96k05j01L12j53j83L06j00j87K81
$$ -62 161 -126 -66 164 -123 -99 179 -80 -124 170 -53 -133 163 -42 -143 169 16 -167 139 39 -148 133
5039A33p8k29K96j8k68K35K7k56K25M3k85J99J19k96J34J63k83J21J61l00R3K32
$$ 133 55 -174 122 104 -164 71 98 -158 67 110 -175 24 143 -153 -19 144 -139 -18 143 -157 -64 168
5061A68k66J5K27k35J4K41k35n1K88j90j04K64j50j14K91j50j84L22p2k43K66
$$ 168 -98 -83 144 -91 -77 164 -71 -122 166 -24 -128 136 -14 -128 163 13 -171 151 79 -164 102
5082A02m1k15K57j5k71K56N2k86J89Q7k55J75R8l01J50J73k80O9J92k43O5K00
$$ 102 61 -154 103 88 -183 73 125 -161 28 115 -140 35 133 -168 -18 155 -125 -56 136 -107 -42 158
5104A58k70J2K80k37m4K39j89m6K58j96j10K98j21j75K67r1j63K67p1k44K83l
$$ 158 -112 -100 180 -57 -101 138 -51 -97 161 -35 -145 153 32 -143 124 33 -130 137 66 -178 105 102
5126A02k57K19K8k43K22M0k89J86J40k80J09J54k67J15J63k83P2K29k50QK18k20
$$ 102 -155 64 92 -151 71 111 -178 8 148 -132 -23 131 -136 -21 142 -141 -69 160 -90 -82 136 -84
5148h4mK46k35m8K90j75j14K60j30j32K74j29j79K84n2k17K34k5k09K40mk65K18
$$ -84 -88 158 -77 -125 165 -10 -124 136 6 -126 148 19 -160 124 72 -145 89 64 -145 95 91 -174 44
5171D4O9k56J58J06k70J69J21k97J15J93k68N0K14k67M7K42k66pK64k11n8K51
$$ 44 113 -143 15 121 -149 20 141 -156 -41 152 -116 -66 148 -119 -72 170 -96 -103 161 -50 -108 143
5193A43j82p6K79j75j29K95j21j70K61p8j90K71m9k39K46K2k78K04O1k48K16Q2
$$ 143 -39 -115 164 -11 -140 155 34 -136 125 47 -143 128 79 -160 86 108 -170 34 95 -153 63 145
5215A45l12J73J39k86J15J62k63Q5J92k76P4K02k41J6K23k25rK56k27o1K86j91
$$ 145 -167 6 145 -141 -26 136 -127 -42 150 -126 -52 150 -91 -75 148 -77 -86 170 -57 -118 168 -23
5237b3j11K89j44j43K85j29j61K85q0k10K55m9k60K83lk56K42J6k79K16P5k45
$$ -23 -134 155 11 -132 153 24 -137 148 68 -142 113 64 -196 87 84 -172 70 86 -193 23 98 -147
5259a47J65J00k81J17K11l12J16J87k89P5K42k52l9K85k42l3K62k22q0K89j84
$$ -147 18 118 -163 -46 165 -147 -31 156 -133 -58 184 -68 -107 178 -64 -97 165 -57 -137 152 -32
5280c2r7K86j44j53K85j21j95L00n1k57L00o5k45K74J2k84K25P2k95K18P6k89
$$ -32 -129 157 13 -140 145 24 -171 129 78 -179 121 56 -189 85 97 -187 38 110 -185 33 109 -180
5302a80J72J59l09J10K03k99P3K23l04P0K54k56q3L42k37r5L11j92r8K86j22k08
$$ -180 -8 151 -158 -48 155 -144 -71 152 -152 -82 172 -84 -167 175 -62 -157 154 -38 -136 150 28 -180
5324a80L14j19k11K87mk66K89m1k10K08rk17K09Q2l79L28L2k73J41J89l45J53
$$ -180 134 15 -196 91 87 -179 110 69 -141 67 58 -159 50 132 -247 81 113 -160 -19 170 -175 -22
5346b2J97l18O6K53k81K8K53k74J2K58k34o5L13k21r8K87j38j68L26j54k12L11
$$ -22 175 -143 -77 176 -105 -77 176 -98 -86 172 -62 -127 186 -35 -133 154 16 -152 174 20 -192 119
5368A19k5l01L02L3l14K47P5l27K99M1m01K98N1k49J26J75l25J28K03l02N9K56
$$ 119 94 -207 95 128 -186 61 136 -191 108 149 -252 46 97 -152 -26 149 -176 -48 155 -147 -88 168
5390A68k93M6K55k87oL16k59q6L13j96j00L13j92j56L40j20k29L05o4k26K88n4
$$ 168 -125 -79 176 -111 -117 199 -60 -146 167 -29 -129 184 -8 -164 176 56 -173 132 68 -158 130 76
5412G6k74L06K6l21K52O9l06K21R6l45K14J75l59J27K08l04R8K28l26M0L06k98
$$ 76 -198 108 134 -187 65 134 -172 49 145 -200 14 189 -170 -43 165 -139 -41 187 -139 -99 207 -91
5434i1m2L17k50o6L27k32j21L49j59j99L25j22k04L15r8k60L42m5k89K61O2l25
$$ -91 -133 184 -66 -132 195 -37 -158 191 32 -167 158 36 -168 147 49 -211 131 86 -203 58 120 -205
5456b05K45O9k84K32J44l77J74J32l01J57J81l46J17K88l49J6K96k89k8L38k95
$$ -205 40 109 -175 57 201 -176 -2 130 -171 -14 167 -179 -62 226 -123 -107 189 -100 -128 210 -85
5477h5q0L70k29j47L54j85j75L59j50k35L58n4l02L15j1k97K98J7l28K80Q7l49
$$ -85 -165 205 -24 -171 183 -2 -177 182 32 -203 155 101 -201 114 103 -194 104 121 -207 73 160 -189
5499a89K10J47l51J88J84l68J36K43l49P9K54l07L2K93l29j1L44k59r5L19j71
$$ -189 21 168 -183 5 189 -179 -43 200 -149 -70 184 -123 -91 202 -127 -138 206 -53 -148 171 0
5520@j90L74k01j82M03j74k00L10j09k31L32%l61L30N4l51K39R6l20K29J35l53
$$ 0 -190 184 -17 -199 204 30 -170 140 31 -200 132 132 -229 101 155 -196 43 139 -181 48 183 -170
5542a70J72J85l63J19K49l42O4K99l40J1L24k98n2L39k60r8L64k25j59L70j78
$$ -170 2 187 -176 -57 192 -150 -86 213 -127 -116 208 -90 -142 197 -63 -161 203 -22 -181 189 11
5563A1j96L99j64k14K79o2k49L32k8l22L08M2l52K83R0l43K18J34l54J85K01l75
$$ 11 -185 214 50 -164 115 53 -196 136 108 -214 94 136 -216 67 157 -186 32 166 -188 -3 198 -177
5585a77J16K69l63O8K95l27J6L10l05l9L41k62r8L56k28j51L66j77k12L64j04
$$ -177 -61 208 -155 -87 208 -119 -103 207 -98 -137 204 -58 -156 200 -28 -179 187 10 -202 162 58
5606E8k53L44q0k61L27k1l31L13M1l40K65R9l67K44J51l85J86K21l72J17K35l50
$$ 58 -195 149 69 -192 135 114 -217 96 137 -203 62 161 -206 38 189 -196 -10 211 -161 -44 191 -159
5628a59P9K95l43KL33k93o4L41k68q2L69k44j75L86j48k23L44j11k46L54n1l16
$$ -159 -80 215 -128 -126 207 -86 -150 191 -77 -159 210 -34 -209 177 29 -194 150 39 -207 147 96 -220
5650b20L33K3l30K74N1l52K75J21l81K12J72l57J65J97l69J28K80l71M4L19l29
$$ -220 113 136 -194 80 131 -221 54 175 -206 6 178 -179 -14 183 -186 -58 222 -149 -105 214 -115
5671a15jL20l04m4L62k86j15L84j98j78L55j79k11L98j29k74L47l1k92L05Ml41
$$ -115 -116 204 -100 -144 218 -68 -183 201 3 -175 180 1 -210 188 59 -215 132 101 -191 114 118 -223
5693b23L25O9l82K45J42l57J75J93l73J68K37l86Q5K94l37K2L06l26j0L49k90
$$ -223 102 171 -211 34 176 -181 -6 187 -186 -18 219 -167 -82 212 -125 -103 203 -123 -133 216 -74
5714g4j06L77k21j49L51k05j70L84j57k52L62o7k69L22m8l03L37L3l65K68J16
$$ -74 -180 197 -24 -173 178 -27 -197 187 30 -222 140 73 -196 126 78 -225 112 145 -220 48 164
5735A64l47K19J24l60K05K05l86J23K55l29N1K77l32K4L28l17o5L50k42j00L30
$$ 164 -183 36 160 -200 5 210 -176 -53 202 -127 -76 201 -131 -107 221 -96 -161 189 -53 -153 177
5756A77k23j36L67j68k26L58j00k47L32p1k86L47rl23K73P2l29K53Q6l52K38J62
$$ 177 -46 -182 185 17 -209 149 49 -198 134 63 -223 124 115 -208 65 137 -192 61 147 -205 33 195
5778A95l72J60K15l49J26K17l45P6K98l39oL27k86n8L34k55j05L62k19j79L68
$$ 195 -177 -17 198 -151 -25 192 -153 -77 221 -118 -124 203 -83 -141 193 -62 -167 195 -24 -203 165
5799A65j39k06L31j07k50L50o3k83L14Kl10K73O0l38K67R9l49K04J67l55J73J85
$$ 165 26 -180 151 44 -206 144 81 -202 112 114 -196 77 137 -201 66 165 -184 20 187 -168 5 190
5821A90l55J23K60l56N8K84l07%L16l02m5L46k61j24L55k07j50L40j67j98L63
$$ 190 -165 -42 218 -138 -80 204 -103 -103 213 -89 -134 212 -49 -173 182 -25 -175 165 -2 -200 163
5842A63j14k60L36m7k80L03J6l27K82Q6l53K55J14l46K12J32l43J56K02l45J09
$$ 163 49 -211 125 78 -202 101 117 -210 72 158 -195 60 174 -172 40 172 -171 -15 187 -158 -49
5863d9K51l41O2K80l11J3K92k88n2L29k41j02L40j97j66L52j64k08L43r5k46L34
$$ -49 202 -139 -77 203 -108 -95 197 -91 -143 186 -55 -157 183 -14 -180 172 8 -200 143 48 -198 136
5885A36o5k82L27j9l03K87O4l41K34J41l51J91J50l17J34K25l73J12K67l47N1
$$ 136 71 -211 116 97 -206 81 145 -196 38 179 -172 19 169 -148 -14 211 -162 -50 217 -130 -79
5906g9K77l04l4L65k98p3L45k57j29L61j71j80L49j62k00L47q3k76L16k7l02K87
$$ -79 198 -106 -140 225 -73 -146 199 -58 -187 174 3 -177 172 10 -190 157 74 -202 114 87 -215 72
5928G2M6k66K46Q4l23J93Q4l33J82J91l32J94J76l82J12K29l12R5J90k02j15L57
$$ 72 118 -148 98 182 -141 52 136 -197 -15 176 -156 38 214 -168 -56 173 -139 -44 146 -56 -171 186
5950A86k16q5L21k42j28L06j04k51L42j13j98L03q8k29L38q1k82L21J9l00K42
$$ 186 -30 -115 206 -36 -164 142 38 -213 129 16 -182 121 33 -196 142 61 -221 100 119 -181 61
5971F1P5l07K20J21l42J80J78l22J23J76l05J05K28l11L7K77k63k6K63k34p9L24
$$ 61 136 -171 49 170 -172 8 186 -136 -13 163 -142 -37 191 -120 -83 194 -69 -95 168 -66 -145 179
5993A79k39j17L31j51j81L22j27j83L17j15k15K67o0j83K69m0l24L11L8k50J52
$$ 179 -60 -177 154 3 -178 144 17 -166 151 36 -179 88 28 -155 114 74 -250 61 99 -151 1
6014AJ24k91J65J70l31J71J50l18J10K24k30L5J85l00L0L38l28n9L20j70j44K31
$$ 1 125 -166 -1 169 -162 9 159 -159 -49 175 -55 -20 165 -135 -105 233 -95 -154 166 -4 -148 83
6036H3j52oK47k11j29L00r0k08K86r3j86K16j8k54K63P5k87J93R9k73J68J75l35
$$ 83 -69 -75 172 -39 -168 132 42 -166 120 27 -159 57 39 -215 48 123 -164 29 128 -145 23 198 -137
6059a37J19K06l02P0K17k81L8K50k63k8K92k38n1K65k03j06L23j85j54L10j26
$$ -137 -18 188 -114 -44 173 -108 -70 180 -83 -111 181 -57 -108 157 -46 -152 171 -14 -168 142 16
6080A6j80K77q3k05K82l5k66K56L6k60K15O5k92K09J09l01J50J79k92J05J80k79
$$ 16 -164 113 30 -175 107 72 -194 62 98 -162 53 118 -174 35 144 -157 -7 172 -120 -15 165 -114
6102a14P7K32k79j1K77k44l5K60k07p5K83j86j28K90j33j61K80j06j87K85p5k11
$$ -114 -37 195 -84 -95 182 -62 -97 163 -44 -119 164 -22 -150 140 7 -154 126 20 -167 118 43 -168
6124a68K67j7k59K44K4k67K32N9k87J92J05k73J49J50k82J10J85k67M8K32k62
$$ -168 99 82 -177 67 91 -176 56 115 -172 20 125 -148 1 151 -131 -21 164 -103 -55 177 -85
6145h5K4K36k39j7K49k15o6K67j85j10K84j44j53K80j09j82K75o2k15K61l3k39
$$ -85 -61 175 -64 -81 168 -47 -113 154 -31 -141 143 -1 -154 126 17 -165 110 48 -167 94 61 -178
6167a78K39L6k59K00P5k94J17K43l08J68J30k87J08J75k48J11P0j54K6J74j89
$$ -178 61 97 -162 38 113 -181 -64 179 -129 39 169 -118 -10 165 -83 28 98 -56 -30 144 -45
6188d5o2K76j97j16L32k58n9K66j44j59K88j05j56K22o8j78K26j8k40K93M6l60
$$ -45 -107 169 -28 -144 188 -70 -129 137 -7 -166 122 17 -139 83 15 -163 63 45 -195 98 144 -216
6210b16K11J80l81K51L0k06J10J92k95Q6J92l00J27J32k10J0K53k30k6K50k31
$$ -216 -5 175 -206 45 75 -131 -21 171 -124 -38 154 -146 -19 113 -97 -87 166 -64 -90 160 -71
6231g1n9K82j88j13K76j72q0K26o5j97K86r7j77K63n2k51K54J6k22J88L2j99J68
$$ -71 -130 152 -36 -149 127 -45 -125 101 36 -161 125 28 -149 114 62 -189 65 81 -141 47 79 -120 48
6254D8O4k37J32J31k77Q6J70k13P6K21k99m3L20j86j28K18j24r4K85j58j10J75
$$ 48 112 -125 7 138 -139 -53 117 -96 -20 201 -98 -141 179 -7 -135 83 -41 -135 150 -8 -118 57
6276E7Lj52J73j25n2J67J7k13K34m6k15K18K6k29J77J43l04J66Lj50J28J35l24
$$ 57 60 -92 81 -44 -96 71 88 -125 109 63 -152 66 92 -137 40 183 -121 45 48 -102 26 161 -163
6299a63J44J56k25L0K06j99k1K51k54K2J70j86o4K68j47j17K49j31q7K12j05j74
$$ -163 -19 137 -88 -58 148 -51 -72 179 -75 -53 117 -69 -133 135 -12 -129 120 -11 -98 114 9 -165
6321a65L02p0k18K04M0k53K71m8k16K09M4k20J03J17k37J36J39k62R9J98k63O2
$$ -165 137 67 -151 53 93 -160 111 63 -153 56 100 -120 -17 100 -137 -1 138 -124 -25 173 -90 -28
6343b8J45j54J1J97k26oK56k28r3K88j81q2K60j48j62K73r8j35J62L7k36K19l1
$$ -28 117 -37 -26 171 -55 -61 195 -33 -126 162 -19 -101 159 11 -151 122 24 -111 51 88 -148 71 40
6366D0j89K06M4k31J85M8k37J45J06k46R9J78k76R8J38k01N8J92k40m5K79j83
$$ 40 -149 57 101 -130 55 103 -134 11 117 -129 -30 148 -128 -30 108 -93 -35 157 -83 -128 151 -32
6388c2jJ75j88j7K41k12r3L18j56j63K43m9j99K43o8k16K53pk30K01L9k27J80
$$ -32 -33 142 -46 -63 178 -34 -127 191 35 -128 115 66 -133 110 42 -174 79 72 -158 43 82 -145 35
6411C5P3k67J72J15k52J16J43k61J11J79k59M8K13k34lK21k02l0K37j73r2K53
$$ 35 108 -159 13 128 -124 -8 135 -126 -15 164 -95 -47 166 -68 -71 150 -52 -82 155 -18 -110 143
6433A43j44j25K55j23j50K65q0j91K52m5k15K25jk26K00N1k51J81Q6k51J48J10
$$ 143 -1 -126 129 6 -144 121 41 -150 102 57 -158 67 66 -160 40 91 -160 21 107 -144 4 114
6455A14k43J17J40k42P6J88k39L4K12k23JK14j97m2K45j78r5K55j46j22K53j01
$$ 114 -129 -12 128 -114 -38 150 -89 -55 157 -66 -65 149 -48 -90 155 -23 -118 137 -9 -131 122 21
6477B1j56K53p7j91K42l6k04K17Lk24K01M3k41J76R4k61J41J14k40J05J54k50
$$ 21 -135 118 41 -150 92 56 -148 69 72 -152 49 92 -149 27 121 -140 1 115 -125 -20 134 -116
6499a16O8J91k36L6J94j99j0K20k00m0K51j78q5K31j29j06K27j18j47K62o7j91
$$ -116 -48 143 -93 -57 137 -62 -72 148 -52 -92 159 -19 -104 127 -2 -108 119 1 -146 116 49 -142
6521a42K31m1j97K28jk28K00L8k36J70Q3k35J53R8k45J21J51k44N6J78k25M3J89
$$ -142 89 48 -149 79 78 -150 50 88 -148 22 105 -130 23 121 -124 -3 148 -96 -40 138 -87 -44 145
6544A45k20kK32j92n8K33j62o7K20j38j16K42r9j49K21o0j63K33n5k08K34Mk22
$$ 145 -75 -77 155 -37 -95 138 -24 -91 129 -9 -125 117 18 -131 90 30 -133 100 45 -163 71 75 -147
6567a47J80M2k15J82N9k49J51J20k41R6J44k12P8J47k36N5J96k17kK13j87k4K07
$$ -147 33 75 -140 42 101 -148 3 123 -118 -22 122 -90 -12 135 -101 -46 150 -67 -69 144 -43 -67 140
6590A40j66q0K56j39j26K26r8j25K26q9j75K56m4k05J95Jj92J87L1k35J86P5k41
$$ 140 -26 -106 150 11 -115 111 13 -112 114 25 -150 106 62 -143 52 53 -139 48 79 -156 30 105 -136
6613a36J32J01k15J26J16k43R0J87k35K3J76j83QK01k02k9K38j55r8K31j35r4
$$ -136 -4 97 -118 8 124 -119 -29 158 -77 -54 122 -61 -53 148 -54 -83 155 0 -98 133 -2 -96
6635i6K23j20j42K53n9j88K13l3j78K15k1k17J87O2k34J46Q3k15J42Q7k31R9J60
$$ -96 127 7 -135 118 59 -129 84 51 -127 88 67 -150 37 99 -135 11 94 -121 21 108 -123 -24 136
6658A36k29N3J60k10N0J82k21QK13j67m3K04j57o2K17j41j02K41j02j40K07o0
$$ 136 -93 -40 120 -90 -40 142 -79 -71 142 -25 -68 136 -21 -83 134 -7 -109 132 30 -110 97 37
6680C7j65K18n2j84K12J1k10J80L0k09J61O5k25J34J11k23R8J23k16Q4J52k26
$$ 37 -128 90 38 -146 66 77 -133 47 77 -132 29 94 -131 3 114 -109 -11 112 -104 -20 132 -94
6702i4L2J89j86j2K05j84k7K26j68p7K29j30j05K14r0j28K11p7j56K09k5j84J91
$$ -94 -62 127 -59 -71 134 -50 -77 149 -19 -96 133 3 -102 112 22 -106 105 28 -128 81 56 -128 63
6725F3lj89J80K1k03J48P8k17J24R8k17R9J29k10O7J54k00K4J85k00lJ92j56m6
$$ 63 60 -129 51 72 -131 17 95 -122 2 100 -117 -18 111 -99 -32 122 -78 -54 131 -69 -72 120 -36 -82
6749h2K07j40q0K07j04j07K16q8j37K19o8j58K04l4j74J89lj92J78J8j99J48P4
$$ -82 125 -15 -95 112 8 -99 117 29 -108 111 43 -115 89 55 -119 70 67 -125 53 71 -128 20 94
6772I4k14J25Q8k08Q6J37k20P4J62j98K3J71j72j3J88j78k1J98j41o7K13j18r9
$$ 94 -120 5 93 -115 -29 108 -112 -38 124 -74 -51 120 -52 -65 123 -55 -76 122 -19 -86 127 9 -90
6795i0J93q6j25K13m6j69J89k0j65J74Kk02J85K7k04J54N2j91J13Q9k08J00J30
$$ -90 103 17 -108 105 59 -110 79 59 -106 68 70 -132 53 80 -124 30 82 -109 4 93 -115 -15 115
6818A15k16P3J33j73K0J57j81RJ98j82k1J85j44n1J96j21r2K06q3j39K10o8j40
$$ 115 -101 -28 105 -68 -48 109 -72 -63 135 -47 -68 117 -27 -78 118 -3 -95 111 28 -111 99 31 -109
6841a09J90l3j62J84J2j99J56M2j94J45M5j99J13J17k09P0J26j85O6J26k01M8
$$ -109 81 48 -114 70 82 -117 39 81 -113 32 77 -122 -9 108 -101 -31 95 -90 -24 102 -99 -51
6863e1J67j74j5J85j42m2J91j52m9K09j20r6J89q9r8J87o8j51K00k3j69J60J8
$$ -51 116 -58 -73 112 -30 -72 119 -33 -82 127 7 -89 100 11 -87 100 32 -119 81 58 -111 49 67
6886F7j69J60J5k07J61O6j97Q0J17j99Q9J23j99N9J62k00J4J62j58lJ75j72l2
$$ 67 -102 58 73 -134 27 93 -104 -24 93 -106 -17 106 -93 -34 128 -72 -58 104 -54 -57 118 -54 -86
6909h6K07j31q1J91q7q9J89r1j27K04n0j60J73j7j44J63lj77J61N2k09J24P0j71
$$ -86 121 -10 -91 100 13 -76 113 22 -105 99 49 -111 62 45 -99 64 61 -116 45 97 -112 12 82 -89
6933h9R6Q3j97R0J21j82K4J53j65J6J66j82pJ97j44n5J76j13o9J84j03r5J95o7
$$ -89 7 90 -107 -17 104 -78 -54 99 -66 -50 116 -66 -73 124 -20 -75 101 -12 -81 103 0 -95 100 33
6957C3j35J75k5j47J73k1j66J76K0j89J33M6j86J31O8j97J04R4j94P2J28j63L2
$$ 33 -102 73 48 -99 74 53 -113 63 83 -106 27 73 -113 18 86 -111 -7 87 -107 -35 93 -70 -38
6980c8J42j87K6J71j51l5J71j27m0J79j33p7K01r4j08J91o3j31J88m5j37J75j4
$$ -38 104 -83 -57 114 -37 -72 99 -28 -68 111 -22 -99 102 8 -100 91 28 -103 85 40 -97 78 64
7003F4j73J55K4j73J51L6j97J30P7j97R5J07j87O4J28j99N0J58j85RJ62j58qJ75
$$ 64 -109 46 70 -103 48 84 -113 17 94 -103 -8 99 -88 -24 104 -95 -45 113 -72 -63 99 -59 -67 108
7027A08j42m9J89j07q4J88q6j07J83o2j38J89k4j60J73rj69J59K6j86J42N6j93
$$ 108 -34 -83 106 -1 -85 103 17 -90 93 31 -107 82 58 -102 71 62 -107 52 78 -108 34 90 -103
7050a03J13Q1j94R1J13j84M7J31j87L2J58j63J4J51j49l5J72j27m8J87j12q0J88
$$ -103 10 91 -103 -12 101 -83 -36 95 -92 -60 98 -65 -51 100 -49 -84 88 -39 -87 100 -12 -92 96
7073I6q4j15J91p1j20J86l6j52J66Lj64J40L5j84J48N2k03J19Q7j78P2J14j93
$$ 96 12 -103 88 17 -103 83 47 -105 61 64 -100 40 75 -109 39 91 -112 7 94 -84 -12 102 -91
7096i1O7J35j98K5J73j75nJ85j66l3J93j40o6J93j07q0J77p5j17J96m6j62J93
$$ -91 -24 111 -87 -62 111 -64 -69 116 -50 -83 110 -30 -96 97 -10 -90 87 12 -105 91 45 -117 76
7119G6l2j51J64J0j81J61L4j91J22P4j80R6P8j89Q9J31k07M5J58j84J8J62j78
$$ 76 44 -107 57 67 -114 47 81 -110 12 86 -94 2 80 -109 -20 111 -96 -51 107 -77 -59 103 -75
7142g5QJ90j51o8J89j05q2J96j20q8K13r4j27J88l1j42J74l2j61J74J5j88J47
$$ -75 -67 123 -28 -96 93 -12 -94 102 -18 -106 107 13 -114 74 43 -99 75 43 -118 56 71 -117 30
7165C0M6j72J30O0k06J18J00k01N7J42j83M4J36j90L7J57j68k0J69j22m4J88j41
$$ 30 76 -96 34 94 -112 6 106 -95 -38 104 -79 -35 101 -89 -52 105 -63 -83 86 -36 -80 108 -33
7188c3o3K09j16j10J99o4j15J75n6j41K02k0j87J69L6j81J36M3j94J39Q5k19R2
$$ -33 -96 113 -3 -113 86 22 -93 82 26 -115 87 67 -120 49 85 -96 40 83 -111 28 113 -106 -14
7211a4J07j88Q4J09j99N7J58j92J2J68j53j2J72j62k9J95j30r4J93q9r1J85p5
$$ -14 93 -95 -11 98 -101 -44 114 -78 -66 102 -51 -63 109 -53 -82 113 -17 -111 82 -7 -98 87 12
7234A2j20J99l5j74J81mj55J67Kj83J55M6k06J29Q0j91J04J02k15P7J50j96K0
$$ 12 -108 91 56 -118 63 59 -96 71 73 -110 45 91 -115 14 94 -97 7 109 -106 -29 121 -75 -55
7257e5J66j86OJ75j69j3J79j37p1J98j13p5J97j11j02K13o5j46J84k8j56J85n
$$ -55 111 -75 -69 106 -63 -76 103 -34 -105 93 -20 -95 102 -9 -111 102 37 -109 75 47 -109 76 71
7280G1j91J91K4k04J35P2j92J11Q1k01J02J20k05P3J27j93K2J60j60nK04j91k8
$$ 71 -120 71 95 -109 26 98 -94 17 98 -103 -1 119 -86 -13 114 -79 -57 103 -57 -62 142 -49 -77
7303g7J44j15q2K40j54q5J93k9j60K25m6j61K06m5j21J10J4j37P5P0j87J56M9
$$ -77 67 -48 -130 110 -44 -129 64 35 -125 100 54 -107 99 54 -67 43 57 -80 -5 65 -122 34 83
7326H3j79J06J17k30R0J53k05N9J32k02K1J83j65j9J50j56m4K04j24p8K00r9j14
$$ 83 -96 10 127 -103 -13 140 -65 -6 126 -76 -55 128 -37 -56 94 -62 -106 98 -26 -104 96 -3 -117
7349a17K07q0j25J92n0j54J97k1j58J62K0j81J59L1j87J41N7j93J24Q9k02P8J34
$$ -117 90 10 -115 77 27 -127 70 49 -109 53 73 -108 51 82 -105 36 93 -100 24 113 -89 -11 123
7372A23k04N1J42j87K2J76j89l0J98j50l9J70j26n7J90j00j13K06o8j23J79m1
$$ 123 -81 -30 112 -75 -53 123 -66 -96 102 -48 -87 83 -43 -100 90 -10 -123 83 15 -108 71 30
7394C0j56J95j3j83J74K4j74J45L9j94J50O8k14J02J19j98P0J21j89N8J47j97
$$ 30 -126 69 56 -127 47 71 -103 42 81 -113 37 105 -109 -7 112 -86 -16 105 -84 -26 121 -76
7416g6J5J72j66j5J71j60k8J96j40q0K05q8j14J95q5j19K00n5j58J88lj68J69
$$ -76 -61 111 -55 -70 101 -59 -87 109 -31 -111 94 6 -108 87 2 -117 83 28 -130 58 55 -113 56
7439E6Oj81J68N4k17J29Q7j82R3J00k12R1J33k09M1J61j72QJ69j77j2J93j52o7
$$ 56 62 -119 49 103 -114 15 102 -80 13 113 -99 -8 125 -84 -43 118 -54 -46 123 -54 -66 127 -25 -92
7463i2K03j18q7J78r7j09K21p7j48J87l4j34J52kj68J79K6j97J44N2j69J15O3
$$ -92 111 -7 -94 84 -13 -122 99 22 -126 61 27 -107 45 43 -125 54 80 -117 27 79 -90 25 88
7486H8j95J15J07j99N6J41j76L5J36j73J6J85j82k8J73j33m3J72j33p0K15j04
$$ 88 -107 8 115 -84 -28 113 -63 -28 108 -65 -49 136 -46 -74 99 -34 -77 95 -38 -108 107 3
7508Cj25J97n1j35J90n2j55J88nj85J59M0j77J41M7j94J41P4j91R1J09j85O0J16
$$ 3 -122 75 24 -111 79 27 -128 60 55 -130 29 69 -108 33 80 -114 27 101 -90 1 110 -75 -15 101
7532A01j90O3J54j92JJ77j59k6J76j61l6K09j33r6J95q0j08J81p0j37K17l5j79
$$ 101 -89 -26 128 -64 -63 114 -45 -71 105 -56 -92 117 -16 -112 83 3 -105 76 6 -131 86 51 -128
7555a28J70Jj56J53K6j87J55N6j89J04J02j95R2J01j92O5J40j89K2J43j43PJ50
$$ -128 42 43 -113 40 66 -121 34 90 -99 5 107 -88 4 105 -87 -22 118 -71 -49 94 -49 -42 108
7578A08j64j7J92j55o5J89j08p8J81r1j04J90o5j38J93k9j42J50Qj72J64K2j86
$$ 108 -56 -73 119 -36 -101 88 -20 -98 83 -8 -112 78 13 -125 68 39 -103 47 55 -117 47 69 -117
7601a17J30O4j82J13R7k03R5J09j82M1J30j54K5J41j62LJ61j50l0J79j36n0J75
$$ -117 13 77 -105 8 105 -98 -3 106 -76 -35 95 -59 -34 107 -55 -52 109 -41 -71 108 -28 -78 97
7624I7j10q9J86q4j11J70n5j22J83l8j43J62Qj60J30L4j68J29N5j65J00R2j82
$$ 97 -13 -102 84 0 -111 59 4 -118 65 27 -116 46 54 -106 24 58 -110 19 74 -91 9 101 -81
7647h1P3J06j67M4J36j78K6J51j54j1J57j41l5J67j15n8J69j09q2J84r1j13J88
$$ -81 -8 98 -69 -25 111 -67 -41 110 -44 -55 102 -39 -74 93 -22 -80 89 -20 -102 82 -9 -122 66
7670F6n1j29J59k3j38J54jj53J40M0j68J27N3j74R9R9j87Q1J11j68M2J27j59J9
$$ 66 15 -114 45 22 -116 38 37 -116 24 64 -104 23 76 -98 1 100 -87 -6 105 -63 -21 106 -53 -34
7694c4J45j61j2J70j30n2J59j13m3J61r6j01J78o1j17J61m2j20J63l1j49J65J3
$$ -34 111 -50 -62 108 -22 -74 85 -28 -71 90 -6 -107 71 10 -107 54 12 -108 55 24 -125 40 53
7717E3j49J05L1j37J04N5j62Q9J03j69O8R5j42N5J07j67J4J56j51nJ41j27l5J70
$$ 53 -96 9 40 -97 7 62 -100 -11 92 -77 -9 86 -56 -1 106 -61 -47 109 -42 -47 94 -33 -68 102
7741A02j19p6J75q3q6J52o6r0J62n8j22J51Jj32J31rj34J38K5j66J07P0j55Q4
$$ 102 -17 -93 82 -1 -87 65 -1 -91 71 13 -109 42 43 -89 42 33 -101 37 62 -104 3 73 -82 2
7765BO3j44P4J04j69M2J21j34J2J14j37J2J40j40l5J59r2n0J35r5o7J69p5j12
$$ 2 65 -79 -5 99 -70 -28 93 -41 -29 85 -52 -40 100 -40 -75 84 -8 -58 77 -18 -85 84 9 -103
7789a03J59l7j22J42j7j29J44Rj56J29L7j38J01L7j45Q9P6j66O6J05j36M0Q7j35
$$ -103 56 19 -103 39 22 -107 37 46 -110 19 56 -82 19 56 -89 0 76 -90 -24 81 -55 -15 72 -63
7813f3L1J32j48pJ24r3j9J21r7l1J37r6p4J39n0q8J37n7r8J47j6j41J41Nj23J09
$$ -63 -32 100 -48 -55 69 -24 -43 78 -19 -50 87 -9 -83 56 6 -82 55 -2 -100 47 31 -110 31 36 -87 22
7839B2J4j25J15L6j47Q4O7j18M6P3j33N8J07j47PJ26j19mJ13j07j4J38j06m4J18
$$ 22 36 -89 26 62 -85 -1 66 -52 -6 67 -66 -8 99 -48 -41 85 -34 -38 75 -32 -46 92 -14 -58 60
7864F0o1n8J19o1p2J32n2r9J30j8j06J18oj19J20J2j31Q9M9j14P0M7j24P2Q2j32
$$ 60 -1 -59 60 -1 -73 59 7 -92 38 20 -86 32 26 -93 27 39 -92 -3 46 -68 2 49 -75 -3 79 -53
7890e3L7J06j32K8Q9j26J5J20j18j4J28q4m8J25q6n7J38p1p6J24m3q4J18k3j04
$$ -53 -16 90 -42 -14 75 -51 -36 84 -34 -48 80 -4 -52 73 -13 -70 68 -3 -79 45 2 -82 36 13 -91
7915i1J31j7j08J03J0j09R1M6j31P4N9j23N2P1j13M2R5j21K2J05j13qJ17j09j4
$$ -91 40 23 -85 18 28 -81 10 56 -75 -1 58 -65 -13 58 -55 -13 82 -39 -17 88 -25 -33 84 -25 -39
7940c9J22j03m3J36p3o3J32o5p8J22m4q6J10j6r3J12qr9R9J2j17R3K9j09P6M7
$$ -39 83 -20 -63 73 0 -63 69 4 -74 48 4 -82 28 12 -81 31 23 -76 23 35 -82 11 40 -69 7 54
7966E4j19O3N8j12M0P7j08L4R4j12kJ17j10j1J05q3l2J17q7m2J10n8o3J16l5q9
$$ 54 -65 -2 56 -56 -16 61 -47 -13 81 -31 -33 84 -26 -37 68 -15 -47 70 -17 -59 51 -7 -70 46 11 -78
7992g8J14l1r5J15Lj05J00Kj09R5K2j16Q7M7j19O0O0j12O0O7j17K5J08j06jR3
$$ -78 36 5 -90 25 28 -77 23 25 -84 11 33 -83 4 51 -68 -8 52 -60 0 67 -50 -25 83 -23 -24 69
8018F9r1%J02r7l5J28q1m2J05p1l9J22p1q1J20j9q6J00k7r1J11Rj29J13K7j20
$$ 69 -22 -22 80 -17 -52 76 -5 -47 58 -13 -52 70 -1 -82 38 19 -67 33 6 -85 26 35 -94 19 46 -74
8044g4Q3K5j12Q3N5j31O1P8j09K5P8j04L3R4j19KR9p9k6J11r0j6J03q2m6J11l9
$$ -74 9 34 -78 5 60 -71 -10 68 -41 -16 62 -42 -9 85 -34 -32 67 -12 -38 73 -17 -33 70 -12 -58 53 14
8071A4o6R6m9o4J08l2q5R8Mr8R3j0q4R7J3j20P9N8j17N6N5j13P2P5j40L4R8r6
$$ 14 -52 44 -5 -69 39 7 -78 20 24 -74 19 9 -75 22 35 -85 -6 52 -65 -9 46 -67 5 80 -60 -26 72 -24
8099b4LQ6r2NR2j04j6J14p8l0R9o2n4J22o4o9J03j7p7R3k8p9J03kj13R4L2j03
$$ -24 -21 65 -27 -22 70 -34 -50 64 -14 -44 55 -7 -61 61 -3 -72 31 14 -63 30 2 -77 26 24 -89 5 37 -66
8127f6P0J9r9Q6N2j40O6P0j10M2P0j05L4R9j23jJ06q8j4R1r6jJ00p1n3J10m7n7
$$ -66 4 23 -76 10 62 -78 -12 58 -52 -10 60 -45 -11 88 -35 -36 70 -18 -32 59 -37 -38 62 -9 -62 48 1 -56
8155e6R8n0o9J19k8r4J05Nr9R4Lj12J04K8j22O8N3j07O0M7j08N9O5j22L7R3j09
$$ -56 42 -8 -77 42 14 -80 25 30 -69 25 28 -84 20 48 -74 -6 47 -60 0 47 -61 -2 63 -59 -22 71 -38
8182c8K1P7r9J0R8q8l3J17q4
$$ -38 -17 60 -39 -29 69 -19 -52 65 -19
8191a9
$$ Imaginary data points
##PAGE= N=2
##DATA TABLE= (X++(I..I)), XYDATA
0@%%%%%%%%%%%%%%JrJ6j6J6j6K2l0L2l9M7n1N9p0P9q9J04j20J36j53J71j92K16
$$ 0 0 0 0 0 0 0 0 0 0 0 0 0 0 0 1 -8 8 -8 8 -8 14 -16 16 -23 24 -27 32 -38 41 -48 56 -64 72 -81 90 -102 114
37A14k41K70l02L35l71M12m57N05n55O11o76P43q16Q98r88J091j207J335j477
$$ 114 -127 143 -159 176 -195 217 -240 265 -290 321 -355 388 -428 470 -518 573 -634 701 -776
56g76J641j833K057k319K635l026L521m176N078o391Q491j2336K1419p6562l2960
$$ -776 865 -968 1089 -1230 1405 -1621 1900 -2276 2802 -3589 4902 -7434 13985 -62577 -95537
71i5537K31130j60550o9272J93175j08821p8807J86627j05050q9078J87475q2062
$$ -95537 135593 -24957 -94229 98946 -9875 -88682 97945 -7105 -96183 91292 9230
82I230j13101J94278o7239j45522K01551j4710j91607J62957M6455j76843J08884
$$ 9230 -103871 90407 23168 -122354 79197 64487 -127120 35837 82292 -94551 14333
93A4333N5202j53982J03916N7154j67555R4145Q8374j75431O9366J17123j77175
$$ 14333 69535 -84447 19469 76623 -90932 3213 91587 -83844 -14478 102645 -74530
104g4530L3885J52729j58983j9485J59450j12147m0888J35797r8711l5692J44730
$$ -74530 -40645 112084 -46899 -66384 93066 -19081 -59969 75828 -22883 -58575 86155
115H6155j02529o2787J63158p8311r6318J61527m5084j21127J48860o700j35312
$$ 86155 -16374 -79161 83997 5686 -90632 70895 25811 -95316 53544 46844 -88468
126h8468J16512K1480j20739R5769J9747j20091J01598L5304j42739Q7113P1754
$$ -88468 28044 49524 -71215 24554 44301 -75790 25808 61112 -81627 5486 77240
137G7240j45924N3672R4519j33249K4521J07181j14053j084J03965r4853o183
$$ 77240 -68684 -15012 79507 -53742 -29221 77960 -36093 -37177 66788 -28065 -34248
148c4248J00848r7350j3167J21298r5040m6561J34319o5930p3344J24454l8957
$$ -34248 66600 -30750 -43917 77381 -17659 -64220 70099 4169 -69175 55279 16322
159A6322q4017J11634j9655q8102R8910q989q8315R6696l137j02507R9368K2176
$$ 16322 -67695 43939 24284 -63818 35092 26103 -62212 34484 31347 -71160 28208 50384
171E0384j21339P8371N2504j17378N0174O5119j04065L3632O8926r6310K3098
$$ 50384 -70955 7416 59920 -57458 -7284 57835 -46230 -12598 56328 -39982 -16884
182a6884P3236r3630J5136Q4609r5444l728J03040q2808l2762J06211n7364m9297
$$ -16884 56352 -37278 -22142 62467 -32977 -36705 66335 -16473 -49235 56976 -388 -49685
194d9685R5044m0515n2545Q9549l3166n8849R0374k5209p1843R2506q384q8570
$$ -49685 45359 4844 -47701 41848 8682 -50167 40207 14998 -56845 35661 27277 -61293
206f1293Q5007J6388r6733O5330L5143r1114M8291M1552q5570M0701M7134q7222
$$ -61293 23714 40102 -56631 8699 43842 -47272 1019 42571 -42999 -2298 44836 -42386
218d2386L4510O0074r1359J8910P7125q5412l852Q6328o8649k2028Q3353n3468
$$ -42386 -7876 52198 -39161 -20251 56874 -28538 -32390 53938 -14711 -36739 46614 -6854
230f854l0393P9125m4681l5696P9749l9626m6316Q5055k7858o3939Q2750o117
$$ -6854 -37247 41878 -2803 -38499 41250 1624 -44692 40363 12505 -51434 31316 25199
242B5199p4874O7984J1385p2971N5554J8841p2221M8755K6247p4255M3060L5910
$$ 25199 -49675 18309 29694 -43277 12277 31118 -41103 7652 33899 -40356 2704 38614
254C8614p8595L5238N0990q1543J7307O5704p0682j624O5949n7895q003O4780
$$ 38614 -39981 -4743 46247 -35296 -17989 47715 -22967 -24591 41358 -16537 -24540 40240
266D0240n4358j4679O9872m9181k5975P3268m0977l7443P6741k8588n2857P1573
$$ 40240 -14118 -28797 41075 -8106 -34081 39187 -1790 -39233 37508 8920 -43937 27636
278B7636r316n7576N8010n23n3954N4351K189o0132N3297J4336o6354M4297K5844
$$ 27636 18320 -39256 18754 18231 -35723 18628 20817 -39315 13982 28318 -38036 6261 32105
291C2105o8005L5305L8015o8335K0179M7908n8645P540M5875n2236O822M9691
$$ 32105 -35900 -595 37420 -30915 -10736 37172 -21473 -13933 31942 -20294 -13472 36219
303C6219n5719k672O0679m9348j7485O3047l9076k6913O3762k9405l7696O0192
$$ 36219 -19500 -22172 38507 -10841 -28326 34721 -4355 -31268 32494 3089 -34607 25585
315B5585j5919m0688N2128j2327m1104N5123p540n2901N3530Q493n8731M1421
$$ 25585 9666 -31022 21106 8779 -32325 22798 15258 -37643 15887 24380 -34351 7070
327G070J8768n6780L3826K6534n7132K3155L3926n0819J5284L3585m9917J4160
$$ 7070 25838 -30942 2884 29418 -27714 -4559 29367 -21452 -6168 27417 -22500 -8340
339h340M2061n3682R89N3048m3484j3044N0686l4204j7233N1034k9314k5205N0758
$$ -8340 33721 -19961 -18972 34076 -9408 -22452 28234 -5970 -23203 27831 -1483 -26688 24070
352B4070k0487k9170M7504j8129l3136N2689j0997m6604M8714N543m8708L6608
$$ 24070 3583 -25587 21917 3788 -29348 23341 12344 -34260 14454 19997 -28711 7897
364G897J0852m5582L3962J5153m9558K8368K4018m7944K1115K6812m8731J7978
$$ 7897 18749 -26833 7129 22282 -27276 1092 25110 -22834 -1719 25093 -23638 -5660
376e660L6730n0514M026M5103l9406o820M0532l3044p238M2688l2778j5627M6522
$$ -5660 31070 -19444 -15418 29685 -9721 -16541 23991 -9053 -16291 26397 -6381 -22008 24514
389B4514k4657k2549M4512j9944k7564M7106j2343l7964M2542J004l8237L3092
$$ 24514 -143 -22692 21820 1876 -25688 21418 9075 -28889 13653 14657 -23580 9512
401I512L046l6497L4295O738m3540L1004J7347m4758K2825K2486m4285J8183K9924
$$ 9512 12558 -23939 10356 17094 -26446 4558 21905 -22853 -28 22458 -21827 -3644 26280
414B6280m4533P632L5581l6763P43L3314l4349k59L8026l5142r552M3649k6992
$$ 26280 -18253 -10621 24960 -11803 -11060 22254 -12095 -12354 25672 -9470 -19022 24627 -2365
427b365j8186M1568k0513k2563M1553j4064k9048L8105n439l0065L3198l136l1602
$$ -2365 -20551 21017 504 -22059 19494 5430 -23618 14487 9048 -21017 12181 9045 -22557
440b2557L4447K370l8684L0255J2686l9395K2322J7505l8117J7740K2346l7915
$$ -22557 11890 14260 -24424 5831 18517 -20878 1444 18949 -19168 -1428 20918 -16997
452a6997J1277K6497l4420O766K7759l4468L479L3826l3770n653L8113k6750j2912
$$ -16997 -5720 20777 -13643 -6877 20882 -13586 -10107 23719 -10051 -15704 22409 -4341 -17253
465a7253L6735k1203j6422L6581j6948k1257L5703j1510k4216L4271p578k8546
$$ -17253 19482 -1721 -18143 18438 1490 -19767 15936 4426 -19790 14481 6903 -21643
477b1643L4018n43l3913K9101P813l3985K2727J1862l3228J9164J5635l3577J4747
$$ -21643 12375 11832 -22081 7020 14833 -19152 3575 15437 -17791 1373 17008 -16569 -1822
490a822K0013l2989J0329K3914l2586M936K8818l0193k364L1222k5161p404L1081
$$ -1822 18191 -14798 -4469 19445 -13141 -8205 20613 -9580 -11944 19278 -5883 -13287 17794
503A7794k1538j0782L1694j8771j4823L2814j5106j9594L3277j0043k4563L1707
$$ 17794 -3744 -14526 17168 -1603 -16426 16388 1282 -18312 14965 4922 -19641 12066
515A2066l652k7668K8133J636k8798K4705N700k9587K1771R485l0746J8846J4103
$$ 12066 8414 -19254 8879 10515 -18283 6422 12122 -17465 4306 13791 -16955 1891 15994
528A5994l2066J4261J9721l1064P758K2964k7873L040K4466k5583j007K6319k2847
$$ 15994 -16072 -1811 17910 -13154 -5396 17568 -10305 -7265 17201 -8382 -9389 16930 -5917
541e917n272K7369k0243q883K9181j7581j4472L0236j1587j9200K7672o682k0489
$$ -5917 -11189 16180 -4063 -12946 16235 -1346 -15818 14418 2831 -16369 11303 4621 -15868
554a5868K6106l990k3262K5375Q75k5788K2354M785k6853K0574Q978k9560J6608
$$ -15868 10238 6248 -17014 8361 9236 -16552 5802 10587 -16266 4308 13286 -16274 334
567C34J5271k8553J0183J7289k5560P823J8723k6198M337K2998k4107j306K4125
$$ 334 15605 -12948 -2765 14524 -11036 -3213 15510 -10688 -6351 16647 -7460 -8766 15359
580A5359k0964m382K5769j9114r904K7342j3185j4165K4183r446j4296K4144q385
$$ 15359 -5605 -9987 15782 -3332 -13236 14106 921 -13244 10939 1493 -12803 11341 2956
593B956j8430K5040k631k2007K1347J521k2225J9892M548k5122J7088J0425k4660
$$ 2956 -15474 9566 6935 -15072 6275 7796 -14429 5463 10011 -15111 1977 12402 -12258
606a2258J1751J1846k2786J1100J3761k5306P772J9493k3622J563K0509k0350
$$ -12258 -507 11339 -11447 -347 13414 -11892 -4120 15373 -8249 -6686 13823 -6527
618f527p27K1845j9560n368K3975j4805r299K1702j2217r684K2961j1360j4828
$$ -6527 -7254 14591 -4969 -10337 13638 -1167 -10466 11236 -981 -10665 12296 936 -13892
631a3892K4074n057j8301J9899j327j7837J8858P47k0677J7002N861k0722J2882
$$ -13892 10182 5125 -13176 6723 5396 -12441 6417 7164 -13513 3489 9350 -11372 1510
644A510P164k0040J2755R899k3021R070J5563k0862L458J5664j8310K625J7165
$$ 1510 8674 -11366 1389 11288 -11733 -2663 12900 -7962 -4504 11160 -7150 -4525 12640
657A2640j8978j289K0178j5565n052J9019j3832n871K1169j3089j1320K2252p070
$$ 12640 -6338 -7627 12551 -3014 -8066 10953 -2879 -8750 12419 -670 -11990 10262 3192
670C192j4074J8375m658j3466J8690l465j7113J7936J791j8029J4156L443j7766
$$ 3192 -10882 7493 2835 -10631 8059 4594 -12519 5417 7208 -10821 3335 6778 -10988
683a0988J3959O276k0528J0423J1312j8408N722J0966j6542N857J2621j8341K439
$$ -10988 2971 9247 -11281 -858 10454 -7954 -2232 8734 -7808 -1951 10670 -7671 -5232
696e232J6417j5645j623J5914j3829k592J7684j3391p047J9062q755r576J6451
$$ -5232 11185 -4460 -6083 9831 -3998 -6590 11094 -2297 -9344 9718 963 -8613 7838
709G838p212r501J7752o382j3674J7936j352j5502J4651P80j5356J4236L013j7784
$$ 7838 626 -8875 8877 2495 -11179 6757 5405 -10097 4554 5334 -10022 4214 7227 -10557
723a0557J1785P268j6844Q216P821j5978P792R886j7497M563J3556j5319O20J3524
$$ -10557 1228 8496 -8348 -132 7689 -8289 -497 9389 -8108 -3545 10011 -5308 -4688 8836
737H836j3420o11J4740j2832l880J5989r769o196J4896q353p105J6052p147j0662
$$ 8836 -4584 -5195 9545 -3287 -7167 8822 -947 -7143 7753 -600 -7705 8347 1200 -9462
751i462J6186l150j2367J3954j197j2715J3535N27j4665J2311L725j5020J0025
$$ -9462 6724 3574 -8793 5161 3964 -8751 4784 5311 -9354 2957 6682 -8338 1687
764A687N185j5196R028P511j6142O355J0269j4916L420J1038j3694J860J2268
$$ 1687 6872 -8324 704 8215 -7927 -1572 8697 -6219 -2799 8239 -5455 -3595 8673
777H673j3133p53J3557j1207k984J3741r723m839J4400p997p425J4356n227r017
$$ 8673 -4460 -5213 8344 -2863 -5847 7894 -1829 -6668 7732 -265 -7690 6666 1439 -7578
791g578J3254l370j0048J2801j536j1530J1952P57j2566J0681K856j3318R266
$$ -7578 5676 2306 -7742 5059 3523 -8007 3945 4702 -7864 2817 5673 -7645 1621
804A621N018j3827P294O971j3529N442Q490j3225L559R884j2692J643J1198j1892
$$ 1621 6639 -7188 106 7077 -6452 -1010 7480 -5745 -2186 7698 -4994 -3351 7847 -4045
818d045n10J2397j0540k936J2911q654m782J2875p069o467J2927n053q114J2250
$$ -4045 -4555 7842 -2698 -5634 7277 -1377 -6159 6716 -353 -6820 6107 1054 -7060 5190
832E190l108r207J1619j439j0539J0986J052j1597R107K986j1508P830M270j2032
$$ 5190 2082 -7125 4494 3055 -7484 3502 4554 -7043 2064 5050 -6458 1372 5642 -6390
846f390O583O332j2094M502P611j1447L228Q716j1683J333J0739j0427j339J0958
$$ -6390 193 6525 -5569 -1067 6544 -4903 -1675 7041 -4642 -3309 7430 -2997 -4336 6622
860F622q772k420J1178q325m133J2328o406o423J1631m481p104J1433l410q987
$$ 6622 -2150 -4570 6608 -1717 -5850 6478 72 -6351 5280 799 -6305 5128 1718 -7269
874g269J1345n84j0239R244J237r777Q468J931j1044P768M700j1303N171N871
$$ -7269 4076 3492 -6747 2497 3734 -6043 2425 4356 -6688 1080 5780 -5523 -352 5519
888E519j0316M243O664j0987K645R045r881k00Q978q213n37R295q687k319J1102
$$ 5519 -4797 -554 6110 -4877 -2232 6813 -3068 -3268 5710 -2503 -3040 6255 -2432 -4751 6351
903F351o890m880J0458m940n249J0371m576p197J0933j869q627R049m16q230Q878
$$ 6351 -539 -5419 5039 99 -5150 5221 645 -6552 4381 2512 -6115 2934 2518 -5712 3166
918C166R3r995Q609L118j0652N898M345r477N264M907j0424L922P276r625J337
$$ 3166 3259 -6736 1873 4991 -5661 237 4582 -4895 369 5276 -5148 -1226 6050 -3575 -2238
933b238P400q176J056P842q888q05R816p022l268Q991n351l363R089n370n082
$$ -2238 5162 -3014 -1958 5884 -3004 -3809 6007 -1015 -4283 4708 -643 -4006 5083 -287 -5369
948e369R952l174o651Q526j932o427Q841j494q483Q654J352r144O429K377q329
$$ -5369 4583 1409 -5242 3284 1352 -5075 3766 2272 -6211 2443 3795 -5349 1080 3457 -4872
963d872O266K888r749N321N394r349L015N719q429K710O634r144P44Q546p397
$$ -4872 1394 4282 -5467 -146 5248 -4101 -1086 4633 -3796 -1086 5548 -3596 -2852 5694 -1703
978a703j595P757o026j487Q263o263l538R294m060n192Q020k782n085Q296k351
$$ -1703 -3298 4459 -1567 -3054 5209 -1054 -4592 4702 642 -4550 3470 688 -4397 3899 1548
993A548p051Q173K61p579O264Q90p107O539J550q734N763M017q614L613M402p876
$$ 1548 -5503 2670 2931 -4648 1616 2506 -4601 1938 3488 -5246 517 4534 -4080 -467 3935 -3941
1009c941L572N289q776J887P123p536n5O738o542j33P469o907k071Q671m952l761
$$ -3941 -369 4920 -3856 -1969 5154 -2382 -2437 4301 -2241 -2374 5095 -1812 -3883 4788 -164 -3925
1025c925P665l784l844P868l283n444P927j205o330O522l38o146O617M66p535
$$ -3925 3740 -44 -3888 3980 697 -4747 3180 1975 -4355 2167 1829 -4317 2300 2766 -4769
1040d769N840K561p567M113L158p052L885L865p824K739N504p177J127N643o613
$$ -4769 1071 3632 -3935 178 3336 -3716 169 4034 -3790 -1051 4453 -2724 -1597 4046 -2567
1055b567O97O418o670p84P429n476k299P071m522k690P415m028m082P575k515
$$ -2567 -1870 4548 -2122 -2906 4523 -953 -3252 3819 -703 -3393 4022 -6 -4088 3487 972
1070I72n074O887j491n411O677n81o365O125J003o673M959J812o640M377K772
$$ 972 -4102 2785 1294 -4117 2560 1979 -4386 1739 2742 -3931 1028 2840 -3800 577 3349
1085C349o956L433L942o780K130M590o387J324N329o116J29N960n456r92O274
$$ 3349 -3607 -174 3768 -3012 -882 3708 -2679 -1355 3974 -2142 -2013 3947 -1509 -2501 3773
1100C773m779j890O558m101k900O755l171l832O654k258m668O413j163n268O038
$$ 3773 -1006 -2896 3662 -439 -3339 3416 245 -3587 3067 809 -3859 2554 1391 -3877 2161
1115B161k16n873N497Q84o283M710J964o329L891K711o448L128L745o401J885
$$ 2161 1945 -3928 1569 2453 -3830 880 2844 -3485 406 3117 -3331 -203 3542 -2859 -974
1130i74M508n845R63M938n514O2N576m982j196N784m029j831N837l635k746O215
$$ -974 3534 -2311 -1348 3590 -1924 -1862 3714 -1268 -2464 3320 -709 -2540 3297 -338 -3084 3131
1146C131k668l866N868j532m198N538j055m876N585J53n665M616J199n530M176
$$ 3131 463 -3403 2465 933 -3265 2273 1218 -3658 1927 2080 -3585 1031 2230 -3300 876
1161H76J673o013L754K997o288K323L788n552J745L997n739J038N078n269m77
$$ 876 2549 -3464 290 3287 -3001 -678 3110 -2442 -697 3300 -2439 -1401 3677 -1592 -2069
1176b069N250m264r12N279m230j789O064l125l215N415j926l206N200j839l965
$$ -2069 3181 -1083 -1995 3284 -946 -2735 3329 204 -3011 2404 478 -2728 2472 633 -3332
1191c332N590n50n056M518N90m685M201P19n433M108K233n814K614K899n061K339
$$ -3332 2258 1708 -3348 1170 1760 -2925 1276 1995 -3438 670 2903 -2911 -297 2602 -2459 -120
1207a20K912n642J997M409n477K41M605m398oM614m619p58N651l744k325N156
$$ -120 2792 -2850 -853 3556 -1921 -1680 2925 -1473 -1479 3135 -1484 -2242 3409 -335 -2660 2496
1223B496k560k261N053k686l112N600j265m378M591r1l993M150p4m705M319J430
$$ 2496 -64 -2325 2728 42 -3070 2530 1265 -3113 1478 1387 -2606 1544 1470 -3235 1084 2514
1239B514n255K828K079m537K635K160n213K302L670n150O39L898m108N04L839
$$ 2514 -2741 87 2166 -2371 264 2424 -2789 -487 3183 -1967 -1328 2570 -1538 -1034 2805
1254B805m565r4N023l913j532M763k942j579M752l097k465N475j811l599M514
$$ 2805 -1760 -1854 3169 -744 -2276 2487 -455 -2034 2718 -379 -2844 2631 820 -2779 1735
1269A735r05l296M397q47m168M542O06m774L260J336m221L001J506m903K577K949
$$ 1735 830 -2466 1931 1084 -3084 1458 2064 -2710 550 1886 -2335 666 2172 -2731 -154 2795
1285B795m719J109L128l954R72L211m383L23M383l715j038M115k908j072M245
$$ 2795 -1924 -815 2313 -1641 -669 2542 -1841 -1518 2865 -850 -1888 2227 -681 -1753 2492
1300B492l038j944M864j947k884M143j237k697M235j227l674M404J80m171L328
$$ 2492 -546 -2490 2374 427 -2457 1686 449 -2248 1987 760 -2914 1490 1670 -2501 827
1315H27P53l838L164R81m486K827K256m419J574K514l910J415K811m270O45L803
$$ 827 1580 -2258 906 1887 -2599 228 2484 -1935 -361 2153 -1757 -342 2469 -1801 -1156 2647
1331B647l624n52L638k882o55L735k951j506M296j991k327L790j325k379L799
$$ 2647 -977 -1529 2109 -773 -1428 2307 -644 -2150 2146 155 -2172 1618 293 -2086 1713
1346A713j153l116L906o7l575L129M29l407L013P36l980K736J721m030J849K102
$$ 1713 560 -2556 1350 1283 -2292 837 1266 -2141 872 1608 -2372 364 2085 -1945 -96 2006
1362B006l730J568K422l985R44L175l559P1L272l103k87L441k968r84L841k298
$$ 2006 -1724 -156 2266 -1719 -775 2400 -1159 -1088 2184 -919 -1206 2235 -733 -1717 2124 -174
1378a74j708L621j676j988L566j273k530L516n76k938L146J9l071K890M67l390
$$ -174 -1882 1739 63 -1925 1641 368 -2162 1354 778 -2160 986 1005 -2066 824 1291 -2099
1394b099K529J141l475K052J588l451J629J972l473J203K423l384O40K796l162
$$ -2099 430 1571 -1904 148 1736 -1715 -86 1886 -1587 -384 2039 -1345 -705 2091 -1071
1409a071Q4L064k847m26L205k566r23L423k133j505L404j571j930L254j126k288
$$ -1071 -987 2077 -770 -1196 2009 -557 -1480 1943 -190 -1695 1709 138 -1792 1462 336 -1952
1425a952L241n41k755K874J35k865K493N11l030K274J088l226J686J667l036J235
$$ -1952 1289 748 -2007 867 1002 -1863 630 1141 -1889 385 1473 -1753 -67 1600 -1436 -201
1441b01J832l043R27K382k974K03K659k502j57K614k443m63L098k211j227L109
$$ -201 1631 -1412 -485 1897 -1077 -874 1785 -717 -874 1740 -703 -1166 1932 -279 -1506 1603
1457A603j548j461K896j406j769L130q91k395K802j92k376K477q8k648K529O40
$$ 1603 55 -1406 1490 84 -1685 1445 554 -1841 961 769 -1607 870 782 -1866 663 1303
1473A303l049J820J244k698J409J273k822J288J952k898M15K263k270J32K149
$$ 1303 -1746 74 1318 -1380 29 1302 -1520 -232 1720 -1178 -763 1500 -770 -638 1511
1488A511k375j15K753k106j014K685j354j051K421j495j308K906j014k067K538
$$ 1511 -864 -979 1774 -332 -1346 1339 -15 -1066 1355 -140 -1448 1458 444 -1623 915
1503I15k92j932K254m02k227K539K91k747J799Q85k302J543P21k600J603J523
$$ 915 623 -1309 945 543 -1684 855 1146 -1601 198 1083 -1219 324 1045 -1555 48 1571
1519A571k834O79J922k152M13J708k340K68K422k141o88K359j359p12K118j543
$$ 1571 -1263 -584 1338 -814 -401 1307 -1033 -765 1657 -484 -1172 1187 -172 -884 1234 -309
1535c09r67K691j077j825K281k90j574J941m88j838K303J34k408J673O97j998
$$ -309 -1276 1415 338 -1487 794 504 -1070 871 383 -1455 848 982 -1426 247 944 -1054
1551a054J437N12k316J575J255k555P38J581j973N73J397k228N20K069k144l57
$$ -1054 383 895 -1421 154 1409 -1146 -408 1173 -800 -227 1170 -1058 -538 1531 -613 -970
1567i70K105j469m02J929j649o76K454j188j438K105n20j266J870o56j567K173
$$ -970 1135 -334 -736 1193 -456 -1132 1322 134 -1304 801 281 -985 885 229 -1338 835
1583H35m4k065J575M94j771J374M00k035J399J042k196P27J279j751O25J183k039
$$ 835 791 -1274 301 795 -976 398 798 -1237 162 1204 -992 -265 1014 -737 -112 1071 -968
1600i68N48J806j978j76J784j412k00J683j582m83K184j220j085J934p95r40J818
$$ -968 -420 1386 -592 -768 1016 -396 -596 1087 -495 -978 1206 -14 -1099 835 40 -900 918
1617I18q11j347K039k01j795J584K12j565J423J92j814J404P76j949Q12J016j643
$$ 918 107 -1240 799 598 -1197 387 599 -966 457 649 -1165 239 1015 -934 -122 894 -749
1634g49P02J045j852N02J533j680j08J550j310j52J534j415m06J882j113q79J717
$$ -749 -47 998 -854 -352 1181 -499 -607 943 -367 -519 1015 -400 -806 1076 -37 -916 801
1651H01p74q63J677p46j163J822l26j468J513l9j368J431L9j631J395N09j754
$$ 801 27 -836 841 95 -1068 754 428 -1040 473 434 -934 497 536 -1095 300 809 -945
1668i45R61P74j581P78Q90j689N71J244j590J54J350j350o1J445j296l43J624
$$ -945 16 790 -791 -13 877 -812 -241 1003 -587 -433 917 -433 -494 951 -345 -688 936
1685I36j030o93J560p39q35J531n95j038J543l05j262J415n1j330J279J51j446
$$ 936 -94 -787 773 34 -801 730 135 -903 640 335 -927 488 437 -893 386 537 -909
1702i09J149M16j521R73O22j529P60Q26j490N50R84j462L33J194j386J6J334j162
$$ -909 240 656 -865 108 730 -799 -39 787 -703 -153 831 -631 -298 896 -490 -474 860 -302
1720c02k41J346j020m31J460q47p36J439n15r16J322l36j045J335j01j274J129
$$ -302 -543 803 -217 -648 812 -35 -771 668 153 -763 559 223 -822 513 412 -862 267
1737B67K81j275Q99L51j280Q75N84j445O15Q85j272L24Q65j214L01J063j262m2
$$ 267 548 -727 172 523 -757 118 702 -743 -128 757 -515 -191 674 -540 -239 824 -438 -480
1755d80J238r78k28J113r37k60J332q77o60J330m47p57J104l92q07J253k18j144
$$ -480 758 -220 -448 665 -272 -532 800 -77 -737 593 146 -611 493 101 -706 547 329 -815
1773h15J077K23j105Q14K13j118Q86M83j350N35Q34j095K57P39j087L10J005j201
$$ -815 262 485 -620 194 407 -711 175 658 -692 -157 677 -418 -161 578 -509 -199 806 -395
1791c95r0J171q19k59R87q41k37J255p97o93J239l36p08R77m22o81J217k53j107
$$ -395 -485 686 -133 -392 595 -246 -483 772 -25 -718 521 185 -523 454 32 -649 568 315 -792
1810g92J042J83r83P57R8r88R14L70j291N61P19r96L24N72j047M05R17j190p7
$$ -792 250 433 -550 207 305 -683 231 601 -690 -129 590 -406 -82 490 -557 -152 765 -425 -502
1829e02J138p50k46Q92p95j85J182p43o84J168k80o92R03l56o66J167k08j113
$$ -502 636 -114 -360 532 -263 -448 734 -9 -693 475 195 -497 406 50 -616 551 343 -770
1847g70R65K60r45O77J28r46Q62L46j233N35O90r62L34N18j010M34Q36j132k5
$$ -770 195 455 -490 187 315 -631 231 577 -656 -121 569 -393 -59 459 -551 -117 719 -413 -438
1866d38J007p38j53Q11p87j07J109p78n86J130l40o08Q93l58o44J088j92j008
$$ -438 569 -169 -322 489 -298 -405 704 -74 -660 470 130 -478 415 57 -587 501 309 -699
1884f99R17K07r10O75J44r38Q14L63j164M95O56r55L18N54r52L53P90j053J1R26
$$ -699 218 425 -485 190 334 -604 210 573 -591 -96 560 -395 -77 477 -475 -122 668 -385 -374 552
1904E52p68p7P95q31q4J041p44m67J020l69n40R08m50n47J018k21q68Q85M3q06
$$ 552 -216 -293 502 -329 -413 628 -116 -583 437 68 -472 436 -14 -561 457 236 -632 253 296 -510
1924e10P76Mq61Q04L09j065N28N21r19L97N59j012L55P43r90P2Q60p79q5Q22p72
$$ -510 266 270 -591 213 522 -543 -15 506 -413 -16 543 -469 -114 629 -361 -289 571 -208 -293 529 -243
1945b43j22R52o83m28R53m36m94R43m32n84J007k70p84Q65J3p90P70O2q81P76
$$ -243 -365 587 -96 -524 429 -7 -501 442 10 -574 433 163 -621 244 257 -533 237 299 -582 194
1965A94J89q75N53L66q71M41N08r81M03O46r43J59P80q33k5Q79q08j72R34o47
$$ 194 383 -492 61 427 -444 -3 505 -476 -73 573 -370 -211 569 -264 -289 590 -218 -390 544 -103
1985a03l53R38n03m53Q98m08n73R52k64o94Q73q9p70P86L6q43P60J73r00O46K91
$$ -103 -456 482 -21 -474 424 16 -557 395 131 -563 310 221 -549 237 273 -570 190 363 -537 109 400
2006D00r19N20M65r12L77N62q83K51O80q73J03P74p75p0Q22o81k01R10o16m07
$$ 400 -519 1 466 -446 -69 493 -390 -139 541 -332 -229 545 -230 -300 522 -159 -360 550 -66 -473
2026d73R54m27n53Q96k98o06Q97k00p92Q60N0q66P20J63q72O82K85r84N52N02
$$ -473 481 54 -499 397 99 -507 390 190 -602 258 308 -558 162 325 -547 135 420 -564 -12 490
2046D90r38L60N27q60L27O47r39J26Q09p80n9P78o95q8Q61p01l16R57m70m62Q36
$$ 490 -448 -88 439 -421 -94 553 -386 -260 549 -231 -290 488 -207 -295 566 -135 -451 506 36 -426 410
2067D10l98m65R15l27p13R01l4p99P04N2p67P58J48r81O30M44r16L81M67q69M15
$$ 410 12 -453 462 135 -578 323 289 -510 194 246 -521 237 385 -596 34 478 -438 -57 410 -459 -44
2088d4N92j002J76Q35p88n6P27p33J4Q47p58k92J003n15m07P95m25l97Q98l54
$$ -44 548 -454 -278 557 -231 -287 440 -293 -279 568 -190 -482 521 6 -401 394 -31 -428 470 116
2108A16o99R20o5p70P52o1o88P94Q8r65O90L71q86M39L24p91M33N09r61K34P27
$$ 116 -583 337 272 -498 254 193 -495 299 387 -578 112 483 -403 36 360 -431 2 511 -450 -216 511
2129E11p65R9N79p04O3P80p40k76R72n52m27P81m00l57R03m05o58R36o6o92O75
$$ 511 -254 -155 424 -280 -217 563 -177 -453 519 -33 -460 321 -79 -436 467 62 -596 340 274 -418 257
2150B57j36n98P43P5r20O62L30p98M51K43p41N05M32r49K80O61p44Q7N69p18J15
$$ 257 121 -477 266 341 -579 83 413 -385 66 309 -432 73 505 -444 -164 497 -247 -160 409 -309 -194
2171a94P33p67j78Q73n00k90P00m84l05Q80m24o06Q85j26o51O83q0o39P76K4q61
$$ -194 539 -228 -406 467 -33 -323 377 -107 -412 468 44 -562 323 197 -454 229 149 -490 286 310 -551
2192e51O29L10p90M53K74p73N01M20r03K86O32p27R9N52p03J07O90p16j31P94
$$ -551 78 388 -402 51 325 -448 53 473 -430 -144 488 -239 -140 412 -291 -184 506 -210 -341 453
2212D53n10k51O89m73k83Q25m08n34Q07j67n60O70j26o06P24J2p87O25K51p59
$$ 453 -57 -308 381 -92 -375 450 42 -492 315 148 -412 258 132 -474 250 262 -525 100 351 -408
2232d08M58K81p77M53M26q31K60N88p31J23N85p06P5O97o81j35P67n26k23P16
$$ -408 50 331 -446 7 433 -398 -138 450 -281 -158 427 -279 -204 493 -188 -323 444 -82 -305 411
2252D11m72l00P73l77m68P54k05n03O61j29n80O83lo95N85J57p07M94K46p38M25
$$ 411 -61 -361 412 35 -433 321 116 -387 274 145 -435 248 245 -450 135 292 -415 79 325 -413 12
2273A2L64p42K72M81p05J90N53o89N2O54o27j03O99n13k10P16m46l17P37l41m20
$$ 12 376 -366 -94 387 -318 -128 425 -264 -212 442 -185 -288 411 -102 -312 404 -42 -359 378 37 -383
2294c83P08k27m90O76j23n72O33po24N64Q4o38N04J87o59L99K91o63L24L67o60
$$ -383 325 98 -392 284 161 -411 222 215 -409 155 239 -399 105 292 -367 32 323 -340 -16 351 -309
2315c09K06M82o31R6N14n68J1N78n36j18O55m43k45O44l47l25O74k99m28O79j48
$$ -309 -103 379 -252 -156 358 -210 -199 379 -157 -275 380 -63 -308 336 -11 -336 338 39 -389 290 142
2336A42n11N79n0n21N60J7o13N20J70o38L77K48n95L45K98o68K72M23n70Q4M31
$$ 142 -369 210 160 -361 199 216 -397 123 293 -345 32 280 -315 30 328 -340 -68 355 -215 -131 300
2357C00n18R3M71n51l8N97m09k03N27l36j78N53l30l28O31j66m31N13r6m12N40
$$ 300 -218 -125 346 -205 -243 354 -55 -258 269 -67 -245 308 -22 -350 281 115 -316 197 101 -311 229
2378B29o0n65N14J49n80L61J78n10L49K27o25K81M03n63J10L85m95J20M33n49
$$ 229 169 -396 118 267 -313 48 226 -284 65 292 -333 -52 351 -212 -102 283 -212 -92 341 -208
2398b08j7N64m08j53M65l25j07M97l62k68N86j87l53M45j09l16M79j03m69M87
$$ -208 -225 339 -69 -222 243 -82 -189 308 -54 -322 264 77 -276 169 60 -256 223 120 -349 138
2418A38Q0m84L21J19m43L77J44n69K81L43n05J11L19m23J36L68n19J1N07l84j26
$$ 138 218 -266 55 174 -269 108 252 -317 -36 307 -198 -87 232 -191 -55 313 -206 -195 312 -72 -198
2439a98M26l20q7M83l61k49N60j76l16M02j31k59M56j34m12M47M3m04K93P1l61
$$ -198 228 -92 -179 304 -57 -306 254 78 -238 164 33 -226 230 96 -316 131 174 -230 63 134 -227
2460b27L39J03m87K48K70m02J15K32l68J48L01m67M6M19l34j09L77l03n4M15l15
$$ -227 112 215 -272 -24 246 -156 -41 191 -177 -29 272 -195 -149 270 -64 -173 204 -99 -153 262 -53
2481e3k13M87j66k85L76j22k42M15j15l83M20M7l82K75O1l47L10J01m31K40K38
$$ -53 -266 221 55 -230 146 24 -218 197 82 -301 119 166 -216 59 120 -227 83 184 -247 -7 231
2502B31l89J23K01l34J51K48l93K6L72l07n8K93k42n3L58k82j61L93j45k21L33
$$ 231 -158 -35 166 -168 -17 231 -162 -136 236 -71 -129 164 -78 -131 227 -55 -216 177 32 -189 144
2523A44j35k00L56j01l19L54L0l35K66N5l08K72R3l74K18J89l62J36K04l29J19
$$ 144 9 -191 165 64 -255 99 129 -206 60 115 -193 79 172 -202 16 205 -157 -21 183 -146 -27
2544b7K41l44M0L02k80j9K71k50m4L06k40j22L31j52j75K80r4j90K98q7k33K83
$$ -27 214 -130 -90 212 -68 -87 184 -66 -110 196 -44 -166 165 13 -162 118 24 -166 132 45 -188 95
$$ [...]
8191e9
##END NTUPLES=NMR FID
##END=
