##TITLE=1H_LY-1000-Ni-ac-120
 CDCl3, 8 sc, 
 14.1.2019
##JCAMPDX= 6.0         $$ Bruker NMR JCAMP-DX V2.0
##DATA TYPE= NMR FID
##DATA CLASS= NTUPLES
##ORIGIN= UXNMR, Bruker Analytische Messtechnik GmbH
##OWNER= root
$$ XWIN-NMR		Version 3.5
$$ Mon Jan 14 16:22:46 2019 Russian Standard Time (UT+4h)  she@DPX200
##.OBSERVE FREQUENCY= 200.1313
##.OBSERVE NUCLEUS= ^1H
##.DELAY= (6, 6)
##.ACQUISITION MODE= SIMULTANEOUS
##.ACQUISITION SCHEME= undefined
##.AVERAGES= 8
##.DIGITISER RES= 18
##SPECTROMETER/DATA SYSTEM= spect
##.PULSE SEQUENCE= zg30
##.SOLVENT NAME= CDCl3
##.SHIFT REFERENCE= (INTERNAL, CDCl3, 0, 15.7039)
##AUDIT TRAIL= $$ (NUMBER, WHEN, WHO, WHERE, WHAT)
$$ ##TITLE= Audit trail, XWIN-NMR		Version 3.5
$$ ##JCAMPDX= 5.01
$$ ##ORIGIN= Bruker BioSpin GmbH
$$ ##OWNER= she
$$ F:/spectra/data/she/nmr/H-F/1/audita.txt
$$ ##AUDIT TRAIL=  $$ (NUMBER, WHEN, WHO, WHERE, WHAT)
(   1,<2019-01-14 16:21:28.35 +0400>,<she>,<DPX200>,
      <created by zg, POWCHK disabled, PULCHK disabled
       configuration hash MD5:
       00 E9 B6 7A A2 85 ED C7 34 08 36 98 17 FE 4E 26
       data hash MD5: 16K
       FA 95 C1 4C 1D 44 16 1B 62 9B 3E 61 24 CE 3A 54>)
$$ ##END=
$$ 
$$ hash MD5
$$ B0 29 56 9D 2D 3B FF ED D0 A4 22 02 88 37 8F CD
##$RELAX= 
##$RELAX= 
##$RELAX= 
##$RELAX= 
##$RELAX= 
##$RELAX= 
$$ Bruker specific parameters
$$ --------------------------
##$DU= <F:/spectra>
##$EXPNO= 1
##$NAME= <H-F>
##$PROCNO= 1
##$TYPE= <nmr>
##$USER= <she>
##$AMP= (0..31)
100 100 100 100 100 100 100 100 100 100 100 100 100 100 100 100 100 100 
100 100 100 100 100 100 100 100 100 100 100 100 100 100 
##$AQSEQ= 0
##$AQ_mod= 1
##$AUNM= <au_zg>
##$AUTOPOS= <>
##$BF1= 200.13
##$BF2= 200.13
##$BF3= 200.13
##$BF4= 200.13
##$BF5= 200.13
##$BF6= 200.13
##$BF7= 200.13
##$BF8= 200.13
##$BYTORDA= 1
##$CFDGTYP= 0
##$CFRGTYP= 5
##$CHEMSTR= <none>
##$CNST= (0..31)
1 1 145 1 1 1 1 1 1 1 1 1 1 1 1 1 1 1 1 1 1 1 1 1 1 1 1 1 1 1 1 1 
##$CPDPRG= <>
##$CPDPRG1= <>
##$CPDPRG2= <>
##$CPDPRG3= <>
##$CPDPRG4= <mlev>
##$CPDPRG5= <mlev>
##$CPDPRG6= <mlev>
##$CPDPRG7= <mlev>
##$CPDPRG8= <mlev>
##$CPDPRGB= <>
##$CPDPRGT= <>
##$D= (0..31)
0 1.2 0 0 0 0 0 0 0 0 0 0.03 0 0 0 0 0 0 0 0 0 0 0 0 0 0 0 0 0 0 0 0 
##$DATE= 1547468487
##$DBL= (0..7)
120 120 120 120 120 120 120 120 
##$DBP= (0..7)
150 150 150 150 150 150 150 150 
##$DBP07= 0
##$DBPNAM0= <>
##$DBPNAM1= <>
##$DBPNAM2= <>
##$DBPNAM3= <>
##$DBPNAM4= <>
##$DBPNAM5= <>
##$DBPNAM6= <>
##$DBPNAM7= <>
##$DBPOAL= (0..7)
0.5 0.5 0.5 0.5 0.5 0.5 0.5 0.5 
##$DBPOFFS= (0..7)
0 0 0 0 0 0 0 0 
##$DE= 6
##$DECBNUC= <off>
##$DECIM= 24
##$DECNUC= <off>
##$DECSTAT= 4
##$DIGMOD= 1
##$DIGTYP= 9
##$DL= (0..7)
0 120 120 120 120 120 120 120 
##$DP= (0..7)
150 150 150 150 150 150 150 150 
##$DP07= 0
##$DPNAME0= <>
##$DPNAME1= <>
##$DPNAME2= <>
##$DPNAME3= <>
##$DPNAME4= <>
##$DPNAME5= <>
##$DPNAME6= <>
##$DPNAME7= <>
##$DPOAL= (0..7)
0.5 0.5 0.5 0.5 0.5 0.5 0.5 0.5 
##$DPOFFS= (0..7)
0 0 0 0 0 0 0 0 
##$DQDMODE= 0
##$DR= 18
##$DS= 0
##$DSLIST= <SSSSSSSSSSSSSSS>
$$ [...]
##$SUBNAM2= <"">
##$SUBNAM3= <"">
##$SUBNAM4= <"">
##$SUBNAM5= <"">
##$SUBNAM6= <"">
##$SUBNAM7= <"">
##$SUBNAM8= <"">
##$SUBNAM9= <"">
##$SW= 24.933730806125
##$SWIBOX= (0..15)
0 0 2 0 0 0 0 0 0 0 0 0 0 0 0 0 
##$SW_h= 4990.01996007984
##$TD= 16384
##$TD0= 1
##$TE= 0
##$TE2= 300
##$TE3= 300
##$TEG= 300
##$TL= (0..7)
0 120 120 120 120 120 120 120 
##$TP= (0..7)
150 150 150 150 150 150 150 150 
##$TP07= 0
##$TPNAME0= <>
##$TPNAME1= <>
##$TPNAME2= <>
##$TPNAME3= <>
##$TPNAME4= <>
##$TPNAME5= <>
##$TPNAME6= <>
##$TPNAME7= <>
##$TPOAL= (0..7)
0.5 0.5 0.5 0.5 0.5 0.5 0.5 0.5 
##$TPOFFS= (0..7)
0 0 0 0 0 0 0 0 
##$TUNHIN= 0
##$TUNHOUT= 0
##$TUNXOUT= 0
##$USERA1= <user>
##$USERA2= <user>
##$USERA3= <user>
##$USERA4= <user>
##$USERA5= <user>
##$V9= 5
##$VALIST= <valist>
##$VCLIST= <CCCCCCCCCCCCCCC>
##$VD= 0
##$VDLIST= <DDDDDDDDDDDDDDD>
##$VPLIST= <PPPPPPPPPPPPPPP>
##$VTLIST= <TTTTTTTTTTTTTTT>
##$WBST= 1024
##$WBSW= 4
##$XGAIN= (0..3)
0 0 0 0 
##$XL= 0
##$YL= 0
##$YMAX_a= 66281
##$YMIN_a= -71107
##$ZGOPTNS= <>
##$ZL1= 120
##$ZL2= 120
##$ZL3= 120
##$ZL4= 120
##$ABSF1= 10
##$ABSF2= 0
##$ABSG= 5
##$ABSL= 3
##$ALPHA= 0
##$AQORDER= 0
##$ASSFAC= 0
##$ASSFACI= 0
##$ASSFACX= 0
##$ASSWID= 0
##$AUNMP= <proc_1d>
##$AZFE= 0.1
##$AZFW= 0.1
##$BCFW= 1
##$BC_mod= 2
##$BYTORDP= 1
##$COROFFS= 0
##$CY= 11.3945322036743
##$DATMOD= 1
##$DC= 2
##$DFILT= <>
##$DTYPP= 0
##$F1P= 18.9103706918063
##$F2P= -1.10871071338519
##$FCOR= 0.5
##$FTSIZE= 0
##$FT_mod= 4
##$GAMMA= 1
##$GB= 0.15
##$INTBC= 1
##$INTSCL= 1
##$ISEN= 128
##$LB= 0.24
##$LEV0= 0
##$LPBIN= 0
##$MAXI= 10000
##$MC2= 0
##$MEAN= 0
##$ME_mod= 0
##$MI= 1.114404
##$NCOEF= 0
##$NC_proc= 0
##$NLEV= 6
##$NOISF1= 3.799351
##$NOISF2= 2.8
##$NSP= 1
##$NTH_PI= 0
##$NZP= 0
##$OFFSET= 15.70392
##$PC= 1
##$PHC0= -8954.608
##$PHC1= 15.80006
##$PH_mod= 1
##$PKNL= yes
##$PPARMOD= 0
##$PSCAL= 0
##$PSIGN= 0
##$REVERSE= no
##$SF= 200.130013532006
##$SI= 16384
##$SIGF1= 3
##$SIGF2= 2
##$SINO= 400
##$SIOLD= 16384
##$SREGLST= <1H.CDCl3>
##$SSB= 0
##$STSI= 0
##$STSR= 0
##$SW_p= 3612.71676300578
##$SYMM= 0
##$S_DEV= 0
##$TDeff= 0
##$TDoff= 0
##$TI= <>
##$TILT= no
##$TM1= 0
##$TM2= 0
##$TOPLEV= 0
##$USERP1= <user>
##$USERP2= <user>
##$USERP3= <user>
##$USERP4= <user>
##$USERP5= <user>
##$WDW= 1
##$XDIM= 8192
##$YMAX_p= 0
##$YMIN_p= 0
$$ End of Bruker specific parameters
$$ ---------------------------------
##NTUPLES= NMR FID
##VAR_NAME=  TIME,          FID/REAL,        FID/IMAG
##SYMBOL=    X,             R,               I
##VAR_TYPE=  INDEPENDENT,   DEPENDENT,       DEPENDENT
##VAR_FORM=  AFFN,          ASDF,            ASDF
##VAR_DIM=   8192,          8192,            8192
##UNITS=     SECONDS,       ARBITRARY UNITS, ARBITRARY UNITS
##FACTOR=    0.0002004,     1,               1
##FIRST=     0,             0,               0
##LAST=      1.6414764,     0,               0
##MIN=       0,             -71107,          0
##MAX=       1.6414764,     66281,           0
$$ Real data points
##PAGE= N=1
##DATA TABLE= (X++(R..R)), XYDATA
$$ [...]
1675A859L498l925o424N22P188L589n509p082J274P742L801m236n651k36L287
1690c03J449q52J8R36q80k063N99L128L91m291k881L871O171m80p300m116M968
1707a635P144n58p120l761M018N460R5l598j728J006M06p56P29K016k85k890p51
1724b208L585K633l551n711O37P231M325m710p336j36O539L853l396m957R3L657
1740E48J561j414r23O06l37j576K85K691Q59l195k662K980N186n09o720m134M443
1757b311P272O03o214m191K738M651J12l379j411J699J336n64l07Q52l31k142
1773a587m99L085K525k652m907K04O059L924m042o877o52N957M256k403m596l97
1789b602L121J406j722j463O60P79l85K05J538Q4k951k281K618M840J09n588l903
$$ plain form
1675 1859 5357 1432 -4992 -4470 2718 6307 798 -6284 -5010 2732 6533 2297 -3354 -3590 -303
1690 -303 1146 294 312 1248 368 -1695 -1096 2032 2423 -1868 -4749 -878 5293 4813 -2487 -6603 -1635
1707 -1635 5509 4951 -2169 -5930 -1912 3548 3643 45 -1683 -677 -271 -1027 -298 1718 1433 -1457 -2208
1724 -2208 1377 4010 459 -5252 -4615 2616 6941 2231 -5105 -5241 1298 5151 1755 -3202 -3109 548
1740 548 2109 695 -228 378 41 -1535 -1250 1441 2300 -895 -3557 -577 4609 4100 -2620 -6754 -2311
1757 -2311 4961 5564 -650 -4841 -2103 2548 2660 -719 -2130 -431 905 341 34 886 555 -1587
1773 -1587 -2086 999 3524 872 -4035 -3831 2228 6152 2110 -4767 -5419 538 4794 2391 -2205 -2602
1789 -2602 519 1925 203 -1260 -600 179 -206 -1 1537 1621 -1330 -3611 -993 3847 3956 -1632 -5535
1806e535L452O276P44n521m015K277M486N23l011j542J562J517n99r41J75k3j070
1823a245Q5K646J950k542m615k76N154L942k775n790r47M811L736k049m257n74
1839b746L034J775j393j774K14J001J75Q7P22k79k316j589K380M195L15m745l827
1856d771K312N352J194m222l521J768L975N84k979j968J296K086J73j032n66k91
1872f10n32M27K124J415k155l813l59M277L554j966m893j258L762L283j501l663
1888a908n88K833J993j216k190m48J010Q76N01M03n93k031j254J914L462M32l769
1905e73l246J647M368J178l335k990J300L381O59k621k062R93K267P52r60j172
1921d14p20k09Q31J911J025j790l074l74L239K841j371l784j065K942K716j178
$$ plain form
1806 -5535 -2083 4193 4937 -584 -4599 -2322 2164 2687 -324 -1866 -304 1213 614 -327 -152 -175 -1245
1823 -1245 -1160 1486 3436 894 -3721 -3997 1157 5099 2324 -3466 -4413 398 4134 2085 -2172 -2746
1839 -2746 288 2063 670 -1104 -890 111 286 373 1095 816 -1500 -3089 -709 3486 3801 -944 -4771
1856 -4771 -2459 2893 4087 -135 -3656 -1888 2087 2671 -308 -2276 -980 1106 1279 247 -319 -610
1872 -610 -1142 -715 1409 2824 669 -3144 -3503 774 4328 2362 -2531 -3789 -27 3256 1755 -1908
1888 -1908 -2496 337 2330 1114 -1076 -1524 -514 362 863 1266 673 -1358 -2612 -698 2764 3196 -573
1905 -573 -3819 -2172 2196 3374 39 -2951 -1651 1730 2389 -232 -2294 -1301 966 1718 758 -414
1921 -414 -1134 -1343 -512 1399 2424 634 -2440 -2814 425 3266 1895 -1889 -2954 -12 2704 1526
1937A526l185p40K469K172p31k299j054Q31J395R15J06j020j809q00J687K698
1953B161L28k809k479J170L247R33k607k394J072K920P92k274k215M82K198J299
1969A824o05j481j110j06J107J715O61j559k335k61K418K073j002k761p40K250
1985H8K120r50k690q25K032K233j91k099j516L65J562J293Q4j205j627m38J468
2002b96J938R4k034j648R17K316N40k014j837Q44K474R05j784k247r8J952J739
2019A761j48j586j468q4J301J524K45j400j605R7J746J233r24j916l14J793J588
2036A843p65k243r34J514K177L62j714j845j16J541J572J52j353j456q0J347J303
2053A305k82j504q59R46J536J38j601j346O63J986R74j218k068o12J442J899L71
$$ plain form
1937 1526 -1659 -2399 70 2242 1511 -788 -1842 -1011 384 1299 1405 385 -1424 -2224 -537 2161
1953 2161 2489 -320 -2799 -1629 1618 2551 -56 -2450 -1378 1542 2334 60 -2155 -1673 525 1824
1969 1824 1219 -262 -1372 -1478 -371 1344 2005 446 -1889 -2150 268 2341 1339 -1422 -2162 88
1985 88 2208 1258 -1432 -2257 -225 2008 1817 -282 -1798 -1433 129 1422 1506 301 -1326 -1764 -296
2002 -296 1642 1736 -298 -1946 -1029 1287 1827 -187 -2024 -1180 1294 2199 415 -1832 -1930 22 1761
2019 1761 1613 27 -1441 -1525 -224 1300 1545 145 -1460 -1363 383 1616 692 -1224 -1538 255 1843
2036 1843 1078 -1165 -2099 -585 1592 1954 240 -1605 -1721 -180 1392 1544 191 -1265 -1345 2 1305
2053 1305 1023 -481 -1340 -394 1142 1280 -321 -1667 -1004 982 1956 738 -1330 -1942 -500 1399 1770
2070A770j423j671j94J372J392p5j354j011N05J344M80j007j271Q6J473J151o09
2087I58j787r89R66J914Q31j186j914n95J329J735K31j415j334K57J392P49p39
2104D03j239j70J128J057k81j365r44N32J541R65o72j745r81R03J867P83j201
2121E81j738k78J421J281m13j412n68R52J169r1j228q62M47J237P72m68j279r31
2139a408M18J510J096o05j771r16J024J731L10j423j239N35J478M17j173j157
2155a173L38J315P59o06j183o04M19J078Q46j96j283j142L51J629J032q80j703
2172a003l11J436J217o65j572k93J354J175m91j451o52P18J096M70l84q63p44
2189i63LJ023J142r2j465j105P29J650L57j430j195P49J633K25j496j208O02J526
$$ plain form
2070 1770 347 -1324 -1518 -146 1246 1171 -183 -1194 -689 655 1135 128 -1143 -1057 416 1567 958
2087 958 -829 -1818 -852 1062 1893 707 -1207 -1802 -473 1262 1493 78 -1256 -999 393 1142 403
2104 403 -836 -1006 122 1179 898 -467 -1411 -879 662 1627 955 -790 -1771 -868 999 1782 581
2121 581 -1157 -1435 -14 1267 854 -558 -1126 -174 995 904 -324 -1186 -739 498 1270 802 -477 -1408
2139 -1408 -990 520 1616 1011 -760 -1676 -652 1079 1389 -34 -1273 -738 740 1157 -16 -1173
2155 -1173 -835 480 1239 633 -550 -1154 -735 343 1189 993 -290 -1432 -1081 548 1580 700 -1003
2172 -1003 -1314 122 1339 674 -898 -1191 163 1338 847 -604 -1256 -538 558 1028 644 -219 -963
2189 -963 -960 63 1205 1113 -352 -1457 -728 922 1279 -151 -1346 -597 1036 1261 -235 -1443 -841 685
2207F85N69p89j015l21L27O31O39J84p72j129j18J278J146n95j588l68J432J187
2225A383q05j708k21J605J271o62j579n38Q52R61J88l13m23n12k94N26J050K84
2243A065j101j108M54J503L73j408j194Q10J773K53j644j343O61J630N33r01r12
2260e56p7L25K63L50L54k69r40m29Q97J086l44j428l85J396J213q18j833l09J686
2279A82J388o58j611m86Q89Q31n2l25q2j89m26O1Q39N32p30j049K43J336M11j323
2299b19j226P86J851L73j674j421N90J590M83q99p51J61L54n5J5L90R9o73n46
2318g72N66R91j69j247m47J257J224p11j849m09J622J459n37j576m96Q75O98k18
2336B61l70J50J60l54k80M97N52m49q83J28J198M74j201j244O28J792M54j547
$$ plain form
2207 685 1254 465 -550 -871 -544 87 726 910 138 -991 -1109 169 1315 720 -868 -1236 196 1383
2225 1383 578 -1130 -1351 254 1525 863 -716 -1254 -402 559 747 434 11 -501 -795 -269 781 1065
2243 1065 -36 -1144 -690 813 1186 -222 -1416 -606 1167 1420 -224 -1567 -906 724 1257 356 -556
2260 -556 -633 -308 -45 305 659 390 -550 -979 -82 1004 660 -768 -1153 243 1456 638 -1195 -1504 182
2279 182 1570 912 -699 -1185 -296 535 483 158 76 -113 -539 -478 361 893 163 -886 -643 693 1104 -219
2299 -219 -1445 -659 1192 1565 -109 -1530 -940 650 1133 234 -517 -356 -2 -57 -42 348 447 -226 -772
2318 -772 -206 785 616 -631 -1078 179 1403 692 -1157 -1566 56 1515 978 -598 -1094 -219 479 261
2336 261 -109 41 201 -153 -433 64 616 167 -716 -588 610 1084 -117 -1361 -733 1059 1513 -34
2354c4j442N34J535M74q77o63K95L68k55k67L73M06l30n66K91P90j25j156m52
2373a101J169J279n03j738n37J397J350m85j442l90R07O54l56m59K66L52l33n02
2391d72K29N88j36o82O0J034M24j120j286M44J692O37j226j317L69J312L22r06
2409c4o18M47N69k21m41K05M75j38n45N0O19J8q75m13J009J195m01j622o92J138
2429b75J285k57j174k72Q36N00n51o28K47N79o3m44M4M85n4o57p6Q18M78q33j105
2450a117L30J466O39j049j259J94J108L09p50m35N98N96l19o75m0M61P1l18O1
2469a29N82N7q06n41O89J046j78j260n79R43J132k24j080l20P16M56n12n84L16
2488b76P05Q0n07k22K39mm29j9P66N44o21j029K5J068N69p64r53K64J012K44p46
$$ plain form
2354 -34 -1476 -942 593 1067 190 -473 -178 190 -65 -332 41 447 117 -449 -158 632 507 -649 -1101
2373 -1101 68 1347 844 -894 -1431 -34 1316 831 -611 -1001 -94 560 204 -255 11 363 30 -472
2391 -472 -243 345 209 -473 -413 621 1045 -75 -1361 -917 775 1412 186 -1131 -762 550 872 -34
2409 -34 -652 -205 364 143 -298 -93 382 244 -301 -251 368 386 -489 -902 107 1302 901 -721 -1413 -275
2429 -275 1010 753 -421 -693 143 643 92 -536 -289 290 227 -217 -173 312 258 -399 -475 343 821 -12 -1117
2450 -1117 -787 679 1318 269 -990 -796 312 621 -129 -564 34 630 311 -364 -404 57 128 -190 -129
2469 -129 453 510 -296 -837 -148 898 720 -540 -1119 -176 956 732 -348 -668 48 504 -8 -592 -276
2488 -276 429 509 2 -220 19 15 -414 -433 333 877 256 -773 -748 320 889 125 -828 -564 448 692 -54
2509e4n22M50O12k16o47p6N07K39k46q9L38K6o61m98N76J012N0r80n91N80P97
2530F07k31q41j40P56N36m67o79J15N83J16m11j91K59J17l00q8N34M14m78q81
2550f70o1Q67N97m78p23J51P08R0p11m67M79P15m8n71k19L04J66j92j02K97J71
2571C03m02m21L22P12P6p50m95M34O62j05o46j02O29M09m48o91J4N85K73k21k11
2592g3J52M6l00j65L48M59k16n75j21N83L89m03n57J35O07J12n66l98L92O05n
2613D49n48k76K40K15j02n6K35J74l23m08J04M93J54m24l14L29M42j47n61j20
2633d44N43L95k91n65k0M60K46k10k04P6Q9j71j65K30L59o9m02j65L29K45k43
2654B3l51J74M95P1m88m11K63M99Q7l75k24J59J68q1j15J41J80j61k84jL27J37
$$ plain form
2509 -54 -576 -126 486 270 -377 -453 54 293 47 -42 296 322 -339 -837 -261 751 801 -179 -770 -190 607
2530 607 376 -465 -605 151 687 220 -459 -344 239 355 -56 -247 12 129 -171 -259 275 689 211 -670
2550 -670 -731 136 733 255 -468 -317 391 481 -230 -697 -218 497 449 -122 -341 -37 129 -63 -165 132 303
2571 303 -99 -520 -198 514 590 -160 -655 -221 441 336 -310 -412 217 626 178 -513 -499 86 359 138 -73
2592 -73 79 125 -175 -340 8 467 251 -324 -445 138 527 124 -433 -298 309 421 -145 -543 -151 454 449
2613 449 -99 -375 -135 80 -22 -78 157 331 8 -400 -296 197 351 -73 -387 -58 384 237 -324 -444
2633 -444 99 494 203 -362 -382 78 324 114 -90 -14 75 -96 -261 -31 328 259 -143 -308 21 266 23
2654 23 -328 -154 341 412 -76 -487 -224 275 362 -13 -237 -78 90 9 -106 35 215 54 -230 -231 96 233
2676B33k41j99K05K82j69m21o3M53L59k16m77q0L04K02j20j43R9J08j22j85Q8
2697a03K34M1k19j04J65J41j84k12J55L54N4l74l20J68M14P4k37j91J11J08o7
2718Hj23R1J74j3j88q4J30Q1j12n8J49J65j33l29l9L13K75j18l26r9K23J40r6
2741C1j16P2J27n7j67k6J29R6n4n0O5J9j42j24J27K67N1k74k32R2K68N8j55j03
2765i8R3R5o7j41L0J52P4p8r7j1K0j4NJ30P8j19k14l9K05J83m9k12n0J29P4r4
2791a5r8Q7J35Jj42q4J9J09M2Okn0j05n1J03J64K2j46j49O6J26L5r2m2Q2Q7p2
2818C6j41k6J25J22j0p8q2l1K6O8P4L2q6j14k5J10Q6l5q0QP6Rj04p3O9J37N2j06
2846C9j40k7Q2R9N0m2q0o1KP0P1Pp1m6L4L8l9n6J6J01O5n4j47o3P7J48O6p4j21
$$ plain form
2676 233 -8 -207 -2 280 111 -310 -373 80 439 223 -254 -334 -30 172 52 -91 8 116 -6 -191 -103
2697 -103 131 172 -47 -151 14 155 -29 -241 -86 268 322 -52 -372 -204 210 284 47 -144 -33 75 8
2718 8 -115 -24 150 137 -51 -135 -5 76 -36 -94 55 220 87 -242 -281 32 307 189 -137 -236 -13 127 31
2741 31 -85 -13 114 57 -110 -136 -7 89 35 -15 50 69 -73 -197 -70 197 248 -26 -258 -166 102 160 5 -98
2765 -98 -5 90 23 -118 -88 64 138 60 -37 -48 -28 -42 -37 93 171 52 -162 -201 4 187 138 -74 -124 5 79 -15
2791 -15 -113 -26 109 110 -32 -116 -97 12 54 60 58 8 -97 -148 -45 119 141 -5 -154 -88 38 73 -19 -61 21 108 36
2818 36 -105 -131 -6 116 106 28 -54 -85 -59 9 83 115 29 -85 -110 0 86 51 -29 -21 55 64 -40 -113 -44 93 145 39
2846 39 -101 -128 -46 53 103 61 -19 -80 -78 -8 63 70 -1 -47 -13 25 -14 -70 -54 47 112 58 -89 -152 -75 73 139 65 -56
2875e6n4N1P3O5k9n8k2RK8Mm6oP2N8l7j05o6O4J26Q2n8j50p0O1J14N9m5p7m4M2
2905a5M2Lm5k0N4M7k5r0o0M9J20O2n3j22q7N7J31Q0n7j18n1M5Q5J3o6l0M5N5k
2934D7q9n9M4J18N9o0j22n9M7J30P5n4j11p6M2J16N3p0q9J1Q2M2q3p9K1J21O6
2961A23m8j35p0P5J20O4n7j18o4L7R7P3n9q4l4N9R0l8q3l5R1R8k0j37r1N7J45
2988E6P7q3j24n7M8J17N6k7j04m0M5Q4J8p4p8O4J07J4j13j22K8J63J25j00j42
3013f2n8N8J19N2m8r5o0M8R4L6o8q0QQ1P6p7j17j3J13J47m4j51j12N0J63P8o8
3040G0j29o1P1R6K4m8o7l6P8O9j3j12n1P6J43K2j43j53L5J71J24o8j60p6P8J17
3066E7O3o2j06j4M5O6J0o2q5N5J14L3p9j42l0J51J45l1j67j21O4J53P6o4j27n4
$$ plain form
2875 -56 -110 -59 14 79 50 -8 -30 -21 7 11 -35 -41 31 89 52 -53 -119 -55 71 153 95 -55 -125 -64 50 109 64 -13 -57 -15
2905 -15 27 30 -15 -35 19 66 41 -49 -109 -60 60 122 69 -53 -140 -83 48 128 71 -47 -98 -53 32 45 -21 -51 -6 49 47
2934 47 -42 -101 -57 61 120 60 -62 -121 -74 56 131 77 -34 -110 -68 48 101 31 -58 -47 35 77 -6 -85 -64 57 123
2961 123 75 -60 -130 -55 65 129 72 -46 -110 -73 24 97 38 -46 -80 -21 69 31 -52 -87 4 102 82 -55 -146 -89 56
2988 56 133 50 -74 -131 -83 34 90 63 -41 -81 -36 48 66 -8 -86 -22 85 99 -14 -136 -108 55 180 80 -62
3013 -62 -120 -62 57 109 61 -34 -94 -46 48 84 16 -64 -56 25 101 24 -93 -106 7 154 110 -41 -153 -103 60 138 70
3040 70 -59 -120 -49 47 71 23 -44 -80 -2 67 54 -58 -109 -33 110 132 -11 -164 -129 42 166 98 -62 -138 -60 57
3066 57 120 58 -48 -62 -17 49 59 -3 -88 -33 81 114 35 -107 -137 14 159 128 -39 -160 -96 57 133 69 -58 -112
3092a12P5Q6J9p0q0K1Q6O3n2j28n1J13J47K7j54j47K2J71J12m9j61o4P0J26L5
3117A05q3q7j2R9Q0l9j11o1P2J43M3j29j61oJ45J62k7j44j36N3J47P9p6j11n1
3142a06R1R5Mj13q0M2J18P9r0j54l7J28J62Jj55j42L5J42J01l6j26p1N5J19J6
3167G8p5r7J1J00J06n2j49o7R8J62M3j37j52lJ47J23k0j45r4N5J10O0o1j01k1
3192h1Q8Q2Mj32r9P0J62O1r6j81n1J57J46jj48j24M7J36O6m8j17m3O5R3M5r7j08
3219a04MJ24J08o3j74o5J14J73L5j33j70J6J47J10m9j19o8O5J14L8p0r6k8R3J09
3244A11j1j33r3M4J76Q9j23j61o1J48J59j7j29j13M9J07N4o4q9k3O8J01Pr7j26
3269a27PJ49J13l8j90q7J22J62M6j56j35LJ49J03n6j22l3M5Q9K6o5q7j8J02J11
$$ plain form
3092 -112 -37 49 68 -2 -82 -61 25 88 36 -92 -143 -30 117 144 -10 -157 -135 36 148 99 -62 -126 -56 70 105
3117 105 22 -65 -77 22 102 63 -48 -109 -37 106 149 20 -141 -147 -2 160 133 -11 -147 -94 53 132 56 -55 -106
3142 -106 -15 80 84 -29 -109 -67 51 130 40 -114 -151 -23 139 140 -15 -157 -122 20 121 85 -41 -112 -57 62 78
3167 78 3 -94 -83 17 123 71 -78 -145 -47 115 158 21 -131 -134 13 136 116 -29 -123 -68 42 102 41 -60 -81
3192 -81 7 89 93 -39 -138 -68 94 155 59 -122 -173 -16 130 129 -19 -143 -96 40 106 58 -59 -102 -37 56 101 4 -104
3219 -104 -100 24 132 69 -105 -170 -56 117 152 19 -151 -135 12 122 73 -46 -114 -49 65 103 33 -63 -91 2 111
3244 111 100 -33 -126 -82 94 183 60 -101 -162 -14 145 128 -1 -114 -65 42 96 32 -57 -80 -12 89 96 -1 -127
3269 -127 -120 29 142 104 -86 -173 -51 111 157 1 -134 -131 18 121 65 -57 -90 -45 44 70 5 -82 -100 2 113
3294A13nj50j15N2J79Q9j01j77l2J44J35k3j39r0N9J29L4o8q4k0O7Q2J5r4r6j0
3320a06J43J19n0j78r3R6J66M5j48j19L5J14P6o3j10k1O9Q6Nn4r0qQ1J07lj43
3346d4j10N3J73P6r2j71j5J28J05j3j31n1P4R5K1q9p8oQ1Q9Jq3j21J4J22J15m6
3373I7j44r4J02J49L3j30j12L4J16M8p1r3j5P9P3Jq2p6pQ9J05pj22j01M1J38P5
3400A26p9j43k0J16J04n5j02l9P0R2kn9q1J6N6R1%r7r4QJ15J07m5j42o4Q3J24
3427H6Rj02r0M5J11M0q1r1OP9Q3j6p7q0KR0Q5kj16r5K8J38O3r3j06jJ05Q6q0r2
3457f6m0P5J04np9p0NP0P2jp6r6K0J03Q1l2j19m2Q0R8nj02p3P6Q4J8q6p2K3N9
3487DQ1po5q7NQ6P5k3q4p4N6Q9K2p5q2K2Q8M8n5r9LP3O3ko3o5OP1N9mp8o9J6R1
$$ plain form
3294 113 108 -42 -157 -105 74 163 62 -115 -147 -3 132 109 -30 -120 -61 68 102 34 -50 -70 -3 79 94 0 -96 -106
3320 -106 37 156 106 -72 -165 -69 97 142 -6 -125 -90 24 100 37 -73 -94 -25 61 66 12 -78 -86 -5 102 99 -44
3346 -44 -154 -101 72 148 56 -115 -130 -2 103 90 -41 -92 -18 77 98 9 -69 -75 6 95 96 13 -108 -94 28 143 97
3373 97 -47 -141 -39 110 143 13 -99 -65 51 99 28 -65 -80 -1 72 73 -9 -85 -92 -3 102 95 -27 -128 -87 51 126
3400 126 47 -96 -116 0 104 49 -53 -92 -22 70 68 9 -72 -56 0 91 91 -6 -100 -92 23 130 85 -57 -121 -38 86
3427 86 95 -7 -97 -52 59 99 18 -73 -67 12 95 79 2 -78 -76 14 99 97 -19 -114 -86 52 115 22 -84 -85 20 106 26 -66
3457 -66 -106 -31 73 68 -11 -81 -76 -6 66 65 -11 -107 -87 16 97 65 -54 -96 -16 82 77 -25 -98 -22 62 80 -6 -78 -55 4
3487 4 85 78 13 -74 -69 17 92 69 -15 -89 -33 56 78 3 -79 -57 31 79 24 -75 -72 1 64 62 -1 -66 -60 11 70 66 -12 -81 -65 26
3521B6N3m9r4j0P5N4k3p9m0Q1O9J2q3o6K0O8N5j5n6n6J4O3N1k8o5m1M9P2kp4n1
3552g0L0J06J7o6q6mQ8O4k1n7o0RN3M1Jo7k6J1N8K9n4o2K5P5M5o5q4j1O7Q5j3
3583E8p2o6K2O8M1j2n6l2J8N3K6l5m9rM8P7m6q3k9O3Q6Rp7o7K0O2O4l7m4m7J9
3614b7N1K5k2m5rK6L8Lp6l6M7P5K3o2r1OP1O7qq3m0J9P0J4l2m1nL5L1%m7l0K0
3647c3O8L6n8q6j3Q4P7Jr5n8L2P5K5l9m5j1M2N3j8l7m1J4O1K9l8p7j7O9O5J6q2
3678ap0PQ8N0k9p4k6K9O3kn3k0J0M7K7k7o9k7N3Q8J5p0q6KP3P4j9q6l3K1Q8Nm1
3711Go0MQ0M0l5q0k4N1Q0K5p9q7PR0O9j9q3m9K2Q0K8k8p3j9O2N0no4o2M1Q6M1
3743I6p4r8j9R4Q2jr6p1J3Q3N9l5p0j4L3P0J2q2m8J6P7O1m8j01l9P7J09Qr4r2
$$ plain form
3521 26 79 30 -64 -74 1 55 32 -47 -87 -6 63 75 -8 -74 -54 14 69 54 -2 -58 -44 19 70 42 -23 -64 -15 57 55 -19 -70
3552 -70 -40 66 83 17 -69 -73 15 79 58 1 -59 -50 3 44 45 -22 -48 -37 21 50 -4 -66 -41 34 79 14 -70 -81 -14 71 58
3583 58 -14 -80 -58 10 51 39 -17 -49 -31 22 48 13 -36 -45 3 80 34 -49 -78 -15 71 80 3 -64 -44 18 82 45 1 -46 -27
3614 -27 24 49 27 -18 -27 -1 37 40 -36 -72 -25 50 73 11 -80 -74 -3 64 56 -27 -67 -48 22 36 4 -37 -42 -7 24 24 -23 -53 -33
3647 -33 35 71 13 -73 -86 -2 75 76 -19 -77 -45 30 55 16 -29 -40 2 55 37 0 -41 -27 34 63 25 -52 -69 0 65 81 -1
3678 -1 -71 -64 24 74 45 -29 -55 -26 37 35 -18 -38 -28 19 46 19 -50 -77 -24 64 79 9 -77 -75 -2 72 53 -33 -66 -45 43 48 7
3711 7 -53 -49 31 71 36 -44 -68 -17 63 88 9 -78 -71 19 88 69 -14 -63 -41 39 67 39 -34 -53 9 59 54 -10 -72 -31 55 96
3743 96 22 -76 -95 -1 81 80 -16 -87 -74 9 68 33 -37 -51 -18 52 64 -18 -66 -50 27 88 40 -61 -100 -23 86 94 0 -92
3773i2K9R9N7m2o9l7L2O8Ml9n4nO5P8k8j00o9O1J36K3r3j13j1J25Q7m6j07k3M4
3802b0O5Rm5m3j7N4O0Kp7q0J7J23O8o1j39o4J33J28qj27r9O1R9M2o1q2RM1O3L
3832E4n8o1OQ4P0j0j25r9P1J63O7j25j60J3J40J12q2j14k0O3Q6j5o9m0J3M7N3
3859F4kq0q2J0J17J01o0j59o9J27J69j8j54r4Q7J30kj01p9M1P6M2k8o9m0MP3R9
3887A03l0j21j17O5J94N8j19j79L0J73Q1r9j40QJ23O4m0r3k9L7P3L3J0q8r7nJ48
3914D3J25o3j98p8J37J91k3j90r8J10J80l6j38q8P3J05L1n3n8m8J1O5Q7K1j38
3939c0j31N1J96R8j53j91L0J98J17j59j71K4J71Q8q9j19j7M3Q3L9Ko6j07j7J19
3964IJ47m3k00j00J64J92j7k35j01J48K09j9k13q8R2J57Lq5o7k8LO7R8J6j25j49
$$ plain form
3773 -92 -63 36 93 51 -18 -55 -23 45 49 10 -44 -49 16 94 66 -34 -103 -42 94 117 24 -89 -100 25 112 66 -41 -64 -20
3802 -20 45 54 9 -34 -51 3 63 65 -12 -92 -75 48 116 55 -84 -148 -15 113 105 -22 -121 -60 39 81 20 -62 -53 -12 51 54
3832 54 -4 -65 -59 25 95 85 -40 -139 -68 95 162 37 -123 -110 30 142 60 -54 -74 -11 75 60 -9 -49 -36 11 64
3859 64 62 -18 -100 -90 27 128 68 -91 -160 -33 136 118 -36 -130 -43 87 85 -16 -95 -54 22 64 36 -33 -73 -69 4 103
3887 103 73 -48 -165 -100 94 152 33 -146 -116 57 138 39 -101 -93 30 94 54 -39 -68 -31 42 75 85 -3 -100 -105 43
3914 43 168 105 -93 -171 -34 157 134 -56 -154 -44 136 100 -38 -126 -53 52 83 30 -28 -76 -65 0 87 108 -30
3939 -30 -161 -110 86 184 31 -160 -130 68 185 26 -145 -121 50 138 49 -70 -87 -44 39 78 80 14 -93 -110 9
3964 9 156 113 -87 -187 -23 169 152 -83 -184 -36 173 154 -59 -147 -55 102 105 20 -47 -75 -72 -5 93 109 -16 -165
3990a65M0J91J23j72k20N8K43J08j66k34L7K15J24j29j62j2R5P2K3j2n5q5l0J28
4014A5J39k1k06j05J58K17m6k62j11K01K28k5k52j37J38J81J8j06o6NLM5Q0J5
4038A06j13j35K7K12J05j68k30M6K61J21k04k66M3K81J42j53j95j6J06O9kj2k4
4061An7m0Q2J44l0j94j21J85K28l0k76j49K11K82l5k84j60J59K12K7j15j02NK2
4085c5K5L7N4n8j24OK03R0j83k46M5L01J74k17l05L2K76J80j71k34l2J64J01k4
4109E9l7j9m9m4O4J31k1j77r2J69K57m6l39j80K23L34pk85j90J58K23K7j64q7
4133i2L7N9J8K5L1p7j02J6J76R8j77k44M6L21J95k46l64PL27K25j73k28k4J53
4157GJ08o9p4j3jmN4Q8j2j88j04J71K63n3l12j95K49L55ml23k30J52K53L5j87
$$ plain form
3990 -165 -125 66 189 17 -203 -145 98 206 40 -194 -157 58 182 53 -109 -121 -26 46 69 57 2 -83 -113 15
4014 15 154 133 -73 -178 -20 197 151 -111 -222 -21 207 182 -70 -207 -69 112 130 24 -42 -37 -34 11 91 106
4038 106 -7 -142 -115 97 202 34 -196 -150 111 232 28 -238 -195 86 228 75 -120 -136 -30 39 37 25 1
4061 1 -56 -96 -14 130 100 -94 -215 -30 198 168 -108 -257 -46 236 201 -83 -243 -84 128 155 40 -62 -57 -35
4085 -35 -10 27 81 23 -101 -95 108 198 15 -231 -186 115 289 72 -233 -201 75 255 84 -150 -182 -18 83 59
4109 59 22 3 -46 -90 -26 105 84 -93 -185 -16 241 195 -144 -324 -101 233 226 -59 -249 -91 132 159 -5 -92
4133 -92 -55 4 22 47 78 1 -101 -85 91 189 12 -232 -186 135 330 84 -280 -273 54 279 106 -122 -146 7
4157 7 115 46 -28 -41 -42 -46 8 96 84 -104 -208 -37 226 173 -139 -334 -85 270 266 -57 -287 -135 118 153 -34
4182c4p5O3R1lk7mm8p9L5J91R4j75k74L8L24K01k13l57k1L35K31j58k80k4J75
4207FJ13o5j10KM8J7L2N9n2j73r2J91K70j6l42k29K07L67L6l25k42J71K77M7k21
4232b4j22O8J28J5l6m8l6m6M7J84O3j93k68L3L31K33k03l55m8L10K34j42k80m8
4256b03K28J47p9j54l4M7O1M7L5l4j76p4J76K64j0l41k17J87L54O0l14k47J59
4279a18K88L7k31j79Q8J69P1o2q7n8m5P9J78O4j78k59J2L27K27j95l51p5L22K49
4303B73j39l03n5K38J78o6k12p1P6J21O0L8j00j53p9J70K64k2k96k15J70L40M6
4326B63k94k51J44L10O3k45k01O7K15R8p1j30r8PR8J74N1j85k32lL02J92j58l32
4350b16n2K93K49j27l31p7K45K29m8k29j25P0J54J01%j21j66l7J67K41j5k69j96
$$ plain form
4182 -34 -109 -46 45 42 15 11 -37 -116 -81 110 204 29 -245 -207 117 318 105 -252 -273 62 293 135 -145 -169 6
4207 6 119 54 -56 -54 -6 11 43 102 50 -123 -215 -24 246 230 -112 -341 -134 233 269 -56 -298 -127 150 197 -24
4232 -24 -146 -78 50 65 29 -19 -55 -101 -54 130 193 0 -268 -235 96 329 126 -229 -277 33 267 125 -155 -203
4256 -203 25 172 93 -61 -95 -48 13 60 95 61 -115 -189 -13 251 241 -100 -317 -130 224 284 -30 -277 -118
4279 -118 170 207 -24 -203 -115 54 125 63 -24 -82 -127 -48 130 194 16 -243 -231 96 323 128 -223 -298 24 273
4303 273 134 -169 -224 14 192 126 -86 -157 -81 40 100 138 38 -115 -194 -24 240 218 -78 -293 -123 217 263
4326 263 -31 -282 -138 172 235 -10 -211 -144 71 169 98 -32 -130 -123 -25 149 200 15 -217 -220 82 274 116 -216
4350 -216 -268 25 274 147 -184 -261 -16 213 165 -64 -189 -119 35 136 136 15 -151 -188 -21 220 205 -64 -260
4373b60J51L14M9k88k41J38L16J00k51k44K5K41J49o1j53j24%J24J75J2j56k15
4395a99K8K61J58j59k93l7K86K20j21l22j02K38K66qk40j68L6J70J49jj54j70
4417a62rJ76J77k6k42j45J39K93K4k69k36J20L24J33k27k81k2K41J97k7j80j65
4439a67K4J47J69lj96j57N4K22J38j69k62k2K75K08q8l25j31J93K99L7k29k26
4461b09MK00J75j4j66j74L7J99J39p8k34j00J77K51kk61k19J13K92J46j69l04
4483a97p4K10K62J7k00k13J4K05J58m4j97j22J07K21O4j86k37J4K60K05q9l01
4505a23j57J71L00R2k05k68l3K02K17lk17j78Q5K16J14j47k29m7K08K14l8k39
4527f5k02R1K84J64j33k99j15J61K90N8k12k32RK48J66r9k38q9J66K36Nk15k06
$$ plain form
4373 -260 -109 205 254 -34 -275 -137 179 279 28 -216 -191 50 199 138 -15 -139 -139 -15 160 172 16 -199
4395 -199 -171 90 248 89 -204 -241 45 265 144 -178 -280 -42 224 216 -24 -192 -156 14 163 162 8 -162
4417 -162 -171 5 182 156 -86 -231 -92 201 225 -44 -280 -160 164 297 70 -211 -233 8 205 178 -2 -167
4439 -167 -143 4 173 170 -26 -183 -129 93 231 62 -200 -222 53 261 173 -152 -283 -90 209 246 17 -209
4461 -209 -205 -5 170 156 -10 -184 -147 52 191 113 -121 -221 -44 207 205 -56 -275 -162 130 276 107 -197
4483 -197 -271 -61 201 218 18 -195 -181 24 182 138 -59 -181 -74 147 211 25 -212 -198 62 267 178 -123
4505 -123 -280 -109 191 283 78 -190 -223 -21 196 193 -24 -202 -117 99 213 66 -163 -210 -2 212 174 -65
4527 -65 -267 -176 108 272 139 -160 -275 -114 176 234 22 -210 -201 47 213 114 -124 -213 -47 189 194 -21 -227
4550b27M6K49J82q6k61j61J03K85J38j55k76q2K06K48j1k48j80J24K59Q7k02k44
4572b06qK57K02m9k54j92P9K46J74r4k69j54J29K81J03k04k67NK78K07j46k87
4594a69r4K41K58j3k74j97P1K47J55p5k24j44N8K41J62j07k77j26K29K73pl06
4616g8k13J63L37P8k73k86L8K93K02q2k55j29O1J99J47m0j98j81O9K75J34k07
4638E4k80%L09K25j72l78p1K97K92m2l08k03J08K48J36q6j76j36L6J79J66o3k44
4661a09j53J94L03J5l37k53J86L90J20l28l39O2L39J99j37k45q9Q0J53J05j8j59
4683b1j65L6K50J56j72l32k2L50K82j91m35j07L48L66p6l54k06J50K49O7r4j29
4705e0p1J2J33J29k7k13j66J68L43K7l60l18K03M58J30l64l82O8L71K02j64k37
$$ plain form
4550 -227 -181 68 250 164 -97 -258 -155 130 268 113 -163 -245 -39 209 198 -50 -230 -106 153 240 38 -206
4572 -206 -214 43 245 196 -58 -250 -171 75 249 155 -114 -268 -139 142 245 41 -226 -221 57 264 118 -169
4594 -169 -263 -22 236 223 -51 -248 -177 70 225 150 -74 -218 -160 81 243 136 -141 -267 -38 235 228 -78
4616 -78 -291 -128 209 287 14 -272 -234 59 261 179 -76 -205 -144 55 202 162 -36 -217 -148 127 261 54
4638 54 -226 -226 83 308 136 -242 -313 -16 276 234 -74 -277 -169 79 215 129 -47 -183 -147 32 198 135 -109
4661 -109 -262 -68 235 250 -87 -340 -154 236 356 28 -311 -249 90 289 152 -93 -182 -102 51 156 138 -21
4683 -21 -186 -150 100 256 84 -248 -270 80 362 171 -264 -371 -23 343 267 -87 -293 -143 106 173 79 -50
4705 -50 -121 -109 24 153 126 -87 -253 -85 258 285 -75 -393 -190 268 398 34 -348 -280 91 293 129 -108
4727a08o5J00J26M2rr3j43J7K29J64j52l63l7L77L22j69n02j61L87M02p1m06j91
4750c04J77K55L9j37r3j0NO9J15kk07j66J65L66M7l83l55J64N16J72l77m29P1
4773c02M13K02j96k78pJ44J08k2l0m3j06J4J60J75j28l76o7M01L76j47n49k04
4795d62L93M39p0m10j94K16K79k6j77r2M6M0N2P2J0j79j73J36L47Q8l58m15J30
4818c08N52K49l88m80M8M35K06k33k99L2K42P1q0o1m7m3j3J80J79j14l52j30L67
4841A3M10j17n60k33L75M82l6m43k13K32K95k9k40r6J16J02K3K9k0j68j81J22
4863a37L54J64l53m28Q4N32K61l62m97M5M70K22k50l20K9K57R6j23j23jj3J9J44
4886G0J78q1l91j74L31M58n0n09k84L44M79l0m73k51K86L36j6k84j22J36J15J3
$$ plain form
4727 -108 -173 -73 53 95 86 -7 -150 -133 96 260 108 -255 -292 85 407 238 -264 -425 -38 364 293 -113 -304
4750 -304 -127 128 167 30 -63 -73 -68 1 116 114 -93 -259 -94 272 319 -64 -419 -255 261 433 56 -373 -302
4773 -302 111 313 117 -161 -168 -24 84 62 32 -11 -117 -103 57 232 104 -272 -339 62 438 291 -258 -462
4795 -462 -69 370 300 -110 -304 -88 191 165 -12 -104 -58 -18 34 106 116 -63 -236 -100 247 335 -23 -438 -308
4818 -308 244 493 105 -375 -327 108 314 81 -218 -186 56 127 47 -14 -61 -104 -117 63 242 128 -224 -354 13
4841 13 423 306 -254 -487 -112 370 334 -109 -322 -90 205 176 -64 -160 -44 58 81 110 90 -78 -259 -137
4863 -137 217 381 28 -400 -316 216 477 115 -382 -337 133 355 105 -215 -186 71 167 44 -79 -80 -93 -74 70
4886 70 248 167 -224 -398 -67 391 341 -168 -452 -108 371 341 -132 -383 -97 239 223 -61 -183 -47 68 81
4908H1ok5j20j55R0L57J80l23m65K1N08L03l14m75J3M74K49k99l78K5L39J54j25
4931A09j53m0K1MJ22J50p7l25j65L03M46k6n25l02L08M81j4m57k49L01M06m7l56
4954h5j89J32J94N0j4j3j18j56M2L09J77k71m06%M94L22l09m89rM66K55k63m12
4977b93J9L65K13j56k23o8J3O3J27J49m0k88k17K46M09Jm59k98L09M96qm82k94
5000d16K84M27nl53k25J38K50O0n6o3j13j35L7K84K01k11l88j9M18K72k74m89
5022c76J2N05K90k76m53l3L56K49j10k49o2M8Q1R7J00l7k64j74J98L67M3m11k81
5045c80K67M46J7m91l02K67M70O4l64k78J04K39Q7o1n6j01q0L9K19J67j88l50
5067b65k7L89K66k38m57k4M81L05k51m69p9L44L07p4k51j20O3P5P5P0j2k07j35
$$ plain form
4908 81 75 50 -70 -225 -135 222 402 79 -386 -365 143 446 132 -343 -330 144 393 94 -284 -259 80 234 109
4931 109 -44 -84 -63 -59 63 213 136 -189 -354 -51 395 369 -156 -458 -150 331 317 -140 -389 -88 318 271 -85
4954 -85 -274 -142 52 102 88 75 -43 -199 -157 152 329 58 -348 -348 146 468 159 -330 -339 127 382 119 -293
4977 -293 -274 91 304 148 -75 -143 -130 -67 60 209 169 -119 -336 -90 319 320 -139 -437 -128 368 360 -122 -416
5000 -416 -132 295 290 -63 -288 -150 100 160 104 41 -72 -207 -170 114 315 104 -284 -303 115 387 113 -376
5022 -376 -364 141 431 155 -298 -331 25 274 164 -85 -147 -99 -18 79 179 142 -122 -296 -98 269 312 -99 -380
5045 -380 -113 333 350 -141 -443 -176 294 358 -6 -284 -180 59 146 85 29 -72 -152 -113 106 273 85 -265
5067 -265 -292 97 363 125 -332 -356 125 430 179 -290 -369 -25 282 208 -43 -163 -100 -25 50 120 108 -99 -234
5090b34J67L09K5l70k64K52M47K4m55l25K30M76J00l54l17O2K70J18n3r4p4n1
5112a11L2J55J18j45k56j4L32K41k39m37l8M36L47k08m59j37L24L10k5k71j28
5133a73N0J21O9L9n6j40p0J25K45j8l27k07K27M29M7m24l51J80M51J53k94l21
5155b45J8K51J54n8j19j01j2Q4J33O4j67k21M6L04K06k31m08m4L95L51j60m28
5177a88j69K55L28jk34j73O0J43P7jj01j14l6J78J75l6l03j84K15L88O6l71l50
5200c76J29M20J63k25l16j8K25J76n5j58q5K7J23J03rj64j66O6K87J55k13l59
5222b70n8L60L12r7l80j90K08L00N0k26j81M7J76R7n4j43j09N1J74J51r7k75j56
5245c10K05L45O4l11l06P2L44J92j81k90n0K02J89j9j87j24N5J61J29p5k03j41
$$ plain form
5090 -234 -67 242 267 -103 -367 -115 332 356 -99 -424 -194 282 382 28 -289 -227 43 161 108 14 -60 -111
5112 -111 -79 76 194 49 -207 -221 111 352 113 -324 -362 74 421 213 -246 -383 -59 251 226 -45 -173
5133 -173 -123 -2 67 106 50 -90 -160 -35 210 192 -135 -342 -115 314 361 -63 -414 -234 217 370 76 -245
5155 -245 -227 24 178 120 1 -100 -112 -28 105 169 2 -219 -173 131 337 106 -302 -346 49 400 240 -188
5177 -188 -357 -102 226 225 -9 -182 -122 21 98 97 -4 -118 -154 24 199 163 -140 -324 -109 279 345 -26 -376
5200 -376 -247 173 336 111 -205 -223 2 178 123 -35 -120 -93 30 133 124 -40 -206 -140 147 302 89 -270
5222 -270 -328 32 344 247 -133 -323 -115 185 235 9 -172 -125 51 148 94 -49 -158 -107 67 218 121 -154 -310
5245 -310 -105 240 304 -7 -313 -241 103 295 114 -176 -226 -24 165 146 -41 -165 -110 51 180 105 -98 -239
5267b39J19K74J27k02l17n4K93K88n8l08j94J52K77O5k04j95L5J76J47o1k04j20
5289b03R2K30J28j45k66j13J91K97L8k54k53M1K94J65j33k60p4J93K00nk09j52
5311a98O1K26J45j27k46j21J58K67R9k01k71n2K43K39m1k36j58J09K25Q9j73k02
5333a65NJ93J75o1k43j55J32K63J15j55k85q3K11K40K4k20j90L4K31J20r2k04
5355a10r5J60K21Rk07k21N5K73J69j14k98j19J76K82N0j92k36J0J83J75m3j94
5377f6j19P8J94J00j46k24l8K33K22l0k97k01J36L10J25j84k73m2K07J91rj90
5399b3j24M1J60R8p1j75p4J09K12O9k23k49K8K97K23j25l20j50K16K66J8k12j71
5422a80M5J76Q8n4j35q2O9J51R2j15k22o1J97K71qk94k41J17L43J26k14k77JK23
$$ plain form
5267 -239 -120 154 281 79 -238 -292 1 289 231 -77 -271 -119 158 223 19 -176 -141 35 182 121 -83 -203
5289 -203 -111 119 247 102 -164 -277 -86 211 249 -5 -258 -217 77 242 109 -151 -225 -32 168 163 -46 -198
5311 -198 -137 89 234 107 -139 -260 -102 165 264 63 -208 -260 -17 222 181 -55 -213 -104 121 210 37 -165
5333 -165 -160 33 208 147 -96 -251 -119 144 259 104 -181 -264 -53 187 211 -9 -199 -165 66 186 94 -110
5355 -110 -205 -45 176 185 -22 -243 -188 85 254 140 -158 -277 -101 181 231 39 -197 -187 -4 171 128 -66
5377 -66 -185 -107 87 187 41 -183 -221 12 234 204 -93 -294 -158 152 277 93 -180 -222 -15 176 167 -23
5399 -23 -147 -106 54 152 81 -94 -168 -59 153 222 -1 -250 -222 75 298 173 -147 -297 -81 185 203 -9 -180
5422 -180 -135 41 129 75 -60 -142 -73 78 170 55 -167 -228 -31 240 232 -62 -303 -186 157 283 69 -208 -207 16
5446A6J55o4j66q2Q5J14O2n5j44r7J12J99R3j83k80j6L04K42j01l46j37K16K69
5469A96j0k28j44R9J72K8q4r8m4N2J26Q2p6k03j19J75K91L9k89k79R3L51J57k16
5493G1k84K9K39J25j18j63k8J25P7J7m7j08q8M6K23J20j43k96p5K85L09j02l57
5516a43j51K26K87l3k68j19J42J84mj31p4j0O5Q5Q6l9j85j56J24L11Q6k65l07
5539b89N8L54J57k27k92L7K90J17j60k02MJ63R9k2o2r8p1L9J75J61j08k90j10
5562b77K41L17o9l38j72K32L17o5k79j41J74K24j1j57j07K6O6P2Q1l0j63j74R5
5585a38K94J36k31l21L7L33J77k38l01M7L02J55j94k40J2J71J11l8o5n5o7OJ50
5608D3J63o8k74j47K25L10k1l40j80K24L09n3l11j58K06K57j2j81j20M0O5L6O9
$$ plain form
5446 16 171 107 -59 -141 -56 58 120 65 -79 -176 -64 135 228 45 -235 -251 53 295 194 -152 -289 -73 196
5469 196 186 -42 -186 -87 85 113 29 -69 -113 -61 65 147 71 -132 -251 -76 215 254 -35 -314 -221 130 287 71
5493 71 -213 -184 55 180 62 -101 -129 -4 73 90 43 -65 -153 -107 116 236 93 -203 -278 7 316 214 -143
5516 -143 -294 -68 219 186 -82 -201 -59 125 121 -10 -84 -94 -29 56 142 103 -82 -238 -114 197 283 18 -289
5539 -289 -231 123 280 53 -239 -202 88 205 45 -157 -153 10 109 87 25 -73 -144 -105 70 231 123 -167 -277
5562 -277 -36 281 212 -126 -298 -66 251 186 -93 -234 -60 164 153 -4 -111 -85 -19 53 134 104 -59 -233 -138
5585 -138 156 292 61 -260 -223 110 287 49 -252 -205 97 252 58 -182 -170 1 112 74 9 -46 -113 -107 43
5608 43 206 138 -136 -283 -58 252 231 -109 -289 -65 244 191 -120 -278 -72 185 173 -8 -128 -88 -23 13 82
5631H2K3j13j63L8K47J44j91l21L3L25K04k42l20M2L21J63k06k71K1K07J25n3
5653I5o7n0o3k2Q7J66j2k21j55J73K81jl22j98K33L36k9l38j83K11K71%k11j33
5677a52M7Q9L9L9M9r6j66j7K10J77j45k91ML35J87k33l40QL46K04j90k86j8K22
5701B2J28o5r3l7j5k0P3J28L4k07j55J18K74J0l11j80K22L48j3l65k22J71L14
5724A59L7k06j18N4R5nQK2m9j08l1J82J71j37k62k7K89K04j96l50mL60K35j88
5748A35l11o7K23J37n2q2JNl0J9R6K3j44j49J23K51L5k84k13J87L33K8l36k30
5772c02J52L22N8k18j46M1Q9K7l2M0j0p9l0J26J06r4k43k9K90K34j84l40o0L24
5796D2K36j32l11m6J98J68n2j31j6K8j4lP7L8j10r3O5K20L1k74k18J57L62O2k92
$$ plain form
5631 82 105 -8 -171 -133 114 258 67 -254 -221 104 308 66 -254 -212 109 272 66 -205 -184 23 148 95
5653 95 28 -22 -85 -107 -20 146 134 -87 -242 -69 212 211 -111 -309 -76 260 231 -107 -290 -79 192 192 -19 -152
5677 -152 -105 -16 23 62 111 15 -151 -168 42 219 74 -217 -213 122 309 76 -264 -256 90 294 104 -182 -200 22
5701 22 150 85 -8 -45 -60 -80 -7 121 155 -52 -207 -89 185 195 -116 -296 -74 274 261 -104 -326 -155 159
5724 159 196 -10 -128 -74 21 16 24 46 -3 -111 -142 40 211 74 -188 -215 74 278 82 -268 -272 88 323 135
5748 135 -176 -243 -20 117 65 -17 -16 -11 -41 -22 74 97 -47 -196 -73 178 213 -71 -284 -97 236 264 -72 -302
5772 -302 -150 172 230 12 -134 -93 -4 23 -9 31 21 -58 -88 38 144 50 -193 -222 68 302 118 -222 -282 42
5796 42 278 146 -165 -211 -13 155 103 -28 -44 -16 -30 -33 44 82 -28 -121 -56 164 195 -79 -297 -140 222 284 -8
5821hk68J10K95O9k03j37N3J25L3n4nom8l6R4J12p4k20k2K45K18j43l36r5K78
5846b3K76q4k80r2J69J52m5j35k1O3M1j8N4J2j11j01O9K07N1k35k06J07L35R9
5870B84k49k90Q5K73R4j64j66M0J52J5o8l7ooKQ1Q5p3j97n7K15K28j03l01r6K33
5896b6K58o1k65j01J58J56k6j50l5Q0L4Kqj0p2o9R0J91L9k14k08R5K75J12k15
5921C0k50N1K55J04j48j71K2J51N4o3q5%RM6M6N9p3j77k7J82J89n8k60j31J95
5946e0K38l4k41j05J52J68j2j60o3N7Q4J5nm9o8m2P2J54M1j71j88N6K43J24j64
5971E2k25K2K13J06j37j63NJ47R2n3r4l2J1M9O4M7o7j49l6J49J72l7k23j07J45
5996d9K10lk19j12J20J68Pj41j12N9R7P7k6p8o9l3P2J39L8j57j36K0J95J01j27
$$ plain form
5821 -8 -276 -166 129 198 -5 -142 -89 36 69 15 10 4 -44 -80 14 126 52 -168 -190 55 273 130 -206 -301 -23
5846 -23 253 169 -111 -203 -34 118 73 -62 -83 -20 21 3 57 69 -42 -143 -74 133 184 -51 -257 -150 185 284
5870 284 35 -255 -170 103 197 33 -133 -93 59 74 6 -31 -37 -43 -41 40 125 52 -145 -202 13 241 138 -163 -259 -26
5896 -26 232 171 -94 -195 -37 119 93 -57 -92 -12 22 24 16 6 -66 -135 -45 146 185 -29 -237 -142 133 245 30
5921 30 -220 -169 86 190 42 -129 -107 44 98 35 -50 -50 -41 5 51 110 37 -140 -167 15 204 146 -114 -245 -50
5946 -50 188 154 -87 -192 -40 128 116 -44 -107 -50 34 49 44 -5 -73 -115 -43 111 152 -19 -207 -151 92 216 52
5971 52 -173 -151 62 168 31 -132 -127 20 112 59 -35 -67 -56 -7 57 104 37 -112 -148 1 173 136 -87 -194 -49
5996 -49 161 158 -61 -173 -53 115 122 -19 -131 -72 25 102 76 -2 -71 -104 -32 107 145 -12 -148 -128 67 168 41
6021D1j97J1J85J08j01j77j4J41J17j9j21o9PP8R5J9r8j11k7J25J49l0j80j00
6045a68J20J79qj71j01R3J53M0j32j14%J22Q5j0q4r6j5Q0J15K3j21j34N2J60P2
6070A40j01j59LJ66Q8o7j68n3J29J32Nj16j09kR4J10Mr2j08OR9J12m2j20p6R5
6096c0J42nj39j23R5J46N3j09j41rJ10J14Lr7r3rR1J15k7j02r5N2J13N3q8j29
6122a09KJ46Q8n4j44o5Q7J31N6j10j12k7R7J11Kj04q7J8J05O9n6j14l4R7J06o
6148I3j30r1M8J31Q2o9j54m5Q7J28M1r9j20nJ13R2l9r4p2O5J20J5j01j00RJ23
6174B8R5m4j12j07O3J44P6r1j25o1J07J31nj22q8N7J06M3q0j06J2R6O9j1j03q2
6200a10K9J14R4n4j24q3O2J42N6r4j36mJ31Q7n7j32k7R6J01j7j01o1NJ09O9k2
$$ plain form
6021 41 -156 -145 40 148 47 -130 -144 -3 114 95 -26 -95 -88 -10 85 104 6 -105 -132 -7 142 112 -68 -168
6045 -168 -48 131 123 -48 -149 -56 97 137 5 -109 -109 13 98 88 4 -92 -107 -27 88 111 -10 -144 -92 68 140
6070 140 39 -120 -117 49 137 70 -98 -151 -22 110 115 -1 -110 -112 -18 92 96 4 -104 -98 1 113 71 -49 -125 -30
6096 -30 112 107 -32 -155 -60 86 139 30 -111 -120 -10 104 107 10 -83 -92 -1 114 87 -15 -110 -58 55 108 20 -109
6122 -109 -107 39 127 73 -71 -136 -49 82 138 28 -84 -111 -14 97 99 -5 -92 -74 31 100 44 -70 -104 -7 99 93
6148 93 -37 -128 -80 51 133 64 -90 -135 -48 80 121 22 -98 -103 10 102 63 -31 -103 -38 82 97 -4 -104 -95 28
6174 28 123 79 -33 -140 -77 67 143 52 -73 -134 -27 104 99 -23 -111 -54 52 95 15 -91 -79 17 86 75 -28 -110
6200 -110 -81 33 127 73 -51 -134 -72 70 126 32 -104 -108 23 110 53 -79 -106 -10 91 74 -27 -88 -83 26 95 73
6226G3r6q9K9J21R6n7j40o0Q9J36Nj42q5P3J33Oq8j14K1J17O3k2r1n6%P7R4j1
6254H2j14q8K9J51O5r7j56J4J41Q4p1j39j1J16J13l7j16n4K9P9M1Qo4q1k5J12
6280A1J01k9j35p7Q0J51J0j61r0Q9J43L6j40j13M2J22O2m3p4n5%N4P5L8r0j15
6306a08J9J32R0r8j54J1J55R0j05j53k5J47J29m6j35n5O9N4L0ll5o7l4O7J22j6
6332H1j29q6P9J63J6j80r8Q5J89J2j52j20N0J31O6o4o7k9J1K8N7M0o1j06MJ09
6358B9R7p4j76pJ70J34j07j91k3J58J26n2j31n2N5O9J8ql3m1l2L9J01mr7r6Q1
6385d7J54K0j84j22J10K05J9j61j42M8J51M0p1n6kK1J2L3K8k7q7k7J14R4p0j64
6411a11j7J71J47j04k08n1J79J34l7j57m4P6O4j9k4Kpl3K4P6J7j14j05Q3J61M0
$$ plain form
6226 73 -23 -112 -83 38 134 77 -63 -123 -34 102 107 -35 -120 -47 86 92 4 -110 -89 28 91 69 -22 -78 -78 -1 93 82
6254 82 -32 -120 -91 60 125 28 -128 -114 27 111 40 -99 -110 6 119 82 -34 -88 -59 20 61 69 5 -76 -101 11
6280 11 112 83 -52 -129 -49 102 112 -49 -139 -50 93 129 -11 -124 -82 40 102 59 -15 -70 -70 -16 59 97 7 -108
6306 -108 -89 43 133 35 -119 -108 47 137 32 -121 -146 1 130 84 -51 -106 -37 17 47 44 9 -58 -92 -25 97 81
6332 81 -48 -134 -55 108 124 -56 -154 -69 120 132 -20 -140 -90 41 107 43 -24 -53 -42 -14 43 83 22 -84 -80 29
6358 29 126 52 -124 -131 39 173 66 -125 -148 10 136 84 -47 -99 -44 25 43 35 2 -39 -71 -32 69 65 -32 -128 -47
6385 -47 107 127 -57 -179 -69 136 155 -6 -148 -100 51 91 20 -36 -38 -17 -5 28 56 29 -58 -85 29 123 53 -111
6411 -111 -128 43 190 86 -122 -173 6 140 103 -54 -98 -22 42 23 -1 1 -6 -39 -15 61 78 -36 -141 -58 103 143
6437A43j71j53Q2K12M1j54j62N6J51O1r5n1K1J6pjK9j0o0j9R3J06p7j71l7J69
6463A2J62p4k10o3J79J42n7j52m4R8P0l0l7lKk5MO0L0q8r8N8J71N8j69j95P3K27
6491A01O6j59j50M6J53L9r0r1L3O4nj8K8Mm6m0P6R6n3j63m1J75J58n7k20q7J44
6518c7J62k4j65n6J16P2k2q2JL1mMM3L7q6r1M1J62M2j48j70N4K18Q1j50j63L3
6545a01J61M4r7q3L2Q6Ll9Kk4m4j6P8R3l1j51o8J40J57m9k05o3J43J66l1j55p5
6572a27J00J14m9r7jN9J0qL2Qo9q7K8J72N8j32j63L6J83R8j35j65L2J66O1r3j16
6599h5K6R5K4m6k1nj6j4N9Q9l1j54p8J21J52pj82q3J26J55l1j64o2J04J20l7q5
6626c0m9O1K1J4J1Jm5p4K5J30P8j23j61J9J71R7j18j48K5J57O3j01j26K3J06M1
$$ plain form
6437 143 -28 -181 -99 113 154 0 -162 -106 45 106 11 -40 -19 -3 -10 -11 18 8 -52 -71 22 128 51 -120 -157 12
6463 12 174 100 -110 -173 6 148 91 -61 -105 -7 63 33 -4 -7 -5 -30 -26 34 64 -24 -122 -64 107 165 -4 -199 -126 101
6491 101 167 8 -142 -96 57 96 6 -85 -52 12 7 -11 17 21 -25 -65 11 107 54 -109 -150 25 183 126 -94 -181 -37
6518 -37 125 101 -64 -120 -4 68 46 -36 -35 -4 -8 -4 39 76 -10 -101 -60 102 144 -4 -174 -120 98 179 29 -134 -101
6545 -101 60 104 7 -76 -44 42 45 6 8 -16 -60 -76 2 95 64 -87 -155 -15 142 93 -112 -175 -32 134 103 -52 -127
6572 -127 -27 87 38 -59 -60 -1 9 1 33 41 -28 -115 -87 85 143 11 -152 -116 67 165 30 -135 -103 63 124 31 -85
6599 -85 -59 36 60 14 -7 -12 -28 -42 17 106 75 -79 -157 -36 116 109 -73 -156 -30 125 94 -70 -132 -28 92 55 -30
6626 -30 -79 -18 3 17 28 29 -16 -90 -65 65 143 20 -141 -122 49 146 28 -120 -95 62 125 24 -102 -79 27 68
6652F8m2m2Kk0j1M9P2k2j13p0R9J51rj64j06J22J57k4j55o8J09J20j3j25m6M6
6678c5M6J1RJn1o9K3J06O6q8j34K3J52O2r0j58J7J59Q0j06j24K5J03N3k9o2k4
6705c4KPM3O2rj10n8O5J33kj54r2J24J31qj39r4J03J19mr2p1K1O6K6Kj4m2n0J7
6735e2Q3N5o1j31MJ44O7p7j61K9J54P7q3j46j0J07O8k2n5l7OJ8M0L2j3q0l4P2
6763fP8lj14o4R4J27k2j28p9N8J47J1j06n7JN6M6jj6l9l8K7O3L2n3r6J4J15O4
6792A11r2j28J7J23P9p5j24j6Q4Q7j5o0l5J6NM4J4k9m3l8P4Q1pj32n7Q8J23j9
6820G6j26o9N6J24L4p9r0L0M4M0jl4k9j3L0N2Ln7n6J4J04M6q0j25J2J17Q4n4j18
6849f5k0O6P5J5q3m8J5M0L8jm8m4MO6M7j5r3m4P5J10%j23p2M9J09M2p2r3PP0L2
$$ plain form
6652 68 26 -16 -14 -34 -45 4 76 54 -59 -129 -30 121 112 -52 -158 -36 121 97 -58 -126 -17 103 90 -35 -81 -35
6678 -35 11 22 31 32 -19 -88 -65 41 107 19 -115 -92 60 122 32 -126 -109 50 130 24 -100 -75 28 81 52 -10 -34
6705 -34 -32 -25 18 80 71 -39 -97 -32 101 99 -55 -147 -23 108 100 -39 -133 -30 89 85 -7 -78 -57 9 35 37 23 -19 -69 -52
6735 -52 31 86 25 -106 -102 42 109 32 -129 -100 54 131 48 -98 -108 -1 67 45 -10 -47 -41 -23 17 49 36 -44 -78 -6
6763 -6 72 69 -45 -109 -15 112 90 -38 -117 -59 88 99 -7 -64 -63 -7 39 38 22 -17 -55 -28 35 67 14 -82 -68 47 111
6792 111 19 -109 -92 31 110 35 -89 -105 -21 66 51 -9 -44 -28 -23 21 35 6 -37 -75 -1 80 73 -59 -116 -28 95 76
6820 76 -50 -119 -63 61 95 16 -74 -44 0 40 39 5 -24 -37 -7 45 48 -9 -65 -51 53 99 19 -106 -94 23 107 53 -65
6849 -65 -85 -19 56 71 -12 -60 -45 -5 33 32 -16 -60 -56 10 57 42 -51 -95 -20 90 90 -33 -105 -56 53 95 23 -70 -63 7 39
6880C9jn9k3J0M4L4%n8n5L7Q2M7q9r9J2J08P3m4j10k3M7Q8Lo5m5PN0L7j4m9l7
6911e3K5O3N2o0r3j4P4R1j2r4q3L8J07K9m6o5j4O0M9j5n0l6J2P5J3l6o3l0N9P9
6941F2J0p3o7%R5P5m2r0m3M2Q4J7o1p7J5O7M5k9o3l3M2P4J8n2q3j3Q8O3rp8o4
6972h0K9Q0L9m6n9k4M8O9j1o6m8K5R2K7o3o7k7Q5O9j1p1n1QO7M3pp6m0M5N4L1
7003F4m8p9J8O5O7l8q0m7M6R8J4p1q3J2Q1M4j0q0l2L2M7K4k4n5l0O1N9lp5o8L9
7034e2J01M7p8j01LQ3O6j8o9m3J9O4K7l3m2k7L1M3L8m9o7j0Q4P2m3j04m8P9R7
7063G0Mq2o2K0P2M2k9n8l2M0M0K2j7p1j1L8O0J3p8p8L6J05M6p0j07lR4P7k2j02
7093d3k1M6L1L1l8k4k1J1N8J9l6o9j7Q8P9k3j26n0P6J09Nj06o7N1Q1J1l2o6QK8
$$ plain form
6880 39 38 -21 -44 -34 10 44 44 -14 -69 -32 50 97 8 -91 -79 29 102 58 -52 -75 -28 60 63 -2 -47 -40 10 47 33 -16 -53
6911 -53 -28 35 87 27 -66 -80 -6 85 73 -21 -104 -66 41 70 24 -41 -55 5 54 39 -11 -47 -35 40 53 17 -46 -76 -17 62
6941 62 72 -1 -68 -68 27 102 60 -30 -73 -31 53 70 9 -68 -53 14 59 30 -33 -66 -24 50 68 16 -67 -80 8 71 62 -16 -80
6972 -80 -51 29 68 22 -37 -61 -13 56 45 -21 -69 -44 48 75 12 -55 -82 3 72 61 -10 -61 -53 14 57 50 -26 -66 -21 33 64
7003 64 16 -63 -45 20 87 49 -31 -78 -32 66 80 9 -74 -62 19 63 53 -27 -59 -27 20 44 20 -35 -65 -4 55 52 -23 -91 -52
7034 -52 49 96 18 -83 -80 3 69 51 -18 -61 -42 22 49 16 -26 -53 -22 21 59 10 -57 -67 17 89 46 -58 -106 -27 70
7063 70 74 -8 -70 -50 22 64 35 -23 -55 -15 25 47 30 -41 -52 -14 46 59 -19 -97 -61 44 90 20 -87 -90 4 81 59 -43
7093 -43 -64 -18 13 44 6 -18 -39 -28 30 49 13 -56 -73 15 94 71 -55 -105 -29 80 85 -21 -88 -37 44 55 23 -43 -35 -7
7123gK6J7l1k9m4N5P3L5j04r5L6J11P0p6j14rJ00P3m7q0k2N5M1k2j7j6k1K7M6
7152C1K1l9p6k4R3Q2k9j24o4Q7J18Pj14o6O2Q3J4n5n1J5L2J6Oj3l3l6K4P7L9q4
7182aj08M2J12P3r2j13mJ21P0n9q9k5Q4M6j4n6j0LK3L0J0k9p5k8Q9R8k4j27o9
7211a22Q0J38lj22p7N0J09K0r1m9L3N6J5k3pl0l3L3O8M4q5j00J0J31P6p7j41%
7239i7J22P8p5r6LQ0N9n4m6nJ1J1M7rmp2l7O1J15nj26q0Q7J30qj19p8O9J10mr7
7270b9l1L5O3Mk1l9ok4L3N5M3p7r6NJ07Q6p4j17nJ27P4o9j18oR8O4n3o1j2L3K5
7301A4J0Rj2o2l5P1R1Qj12q5O1J28Rj23q4P8J19Oj10p9N7O9Qk2k0rl3J9O6K6m5
7332A8r2j9J32O9o9j31jJ22Q5q1j27J4R9P7n8o6k7K5K9MJ5%l3m6L2R3jr3q1O6
$$ plain form
7123 -7 19 36 5 -24 -68 -13 60 95 -9 -104 -68 43 113 37 -77 -86 14 87 40 -40 -62 -7 34 12 -5 -21 -42 -15 31
7152 31 52 13 -63 -87 6 88 59 -65 -129 -42 76 83 -31 -97 -35 48 62 7 -44 -29 3 19 25 12 -21 -57 -33 44 83 -1
7182 -1 -109 -67 45 118 26 -87 -91 30 100 41 -48 -73 11 57 43 -13 -23 -20 3 33 43 14 -61 -89 0 98 74 -53 -122
7211 -122 -42 96 93 -29 -106 -56 53 73 -18 -67 -34 22 37 14 7 -23 -56 -23 45 89 4 -96 -86 45 121 44 -97 -97
7239 -97 25 103 28 -68 -65 15 74 20 -26 -31 -20 -9 38 29 25 -47 -84 -23 92 87 -39 -119 -32 98 90 -29 -107 -38 72 68 -29
7270 -29 -60 -25 38 42 21 -18 -24 -48 -15 40 83 6 -90 -85 22 108 34 -83 -88 39 113 44 -74 -80 18 82 29 -32 -44 -11 14
7301 14 24 33 21 -41 -76 -5 86 94 -18 -103 -42 86 95 -28 -112 -34 85 91 -19 -98 -41 28 36 14 -6 -15 -48 -29 37 63 18
7332 18 -74 -93 39 108 39 -92 -93 29 114 33 -94 -80 19 96 38 -28 -55 -30 -1 3 18 18 -15 -61 -29 64 63 -30 -111 -45
7362d5J31J1j24p7N5J38mj04n9L3Q7K0l5l6jk4J0M9L7l5q7nQ9P0n6j45J2J21Q9
7391A15o7j26j3J03P4n0p5k3M7K9LJ6j0n0l4L1Q7Rq3q5P0J21kj35q5P3J44Qr8
7420fp7L9P4K2l7l8JRQM2K2l6q0rR0Q2p3j24J8J07R4r0j09n2J24P9j8q3m4M6M3
7451B4j5qJ4n1j5L5O6Pp2q5P1J01Oj02q3N0J27M5j10j00M0Q5K3l2l9MKOL5Pk8
7482Hm8mO9O9n9j15pJ10R0n8j32k8J04R7m0q8l2M6L7Pj2j7jj7J9L9Ko4o5N0J10
7513G0J7j08r8M9J28L3q7r5K3R8K7l6n6kK8J0J7J3k8m0mO8N7n6j03j8J14Q7n1
7542E7j32j5Q2P5j8p1k4K2M6J5m0j6jkJ8M3Jo6m4N1R3K5j18q8M7J03N2q9q5J9
7572f0O8N2m6m7JJ6K3K1j3k8l7K3N1L1l3q5j0Q8P7k9j19l5P5Q9k2q5k6M0N0J5
$$ plain form
7362 -45 86 97 -27 -104 -49 89 85 -19 -78 -45 42 62 27 -9 -10 -34 -24 25 62 27 -60 -65 24 94 38 -107 -95 26 115
7391 115 48 -78 -91 12 86 36 -39 -62 -15 14 17 33 23 -27 -61 -30 57 66 -17 -102 -32 89 87 -48 -133 -60 84 92 -6
7420 -6 -83 -44 30 52 15 -23 -22 -13 -5 37 59 23 -57 -66 24 106 33 -91 -73 34 128 38 -71 -123 1 80 62 -21 -65 -19 24
7451 24 9 1 15 -36 -51 -16 50 57 -15 -100 -29 72 78 -24 -107 -57 70 115 5 -95 -55 30 53 21 -18 -14 -12 -6 29 36 8
7482 8 -40 -44 25 94 35 -80 -87 23 113 55 -77 -105 -1 96 56 -32 -64 -18 19 26 14 -3 -4 -21 -2 37 39 -25 -90 -40 70
7513 70 87 -21 -119 -70 58 91 4 -91 -68 30 57 21 -35 -37 -9 1 18 31 3 -37 -41 27 84 28 -75 -93 21 108 57
7542 57 -75 -90 -8 67 49 -22 -46 -24 22 37 -3 -19 -20 -22 -4 39 40 -26 -70 -19 74 99 -19 -107 -60 43 95 6 -79 -60
7572 -60 8 60 14 -33 -32 -16 7 28 15 -13 -50 -27 24 55 22 -63 -73 15 92 63 -56 -91 -16 73 51 -34 -60 -20 30 45
7602D5k8l8nJ6L5J7j3o0k5M5Q4Mr5o7K6J13K5p6p1J2Q7K3l1n9LK3L6J3j0n5j3
7633c9J8N7L5o3p3JP8O7k7j02l3O6Q0j0p1l7L0M1J5k9k7j0K2M9J2k7o4j4M8P9
7663G2oq2p2M4R0L7o9p5J5O8M5m4m6k5L9M5jl6l6j1L1P1Pn6o0j6Q8N4l0q2l6N6
7695b1P3pp7k2K4N4K3l7m9j9M3M8J4m4n4JM7O3%p9o0M1O8K9m4o7kP0N3m0o2k8
7727f1M8N9J5m8o0rM7O7J1p8n6J4O4N7m0o7k3M0O2Ko0n1L3P9J0m4o8j3N3N6J4
7758E3o1n2NN4N9j3o1m1K1O7L2m7o1jN6M6k7o0l6L5P8J9n2o6j6O1O9mn9n9J9P1
7790B9L3l0o3k4N7N2j8n5m5J8P7M2m4p8l2O4P4J2o3p1K9N5L1k2o0k0L4L7J4l4
7820an1J2N0M3k3o4n3N3O6M0n1p6k3P9O2nq3m3L1O3J5m8l8LN0M0rm8n3PP7O3l6
$$ plain form
7602 45 17 -21 -26 -10 25 42 29 -31 -56 -11 73 77 -18 -85 -59 54 79 3 -68 -56 31 54 23 -36 -33 -10 26 39 29 -26 -39
7633 -39 -21 36 71 8 -65 -64 14 81 54 -48 -81 -15 65 55 -16 -53 -23 18 33 4 -23 -33 -11 38 50 23 -41 -55 -7 72
7663 72 66 -16 -88 -44 46 83 14 -61 -46 22 67 23 -23 -48 -9 36 35 -1 -37 -48 -17 54 61 5 -55 -71 17 71 41 -41 -77 -21
7695 -21 52 45 -32 -54 -30 24 47 10 -39 -58 -15 33 47 3 -51 -50 -3 60 60 -19 -79 -38 30 59 15 -52 -54 16 69 29 -33 -61
7727 -61 -13 46 61 13 -47 -56 -9 58 69 -9 -65 -51 13 70 30 -37 -60 -20 42 44 -16 -67 -34 45 55 11 -57 -70 -17 39 53
7758 53 -8 -60 -55 -1 58 45 -16 -57 -36 31 63 16 -45 -46 10 56 29 -31 -67 -32 46 65 13 -53 -69 -8 61 57 -2 -61 -42 29
7790 29 62 32 -31 -55 2 54 36 -19 -64 -46 31 73 29 -49 -81 -17 57 69 6 -65 -36 19 50 28 -32 -52 -18 19 33 -1
7820 -1 -52 -40 10 53 30 -34 -87 -34 32 72 21 -55 -78 1 63 58 -25 -68 -37 26 41 -7 -45 -42 8 48 39 -9 -62 -55 22 85 49
7853D9q9m7O7Q8Op5o6J7P1M7n0o4%M2N4qm7m8J7M4N4j9o7n2K8R1L5n4q4j3P4O4
7885F5k0q2k9N4O2jm5n5J9M9K3nm8m2KP1N9j4q1o7N5J06Rr0o5K5R3K6n8o3j0O6
7917IM6k8m0l2PL8M5Ro1n6PQ1O3m9q5k5P7O2j6q8l6O1O3%o9m2K4M9L4rm3m7j8
7950f9O8O5pp5p2N1Q6K9r3o9L6R5M8q3q4K1P3M1j3n3l0RM8K1K2o1o0J1O4O2m2
7981C9r9k3J00O9l6j00l2Q3O7k5o8l3J6N0K4Jl5k4l2N2O2Kp7o1M3R3K7p7r2M0
8011d6J01L6p9q6J9Q6K3j6n5k0%L9L3J6l3p2oP3P6m1j02j8Q2Q4m3j05l1Q7Q6l7
8041E1p6m6L6N6K1j8j6l8rJ5O5On7p0K7R7M6j01q1K9J15L6q6p9J5R0K6k6o3oJ5
8072b6J5L5K3k9n0k9O7O4k6r6l7R7R7m7j05m6Q5Q8j1q4n0L8N1J3j1k7j1j4K5L5
$$ plain form
7853 49 -40 -87 -20 68 74 -1 -67 -50 21 68 18 -46 -46 -4 50 42 -5 -53 -36 8 62 43 -24 -76 -48 43 78 24 -60 -73 1 65
7885 65 45 -37 -66 -12 50 49 4 -51 -32 17 40 35 -13 -55 -53 18 77 63 -18 -85 -30 76 85 -5 -70 -45 48 74 16 -47 -57 9
7917 9 55 27 -13 -45 -38 0 45 54 -7 -63 -56 25 88 39 -46 -71 6 68 52 -36 -72 -11 52 52 -17 -59 -35 14 48 39 -4 -51 -69
7950 -69 -1 64 57 -18 -90 -39 47 76 -17 -86 -50 45 93 10 -74 -53 20 61 48 -5 -35 -26 22 43 65 4 -56 -45 19 81 39
7981 39 -60 -83 17 86 50 -50 -82 1 68 43 -25 -58 -42 8 32 33 -2 -26 -58 -6 56 58 -19 -80 -37 56 83 6 -86 -46
8011 -46 55 91 12 -74 -55 31 54 38 -17 -37 -37 2 35 51 18 -54 -60 13 89 48 -54 -72 10 94 51 -54 -85 2 88 51
8041 51 -25 -71 -35 21 42 24 8 -30 -39 -24 41 47 -10 -80 -53 44 90 -11 -92 -63 52 88 2 -77 -62 28 54 28 -35 -41 -26
8072 -26 -11 24 47 18 -32 -61 6 70 44 -52 -89 8 105 58 -47 -93 -8 80 69 -15 -65 -27 24 37 26 -1 -12 -26 -1 34
8102C4K1o0n2J8R0K8q6p9K7J15M1q9r3J1Q4M4l8n5J0RJ9J2J5j1m6j0M8N3k1q9
8132e0k8R8Q0m1j24k6P2J03j4p8n2L5N8mj8j5OkOL4kl8o8L0R4L5r3r4M6R9N6p4
8164C1j01PQ6L9j8o1nJ2K2rK3k8l0LM3M6k8r1l9R2Q7nj32l5P0J00p
$$ plain form
8102 34 55 -5 -57 -39 51 79 -7 -86 -59 56 97 8 -85 -74 10 54 16 -39 -29 -20 -1 11 26 15 -31 -41 7 60 39 -50
8132 -50 -78 20 100 59 -65 -91 -19 84 70 -8 -60 -25 33 29 11 -4 2 0 6 40 38 0 -68 -38 56 91 -2 -96 -50 49 105 31
8164 31 -70 -63 23 62 44 -17 -22 -10 12 3 26 -2 -32 -29 14 60 32 -59 -98 -6 81 76 -56 -91 -21 79 72
8191G2
$$ Imaginary data points
##PAGE= N=2
##DATA TABLE= (X++(I..I)), XYDATA
0@%%%%%%%%%%%%qJ6j6J6j6J7k5L2l2M0m8N5o3P2q1R0j05J21j38J54j70J88k11
35a12K35k61K92l25L62l99M40m89N40n98O62p34Q19r15J023j151J304j487J713
54I19k005K395k938L766n201Q349k6702K2759O4939l3082o0156j7626M5312K9594
68C0323j5662l2191J1J6797Q531k664N540j01j9749k0814J8588M1998N881n0380
82a3892l9047L2768O7735R028o4667n3678K6072O3894J7189m0953l3183J4143
94a4591K9131Q59j8971p687N477J039J092J6011J4848j9092m0797n811M8177M1410
108E1095k6685o3364j2661N7801N0020k4181o1728j6631M1562L5901j2540l0748
120a2159l890J8328Q506o314l474q72j1784j0740J8603L7446M051m7751m2229
$$ plain form
0 0 0 0 0 0 0 0 0 0 0 0 0 0 -8 8 -8 8 -8 9 -16 16 -16 24 -24 31 -32 40 -41 49 -56 65 -73 81 -89 99 -112
35 -112 123 -138 154 -171 191 -208 232 -257 283 -315 347 -387 432 -483 540 -611 693 -794 919
54 919 -1086 1309 -1629 2137 -3064 5285 -21417 1342 66281 33199 -26957 -44583 729 30323
68 30323 14661 -17530 -17519 -722 7809 5145 10685 10584 -9165 -29979 -11391 30607 36488 -13892
82 -13892 -52939 -20171 47564 56592 -8075 -61753 -35681 28213 45402 4449 -28734 -14591
94 -14591 14540 15399 -3572 -11259 -5782 -4743 -3651 12360 27208 8116 -32681 -38492 9685 51095
108 51095 24410 -38954 -51615 6186 56206 32025 -29703 -46334 -4772 31129 18589 -12159
120 -12159 -16049 2279 10785 4471 997 125 -11659 -22399 -3796 33650 37701 -10050 -52279
133e2279K3845O2503J6692n2102m8261K0943N7596J4723m2052l6259J3557L4197
145A3103P234j8594j1726M248M133J251R618Q999j6094l2607k661M4248L9104
158E0256k2480n9730j8150M7395M6843j6430n2124j3966L8988L3781j4401l5493
170a5511q769J9914J5868j605n659l810r631q076J4093K9092L140l8899l5196
183d5049K0138N4923J7515m3911m5291J3466M9059J4995l5749l2558J3640L5614
195A6792R696k1161j9428j31Q205P413J0266O598j4218k7806m117L5059L2952
208D0120j7336n0160j6331M1077M2992j2680m7828j5987L4117L3170j1551l5295
220a5692j1271K0850K1425J284j0218j0099r954m166J4680K6016M112l1721l0813
$$ plain form
133 -52279 -28434 34069 50761 -1341 -49602 -28659 28937 43660 1608 -34651 -21094 13103
145 13103 20337 1743 -9983 -5735 -1602 -351 9267 18266 2172 -30435 -33096 11152 50256
158 50256 27776 -31954 -50104 -2709 44134 27704 -24420 -38386 602 34383 19982 -15511
170 -15511 -24280 -4366 11502 9897 4238 428 -9203 -17279 -3186 25906 29046 -9853 -45049
183 -45049 -24911 30012 47527 3616 -41675 -28209 20850 35845 96 -32462 -18822 16792
195 16792 26488 5327 -14101 -14232 -6027 1386 11652 18250 4032 -23774 -27891 7168 40120
208 40120 22784 -27376 -43707 -2630 40362 27682 -20146 -36133 -2016 31154 19603 -15692
220 -15692 -26963 -6113 15312 16596 6378 -3721 -13675 -17841 -3161 22855 26967 -4754 -35567
233c5567J4025M4589J5403l6258l8816J1590M4492J5629l2052l3117Q959L4138
245A3015J3497j8563k2229l139J0645J1680R306J937j4504k3040l093K8383K7821
258C1716j1649l9356j4481L1565L4791j0190m0780j4992L0017L2846o826l3516
270a0855j6130J6237K3385N716j0349j3222r359l63J4401K0453J796k5904k4659
283b8853J0865L5652J3079k8882l2038R453L8359J4675k8455l2707N073L3019
295I240J8363j4295k4537q246R912J4701R697q57j4260j8003n10K3174K0959j0350
309A4988l1394j0826K6283K8635q849l5276j4060K6014L1440l020l0973j9563
321b6601J1707K4401J0306q989j5667j0042J983J4080J5413r40k0359j6996R959
$$ plain form
233 -35567 -21542 23047 38450 2192 -36624 -25034 19458 35087 3035 -30082 -21123 13015
245 13015 26512 7949 -14280 -17419 -6774 4906 14212 16149 1645 -21395 -24488 3895 31716
258 31716 20067 -19289 -33770 -2205 32586 22396 -18384 -33376 -3359 29487 22661 -10855
270 -10855 -26985 -10748 12637 18353 8004 -5218 -14577 -14940 -539 19914 21710 -4194 -28853
283 -28853 -17988 17664 30743 1861 -30177 -20724 17635 32310 3855 -28852 -23779 9240
295 9240 27603 13308 -11229 -19475 -9563 5138 14835 13978 -282 -18285 -18795 4379 25338 14988
309 14988 -16406 -27232 -949 27686 18837 -16439 -30499 -4485 26955 23935 -7038 -26601
321 -26601 -14894 9507 19813 10824 -4843 -14885 -12902 1178 16591 15651 -4708 -21704 -11745
334a1745K6835Q214k3677k5030Q385L2198J3522k3390l0142P22K8623K0740q853
347A6402k3942j2333P940J6697J0556l155j4524j3353K829J8763J3508j0571k3686
360a4869n660K2387K2336q494l0291j3200K1492K9369J311k6646k1812O266K3439
373E628J4096o888j7520j1010M307J5121J1460m851j7563j0142J1515K0811L069
386A8033k1200j9565Q535K7864J2482j9145k7636l122K3733K1885l527k1907j5280
399a8850N406J7612J1310n094j5362r612O787J6351O836j2405j7919n10J9937
412D487J6700q510k5178j1594J6633K5525M728k0613k1590Q60K0189J6252l965
425A3924j7790j1797N895J6126Q244q985j6089m022J4009J6213j911j9639j4707
$$ plain form
334 -11745 15090 23304 -373 -25403 -17018 15180 28702 5312 -24830 -24108 4515 25255 16402
347 16402 -7540 -19873 -11933 4764 15320 12165 -2359 -15712 -12883 5880 19388 8817 -14869
360 -14869 -20529 1858 24194 15700 -14591 -27791 -6299 23070 24381 -2265 -24077 -17811 5628
373 5628 19724 12836 -4684 -15694 -11387 3734 15194 10343 -7220 -17362 -5847 14964 18033
386 18033 -3167 -22732 -14197 13667 26149 7004 -20632 -23754 -21 21864 18337 -3570 -18850
399 -18850 -13444 4168 15478 10384 -4978 -14590 -7803 8548 15384 2979 -14940 -15450 4487
412 4487 21187 12677 -12501 -24095 -7462 18063 22791 2178 -19412 -18552 1637 17889 13924
425 13924 -3866 -15663 -9768 6358 14602 5617 -10472 -14494 -485 15728 13817 -5822 -20529
438b0529Q823K3418J1000j4667k3881o091J7990K1347J386j8730j7159K767J8132
451C806J2386o825j7266p237J1288J6365J568j5845j4960M133J9485J2772r083
464A0587k1425j0057J2619K1570P003j4932k0201l343J6615J7356j452j7810j2676
477a6146P344J7976O339j3128j6504N16J7287J3677o083j9054j0756R225J9122
490I815Q782j0596j8849p447J1926J8590M926j4453j7238K95J7496J3128p815
503H560j8941n940J5003J7303k075j9046j3207P802J9237R306r669j7484p632
516a6783R142J6562P587r541j7246o120J2806J7338N59j7665j3783Q429K0442
529A1727N905j7012j8570L367K0990J3071r425j9527p878J0174J5814O190p815
$$ plain form
438 -20529 -11706 11712 22712 8045 -15836 -21927 -3937 17410 18796 66 -17093 -14326 3806
451 3806 16192 9367 -7899 -15136 -3848 12517 14085 -1760 -16720 -12587 6898 19670 10587
464 10587 -10838 -20895 -8276 13294 20297 5365 -14836 -18179 -1564 15792 14340 -3470 -16146
477 -16146 -8802 9174 15513 2385 -14119 -13603 3684 17361 11278 -7776 -18532 -9307 9815
490 9815 18597 8001 -10848 -18295 -6369 12221 17147 2694 -14544 -14249 3247 16375 8560
503 8560 -10381 -16321 -1318 15985 13910 -5136 -18343 -10541 8696 18002 8333 -9151 -16783
516 -16783 -7641 8921 16508 6967 -10279 -16399 -3593 13745 14304 -3361 -17144 -8715 11727
529 11727 17632 620 -17950 -14583 6407 19478 10053 -9474 -17352 -7178 8636 14826 7011
542G011j3980p299P113J5338O963j0867j6880j485J7269J4195q563k1360o035
555a8580J8188J9477m078k2141j2852J0447J9355O507j0347j3906m643O559J1245
568E231O624m835j3139p414Q897J6105K315j6678j4626Q379K2183O613j9031k0708
582b0084M166K3267J3213j1175j9574n581J0813J2572L117n903q954n682L263
595f542J1301P595p506j5691k967J6638J5469q344k3543p531K0049K2348m172
608A7104k4627j3740J1970J9936M545j1478j1296j343N508O625M410j897r311
621c594p496O109J5083L666j6187j6087P824K4198Q497k0202k3324L762K5120
634G369J4046j2281j9818l630J1780R916l19n158m382k922P70P139O992m801j4111
$$ plain form
542 7011 -6969 -14268 -7155 8183 15146 4279 -12601 -14086 3183 17378 8815 -12545 -18580
555 -18580 -392 19085 15007 -7134 -19986 -9539 9816 16323 5976 -7930 -12573 -6014 5231
568 5231 11855 7020 -6119 -13533 -4636 11469 13784 -2894 -17520 -9141 13042 19655 624 -20084
582 -20084 -15918 7349 20562 9387 -10187 -15768 -4955 7617 10734 4831 -4123 -9805 -6542
595 -6542 4759 12354 4848 -10843 -13810 2828 18297 9953 -13590 -21121 -1072 21276 17104
608 17104 -7523 -21263 -9293 10643 15188 3710 -7586 -8929 -3421 3204 7614 5717 -3594
621 -3594 -11090 -4981 10102 13768 -2419 -18506 -10682 13516 22013 1811 -21513 -17751 7369
634 7369 21415 9134 -10684 -14314 -2534 7382 7063 1905 -2477 -5399 -4629 2510 9502 4701 -9410
649i410m180J5469J6564o928k4436r642J9731K4075k994k5197j4404J2410J9935
662A0993L016j2409r253J805N387K788J442k45n434o271L966J3329M433j5289
676a742j7303O334K5247J1097j9526k5248K137K5542J4816j2861k0227k057J3576
689b15Q823l529o113j437M5k01L870N818k872j2505m892J4624J7694n570k5584
704a2044j2406J8907K6066r48k5127j5024J2567J9744J070j4280q076N373P028
717B850L91j620P1k715n293J951J1583N498j3263j7397M483K4821J2946j8042
731F264k6278q5K4635J5502j1902j9355p19J4589P476p007q150M31L568R63K049
746A981M363j983j1390o125J2366J7691l080k3925j3402J7248K6268M03k4960
$$ plain form
649 -9410 -13590 1879 18443 11515 -12921 -22563 -2832 21243 18249 -6948 -21352 -8942 10993
662 10993 14009 1600 -7653 -5848 -461 2327 3769 3524 -1910 -8181 -4215 9114 13547 -1742
676 -1742 -19045 -12711 12536 23633 4107 -21141 -19004 6538 21354 8493 -11734 -13791 -215
689 -215 8608 5079 -1034 -2471 -2426 -2627 1243 7061 4189 -8316 -13208 1416 19110 13540 -12044
704 -12044 -24450 -5543 20523 19575 -5552 -20576 -8009 11735 12805 -1475 -9551 -4178 2850
717 2850 3241 1621 1692 -1023 -6316 -4365 7218 12716 -547 -17944 -13461 11360 24306 6264
731 6264 -20014 -20099 4536 20038 8136 -11219 -11938 2651 10127 3120 -5030 -4599 -1031 -68 1981
746 1981 6344 4361 -7029 -13154 -788 16903 13823 -10102 -23504 -6256 20012 20415 -4545
759d545j6125J1924J9997Q61j5043p341Q134Q871j494n569j682r27l055K212J1245
774G463O662j1870j8620J076K2910J4552j5293k5358q44K4353J5946j2275k0683
787a1981j114J5617P993q234r159K022O579J597o20J668j907j0037o320J1256
801b640J8812N19k1900j5980J2473K4155K192k2259j5077J2173K0713J038j6741
814b522r508P940J0322r58o596j771J295j045J116Q352N687j0329j8006r41K1491
829D527J7012j0877k4104l998K0542J4779j1646k0261k85J8217J0670q660j2556
842f640n98O787K720q66J436l1p264o142Q377J6548J257k0365j6692J0449K4258
857A3234N097j9733j5288J0341J9370K7j8308j0496R759J4168J346p720m305l0
$$ plain form
759 -4545 -20670 -8746 11251 12112 -2931 -10272 -2138 6733 5239 -330 -2012 -2939 -5994 -3782 7463
774 7463 14125 2255 -16365 -15289 7621 22173 6880 -18478 -19322 5031 20977 8702 -11981
787 -11981 -13095 2522 10515 2281 -6878 -4856 1723 3320 2700 4368 2461 -7576 -13896 -2640
801 -2640 16172 16691 -5209 -21189 -8716 15439 17631 -4628 -19705 -7532 13181 14219 -2522
814 -2522 -12030 -4090 6232 5274 -1322 -3093 -1798 -2843 -1727 6625 12312 1983 -16023 -16964 4527
829 4527 21539 10662 -13442 -17440 3102 17881 6235 -14026 -14311 3906 14576 5916 -6640
842 -6640 -7238 -451 2269 1403 2839 2808 -4456 -10598 -2221 14327 15584 -4781 -21473 -11024 13234
857 13234 18331 -1402 -16690 -6349 13021 13048 -5260 -15756 -5997 8171 9517 1797 -2508 -2538
871b538j505j68P072P214o088j5092k471J7567J5216r612k2954n007J9309J5890
885A6833r030j9057j225J7076J0300r591j4522j536Q826N950M45M18r09p253p472
900a0747N087J4577L995j4917j4124Q167K0814M153j9137j5880R074K0096K807
913A3965j6526j1347Q306J4276J693r209o468J15J029J618O693O717m968j4401
927h507m987J3477J4132o269j8882l925J8063J4948r480k0709l591J6744J2932
940A3946o680j4043k611Q330O013o97j573j236n140n577M363J3108M898j2348
954G53j3894M695J7306M539j6002j3858Q828J9955L823j6605j4040N298J4266
967E064M374p012o096K12J496P81L743M514l393j0925l968J1236J2664m423j6489
$$ plain form
871 -2538 -4043 -4211 2861 10075 3987 -11105 -13576 3991 19207 9595 -13359 -18366 943 16833
885 16833 7803 -11254 -12479 4597 14897 5306 -9216 -10752 -1926 4024 4469 4887 3978 -3275 -10747
900 -10747 -5660 8917 12912 -2005 -16129 -7962 12852 17005 -2132 -18012 -8938 11158 13965
913 13965 -2561 -13908 -5602 8674 10367 1158 -5310 -5195 -4166 -2548 4145 10862 5894 -8507
927 -8507 -13494 -17 14115 7846 -11036 -14961 3102 18050 8570 -12139 -15730 1014 13946
940 13946 7266 -6777 -9388 -1058 4955 4258 2685 1449 -3691 -9268 -4905 8203 13101 753
954 753 -13141 -8446 8860 13399 -2603 -16461 -7633 12322 16145 -460 -14500 -9202 5064
967 5064 9438 2426 -3670 -3458 -1962 -1181 2562 7076 3683 -7242 -11210 26 12690 8267 -8222
982h222m898J4702J3568p736j8982m134J6089J4433m665j4760n724O400O896O98
996C665j395p83l118m048K447R067L296r933j0994M746J5751M567j4397j3692
1010a4821O784J8400M741j4955j4202M039J4443O102o199p335j143J549J094K795
1024A292L663j744p689l065Q339R379m469j4266l972J3674J3387n836j7662n719
1038a4688J3247J3924k640j3327o399N530P416J442k028j749k409k627J751O448
1052C891K430p224p961M180J2791L427j2828j2802N169J7010O572j1908j3996
1065a1249J198J2389O893m700p432j702K505K365J854J399k109n344j417O747
1079A397O890m217j1890l121J2109J2268m546j6234o961J0778J3800j61j1483
$$ plain form
982 -8222 -13120 1582 15150 7414 -11568 -15702 387 14820 10155 -4605 -10329 -3929 2967 3665
996 3665 2270 1487 -1631 -5679 -3232 5835 9131 -802 -11796 -7050 8701 13268 -1129 -14821
1010 -14821 -8037 10363 15104 149 -14053 -10014 4429 10531 4332 -3003 -4146 -2597 -1503 1292
1024 1292 4955 3211 -4478 -7543 796 10175 5706 -8560 -12532 1142 14529 8693 -8969 -14688
1038 -14688 -1441 12483 9843 -3484 -9883 -4353 3063 4505 2477 728 -1681 -4308 -2557 3891
1052 3891 6321 -903 -8864 -4684 8107 11534 -1294 -14096 -8927 8083 14655 2747 -11249
1065 -11249 -10051 2338 9231 4531 -2901 -4603 -2098 267 2121 3520 1411 -3933 -5350 1397
1079 1397 8287 4070 -7820 -10941 1168 13436 8890 -7344 -14305 -3527 10273 10112 -1371
1092a371p148L910P201J861k665k634j384l81K276M239M53o340n845M287J0975
1107G434K891j1103j1614L644J4915P120r272j3016p72J0298P218l052o934k213
1121d456K706L128J205o28k686l243O96O076M653m581j0135k427J0297J0857k950
1136H512j3632p126P909J2181J440r277p244K434O899K645k909l867j247J665
1150a617L432K541j838o126l656N058R500J944r742j0158K493J2488O987o798
1164D508j1279j878Q284P047j954o724k911K977M413J367k447m062k111K733O189
1179D152K905n285q825j588Q928R329j890j1069o659N492J0094K284p069o684
1193e885J327O341L242k850m959j660L018M791J885l550o361k299N511Q201J220
$$ plain form
1092 -1371 -8519 -4609 2592 4453 1788 -846 -2230 -2611 -335 3904 4357 -1983 -7828 -3541 7434
1107 7434 10325 -778 -12392 -8748 6167 13287 4015 -9001 -9773 525 7743 4691 -2243 -4456
1121 -4456 -1750 1378 2583 1955 -731 -3974 -3278 2798 7451 2870 -7265 -9692 605 11462 8512
1136 8512 -5120 -12246 -4337 7844 9284 7 -7237 -4803 2096 4741 1832 -2035 -3282 -1617
1150 -1617 1815 4356 2518 -3608 -7264 -2206 7294 9238 -504 -10662 -8169 4319 11306 4508
1164 4508 -6771 -8649 -365 6682 4728 -1996 -4907 -1930 2483 3850 1403 -2659 -4770 -2037 4152
1179 4152 7057 1772 -7053 -8641 287 9616 7726 -3343 -10002 -4510 5584 7868 799 -5885
1193 -5885 -4558 1783 5025 2175 -2784 -4444 -1426 3365 5250 1700 -4661 -6960 -1449 6752 7972
1208G972q131q413J436R665O211m373q940k554O070O424p97o140l717K745N641
1223C099K193l587n736j908M415O747J806n888p770p93P598P506j276q476n575
1238g645L621P841K530n254o060M34N938M102k548o173k745L919O533K061n009
1253A545p061j455O116P243L84o993o509J200P207M730k914o627k364M370N531
1268D403qn551m413K136O517L378l969p170k365N408P363J160o274o743J00O476
1284D48N459j292o101l817K448N526K119l720n137k90N263M780j756o906m085
1299g061L982P913K725n809p743r41O609O375o60o221m475J663N247K861k260
1314B205m636j728L250M747N55n016n149J328P154M792l814q502l184O016Q046
$$ plain form
1208 7972 -159 -8572 -7136 2529 8740 4367 -4573 -7127 -1057 5367 4570 -1570 -5287 -2542 3099
1223 3099 5292 1705 -4031 -5939 -1524 5223 7029 1141 -6629 -7422 176 7682 6406 -2070 -7645
1238 -7645 -4024 3817 6347 1093 -4967 -4533 1405 5507 2959 -3214 -5959 -2040 4493 6554 1545
1253 1545 -5516 -6971 -855 6388 6772 -221 -6730 -5530 1677 6407 3493 -3134 -5498 -1128 4403
1268 4403 4395 -1156 -5569 -3433 3084 6462 2493 -4677 -7042 -1634 5729 6889 615 -6128 -6028 448
1284 448 5907 4615 -1486 -5303 -2855 2671 4790 1070 -4067 -4357 906 5686 3930 -2976 -7061
1299 -7061 -3079 4834 7559 1750 -5993 -6934 -325 6050 5390 -831 -5306 -3643 1604 4465 2205
1314 2205 -2431 -4159 -909 3838 4393 -623 -5772 -4444 2710 7502 3688 -4814 -7998 -1982 6064
1329F064P86o784n980J196N901L506k022m383j930K127L670J390k694m292q72
1344d317M525N413o46p105n512L361Q792L707n940q219p54O833N593j662n680
1359a611k626K462L750J003k176k896r56K339L888J121m135n623P7P030O087k877
1375D857r033m178N886Q425O70p039n353K260N737J859l124l424j12K423K353
1390B207M47k116l544j281L740N780N09o878o625K422R180M590n801q542n69P231
1406G50N077k858n773j109L751L097p27k638j773p5J775L144J572l190n837j227
1422f041O467P046j755r087m963N511Q541N69p251m848L263N853N71m302k944
1437c370J409K925J369k93j586k795j753K661N766J868n944p299J062Q794N290
$$ plain form
1329 6064 6850 66 -5914 -4718 1183 4689 2667 -1716 -3646 -1519 2151 3541 847 -3445 -4317
1344 -4317 208 5621 4975 -2130 -7642 -4281 4511 8218 2278 -5941 -6695 138 5731 4069 -1611
1359 -1611 -4237 -1775 1975 2978 802 -2094 -3050 -711 3177 4298 163 -5460 -5383 1647 7734 4857
1375 4857 -4176 -8354 -2468 5957 6627 -412 -5765 -3505 2232 4091 967 -2457 -2569 -146 2207
1390 2207 2654 538 -3006 -4287 -547 5233 5742 -1136 -7761 -5339 3841 8431 2630 -5912 -6481 750
1406 750 5827 2969 -2804 -3913 -162 2935 2208 -430 -2203 -2278 -503 2641 4213 1023 -4814 -6041
1422 -6041 426 7472 5717 -3370 -8333 -2822 5719 6288 -963 -5811 -2548 3305 3876 -426 -3370
1437 -3370 -1961 964 2333 2040 454 -2341 -4094 -1433 4333 6201 257 -7042 -5980 2814 8104
1452H104n165q541o09P387M840l692o164k63M925L066j919l361j162P31J535K454
1468B166J829k204n674k382N398P488m08q530n515M899Q483M88p569m787M161
1483b157O536J4n524l142K340L582Q90j019j281k015j942J605N457K914m814p584
1499f140k20Q126N741m503q287n15P586M677m486o841J30N977L390k526l826p86
1515b503J166J040J578J940r95m947l151M144P368O43p704n832M109Q184O41p499
1531a818m676M664P124j80o489l816K679M281R64j296j026j318j950M05M418L326
1547E292l409o935q58P291N754m010q221p94P592M886m674p297J92O821L970k961
1563B639m662r86J540J001J107K102J67m029l778K527O506J285o664n513L880
$$ plain form
1452 8104 2939 -5602 -6211 1176 6016 2324 -3840 -4103 822 3888 1969 -1392 -2554 -1823 -288 2166
1468 2166 3995 1791 -3883 -6265 -867 6621 6213 -2317 -7832 -2933 5550 6038 -1531 -6318 -2157
1483 -2157 4379 4393 -1131 -4273 -1933 1649 2539 1520 239 -1776 -3718 -2113 3344 6258 1444 -6140
1499 -6140 -6360 1766 7507 3004 -5283 -5798 1788 6465 1979 -4862 -4732 1245 4635 2109 -1717 -2503
1515 -2503 -1337 -297 1281 3221 2226 -2721 -5872 -1728 5640 6283 -1421 -7253 -3144 5040 5681 -1818
1531 -1818 -6494 -1830 5294 5114 -1375 -5191 -2512 1769 2733 1437 411 -907 -2857 -2452 1966 5292
1547 5292 1883 -5052 -5910 1381 7135 3125 -5096 -5890 1702 6588 1914 -5383 -5191 1630 5600 2639
1563 2639 -2023 -3009 -1469 -468 639 2741 2908 -1121 -4899 -2372 4134 5419 -1245 -6758 -2878
1578b878Q169Q37p738n260M457P488J39o674m009L021M768Q30j886j125q09j908
1594b578m40L682M045j768o132j821N763N192l514p782p30P856N619m326p946
1609d880q22O442M318k676m654p05K226J201L02J273M24l166l764J505N866K143
1625E033n226n130L029P293O67p781n592M447Q388J259o491m806K205M463O22
1640B380k175q22L71q50p26K376L299j316n523k081N062N281k571p069r72P308
1656A972N406m386q348j316O601N200j861m467r23J864N27p39P54J246j440k840
1672b750Q44M713J721m873n162K396P113J531o678n521L695P928J426o446n310
1687e373J771M792J375j814q07O11o52j499Q28K575k39l746j428M442M621k525
$$ plain form
1578 -2878 5291 6128 -1610 -6870 -2413 5075 5214 -1460 -5469 -2448 2320 3150 1264 139 -670 -2578
1594 -2578 -3018 664 4709 2941 -3191 -5012 751 5943 2429 -5353 -6083 1773 7392 3066 -4880
1609 -4880 -5702 740 5058 2382 -2272 -2977 -751 450 752 2025 2449 -717 -4481 -2976 2890 5033
1625 5033 -193 -5323 -2294 4999 5666 -2115 -7707 -3260 5128 6387 -104 -4910 -2705 1758 2380
1640 2380 205 -617 -246 -1096 -1822 554 3853 2537 -2986 -5067 -5 5276 2705 -4364 -5336 1972
1656 1972 7378 2992 -5356 -6672 -71 5129 3268 -1199 -2122 -258 269 -470 284 1530 90 -2750
1672 -2750 -1906 2807 4528 -345 -5507 -3111 4002 5533 -1145 -6666 -2971 4957 6383 -63 -5373
1687 -5373 -3602 1190 2565 751 -56 555 -97 -1596 -768 1807 1568 -2178 -3606 836 5457 2932
1703B932p200j834O499N961k885p545j765N887N076j851m896j370K170J248n35
1718a08L70J360o42k523j99L216J505l808m110K495O916J800o445o290K307P374
1734C218K286n122m744J650M541J038k506j467P41J96r52N29K210K24l021j654
1750b833L259L829k098o286j717O107O184k012p266k752M518M770j134m123r44
1765b498K535J536j010q67N01j45j450J17K738J397l084l724J706N785J767n521
1781b17n772J819O927K833m278m832P80L920J074k370j517J133J231l67k51Q10
1797I23l21k342j009L109L642j501n515k021M867N424j445o329k662M016M642
1812C478o75l844j235K211J583j046j290K78M61m52L17J907O71k944l398J417
$$ plain form
1703 2932 -4268 -6102 397 6358 3473 -4072 -5837 50 5126 3275 -1621 -2991 -821 427 -108
1718 -108 262 1622 980 -1543 -1742 1474 2979 -829 -4939 -2444 4472 6272 -173 -6463 -4156 3218
1734 3218 5504 382 -4362 -2712 1829 2867 361 -1106 -365 -169 -1121 -592 1618 1842 -1179 -2833
1750 -2833 426 4255 2157 -4129 -5846 261 6445 4433 -2833 -5585 -1067 3703 2569 -1554 -2498
1765 -2498 37 1573 563 -304 197 52 -1398 -1281 1457 2854 -230 -3954 -2248 3537 5304 -217
1781 -217 -5989 -4170 2757 5590 1312 -3520 -2740 1180 2254 -116 -1633 -500 731 364 113 923
1797 923 602 -1740 -2749 360 4002 2501 -3014 -5035 -168 5256 3811 -2518 -5180 -1164 3478
1812 3478 2803 -1041 -2276 -65 1518 472 -818 -540 -79 -531 -214 1693 2364 -580 -3978 -2561
1828b561N275K210m302n190R09N640K582l535m301O20L772J381k176j892P25J460
1844F17J09m35J11m12j553m10K681K976j319m879k164L827M937n34n052k598L067
1861a031L964n10l623j404K177K176m78j650n68L21J86N97J397K64k458k694J166
1878b168M416K045l402m560L30M546K507k683l657M15L361J384k080k276K98J755
1894B31Q78j83m04q06j310j53K292K467r66l935j913K924M087j79m074k281K351
1911i74L369k77l126j461J886K350n4j758j218M2O57J045J194p9k160k180Q89
1928a855L450J721k493l554J24L521K041k107l095K04K967J563j703k437k47J708
1944a92J496J30q02j239j096K57K044J882q17l036j520K142L083p6l078j776J892
$$ plain form
1828 -2561 2714 4924 622 -4568 -3659 1981 4563 1028 -3273 -2653 1119 2500 324 -1568 -843 617
1844 617 726 291 402 -10 -1563 -1973 708 3684 2365 -2514 -4678 -851 4086 3552 -1500 -4098 -1031
1861 -1031 2933 2423 -1200 -2604 -427 1749 1271 -379 -947 -626 -440 157 1554 1818 -640 -3334 -2168
1878 -2168 2248 4293 891 -3669 -3339 1207 3714 1031 -2626 -2211 1150 2534 454 -1822 -1524 231
1894 231 1109 926 522 -284 -1594 -1747 545 3012 2046 -1889 -3802 -878 3209 3030 -1044 -3325 -974
1911 -974 2395 2118 -1008 -2469 -583 1767 1713 -45 -1263 -1221 -564 481 1675 1596 -564 -2744 -1855
1928 -1855 1595 3316 823 -2731 -2607 914 2955 848 -2247 -2043 924 2487 784 -1653 -1900 -192
1944 -192 1304 1434 632 -607 -1703 -1446 598 2480 1663 -1373 -2893 -751 2332 2256 -822 -2598 -706
1961g06K809j39k770j608J470K438N09j544j660l46Q08J391J050l58j905j636
1977b197P56K616J266j831k590J08K625J507j680k529Q3K525J671j212k385q07
1993b074J360J822N87q43j527j000M97J785J319p74k179r60J598K078j95k255
2009g61j249J517K296lk328j711R44K336J060j132j941q11Q61J616R72o12j685
2026f31j045Q19J848O16j426j655L30J946R91j398k058n5K083J694o50k170j273
2043b034Q81J923J024p76j663r57O78J589Q02q60j530l33J296J277m50j685p58
2060a576J269J829J26j810j680L42J985J433n81j897j196O52J730R23p44j545
2076g40n54R84J277Nj252r33O13J489N43j177j612j69J555J625r4j773j527L03
$$ plain form
1961 -706 2103 1964 -806 -2414 -944 1494 2003 459 -1201 -1547 -739 652 1702 1344 -561 -2197
1977 -2197 -1441 1175 2441 610 -1980 -1872 753 2260 580 -1949 -1866 659 2330 1118 -1267 -2074
1993 -2074 -714 1108 1695 852 -675 -1675 -1178 607 1926 1152 -1027 -1987 -389 1689 1494 -761
2009 -761 -2010 -493 1803 1800 -528 -2239 -1295 1041 2101 969 -972 -1783 -922 694 1666 1054 -631
2026 -631 -1676 -857 991 1607 181 -1474 -1144 802 1793 395 -1663 -1718 365 2059 1409 -761 -2034
2043 -2034 -1153 770 1794 1018 -645 -1602 -924 665 1467 607 -923 -1256 40 1317 867 -818 -1576
2060 -1576 -307 1522 1648 -162 -1842 -1500 485 1918 1337 -560 -1756 -1104 626 1549 805 -740
2076 -740 -1294 -310 967 972 -280 -1213 -600 889 1432 255 -1357 -1526 29 1654 1560 -213 -1740 -1437
2094a437J826J328n75j746r10Q70J481L09j118j071L21J257O26p92j332l28J087
2111b04J415K14j298j538j36J510J603o0j701j413M62J731Q94r42j452j12J246
2128B19R15n78j273m17R34J195J72j006j192k54J020J397L66j236j587j80J532
2145B7J475l60j682q75J028J429n7j376q28Q01J349K18j083j090j3R41R93K52
2163A149q03j224n09R36J566L60j370j486K64J664Q33j087j445J77J549P86r87
2180C73j446r7J193J027r1q89q13k14N65J034O19o71j463n26J190J479j91j622
2198e43q16J136J469k91j660p51J139J487J0j268r41K01Q00O13K02l08q58p15
2216a094M11J339O63j002j457J13J560P96j151j504L38J752P71j208j557J0J330
$$ plain form
2094 -1437 389 1717 1142 -604 -1514 -644 837 1146 28 -1043 -722 535 1161 369 -963 -1291 -204
2111 -204 1211 1425 127 -1411 -1547 -37 1566 1506 -195 -1608 -1146 585 1479 537 -915 -1027 219
2128 219 1134 556 -717 -1134 -200 995 1167 161 -1031 -1285 -265 1132 1498 262 -1325 -1505 27
2145 27 1502 1142 -540 -1415 -387 1042 985 -391 -1219 -418 931 1149 66 -1024 -1037 -96 897 1149
2163 1149 346 -878 -1387 -451 1115 1475 105 -1381 -1117 547 1380 293 -1152 -975 574 1360 373
2180 373 -1073 -1170 23 1050 959 70 -743 -957 -392 642 1261 590 -873 -1399 -209 1270 1079 -543
2198 -543 -1359 -223 1246 955 -705 -1456 -317 1170 1180 -88 -1029 -828 -28 585 787 479 -379 -1094
2216 -1094 -683 656 1319 317 -1140 -1027 533 1329 178 -1326 -988 764 1535 327 -1230 -1220 110
2233A10R02k77p40m55j56J46O47P33j66j183p40Q33J386o7j503p87J161J552l31
2252A065j849q15J242J628m5j350q70L68P05K89P2om23p16l7J000P92o71j295
2271i16oJ454P98j166j593L11J870R03j233j635J3J347P94m25o39j28Lj29K16
2290a61O85K23q61q32N09J240O0j387q01J151J603k49j904r61J200J652Oj305
2308a32p17M57N87k6j03K03j2n87l16O70P87l89j145j10J288Q24j081j599K19
2327a182J861J002j138j674n3J266P26m90n56J28K16k53j83M54L98m81p20L23
2345c56J064J23j261q40R86J572j11j776j014J085J618M9j260o74N30N25k18k76
2363b34L22L45l75m96L11O53k46r71j14J254Q81r35j600NJ663J015r83j510J0
$$ plain form
2233 110 1012 735 -5 -460 -616 -470 177 910 744 -439 -1179 -346 1040 973 -530 -1317 -156 1396 1065
2252 1065 -784 -1599 -357 1271 1226 -124 -994 -626 79 368 440 434 11 -705 -742 258 1050 379 -916
2271 -916 -922 532 1330 164 -1429 -1118 752 1655 422 -1213 -1200 147 941 516 -123 -251 -248 -377 -161
2290 -161 524 747 -114 -946 -437 803 863 -524 -1325 -174 1429 1180 -724 -1685 -485 1167 1173 -132
2308 -132 -849 -392 195 169 66 269 257 -330 -646 24 811 422 -723 -833 455 1279 198 -1401 -1182
2327 -1182 679 1681 543 -1131 -1184 82 808 318 -238 -110 106 -147 -330 124 522 41 -679 -356
2345 -356 708 831 -430 -1270 -284 1288 1177 -599 -1613 -528 1090 1139 -121 -795 -265 260 42 -234
2363 -234 88 433 58 -438 -127 526 280 -691 -805 449 1330 395 -1205 -1200 463 1478 495 -1015 -1005
2382a005J230N83n73n62K41L64l19m08L05N30j65n84J23Q25J02j145q45Q80J579
2401A156J16j559j053Q08J368K1j130n09O48O22k94m89K00M43j81n28R5N73k2
2420B85p31j50J007P72p95j514j51J481J100o72j305p5J012M12p01n84L97O33
2438D21j20n13M4M29q1n39K6P19K44q73p81O71J366J32j369j042O32J256J13q93
2458a58l83O49N04m70o86J27N93J06l62J1M23m1p39k82P96Q21m72j213j89J193
2478B28Q96o01j176j03Q98M08n70n14M31O77j20o55j97L28J18k64N9O38K49p84
2498e4q27L28J119K95r61p86N18J031J8r12m27O00N70l50o29Q1O09K06l79j77
2518a27K28mn12j99P17P79k84j059l85P99P39m08q31M3Q55L42o51o23K76O64K
$$ plain form
2382 -1005 225 808 235 -327 -86 278 -41 -449 -144 386 221 -363 -240 585 687 -458 -1303 -423 1156
2401 1156 1272 -287 -1340 -532 836 857 -273 -782 -134 488 194 -295 -95 348 167 -361 -266 307 285
2420 285 -446 -596 411 1183 388 -1126 -1277 204 1304 632 -673 -748 264 676 -25 -609 -212 421
2438 421 301 -212 -168 261 180 -359 -333 386 630 -243 -1024 -353 1013 1145 -224 -1266 -634 622 735 -158
2458 -158 -541 108 612 142 -544 -417 176 282 -80 -69 354 313 -426 -708 88 909 437 -776 -965 228
2478 228 1124 523 -653 -756 142 550 -20 -534 -103 574 454 -201 -398 -70 48 -216 -157 481 730 -54
2498 -54 -881 -553 566 861 -100 -886 -368 663 681 -231 -658 -58 512 162 -467 -386 223 429 50 -127
2518 -127 101 97 -415 -614 103 882 598 -461 -846 -47 692 284 -547 -504 351 693 42 -581 -305 359 361
2539C61m96j80L34J64k49o5L98K26n71o70K44R49L67o91o95K93P01k8p34k69O56
2560D5O14k54p03j35M27K29k26j31K38J11l65k70M04N72j60p74k98O04O23k51
2580C00o66J8O34K54o01n76K59O81J86m03k81J47J02k01r7L56L08k82n54N2O17
2601B53K56n05n03K74N86Mo06k58N22N29k25o16j70L86K97j28j10J41Q8l18l02
2622d05K42M87K7m67k57L87L63k35n29M4N73K73m61n13J44N53J63l28k74J16J38
2643D1j12q8K30K51j64l98o3L66K19k74k88K29M09n4n24k54L95M99o2m95j73K70
2665d0K11j04j45J05J31j47k47R5L11Q7k81j78K12K17j88l42P1M71K01l59m47
2686c66N0M10J85k14j84R4J13j04j48J07K18k1k30q6J89J22j76j55J74L11o7m18
$$ plain form
2539 361 -135 -315 19 183 -66 -131 267 493 -78 -748 -504 445 812 121 -574 -281 420 392 -342 -611 45
2560 45 659 405 -298 -433 -6 223 -3 -134 104 215 -150 -420 -16 556 396 -378 -676 -72 551 300
2580 300 -366 -348 286 540 -61 -637 -378 303 489 86 -195 -48 54 -147 -244 112 420 138 -416 -364 253
2601 253 509 4 -499 -225 361 365 -241 -499 23 552 327 -289 -459 -73 224 96 -14 127 215 -103 -405
2622 -405 -163 324 351 -116 -373 14 377 142 -387 -343 230 503 42 -471 -327 226 389 61 -213 -97 41
2643 41 -71 -159 71 322 158 -240 -303 63 282 8 -280 -51 358 304 -220 -474 -79 420 358 -137 -310 -40
2665 -40 171 67 -78 27 158 11 -236 -141 170 257 -24 -202 10 227 39 -303 -232 239 440 81 -366
2686 -366 -316 94 279 65 -119 -25 88 -16 -164 -57 161 140 -90 -176 13 135 -41 -196 -22 289 222 -196
2708a96j96K91M14j4l53j65J58J53n8j16Q7J53n6k09l1J64Q4j10n9J27J05j68
2730Ek50N3L56J68k27l36j6K89J42j26j46P5J24q1j52J5J71Q3j10p8L7K1q9n8
2754a30J48K06m7k99j56J82K79Ok21j16J31R1o7j25P0J44K4j32r8N0O8QJ1P6J3
2779A16j44j55N3K32J41j70j90rJ61P0j03p9Q7J13m6j55n4R8J20Nm2n3m0n0J0
2804h4J22J14m7j83q0R1J53mj07n3J09L9p2j17K2J56Q3o6j30n9M3O5P9K5m3q7
2830c1q0L3J34N6p4q8%Q7Jq5m7J01J17j4j52q8M1J37P0k2q4q0k8O5P8N2m4q0k3
2859d8L2N4l7m6K2R7J3r7j09RJ25J09j5j09j17J1R1Q6J5p1n6j6M5L6j3l2J4N3
2887D6J8n1j00j6J01J22Kj13j23lJ13J11J1r7r5KP5N2j4n6JL9K6l3r2JQ6Q6Jj00
$$ plain form
2708 -196 -392 -101 313 299 -54 -219 -61 92 34 -82 5 158 102 -107 -138 26 110 0 -59 68 173 5
2730 5 -245 -192 164 332 105 -231 -247 42 184 58 -88 -13 111 30 -122 -107 64 147 37 -41 -4 17 -72 -130
2754 -130 18 224 177 -122 -278 -96 183 189 -32 -148 -17 74 7 -118 -48 96 120 -12 -110 -60 8 16 27 103 116
2779 116 -28 -183 -130 102 243 73 -117 -126 35 105 2 -77 10 123 77 -78 -132 -34 86 91 49 -4 -44 -94 -84
2804 -84 38 152 105 -78 -158 -67 86 82 -25 -78 31 70 -2 -119 -97 59 142 76 -54 -113 -70 -5 74 99 56 -31
2830 -31 -111 -78 56 112 38 -50 -50 37 38 -47 -94 7 124 110 -42 -130 -89 48 118 96 12 -68 -96 -31 47 99 55 -25 -48
2859 -48 -16 38 1 -45 -23 74 87 -10 -119 -110 15 124 109 0 -117 -106 -15 71 86 15 -41 -57 -12 24 11 -21 -7 46
2887 46 64 13 -87 -103 -2 120 122 9 -114 -117 -4 107 118 21 -74 -72 3 55 41 -15 -14 25 51 18 -74 -73 13 99 100 0
2917@j01j0J04J11J9j05j11JR0Q2j3q3l7M5N8m5o8j9O5J02Lr7r7j1J01J11J9j01
2945A3j05k7J08R7J3r1p0K5P6J9p6n8N5J14K3j20r5lJ23J13kj21j01j7Q2J08K6
2972A09r2r2mJ01M9m8q1KR2O7o9j28k2J09J31jj22j25J6R5J07J3q4r2j7P7P3j5
3000D9q8l8N8R1j0j17p7Q6J52M2j38j41lJ40J16mr8r7j3R7P6j7n0p1J5J03K2q7
3028bj01M8J25Q6r0j81m0J41J49J6j34j22%J03Q8lq1o8J6Q1L4l3r3k5J10R9n0
3055G3j48q9J11J68L5j21j58MJ13J20kj02r1J6Q4N7j7q9m2O8J13j7j14j03M4J76
3081H9Q6j07j74n1J27J65J1j27j15LJ06P8l0q5n0L7R5K7r2j03NJ49R9n3j74q6
3107a70J04J70N7j19j59j8J23J13j9r6q0L6R6N2o7j06j5J21J02k8j45j07N5J87
$$ plain form
2917 0 -101 -111 -7 104 123 18 -93 -92 -2 80 67 -16 -53 -8 50 5 -63 -82 -17 85 88 -9 -106 -117 -16 95 114 13
2945 13 -92 -119 -11 86 99 8 -62 -37 39 58 -18 -76 -21 93 116 -4 -99 -102 21 134 132 11 -90 -107 -25 83 109
2972 109 17 -75 -79 22 71 23 -58 -56 36 103 34 -94 -116 -7 124 123 1 -124 -108 -13 94 107 23 -69 -86 -9 64 49
3000 49 -39 -77 -19 72 62 -55 -132 -46 106 148 10 -131 -134 6 122 118 20 -77 -90 7 83 66 16 -55 -40 63 85 -2
3028 -2 -103 -55 70 156 66 -115 -155 -14 135 151 17 -105 -105 -2 86 83 2 -66 -50 31 65 32 -61 -86 24 123 73
3055 73 -75 -164 -53 115 150 29 -129 -125 -12 108 106 4 -87 -71 13 70 53 -36 -78 -10 103 86 -28 -131 -87 89
3081 89 175 68 -106 -157 -30 135 146 19 -96 -93 13 91 61 -24 -74 -37 58 85 -7 -110 -105 44 143 90 -84 -170
3107 -170 -66 104 161 42 -117 -135 -12 101 82 -14 -94 -58 38 90 23 -83 -98 23 125 97 -48 -155 -100 87
3131H7R1j06j78m0J10J42K6j11j14J5J01Q2l4j21l3P0J10K5j24j29L8J62R9q1
3155H7j72p6J02J46O0j08j30j5R6J04j1j16p4N5J20L6q9j28j0J32J36l9j57j23
3179a74R0J58Q4r8j50m4J09J23Kq3j05K1J11O5o5j06n3R8J52jj56j24K8J65J31
3204A78q3j68p2J05J34L5j16j00lJ00Q7k1r5p7O3J10M5j03j38k0J59J51n1j73
3228e3j13P8J63O7j04j28lQ0R7%j03o6J8J11O9o3j17o8J26J46mj70j17L0J95R9
3254A70q1j68n9J07J26Lr3o9J4P3Q2k8j16o7N3J47N2j04j67oJ39J60m7j84r8R0
3280g1J63L4j05j06mQ7Q5l6q8o1M7J02O9p9j42m8J05J66M0j69j42L1J84R4j06
3305E0j40m4J27R3Rj05o6MR9N9k6j03p2Q0J30P6j21j68k8J58J48l1j69r3Q8J40
$$ plain form
3131 87 178 72 -106 -146 -36 106 132 21 -93 -78 23 105 71 -50 -83 -13 97 122 -2 -131 -93 69 168 87
3155 87 -85 -161 -59 87 147 39 -91 -106 -10 94 83 -33 -107 -52 68 104 15 -113 -123 9 145 106 -51 -174
3179 -174 -84 74 158 60 -90 -134 -25 98 100 17 -88 -67 44 109 44 -62 -115 -17 135 134 -22 -146 -118 47 178
3204 178 95 -73 -145 -40 94 129 13 -87 -90 10 97 76 -19 -96 -33 77 122 19 -119 -139 20 171 120 -53
3228 -53 -166 -88 75 142 38 -90 -93 -13 84 84 -19 -85 -67 44 113 50 -67 -135 -9 137 133 -37 -154 -124 71 170
3254 170 89 -79 -138 -31 95 98 5 -64 -50 23 105 77 -39 -106 -53 94 146 42 -125 -131 8 168 121 -63 -161 -71
3280 -71 92 126 21 -85 -89 -2 83 47 -41 -102 -55 47 116 37 -105 -153 -48 118 158 -11 -153 -122 62 156 50
3305 50 -90 -134 -7 86 95 -10 -76 -72 27 86 60 -43 -115 -35 95 171 50 -118 -146 12 160 129 -40 -133 -45 95
3331I5J3j03r1jJ02P2l5p4o0K4R8N6m2j40m9J01J55J8j39j42K7J70P8q7j29j1
3357i4J03Q2m0r2n0L8Q7N5m6r1o3O0J27N6q8j56j6J42J22k5j57r0R3J34Jr6p4
3384g8L2R0N0n2p6o5M3J02O4n6j27o5J03J37J3j29j25L8J60N2p7j24mR6P8m5q2
3411d7m2M4Q6L8m4j02n4O9J20N1r8j16j9J22J00k9j31n5Q5J04Jj07o6L2J10L1
3437H3m3p3m3M4R5M4n0j09o3Q8J17J6j01q9K6J20L2q1r4J2R2N8k9j01k5L0Q7L8
3465H1n0r4m1L9J23K6p3r7pJ04P4l3j20k7Q6R2k1r3o4N5Q8M0n1q1l8L5R8L5n3
3494C3q0l8P6Q0oq2o4N0R3J2p5p8L1R1M2m0j03k7N7P4L2l9p5m0M4P6L3o8q1J4
3524e8Q3M1n8q0NQ0O5l9r7l3N3Q2J6m1n8l6M0O9K5m6o1j1O1O6j9p7l5M9R4j3q7
$$ plain form
3331 95 108 5 -86 -87 15 87 52 -22 -82 -58 40 96 54 -86 -135 -34 121 139 0 -142 -115 55 133 46 -83 -94
3357 -94 9 91 51 -41 -91 -53 34 89 43 -48 -111 -51 76 132 44 -112 -128 14 136 111 -46 -136 -43 91 92 -4 -78
3384 -78 -46 44 94 42 -34 -99 -56 46 110 54 -73 -138 -35 102 115 -14 -139 -101 59 111 34 -90 -94 2 80 35 -47
3411 -47 -89 -45 41 79 35 -67 -121 -52 68 119 21 -95 -114 8 108 79 -52 -107 -22 82 83 -24 -90 -58 52 83
3437 83 40 -33 -76 -32 63 107 57 -52 -115 -27 90 106 5 -84 -58 62 94 13 -81 -69 23 81 52 -49 -74 -44 43 81
3465 81 31 -63 -104 -65 58 84 11 -86 -93 11 85 52 -68 -95 -9 83 62 -31 -95 -40 48 88 37 -44 -82 -47 51 86 33
3494 33 -47 -85 -9 71 65 -17 -81 -31 62 74 -1 -79 -48 43 85 45 -58 -85 -28 46 78 39 -36 -76 -32 44 77 9 -72 -58
3524 -58 25 66 8 -72 -67 13 78 39 -58 -91 -38 44 60 19 -39 -75 -35 34 59 13 -48 -59 2 68 49 -28 -63 -14 80 67 -20
3555b0m9L4Q7L6m3p2l8O2M6K6l7n2j9L3N9ko3n0M2P1Po9o7J0J01M5m0j06j3N5
3585b6N7K4m5n9pL3M4Ok7m1J7N5J2k7q0MO9O3j6r8m7N9Q6J9n9n9lL5M5pj5m3P
3618b4M5L2k7o7oO2N5j1p2p2L8J01M4p7p0j4M9O4pm7l0JN1K3k2n0k8M3P2Mp6o0
3650g6J8Q0O4m8q8k5N6Q8jn7n7RN3K4j4n6rM3M4Mo1n0K5O8O5m1r5n1P0P6K3n6
3682B5o1k5Q0M9l2n5m3N1M5J3m8o7J1P9N1l2p3n4L8R2L9m4j00pN2P0j3n6m8L0
3712c3N7L3n4o4%P8N3j0q9n7L4R8M1m5q6l1N2P9J2m7p3QO4M2l0o8k2O8P8j2p9
3743cp8K4J15M4m7r4l8O5O3J5m1q0PM8N5j7p4l1M4P7J4o8j00J9J11P5n2j04n6
3772a07P8Q4K2o6o8j0O2N9j8l6n5L5O8J9m6q1k3R0R1jj18j10P0J29N9q7j07oO7
$$ plain form
3555 -20 -69 -35 52 88 45 -27 -65 -3 43 69 32 -20 -39 -6 53 51 -12 -62 -20 51 58 -11 -78 -68 33 78 38 -68 -81 -26
3585 -26 31 55 10 -49 -56 -23 21 27 0 -41 -24 31 43 16 -64 -60 9 72 56 -42 -89 -30 56 75 16 -43 -46 -11 34 27 12 -31 -24
3618 -24 21 53 26 -41 -47 15 70 59 -13 -85 -47 54 98 21 -49 -63 -14 50 43 -4 -34 -33 18 41 19 -31 -59 -16 56 60 -16 -76
3650 -76 -58 22 86 38 -50 -75 -19 69 68 11 -46 -37 16 40 26 -30 -39 4 48 52 -9 -59 -34 34 99 58 -37 -88 -18 58 81 25
3682 25 -36 -61 19 68 36 -19 -62 -11 34 47 -1 -68 -57 22 73 41 -32 -86 -48 44 83 39 -61 -68 -16 54 41 -15 -63 -33
3712 -33 24 57 3 -61 -61 17 70 60 -29 -86 -52 46 87 42 -44 -75 -23 56 68 21 -52 -44 20 62 32 -36 -58 10 88 76 -3
3743 -3 -81 -57 58 102 55 -39 -77 -12 51 66 25 -55 -48 0 55 38 -36 -67 -23 54 68 0 -100 -81 30 105 53 -51 -107
3772 -107 -29 55 77 11 -57 -67 -5 54 36 0 -55 -20 48 67 21 -60 -83 7 98 97 -21 -131 -61 68 127 40 -67 -73 -6
3801fQ0k5p1l3L2N2J7j6p7l9P0R1K3j03j09J1J44R4o3j37n7R6J16j2q5p9L3P7
3829B4K8m1n2j2J3P8M2m8j08l0J05J35j1j54j03N8J61N1j02j27J6J08N7m2q8j0
3855e2N6M6K8m9q5k4M3J29M2j16j64J8J69J08p3j65m1J26J17k8j41m5P5Q5ln9
3881cn3rM5O9L6l7j38n5J17J67%j83j29Q4J91M6j54j18L9J37N5r8r2NQ1P1No5
3909A4n7m8M9J23O5j07j81NJ82J49r8j95l1J42J36n9j69m2J12J10oj12n6jN6P1
3935E2M4l8j35p7J09J80J3j81j62R6K11O2j93j58Q7J90L0j22j34L4J12O5j8n6
3959A1o8m5M5J22Q5j12j66l2J90J58q2k42k9J98J53r0k07n3J69J42l2j41o7L3
3983f0M8O6M4k2j37r6R5J86L2j90j66J13K32M3k39j73J21K32M2j69j68O1J34O1
$$ plain form
3801 -6 74 49 -22 -55 -23 29 46 30 -47 -86 -16 75 98 -5 -114 -103 41 135 72 -65 -122 -26 90 78 -7 -86 -53 24
3829 24 52 11 -41 -53 -40 38 80 32 -76 -106 -1 134 123 -31 -134 -76 85 136 34 -93 -77 31 88 46 -42 -52
3855 -52 4 50 78 29 -56 -80 -37 92 134 18 -146 -128 41 149 76 -89 -130 -4 113 85 -56 -101 -26 59 56 -3
3881 -3 -56 -65 -20 49 85 48 -90 -145 -28 139 139 -44 -173 -89 102 148 -6 -124 -85 52 107 9 -83 -78 3 74 79 14
3909 14 -43 -91 -42 81 146 39 -142 -137 45 194 96 -99 -130 12 148 89 -80 -122 -10 100 94 -18 -74 -75 -19 52
3935 52 96 58 -77 -154 -45 135 148 -33 -195 -99 112 174 -19 -177 -90 100 130 8 -126 -92 20 85 67 11
3959 11 -57 -102 -57 65 150 38 -128 -160 30 188 106 -136 -165 33 186 96 -111 -164 5 147 115 -26 -93 -60
3983 -60 -12 54 98 76 -61 -157 -62 124 156 -34 -200 -87 145 188 -51 -224 -103 129 171 2 -166 -105 29 90
4007I0m2n5n1k8QJ21R7q8j82m3J98J61r9k41m0K49J79j16k69o0J96J77m2j56n4
4032i0N6M5K8L1nj09r9J03J73M2j94j85J09K53L6k44j85J30K77O1k25j86M3J69
4056C4O5n3n8k3k8J1Q6Q2p3j81l2J92J98j19k79o2K74K27j38l10n5K30K15n4k01
4081e2o0O1O7pL4J0o9r3O3J64K3j94j87J33K94O5k78k43J18L12Q8k30k22O4K06
4106F7O6p5q3j1j4pO2R3m1j61k7J87J62j31l12n6L01K69j17l26j15K51K13p0k00
4131g5p8J03Q9Pj9oo0o0M4J45N0j95j62J35L08N4l11k83J15L74J10k35k40N2K24
4156H6N2j14r6J9L8K6K6N8n8j62l1J96J82j16l27n5K97K93j15l86j36K57K72n8
4180A48k21q4J22J18l4p1j9rk8O9J37Rk01j90J26L25Q5l06k97J24L66J39k58k78
$$ plain form
4007 90 48 -7 -58 -86 -78 43 140 52 -130 -173 25 186 87 -154 -194 55 234 118 -151 -211 -15 162 120 -36 -90
4032 -90 -34 11 39 70 65 -44 -143 -40 133 175 -19 -204 -95 158 194 -50 -235 -105 172 233 8 -178 -135 34
4056 34 99 46 -12 -35 -63 -52 34 116 43 -138 -170 22 220 101 -178 -240 34 261 123 -187 -242 -12 203 149 -52
4081 -52 -112 -51 16 9 43 53 -16 -109 -46 118 141 -53 -240 -107 187 252 -26 -269 -151 161 249 19 -203 -139 67
4106 67 133 58 -25 -36 -50 -57 5 98 57 -104 -131 56 218 87 -225 -281 20 289 172 -154 -269 -18 195 125 -75
4131 -75 -153 -50 39 46 27 21 -39 -99 -55 90 140 -55 -217 -82 226 280 -31 -314 -199 175 285 50 -190 -138 86
4156 86 138 24 -72 -53 -15 11 37 95 37 -125 -156 40 222 106 -221 -276 21 314 199 -187 -323 -66 206 148
4180 148 -73 -157 -35 83 49 -22 -41 -50 -78 -9 128 137 -64 -254 -128 197 282 -24 -321 -197 169 308 50 -228
4204b28M2K58R7j33j20K7Q4J1MJ2o5j25J0J99J95j25l44j01L10K96q8l72j41K60
4228c7K70n6k73r2J31J51nj00l3qON9J20j0j97j88J33L23J01k83l21Q2L80J38
4252B91k47k78N9K82R3j55j57MJ12O3Qk0p4j19J1K04J73j22l33r7K81L18n8l56
4276a17j72K33K89m7k76j12J49J92Kj34r5j0M2Q3J12j9k09j52J09L02J13k64l23
4299c04P8L59J49k34k94M9K75J39j79j92KJ47J09Oo2j11q6L3J93J71j05l01j08
4322b66K46L04o4l40j63K23L10m8k93j53J60K48K0j51j36k5P6J16J03m7j87j66
4344b33J14K92J00k45k86N2L29J55k19l03K5L11J71j75k33n3J52J63K8r1j32r5
4366a73N0J97J54j21k67j07K28K83n9l23j52K39K95k0k94j93J47K64P2j55j77
$$ plain form
4204 -228 -186 72 169 36 -84 -57 27 38 42 54 -11 -136 -126 73 268 143 -201 -302 8 304 216 -156 -297 -37
4228 -37 233 177 -96 -188 -57 94 89 -11 -44 -52 -46 13 133 123 -74 -262 -129 194 295 12 -309 -227 153 291
4252 291 44 -234 -175 107 200 45 -112 -108 4 67 75 55 -19 -138 -127 77 250 128 -205 -302 -21 297 239 -117
4276 -117 -289 -56 233 186 -90 -202 -53 139 141 7 -88 -98 -56 27 139 120 -89 -241 -132 170 283 19 -304
4299 -304 -226 133 282 48 -246 -197 78 217 38 -154 -152 -5 104 110 48 -63 -149 -116 77 248 143 -158 -266
4322 -266 -20 284 220 -120 -283 -60 250 202 -91 -244 -84 164 184 33 -103 -128 -52 64 167 120 -67 -233
4344 -233 -119 173 273 28 -258 -206 123 278 59 -244 -219 92 263 88 -145 -198 -46 117 145 54 -78 -173
4366 -173 -123 74 228 107 -160 -267 -39 244 185 -138 -290 -51 244 224 -70 -263 -116 148 220 65 -112
4387a12o2J07J46R2n4j99j21J07K60P2k26k50N3L13J50k24k91PK92K03j13k88
4409a38j09J55K07O4j05j74q8R3J79J17j27k35o2K22K22n9k95j49K25K79kk80
4431f0k20J12K80J40j31k38r1J22J84R2j06j83q6J39K31J9k14k01P3K77J31k02
4453F8k95j9K94K31q9k79j68J25K41J08j10k18p5J05J90P7j48k08j0K07J85j02
4475A10k70j11J99K87K8k75k45O3K84J83j13k53j20J14K20Q5j19k08n7J89J80
4496A71k4k19j55J04K77J08j99k92j7K48K61k8k77k16Q8K61J40j04k53q2J61K04
4518A57K1j92j85N0K45J23j25k55r4K01K55M4k39k41mK53K25o5k61j70J27K53
4540A23J06j86k24j3K17J94r1k52j24J59K53P1j91k33n4K06K52K0k50k25N5K48
$$ plain form
4387 -112 -174 -67 79 171 117 -82 -203 -96 164 236 10 -240 -187 126 276 52 -239 -232 60 263 150 -138
4409 -138 -247 -92 115 179 74 -100 -188 -95 84 201 74 -161 -223 -1 221 162 -133 -282 -57 222 220 -60
4431 -60 -280 -168 112 252 121 -117 -208 -86 98 190 84 -99 -185 -46 185 204 -10 -211 -138 139 270 68
4453 68 -227 -246 48 279 190 -89 -257 -132 109 217 107 -111 -186 -81 109 186 38 -170 -180 27 212 110
4475 110 -160 -271 -72 215 243 -32 -277 -214 70 253 140 -113 -233 -119 101 186 67 -141 -198 -9 171
4496 171 147 -72 -227 -123 154 262 63 -229 -246 2 263 235 -42 -258 -170 91 231 127 -126 -208 -47 157
4518 157 178 -14 -199 -149 96 219 94 -161 -255 -54 201 245 6 -235 -239 14 239 174 -87 -257 -130 123
4540 123 229 43 -181 -194 23 217 126 -126 -250 -91 162 233 42 -191 -245 -39 213 233 -17 -242 -187 61
4562F1J88j22k72r2K07K50l3k49j93J19K79J17j74k64n0J89K14N6j89k40m2K28
4584a2K35j3k67k08J18K96R8k26k75M2K87J90j42l04r7J93K54N8j80k26m6J60
4606f5K21N7j90k30j5K52K18j09k99j22K45L07m9l25j94J56L31Q9k16k49m0J84
4628d3J94N1j42j96p6J67K42J4k46k25J05L32J27k77l19N2L55K17k02l27j07K46
4650e8K56Mj72j85l9J28J79Q4j45k34l8K34K33j03l35j31K71L63n2l99k34K07
4672a66L83Q2k51k59NJ83J51K3j02j52o5J03K15N9k22k42Q9L48J56k85l98N4M28
4695A37K48k19m06q4K78K42k2j80j22%Q1J25O9r6j96o4K16K53p3l79j69K93M09
4718C41l3m41k72K21M16R0k86k64M7J84J17k4q4r3m2O3J92N7k10k59O5M01J95
$$ plain form
4562 61 249 127 -145 -237 -30 220 187 -62 -255 -136 143 260 86 -178 -228 -39 175 231 42 -198 -240 -12
4584 -12 223 210 -57 -265 -147 149 247 21 -254 -212 75 265 123 -181 -278 -85 169 227 47 -179 -225 -65
4606 -65 156 213 23 -207 -222 30 248 139 -160 -282 -37 270 221 -104 -298 -142 189 278 62 -187 -227 -43
4628 -43 151 202 60 -136 -212 -45 197 211 -35 -260 -155 177 304 27 -292 -240 115 332 130 -197 -304 -58
4650 -58 198 202 30 -155 -194 -66 113 197 52 -182 -220 14 247 144 -191 -322 -51 312 260 -139 -373 -166
4672 -166 217 299 48 -211 -206 -23 128 151 49 -103 -168 -65 150 209 -13 -255 -166 182 338 53 -345 -291 137
4695 137 385 166 -240 -324 -46 196 174 -6 -128 -128 -47 78 147 51 -145 -209 7 260 187 -192 -361 -68 341
4718 341 308 -133 -405 -184 232 322 36 -228 -181 3 120 96 12 -81 -123 -60 132 189 -21 -280 -215 186 381
4741C81l14m24J2M58L23k44m30q6K98K70p1j96r2N8M6O3M6n5j47r2K17K68q2l96
4765a89k21L13M77j3m75l23K40M36Q8l30k52Q3K24O5o5o7l6l0L0J32Q8j82k81
4788b88N8M12K44l18m88k1M91L52k28m62r4L43K67j26k25p3J20Q2J4Rl4j34p5
4811a74J73K82m7m00k63L03N09N2n03l83K10M79J00l44k68J33K66M2j55j16J2
4832i2K0L2J28Q6j62k72nM00K82k75n15n7M94L98k09n02j18L51K72j09k90l2J78
4855CJ17m0m4l7j16p1J78K77%l75k99K38N07Q0m67m09K07N19J18l72l18J52L02
4878A50M5j96j25N0P4L5Q3N7j63k88l1M05L32k22n19j23M53L91j83n10j13M06
4900HL26j61l29p4K26J35m8q4l4o1m4J37K70J6l84l26K01N16J62m47m09J70M89
$$ plain form
4741 381 67 -357 -345 113 436 192 -238 -324 -26 244 173 -23 -115 -57 -11 52 98 43 -104 -196 21 289 207 -189
4765 -189 -410 -97 380 367 -108 -431 -191 245 333 3 -249 -166 58 123 58 -9 -45 -75 -45 87 175 -7 -288
4788 -288 -230 182 426 108 -380 -401 90 442 214 -248 -342 1 268 142 -83 -156 -36 46 60 69 35 -99 -174
4811 -174 -1 281 234 -166 -429 -126 383 435 -68 -451 -241 238 338 -6 -274 -141 125 167 12 -104 -92
4832 -92 -72 -40 88 174 12 -260 -265 135 417 142 -373 -430 64 462 253 -249 -367 -16 256 147 -143 -175 3
4855 3 120 80 36 -1 -117 -188 -10 267 267 -108 -407 -169 338 418 -49 -458 -251 268 386 14 -304 -152 150
4878 150 195 -1 -126 -76 -2 33 116 173 10 -278 -309 96 428 206 -313 -436 17 408 225 -285 -398 8
4900 8 334 173 -156 -230 -4 131 83 -1 -35 -96 -140 -3 267 283 -101 -427 -226 290 452 5 -404 -234 255
4923B55J29m24l18J57L88Q7k32j78K0J07L7O1O2j41k32l5L46L22j90n11j53M39
4945dM13j53m92j29L89L52j78m14r8K62K18j3j16o4o1o2J11K34N1l17l07J69M81
4968B72J63m25m32J50N08J48l91l60J71M09J24k82k47J6J49R3O3M8j08k52o5K74
4990B6L16j26m50j58M05M15j60n21j44L92L75j40m19j38K81K61l5j60r6m7m3J20
5012d6K35O9k67l19R9M43J52l87l81J47N23J63m13m07J23M38J54k49k70jJ72R9
5034G7L8Mq4k19n1K38L12r5m01j71L60L80j39n04j67M15M17j11m62j87K34K92
5056A76Rj52j03k7nR4J55O5k39k76J01L91J47l28l92J42M79J69l75m51J03M60
5078A43K16k14l13n5J62J22K9no9j54l2J99K16q5l58j25L23L68j20m76j87L71
$$ plain form
4923 255 384 -40 -358 -201 187 274 42 -136 -116 -9 28 89 151 10 -222 -257 89 411 221 -290 -443 -4
4945 -4 409 256 -236 -365 24 376 198 -216 -314 -52 166 153 37 -27 -88 -150 -39 195 246 -71 -378 -209 272
4968 272 435 10 -422 -272 236 384 -7 -367 -196 213 337 55 -192 -176 -27 66 129 177 69 -183 -248 26
4990 26 342 216 -234 -392 13 428 268 -253 -397 -5 370 230 -189 -327 -46 215 180 20 -76 -123 -166 -46
5012 -46 189 258 -9 -328 -229 214 366 -21 -402 -255 268 431 18 -389 -266 172 326 77 -193 -194 -22 77
5034 77 115 119 35 -184 -235 3 315 220 -181 -352 8 388 249 -255 -422 -7 410 299 -163 -350 -116 176
5056 176 185 33 -70 -97 -102 -8 147 212 -27 -303 -202 189 336 8 -384 -242 237 406 31 -420 -317 143
5078 143 359 145 -168 -223 -61 61 90 85 16 -138 -170 29 245 160 -198 -323 0 368 248 -228 -415 -44
5100d4M36q1m36k28K13L08N5j42j54l1J9Q8J22K6j58k19J06L15J19l16l63J30
5122b35M56K01l40m44L3M16K59j91k96r8J71J54K2n0p9j04qJ66J67r3l01q9L04
5145B1L34j20m43k15L35M38k1l88k79J64L19Q7j63j69qN4R7P8l6j38j44J13K80
5168A96O6k93l18J28M23K12l02m26k4L83K64j30l04j04J49J83K6j00r8o3O0J46
5190G4J12j34k56o4K89K90j01l98k24K77M22L4l49k77R8L01J25j52j77l5J04J24
5212H3M1q1j62o5J49K52L8k94k81R4L94K09k47l90n3L11K82q3k95j20J36J90M4
5235A52j32j40k9J15J70M7j66k33j0K59K75r5l65j99K18L50P6k88k73P3K69J40
5257B14j38j99n7J42J63K0j25j82l4J99K14Jk62k43Q5L22J99j92l22q0K51K57
$$ plain form
5100 -44 392 311 -125 -353 -140 168 223 81 -73 -104 -85 3 125 151 -7 -226 -120 195 314 -2 -365 -235
5122 -235 221 422 82 -362 -329 87 346 155 -141 -239 -68 86 108 58 -21 -125 -133 33 200 107 -194 -283 21
5145 21 355 235 -208 -423 -88 350 329 -59 -338 -174 145 232 69 -100 -108 -54 43 121 85 -53 -197 -84 196
5168 196 262 -31 -349 -221 202 414 112 -314 -338 45 309 179 -125 -229 -80 103 129 29 -69 -132 -72 74
5190 74 186 52 -204 -268 21 311 210 -188 -412 -135 287 321 -28 -305 -207 94 219 67 -110 -145 -41 83
5212 83 124 43 -119 -184 -35 217 255 -39 -320 -226 168 377 130 -260 -313 -2 280 197 -98 -218 -82 108 152
5235 152 20 -120 -149 -34 136 183 17 -216 -226 33 308 213 -152 -351 -133 217 293 5 -268 -195 74 214
5257 214 76 -123 -180 -38 125 145 20 -162 -196 3 217 218 -44 -287 -202 120 319 127 -195 -275 -24 233
5279B33l9k60j44J18K10Q0j63j86k9J69J91J5k08k13J6K45K41r8k96j91J68L04
5301A63Q7k22k46L2K20J67j02k33p0J55K01L7j83k13oK27K21l6k62k04Q9K80J64
5324B66j57k76o6J88K22k2k11j55R6K40Q8j49k33n1K12K43j3k39k29O3K58J84
5346B59r6k51j30J33K06P9j62k02J2J90J60p2k41j19J43K68N6k15k49k0K69K22
5368B40o9k50j75J22K11J07j29j84m6J40J80kj88j56N7K51J29j58k66q5K31K80
5390B40pk80k20Q8K76J34j27k03p1J26J46L4j23j37j2J70J57m1k37j66J39L09
5412A95R6k42l04J5K73K37r5k74j13J33J85L2j22j22j5J10J25Rj36j83J7K40J88
5435B49j28k91j37K42L09Ok86k37R5K78R2j35j84rJ35J13oj09r8j9J34J68j1k27
$$ plain form
5279 233 194 -66 -210 -92 118 198 35 -151 -180 -11 180 195 -13 -226 -210 35 276 178 -118 -309 -141 163
5301 163 250 28 -218 -186 34 201 99 -134 -204 -49 152 189 6 -207 -213 14 235 199 -63 -267 -178 102 266
5324 266 109 -167 -233 -45 177 155 -56 -211 -115 125 213 64 -169 -220 -8 235 222 -17 -246 -183 75 259
5346 259 163 -88 -218 -85 121 200 38 -164 -152 38 198 126 -115 -234 -91 177 233 18 -231 -251 18 240
5368 240 171 -79 -254 -132 79 186 57 -127 -173 -33 147 145 -43 -199 -142 109 238 80 -186 -271 -40 240
5390 240 233 -47 -267 -179 97 231 104 -99 -170 -44 102 136 13 -124 -136 34 191 150 -87 -253 -114 195
5412 195 291 49 -255 -240 33 270 175 -99 -212 -79 106 138 16 -106 -121 -11 114 123 -13 -196 -179 61 249
5435 249 121 -170 -307 -65 244 250 -36 -273 -178 100 192 57 -127 -136 -1 112 106 -3 -101 -120 14 182 171 -56
5459e6k02J05L18J53k22l47rK94K23j09k71p5J66J77k4j51q2K9R9R6Jj16j69K
$$ plain form
5459 -56 -258 -153 165 318 96 -251 -260 34 257 148 -123 -198 -32 145 121 -30 -112 -83 16 112 113 -3 -172 -170
$$ [...]
8191c7
##END NTUPLES=NMR FID
##END=
