##TITLE=1H_LY823.60
 CCl4, 8 sc, 
 29.5.2019
##JCAMPDX= 6.0         $$ Bruker NMR JCAMP-DX V2.0
##DATA TYPE= NMR FID
##DATA CLASS= NTUPLES
##ORIGIN= UXNMR, Bruker Analytische Messtechnik GmbH
##OWNER= root
$$ XWIN-NMR		Version 3.5
$$ Wed May 29 15:44:55 2019 Russian Standard Time (UT+4h)  she@DPX200
##.OBSERVE FREQUENCY= 200.13155
##.OBSERVE NUCLEUS= ^1H
##.DELAY= (6, 6)
##.ACQUISITION MODE= SIMULTANEOUS
##.ACQUISITION SCHEME= undefined
##.AVERAGES= 8
##.DIGITISER RES= 18
##SPECTROMETER/DATA SYSTEM= spect
##.PULSE SEQUENCE= zg30
##.SOLVENT NAME= CDCl3
##.SHIFT REFERENCE= (INTERNAL, CDCl3, 0, 15.7039)
##AUDIT TRAIL= $$ (NUMBER, WHEN, WHO, WHERE, WHAT)
$$ ##TITLE= Audit trail, XWIN-NMR		Version 3.5
$$ ##JCAMPDX= 5.01
$$ ##ORIGIN= Bruker BioSpin GmbH
$$ ##OWNER= she
$$ F:/spectra/data/she/nmr/H-F/1/audita.txt
$$ ##AUDIT TRAIL=  $$ (NUMBER, WHEN, WHO, WHERE, WHAT)
(   1,<2019-05-29 15:43:40.92 +0400>,<she>,<DPX200>,
      <created by zg, POWCHK disabled, PULCHK disabled
       configuration hash MD5:
       00 E9 B6 7A A2 85 ED C7 34 08 36 98 17 FE 4E 26
       data hash MD5: 16K
       BF 63 09 C7 6E 52 E9 69 E4 41 26 DF 95 86 C9 5E>)
$$ ##END=
$$ 
$$ hash MD5
$$ 47 8D 35 F6 1E DA 9B 43 AF 59 61 21 3A 3E E3 29
##$RELAX= 
##$RELAX= 
##$RELAX= 
##$RELAX= 
##$RELAX= 
##$RELAX= 
$$ Bruker specific parameters
$$ --------------------------
##$DU= <F:/spectra>
##$EXPNO= 1
##$NAME= <H-F>
##$PROCNO= 1
##$TYPE= <nmr>
##$USER= <she>
##$AMP= (0..31)
100 100 100 100 100 100 100 100 100 100 100 100 100 100 100 100 100 100 
100 100 100 100 100 100 100 100 100 100 100 100 100 100 
##$AQSEQ= 0
##$AQ_mod= 1
##$AUNM= <au_zg>
##$AUTOPOS= <>
##$BF1= 200.13
##$BF2= 200.13
##$BF3= 200.13
##$BF4= 200.13
##$BF5= 200.13
##$BF6= 200.13
##$BF7= 200.13
##$BF8= 200.13
##$BYTORDA= 1
##$CFDGTYP= 0
##$CFRGTYP= 5
##$CHEMSTR= <none>
##$CNST= (0..31)
1 1 145 1 1 1 1 1 1 1 1 1 1 1 1 1 1 1 1 1 1 1 1 1 1 1 1 1 1 1 1 1 
##$CPDPRG= <>
##$CPDPRG1= <>
##$CPDPRG2= <>
##$CPDPRG3= <>
##$CPDPRG4= <mlev>
##$CPDPRG5= <mlev>
##$CPDPRG6= <mlev>
##$CPDPRG7= <mlev>
##$CPDPRG8= <mlev>
##$CPDPRGB= <>
##$CPDPRGT= <>
##$D= (0..31)
0 1.2 0 0 0 0 0 0 0 0 0 0.03 0 0 0 0 0 0 0 0 0 0 0 0 0 0 0 0 0 0 0 0 
##$DATE= 1559130220
##$DBL= (0..7)
120 120 120 120 120 120 120 120 
##$DBP= (0..7)
150 150 150 150 150 150 150 150 
##$DBP07= 0
##$DBPNAM0= <>
##$DBPNAM1= <>
##$DBPNAM2= <>
##$DBPNAM3= <>
##$DBPNAM4= <>
##$DBPNAM5= <>
##$DBPNAM6= <>
##$DBPNAM7= <>
##$DBPOAL= (0..7)
0.5 0.5 0.5 0.5 0.5 0.5 0.5 0.5 
##$DBPOFFS= (0..7)
0 0 0 0 0 0 0 0 
##$DE= 6
##$DECBNUC= <off>
##$DECIM= 24
##$DECNUC= <off>
##$DECSTAT= 4
##$DIGMOD= 1
##$DIGTYP= 9
##$DL= (0..7)
0 120 120 120 120 120 120 120 
##$DP= (0..7)
150 150 150 150 150 150 150 150 
##$DP07= 0
##$DPNAME0= <>
##$DPNAME1= <>
##$DPNAME2= <>
##$DPNAME3= <>
##$DPNAME4= <>
##$DPNAME5= <>
##$DPNAME6= <>
##$DPNAME7= <>
##$DPOAL= (0..7)
0.5 0.5 0.5 0.5 0.5 0.5 0.5 0.5 
##$DPOFFS= (0..7)
0 0 0 0 0 0 0 0 
##$DQDMODE= 0
##$DR= 18
##$DS= 0
##$DSLIST= <SSSSSSSSSSSSSSS>
##$DSPFIRM= 0
$$ [...]
##$SUBNAM2= <"">
##$SUBNAM3= <"">
##$SUBNAM4= <"">
##$SUBNAM5= <"">
##$SUBNAM6= <"">
##$SUBNAM7= <"">
##$SUBNAM8= <"">
##$SUBNAM9= <"">
##$SW= 24.9336996594482
##$SWIBOX= (0..15)
0 0 2 0 0 0 0 0 0 0 0 0 0 0 0 0 
##$SW_h= 4990.01996007984
##$TD= 16384
##$TD0= 1
##$TE= 0
##$TE2= 300
##$TE3= 300
##$TEG= 300
##$TL= (0..7)
0 120 120 120 120 120 120 120 
##$TP= (0..7)
150 150 150 150 150 150 150 150 
##$TP07= 0
##$TPNAME0= <>
##$TPNAME1= <>
##$TPNAME2= <>
##$TPNAME3= <>
##$TPNAME4= <>
##$TPNAME5= <>
##$TPNAME6= <>
##$TPNAME7= <>
##$TPOAL= (0..7)
0.5 0.5 0.5 0.5 0.5 0.5 0.5 0.5 
##$TPOFFS= (0..7)
0 0 0 0 0 0 0 0 
##$TUNHIN= 0
##$TUNHOUT= 0
##$TUNXOUT= 0
##$USERA1= <user>
##$USERA2= <user>
##$USERA3= <user>
##$USERA4= <user>
##$USERA5= <user>
##$V9= 5
##$VALIST= <valist>
##$VCLIST= <CCCCCCCCCCCCCCC>
##$VD= 0
##$VDLIST= <DDDDDDDDDDDDDDD>
##$VPLIST= <PPPPPPPPPPPPPPP>
##$VTLIST= <TTTTTTTTTTTTTTT>
##$WBST= 1024
##$WBSW= 4
##$XGAIN= (0..3)
0 0 0 0 
##$XL= 0
##$YL= 0
##$YMAX_a= 72405
##$YMIN_a= -92757
##$ZGOPTNS= <>
##$ZL1= 120
##$ZL2= 120
##$ZL3= 120
##$ZL4= 120
##$ABSF1= 10
##$ABSF2= 0
##$ABSG= 5
##$ABSL= 3
##$ALPHA= 0
##$AQORDER= 0
##$ASSFAC= 0
##$ASSFACI= 0
##$ASSFACX= 0
##$ASSWID= 0
##$AUNMP= <proc_1d>
##$AZFE= 0.1
##$AZFW= 0.1
##$BCFW= 1
##$BC_mod= 2
##$BYTORDP= 1
##$COROFFS= 0
##$CY= 11.3945322036743
##$DATMOD= 1
##$DC= 2
##$DFILT= <>
##$DTYPP= 0
##$F1P= 18.9103706918063
##$F2P= -1.10871071338519
##$FCOR= 0.5
##$FTSIZE= 0
##$FT_mod= 4
##$GAMMA= 1
##$GB= 0.15
##$INTBC= 1
##$INTSCL= 1
##$ISEN= 128
##$LB= 0.24
##$LEV0= 0
##$LPBIN= 0
##$MAXI= 10000
##$MC2= 0
##$MEAN= 0
##$ME_mod= 0
##$MI= 1.114404
##$NCOEF= 0
##$NC_proc= 0
##$NLEV= 6
##$NOISF1= 3.799351
##$NOISF2= 2.8
##$NSP= 1
##$NTH_PI= 0
##$NZP= 0
##$OFFSET= 15.70392
##$PC= 1
##$PHC0= -8575.837
##$PHC1= 14.00025
##$PH_mod= 1
##$PKNL= yes
##$PPARMOD= 0
##$PSCAL= 0
##$PSIGN= 0
##$REVERSE= no
##$SF= 200.130013532006
##$SI= 16384
##$SIGF1= 3
##$SIGF2= 2
##$SINO= 400
##$SIOLD= 16384
##$SREGLST= <1H.CDCl3>
##$SSB= 0
##$STSI= 0
##$STSR= 0
##$SW_p= 3612.71676300578
##$SYMM= 0
##$S_DEV= 0
##$TDeff= 0
##$TDoff= 0
##$TI= <>
##$TILT= no
##$TM1= 0
##$TM2= 0
##$TOPLEV= 0
##$USERP1= <user>
##$USERP2= <user>
##$USERP3= <user>
##$USERP4= <user>
##$USERP5= <user>
##$WDW= 1
##$XDIM= 8192
##$YMAX_p= 0
##$YMIN_p= 0
$$ End of Bruker specific parameters
$$ ---------------------------------
##NTUPLES= NMR FID
##VAR_NAME=  TIME,          FID/REAL,        FID/IMAG
##SYMBOL=    X,             R,               I
##VAR_TYPE=  INDEPENDENT,   DEPENDENT,       DEPENDENT
##VAR_FORM=  AFFN,          ASDF,            ASDF
##VAR_DIM=   8192,          8192,            8192
##UNITS=     SECONDS,       ARBITRARY UNITS, ARBITRARY UNITS
##FACTOR=    0.0002004,     1,               1
##FIRST=     0,             0,               0
##LAST=      1.6414764,     0,               0
##MIN=       0,             -92757,          0
##MAX=       1.6414764,     72405,           0
$$ Real data points
##PAGE= N=1
##DATA TABLE= (X++(R..R)), XYDATA
0@%%%%%%%%%%%%%JrJ6j6J6j6J6k0K8l2L2l7M5m8N5o3O9p7Q7r9J09j20J34j48J63
38H6j83K03k22K46k73L03l36L73m17M66n22N91o75P78r09J077j307J641k150L008
58A778m695R048l7064o1824J63033m6063j09042J37257J245j33757Q3090M6788
70D9794r7130M7112N1546p9193J0841L9328m3068J9308L0093m2182R647J7639
82A3735l7272K0077K9491l5139M170K0714k9783J525K5314j0212j298K056j1044
95g666Q897l708p543K8317j0030l1059L2264J475m0040L7478K1239n2013J5659
108f730L0303m3833Q321L9265l2938m728K7376k9042j91L0560k5081K012K7502
121B2796l8272k734M4142l3013j3003N2497l0565l7331N4466n240m4921M5280
$$ y = [0, 0, 0, 0, 0, 0, 0, 0, 0, 0, 0, 0, 0, 0, 1, -8, 8, -8, 8, -8, 8, -12, 16, -16, 16, -21, 24, -24, 31, -32, 37, -40, 47, -52, 57, -63, 71, -77, 86, -97, 106, -116, 130, -143, 160, -176, 197, -220, 246, -276, 315, -360, 418, -491, 586, -721, 920, -1230, 1778, -2917, 6131, -30933, -92757, 70276, 24213, -84829, 52428, 53673, -80084, 3006, 49794, -47336, -224, 51322, -27871, -17030, 22298, -20770, -1462, 28631, -13551, -3904, 13735, -23537, -3460, 26031, -9108, -4938, 15776, -14007, -12482, 12832, 2620, 1322, 3378, -7666, 1231, -2477, -10020, 18297, 8267, -22792, 9472, 10947, -29093, 8385, 29624, -22389, -6730, 23573, -20260, -11939, 27326, -5612, -10340, 17036, -12006, -12197, 18363, -6718, -4706, 22796, -15476, -18210, 25932, -7081, -20084, 32413, 1848, -35483, 18983, 13743, -31178, 14102]
133A4102J2582n4238K0351K9177l6081O070L0064k4343j0722J8625o687l597J0644
146E947l061k114k360o561J0346L732j0803R087K563j8366Q061J2755j3721L935
160e60J1061j6433j656J3597q397O28J1490j2418m138J2026q447j671J5214r021
174A275r253J2555m744q213J4324K27j1691O151J126p221O263K813m216K843l239
189a000l709P330k358l565J0073n004j0910J1841J788j2411J0819O349j6657L364
203d050J1338j1529j67J3357q029p686R090j188n433O488J778n242k96R84LN40
219d2M08K242j436n034K917L204m245K645L946p066r21O082l942p91O900m090
235G77m812N216j195k929N953m01n248K688L97l220L591J809l097N80k77k048
$$ y = [14102, 26684, -27554, -7203, 21974, -14107, -8037, 22027, -2316, -13038, 5587, -1100, -4697, 5947, 2886, 772, -1588, -8149, 2197, 5929, -4874, 4213, 6776, -11590, -3529, 9226, -4495, -560, 10501, -5932, -7588, 6009, -2388, -1760, 9730, -2688, -6826, 5200, -3247, -4918, 10296, 1275, -7978, 4577, -167, -8380, 5944, 6171, -5520, 631, 1757, -5464, 799, 3612, -604, 2239, -1000, -4709, 2621, 263, -3302, 6771, 1767, -9143, 2698, 4486, -7925, 2894, 9243, -7414, -4050, 7288, -4241, -4408, 8949, 920, -6766, 2324, 1136, -4297, 2191, 3969, -1273, -1569, -585, -582, -42, 366, 2608, 1172, -3862, -945, 2259, -1986, 659, 4605, -2461, -3382, 2700, -1242, -2033, 4867, 777, -4035, 1181, -14, -2943, 3010, 2609, -2639, 49, 446, -2774, 817, 2626, -471, 109, -168, -2216]
251b216K320J123r60J237j866k125L082k17j677L870j052m823L205J484l815L507
267A077K599n790J19L911l184j35M502k249k942K324j91j536K208J229j836j201
283a095M66P04m11L73J797j452k415K111O03k321K583J742m328N1L156k574k10
300a220M003k224k813K960l69k362K992J150l021J85J139j380N00J797o19j151
316d33kJ59n7J15J023L30j712m19J271o24o3K009j020k085J517M43j628J643J297
335A764k374k86J429j185K1K079p91j588Q40J26p57R52P33q66m42J80j86P2O65
354C86L43o11o76K50L31k16M28N06q35n13O15j39k05R91jj167R6N50l89K08P34
375F86m75o82L57R9l04M69N26n79o26L39K81k37L18M38p02n02P01L1n87Q23M18
$$ y = [-2216, 104, 1227, 267, 1504, -362, -2487, 595, 378, -1299, 2571, 1519, -3304, -99, 1385, -2430, 1077, 3676, -2114, -1995, 1916, -1268, -1403, 3099, 850, -2092, 232, 41, -1495, 713, 1942, 106, -1095, -629, 75, -336, 37, 1834, 382, -2033, 78, 681, -1640, 943, 2685, -1643, -1592, 1564, -1010, -1220, 2783, 559, -2254, 706, 337, -2025, 967, 2117, -904, -719, 420, -960, -460, 1337, 718, -433, -435, -276, -333, -218, 805, 1135, -577, -996, 275, -349, -412, 1597, 577, -1508, 9, 452, -1176, 467, 1764, -610, -896, 533, -652, -631, 1448, 657, -931, -91, 35, -722, 230, 963, 97, -345, -165, -351, -279, 386, 729, 118, -558, -308, 23, -193, 235, 741, -94, -607, 8, -131, -336, 655, 654, -513, -417, 133, -256, -48, 686, 211, -471, -114, -15, -319, 150, 676, 97, -529, -190, 91, -146, 172, 610, -92, -594, 107, 138, -449, 374, 792]
396G92j308r0J066n67l17J248m89j283J008N07j220N92J122j324n27J271m29p23
414f71J243Q3j441N06R30r87j46J237n15r84Q65L02j060N98R47j191m56J312m15
433A57r46J230K20j404O23Q03j286J78J393r63p90J244k48r43J045L03j133L97
451a20O12q34k3Q86l11n52L57J06l54J87M07l43l29M29O6n26L28M78n85j36N42
472B85l81j95O93k94n07N94k7n40M97R1m61L75N1n65M21K41n02K59J84n07K76
493a2K72n44K55L84n44RL99l89J09M11m86q6M43k73j05L88k25j17K69k59n3L48
515A94j37j08J26k21R6K85l50L6L26m07j4M60l93j03O18m25m55P16l0n87N22J15
537B64o62L45M06n66L9N32l56l12L74P5k75J47J56k64j11L56j0l61K22K65m54
$$ y = [792, -516, -606, 460, -107, -424, 824, 335, -948, 60, 567, -653, -61, 1061, -263, -790, 481, 52, -671, 572, 655, -786, -280, 650, -337, -483, 754, 239, -745, 120, 422, -638, -40, 907, -284, -740, 572, 157, -789, 441, 661, -743, -120, 683, -603, -425, 968, 5, -785, 459, 211, -732, 313, 616, -517, -120, 492, -342, -365, 521, 210, -342, 15, 121, -233, -46, 361, 18, -311, 118, 184, -342, -14, 464, -121, -257, 285, -96, -291, 402, 108, -399, 195, 168, -372, 125, 216, -245, 130, 181, -384, 37, 278, -224, 35, 219, -288, -12, 260, -284, -29, 355, -189, -180, 219, -170, -61, 350, -136, -222, 221, -52, -157, 231, 6, -111, 158, -101, -154, 194, 57, -51, 75, -146, -50, 235, -115, -79, 247, -160, -174, 286, -107, -210, 408, -17, -472, 244, 214, -373, 149, 264, -398, -53, 353, -213, -174, 358, 2, -310, 64, 139, -136, 11, 167, -97, -208, 148, 138, -223, -1, 264, -190]
558a90l2M82k52k14M55k04m42N42J49n66K46K98m77O5M03l21r8M13k49l07L80
579H1J26l27J01J57k52KK98j43k17K85K8l72J86K97l41lL37l89r0N59l05l64N92
602B46j03n27N34P0o31N16K70q03L48N32p66J20O65p07l6P56o44k76Q90l68n16
623d30P21j89n15O52l1n67M98J00n17L08J30l06K60m1k71K95q5j39L71l21j95
644b72O39m06m22R13k83p47R68j48r90J102K10j357R08N50j413O90Q50j407M31
663a84J032j455J77J315j228j12J308j187k94J486j007n48J496p91q09J433n05
680A27q71J372l79j068J242j06j004J073o8r98J025Pj028R73J07j017Q56J04r72
699f25R17J13j066R02J76j077R52J30j246J143L13j560J136O24j842J024J038
$$ y = [-190, -222, 260, 8, -206, 249, 45, -397, 145, 294, -272, -26, 272, -205, -140, 263, -58, -156, 257, 8, -299, 81, 207, -120, -19, 138, -114, -112, 186, 43, -174, 111, 139, -233, -47, 250, -91, -94, 243, -146, -236, 323, 18, -346, 246, 143, -384, 150, 220, -411, 105, 375, -428, -80, 452, -314, -194, 471, -236, -272, 484, -160, -436, 454, 86, -430, 291, 102, -413, 239, 208, -359, 139, 239, -278, 30, 160, -146, 114, 73, -198, 97, 12, -127, 244, -77, -272, 367, -39, -461, 452, 169, -578, 390, 242, -748, 354, 564, -793, 115, 665, -748, -58, 792, -615, -184, 848, -607, -430, 885, -343, -455, 853, -334, -628, 858, -149, -697, 799, 8, -801, 632, 127, -744, 628, 249, -819, 423, 317, -687, 386, 318, -680, 345, 352, -676, 297, 404, -613, 243, 347, -625, 292, 405, -661, 241, 417, -660, 292, 422, -824, 319, 632, -928, 208, 832, -1010, 14, 1052]
716A052k012P17J513k105J51J995j721m63K031j318r11K020p31j213J663l24j252
733i08J301m1j027J077p3j028R09R8q13Q12k8q45Q06J9p93Q34M1q85P80Qq73R58
755C29J53j163Q72L10j244Q54O07j405O08Q94j434K72J188j163j15J132r03k86
773d94J092o38l95Q68m84k95P64n45k16Q79o54l58J018n65n54J110l81q49J143
792D46o9j090Q65L31r94N27M45q45K77M78o02J21M17m54P9K28l66K46K34m78J68
813c6K49m57K21L30m84J10L27m68P2M10l68L4L21m85M4N17m05j01M95m14k13N69
835B68k45k80N23j60m30L56R6k59J99K3k11J13j0j6J33j45oK20k92q0M57j95k88
858b29L93q5l50L56Q7l70K05J89l28L3J92o9j2J9l6Pm7M0J18j66KK32k38j33L54
$$ y = [1052, -960, -243, 1270, -835, -684, 1311, -410, -873, 1158, -160, -1071, 949, 218, -995, 668, 344, -908, 393, 352, -675, 402, 329, -699, 210, 308, -505, 307, 279, -566, 240, 259, -534, 300, 341, -544, 236, 244, -629, 329, 482, -681, 191, 501, -743, 111, 718, -687, -79, 815, -619, -347, 841, -322, -437, 695, -208, -494, 598, -40, -435, 433, -51, -346, 418, -127, -343, 536, -118, -476, 542, -23, -577, 533, 152, -697, 446, 377, -713, 152, 483, -511, 16, 461, -384, -107, 371, -231, -110, 307, -147, -68, 160, -206, 40, 274, -204, -36, 213, -244, -23, 307, -177, -67, 260, -208, -136, 274, -94, -60, 261, -224, -180, 337, -68, -169, 326, -88, -301, 268, 23, -257, 266, 106, -324, 32, 128, -131, 68, 91, -120, -7, -17, -33, 100, -45, -51, 169, -123, -203, 254, 59, -229, 164, 79, -271, 85, 172, -198, 7, 196, -132, -99, 93, 24, 12, 31, -5, 2, -45, -5, 113, -53, -51, 181, -57, -190, 164]
883A64j03k05L26j67k44L76l3l36L59N0m30K70J37l80K66K14m63Q9L04l11M2K70
905A95k65j3J83j73NJ98j20j0K2j59J52J23k45J42J06l12J24K33l52J39L15m38
927a50l2L91k70m8L87l41j48M20k36k01M69j62k89L67j38k86M54nm25L29P3l97
949b38K65J59l47J68J79l53Q7K33k04M2J06k04P3J31j68O0J06j80J07M0k05J71
971B8J39k94R8J63k78R1K55l07j1L32k82j33L65j41j70L02j51k11L20Jk62K00
993E4P3k54J24Q9j88J40R3k05K3J01r1N8N5j26N9M7j27N5Q3q2L9K8j49O0J48j37
1019c0j1J35j36k1J08p3k5J41p4j22Q9K5j2K3j8k6K1j1jL3k4K1L3j02j4J60m7
1046D2j05J09j6j23J03P0j43O4J10j70m5J76j8j02J05j4j36P5J09j20k0J50o7
$$ y = [164, 61, -144, 182, 15, -229, 147, 114, -222, 137, 187, -243, 27, 164, -216, 50, 264, -199, -110, 194, -117, -75, 195, -70, -83, 100, -73, -68, 130, 10, 0, 22, -137, 15, 138, -107, 35, 141, -171, -47, 186, -166, -27, 288, -150, -182, 209, -61, -109, 278, -63, -211, 209, -27, -228, 241, 79, -210, 157, 19, -267, 187, 182, -243, 86, 159, -238, 27, 186, -161, 7, 186, -167, -80, 153, -51, -9, 97, -107, -34, 97, -71, -11, 95, -85, 22, 62, -143, 28, 167, -127, -29, 134, -144, -53, 202, -105, -116, 216, -66, -199, 166, 25, -145, 157, 6, -205, 115, 116, -146, 54, 127, -127, -3, 86, -102, 38, 131, -74, -51, 50, -41, 17, 72, -54, 5, 52, -75, -20, 63, -19, 20, 48, -101, -41, 107, -30, -41, 94, -42, -63, 45, -28, -53, 88, 14, -108, -19, 6, -6, 17, -1, -27, -6, -17, -18, 15, -9, 12, 45, -57, -71, 89, 42, -63, 46, 30, -93, 10, 80, -63, 1, 111, -59, -104, 72, 54, -48, 57, 43, -93, -18, 91, -29, -49, 101, 34]
1069C4j25Q2O5p0K9L1q8m3J42j8r3P6N6j52lJ25n3j6J07q4j36J27R9j48L3J07
1095H4j31m3J42l9o1J38k6j95O7J41r1j7J17p6j13J15M8j11P1J15j74r7J81J8
1119F3j30J37nj84P2J28j29RJ74j21j40J14M5o0P7J1j14k3R3J6o6M9N0r6q4J09
1145eN6p5O6K1j75L9J60r7n2J56o5j52J15M6p4P8M3j57j2R8J2k0K3J0n9m0M8N0
1173C8j9K3Oj29J9J47p9m5J48j04j21J44K2j34J56N3k44L6J70j18KJ37j15r8J27
1198B2Qr6P8Q5j25p0Q3N1o0L1P4j47l6J70n1j22J65L5k17O3J49j51L2J63j77q0
1224a23J75l8j03J38J9j11L3Pl5O2L7n9l0nL8K6n0L8M4j07JP5p0M1J06j35q4J76
1252F6o5p4J66n0j43J67l7j51J82L7j83R2K5j40J47L5j56J24J2j74J36N9j94J93
$$ y = [34, -91, -9, 56, -14, 15, 46, -42, -85, 57, 39, -54, 22, 78, -74, -77, 48, -5, -21, 86, 2, -134, -7, 92, -56, -23, 84, -47, -90, 52, 13, -48, 90, 64, -131, -64, 77, -14, -31, 86, 10, -103, 12, 60, -51, 20, 135, -39, -136, 45, 63, -67, 70, 65, -119, -47, 81, -48, -39, 135, 14, -126, -12, 33, -27, 50, 61, -53, -76, 17, 33, -33, 16, 66, -30, -114, -5, 51, -24, 42, 63, -112, -73, 87, -10, -62, 94, 29, -123, -8, 38, -36, 42, 85, -72, -84, 14, 26, 6, 29, 39, -20, -60, -12, 38, 19, 42, 48, -81, -62, 85, 6, -39, 109, 5, -116, 28, 50, -84, 72, 125, -119, -83, 87, -31, -29, 108, -7, -105, 22, 30, -66, 12, 97, -28, -98, -15, 36, -24, 7, 81, -66, -102, 68, 17, -105, 60, 95, -122, -59, 90, -61, -29, 134, -43, -123, 52, 14, -89, 49, 68, -43, -10, -3, -38, 24, 61, 2, -28, -33, 5, 31, -19, 19, 63, -44, -43, 32, -38, 3, 109, -26, -110, 66, 1, -73, 93, 43, -100, 67, 30, -121, 61, 98, -85, 7, 32, -108, 39, 74, -82, 42, 54, -120, 16, 75, -119, 74]
1276G4M6l04J41J98k94J14K33l31J7K87k74n1L65k10j72K76j32j26K95j05j74
1297a27K21q4j29K20o9q8J94j61j20K64j15r8K69j96j71L56j60k13M29j44l37
1318b59M05n2l87M63M9n43L69J70n27L27K85n48K05L30n56J53M24m44K3L70m26
1339a69JM28l64l6M14l60j21M33k86j04M49k95k19M10j76j93L90j59k30L43j35
1360B1k23L68q7k28K88j47k07L94j06k59L63j22l16M13m6l50M30k0m72L74J20
1381A88m68L74J66n57K77L01n48K08M10n39M5M36m76k0N32l79j89M68k46k49M47
1402A81r7k99L61p6k96K80N2k14J74j2j94J69Pj26J74l6j50J54n3j19K28l6j98
1425a26J97m0j96K74Kk61K19N5l27K26J46l22J73J71l84J22K76l22J5L34l18q6
$$ y = [74, 120, -184, -43, 155, -139, -25, 208, -123, -106, 181, -93, -144, 221, 11, -161, 115, -17, -143, 152, 47, -127, 94, 10, -119, 101, 32, -56, 138, -23, -143, 121, 6, -92, 177, -19, -190, 166, 6, -207, 222, 78, -259, 146, 94, -293, 170, 219, -324, 45, 215, -312, 15, 300, -248, -43, 287, -269, -116, 308, -136, -113, 257, -169, -168, 260, -104, -140, 274, -86, -207, 226, -60, -164, 285, -10, -229, 181, 5, -188, 202, 43, -187, 156, 21, -202, 166, 79, -149, 139, -8, -215, 179, 73, -186, 177, 55, -261, 152, 106, -244, 186, 166, -306, 68, 188, -280, 94, 260, -297, -20, 281, -267, -59, 351, -188, -143, 293, -183, -203, 329, -50, -239, 229, -17, -266, 181, 84, -215, 146, 70, -226, 54, 106, -108, 66, 54, -140, 29, 36, -90, 84, 48, -102, 52, -1, -120, 108, 72, -126, 71, 31, -165, 109, 111, -150, 69, 124, -203, 23, 169, -153, 20, 191, -193, -71, 205, -117, -102, 232, -86, -172]
1447a72L47k00j48L82j68k58L11m0k22K57L7k79J70R0k47J35J41k00M7O6j11M9
1469a3J04j17J6N1q0L6L8o9P8Pj15Q1J7q9J23nj63J32M3j75J17R4j83O1J17k13
1495a07N9K06k00l5J83j53m6J91j04q3J74p4j12J34mq2J01l4r7J00Jo7O4J3n0
1520b2J9j5k6O5J4m6K3k4j7M7j4j6K9k3k1M4k8J0O8p8l5P9k8l8R4n5o2J00k7r3
1550g6J21Mp7M1Mp0P5K1p7L0K8n9M3J3l3L3Mp5L8L0l6M5po7O2Lo4O4K2p3N0Oq0
1583e7O8M1q6L0M1q2M4M1q1K8O8q5j6P6m2J3M1o1rM2l3J1M1m4ML7p1J0Q7o6j1
1614b1N6o0j4Q0l6m9P0op8N5K6k6K2j5l2NK5r%Pl1K5nj3M0J6n5QJ1k6M0K2m1k
1648a1K1k4rL7j6J4lm3J0M1Qk1J2k1j3K3j1J2K7j8k9j3K2J3J4k2j0LroL1j1J6
$$ y = [-172, 175, -25, -173, 209, 41, -217, 94, 54, -168, 89, 126, -153, 17, 107, -140, -5, 136, -64, -17, 49, -62, -13, 91, -26, -10, 41, -39, -3, 35, -34, 44, 51, -64, 17, 34, -55, 68, 63, -100, 32, 75, -100, 17, 111, -72, -11, 106, -107, -48, 158, -42, -77, 106, -47, -93, 98, -6, -89, 85, 11, -101, 33, 29, -53, 48, 14, -83, 17, 18, -49, 15, 28, -22, -3, -18, -44, 21, 35, -11, 12, -12, -29, 18, 4, -12, 17, -6, -27, 17, -11, -1, 67, -11, -46, 33, 5, -33, 61, 6, -56, 44, 17, -76, 45, 49, -28, 13, 17, -53, 22, 43, -34, -4, 24, -35, 8, 21, -12, 21, 25, -50, -12, 18, -18, 27, 20, -47, 15, 18, -46, 18, 40, -33, 17, 23, -57, 11, 52, -34, -4, 37, -45, -1, 40, -41, -13, 55, -30, -46, 30, -12, 1, 42, -19, -28, 14, -19, -8, 33, -11, -7, 30, -41, -31, 56, -10, -21, 35, -25, -39, 41, 5, -44, 26, 20, -58, -3, 23, -3, 19, 4, -28, -23, 2, -7, -7, 0, -31, -6, -11, -24, 16, 32, -23, -15, -4, -30, 10, 32, -9, -11, 10, -14, -23, 14, -2, 12, 9, -34, -24, 17, 25, 4, 16, -5, -18, 5, -6, 6, 33, 15, -14, -27, -5, 8, 22, 0, -10, -7, -16, -22, 9, -2, 14]
1681A4Qn3qM3K1k0Jkm0L5K3k6KK1m4j8L2J2J8j8ol1J8K6j0rK1k0nqK4NJ1jk7k6
1717c7L7K3k8RJ1l5j2J9PJ8J8m1k0K3PJ9J3k7j3LpkL4%k1Jm0K5M2j6pnj3pL1j3
1753dJ1J7l3l5J2M0JJ4j9m2J8K2j2L3J6m5j9KjL6J1j5l2JLK7J5k2J7k2l5K6M0
1786B6j1NJn7JO4j7JJ5l0l1K2J2j5N1j9n3NOL2J6ok6%k3mN3kj1Lm0l3O8J8l2J6
1822Ej7l2K8K7pK1Jn2rK4K0K1ln2mJ7lK9K5k7j6j3l2M7L6j5j8j6l2M0M8k4MJ4
1856C5q5J5L9pJ2M8p1m6O6j0jO2m1n0K7ok0N8K4n4nk7lP6j5l1L0l5m8J02j7m0
1888a8P7l9j08P7O2p6O2Pj00K8N2o0M7O3r8MM1o1N5O6q0k5O2r2K9J08q4j6P4j11
1918e4l3J31k1m8Q1q1o0J25k2n7J16o7j08J19k4m2J15k1j50R2K6r0J16L2j28M1
$$ y = [14, 22, -31, -39, 4, 25, 5, 6, 4, -36, -1, 22, -4, -2, 19, -25, -43, -11, 1, 19, 1, -5, -36, -18, 8, -2, -11, 10, -10, -15, -23, 1, 6, 17, 16, -11, -37, 0, 23, -5, 4, 15, -20, -32, -13, -6, 12, 30, -11, -31, -8, -1, 18, 31, 4, -9, -6, -13, -15, 19, 19, -2, -1, -41, -16, 26, 10, 3, -2, -15, -22, 9, -4, 7, 24, -9, -44, -32, 8, 9, 23, 4, -38, -20, 2, -10, 23, 39, -6, -25, -23, -24, 12, 23, 8, -24, -23, -20, 7, 22, 0, 17, -5, -40, -14, 26, 15, 20, 21, -36, -35, 29, 12, 13, 28, -2, -33, -11, 1, -14, 37, 18, -35, -30, -24, 8, 24, 18, -8, -8, -31, -35, 18, 16, 5, 8, -32, -65, 3, 21, -11, 5, -12, -44, -16, 11, 4, 25, 26, -26, -35, -11, 9, 30, 27, -25, -29, -12, -15, 14, 39, 12, -4, -17, -49, -2, 34, 19, 1, -15, -47, -7, 41, 17, 21, 35, -50, -35, 4, -3, 9, 57, -14, -60, 6, -4, -5, 57, 16, -34, -7, -13, -33, 25, 49, -5, -10, -37, -40, 36, 21, -10, 20, -15, -63, 39, 22, -18, 59, 20, -88, -11, 51, -25, 37, 44, -56, -28, 24, -36, 11, 74, -24, -20, 21, -40, 15, 81, 1, -24, 38, -54, -25, 83, -1, -17, 57, -54, -87, 44, 23, -25, 56, -25, -85, 40, 18, -39, 77, 10, -98, 21, -3, -45, 70, 49, -101, -9, 17, -73, 43, 75, -53, -12]
1944a2L7j26R6R2j23M2K1j37J11R3j29M0R3j92K6J55j33M3J43j96m7J77q6k7J54
1969A15j14j01J58p0o1J91o9j36J39p2r2K19n1j26J29m0j43J78J9j53J55l9j89
1992a53J66N9j47J36J3k11J18J04j70J07J01k07L1J21j60Q3J58j82m0J29j26K0
2014e0J70j13n8J12j29j5J74o2n6J13j31n0J73o4n8J42j05r2J57m9r1J86n4j72
2038a22J38Kj08J65J0j67Q9K3j30J24R2j66M6N2j61R4J31j43J1R5j67M2J31j02
2062b1K5J01j57m1J38n2j3J04r8p2J12m3k5J31o8q1P1l8m1J34k7p3N9m6n1J28
2088E6lp6P0m3q2R4J8n1Q4m8j06R1K8p9J02Rj40O3M5j05Q8Q8j55KQ5r1M3J12j16
2117a7l0Q0q6PJ02l9k8M9r1jR2k3j3L6o5k1N5j2LO8q3l3N9m1J3J19q9n1O7n6j8
$$ y = [-12, 25, -101, -5, 87, -36, 6, 27, -110, 1, 94, -35, 5, 98, -94, -68, 87, -46, -3, 140, -56, -103, 74, -12, -39, 115, 1, -100, 58, -12, -73, 118, 49, -87, 52, -20, -112, 107, 56, -70, 59, 19, -124, 54, 73, -80, 75, 36, -153, 13, 72, -75, 61, 74, -137, -19, 85, -85, 22, 123, -84, -53, 68, -92, -9, 149, -33, -73, 56, -70, -50, 120, 7, -51, 61, -68, -83, 91, 29, -27, 86, -45, -95, 78, 14, -44, 98, -7, -99, 58, 9, -82, 104, 50, -122, 16, 18, -90, 75, 85, -82, 7, 30, -100, 24, 116, -50, -4, 48, -113, -19, 112, -31, -20, 75, -92, -50, 81, -21, 4, 105, -52, -93, 45, -7, -20, 84, -14, -86, 26, -17, -42, 89, 21, -60, 11, -27, -68, 66, 39, -34, 25, -21, -72, 56, 53, -23, 47, 4, -78, 16, 34, -17, 67, 19, -87, 4, 32, -47, 55, 64, -76, -13, 32, -73, 15, 103, -52, -50, 35, -56, -13, 99, -17, -47, 33, -53, -46, 56, 17, -11, 38, -53, -54, 38, 15, 2, 38, -27, -48, 7, -5, -2, 66, -17, -50, 9, -32, -19, 100, 11, -40, 27, -29, -47]
2148d7J09l4o2Q1n6o8J13No9P4l9q3R2Rm8P4k0j10Q8K3p6R3Pj19L6N9q9P2M9j08
2178d4K6L8q7O4O5p8KM4r1L9O8o2L1J4q9J7P0o0L7N7r9jP9p5L5Q4j08k1J06r3
2208c2LJ25r3n2R0p3m9J55m2r3R3l1p0R6J9q6O9jj07Q3L2o9P4rj08N9M1o0O3J8
2238D5j00M0L0p8P4O1j13J5N7q0L4R3j02KO8q2j2R7m6j4N0o7l3J00l1l2Q0o0l1
2267c5O6l5j5Q5n6n5O6j6m5J07l4r4Q8j7p9R6L4r0M3J3q6O1N7o9MM2p9J7O0m8
2297a4QM2o2k0O6k8J5L5n3l2P6m0j3P1n1k9N6m3k9Q4j2o3M4qn3P4Qn7M6Mp2L7
2329a3L4l5L6No7L7M0m9K1K0o1K8Qm4O9K1p0RK8m2K8N5p8mO5n8j6O4j8l5N2m8
2361a8k6O8mm1K9ol7M4rj4L4k1l5M4mk6M7j3l0K8nj7L5J2m8K6Kl6K4K9k8mPj9
$$ y = [-47, 62, 28, -34, 47, -9, -77, 36, 41, -28, 46, 7, -76, 16, 25, -23, 51, 31, -79, 9, 32, -44, 49, 56, -63, -27, 32, -57, 15, 64, -44, -18, 20, -67, -3, 62, -16, -14, 30, -61, -22, 46, -16, 15, 29, -60, -43, 27, -33, 4, 61, -38, -39, 40, -35, 0, 84, -24, -45, 61, -32, -29, 96, 3, -49, 41, -32, -81, 74, 32, -61, 32, 1, -69, 27, 46, -40, 29, 28, -79, 4, 36, -33, 41, 32, -76, -17, 24, -36, 27, 45, -55, -15, 15, -63, 11, 72, -41, -26, 31, -49, -15, 78, -24, -22, 46, -36, -48, 49, 3, -11, 39, -28, -61, 39, 8, -24, 56, -4, -35, 31, -4, -19, 66, 10, -45, 21, 5, -40, 67, 33, -61, 27, 10, -69, 27, 61, -29, 14, 27, -59, 2, 59, -10, -6, 36, -43, -26, 34, -14, -6, 36, -26, -46, 20, -8, 7, 42, -11, -43, 33, -7, -20, 51, 0, -29, 27, -16, -45, 39, 27, -36, 8, 0, -53, 21, 29, -28, 18, 22, -50, -13, 21, -14, 22, 27, -40, -3, 37, -12, 9, 29, -32, -4, 4, -40, 29, 50, -20, -11, 17, -25, 3, 58, -20, -24, 41, -17, -33, 31, 13, -22, 30, -18, -44, 24, 20, -21, 8, 2, -35, 9, 0, -14, 20, -1, -36, 8, 4, -22, 25, 12, -18, 10, 5, -12, 23, 35, -13, 13, 15, -21, 3, 32, 4, 0, 7, -12]
2395a2NK9j8KJ6k4lQlKJ1j5j6J2PPnk1J2J3j5pL6k3j8K8k0nM0j7k5K1Ok4QK2j1
2432C%Ok4nL4j1j0MO%OPokmQj6J2RKk4J4jj7MJ9j8MJ1j2qJ7Qj4NQpmJ5j1qJ4j3
2475Aj1PJ6Kj7Plj5K8Kk6%J6j4kOOjlj5QJ5Mj1oKJ2qJOj2QPj4oK3oqQJ7m3J5J3
2518Ij0lJ6j5j4K5Qj4lMqlOpJ2qnRj5J3Lmk5K2Lj4L2Mm5M2J4m3NL4l2JJ7lpJ6
2558A7j9oK1pj3K1j3jK5l9KK9j1j0K8l2lM3k9k7M3ok8L4jm0M9jn7L7K0n3L5J4
2592B2n1L2J6m2K1L1m3jK6k9ML1m5J9M0o0K8K8n3K4L0n6J3N1m8k0O4m0l2O8l3
2623em4P9j4m8N6on4N9Pn9L1J2k7J9Ml6L8Mm4M4ll1M4Jo3O0Qp0L1M0n6kO0n6N
2658a6O1o1j2O6m5k5O4m2oM1l8j2O0m2k1M7k1l5P8m1l9O4j1l8M5j2n0O1Qo0L0
$$ y = [-12, -7, 22, 4, 6, 22, -2, -5, 3, 0, 2, 13, -2, -18, -6, 1, 8, 3, -18, -6, 7, -8, -15, 21, -2, -20, 8, -12, -17, 23, 6, -19, 2, 8, -16, -8, 14, 3, 3, 9, -15, -20, 14, 3, -7, -3, 3, 3, 9, 16, 10, 8, 4, 12, -4, 8, 17, 19, -5, 9, 8, -9, -5, 14, -4, 0, 11, -1, -9, 8, 16, 2, 7, 15, 8, 4, 19, 8, 0, 14, 1, -10, -3, 13, 15, -2, 5, 2, -13, 15, 17, -9, -9, 7, -7, -9, -3, 3, 2, -1, -16, -8, 7, 11, 0, -6, -4, 8, 0, 1, 7, -5, 3, 10, -4, -10, 13, 7, -1, 7, 24, -19, -4, 9, -1, -4, 12, -3, -17, 8, 16, 2, -1, 3, -5, -8, -2, -9, 3, -5, -10, -1, -16, -3, 0, -4, -29, -7, -4, -18, 14, 18, -27, 15, 29, -14, -9, 25, -7, -6, 11, 8, 1, 17, -2, -8, 13, 6, -7, 14, 1, 0, 25, -14, -12, 17, 6, -4, 24, -8, -11, 32, 3, -24, 19, 13, -15, 19, 18, -22, 27, 26, -31, 6, 26, -27, 8, 22, -29, 3, 19, -23, -2, 29, -14, -15, 11, -18, -14, 17, -28, -9, 31, -29, -1, 27, -26, -2, 28, -28, -15, 36, -12, -32, 32, -8, -40, 28, -5, -49, 30, 16, -32, 24, 18, -36, 23, 30, -29, 2, 14, -13, 6, 10, -26, 12, 16, -28, 16, 13, -18, 26, 27, -36, 24, 32, -38, -7, 33, -23, -25, 35, -21, -16, 45, -16, -28, 38, -7, -32, 32, -10, -16, 25, -13, -25, 35, -7, -28, 19, -2, -37, 41, 0, -39, 25, 14, -24, 21, 9, -41, 20, 28, -32, -2]
2689bL1m1J7K3n9J7N0n3oM6k7j5M5m2QK9j9LmJ1k1J2j8OL5l6LJ9l0J0L0l5l1P3
2723B9k7n5O0J0m8M1J6p1M0M0n7%N1m8kL9k0qM4l9j1K4qj4K2j5MK3k7oK4oLOk1
2758gJJ3qlMlmPLnJ9ol0K0Jj8L1lk7J5jlkJ3oNj1oJ5%oJRj8NK5l9J4K0k0j1MK1
2801IpqJ8k4lL2nk1K6rl6K8L4m9K1J6m0jM1j3j9M1k8k5L3j0rL0lm4K5j6qM0ml2
2837b0L5j0l7L9J0l3L8j4l3L9J1l4J7Rn0M0J8m6L7J6n8J5L5m4K1L5m5lM5m2lM8
2869C6m2J2K4m9%O1n0j1N6n6mO0l2k7N6j8m6N5nk8L9j4n2N8J2o0M1J2n5L3kl3
2901b9M0J0n6L3K7o3M2K0m3OM5n7KM2m1RM0m4mL9k5LL7m2j3N6m4KM6l7k6M0j3
2934Bk9N2k3k7O1nn5M3Pn4L9J8p1N5K6o3K6K7n2J4M1m1LL1l4qL1k4ML2l5mL5k5
$$ y = [-2, 29, -12, 5, 28, -31, -14, 36, -17, -23, 23, -4, -19, 26, -16, -8, 21, 2, 5, 1, 12, -9, 3, -15, -9, 26, -10, -7, 12, -18, -8, 22, -13, -44, 29, 2, -53, 7, 17, -31, 10, 26, -45, -5, 35, -22, -22, 29, -19, -21, 18, -2, -10, 34, -5, -16, 8, 0, -14, 8, -7, -3, 20, -7, -13, 11, 5, 8, 14, -7, -6, 7, -1, -4, 0, -3, -7, 0, 3, -2, 17, 11, -19, 1, 2, -16, 15, 12, -15, 0, -1, -4, -6, 7, 1, 6, -5, -11, 4, 4, -2, -1, 8, -10, -5, 20, -19, -5, 15, -5, -16, -12, 9, 2, -6, 12, -12, -15, 17, 12, -9, 17, 8, -28, 0, 34, -15, 6, 22, -18, -19, 22, 9, -10, 31, 3, -22, 11, 1, -8, 22, 19, -25, 0, -16, -24, 16, 12, -20, 15, 5, -32, 7, 17, -16, 22, 8, -25, 14, 25, -9, 8, 17, -33, 7, 25, -21, 16, 32, -26, -11, 24, -20, 1, 36, -9, -12, 33, -9, -12, 36, -6, 6, 30, -19, -19, 42, -8, -19, 37, -19, -23, 37, 5, -22, 34, 16, -30, 25, 20, -8, 31, 17, -35, 23, 35, -25, 16, 28, -27, 6, 4, -29, 11, 21, -35, -2, 25, -38, 4, 24, -19, -13, 32, -25, -23, 19, -22, -13, 27, -17, -21, 18, -7, -4, 33, -9, -22, 34, -10, -8, 38, 1, -25, 15, 2, -27, 25, 2, -25, 36, 31, -24, 19, 26, -28, 11, 29, -42, 13, 39, -24, 2, 29, -23, -9, 32, -9, -6, 25, -9, -17, 14, -10, -6, 26, -9, -13, 22, -3]
2968cj4M2l2jM1m9j3M5kk4K2ol0L9j2k7N1mm6L7Nl3K0J0l2J2J8l1K4nk6M5Pm7
3002a9K3K3l1oL2l3J4L0m4pL8k2j1L1k5KK5l3k0N3j0k3K8k1pK7j0j7K6jl1J5l
3035gj1L6j2k4K2lqJ2Ol1K0J1l0J1K7j4Moj6J1K2k0%J6j8PqMJ8j4j0J1Pj2mJ2
3071InrL1l3pJ6j2JJ9k7%K5qj3J0nQoJ5qj1QMj1JJjj2J8J0j8ORj3J3J7j7j9K7
3110A3j2j3J2NJj0MnJ4nPj8%K6pj1Ojj1J2Nk6QK2j6pP%nJ5JrJ5%l6J7Pj4RJ6j6
3151@qLJ7j4jOjj1OK4qk6K5lk5M4j5l0J4K2l9J2L8k2j3J6j9jK2pk4K4J2j8PJm
3188DQj0PJpkJ1j5PJ9k8j2K9j1k6L0pj6L5J0m6K4K2n0J3K8m6K1K0j7nK8j8nPr
3224flJ1j6J8J1l0K6J2m5K3L8n3qO3n5kO1l8k5N5l4k4M1ll3L7j2l0M5kl7K0J4
$$ y = [-3, -17, 25, -7, -8, 33, -16, -29, 16, 14, -10, 12, 6, -24, 15, 3, -24, 27, 23, -23, 14, 19, -14, 6, 16, -16, -4, 14, -17, 7, 2, -24, 21, 28, -19, 4, 27, -4, -10, 22, -11, 3, 33, -11, -18, 20, -2, -13, 18, -7, -5, 20, -13, -33, 20, 10, -13, 15, -6, -13, 14, 4, -13, 13, 12, -19, -4, -7, -18, 18, 6, -18, 4, 1, -7, 5, 11, -20, 0, 11, -19, -8, 19, 5, 9, 3, -13, -2, 20, 0, 0, 16, -2, 5, -3, 1, 19, 5, -5, 6, 13, 1, -3, 9, 4, -5, 26, -7, -14, 2, -10, -9, 10, -17, -17, 8, 0, -13, -3, -8, 0, -6, 9, 1, -10, -2, 2, -9, -8, -7, -8, -20, -2, 8, -10, -4, 5, -8, 5, 22, 5, -14, 13, 1, -12, 0, 5, 6, -4, 0, -5, 9, 4, 11, -7, -7, 19, 12, 1, 7, 6, -5, 7, 12, -14, -6, 16, 0, -7, 0, 0, -5, 10, 11, 2, 17, 17, -19, -2, 5, -9, 0, 16, 0, -8, -5, 12, -2, -3, 3, 2, -9, -3, 21, 13, -13, 12, 9, -16, 28, 13, -17, -3, 19, -20, -8, 30, 8, -5, 11, -8, -9, 13, 6, -18, 6, 18, 0, 7, 8, 4, 12, 2, 9, 10, 3, 1, 12, -3, 4, 23, -5, -17, 12, 1, -25, 5, -2, -18, 17, 27, -19, 5, 27, -23, -10, 18, -28, -7, 13, -4, -9, 19, 1, -4, 3, -6, -9, 2, -14, 4, 15, -15, 11, 23, -22, 1, 39, -14, -22, 41, -14, -16, 45, 7, -18, 37, 3, -21, 20, 17, -16, 21, 9, -21, 24, 22, -15, 5, 19]
3257A9m6K8Pk5L0Nk6J9Jj7K4nl7L6J1o1L7M0m9J0M1p4LO3m9j0O8l6m2N2ll3M3
3290B4ll5K4llJ4j2j1L3k5j7M8j9m1O2k5n4P0Mo7M2L6o9J8N1o7L1K6n4LM8l7o
3323a4M2l9JL5l7j5N6l7KJ7l3J0L2j8j0K6k8nM4l7k2Q6n4m9O9on7P0No9K6N0o1
3356b0K0N1m5l0N0k2j2L1j4j7J2nJ2Pk8J5J5m2J9L9m2%L1m2oM4k7j3M6j6l2L7
3388A6rj9K8Mm2J9K0l5M1pl8K6J1k5J2J8k5K0j3pJ3Rj8J2Nk4RJ4k5K8J0m3oL4
3422A3j5rL4j7k1J4J6j5LK9k8pj0J3M%Pj7j4K6J4k0RJ7k9j3K8j8KK3k1k2K5jj3
3457a3J1Qj1NojNJ6Kj7qJ1nlJ0jk4K6Ql8M2Ql1NRoj7L6j8j7L7j5k1J3J2j5%nK
3496fK3j8LLj1pK2nl1M4j0l4M7ol5L5Lk3PJ3l3MK6rRkk2K8j1kLQk4J6J0k2J6M
$$ y = [19, -27, 1, 8, -17, 13, 18, -8, 11, 12, -5, 19, 14, -23, 13, 24, -37, 0, 40, -9, 1, 42, -32, -29, 34, -15, -25, 43, 7, -35, 17, 14, -19, 24, 21, -14, 10, 7, 4, 18, 6, -5, 28, 3, -14, 34, 15, -26, 36, 11, -43, 27, 31, -36, 6, 42, -27, -9, 42, -25, 6, 32, -22, -19, 29, -8, -14, 28, -11, -10, 25, -12, -27, 29, -8, -6, 11, -22, -12, 20, 2, -8, 18, -10, -15, 29, -8, -30, 56, 2, -47, 22, 16, -41, 29, 34, -35, -9, 41, -20, 0, 51, 6, -24, 26, 4, -8, 23, 9, -8, 4, -1, 11, 18, -10, 5, 20, -22, -3, 36, -6, -6, 25, -17, -23, 21, -6, -19, 27, 11, -21, 16, 7, -12, 16, 20, -22, -3, 17, -18, 23, 16, -22, 4, 15, -10, 2, 20, -5, 15, 2, -5, 8, 17, -1, 11, 16, -8, 1, 15, -10, 18, 28, -15, -21, 13, -2, -11, 23, 6, -15, -1, 15, 0, 3, 32, 4, -3, -13, 0, 4, 4, 11, -6, -20, 6, 20, 0, 9, 26, -3, -16, 12, -6, -4, 19, -2, -24, 1, 0, -13, -2, 6, -5, 0, -6, -7, -2, 14, 16, -1, -9, 2, -3, -6, 4, 3, -21, 5, 13, -25, 17, 25, -6, -1, 8, 2, -15, 21, 3, -14, 23, 8, -13, 0, 12, -3, -3, -8, -6, 17, -1, 2, 5, -6, -13, 9, 4, -27, 17, 7, -27, 20, 14, -21, 14, 17, -6, 1, 14, -19, -15, 11, 2, 11, 9, -13, 15, 4, 2, 5, 13, -11, 5, 15, -7, 9, 13]
3534A3k5MJ7k2J4K5k8k0N0l7mL2k1%L7k8k5M5k4l1M2om2M5J6n0J8K4m7K7K2l2
3566a1J2J3l3J2J4k0J9Jl7K9J8l5J3K8j9j9K8j7jL5k0k1K5j0k1K2J3k2J7k1nK4
3598A1j3kK1kj9L0j6k7M3qk6J8Lk5J9J7m7QM9m0LM4m5lL5k4oL6l5j4L6k6qL4k2
3633aj6L2mk5J8MrRj1oJ7Mj7K2qk1K9mk2J6Kj4J1Lj7K3Lk5J3J%%J0j7K2Lm7L5
3671A3J0j6kJ7l9L7jj7qJ7k1J5K1j8LJ3k4j1K4Jj7mRj1J3pj6K1J4j5nPQmj1J4
3707A0Pj8J9rj1J3%j5NPjJ0pMj4MJ4j5PNj3J6j5LMjJj3Rj4K8k5jK2op%Mm%Nj2
3749dKJ3rj2J6rJ0rNPnJ1k0J1nK0j2%jJNj4M%Rj7QjPlQj2J0J2k1nkJ6qj0K6j1
3791A1mMj4oJ3J0j0lOrJ0j4j2K2J0k7J0J3%j5RlmPPj3mJ9j1lkK7l2QJ7j2j5L0
$$ y = [13, -12, -8, 9, -13, 1, 26, -2, -22, 28, -9, -13, 19, -2, -2, 35, 7, -18, 27, 3, -28, 14, 8, -34, 11, 27, -23, -5, 19, -28, -1, 21, -11, 1, 14, -19, -7, 7, -13, 6, 7, -30, -1, 17, -18, -5, 23, 4, -15, 13, -4, -5, 30, 10, -11, 14, 4, -17, 5, 18, -4, 13, -8, -13, 11, -2, -4, 17, 15, -4, 26, 10, -17, 26, 18, -8, 10, 13, -12, 7, 24, -23, -15, 34, -6, -3, 41, -4, -7, 28, 4, -2, 34, -1, -15, 21, -5, -13, 21, -1, -17, 15, 11, -14, 4, 8, -1, 8, -3, -9, 8, 12, -5, 17, 9, -12, 17, 13, -9, 7, 9, -5, 6, 9, -8, 15, 18, -7, 6, 7, 7, 7, 17, 0, 22, 25, -22, 13, 23, 7, 5, 22, -17, 20, 19, 2, -6, 11, -10, 5, 26, 8, 11, 24, 0, -11, 13, 14, -3, -7, 2, -9, 4, -3, -19, 2, 16, 1, -4, 3, 11, 7, -4, 10, 17, -1, 18, 9, -2, 11, 11, -4, 1, 8, 7, 17, 10, 14, 0, 4, 18, 3, 10, 15, 2, 18, 3, 6, 10, 9, 10, -3, 6, -8, 20, -5, -6, 16, 10, 3, 3, 7, 3, 3, 8, -4, -2, 11, 2, -10, 6, -3, 7, -2, 3, 10, 5, 16, -4, 7, 2, 22, 10, 10, 9, 10, 15, 1, 5, 5, 14, -3, 5, 4, 11, 8, 16, 4, 14, 26, 5, 0, -2, 14, 6, -4, 22, 11, 7, 11, -3, -9, 4, 14, 4, 1, 7, -2, 8, -6, -18, 4, 14, -13, -3, 10, 10, -5, 4, 1, -3, 4, 11, -2, -6, 13, 2, -1, -3, 24, -8, 0, 17, 5, -10, 20]
3829B0Kl1J1J1qj0K1lj0K0k3pK3%nl%OqOjPj0j4LKJ4Lj5kORj1J7mmPj3j7J9J2
3870B0j1rKL%%j1POj1KjJ3QoqMPj5%LrRPj3KK4m2K1K0l4RL9l6lL2k2j7K6j0j9
3911a3L4Ml8K0J2j7JlJOomJ6mj3J3lj6J9Qk2J5Jk8J6J0k9J6K2k8RK3j8lK3k0j0
3948fL0l1KK6k5MMqRJ8k1JK6l1lK7j3j6K5j0k5K6J2k3PRk1NJ3j5J5Orj1J7j7R
3985FOlj0LoQlj0%J9k2NL1k5oL7m6NL8k8j9M6k1k5L5Ml1K1%l3J8J2rLJ8j0pJ8
4023A9j2j0K6k3J3%j1RMj8NJ7k7J2J2k5JL7j7k8L0jk1K2Kk1lJ9nKJ0j7nMmK5j4
4060Gj5J0K1k6L2j1l1K0J2k4PJ8rlJ5l5lM8k2rJ2oj4K2Jk2K6ok6RK0j5kK3j1l2
4096a9J8J0k1K3Lj5j0K0MpnJ3Lk3PJ8l9RK5k6JJ7Pl1K3Kk9K2J2k3RJ7k4j3K4J0
$$ y = [20, 22, -9, 2, 13, 5, -5, 16, 13, 3, 23, 0, -7, 16, 16, 11, 8, 8, 14, 6, 12, 11, 18, 8, -6, -3, -1, 13, 16, 1, -1, 5, 14, 3, 20, 16, 12, 19, 6, -11, 8, 20, 9, 0, 2, 5, 5, 5, -6, 1, 7, -4, -2, -3, 10, 18, 12, 4, 8, 15, 0, 0, 3, -6, 3, 10, -3, -1, 23, -19, 2, 22, -12, -3, 36, 0, -3, 29, 7, -10, 16, 6, -13, 21, 25, -13, 7, 19, 2, 3, 0, 1, 7, 1, -3, 13, 9, -4, 9, 6, -10, 9, 17, -5, 10, 11, -17, -1, 9, -20, -4, 18, -10, -1, 22, 4, 1, 24, 4, -6, 24, -7, -5, 21, -4, 0, 4, -4, 5, 23, 2, 3, 29, -2, -5, 22, 9, -7, 18, 8, -17, 9, 21, -2, 5, 14, -7, -2, 11, -4, 11, 17, 8, -3, 14, -3, 6, 12, 9, -1, 2, -4, 4, 1, -9, -9, 10, -12, -7, 24, -1, -7, 30, -16, -11, 27, -1, -20, 26, 5, -20, 15, 19, -12, 9, 9, -24, -6, 6, -3, 0, 18, 8, 1, 19, 7, -3, 23, 0, 13, 13, 2, 11, 15, -3, 2, 19, -8, 4, 16, -9, -8, 29, 12, -16, 14, 13, -8, 14, 16, -5, -8, 11, 6, 8, 18, 1, -4, 0, -4, 21, 7, -8, 2, 23, -3, 29, 18, -13, 7, 19, -5, 2, 20, 11, 8, 23, -12, -15, 33, 11, 2, 14, 8, -6, 16, 17, -5, 21, 15, -11, -2, 18, 3, 1, 24, 13, -19, -1, 9, -12, 11, 14, -1, -11, 9, 13, 6, 1, 14, 17, -6, 1, 19, -20, -11, 14, -12, -11, 6, 13, -18, 5, 7, -22, 0, 12, -11, -2, 15, -9, -22, 2, 12]
4132A2j3O%j7J4PkpJNJ1l7K4J3j9%Rj2lL6k1k9M0rk8K4K8l7J5J9n8K1M2m0pL4
4168B2k2j1J5Mk5M0nl4ORJkJ0Lnk4J8J7j8RJ6l4j8O1k9k8L4Pn3M9J9m9K2M8o6
4203a3nN2l7ML3l7mJ3lrJ6oj9L0l4K6Mj5jJ9k5jM3n9J6M1k6l7M0pk2M3ql6K5K3
4239B4m2J5L0l5kK3l3J4L2j4poPJ2j5j1L0j1k8K9Nl0K6K1o4J8N5n0oO2m6k8N4
4272B9j9k8L7Pn0K7Nk9K1K5l2jL0k7J0J2j5J4j2j5K1%k1J5Ol5L2J0m6K9Pk8J0
4305a1L6l9RL7l1k7N0ql9M0j0j8J1J4j6%MnRnRJ3l3RK2k8j8L7j3j0L7j0m3L2J5
4340B0m6K6J7l5J2M0l3k0M9l2j6K7lk0L0Jk8RPj2J3MrJ2j3OPnlJ6l0jL5k7mL5
4376B9l5j0L3j6j5L2Jk3%K2j0ojJ1nrpJ4rJ2Rk8J5J7k1oK4Qm1K7J2l4J6Ok4RK6
$$ y = [12, -1, 5, 5, -12, 2, 9, 7, 0, 1, 6, 17, -20, 4, 17, -2, -2, 7, -5, -8, 28, 7, -22, 18, 9, -19, 5, 33, -4, 11, 30, -28, -7, 35, -5, -12, 22, 0, -11, 4, 8, -17, 23, 18, -16, -10, -1, 0, -2, 8, 11, 6, -18, 0, 17, -1, 8, 24, -10, -28, 33, 4, -24, 10, 17, -36, 13, 32, -17, 5, 53, -13, -18, 34, -3, 1, 34, -3, -7, 6, 3, -6, 10, 4, -15, 15, -19, 7, 11, -4, -5, 14, -11, -12, 31, -28, -12, 29, 3, -34, 6, -1, -23, 20, 12, -24, 1, 24, -18, -3, 27, -8, -10, 13, -20, -6, 26, 12, 5, -1, 6, 18, 3, -8, 22, 11, -17, 12, 17, -13, 13, 34, -30, -12, 43, -7, -13, 49, 3, -25, 29, 10, -18, 19, 26, -24, 3, 8, -21, 0, 25, -7, -8, 22, -5, 5, 17, 2, 16, 4, -11, 10, 10, -11, 4, 10, -25, 7, 17, -29, 0, 7, -21, -11, 25, -14, -5, 32, 1, -26, 24, 16, -23, 17, 7, -11, 0, 14, -2, -2, 2, -3, 6, 1, 10, 23, -10, -1, 21, -7, -25, 12, -1, -11, 26, 16, -27, 5, 20, -26, 0, 17, -18, -6, 34, 1, -19, 30, -2, -18, 9, 6, -14, 16, 17, -11, -2, 5, -7, 6, 10, 1, 13, 0, 6, 13, 8, 5, 21, -9, -10, 25, -2, -6, 29, -6, -16, 17, 1, -14, 18, 19, -4, -4, 18, 8, 2, 1, 12, 7, -2, -9, 5, -4, 8, 17, -11, 4, 21, 0, -6, 18, 26, -15, 12, 24, -10, 6, 12, -12, -3, 23]
4413B3k4j9L8pk7J6J9k9QK6j7j4OJ6k2J4J9j9lJ2j2j5K0mk%J1j6KK0Lk0RLk3R
4449AK2j9PNj6mK0Jj7J5J0j0k1J2MnnRoJ0J0j7j0NJ6j6pK2j1Lj1PmNJ6j0jLj0
4488CqLJ4pJ0j2rqJ3Nj3J6knK0nk0PJ1pj3K6qj8PQklJ7j4j6J8Pj8kJ3jj7K5pj2
4529dJ2mnj3K6%l6K7Kk0J3J5k4RK6j9qK0j3pORlj0nJ3kRkj3JNJ3j9K1Kk9J3K2
4568B8l6oN2l0j6J6qqJ5Pj9J6nkKJ6j0lj0kJ0J1j4lk%Kk1J1J6j0j4J5K0l2K8l
4605A1k3K2J6l5pK7qj8J5pj0K1Mj3MJ2MnoOn%j2J8j2QMprJ8qj9L2ok3K9j5k6L1
4644HJ3l8J4J4j3jK0rj5J5Lk3J7jj3J4nPNlj1J1nKlk4K4K3k4JKJj7L0j7nK0Ml3
4683a2J0J0k4L0Kk2J1Oj1PnrKJ3j0J1Ljr%RnJ0k6K2%prJ7pqJ4j2k0K7jk7L3%j8
$$ y = [23, -1, -20, 18, 11, -16, 0, 19, -10, -2, 24, 7, -7, -1, 15, -7, 7, 26, 7, 4, 16, 4, -11, 9, 5, 3, 3, 14, -2, 0, 20, 23, 3, 12, 15, -8, 1, 23, 4, 11, 16, 0, -4, 16, 17, 0, 15, 25, 15, -6, 6, 10, 5, 0, 9, 3, 13, 23, 6, -4, 1, 17, 1, -6, 16, 5, 8, -3, 4, 0, 5, 21, 11, 10, 13, 3, -5, -2, 12, 5, 15, 3, -6, -14, -1, 4, -9, 7, 5, 0, 20, 15, -5, 2, 13, 6, -7, 19, 11, -7, 0, 8, 6, 3, 20, 6, -10, 8, 15, -3, -5, 8, 7, -10, 15, 8, -4, 8, 4, -1, -14, 12, 12, -24, 3, 5, -15, -2, 13, -11, -2, 24, 5, -3, 17, 4, -3, 3, 12, 9, -1, -6, 7, 5, 14, 12, -1, 0, 5, 18, -1, 20, 22, -7, 6, 28, -8, -14, 38, 8, -8, 8, 0, -8, 7, 14, -5, 11, 6, 4, 6, 22, 12, 9, -1, -3, 7, 18, 4, 1, -1, -1, 1, -20, -9, 7, -3, -17, -2, 18, -14, 14, 11, -12, 10, 26, -9, -16, 11, 3, -15, 0, -7, -17, 4, 8, -5, -1, 11, 15, 10, 4, 10, 5, 5, -7, 11, -1, 7, 11, 4, -5, 13, 5, -14, 18, 12, -11, 18, 3, -23, 8, 21, -17, -3, 11, -2, -3, 17, 8, -7, 8, 11, -12, 5, 4, -9, 5, 0, 7, 12, 9, -2, 9, 4, 6, 3, -21, 3, 26, 2, 3, 5, 6, -11, 19, 2, -3, 17, 21, -12, -2, 8, -16, 14, 16, -6, 5, 11, 0, 7, 2, -7, -5, 8, -2, 9, 12, 11, 2, 2, 11, 6, 16, -10, 12, 12, 5, -4, 13, 6, -2, 12, 0, -20, 7, 6, -21, 12, 12, -6]
4723fJJ7%ploMLjj1PjKJ1j2KRk1J3Jj7K1J5k1oK9j9oK1j0k6K2Qk2J4Nj0kMrJ4
4764GJ4k1lOl%J4k5J2MnkkJ2j1JJ2pOj6MJ8j4Oj0oNJ2j2KRPpm%nJ2j7KJ4J1nJ
4807A6j0qM%OmMlj2J0Rj6OLj9J5mN%lnRMj0lJ9j6KLnmJ6j0j5J5j%Pj0MPj4JK3
4851A6rj0J2j1oJ5%rJ0%mjLqQkoJ2j0rK2Kj5kMj3%J6ljMooJ4%j3K4j5k4K0kjJ6
4894A2j0j8J6omPJ4k4J3J5l3K1Qk2LK1j6j0J4pnNj1LJ0RmpmJ0J0j9J6Pj4pQKo
4933cROk0J4j4NL2k7Np%j0QJ1q%lj3J8Rj4QLj7MPjJJ2k2NJ0j0RNk2j3K4kRPlj6
4976dPRj4mK5k5ONJj5J7QrNKk1QJ4j8jmJ1pjJ3Pj8J6pj2RJ4rk0K3j7OLmj4J9%
5018Dq%KoMNrJ4J2j5K%kmPj4JJ1rpK1nJ3j5%j%J6j5mRooJJ1kKpj0ROmJPqOkmM
$$ y = [-6, -5, 12, 12, 5, 2, -4, 0, 3, 2, -9, -2, -3, -1, 10, -2, 0, 9, -12, 1, 2, -15, 6, 21, 0, -6, 23, 4, -2, 19, 9, -17, 5, 13, -9, 5, 10, 0, -2, 2, -7, 7, 21, 0, -3, 3, 0, 0, 14, -11, 1, 5, 0, -2, -4, 8, -3, -2, 10, 3, 9, -7, -3, 15, 1, 7, -3, -9, -4, 8, -4, -2, 7, 14, 7, 3, 3, -2, 10, -7, -5, 9, 20, 15, 16, 6, -2, 2, 2, 8, 4, 8, 5, -7, 3, 12, -4, 2, 5, -14, 1, -3, 2, 2, -1, -6, 3, 7, -3, -6, 13, -3, -1, 2, -3, -7, 9, -1, -16, -1, -2, -2, 5, -5, -1, 6, -8, -7, 16, 7, -3, 9, -2, -8, 7, 7, -2, 8, 8, 4, 3, 6, -2, 6, 4, -2, 10, 0, -9, 13, 15, 0, -2, 2, -11, -11, 5, 2, 1, 5, -1, -7, 7, 7, -6, 18, 3, -21, -1, -3, -4, 12, 2, -16, 0, -6, -10, -3, 11, -13, 0, 15, -18, 3, 11, -11, -8, 13, -3, -13, 1, -6, -11, -6, -17, -14, -4, 5, 1, -6, -10, 0, 10, -9, 7, 14, 0, -7, 1, 3, -3, 6, 12, -8, 6, -8, -3, 29, 2, 7, 0, 0, -10, -2, 9, 1, 1, -2, -15, 3, 12, -2, 6, 9, -8, -4, 3, 2, 3, 15, -7, -2, 8, -2, 7, 12, -10, -23, 1, -1, 8, 15, 12, -4, 3, 12, -2, -6, 19, -6, 0, 5, 6, -9, 8, 16, 7, 12, 14, -7, 1, 15, -3, -4, -8, 3, -4, -5, 8, 15, -3, 13, 6, -6, 3, 17, 8, -12, 11, -6, 0, 3, -1, -15, 4, 4, -4, -4, -2, -8, -4, 1, -8, 6, 18, 3, 5, 5, 3, -1, 6, -8, -7, 4, -5, -12, 9, 4, 17, 2, 2, 1, 1, 17, 2, -2, 7, 1, -5, -4, 7, 5, 7, 0, -10, -1, 5, 1, 2, 9, 1, 7, 5, 1, 5]
5067EljoNkKj3J5%oLKj3QJ2orPj3OJ2qj2J0pJJ8j2j1J1J1qqK3oqOrOPlrjJ5j7
5112fmPMKpJ1j4J3mkJOmrJ1J3j5%oMPrKjKL%oJMpOOpQLj3KkkJ0knRrj4J9rOJ6
5162A9j8oJ6j1rK2rlQpLQJ0k7jOjjQMoQk7J9JklKmj7K5j2LoJ3JljnNj0NNkKPk0
5209a1J2Mj0mNQpRkkPrLKJ1j9KJ2j1kK7k3LloNPKrJ5j3pK2j4jOLlJ2j3rJ3pj1
5253fJ4J1k2J4lj0NJ1j3J6rj4MK2k2%J1j5%PmJ5qJpJ3j1J0Mj2QOj4jJ8j6RKj9
5292elJ3Nj3J8pj5K1kj2RLk4J3J0j5LNj0J3qrJ3OllMmKloJ7mj9QJ4k4J5J2k7O
5333fJ8j3Pkjj2J9Kk1K5Jk2J3Jj5J6j0PpJjP%rJ3qj0NMoJ8jj9MJ2ppMk%K2j9N
5376FPloqJ0pjLJQlLnoJ0ppkRjlK1rj1J4j5mJ7mnKlqJ5jmqjJ0j2J0Qj5J7mj6J2
$$ y = [5, 2, 1, -5, 0, -2, 0, -13, 2, 2, -4, -1, 1, -12, -4, 8, 2, -7, 0, -13, -7, 5, -3, -15, -5, -12, -11, 7, -5, -16, -5, 6, -2, -10, 13, 7, -1, 5, -4, 2, 9, 6, -3, -4, 11, -6, -10, -3, 1, 3, -4, 7, -7, 6, 2, 0, 1, 7, 3, -6, 5, 18, 3, 3, -3, 1, 8, -1, 1, 0, 2, 5, 5, -1, 0, 4, -3, 3, 9, 2, 10, 13, 0, 2, 0, -2, 8, 6, 1, 10, 1, -13, 6, -3, 3, 19, 1, -5, 11, 0, -9, 13, 4, 1, 9, 2, 5, 13, 23, -4, -5, 1, 0, -1, 7, 11, 5, 13, -14, 5, 6, 4, 1, 3, -1, -18, 7, -5, -2, -8, 5, 6, 3, 2, -3, 2, -8, -3, 2, 0, 2, 9, -11, 1, 5, -5, -9, -4, 4, -3, 6, 4, 2, 9, 0, 3, 5, 16, -3, -1, 11, 0, -2, 25, 2, 5, 2, -4, 1, 8, 10, 1, 16, 3, -4, 18, 4, 3, 9, 12, 9, 21, 8, -1, 12, 5, -6, 8, 19, -3, 11, 8, -2, 3, 14, 1, 17, 8, -6, -2, 20, -2, -2, 9, -6, -6, 1, -3, 12, 4, 5, -2, 11, 0, 10, 14, 2, 10, 16, 2, 1, 19, 3, 12, 14, -5, -8, 5, 10, -3, 15, 8, -7, 14, 12, 0, 9, 12, -12, 1, 11, -4, -1, 4, -6, 7, -1, -10, 3, 9, 6, 3, 7, 3, 5, 2, -4, 13, 9, -10, -2, 12, -12, 3, 15, -12, -6, 12, -1, 6, 4, 3, -9, 10, 12, -9, 16, 17, -5, 8, 9, -6, 10, 0, 7, 0, 1, 0, 7, 7, -2, 11, 3, -7, -2, 2, -4, 14, 13, -6, -2, 10, 3, -4, 0, -2, -2, 20, 1, 6, 13, 10, 4, -4, 6, -1, -2, 1, 2, 10, 7, 10, 5, -1, 9, 2, -5, -7, 2, 1, -2, 19, 10, -1, 13, -2, -6, 11, 7, 2, 4, 1, -7, 8, 7, 3, -5, -6, 4, -8, 2, 10, -5, 12, 8, -8, 4]
5423DQj2nJ9pqLLkkMqJ0KKj5MpRjLoLJ2mk0J1Rrj4J6jKqPQj2jLkJ0lNoK%J1j9
5471bMPj2qRJ3kJKj3Pj0J1J2j2j3J0%KlMj6J1rNJ7mJj2J3okj0pJ6nKl%Rqj0Rj1
5515a3NJ6pJ1j5RrLPPpj0J8oj6PPMj5jOlK9k2J2mj0pJ1olJJ1k%j3K0%k7J3Pnn
5558bPj5J4MlrJ5qlJkj3J9qJ0qJ0opNOK%j5QJ1oJljJjoORj9J3Nj0j%nLLLM%rn
5607eJ7j4kKRj8RJ6j5oJNKJ5j9%%J1j8PKnJ5j4Oj1J1oJ0pj2NMJ6r%mNj1OkJ5n
5650FnJ0mJ0j7M%JljLOmJj9J3MJqJ1mn%qRJ0j2qQjLKQk4J1KoJ1jj0J2j0%LJ2o
5696EolPmJJ%J6rNjj2J2qlKjqJ4n%jj0kJ1KmL%jjJ2j9LMkPMq%pJpJ4Pkj0LlOM
5747Gk0PQj2rQOJ2j2KmJ2pJOJNqORj0nJ3j3MPrnJ8j8kkJ7r%PqJj2J2pJ2j0j1J1
$$ y = [4, 12, 0, -5, 14, 7, -1, 2, 5, 3, 1, 5, -3, 7, 9, 11, -4, 0, -7, 2, 1, 4, -2, 1, 13, 9, -11, 0, 9, 0, -14, 2, 1, 3, -5, 2, 10, -2, -3, 0, -2, 8, 5, 10, 4, 6, 6, 17, -2, 2, 9, -3, -11, -2, 11, 9, 10, 12, -1, 6, -4, 7, 19, 7, -6, 4, 4, 6, 3, 7, -9, 2, -7, -2, 15, 11, 12, 0, 13, 7, 5, -5, -12, 4, -1, 1, -2, -2, 7, -1, -11, -2, -13, -8, 8, 1, 12, -3, 6, -3, 0, 7, 14, 7, -3, 15, 9, -7, 0, 7, 11, -4, -5, 1, -2, 27, 5, 17, 13, 3, -4, 7, 1, -2, -1, 10, 8, 8, -5, 15, 15, -12, 1, 8, 3, -2, 5, -10, 4, 8, 5, -4, 11, 3, 0, 1, -1, -14, 5, -3, 7, -1, 9, 3, -4, 1, 7, 9, 9, -6, 2, 13, 7, 8, 5, 4, 5, 4, -2, 4, 13, -6, 7, 12, 2, 1, 1, -4, -1, 2, 5, 9, 9, 0, -5, 12, -2, -4, -2, 7, -11, -2, 14, -1, -7, -6, -1, 1, 16, -3, -3, -3, 8, -10, -3, -1, -6, 9, -5, 1, -10, 1, -5, 5, -2, -14, -9, -5, 11, 2, 2, -2, 3, -8, -2, -4, 11, 6, 1, 11, 7, 17, 0, 4, 4, 5, 2, 1, 4, 10, 6, 7, -12, 1, 5, 6, -2, 9, 5, 0, 0, -8, 1, 11, -1, -9, -1, -2, 1, 3, 11, -13, -2, 0, -6, 5, 4, -6, 6, -4, -4, -1, 11, 5, -1, -4, 3, -1, 0, 1, 1, 17, 8, 13, 12, 0, 12, 4, 1, 3, 2, -6, 8, 3, 3, 2, -8, -10, 1, 3, -1, 2, 2, 1, 0, 12, -7, -4, 0, -2, 5, 9, 1, 1, -6, -5, -12, 2, 9, 7, -3, 0, -3, 3, 7, -13, -6, 2, -10, -19, -11, -5, 7, -5, -3, -7, 5, -2, -1, 5, 6, 11, 3, 9, 18, 8, 3, 16, 3, 7, 14, 5, 0, 18, 0, -2, -4, 13, 4, 4, 11, 3, 4, -8, 4, -3, 9, -1, -12, -1]
5792aKjKJJnmJ0kJ1j4jKnQMmpLOj2KRnqJ6qqOlPjmOplJ6kj0LPQj3KkJ1j5QLnj
5843CJ0rmLj0PNkJ5j1qMmLlqJ2NMpj4J5qkRk%pQoRkOqpJ3JKj9J0j3J4mJ1j1nK1
5890A6j6LlkNJQj1LrjK4qj0NrMNj3LMokJ7j2jOJ5j9Rlj1J3pJ0ppJ1j2J3j7QJ5
5933A2j8%J4j1OMj1RoKQr%k%PLj2PjLj2jRPj4J3nlJ2j0Nn%Pj7J0KJ2j7KjpPJN
5979EOopK%J2j0mmKNkmNoKJ1Nj2Qjj1J1Qj2oJ0j0ONoKRpppRmj1J7KkKjLnlJ1j4
6028d%KKjNRk1JJ9j5nNMpJ3lJln%ONnOj6JJ2Nkj1J4oKnkOrNLKjNpjJ1rmNKqRj
6080IrpK0Mk3K9k0%pJ2jj2J6j8JQLJKqJ2nllJ0lj7MMJ6k3K0j4%MJ2j5oJ3%j2m
6122a0K4j1oOLrJ7j7J2j8K8j8oJ1j3K2rMj1J2k4K3%j3J6noMLmMJ0j6LpnOJ1mk
$$ y = [-1, 1, 0, 2, 3, 4, -1, -5, 5, 3, 14, 0, -1, 1, -4, 4, 8, 4, -3, 0, 6, -6, -4, 5, 0, -8, 8, 0, -8, -2, -5, 2, 1, -3, 3, -4, -7, 9, 7, -3, 0, 7, 15, 2, 4, 2, 13, -2, 6, 9, 4, 3, 13, 4, 0, 3, -7, 0, 5, 3, 18, 7, -1, 3, -1, 2, -1, -9, 3, 8, 12, 5, -9, 6, -2, -4, 5, 3, 3, -4, 4, -2, 7, 5, 11, 3, -4, 9, 10, 12, -7, 3, -10, 4, 0, 11, 0, -5, 16, 0, 3, 0, -2, 3, 4, 12, 1, 4, -5, -6, 18, 10, 0, 5, -4, 0, 5, -8, -5, -1, -7, -9, 8, -4, -5, 1, 16, -3, 6, 3, -8, 5, -2, 8, 1, -6, 5, -7, 6, -11, -3, 12, -6, -6, 8, -3, 3, 7, -4, 5, -1, 1, 9, 0, 0, -2, -2, 5, 8, -4, 3, 2, 5, -7, -8, 1, 8, -6, 7, 2, -1, 11, 1, 6, 1, 1, 8, -9, 1, 3, 15, -2, 0, -1, -8, -1, 0, 5, 11, 5, -2, 0, 0, 12, 2, -2, -6, -4, 1, -1, -5, 0, -6, -4, 7, 12, 0, 8, 7, -4, 7, 15, 3, -3, 7, -3, 3, 8, 2, 4, 13, 6, -1, -8, 1, -3, -14, 3, 5, 3, 5, 4, 7, 2, -1, 10, -4, -4, -2, 0, -1, 4, 13, -8, -7, 12, -3, -8, -3, 1, -6, 7, 4, 5, 2, -3, -3, 3, 8, 3, 9, -7, -6, 6, 11, 9, -2, 12, 6, 8, 3, 1, 7, -2, 3, 6, 8, 7, 12, 5, 4, 15, 6, 2, 7, 9, 1, 10, 9, 0, -7, 13, 17, -6, 23, 3, 3, -4, 8, 7, -5, 11, -7, -6, 2, 5, 6, 8, 0, 12, 7, 4, 1, 11, 8, -9, -5, -1, 15, -8, 12, -2, -2, 2, 14, -1, -7, 6, 6, -6, -10, 14, 3, -3, 3, 6, -3, 14, -3, 9, -9, 19, 1, -5, 6, -7, 15, 6, 10, -1, 11, -13, 10, 10, -3, 13, 8, 2, 6, 9, 5, 9, 19, 3, 6, -1, -6, 0, 11, 7, 5]
6162EPqkqJ0j2J2okQpPmq%J3jKmNrLkjPj2%J8pMj2mJ3rQrMQKj0QnoNJ1lqJ0j1
6211@lJ0pJ6j7KJ1nKkj0Ok%oRKnPqrQNj0J7%k1K5j3jKJJLqJ7k4J4j0KP%qL%mJ0
6258Gj4OJ8qpkL%mJ1j5J3qJ4p%qLOj1J5lplmKlKO%J1k2KMNqJ1qkJ5mrPj1JQK%
6306Dj9K1n%N%qkQJoOKjj5J2mJ0omrRnJJ3j2J0lqJJ3mj2MK3j7j7J6jPo%rMLj4
6352a4K1j1jNKMj4J5nPpJj0J3KomMNljkNoJONlnQj2PrM%QlMp%oJ3rmkJ3j8J2l
6401@J0prmRj0lJ5lj7J2KJlO%nJ0pRj5NNrK2j4l%KNoJ4j2lpJ7KnJpJLNQk2K3j1
6448EpJ1qj5J3JOKqJJ2j0oRooRrJQPMj1NMmjOk1J0rNJ0omLPj2J4Jlj6J0NNj5M
6495AKKjJOj0QrNj1J5j4J5qKKlj2J7qmJ7J0j2rPj4LJ1orJNmMOn%rJ3Klj1K1j2
$$ y = [5, 12, 4, 2, -6, 4, -8, 4, -2, -4, 4, -3, 4, 0, -8, -8, 5, 4, 6, 2, 7, -2, 1, -1, -2, 5, -7, -7, 11, 4, 8, -4, -8, 5, -4, 4, -5, -1, 7, 9, -1, 7, 2, -4, 1, 12, 9, 1, 11, 0, -3, 7, 0, 16, -1, 1, 12, 7, 9, 7, -3, 3, 1, 1, -5, 4, 6, 1, 8, 0, -9, -1, 4, -6, 11, 11, -10, 15, 2, 1, 3, 4, 5, 8, 0, 17, -7, 7, -3, -1, 6, 6, -2, 1, 1, -3, 7, -7, -1, 17, 9, 2, 0, 3, 3, -1, 10, -5, 8, 0, 14, 7, 7, -1, 2, 8, -3, 12, 9, 2, -1, -5, -3, -6, -4, 2, 2, 13, -9, -7, -3, 2, -6, 5, -3, -5, 10, 6, -3, 4, -7, -6, 2, 4, 4, -15, 6, 1, 1, 6, 6, -2, -4, 4, 5, -1, 5, 7, 6, -9, 3, -1, 9, 3, -1, -10, -1, -6, -5, 8, -4, 6, 3, -5, -4, 9, 5, -7, -3, 20, 3, -14, 2, 1, 8, 2, 2, -7, -3, 0, -14, 7, -4, -5, 0, 2, 6, -8, 7, 2, 9, 2, 3, -7, 6, 8, 2, -2, 2, 7, 4, 3, 1, 6, 0, 1, 7, 12, 9, 4, 12, 0, 7, -2, 2, 2, 10, 7, 11, 4, 4, -2, 11, 2, -2, -4, 9, -9, 3, 0, 10, 3, -6, -10, -1, -11, -14, 1, -2, -19, -7, -5, -4, -7, -1, -1, -6, 4, -3, 6, -9, -4, 1, -8, 14, 0, -3, -3, -1, 4, -2, 12, 0, -3, -10, 7, 9, 4, 5, -2, -1, 2, 7, 15, -7, 16, 5, -2, 9, 1, -14, -1, 0, 6, 8, 0, 1, 13, 3, -3, 6, 0, -6, 3, -6, -5, 3, 10, 14, 3, 8, 12, 8, 7, 13, -8, 2, -7, -2, 8, 2, -2, 1, 8, -4, 10, 11, 8, -8, 2, 7, 12, -3, 1, 3, 5, 4, 5, 11, 1, 9, 0, 5, -6, 9, -5, 10, 2, 4, 6, 3, -9, 8, 0, -4, 13, 23, 11, 2, 9, -5, -2, 9, 3, -6, -5, 0, -4, 0, 6, 1, 1, -8, 5, 7, 4, -7, 14, 2]
6540BPLj4OjqlJ0mJLLj9RJ0j6J7Polj4J0J2j5J1JnnOql%J3o%J5j3nMlK1k3lJ2
6584FnjoJ5j0KMqj2K2mj0LJNj%lL%nMJmPj0%QNqPj0OM%Qj7J0orLjQQj7PMj3kJ4
6634Cj3J2jqJ3%rkJ7j2MLj2NPpnJ4rj6MQRkQomJ4k3J2j2J3LJoP%mmJ1lnNrJ0J2
6680B3j9PJ8k5jJ0Kkj0NjKrmQjJ0nOlqjjnQJj4nOPj3QJ2j6J9j0%Jj0J1%pLJlJ
6726dKMmjJ2j5J4j0pK6k1J0MllPoMlrPoOpNMnqJ3n%jjj0J0JOOj3%JRomJLLpjO
6776DpPQj0jKKJjjj2OJ7j5MMJj4RjJJ1qJn%JOlJkKQj6JmJ3Mj9J3qJ1oOrljPln
6826cJmJ7j1rJ0MLnnKRqKoJ0qJ7j2%krJ2mMkKjMj2PrJ0mkJ6j3j1J5pJ4loo%NR
6873A1k1J6%j0RJrLoJ4Qk6%j%J8j0rJ9mrlPn%MjjPOj4%Pj6J0jLQKlpLKJ3j1%l
$$ y = [2, 9, 12, -2, 4, 3, -5, -8, 2, -2, -1, 2, 5, -14, -5, 5, -11, 6, 13, 7, 4, -10, 0, 12, -3, 8, 9, 4, -1, 5, -3, -6, -6, 7, 1, 1, 16, 3, -2, 2, -1, 20, -3, -6, 6, 1, 0, -6, 9, -1, 1, 5, -3, -15, 7, 3, -7, -4, -3, 2, 1, 1, -2, 1, 1, -4, 0, 1, -3, 4, -6, -6, 2, 7, -1, 6, -4, 2, 6, 6, 14, -3, 7, 1, -8, -5, -6, 2, 10, -7, 0, 4, -9, -11, 3, -10, 2, 1, -7, 6, 6, -3, -5, 12, 0, 4, 7, -5, 0, 7, 0, -5, 9, 0, -16, -12, -4, 5, 3, 11, 5, 1, 15, -8, 4, -8, 5, 8, 9, 3, 10, 10, 6, 2, 13, 10, 5, 10, 1, 11, 23, 4, 11, 29, 4, 3, 13, 15, 13, 3, 8, 7, 9, 0, -4, 4, 3, 13, 8, 14, 11, 3, 2, 1, -4, 4, 5, -9, -14, -8, -1, -14, -6, 6, -10, 9, -1, -1, 0, -10, 1, 1, -6, -3, -2, -5, -4, -2, 2, -2, -3, 9, -6, 8, -2, -9, 17, -4, 6, 10, 7, 4, 11, 5, 9, 6, -3, 4, -2, 4, -3, 2, 6, 1, -7, 6, 1, 1, 0, -1, -11, -1, 0, 6, 12, -1, -1, 0, 9, 3, -1, 0, 3, 6, -1, -2, 4, -3, 4, 12, 2, 1, 3, 5, 6, 5, 4, -8, -2, 15, 0, 4, 8, 9, -5, 4, 3, 4, 15, 7, 8, 3, 3, 4, 10, 7, 8, 6, 8, 16, 0, 1, -3, 10, 14, -5, 8, 0, 11, 5, 11, 2, -1, -2, 5, 2, -3, -2, -6, 11, 0, -9, 1, 5, 8, 3, -2, 0, 9, 1, 3, -3, 7, -1, 16, 4, 4, 2, -7, 5, 1, 5, 3, 5, 4, 8, -4, 3, -6, 4, 0, -2, 14, 1, -10, 5, -2, 12, 9, 3, -3, -3, 2, 11, -10, 6, 6, -4, 5, 6, -3, 0, -6, 8, 16, -10, -10, -11, -11, 7, -3, -12, 7, 3, -6, -9, -2, -7, -7, -3, -4, -5, 2, 8, -6, -6, 1, -15, -5, -6, -3, 5, 7, 4, -3, 0, 2, 15, 4, 4, 1]
6920AJmJRj1%J2j0J7j6NmNqLkJ0kj7MMPnmJ1pnMmOnLqOjljRKKklJ6nmMronMM%
6972aqKjRJJ0j5J0%QqOqqoO%NQj0%Rj0J4j9KRkqLOpLkKk1J0KLlkrJ1kLlJ1rqN
7022a2J4kj0J1pj%j0L2j5mkRoNNmlRpMjlQ%j1kJ0mjnjJ4kmmNpj0J1nPKj2JJ1j1
7069hJQj3ROj1rJ7mJOnNj4qJ1OokoK8k2MNJJ0j0j%K1j3PqpLmJ0j1J0jj5J3j9J8
7113CnJj1J1JKoRnmmLQj5RrJ0NoKoPjmKj2ONpMN%OKrJ3j3J6j7LQJ1j1mn%J0mJ
7162EJ%j0NklMQmLj5RjLk0J7LJ1k1QRj3NmpRojJ0j0pNLrMMjnkOJPJlLMj5J7j6
7211a0J3kj1J0LonJ7j5OlJ0qJ0j1rM%%RJ3j3MKKojmKKjj%jMjJOqokMKoQj2OkM
7260bj2J8jj3K3j2j2OOlKJ2j3oKPJ0j3NpJ2J2qj2KRqNjkj2Qjj5J8Rk1KJ9j4kN
$$ y = [1, 2, -2, -1, 8, -3, -3, 9, -1, 16, 0, 5, 1, 6, -2, 1, -1, 9, 7, -10, -6, -2, 5, 0, -4, 7, 0, -5, -1, -5, 1, -4, -1, -9, -3, -4, -7, -8, 1, 3, 5, 3, 0, 16, 11, 7, 11, 2, -4, -9, -5, -1, -1, -9, -7, -8, 1, 2, 12, -3, 7, 7, 15, 7, 13, 5, -3, -9, -3, -3, 2, 10, 0, 0, 9, -1, 13, -6, -4, 5, 3, -5, -2, 4, -3, 0, -2, 0, -21, -11, -9, -6, -9, -11, -20, -9, -11, -8, -11, 0, -9, -17, -12, 2, 0, -10, 1, -6, -7, -7, -17, 15, 0, -4, -6, 3, -3, 2, 7, 3, 0, 9, 2, 6, 5, 2, 10, 10, -1, -3, 7, 3, 2, -3, -4, 10, 8, 4, 0, 5, -2, -12, -1, -6, 1, 3, -9, -8, 3, -8, -7, 1, -12, -3, 3, -8, -17, 0, -4, -3, 3, -2, 3, -11, -19, -8, -2, -8, -10, -16, 12, -10, -6, -1, 0, 10, 0, -1, -1, 20, 7, 14, 6, -1, 2, -2, 8, -3, 7, 6, -9, 4, -15, 3, -2, -1, -12, -1, 0, 2, -4, 5, 0, -4, -8, -5, 3, -12, -3, -12, -2, 3, -3, -1, -7, 0, -1, -5, -3, -15, -9, -4, -11, -7, -2, -2, 4, 6, -3, 10, -3, 13, -4, -1, 7, 18, 7, 3, -2, -2, 8, 4, 5, 6, 6, -4, 1, -1, -4, 0, 8, 4, 7, -8, 1, 0, 3, -17, 0, 3, 14, -7, 1, 10, -3, 2, -2, -9, 0, -6, -7, 3, -7, -14, -9, -6, -15, -11, -7, -8, -13, -15, -9, -8, -1, 0, -3, 0, 4, -11, 6, -10, 3, 1, -10, 0, 3, -3, -8, 9, -6, 0, -3, 7, -1, 9, -2, -11, -7, -7, -7, 2, 15, 2, 6, 8, 10, 4, 3, -1, 1, 3, 2, 1, 1, 0, 4, 3, 4, 10, 2, -4, -6, -2, 0, -6, 2, -10, -4, -6, -2, -14, 4, 3, -10, 13, 1, -11, -5, 1, -2, 0, 12, -1, -7, -5, 2, 12, -1, 4, -3, 9, 21, 13, 1, 3, 12, 4, 9, 8, 6, -6, 2, 1, -14, 4, 13, -8, -6, 13, -1, -3, 2]
7302BLrJMNj0Qk2J4JpOJ%nRqRoJMj2kJNkNjjMqJ3%M%qRj2%PjKjNpNjmj0J2OmL
7355Hj3%O%RpjpJOOj6%MJJ1j3POlmoLJ1ojqpRN%%j4J9mqnJ3jkJRj5J8j1OlPln
7405CoJQqNqJ0MKrJ2j8mJ8j1lJJ5k2J7Pk1%lQrMOJNrOmJmNoOJ3j2Nkj6J2Jkj4
7452a5J5LKOMk5J9j1RpLQMj1QolrJ3jmJ1kj2QrJ0mqQj7K4j0K%nrRpJ1o%MPj0p
7498a0QMjloJ2lmmMrqK3Qk3J8roK9mj8OJlOKJ%j0jKRoJqK2qJLj1OLpmj1RjPjj5
7548iPkMmpOMjkQ%kjj8jJ6KnOokJ4lllLoJ5pKj0K4lplkNrRnmjJ0rL%j2J0mJ8k2
7599gJ8r%pNQj5J5j7mNNoONmqMnQ%Nm%NOj8j1J5lLkJ0KLjqnOkRJrkJ1nmQJ1j5
7649C%jjkONknMjJ0j6jMj2Rj8J6OJlJNj1kOmOjQqKrJ1j2MOjjlOj8RJ1j2J4j6Q
$$ y = [2, 5, -4, -3, 1, 6, -4, 4, -18, -4, -3, -10, -4, -3, -3, -8, 1, -7, 2, -4, -3, 1, -11, -13, -12, -7, -9, -4, -5, -6, -2, -10, 3, 3, 7, 7, -1, 8, -4, -4, 3, 2, 4, 3, 8, 1, 6, 5, 1, -9, 3, 9, 5, 8, -5, -5, 1, 1, 10, 3, 2, -5, -4, 2, 8, -8, -8, -4, -3, 8, -5, 2, 8, 5, 1, -5, -2, 9, 3, 2, -6, -13, -4, 1, 1, 1, -13, 6, 2, -6, -11, 2, 1, -1, 0, 9, -6, 12, 1, 7, 4, 11, 8, 3, -3, -2, 6, -2, 3, -5, 5, 9, 11, 2, 14, -4, -8, 10, -1, -4, -3, 12, -10, 7, 14, -7, -7, -10, -2, -11, -7, -1, 0, 5, -4, 2, -2, -1, -5, 0, -6, 0, 13, 1, 6, 4, -12, 0, 1, -1, -15, 0, 3, 5, 11, 15, -10, 9, -2, 7, 0, 3, 11, 15, 4, 12, 6, 3, -6, 7, 6, 2, 13, 11, -1, 7, -2, 8, 4, -4, 4, -13, 11, 1, 3, 3, -2, -11, -2, -9, 2, -4, -4, 0, 7, -3, -10, -2, 2, 1, -2, -8, 4, 1, -3, -7, -3, -12, -20, 3, 11, -12, 6, -3, -9, 20, 16, -2, 4, 5, 2, 8, 10, 11, 11, 1, 0, 2, 11, 5, 6, -2, 20, 12, 13, 16, 5, 11, 14, 7, 3, -8, 1, 0, 7, 6, -9, -2, -4, 0, -4, -11, -5, -1, -2, -4, 4, 4, 2, 1, -17, -18, -2, 0, -5, 1, -5, -7, 7, 4, 1, -2, 1, -5, 10, 3, 5, -5, 19, 16, 9, 6, 4, 9, 0, 9, 4, 0, -1, 9, 0, 3, 3, -9, 1, -3, 15, -7, 11, 2, 2, -5, 0, 8, -7, 8, -9, -13, -8, -3, -9, -3, 2, -2, -10, -6, -11, -3, -3, 2, -2, -2, 3, 9, -9, -20, -5, -8, -5, -7, 3, 5, 8, 7, -1, -6, 0, -2, 7, 8, -1, -3, 8, 3, -1, 7, 18, 3, 3, 2, 1, -1, 5, 10, 8, 3, 7, 6, 16, 0, -1, 3, -9, 0, -18, -2, 4, 5, 2, 3, 8, -3, -5, 1, -3, 3, 2, 10, 2, 4, -5, 6, -6, -2, 4, 3, 2, -1, 5, -13, -4, 7, -5, 9, -7, 1]
7697AQNj4J3opLJpMJJkLLKpQj2POpk%PrMlQmkQk1RlJK%kkJ4j8JPKkpJ6j0oMLL
7750BJ4pp%J5j0j6J5jmpJ5orJ5plJ1j7RP%%JoKNPj5NoJ1Lj9OqJ4j0KKpJmLKP%
7797EoOoLnJ0qj3RnJ9j7Qj0%MRNkmLjMj4K9mj3J2j6PlonJ6Lj0jJJ6rj0J0%oPj1
7843AQqNjq%J0%rOKj0J4qOQjj4mJ2plN%j7J6Lj3J2j0OLJNLrRlQ%j2JrK0j5OnP
7891A1oPqKRpj%jlmQj6J2JkoJj1J1K%lJ%JRk1J4PKj0Kjj0J2Kj3J0KklJ0j0QJ0
7937A6npKj0J1kmMMLLrmqK7q%Lj0MKJkqJ7k0JJkJ0j0NNmkmrKJ5PokrLjMj1J2%
7986ErOJLjqj3J8RoMmrJ2%mnOmQKmllJkOoK0pk%qK4j5oQj7J4rjk%%jmQ%Qj1R%
8038Hj3NqOmNmJ0pNKopKMmQOknLJ1j1kRLoj4MMKNoPrOOj4OmJ5ooNLmqOj0NNmj0
$$ y = [1, 9, 14, 0, 13, 7, 0, 3, 4, -3, 1, 2, 3, 1, 4, 7, 9, 2, 10, -2, 5, 11, 4, 2, 2, 9, 0, 4, 1, 9, 5, 3, 11, -10, -1, -4, -3, -1, -1, -3, -5, 9, -9, -8, -1, 1, -1, -8, 8, -2, -8, -4, -1, 2, 16, 9, 2, 2, 17, 7, -9, 6, 5, 1, -6, 9, 3, -6, 9, 2, -1, 10, -7, 2, 9, 9, 9, 10, 4, 6, 11, 18, 3, 8, 2, 13, 16, -3, 3, -5, 9, -1, 1, 3, -4, -3, -7, -4, -2, 5, 5, -1, 5, -1, 2, -3, 7, -1, -14, -5, -10, 9, -8, 0, -10, -10, -6, 3, 8, 6, 2, 5, 4, 8, -6, 23, 19, 6, 18, 2, 9, 6, 0, -5, 11, 14, 4, 3, 4, 20, 11, 1, 11, 11, 5, 12, 1, 9, 1, 6, 5, -3, -3, 7, 7, -2, 4, 6, -4, 10, 2, 8, 16, 15, 1, -3, 9, 2, -1, 4, 4, -13, 3, 6, -7, 5, -5, 1, 4, 5, 10, 13, 4, 13, 10, 18, 18, 6, 7, -2, 18, 3, 9, 4, 11, 5, 12, 4, 6, 15, 8, 7, 7, 6, 3, -1, 7, -9, 3, 4, 2, -4, -3, -14, -3, -1, -1, -4, -3, -3, -2, 7, -14, 0, 7, 9, -1, 1, 0, -10, 2, 4, -9, 1, 3, 1, -2, 8, -2, 6, 16, 11, 4, 6, -4, 7, 5, 1, 5, 9, 12, 15, 6, 2, -6, 21, 13, 13, 16, 6, 10, 12, 13, 11, 3, 20, 0, 1, 2, 0, 10, 0, 5, 10, 6, 4, 0, -9, -7, 8, 15, 9, 7, -2, 1, 0, 4, -7, 5, 5, -4, 2, 3, 6, 5, -3, -16, 2, 11, 5, 9, 5, -4, 8, 8, 4, -1, 5, 1, 9, 11, 7, 4, 1, 2, 0, 6, 0, 20, 13, 11, 11, 3, 27, 12, 6, 14, -3, 11, 2, 1, -1, -1, -1, -2, -6, 2, 2, 10, -1, 8, 8, -5, 0, -8, -2, -6, -1, -5, 5, -2, 3, 5, -1, -8, -6, -2, -6, 2, 8, 6, 1, 4, 15, 4, 2, 11, 14, 8, -6, -2, 2, 4, 9, 3, 10, 1, 7, 13, -1, 5, 1, 16, 10, 4, 9, 12, 8, 0, 6, -4, 1, 6, 2, -8]
8091hQlRjrK1mj4RMj7Nj7NJ9k3J0%m%PjLJnJ4rjOnLnK2k2MlKlMKMpKkQl%LJ3j4
8141HKlj4KJ4rJ%KRnjmMnLmJ3j9NM%Kj4J3oOj5NMKlK%J2k2OK2j6rlJ0kK3j4qm
8188fNjJ1
$$ y = [-8, 0, -3, 6, 5, -4, 17, 13, -1, 8, 12, -5, 0, -17, -12, 7, -16, -6, -6, -10, -10, -3, -4, -1, 0, -5, 9, 0, -1, 5, 0, 3, -2, 20, -2, 2, -1, 1, -2, 2, 4, 8, 1, 3, 1, 9, 6, 6, 9, 22, 8, 10, 7, -7, -5, 9, 0, 1, 1, 3, 12, 7, 6, 2, 6, 1, 4, 0, 13, -6, -1, 3, 3, 5, -9, 4, -2, 4, -11, -6, -2, 0, -3, -1, -1, 11, -11, -5, 17, 1, -8, -11, -1, -3, 20, 6, -2, -6, -1, -2, 9]
8191I
$$ Imaginary data points
##PAGE= N=2
##DATA TABLE= (X++(I..I)), XYDATA
0@%%%%%%%%%Qj6J6j6K4l2L2m0M9n7P2q8J01j15J34j52J73j98K25k57K90l26L66
32A93m10M62n18N76o41P13p91Q79r74J078j193J320j462J620j799K002k231K493
50A317k802L167l609M158m855N774p051Q966j2179J8855n3348P6287L7355j61151
64h9116J10836M9194j42489M2947J01033j03107P784P6712p0757k1364O7839l4376
76d864o648M0369l5964j2382L5409k8081L149L7268l1018j4588L1202k0552q462
89a5162L1060p933j4183P878q297M387O509j0163J6703N08l4029K1843J9437l9009
103b0451J9071L4033m9367l589M5043l2717j1130M6307k3991k4252L3926j4617
115a734j5184L4881j4276j7156K9924k2184j7940M6296j5429l2214M6414r426
$$ y = [0, 0, 0, 0, 0, 0, 0, 0, 0, 0, 8, -8, 8, -8, 16, -16, 16, -24, 25, -32, 40, -48, 53, -62, 72, -80, 93, -105, 120, -137, 153, -173, 193, -217, 245, -273, 303, -338, 375, -416, 463, -511, 567, -626, 694, -768, 852, -947, 1055, -1176, 1317, -1485, 1682, -1927, 2231, -2624, 3150, -3901, 5065, -7114, 11741, -41607, 34680, 72035, -89116, 21720, 70914, -71575, -28628, 72405, -30702, -22918, 53794, -16963, -38327, 29512, -4864, -11512, 28857, -7107, -19489, 15920, -12161, -9012, 28256, -2762, -17350, 13852, -6700, -15162, 15898, 7965, -6218, 1660, -6637, -2250, 4259, -5904, 10799, 11307, -22722, -879, 18558, -20451, -1380, 32653, -16714, -20303, 24740, -7977, -19107, 27200, 3209, -21043, 12883, -1734, -16918, 17963, 3687, -13469, 16455, -5729, -23669, 22627, 7198, -25016, 21398, 11972]
127A1972m9484M6461J7921n3686K7745L0265n4583N171M4895l0991j0845L5500
139B0341j8376k1159K3921Q33j0979J0625j408p384J482l119O811O893j1854K115
153a258P479j5138K964J7598j1833m952J3433j1676o912J7051l783p120J1201
166G054p663r036J3909k178p550J3223m246j3823J1899K518j1161J0807M346j4553
180f454L469O713p455L590N529o381K44O12m172O161J375o372O561n21j1780R028
196A47P398j3036M760J0093j5098j653J5235p976n906J3449m749j1297R418L219
210D004p547M623L392o612p83L114Q4L85J43M83q78l984K153M806l661n13M410
227C619n408k791P329j470l722N936j997o526N162K037m391M091J253o362J745
$$ y = [11972, -37512, 8949, 26870, -26816, 929, 31194, -23389, -18218, 26677, -4314, -15159, 20341, 1965, -19194, 4727, 5560, -5419, 5206, 3798, -3586, -2104, -5223, 1588, 8481, -3373, -1258, 6221, -8917, -5953, 11645, -188, -5140, 8293, -3383, -10295, 6756, 2973, -4147, 7054, -609, -9645, 4264, 2086, -5464, 7759, 3513, -10310, 1589, 4107, -7054, 3753, 8099, -6454, -2985, 3728, -3727, -137, 5392, -989, -745, -133, -4305, 1856, 3231, -3141, 3420, 2899, -8881, 147, 7545, -5491, -731, 9362, -5736, -7389, 7846, -130, -6036, 7413, 2664, -8633, 785, 4004, -3543, 1080, 4472, -2140, -2923, 191, 275, 660, 803, 1286, 408, -3576, -1423, 3383, -278, -791, 3619, -1789, -4580, 2749, 1279, -2443, 3493, 1496, -5030, 132, 2169, -2222, 1869, 3122, -3240, -1495]
242a495L080l216K045K720l932o40J512j540J680J889k009L5m76k043K835J313
258A758k686K134L52m876K264L630l731J089L439n184j374N292j746k013M180
273B528j364m057K513J421j932J475J305k279j249J112J046k01k08J043r61k350
289b158J849J799k281R91K164l800r94M105j318j779L575j202l760K803J320k743
305a429J914J780l343m95K197q47j48J733p60j568K74O51J14Q1M99Q7j490n05
323a255J652Oo98J396n44k272J307J441j627O87J528k241q78K070m59o77J791
340A227n31k006Q63R12p83N24P64j063o30N00J65N6M79Q7p18n90M51N97j78M9
360A75L36p17n63P80K32l71N86P3j203M7R34k19j40N87m13p86M44M32k96K33M03
$$ y = [-1495, 1585, -1631, 414, 3134, -798, -1438, 74, -1466, 214, 2103, 94, 129, -347, -2390, 445, 1758, -928, 1206, 1558, -3318, -1054, 2576, -1155, -66, 3373, -1811, -3185, 2107, 361, -1652, 2528, 1164, -2893, -380, 1041, -891, 584, 1889, -390, -1639, -527, 519, 318, 110, 1153, 192, -2158, -309, 1490, -791, 200, 2364, -1436, -2430, 1675, 357, -1422, 2153, 951, -2809, -6, 1314, -1429, 485, 2265, -1078, -1573, 624, -223, -371, 1362, 602, -966, -692, -41, 73, 154, 653, 740, -750, -1255, 397, 403, -295, 1101, 557, -1715, -408, 1033, -594, 93, 1621, -620, -1498, 572, 113, -564, 1227, 696, -1310, -447, 465, -318, 206, 970, -93, -723, -223, -58, -2, 477, 564, -154, -744, -293, 304, 126, 175, 511, -206, -769, 11, 243, -128, 458, 531, -672, -625, 309, 90, -50, 537, 124, -662, -218, 214, -82, 151, 554]
381E54o02o20M64N17k35J5L20n71n18P52L21o31L91M93j133l03J292k23p16R56
401E23j15j372P93R72j150M7J236j045q89J386N3j031R04M05j450K24J245p50
419a4n38J154k46j169P28O87r64J41J048r69p51J328L1j178Q75O16j433K11J200
438G57j009l32J446o41j174J194K72j150P15O33j160O3R05o53l00R15j82p42L53
457i0L13l50O0L90k83l84L81K17m76J26N35m91l44O20j49l77N96o3o68M67K89
478C19o25K95L33n30J54K88n34K18M48n12J7L71m47O7M50m52j9N02m52j96N40
499B35k32j61M50l46k77N21j00l09L85q2k82K83o5j81L29m9k60J71o8m0K76k15
521a7j44L69k45k19N11j81l47N52j59n97O24K28p06L03L64o32J14N78m90j86N74
$$ y = [554, -48, -668, -204, 313, 78, 93, 413, -158, -676, 76, 397, -234, 157, 650, -483, -786, 506, 283, -433, 523, 408, -964, -171, 801, -349, -302, 934, -111, -1000, 386, 439, -592, 312, 717, -733, -509, 736, -14, -552, 602, 356, -813, -85, 602, -362, -221, 827, -142, -893, 435, 466, -712, 163, 779, -654, -443, 757, -252, -584, 862, 221, -953, 241, 513, -637, 78, 711, -449, -386, 519, -134, -434, 481, 299, -443, -90, 223, -127, -67, 323, 40, -344, 37, 254, -222, -96, 439, -52, -396, 224, 75, -302, 294, 231, -437, 30, 319, -306, -11, 322, -208, -54, 234, -300, -82, 366, -146, -129, 242, -205, -138, 312, -140, -159, 343, -109, -305, 235, 3, -158, 292, -54, -331, 190, 90, -219, 166, 84, -198, 85, 20, -161, 168, 119, -141, 30, -38, -78, 198, -17, -161, 208, -37, -256, 255, 74, -273, 279, 120, -477, 147, 375, -331, -28, 336, -296, -182, 396, -94, -280, 294]
542B94k20m29L94J94l43N1K07k18j27L10P3l79J05L47l61j73N10j21l69L79%m85
564c61M06L22n98O3M65m16j12N02k31k54L86r4l67L42K19l82OK26j85n3K71o0
586I5k79K35J21l66P6L87k96j59L69j95k37M93r1m97M55J58o05L27L42o39K44
607f2M87p17K6P50o13k24P84m48m01P99l18n67Q22n1p56O04J53o70M78K69o93
628c48L11L71n80J47L54l67Q8J63l07J83J25k73K65q2l61N31o9o14P24J12r46
649e73O83L56j094O74O85j355L62J050j283Q6J271j178k28J359j060m84J551p78
667D4q01J411n93r05J500l79j151J390j25j298J240J80j301J073K65j366R26N17
685F27j254O88N19j198O38N59j154N38O63j152M34O36j034M68O27j145M50P19
$$ y = [294, 74, -355, 39, 233, -110, -59, 148, -70, -197, 113, 186, -193, -88, 259, -102, -275, 235, 114, -255, 124, 124, -361, 45, 367, -231, -168, 297, -119, -231, 271, 40, -214, 172, 78, -289, 53, 272, -110, -104, 122, -63, -116, 155, 95, -184, 51, 172, -194, -118, 269, -27, -186, 183, -12, -249, 244, 153, -344, 111, 269, -336, -9, 333, -306, -62, 425, -292, -266, 484, -129, -353, 431, -17, -418, 381, 63, -504, 318, 267, -489, 115, 268, -402, 76, 345, -348, -37, 334, -246, -99, 255, -112, -24, 139, -168, 15, 140, -133, 132, 50, -311, 220, 151, -463, 261, 373, -573, 110, 466, -628, 46, 731, -624, -262, 788, -495, -409, 862, -316, -544, 815, -245, -729, 822, 44, -757, 654, 61, -844, 656, 277, -874, 516, 391, -907, 333, 513, -788, 285, 550, -816, 110, 627, -627, 61, 580, -618, 20, 579, -575, -37, 626, -526, -92, 544, -490, -22, 605, -540, -90, 629]
703F29j144M34P13j250N43Q84j490M32J232j635K05J591j675k08J968j546p79
720a096K281j046j331K061m92j615J862N7j781J377M26j610R54O38j298O45N25
737E57j204N79O16r65M17M41r59M76N12r20M70M68r73M21N07r50N46O09j216L89
757a79Q61j201K98J023j255MJ277j118l47J454q10p02J277m74p68J126k08q25
775e67Q46q1o52P28j51n61P95k33o93R27j07q87R39R8j083Q32M32j224N18P70
795F46j024J23P94p94n6P31m97j88N69l45j76M07k77%L68m39l7M29l48k0M50l94
817g8j33M57l24j50N11k55k28L95k97j34N58k52l50N03j70m03N45k6m61M42K9
838A79n20L17K62l47Q2J44k34O1J09q0Q3n0j19K11j48j68M17m5m11L07J08m24
$$ y = [629, -515, -81, 632, -618, -75, 809, -681, -249, 983, -652, -447, 1144, -531, -739, 1229, -317, -1096, 1185, 139, -1192, 869, 377, -1238, 624, 681, -1100, 277, 703, -907, 47, 685, -613, 32, 557, -647, -68, 548, -417, 0, 441, -518, -42, 470, -450, 20, 488, -485, -64, 443, -507, 39, 648, -568, -179, 682, -519, -221, 802, -453, -449, 828, -290, -637, 817, 7, -695, 582, 108, -660, 466, 258, -567, 279, 198, -454, 274, 123, -438, 357, 124, -569, 358, 251, -636, 303, 401, -682, 150, 582, -642, -124, 646, -378, -255, 539, -255, -311, 420, -77, -265, 304, -41, -217, 190, -87, -87, 281, -158, -195, 234, -114, -134, 316, -78, -211, 246, -78, -228, 283, 28, -200, 195, -102, -236, 322, 70, -280, 223, 53, -350, 195, 169, -292, 150, 179, -341, -24, 238, -109, -27, 117, -117, -56, 53, -27, 56, 6, -113, 98, -50, -218, 199, 154, -257, 50, 158, -266]
860b66K77K40m08O7K89k81r1K98p0j01P8n9KJ6rJ04r5q3K16j28j87L19K0l09K20
885E9M3l28K89J44m02K07K20m44J33L00l57Q6L22m10p1M32k27j36L36j90j73K50
907H3r2r5K23p0j15Q8j08N6J89k32PK05k53kL13k56p2L72l13j90M61j35k45L70
931A89j62l13M36m6l49L88J7m23L12Q3l71L41J61n08J93K64l89J16K99l41nK94
953A86k83n4L32j72r0J67j37k3J90j50j2J31j31KJ12j61O9J94k61l1K66k10m9
976a15L09k20j62L57j43k51L58k8k91K58J8l00K49J28l14J18J74k53M1J72j61
997e6L7J43j83l6J70p5k7R4j09QR0r5J1J12q4k6O4j00OJ81j19q3J35o3q6J28o
1024C1r4J07lj51Q3P9o3jK2m4J2J1pK8qj4K5n7k7J38j9j27O7M2j03N7J05j35m
$$ y = [-266, 11, 251, -157, -90, 199, -82, -173, 125, 55, -46, 32, -27, -25, -9, -18, 86, -9, -92, 124, -4, -191, 128, 148, -161, 59, 102, -226, 63, 207, -195, 12, 232, -212, -79, 221, -136, -50, 272, -138, -209, 223, -4, -140, 196, 6, -167, 83, -9, -104, 119, 49, -66, 22, -86, -30, 159, -73, -66, 139, -114, -116, 197, -59, -131, 241, -72, -262, 199, 64, -181, 189, 27, -286, 150, 104, -245, 143, 160, -263, 49, 132, -239, 102, 263, -245, -52, 212, -177, -61, 238, -103, -108, 186, -97, -151, 181, 9, -81, 86, -51, -74, 116, -34, -46, 85, -46, -44, 68, -93, -24, 170, -91, -122, 144, -66, -115, 194, -26, -188, 169, 26, -225, 133, 105, -186, 72, 90, -210, 39, 167, -147, -29, 145, -108, -67, 105, -56, -19, 124, -59, -95, 75, 0, -27, 67, -42, -34, 56, -39, -28, 84, 0, -26, 38, -62, -56, 125, 6, -77, 58, -5, -91, 37, 31, -63, 44, 41, -110, -27, 52, -11, -12, 10, -34, -22, -11, -18, 10, 2, -12, 13, -44, -71, 67, 48, -79, -12, 30, -73, -16, 89, -46, -50]
1053e0J49j34q4J91Pj41P4L4j26M6J28j01n8J32m0j21P7J17j04j0M4o5m1J30J7
1078G1j16M9O0j15j7J31j5p1O7k8j47J21J14j37l2J33r8r1J71lq1P4Qj80M5J99
1104A12q9q1J13m2j23J05R4j27L2J14j48j12K00M9j52O1N9j71L6J78j09o1J73
1127A11q5j65J36Q7q4J5L9j11qR5L4o9KN6q5p1J11O0q5J4M1j27LJ89o0j12J34
1154F5l9j65J16J06j02K4N0j31k7J26K4n2MOl9j9N5M7l2j7K0r5RJ60m8j08J02
1181D0l3j26J39O6j39O7R2k16MK19q7p5J24n9j40J36O5j15M5P5j02r2J07P4q4
1206a5KP6j11n5J55J0j62J08Q7k13J8J99r8p5J66j13j33J96L6j50P4O4j30J2P3
1231B1l7K2L8o1l5K4J4M6k7j2M5p3j8J02m2k3J08r7j10J68jj28J37Rj77J12O7
$$ y = [-50, 99, -35, -119, 72, 79, -62, 12, 46, -80, -34, 94, -7, -65, 67, 27, -94, -17, 100, -4, -14, 30, -35, -76, 54, 71, -45, 4, 64, -51, -68, 63, 48, -23, 44, 16, -131, -10, 104, -33, -65, 68, -30, -121, 50, 47, -34, 40, 48, -132, -87, 112, 23, -58, 55, 13, -110, -5, 89, -38, -6, 108, -40, -152, 48, 97, -55, 6, 65, -106, -70, 108, -1, -62, 111, 26, -139, -3, 84, 0, 15, 54, -57, -65, 30, 64, -5, -3, 53, -32, -103, 8, 68, -17, -3, 38, -89, -86, 103, 43, -69, 65, 26, -139, -23, 83, -19, 5, 55, -76, -103, 23, 47, -5, -1, 5, -34, -53, 2, 49, 17, 0, 20, -75, -66, 94, 46, -62, 40, 7, -119, 20, 86, -53, 14, 106, -110, -106, 113, 26, -49, 75, 16, -124, 12, 77, -38, 7, 82, -20, -112, -5, 69, -15, -13, 63, -48, -103, 52, 62, -100, 8, 95, -118, -100, 99, 1, -74, 92, -21, -154, 42, 78, -72, 2, 66, -64, -52, 21, -16, 6, 44, -17, -52, -28, -14, 32, 5, -7, 38, -35, -53, 49, 7, -16, 92, -5, -115, 53, 52, -76, 61, 70, -107, 5, 72]
1258G2j71J25J05k07J9J08j19O2J02j57L8J04j94Q5J45j98Q0J32k84M8K91k41
1280e5n8K99k66j09L46j44j88L47r1l09K86J1k13K39Rk72J78N2j79J65L5j70J41
1303E4k6j85K37J6k10K03n6k38L06J5l20L14M4m23K93J84m45K95K26n67J82M03
1325C02n10R0M62n00l5M82m19j02N56l33k38M55k63k01M86k06k75M45j84k89M38
1346A61j02k87L93r0l73L97L0l35L21J2l69K98M8l20L06O6l47K36J9k75L12P6
1368A77l85K55Q0l74K92J60m21K52J94n19K22L41m75J47L52n15N5M84m63m4N41
1389C56m38j98N38k85k49N68j99m32M87l5m04M08O9m25K65J28l74K23J84k88R4
1410gJ01k26J10J17j60Q2N0j70R8N9j47J58M3k43J27R8k25J71J23l13J28J78l10
$$ y = [72, -99, 26, 131, -76, -57, 51, -68, -6, 96, -61, -23, 81, -113, -28, 117, -81, -1, 131, -153, -105, 186, -55, -113, 186, -80, -189, 157, 13, -175, 172, 81, -228, 58, 69, -144, 95, 104, -168, 10, 62, -117, 48, 83, -87, 54, 28, -157, 80, 96, -114, 89, 33, -205, 101, 116, -204, 110, 154, -269, 24, 208, -237, 58, 284, -283, -101, 302, -208, -118, 344, -156, -191, 291, -128, -230, 326, -7, -245, 210, -53, -254, 232, 26, -249, 196, 12, -277, 161, 59, -228, 165, 75, -298, 99, 129, -206, 115, 127, -242, 56, 104, -216, 90, 156, -191, 45, 64, -211, 101, 177, -208, 47, 127, -247, 45, 205, -216, 36, 230, -289, -67, 274, -201, -54, 298, -217, -162, 322, -141, -185, 356, -82, -280, 258, -27, -276, 292, 93, -339, 148, 113, -291, 117, 186, -239, 26, 154, -220, 3, 187, -101, -7, 94, -132, -22, 95, -65, 17, 67, -103, -5, 54, -93, 65, 108, -135, -8, 90, -135, 36, 159, -154, -26, 152, -158]
1433a58R4K77l05KK76l08k9L85k51j58L68j89k35L73p0k86L35j1l57K60J26k99
1455a60J68J37l11Q8K02k25L3K11j89m7J46j11J2J33j00n4R9o7%P8p3L0M0j01
1479f1L8Q8j07N0O0j53O2J27j69L2J59j79j4J65j43m0K39j45j25K03p0j24J94
1502H7m3j55J69j6j62J36O0j17N2J8j19Q1P0j03L2L6p1J7J8l2N4J4p3RL1j8L7
1529A2ql0M0l3j6L9moL8m6n1R0j1n4P5oq9P7K0q5O8M3j02J9O0o7K7N8q9J1M7o1
1561c4K1K7l5K5Pn6K4N3l4JJ7o8M0L6n3J4M0o5J3K6m7M7N0r7KP8p0OQ7o9l3Q6
1593C9p0k2P7qm6M9l3l1P0j6k3M1l6j3M1k9j1P8n4n1O8j9m4Q3j7p4N7J9p6M5N2
1624D6n6ONm7K8M3k9NPl5kJ2jJ9L1o6mL3qRK0m5pM5k5j1M3j4j1Lk0lM0Ol3Qrj
$$ y = [-158, -64, 213, -92, -90, 186, -122, -151, 234, -17, -175, 193, 4, -231, 142, 72, -214, 121, 110, -247, 13, 139, -160, 8, 145, -166, -78, 124, -101, -68, 143, -46, -93, 53, -58, -46, 87, -13, -67, 32, -35, -35, 43, -30, 0, 40, -61, -23, 65, -42, 8, 68, -85, -23, 104, -65, -33, 126, -53, -67, 98, -45, -85, 154, 9, -116, 87, 17, -107, 87, 44, -111, 58, 42, -120, 16, 76, -41, 11, 29, -90, -9, 61, -42, -10, 26, -45, -28, -10, -42, 12, 26, -47, -38, -7, -25, 12, 4, -26, 14, -19, -35, 4, 0, -6, 32, -14, -65, 25, 14, -40, 35, 29, -60, 17, 37, -48, 20, 63, -39, -20, 40, -27, 0, 58, -31, -20, 27, -34, -13, 14, -21, 4, 11, -45, -21, 32, -2, -1, 16, -52, -12, 24, -29, -15, 25, -40, -27, -1, -48, -1, 49, -48, -46, 32, -38, -32, 55, -14, -47, 39, -31, -53, 24, 16, -30, 19, -14, -45, 25, 9, -14, 27, -9, -22, 19, -10, -21, 57, 3, -48, 20, 1, -43, 40, 23, -51, 6, 25, -51, -6, 46, -10, -4, 1, -46, -18, 25, -4, 1, 8, -27, -29, -17, -18, 1, 32, -34, -38, -5, -13, -4, 16, -29, -36, 9, -16, -27, 16, 2, -9, -6, -26, -29, 11, 17, -16, -8, -17, -18]
1662a8J3J1j0K4j1l5rL0QJ3k0j8J2Qj1K8j0j6J3k1k0N9Jk3Mj5j5J1L8k3k8L7k6
1695a9k2M1K6k7rjk8PL7kj2kJ3j8j9N4jk9Rk7j1M9J0l3J7Jl5PK5%M%k1k2M0K0
1731B2opj5k2J3NK4qPk5jqJ5L9j4l4Kj5MM1j4j2J6j8l8M3L4k5prk5PM2k1pK4l1
1768b4j5J7J3K5%l7j3pK2L2oj4Jml4K0N2k0qjl7OO2ok3%j3k5K7K0Nnmm1LL7J6
1805B1J9l1l6J4kpL8Rl5Jk1j3M8M3o5%J2m7L7L1j8Mml6jN3Oqom6JL9kJK7l0k7
1842c1KLK4N1l9l0Nj1K5N5l0k9K4m6j2O2Jl1M6n4o0P8L6m5L0ro8K0N3l6M9Kp1
1875c6pJ9J5L7Np0K0J3n2O6K7o7L3J2r3O0P6o4mM1r1OR3l8j2P7r1m0P7k5K5O6
1907G8q3n4Q0l6j8J08m6o5O2l9n5J36Rj17N5j6p6J13K9r9P7j0j28R7N5r7P2K9
$$ y = [-18, -5, 6, -4, 20, 9, -26, -35, -5, 3, 16, -4, -22, -10, -2, -13, 15, 5, -11, 2, -19, -39, 20, 21, -2, 2, -13, -28, -17, 21, -2, -30, 7, -19, -41, 0, 26, -1, -10, -11, -39, -32, 5, 3, -9, -11, 2, -16, -35, 19, 18, -11, -2, -29, -40, 9, 19, -14, 3, 4, -31, -24, 1, 1, 5, 5, -16, -38, 2, 22, 16, 9, -6, -28, -15, -10, 14, 6, 13, -12, -13, -21, -6, 33, 19, -15, -13, -28, -24, 17, 3, -9, 7, -11, -49, -6, 28, 3, -4, -13, -38, -31, 11, -10, -17, 7, -24, -39, -22, -9, 16, 16, -21, -34, -41, -19, 13, 7, -7, -6, -10, -44, -24, 28, 8, 0, -1, -38, -32, 30, 24, 1, 1, -12, -37, -10, 10, 15, 10, 6, -35, -32, 5, 21, 40, 9, -27, -13, -15, -22, 16, 25, -10, -9, -30, -43, 5, 48, -17, -17, -5, -52, -15, 16, -2, 2, -2, -38, -39, 14, 20, 12, 6, -40, -39, 0, -2, -1, 26, -4, -31, -29, -26, -2, 49, 10, -20, -15, -26, -1, 54, 24, -5, 19, -27, -39, 23, 24, -7, 39, -15, -75, 3, 39, -6, 24, 15, -53, -33, 20, -16, 33, 35, -36, -43, -24, -9, 28, 33, -37, -17, -4, -56, 10, 37, -30, 3, 15, -78, -18, 58, -6, -10, 31, -60, -54, 39, 1, -11, 66, -25, -65, 12, -13, 12, 78, -5, -59, 21, -15, -33, 75, 29, -36, 26, -13, -68, 68, 77, -40, 15, -1, -77, 36, 65, -34, 43, 33, -95, 2, 57, -40, 32, 61]
1935F1j75O7J06j15O5O5j44J7R3j00L6J18j11m3Q1r9M5J25j08m9J21j28oJ78q7
1960A3o9J49j29j06J89lj03J45o1j56J51J8j08J57k6j67J19J3r8J33K7j99J08
1983cM3j48J46P2j86P8O1j84R9J52j81L9Q7j94N5J78j56J3J38j87k4J66r0k9J68
2008A13j40r5J63m7o4J68p3j21J24n9o5J70k2j26J06m6r6J78Qj42J15j7j52J35
2032A5N1j29J19J3k02J15R8j31Q8N8j87N7J09j33P1J17j73k6J08r9L0J58j31o3
2056f7J06r6k8J67o2q0J13q8p7J69k4o9R3o7j02J26K1q3J09l5j08N9M0o5J03m
2082E1j19M5J6n0J04J5r7M0pq2R7P6j04L7Pj16P9Q7r4L3O0j57K0J26r2K5J01j30
2110b9n8J22l8j9J08q6r3J17k7l5R4k1q8M5j8k9R7qo6L0k9l9P6J0l5N9o1n0P2
$$ y = [61, -114, -47, 59, -56, 9, 74, -70, -53, 40, -60, -24, 94, -17, -60, 21, -78, -33, 92, -16, -65, 56, -72, -78, 100, 13, -56, 93, -36, -142, 47, 44, -59, 86, 25, -131, 20, 38, -70, 87, 61, -106, 13, 26, -72, 61, 88, -111, -3, 40, -108, 38, 110, -76, 2, 63, -121, -22, 130, -51, -12, 75, -119, -64, 114, -42, -29, 109, -78, -102, 64, -26, -55, 113, -27, -122, 41, -6, -70, 98, 25, -96, 28, -31, -96, 74, 52, -74, 32, -14, -110, 68, 76, -66, 49, 32, -120, 15, 66, -63, 56, 69, -133, -18, 80, -51, 37, 95, -92, -35, 74, -59, 12, 129, -44, -70, 38, -61, -31, 127, -4, -67, 39, -57, -85, 82, 20, -60, 53, -35, -112, 57, 33, -36, 57, -10, -112, 14, 35, -48, 61, 26, -82, -23, 17, -48, 55, 51, -68, -23, -7, -57, 47, 62, -35, 5, -2, -84, 13, 89, -15, 22, 29, -87, -8, 79, -15, 18, 78, -79, -59, 67, -25, 0, 101, -29, -87, 35, -3, -22, 86, 0, -93, 24, -3, -38, 56, 35, -53, -8, -26, -55, 42, 34, -32, -2, -31, -70, 6, 16, -19, 40, -21, -71, 1]
2139APk4P2n3p8P4Mm5Q9nr7M5J4p5J05M1j07L2J6q7Q6O2j07L0L7j18O8P7r0K9
2169CO0j27K3Q5o5J6O8j04k3R1n6JJ13q5m7N9n1J4R3o4l6L6n1%R9n5j6N9r0k5
2199g5J16m3j9P3q1m9J11k9n3J19n1r4R5k1p0J32Qj46P6M1j12R5M5j08M5K6j06
2226g5P0Q5j01J5L6q6L6P2p3K3N4j19J7P9o0J7R2j20l3J00m6k5J08p5m7P6m1k7
2254d8R3l1o2N4k7m0J01np7M7mo0P7Nn4P8k7r1O0M2p1O6J3r3N5M7r2N1P0j11J1
2285b3N8p9K3J10r4k8O9n8j5Q6k4n1M9k9m8P3ll6M3l5l6N7ol4N1k1o7O8kl9P2
2316C1jq4M0K9o6N5L3q6M1K8o6L1O1m3nK2m9J7N7n3KK9m2KL5l0J2M7p2JM8l9k
2349a7N1m6k9P4m8k6P4j5o7M9j0m0P1J2p2L1Om1L2L3l9MJ6l5J7J5k2L2nm6K3K5
$$ y = [1, 8, -16, 56, 3, -75, -1, 3, -42, 47, 42, -55, -10, 4, -71, 34, 75, -32, 0, 16, -71, 15, 77, -30, 0, 37, -81, -13, 64, -26, 3, 63, -64, -41, 44, -21, -5, 63, -41, -64, 27, -29, -28, 85, 0, -47, 12, -39, -25, 68, 4, -32, 4, -47, -47, 52, -3, -19, 40, -50, -75, 41, -2, -21, 52, -29, -78, 33, 4, -49, 70, 19, -75, 20, -1, -71, 61, 69, -77, -1, 40, -72, 23, 68, -40, 5, 31, -75, -5, 80, -21, -6, 30, -56, -20, 52, -21, 2, 56, -63, -46, 33, -27, -10, 82, -38, -71, 29, -17, -42, 66, -9, -56, 20, -21, -48, 45, 14, -48, 6, -21, -61, 40, 35, -42, 5, 1, -59, 18, 23, -31, 47, 20, -71, -11, 31, -40, 26, 39, -54, 1, 48, -44, 7, 77, -34, -23, 35, -44, -21, 89, -5, -33, 36, -22, -37, 49, 25, -26, 23, -6, -54, 19, 16, -20, 23, -12, -48, 9, 3, -31, 20, -1, -68, 0, -2, -41, 31, 30, -54, -14, 15, -51, 4, 37, -49, -8, 20, -46, -15, 46, 3, -2, 20, -29, -12, 45, -8, -6, 23, -19, -17, 18, -12, 0, 47, -25, -24, 24, -15, -17, 34, -12, -41, 33, -15, -41, 33, 18, -49, 0, -10, -50, 21, 33, -39, -8, -2, -43, -11, 22, -17, -13, 3, -32, -15, 0, -22, 10, 5, -41, -18, 7]
2381Gm0L0J8l1LJ8l0J8K9k8j8K6j0j8M5k1j0J0lpK0%nJ0k6kK6j5J0jj9NK0k3m
2416a6L3k6j8K5kk0K7jl3K0J5l5RL6k4pJ3k0OJ6Lj5knLMMojJJkJ0J2qk1RK5j5
2455eJJ6j1pJ6k5kK5%k1NJ5jj7J2lppJ2j4OK1pj1MNrNJ3rk4J5KMmJ2k1kONnJ7
2497Elj4J0Oj5LJ3JpKj0rJ9%j3NK3k6ORqpPKj7J2J8qp%PJ2j2Ojmj8Qj%Qkk2J8
2541dOj2J0J2k3KJ4l5JM6k9k2L0J0l5L5ol0M3rl2J7jlJ0pQLNk8M3j1k6L4j0k7
2577b1M3mm8K9L3n3L7K5p4K3M9m4j3M0m7JN7n6J0M0l7j6L7j8j0K2l0nL5j7j4M0
2609A4l5qM7m1k2P2k2m0N7j8o2P0ko3O3Rn9L6J8o4M5K2m1J0M0l9OK0m3K8K1m1
2641b2K3K7n2J9K7p2M2M3p5K3O0n1j2M8l9j9P2m3l9O1k3l4M6j5l5N9j3m8M4Jm7
$$ y = [7, -33, -3, 15, -16, -13, 5, -25, -7, 22, -6, -24, 2, -8, -26, 19, -2, -12, -2, -5, -12, 8, 8, 3, 13, -13, -15, 11, -4, 6, 5, -14, -9, 11, -12, -16, 17, -9, -27, -2, -4, -24, 3, 2, -31, -11, 4, -31, -22, 14, -10, -17, -4, -24, -18, -2, 1, -14, -16, -21, -18, -14, -10, -16, -17, -16, -15, -17, -7, 5, -3, -24, -15, 10, -5, -4, 12, 1, -6, 10, -15, -17, 8, 8, -13, -8, 7, 6, -11, 1, -2, -9, -16, -4, -18, -12, 9, 2, -9, -5, 0, -9, -4, 9, 0, -24, -9, -7, -3, -7, 5, -16, -18, -12, -7, -12, 5, 2, -12, -2, 4, -11, -8, 5, 6, -1, 1, -9, -18, 1, 1, -12, -7, 16, -10, -4, 5, -3, -10, -3, -1, -18, -6, 12, 4, -3, -3, 4, 16, 4, 10, 9, 5, -13, -5, -6, -6, 2, 0, -22, -4, 2, -10, 0, 12, -11, -9, 5, -30, -29, 17, -12, -34, -4, 6, -29, 6, 0, -30, 13, 4, -28, -11, -12, -15, -5, -12, -4, -1, 4, -24, 19, 8, -18, 16, 6, -21, 22, 18, -30, -1, 32, -21, 16, 41, -33, -10, 39, -5, -18, 22, -25, -24, 33, -23, -13, 27, -10, -26, 11, -7, -17, 5, -25, -30, 5, -12, -26, 14, -21, -29, 18, -23, -45, 27, 5, -35, 22, 4, -58, 12, 10, -53, 10, 19, -40, -4, 14, -50, -5, 17, -24, -14, 26, -13, -7, 13, -30, -2, 19, -22, 1, 28, -24, -5, 22, -50, -8, 35, -40, -17, 43, -8, -20, 28, -11, -30, 42, -1, -40, 21, -2, -36, 10, -5, -40, 19, 6, -42, 2, 3, -44]
2672d4N2rm7N3J4o1M0J4n7L1L2n4K7L7o2J1M7m8KM7k6j8L9k9j4M7k2k5L6j3k9
2703b9L3Mk4J7J7k2J5j6%K3j7j7L4k7k8N4j6l1N0nn9N2K0o5J9M4o1QM9m4j7M6
2735Gj6k6N6k9k7N2k5k9J8J5j6J4J0l2L7j3j9L0%j6M%pK4j3j3J3Jj1J9%j1J5l
2769Ik6K0%j1K2rrJ3Mk5QJ6qj6J6j1mJ4j7MLMj0J5j2pK9k6qK0Pkj8J4j9rK0K0
2807A1l1K5J0m3J5M8m9j0M3m2lM7j8k7L2Ol0J8mj1K8Km2K9Nk6K5Kk3J7J3l3J3
2840cJ2j9Nkk9K3K7l4K5Ll6K2K3m7J3M3o1JO1m5NL4n2OM2l0j7M3k2k9N0l1j6O5
2874C0l6l2O7l2m4P8j1m2M7j3n5N0K3o0L2K8o2K5L5l3J6K1n2J8K9n4K6L3n6%N6
2905C2n7J6M2o3J0M7n3j2O4l1j4L5m0k3O2k1l9O3j9l7M4pk5L9nn0L1Mk3M4lm6
$$ y = [-44, 8, -1, -48, 5, 19, -42, -2, 12, -45, -14, 18, -36, -9, 28, -34, -23, 24, -24, -22, 25, -1, -19, 20, -9, -23, 24, 2, -23, 13, 0, -29, 4, 8, -16, 1, 18, -4, 11, -5, -5, 18, 1, -16, 18, -9, -37, 17, 1, -30, 20, 15, -44, 8, 28, -37, -18, 26, -35, -27, 22, -22, -39, 7, -9, -35, 21, -8, -35, 17, -8, -37, -19, -4, -20, -6, 4, -28, 9, -4, -23, 7, 7, -9, -5, -5, -12, 12, -1, -14, -1, 0, -11, 8, 8, -3, 12, 9, -17, 3, 3, -8, 14, 5, -4, 9, 13, -12, -4, 12, 4, -12, 4, -7, -11, 3, -14, -10, -7, -3, -13, 2, -10, -17, 12, -14, -22, -2, 5, 3, -15, -1, -20, -29, -9, 11, -20, 5, 15, -28, -13, 35, -14, -24, 19, -23, -26, 21, 3, -24, 8, 14, -16, 2, -2, -13, 15, 17, -25, 4, 9, -17, 8, 10, -13, 4, 17, -16, -3, 9, -10, -5, -7, -36, -13, 14, -20, 5, 8, -28, -6, 17, -30, -17, 26, -35, -34, 27, -18, -13, 21, -31, -25, 17, -13, -30, 13, -9, -38, 12, -19, -35, 30, -6, -38, 29, -3, -47, 31, 20, -22, 25, 12, -43, 7, 30, -30, 2, 30, -32, -7, 28, -5, 11, 32, -20, -2, 27, -27, -1, 32, -24, -24, 32, -25, -9, 33, -30, -20, 27, -26, -38, 26, -5, -19, 16, -24, -47, 15, -6, -45, 18, -1, -38, 6, -1, -26, 13, 8, -42, -11, -7, -30, 14, 11, -35]
2937c5M3Rm3K3K9n0K6J0m9K8N5o3J3K8m5RM3m0j5N0l0j4L8j8l1M3k3j9M0j9k6
2968c3L4mk9M0k8kL1lm4J5K9l2K9Om7L6Ll7J7K3l0J9Pl4K9K3j7rK2l4J2L3m5J0
3002a0L1l3NK9k7oL3k8nM5l2k8L8nj6L1k1l6K9K9m6K5jk5K6Kk7K0Pk1jJ3qJ0P
3037Dk1nMqJ4Oj7J2Ok0LL1j2j6K5prK4k9jK3j4J1Lj8%J9j7OJ5mklpQJ0j0qJ4k
3077Hk7K9j0pJ9nj4JK1k4mJ2LqMklj1K9j9nOKj8PJ5rLLnqJ7%j6jK6k2KM%jJ5j0
3120cj1RJ3j0rJ5Rk2OMpNK2k3rK3pk1K4lj1PJ5l5OK2j4k2K2klRj9J0j0jJ5k0J5
3159a1J5rk2K0Kj2RJ9l4J5K0k7lM0k1k1K4kj8L3qk8K3Mk5J7Lj5POqRLj2J3oj2
3196a2K8k0k5M7rm1L7Om2L6J3n6K2L4l7kL6k1j2K5j3k5L5j0j0J9k5mJ6rJ0J2k9
$$ y = [-35, 8, 17, -26, -3, 26, -24, 2, 12, -37, -9, 46, -17, -4, 24, -21, -12, 31, -9, -24, 26, -4, -18, 20, 2, -29, 14, -9, -28, 12, -7, -33, 1, -3, -32, 8, -20, -22, 9, 6, -38, -23, 6, -26, 3, 9, -38, -2, 1, -36, -19, 4, -26, -7, 0, -34, -5, 18, 1, -8, 14, -20, -8, 25, -20, -10, 21, -12, -7, 22, -5, -11, 22, -6, -11, 34, 2, -26, 12, 7, -9, 22, 1, -35, -6, 23, -23, 2, 1, -24, 2, 4, -23, -3, 4, -17, -18, -5, -13, -3, 4, -17, -22, -18, -26, -12, -6, -23, -11, -5, -25, -22, 9, -3, -19, 6, -1, -10, 14, -15, -16, 7, -7, 4, 7, -11, -11, 8, -9, -3, 12, 8, 6, 3, -4, 4, 14, 4, -4, 10, 8, -19, 10, 0, -7, 12, 7, -7, -6, 15, -9, -13, -1, 2, -6, -2, -4, -7, -18, 11, -8, -13, -7, -5, -23, -16, -1, -10, -7, -4, -9, -17, 0, 0, -16, -17, 9, -13, -11, -7, -7, -8, 7, -3, -14, -5, 8, -2, -11, 4, 13, -9, -3, 1, -6, -1, 21, -2, -11, 12, 5, -16, 8, 5, -6, 1, 16, -19, -13, 9, -5, -27, -5, -7, -10, -1, -20, -10, -20, -21, -6, -26, -11, 4, -5, -27, -7, -5, -17, -8, 11, -23, -8, 12, -15, -18, 22, 1, -20, 4, 2, -16, 17, 9, -19, 4, 8, -17, 0, 3, -12, -5, 1, -7, 2, 5, -7, 6, 0, -12, 16, -4, -29, 18, 9, -32, 5, 11, -31, 5, 18, -38, -16, 18, -19, -21, 15, -6, -18, 7, -6, -31, 4, -6, -16, 3, -22, -26, -10, -19, -9, 3, -26]
3229b6LL3l6RL5l9j4N8k1l8N0Mo1N6Nn8M4J9m9J5K3k7J9K3m3QL9m4OJ9j7nK8m1
3263b3OL5m7J3K8k8J6K6p0K9M7n0j4N4m2k5Q4l8n7P6j7n0L0K7n0M1J2n5K7RkP
3295apk7M2%k6L2Rn0L6K1o6M6L4p6K3N7p1oO8m2k0M9k4l1N3j1k6L1j1l6L9ol5
3328c2M8j7k1K1j0k0M4j5k9L1rl6N9k0l7M9mn8M8L9p5N4J9p2K4N4n7rN3l1l3N8
3360A6j4k8M7nl3J6Lj0J7j6J5Ql6mM9l1j3M2k7j7N7k1m0L7J1m7L0J0m3L2K1m4
3392a8J2K1l4J4K1l4lL7l6lK8mk1J2j4QK0k9QJ9l3J1L8n2K7K6l2j9M3jl9M4rl3
3426b5L8Nl4J0K1lk3K1LqPjqj2J6%k1ML0k3k0J9Qk0J5Ml0J7Rpj2J1LlnPj1J4n
3465iojJ4nnkOonMlNL2l2j0M2k7LK5qk4K4nj6K0oj3J6poJ8pmK3l3oL1j3k7L6J4
$$ y = [-26, -23, 10, -26, -17, 18, -21, -35, 23, 2, -36, 14, 18, -43, 13, 18, -40, 4, 23, -26, -11, 12, -15, 4, 27, -16, -8, 31, -13, -7, 12, -5, -10, 18, -23, -17, 18, -29, -16, 12, -16, 0, 26, -44, -15, 32, -18, -32, 22, -20, -45, 39, 1, -56, 20, 3, -47, -17, 10, -40, 1, 13, -42, -15, -6, -8, -1, -8, -35, 7, 7, -19, 13, 22, -28, 8, 29, -37, 9, 43, -33, -10, 47, -24, -30, 38, -4, -24, 25, 1, -30, 23, 12, -14, 17, 6, -30, 9, 3, -32, 16, -1, -22, -1, -11, -31, 13, -2, -31, 0, -9, -45, 14, -6, -43, 6, 2, -56, -8, 31, -44, 10, 29, -43, -19, 35, -22, -31, 22, -9, -42, 16, 2, -26, 21, 16, -17, -1, 2, -8, 9, -7, 8, 16, -20, -24, 25, -6, -19, 23, -4, -21, 36, 15, -25, 12, 23, -24, 6, 16, -27, 5, 26, -18, -6, 15, -19, -5, 16, -18, -21, 16, -20, -23, 5, 1, -20, -8, -22, -14, 6, -23, -15, 4, -29, -18, 20, -32, -5, 21, -11, -30, 13, 12, -27, 17, 8, -25, 13, 18, -16, -6, 15, 12, -11, 10, 13, 5, 12, 11, 3, -9, 7, 7, -14, -10, 20, -3, -23, -4, 4, -16, -1, 3, -27, -10, -1, -8, -20, -9, -6, -9, -14, -7, -18, -4, -9, -15, -16, -2, -7, -12, -14, -8, -14, -19, -15, -18, -13, 19, -13, -23, 19, -8, -5, 20, 12, -12, 12, 7, -9, 11, 5, -8, 8, 1, -5, 13, 6, 2, 25, -8, -14, 17, 4, -23, 13, 27]
3506B7m9L1J3l7K4nk3J2K3l5kL8j7j6QJkOj2rK4j6J1Oj5jK0k8ML0j3k1L5k0j0
3541a8L2k7j4M2j2k0K1Ql2L1J2n2L6J9m6K0L6m5J2K5m0nL6k4j3K7j6rK5nj2J5
3573Gj7j0M5m6JM0k7k5L4%k3J9Mj5J4Jl6L9nj6J4krJ4Kj5K1rk7K3K3l4L1Ml2L
3609iM3l8LL7n3PL9m6JM0m4NL9l3nL6k1k3M3j4k1K3rl2L9Pm0J8K0j8JMj7J1Rk9
3645b7J5Kj4J7Rk6J8Rl2ML3j9JK5l1MJ1jlRj3J9oj0OK3k1ORk1PJ5j4j6L6k4j1
3682a1K7mk0J6Ok6K8mj5MJ1j6oOoOOkLlpLkmkOLkj3J0KllMLmQj2NJ2jnjqOQjP
3730IpJ%nM%Rj1pJ4jJLkjqJkjJJ3j7jJ0plMLrLkLJplj3OJ9mLj2J3j3J3n%%KnJ
3780iOJ5j1j5NJ7roJ2Nj6J4J3l4K8qj3LK1k1J5lj1LMj2jPJ3rpRj3J0Nj9MJ1j5
$$ y = [27, -22, 9, 22, -15, 9, 4, -19, -7, 16, -19, -21, 17, 0, -16, -8, -7, -9, -3, -15, -24, 0, -16, -5, 1, -14, -15, 5, -23, -19, 11, -2, -23, 12, -8, -18, 14, -13, -27, 15, 3, -17, 4, 12, -20, 11, 23, -29, 7, 26, -20, 0, 36, -9, 3, 28, -12, -17, 19, -5, -18, 9, -7, -16, 9, 4, -8, 7, -10, -20, 25, -21, -20, 20, -7, -32, 2, 2, -21, -2, 2, -13, 1, 2, -34, 5, 0, -16, -2, -4, -13, 1, 3, -12, 9, 0, -27, -4, 19, -15, 16, 20, -12, -9, 34, -4, -1, 36, -17, -10, 29, -17, -16, 24, -20, -15, 24, -9, -14, 22, 1, -22, 21, 7, -14, 9, 0, -32, 7, 14, -26, -8, 12, -6, -5, -1, -18, -7, 2, -27, -12, -10, -24, -7, 2, -24, -6, 3, -29, -25, 8, -11, -10, 15, -16, -12, -1, -2, -5, 4, -9, 10, 4, -6, 0, 23, 2, 8, 17, -4, 3, 18, 4, -12, 24, 0, -11, 16, 12, -8, 8, 14, -12, 16, 12, -3, 1, 12, -4, -10, -4, -10, -4, 2, 0, 3, 0, -7, -4, -6, -10, -12, -6, -3, -5, -18, -8, -6, -9, -12, -8, -5, -9, -1, -13, -8, 4, 3, -2, -3, -11, -5, 3, 2, 9, 2, 3, 3, -2, 2, 2, 11, 0, -7, 7, 6, 7, 10, 8, 7, -1, 0, -2, -3, -2, 11, -6, -7, 3, -4, -7, -3, 0, -9, -6, -8, -5, -4, -11, -14, -27, -21, -2, -6, -3, -15, -2, -15, -2, -7, -7, -7, -5, -10, -9, -3, 12, 1, -14, -9, 8, -1, -7, 5, 10, -6, 8, 21, -13, 15, 7, -6, -3, 18, -3, 12, 9, -2, 1, 5, -7, -8, -1, 12, 3, -4, 5, -8, 2, 7, -12, -8, 3, -12]
3819a2kjJ4qj1K0Kj5RJ6l9J8Rk2QK0j3qK2j2j2J1J3k1NJ4pRj1jJ0mRrOOOj7j7
3858a5J8Pk1J1PJLmj8LRj0KJ7k3JJ6j2KJ6k6J0J0k1K4oj8lJ3j1J1mj6K3jlN%l
3897fj2K8k2nL0j7j8K6lj1J1Rk7L7j1k0J9OpJLj8K5k2j1K5J0k4J1J0l4J7J9l7
3931a8J4K0k2nL0l5J4J5l0oL7j1k6L3k8j3K5jrJ3rmJ5j6nL0rk5K8qk6L5Jk6L4
3966A2Mm7K9K1k3rK2j8rM7k9jK3k1qK3j1pL4l2j2K1nPLqk1L8l6POmj1J4j6pL4
4003A0jm0L3Jl7K4J1j4J2J2m7J1L3k9KL2l6nK2Mj1J3mqNoJ4J1j0k0K9rk5L8Ll3
4039a5L0j0l4L9J4l5J1J3k5LK5j7k4K5mj%lLRl3K5oj1J6J2l1J1J3k8lL5j3k0K4
4074ej8j2L0Qm0L9j1j3J8J0l0J8Lj9OL5j6oJ1j2LQRk3J7J3k4qPK0j5j0Rj4mK1
$$ y = [-12, -14, -15, -1, -9, -20, 0, 2, -13, -4, 12, -27, -9, 0, -22, -14, 6, -7, -15, 7, -5, -17, -6, 7, -14, -9, 5, -2, 7, -4, -5, 5, 1, 10, 1, 7, 13, 19, 2, -15, 3, 10, -11, 0, 7, 8, 11, 7, -11, -8, 1, -9, -7, 10, -13, -12, 4, -8, -6, 10, -16, -6, 4, -17, 7, 1, -17, -20, -7, -18, -7, -11, -27, -4, -5, -8, -3, -3, -6, -18, 10, -12, -17, 13, -4, -22, 4, 1, -10, 1, 10, -17, 20, 9, -11, 8, 14, 7, 8, 11, -7, 18, -4, -15, 10, 20, -4, 7, 17, -17, 0, 19, -18, -4, 16, -6, -11, 19, -16, -2, 13, -17, -23, 14, 3, -23, 10, -18, -31, -6, -7, -16, -3, -12, -16, -1, -17, -22, 8, -1, -26, 2, -6, -32, 3, 4, -22, 12, 16, -31, -2, 19, -4, -13, 9, -9, -18, 29, 0, -1, 22, 1, -7, 16, 5, -2, 32, 0, -12, 9, 4, 11, 14, 6, -15, 23, -13, -6, 0, -4, -15, -1, -17, -24, 10, 9, -31, 2, 3, -34, -10, 1, -13, -1, 11, -36, -25, 8, -21, -19, 13, -23, -28, -6, -2, -13, 0, -4, -12, -7, -13, 1, 12, 2, -18, 11, 2, -23, 15, 18, -15, 15, 5, -29, 10, 24, -11, 0, 13, -12, -9, 16, -1, -25, 0, -4, -5, -5, -8, -5, 4, -29, -4, -10, -21, -5, 7, -24, -13, 0, -28, -31, 4, -9, -29, -5, -23, -35, -5, 3, -37, 2, -9, -22, -4, 6, -24, -6, -3, -22, -16, 19, 3, -3, 8, -4, -1, 7, 16, -7, 10, 23, -1, -9, -2, 18, 3, -7, 2, -12, -16, 5]
4110Ejpj6L7l1j3K8Ol4RK4m8K3K4j6rRj2k5K7K0j2rK1k2lNMmKLMpNJ5lpkKj1K0
4151AJ5m8L8J0l4J7K3k3%K8m9kN3j8l4L0Jl1K6J8l5J9J4l6J3J9j9qJ3Nj2jMPj4
4186a0oL1l8j9O3j6m5M3ml5L2L4p0K1M0m0j0L8j6j5L1pl3K9Nj5J5Lj6QJj2L0j0
4220GqJ8k4j6L9k0j9L2ql8M5J1m1L1J9o7J8M5m1%K9k5j3L7k6j4L8j7j9J2J2j0
4252a3Mk3K4Mk5K3Nl6J5K9l4pN5l0k4O1k7l1M1J1n0L1K4o3K9K3l5J1L5l4rM2k2
4285Dj4J5mMqqPKnJJ1l1K2J3l4J7L0m2j9N2k1j6K8j5l2L3J7m0J4K1l5J5J2nmJ6
4321Aj5klJ7Jj5%L3l5j0L1j4j6L5Km0K5K6l8PM1m9RK7k3j8N5k2k8J4Pk1J1Qlj3
4357a5J2kj2ONMj9LJ6j5QPj8j0K5Kl1K6j7jRLj5K2K2k9lQKjOLnPmKkOkmrK2j3
$$ y = [5, 4, -3, -19, 18, -13, -26, 2, 8, -26, -17, 7, -41, -18, 6, -10, -19, -10, -22, -47, -20, 0, -12, -21, 0, -22, -25, -20, -16, -20, -18, -15, -11, -18, -13, 2, -1, -8, -10, -8, -19, 1, 16, -32, 6, 16, -18, -1, 22, -1, -1, 27, -22, -24, 29, 11, -23, 7, 8, -23, 3, 21, -14, 5, 19, -17, -4, 15, -4, -12, 1, 6, -6, -7, -3, 4, -10, -16, 15, -23, -42, 21, 5, -40, 3, -1, -36, -4, 30, -40, -19, 21, -19, -29, 9, -7, -22, 9, 2, -31, -2, 3, -12, 3, 6, -10, -2, -1, -13, 17, 7, -1, 17, -7, -23, 16, -4, -23, 9, 1, -37, 8, 19, -22, 9, 28, -39, -21, 24, -17, -17, 12, -13, -26, 11, -15, -29, 9, -8, -27, -15, -3, -13, -9, -32, -8, -4, -29, -6, -1, -37, -22, 7, -27, -34, 21, -9, -33, 28, 1, -30, 11, 22, -28, 3, 27, -36, -7, 16, -19, -8, 27, -7, -16, 26, 4, -10, 5, 1, 5, -3, -11, -4, -2, -7, -6, 5, -26, -4, 9, -25, -8, 22, -20, -39, 13, -8, -24, 4, -11, -43, -10, 7, -33, -19, 2, -33, -18, -6, -11, -15, 1, -14, -16, -19, -2, -1, -16, -16, 17, -18, -28, 3, -11, -27, 8, 10, -30, -5, 21, -17, -10, 31, -18, -9, 18, -5, -23, 32, 10, -18, -4, 3, -18, -7, 1, -2, -15, -3, -5, -17, -11, -6, -2, -21, -18, -2, -17, -9, -2, -20, -30, -5, -3, -34, -8, -25, -26, -17, -14, -29, -7, 15, -14, -17, -9, -7, -8, -2, 1, -4, 3, -1, 1, -1, 5, 3, -1, -10, 12, -1]
4400ak0K1K0k7%J9l3J9K4ql8M2lk7K2Qk9jJ7k2JL1j4k5J7Oj7JJ7j2lJ7qk5L4J2
4436A5m1OJ4j6MMKj9L0J2l2ML2l0J0%lMORj8mK5j3JkJ8j1k%joK1oj8jK3j6nN%
4477AoQ%pj0J7j1j2J9nrMRlrJ2j6rK5J1l0J0J2k0J9Pj5J1jJk7J3K7k5J6%j9OJ0
4516DqKPKj4PN%j8OJ3rjJ1j5JJ9qj7J8Nk9J1J2j2rK6j7oJ3pk1K0%Qj3J8j2nJ0
4556cjnj5K0qlJJ5j3kJ2qoK3Kl1K1K1k8KL0j7mJ7k2j3L7j7JrRPkj2J4j1kJ2j3
4595aJ1JJ1l6RJ6k1J2J5l7J6Oj5j4L5qj3J0j0j8K2J9l3K3nolOjRj2lJ4k1J5J1
4631Dj7mK6j0j6K1jk6K4Nl3J5L3l1mL8j8j7K0kk0J5J3k5J4%qJ2j0Nmj2lJ2krK1
4668Fl0J1J9j2j6J3poJ3Pk1K3kk1OJ8k2MJ9j5j0L9k1oJ2Jk1K0Qk5K2kj3J7opJ0
$$ y = [-1, -21, 0, 20, -7, -7, 12, -21, -2, 22, 14, -24, 18, 15, -12, 10, 18, -11, -12, 5, -17, -16, 15, 1, -24, -7, -1, -18, -17, 0, -12, -15, 2, -6, -31, 3, 15, -26, -20, -6, -22, -18, -14, -12, -31, -1, 11, -21, -17, 15, -15, -5, -5, -8, -4, 2, 11, -7, -11, 14, 1, 2, 0, 18, 7, 5, 5, 4, -2, 19, 13, -5, -6, 17, 1, -4, 1, 1, -5, 3, 3, -4, -14, 3, -8, -20, -1, -6, -15, -11, -2, -5, -14, -2, -18, -27, -2, 9, -21, -11, 1, -19, 0, 7, -8, 3, 2, 3, -24, -11, 16, -9, 7, 7, -12, -6, 4, -4, -2, 5, 7, -7, 0, 5, 5, -13, -7, 6, -3, -4, 7, -8, -7, 12, 4, -13, 5, 10, -19, -8, 4, -8, -17, 9, -8, -14, -1, -8, -29, -9, -9, -1, -14, 4, -8, -13, -3, -4, -9, -24, -4, -12, -15, -14, 1, -12, -14, -2, -10, -16, 7, 9, -22, -1, 20, -8, -6, 24, 7, 3, 20, -2, -15, 22, 5, 6, -3, 6, 13, 11, -1, 13, 2, 0, 12, -1, 10, 11, 22, -14, -5, 11, -10, 2, 17, -20, -4, 2, -13, -27, 8, 0, -13, -3, -13, -31, -9, 10, -23, 0, -5, -11, -14, -8, -9, 0, -12, -15, -1, -22, -7, 4, -13, -17, 9, -1, -17, 4, 3, -23, 1, 6, -27, -12, 21, -10, -14, 24, 6, -11, 9, 7, -13, 2, 15, -10, 4, 4, -4, 8, -2, 3, -1, -13, -16, -4, -6, -15, 6, -24, -13, 6, -6, -22, -9, -16, -22, -9, -2, -23, 0, -2, -23, -17, 1, -21, -17, 2, -13, -23, 16, -5, -11, 1, 2, -19, 1, 9, -16, 6, 4, -9, 8, 2, -5, 5]
4705E%pJ9k0KJ1jj0J0oj4J2JqLJ6j5%%mjOj9J6pjOKp%J3j7%RqoK0j3LJ6j7j5K9
4748Cj9mK3mk2J4J2j7K3Lj7MMp%K1j2j3J4qmJ2MrQKj3J3%Pj7jl%qPQoj%j0LRj3
4792a4j4J6J0j5RLpJQqjK1j4j9K2mnQJk0J9nKmRnRjrJ6Qj7nQj4%J7j3J3Oj6nK3
4835A4k2LNmjJlJ0qQqj4QLRJ1j8nnjJ6pj1KMmjKJ4%J3k5j2K7rKOnoKrJ9Pmj3R
4881@J6%j3Nj0ONl5L4kqQj4oJ6Nj1KRpj2J1JjJ1k1oJ8Knpoj3J9qJ7oj3J8pj4K
4923b0K4j4jmkOPlmK0k0j8K7NoLoj0J4J1rJ0Lk1KK0j7J5jp%o%J5j0qmJ3j5LK0
4964A2k6LJ8j7qJ6jnMnk1K5J0j9%K2l2J3mQmRrnJ0j0J5nPKj8MLoOJ9lj0kQnkJ4
5007A1j3OLrKJ5kj6%MjOjj4jJ0lOkj3rJ1jJ0%rpRnnRKMrj3pJ9jqJ1Kl%OmO%pL
$$ y = [5, 5, -2, 17, -3, -1, 10, 9, -1, 9, 3, -11, 1, 2, -6, -3, 13, -2, -2, -2, -6, -7, -1, -20, -4, -11, -12, -6, -4, -11, -11, 2, -15, -15, -6, -14, -20, 0, -13, -10, 6, -11, -26, 3, -16, -20, 3, -1, -23, -9, 3, -14, 9, 12, -5, -1, 3, -4, -4, 17, 5, -8, 6, -2, -6, 6, 10, 1, 9, 11, -2, 11, 11, 18, 1, 0, -3, -3, -11, -4, 4, -2, -3, -3, -13, -10, -1, -14, -28, -12, -2, -17, -8, -5, -12, -11, -3, -11, -12, 9, -5, -24, -2, -6, -11, -3, -2, -22, -3, -8, -6, -10, -1, -6, 3, 2, -7, 9, 17, 0, -5, 3, -11, -11, 6, -7, 6, 12, -4, -9, 14, -8, -5, 0, -4, -5, -4, -7, 3, -5, 3, -5, -19, -11, -8, 1, 12, -6, -11, -16, -17, -1, -8, -19, -17, -13, -17, -18, -16, -2, -2, 11, -14, -26, 1, -8, -6, 0, -5, -11, -9, -18, 1, 8, 4, -9, 0, 16, 16, 3, 8, -2, 4, 9, -26, 8, 6, -2, 6, -8, -14, 2, 7, -4, -2, 7, 0, -12, -1, 0, -1, 10, -11, -17, 1, 3, -2, -9, -15, -28, -9, -17, 0, -6, -19, -1, -8, -22, -20, 4, -10, -11, -15, -17, -11, -4, -7, -11, 9, -11, -29, -2, 3, -3, 0, -6, -16, -2, 9, 0, 10, 13, -8, -6, 14, -3, 12, 11, 4, 4, -2, -2, 13, 3, -5, -9, 4, -11, -8, 12, -14, -11, 7, -10, -18, -2, -3, -8, -4, -9, -30, -5, 5, -14, -14, 8, -24, -11, -15, -7, -11, -2, -11, -16, -6, -16, -1, -6, 1, 3, -15, -11, -8, -14, -8, 11, 8, -2, -4, 4, -1, -3, 11, -2, 4, 7, -2, 0, 15, 13, -3, -3, 1, 0, 6, 5, -9, -10, 0, -3, 3, 1, -12, -21, -10, -11, -1, -1, -10, -17, -8, -13, -18, -9, -7, -3, -12, -25, -32, -13, -14, -22, -11, -9, -12, -12, -6, -10, -4, -4, -11, -8]
5056hMLj1QjMqJ4Jj1J7j4qRJ6nqJLqJ1lj0NNkq%J1j5NNj7K0kj3Q%j3qK1j0OKj5
5101a9MJKk1J6J0j0jJ1oJJ1rj4K3qMmJ4kmj5K5pMRpqJNj2QMLKqj1K2nnoLj6J0
5145eKJ2j2%Ok1K0j6PlJ1j4KlLllKKQj3QJj1J3kj3K2j0p%J2qJ3rK1j5NojQKlL
5189EOj3J5j2JMKmnjLj1RLk%mJrRj4J5qlJ0j1Mq%KRj5nK4j6pK9j6pJ0Lk2J5Pl
5234a0J6j6jK%nNQj1J9j8MJ4Jj1pK1j7JRj2LRpj1L8k5nQj0QRqjPoj9J3mlJ0j1
5276a3JlOoRnKkpKJ1oJQMj2JJkJ6j0jj1J5klJ8j8JOmMJ2pj2J5nmQlnJlJ3mnnR
5324Fj6NRMj5Qj0PJ4l1%J9nj4J9rj5PJ3j0QkoJ1J0k4J1nJlJ4j2J1j4J4lMqkJ3
5364DloK5j5oJ1qNmQj4J4Mj1%K0j3rklRmKpJOj3nMLj0OLKj1J9qKJ%j1NJ3l7L1
$$ y = [-8, -4, -1, -12, -4, -5, -1, -9, 5, 6, -5, 12, -2, -10, -1, 15, 10, 2, 3, 6, -2, 9, 6, -4, 1, 6, 4, -4, -4, 7, -8, -3, 2, -15, 5, 3, -10, -2, -2, -15, -23, -2, -12, -6, -4, -19, -15, -14, -12, -33, -17, -7, -17, -18, -7, -13, -12, -1, -10, -24, -1, -9, -5, -9, 5, 3, -1, -16, 9, 2, 6, 15, 8, 0, 1, 6, -6, 2, 6, 9, 11, 3, -8, 14, 9, 4, -2, 1, -15, -5, -3, 9, -3, -3, 3, -18, 2, -14, -7, -10, 1, -13, -11, -14, -11, -14, -17, -15, -13, -5, -18, -10, -9, -20, -7, -9, -22, 0, -10, -17, -17, -5, -13, 0, -9, 12, -3, 2, -4, -5, 3, 5, 2, 5, 11, -2, 13, 1, 2, 6, 8, 4, -1, -2, 1, -10, -1, 2, 0, 0, -4, -3, -12, -3, -17, -2, -10, -13, -3, -14, -10, -18, -18, -16, -7, -22, -27, -3, -19, -26, 3, -13, -20, -10, -7, -29, -14, -7, -10, 6, -10, -11, -9, -9, -14, -9, -1, -12, 7, -11, -7, 7, 8, -3, -10, 11, -6, -5, 4, -8, -5, 4, -3, -14, 24, -1, -6, 2, -8, 0, 9, 1, 0, 7, 1, -18, -5, -9, -12, -2, -13, -12, -15, -9, -15, -6, -11, -9, -11, -18, -16, -5, -11, -10, -2, 2, -10, -9, -8, -10, 6, -4, -5, -16, -1, -3, -6, 12, -6, -5, 1, -3, 1, 13, 6, -6, 9, 4, 0, 8, 5, 0, 1, -2, 11, 7, 2, -3, 6, -10, -5, 4, 8, -7, 1, -9, -2, 12, -19, -19, 0, -5, -19, 0, -9, -24, -17, -4, -14, -6, -8, -14, -3, 7, -17, -6, -11, -10, -13, 1, -11, 0, -14, 0, -3, 1, -7, -9, 4, 1, -5, 20, 5, -1, 10, 2, 7, 3, 11, -3, 11, 15, 4, 4, 24, 11, 2, 0, -3, 6, 2, 4, -3, -2, 4, -9, -14, -10, -7, -17, -11, -8, -6, -17, 2, -6, -4, -3, -3, -14, -9, 4, -33, -2]
5409brLj3J1KjJ2j9RLJ9j6mMLoRnKjRk0K0NlprMPkRnmNjk1J3mJ2j2Mj4J1J1j8
5454ioRNqjQJ%jmqK%mJ3lk2J6kJ%J3k0K1pMmQqJ2Jj0NQj%J0orKNKNk0KJ6pj7J9
5503A1oj1OJ1pmRrj3J8k3LJ4j0Pj3JJ0mMJMk0jJ0j3PJQoQqKLJpJ4nkJ0j0jPRp
5548aLmjJ0%oQJ%lQj1LlnkMkoMrJJ2j6jK3mj2J1Mj4%pNKj1KNkj7K1LMnNlj%nO
5598fjlPmlKJ2oMKrJ2Oj8PJ1j6J2kJJ1j0jj6K9k4j0K2j4%j4J5qJ%NqM%Jj4MJP
5642a1KojOjOj3MjNNj4JJ4pjJJ4rQmqLJ1%j0OJpJ1LpLPqOPj4J2j0j0RJrJ%R%M
5691Ij4jJ4j6lPjjnj%NkJJ0j9P%JMoKpjQOoL%oNjNKj0J9j4NjPnLlnRj0OqK0jj5
5742dMLkkRoj4K3k1OOkkk1J5%oJ3j9RkjKj3K3j3J0r%LJj4POL%%mMNj2PLmLJ0j3
$$ y = [-2, -11, -8, -21, -10, -8, -9, 3, -16, -7, -4, 15, -1, -5, -1, 2, -4, 5, 0, 2, 1, 10, -10, 10, 15, 12, 5, -4, 0, 7, 5, 14, 9, 5, 10, 9, -12, 1, -3, 9, -3, 1, -13, -2, 9, -9, -15, -6, -1, -9, -10, -2, -1, -1, -2, -6, -14, -12, -12, -16, -3, -6, -28, -12, -14, -13, -13, 0, -20, 1, -6, -2, -6, 2, -6, 6, 7, -3, 2, 10, 9, 9, 19, 13, 4, 6, 11, 13, 18, -2, 0, 16, 9, -8, 11, 5, -6, 0, 11, 4, 0, 9, 0, -13, 5, -18, -15, -1, -11, -4, -17, -16, -6, -10, -6, -5, -1, -21, -22, -12, -25, -18, -17, -9, -15, -7, -15, -13, -10, -9, -16, -2, -7, -9, 1, -9, -10, -3, 6, -1, 2, -2, -3, 7, 7, 1, 9, 10, 10, 7, 15, 4, 7, 4, -1, -3, 1, -1, -7, -3, -12, -11, 1, -15, -16, 7, 3, -9, 2, 6, -8, -8, -15, -10, -8, -19, -17, -12, -14, -31, -10, -7, -3, -8, -3, -6, -7, -7, -12, -6, -7, -10, -3, -7, -10, -8, 4, -2, 2, 4, -5, 7, 13, -5, 2, 13, -3, 9, 7, 8, 19, 9, 8, -8, 21, -3, -13, 9, -5, -5, -19, -4, -12, -11, -11, -6, -14, -10, -10, -9, -23, -19, -18, -11, -9, -15, -16, -10, -11, -5, -18, -14, -15, -10, -5, -19, -18, -4, -11, -12, -11, 3, -6, 2, -2, -10, -7, 4, 4, -6, 0, 1, -6, 5, 8, 1, 4, 11, 3, 9, 16, 2, 14, 4, -6, 3, 4, -5, -4, -4, 5, 5, 9, -5, -6, 8, -8, -11, -4, -5, -6, -11, -12, -12, -7, -9, -8, 2, -17, -10, -10, -9, -5, -11, -9, -16, -17, -9, -3, -9, -6, -6, -12, -7, -8, -3, -1, -11, 8, -6, -1, -2, 5, 0, 3, 0, -5, 4, -6, 0, -8, 12, 11, -4, 0, 3, 1, -1, 8, 2, -12, 11, -10, -4, 2, 0, -2, -23, -8, -8, -14, -1, -20, -11, -13, -14, -12, -25, -2, -15, -5, -14, -14, -11, -10, -24, -17, -11, -8, -8, -8, -12, -8, -3, -15, -8, -5, -9, -6, 4, -9]
5789iJ0Olj3J6%Kj1jQlLJpmJ5Mj5jMl%J1j2kkoJ1Lj2J1lj7PkJLjJ0j7KNrJ3J%
5835fjoKJ4j3KQRk1RJMnj2QJ0jQmOljmkNJLpqnOJ0%j6J8j4lJ3mp%JOKlj0OOlp
5885hkMpPm%JrOLrJ0KmPKJkpJ2kqJ0p%nORpMJ2j6KPmlj%JPj1%jJ0j3JLpO%Jrl
5938a5J2rPpjRj3J1Mj0jjKrJ3j2NOk0J5nROJ0j2lKJ2oJpNMjLMklJ5pok%MJrJ0
5985ILl%Nk1MJ3j3nPnlJQj2RojQrkQljj4J0QrjnjQQmppJ4NoJ%rJ1QKkKkJnJ1j3
6037elK1qqR%jnMMlOj4kQj0%nQqJ0j5Rj1J8j2nR%lj3RM%j5J3JJLnkJ1j2pK0Jj4
6084a7J5njkJ4KjmQj1JJO%jjM%jlmRj7J0RplmJ1oj3J5orPpKkKjLqoK0pJqOjj0
6134b0QrRMmLOlRj1K%RmNKJkJqRj2PLlkJ9j3JmKjLmJ1%nm%mJ0k2J5Ooj7oJ3nR
$$ y = [-9, 1, 7, 4, -9, 7, 7, 9, -2, -3, 5, 2, 5, 6, -1, -5, 10, 14, -1, -2, 2, -1, -1, 10, -2, -4, -6, -12, -1, 2, -10, 1, -2, -19, -12, -14, -13, -10, -11, -1, -18, -16, -11, -20, -7, -6, -6, -7, -13, -11, 3, -10, -8, 0, 9, -12, -3, -2, 2, -3, -15, -7, 3, 2, 10, 6, 12, 9, 8, 4, 2, 7, 8, 11, 4, -4, -9, -3, 7, 7, -9, 9, -5, -8, 5, 1, -6, -6, -5, 1, 3, 0, -10, -4, 2, -1, -8, -10, -6, -13, -6, -10, -10, -9, -18, -12, -9, -18, -8, -6, -10, -3, -1, 0, -2, -9, 3, 1, -7, 3, -4, -4, -9, -3, 6, -1, 3, 15, -1, 1, 8, 4, 1, 0, 0, 1, 8, -3, -3, -4, 6, -7, -6, -3, -10, -4, -4, -3, -12, -15, -3, -12, -5, -12, -13, -4, -17, -6, -2, -12, -13, -14, -12, -21, -8, -20, -15, -9, -29, -14, -19, -10, -4, 6, -6, -9, -7, 5, -1, 0, -7, -2, 2, 1, 4, 8, 6, 3, 18, 11, 5, 3, 3, 7, 8, -1, 9, 12, 9, 9, 14, -7, -3, 10, -3, -8, -1, -6, -9, -8, 0, -12, -3, -9, -10, -2, -11, -13, -5, -8, -9, -23, -13, -5, -14, -15, -20, -21, -13, -5, -9, -16, -23, -9, -4, -10, -9, -9, -18, -7, 1, 3, 1, 3, 1, 2, -3, 8, -5, -8, 13, 5, -3, 6, 6, 5, 0, 4, 8, 5, 11, -3, -5, 3, -7, -7, -12, -4, -12, -2, -17, -8, -19, -1, -13, -18, -9, -9, -12, -25, -16, -12, -12, -27, -14, -13, -12, -9, -14, -16, -5, -17, -24, -4, -3, -17, -2, -7, -8, -10, 4, 6, 5, 1, 9, -2, -1, 0, 6, 6, 5, 4, 8, 8, 7, 4, 0, 9, -8, 2, 11, 4, 1, -3, 8, 2, -11, 4, -2, -11, -4, -11, -9, -11, -9, -10, -7, -15, -21, -1, -8, -7, -15, -9, -10, -20, -12, -21, -12, -8, -12, -9, -3, -6, 3, -8, -6, -6, 3, -1, 4, 6, 7, 5, 6, -2, 7, -5, 2, 5, 2, 0, 19, 6, 7, 3, 5, 4, 7, 3, 14, 14, 9, 5, 5, 1, 11, -11, 4, 10, 4, -13, -19, -6, -11, -2]
6184blJ0jk0J1Mj1J1omMOrqK2j9jJ0Oj1RnjJ1j2LMNj8J2J6j6jJ1JqJ6j6LJ3j0
6225FJ1rnnPm%Mj5KNjmR%j1Pjm%oO%Nmk0L1j7lJ0kmnj1J8PqQj1RjNLj0nPOQok
6275@J2k0J2J%J2j4pJ0LpJ1Jj9J0O%rllJJj2KKJORqkkr%nK0j4j1J1LmNQqpJ7o
6321fnQKLnKj1RjNKnllJ3qoJ2PrJjRoJj5J7rKQjjpJ1j4koJ1kjLj1LlK1j3nqMK
6371a1O%pNnkKOj1Rj0KQJ1mj3J0P%mPjKj%pMPJ3q%qMj2NPkjj0QKmkoQOlmnOj0
6422fNpNqJQkojJ%j3%LJ1%LkmkOLQjrMQj0rJ0LOj1J4j2QKrPJ3rJKmKJnm%J4j0
6473EMj5QPj5J2oNkLoj3J8q%%j0OqJ9k0NmOJ4qmQj4QrK1j4OJq%NJ1K%j0jJ1nm
6519AQj1J5oJ3j3%q%J2j5PJLmKpjjLj0J3j4J7j8J5orJKPm%nQj7K5j0jJ1Ok5PL
$$ y = [-2, -5, 5, 4, -16, -5, -1, -12, -1, -7, -11, -7, -1, -10, -18, 4, -15, -16, -6, 0, -11, -2, -7, -8, 3, -9, -6, -2, 3, -15, -3, 13, -3, -4, 7, 8, 0, 16, 0, 3, 16, 6, 17, 8, 3, -2, 5, 1, 1, 5, -10, -8, -3, -4, -8, 1, 1, -10, -3, -4, -8, -8, -14, -8, -8, -3, -7, -27, 4, -13, -16, -6, -8, -12, -17, -28, -10, -3, -11, -3, -14, -5, -6, -1, 2, -8, -13, -6, 0, 8, 2, 0, 12, -8, 4, 5, 5, 17, 3, -4, 6, 9, 2, 13, 14, -5, 5, 11, 11, 2, -1, -4, -3, -2, -14, -12, -10, -9, -3, 6, -2, -4, -6, -15, -15, -20, 0, -14, -25, -14, -11, -15, -10, -2, -10, -17, 0, -6, -11, -3, -1, 2, -3, -1, -12, -3, -4, 1, 3, -2, -5, -8, 5, -3, -9, 3, 10, 1, 2, 1, 10, 4, 5, -10, 7, -2, 0, 8, 7, 6, -1, 10, -4, -6, -12, -1, -3, -4, -1, -12, -9, -12, 9, -4, -9, -17, -13, -11, -5, -5, -12, -7, -12, -14, -12, -6, -17, -8, -18, -16, -8, 3, -1, -14, -4, 3, 3, -1, 6, 5, 7, 6, 6, -1, 3, 10, 23, 15, 15, 7, 11, -1, 4, 11, 9, 8, -2, 6, 8, 4, 2, -4, 4, 10, 7, 3, -2, 4, -6, -1, -8, -3, -11, -10, -2, -4, -10, -11, -10, -10, -23, -23, -20, -9, -9, -6, -8, -12, -14, -8, -5, 3, 2, -7, -3, 5, -5, -14, -4, -1, 5, -6, 8, -4, 4, 6, -3, 4, 17, 8, 9, 11, 7, 9, 10, 5, 1, 1, 15, 5, 9, -6, 2, 9, -6, 6, 0, 5, 3, 6, 0, -13, 5, -3, -3, -3, -13, -7, -15, 4, -16, -11, -15, -9, 5, -3, -7, 1, -13, -5, -14, 7, -7, -1, 0, -8, -8, -3, 8, 10, 10, 0, -1, 10, 5, 1, 9, -2, 13, 7, 20, 7, 7, -1, -1, 11, -4, 3, 4, 7, 3, 5, -2, -3, -4, -1, -11, 2, -12, 5, -13, 2, -4, -13, -12, -10, -3, -7, -7, -12, -4, -21, 4, -6, -7, 4, 10, -15, -8, -5]
6563emQj1OK%%kjK4k0NJ2nmLj0J0NmkjJ1pkJ4pj2ORnj0kLKJ0k1NRkqOj0oJ0j1
6609a2KJ1jj0jLJpNjmMjO%j0J0Lj9J0QkkkPj4J9lj7K9j2KnJ6j4J3rPjrOj1J1m
6653BoJ1j0lMJ5j3nj0J4j3J1RrkrNmPoqJO%pK1oLj1LqRMpPQrjPLOk1K0j7QMLr
6701cK7j7qlJ3K%lpKOj2KQJj0JRqJ1jj4J2j3Poj0Pj2QlPj0RoJjKJ0nOj7NJ0ol
6747a2JJjPlkRJplJ2lJPjK%j4PJ3j0%L%%PnJj2J7j6J2k0RpKJ0j0j0RMoRj9OpJ5
6794cKj4mJ1j1J5poOnkJ9j2jJ3oqlJ0JmPpJ9j2J0pJ0Mj3KrLMkJ0J0j9jLJnnJO
6839ApjK4j9j2QKOj4J4qrMNj7OJ3onj4J1K0lj2OlmjR%Olj1J9j0pJ6%%Nlj3J1P
6883A1joMnNJmKnKNqJ1j1JNqRj0QqqJ3kj5MKNJqmjnOJ2j4PljKjjPMj5LnJ2mJM
$$ y = [-5, -9, -1, -12, -6, -4, -4, -4, -6, -7, 17, -3, 2, 14, 9, 5, 8, -2, 8, 13, 9, 7, 6, 17, 10, 8, 22, 15, 3, 9, 18, 13, 3, 1, 4, 6, 16, -5, 0, 9, 7, -1, 5, -5, -11, -1, -12, -10, 1, 0, -10, -11, -8, -7, -14, -9, -10, -14, -10, -11, -5, -5, -15, -5, -2, -21, -11, -3, -5, -7, -9, -2, -16, 3, 0, -17, 12, 0, 2, -3, 13, -1, 12, 3, 10, 9, 0, 6, -5, 6, 2, -4, 7, -3, -6, -2, 13, 0, -5, -15, -1, -14, -3, 6, -3, -5, -14, -9, -13, -6, -12, -20, -19, -13, -13, -20, 1, -5, -2, -13, -10, -18, -9, -5, -12, -5, 3, -6, -7, 0, 3, 9, -12, 8, -9, -1, 3, 6, -3, 24, 7, -1, -4, 9, 11, 11, 8, 1, 3, 9, -3, -1, 7, 8, -2, -1, 8, 0, 11, 10, -4, 8, -5, 2, -4, -14, -7, -19, -11, -14, -7, -17, -8, -14, -13, -14, -12, -2, -7, -1, -18, -13, -3, -9, -12, -11, -10, -11, -4, -7, -9, 0, 1, -6, -9, 3, 0, 1, 8, 7, 9, 9, -5, 2, 15, 5, 5, 8, 8, 8, 15, 10, 11, -1, 16, 0, 12, -8, 1, -6, -4, 6, -4, -14, -5, -1, -7, 2, -17, -11, -18, -3, -1, -15, -19, -8, -19, -4, -11, -17, -11, -16, -18, 1, -11, -12, 1, -5, -13, -16, -6, -5, -9, -2, -9, 10, -2, 8, 1, 11, 15, 2, 4, -5, -2, 2, 0, 10, 20, 1, 0, 3, 4, -1, -6, -5, 1, -6, -7, 17, -2, -14, -6, -4, 2, -12, 2, -6, -15, -11, -6, -23, -17, -4, -10, -15, -29, -18, 2, -1, -13, -7, -10, -14, -15, -6, -6, 0, -3, -14, 5, -5, -12, 4, 4, 4, 9, 6, -7, 4, 11, 10, 4, 8, 3, 8, 9, 5, 7, 2, 4, 9, 1, 12, 1, 2, 7, -1, 8, -2, 6, -2, -10, 3, 1, -14, -10, -8, -3, -2, -10, -14, -15, -20, -14, -2, -16, -9, -12, -13, -11, -12, -13, -6, -2, -17, -14, -19, -7, -11, -10, -6]
6934fkJ0Lj2NOpkP%Qp%OnMqMokJQQj3Pj5J1JNqLlrQqj1J5MoKlkoJ5j4MqJ2lRr
6985ioJ6qqJ4kj1%JPLLjMNrOj0QqJ1kNNnLlopJRrmPj0J5mpJ2Jj6mjKQlj3NMPo
7036a0%qLQj0LQj3J4oNj6RMJOj1KnLRLnJ4lLqJ0kqqNMKPjolJ2j7J6j5L%KPmN%
7085IpqJjj7J7MoKKj2J0o%%%mN%KL%PpJlKlPoJQKj5J5j1J3jNnjLnJ0JmKPonlK
7137EjnJJmj0J1QmpmJ0j1mlJ2nkj4J2oJ2kmpK3mMj8N%lNjNPj3K1j4j1J0LnJ6l
7182F%pKPkK0k4j4J1RpJ4kj2RPj2KNj5%J0k%j0Oj9J5OqnrK2j2kj0PkKjNlJ1j9
7226b1MJ4j6J0rjlK2j8J1KOkJnkJ2qJ6j7J0J0knmR%k0J8j0jJjnK0j1%LmpkPj0
7269hJ2mJJqJ0j0pNmQpNJ0k8K2%qP%j2MJ1klqNKK7l6J8J2rj7K2j0kJ3j7MQPj5
$$ y = [-6, -8, 2, 5, -7, -2, 4, -3, -5, 2, 2, 10, 3, 3, 9, 4, 8, 0, 4, -2, -4, -3, 5, 13, 0, 7, -8, 3, 4, 9, 1, 4, 1, -8, 0, -8, -19, -4, 0, -6, -4, -7, -9, -15, 0, -14, -10, -18, -6, -9, 0, -9, -15, 1, -7, -15, -1, -3, -14, -14, -13, -6, -3, 0, -1, 3, 8, -1, 5, -5, 3, -5, 6, 4, 9, 14, 9, 12, 9, 3, -4, -3, 6, -3, -7, 0, -10, 5, 1, -6, 6, 7, -9, -13, -14, -12, -4, -7, -20, -15, -11, -4, -10, -10, -18, -15, -7, -17, -14, -6, -19, -5, -11, -6, -22, -13, -9, -8, -2, -13, -11, -16, -13, -4, -1, -6, 8, 5, 8, 0, 10, 8, 0, -8, -3, 1, 3, 10, 9, 3, 0, 12, -5, 11, -4, -1, -1, 1, 8, 4, 9, 9, 2, -6, -5, -6, -23, -6, -2, -8, -6, -4, -16, -6, -12, -12, -12, -12, -16, -11, -11, -9, -6, -6, 1, -6, -5, -8, -6, -9, -2, -8, -7, 1, 3, -12, 3, -8, 5, 4, 9, 4, 3, 6, 1, 11, 12, 8, 10, 17, 11, 6, 3, 5, 4, -1, 0, 1, -3, -13, -2, 6, 2, -5, -9, 1, -10, -14, -17, -5, -10, -12, -26, -14, -20, -8, -10, -14, -21, 2, -2, 2, -16, -11, -11, -14, -9, -10, -5, 2, -11, 10, -4, -15, -5, -2, -7, 9, 6, 6, -1, 1, 8, 6, 26, 2, -12, -1, 8, 1, 15, 13, 1, 10, 17, 5, 7, 12, -3, -3, 7, 5, 5, -5, 1, -18, -3, 3, -5, -10, -19, 3, -9, -11, -21, -14, -16, -14, -15, -10, -13, -2, -21, -17, -3, -19, -9, -18, -19, -22, 0, -18, -7, -5, 1, -1, 0, -5, -7, 5, -3, 13, -4, 6, 16, 14, 9, 5, 14, 14, -6, 12, 2, 1, 2, 1, -4, 16, 5, 5, 8, 4, -3, -5, 2, -8, 4, 0, 1, 2, -6, 4, -6, -13, -8, -12, -4, -11, -6, 4, -24, -2, -2, -10, -3, -3, -15, -11, 0, -2, -5, -13, -8, -6, 21, -15, 3, 15, 6, -11, 11, 1, -1, 12, -5, -1, 7, 14, -1]
7312alJ2Oj5PNMk0RkQoj3J7mj2R%lkpkJ7j2lj%jJ0kj3R%pMJ0j3J0j3KK0j1KrJ0
7357dJ1Jj0mQqJ4mQopJ1lJ1j6LnKPmPJj2J5pjj3PmqJ6jrjOlnlMj5RRnkOj1NqJ5
7406ckj3PpoJ6JlRlRkQk2J7nO%%%JMoQj0QrJkJ1o%j2K1j1p%%kLLkJ0mrjLj4NJ4
7456Dj9J0Qj2jkORj2NolJ3mMlmLnOOpOlpK1j0%OJpJ1oJjMoJkj1JJ3Mnj2J5j8J0
7504BjkLJlml%rJ3O%nnlJ1%LnmnlMlJ9k0MkJ1j5PMJj2J3Lj%MnOJpJKjPq%QmkJ0
7557A2j4QJ2k7J3KKk1J4j1MPllM%J0kj4J2j6nJ1mLjMj4J4KrrJ7j3MpJ4Nj3MqJ0
7599fLMmoPPlpLj2K0mMQj1LKMj6J7pNKlqj0Q%JnPkj2OOoqJ2k3K1j0nNMj1j0K1
7646iJj2JJ1okJkPQoNrRJ0k4J2JnJ6lkMoLkkJ6qJ6mo%lnQmpMkJ3j0mrQq%Pj0M
$$ y = [-1, -4, 8, 14, -1, 6, 11, 15, -5, 4, 2, 10, 4, -9, 8, 4, -8, 1, 1, -2, -4, -11, -13, 4, -8, -11, -12, -12, -13, -3, -5, -18, -9, -9, -16, -12, -2, -15, -5, -18, -16, 4, -7, -5, -14, -4, 7, 8, -2, -6, 2, -6, 8, 4, 12, 6, -1, 10, 7, 18, 2, 5, 0, 2, 9, 5, 12, 13, 1, 16, 9, 8, -5, 2, -2, -10, 6, 5, -4, -5, 1, -2, -7, -10, -6, -21, -12, -3, -8, -10, -4, -15, -10, -18, -3, -5, -18, -11, -18, -24, -8, -7, -10, -1, -4, 5, 3, 11, -11, 6, 1, 7, 7, 7, 7, 8, 12, 6, 14, 4, 12, 3, 4, 2, 13, 7, 7, -5, 16, 5, -2, -2, -2, -4, -1, 2, 0, 10, 6, -3, -4, -1, -15, -10, 4, -15, -5, 3, -9, -10, -12, -6, 3, -9, -4, -10, -13, 0, -4, 0, -3, -7, -4, -9, -3, 3, -4, 2, -1, -8, 13, 3, 3, 9, 10, 3, 14, 8, 9, 8, 12, 6, 7, 5, -6, -5, 8, 12, 7, -5, 10, -8, 2, 1, -1, 2, 3, 0, -4, -7, -7, -16, -3, 3, 3, -2, -7, -10, 1, 1, 4, -1, -5, -10, -13, -9, -12, 7, -13, -9, -11, 0, -15, -8, -4, -3, -15, -2, 1, 0, 0, 4, -1, 5, 6, -1, 0, 2, 1, 8, 0, 0, 8, 4, 2, 12, -2, 6, 18, -9, 4, 6, 8, -13, 1, -10, -6, 1, -2, -5, -1, -1, 9, 7, -7, 5, -11, -16, -5, -9, -6, -7, -3, -17, -3, -1, -10, -19, -2, -15, -11, -18, -4, 1, -12, -8, -16, -6, -3, 1, -3, -9, -2, 5, 2, -5, -2, -14, 6, 2, 6, 14, 3, 6, 8, 12, -4, 13, 6, 11, 13, 10, 2, -8, 0, 0, 1, -4, 3, 1, -11, -5, 1, -5, -13, -1, -24, -3, -13, -18, -13, -9, -20, -30, -9, -8, -20, -19, -8, -14, -16, -15, -17, -10, -2, -8, -3, -12, -3, 7, -17, -5, -4, -9, 7, 4, 2, 6, 0, 3, 1, -1, 15, 7, 23, 19, 13, 13, 10, 5, 13, 9, 2, 6, 4, 17, 7, 3, -6, 2, -6, -6, 1, -9, -5]
7696erJ8nrQj3KJ1rqJ1JnOj1RrLJ3oKJpJJ0j3J4knMJ6rKlMlQmnJlLLjKlJOj1k
7746@OqjLoQjnlj5K1%Lj2J0j0Nj0qPJ2j0NnRoKJ1j1QQj2MnPpJkJ3njRrjJ3j1Q
7793IpJ3j4J4mKLpnj2NQOm%JonkLJ0j1jJJKp%KmmljNNmKPj7JQNj1J1kJjNKjOm
7845AkJ2j3J1Nk0O%K0j8Ojj0RKJj2MKRJk5J7Mj0JLj0NJ1k8J0K1j4j1J4j0Onmk
7886a4O%%oJJJKNKj7J1OmlJ4j2nJ6JoLj2OJ5%Mj5LQj5OPNroJ6j1J0rJrO%oOJK
7934Fj4J0j5J0Pmlqk%J1kqJ7popJ1jRj4LMj0RKkNJ2j2RjkKp%JJ2p%J6mj4N%nQ
7981A4OmpRj5PKkmknJLj0OmOmJlJ1j1oPjmQmj1KJ2KoOkj5K1nmmjLNMjmJ2pMRj9
8032dMJ2lj0J5j3Oj%NLOpj8PnQKj3ML%rmJ3mKJnj1PkJPpjnJjPJOjroJ6%j2J0r
$$ y = [-5, -14, 4, -1, -10, -2, -15, -13, -2, -11, -19, -8, -7, -12, -6, -17, -8, -17, -14, -1, -7, -5, -4, -11, -10, 0, -13, 1, -1, -6, -2, 14, 5, 7, 4, 8, 5, 13, 9, 4, 5, 2, 5, 8, 7, 9, 6, 7, 13, 2, 0, 6, -2, -3, 0, -6, 2, 1, -4, -7, -22, -1, -1, 2, -10, 0, -10, -5, -15, -23, -16, -4, -14, -9, -14, -5, -11, -9, 2, -9, -1, 7, -5, -1, -6, 1, -6, -5, -7, 6, 1, 0, 9, 0, -1, 12, 1, 9, 2, 15, 1, 15, 11, 13, 16, 9, 4, -8, -3, 5, 11, 7, 7, 8, 2, -3, -5, -2, 8, -3, -4, -3, -2, 0, -7, -7, -5, -9, -13, -16, -17, -12, -7, -11, -9, -2, -19, -18, -10, -5, -16, -5, -7, -6, -7, -2, 0, -1, 5, 1, -1, 11, -2, 9, 14, -6, 0, 0, 20, 2, 8, 7, -3, 6, 8, 9, -3, 1, 3, 12, 13, -12, 5, 9, -1, 0, 3, -7, -2, 9, -19, -9, 12, -2, -13, 1, -9, -3, -8, -12, -14, -8, -8, -8, -14, -13, -12, -11, -9, -4, -2, -19, -8, -2, -6, -9, 5, -7, -12, 4, 5, -1, 2, -10, -4, 11, 11, 15, 0, 3, 11, -4, 2, 9, 14, 5, -1, 15, 4, 14, 5, 6, -3, 3, 3, -3, 3, 4, 6, -8, 2, -13, -3, 4, 0, -3, -11, -13, -13, -2, -4, -12, 5, -2, -8, -15, -4, -5, 4, -10, -7, -3, -13, -4, -2, -4, 1, 13, 1, 10, 9, 7, 9, 2, 2, 3, 15, 8, 8, 24, 20, 6, 11, 11, 6, 14, 20, 16, 9, 18, 3, 10, 12, 10, 6, 4, -1, 0, 3, -7, -1, -5, 1, -3, -2, -5, 6, -5, -11, -4, -5, -9, -1, -5, -16, -14, -2, 0, -6, 0, -2, -17, 4, -1, -5, -9, -10, -7, -2, 2, 1, -3, 9, 2, 6, 15, -4, 0, 12, 9, -1, 14, 1, 7, 6, 6, 11, 14, 20, 13, -5, 2, -3, 5, 7, -6, -2, 1, 1, -8, -12, 1, -3, -1, 0, -5, -16, -9, -11, -10, -3, -10, -11, -16, -15, -16, -9, -8, -2, -3, -12, -18, -2, -2, -14, -4, -13]
8082a3J4nlJ4j2OrOOoLNkNl%PKlJk%j2PMj0kJ0j8J4%j1JQjMj4QoJ0Lj4pKLPpL
8130gPnj2lLJ5lKprJ0PpKo%J1Kj2J1Rj2mJ2OpnJ1NnLj6J8lmjrRj0J1kJlmJ0j2
8176cj%Oj3jQjj1jLNJ3j3%j
$$ y = [-13, 1, -4, -7, 7, -5, 1, -8, -2, 4, -2, 1, 6, 4, 9, 6, 6, 13, 15, 12, 13, 11, 11, -1, 6, 10, 0, -2, 8, -10, 4, 4, -7, -6, 2, 1, 5, -9, -1, -7, 3, 6, -8, -15, -13, -10, -3, -10, -7, 0, -5, -17, -20, -17, -2, -5, -3, -10, -19, -9, -2, -9, -7, -13, -13, -2, 0, -12, -1, 8, -4, -8, 4, 10, 3, -2, 9, 14, 9, 12, -4, 14, 11, 7, 6, -3, 6, -4, 7, 5, 6, 3, -1, 9, -3, -4, -4, 2, -11, -12, -4, -5, -16, -17, -14, -9, 4, -9, -9, -10]
8191a0
##END NTUPLES=NMR FID
##END=
