##TITLE=1H_IG-naftMeOH
 200.13MHz, CDCl3,
 8 sc
 
 20.10.2025
##JCAMPDX= 6.0         $$ Bruker NMR JCAMP-DX V2.0
##DATA TYPE= NMR FID
##DATA CLASS= NTUPLES
##ORIGIN= UXNMR, Bruker Analytische Messtechnik GmbH
##OWNER= pz
$$ XWIN-NMR		Version 3.5
$$ Tue Oct 21 14:26:57 2025 Russian Standard Time (UT+4h)  she@DPX200
##.OBSERVE FREQUENCY= 200.1308
##.OBSERVE NUCLEUS= ^1H
##.DELAY= (6, 6)
##.ACQUISITION MODE= SIMULTANEOUS
##.ACQUISITION SCHEME= undefined
##.AVERAGES= 8
##.DIGITISER RES= 18
##SPECTROMETER/DATA SYSTEM= spect
##.PULSE SEQUENCE= zg30
##.SOLVENT NAME= CDCl3
##.SHIFT REFERENCE= (INTERNAL, CDCl3, 0, 14.3821)
##AUDIT TRAIL= $$ (NUMBER, WHEN, WHO, WHERE, WHAT)
$$ ##TITLE= Audit trail, XWIN-NMR		Version 3.5
$$ ##JCAMPDX= 5.01
$$ ##ORIGIN= Bruker BioSpin GmbH
$$ ##OWNER= she
$$ F:/spectra/data/she/nmr/H-C/1/audita.txt
$$ ##AUDIT TRAIL=  $$ (NUMBER, WHEN, WHO, WHERE, WHAT)
(   1,<2025-10-21 14:25:37.10 +0400>,<she>,<DPX200>,
      <created by zg, POWCHK disabled, PULCHK disabled
       configuration hash MD5:
       00 E9 B6 7A A2 85 ED C7 34 08 36 98 17 FE 4E 26
       data hash MD5: 16K
       C4 20 27 1D C1 5A A0 AB EF 16 42 EE F9 65 D2 E9>)
$$ ##END=
$$ 
$$ hash MD5
$$ 8E 70 B9 AD 31 0F 77 20 71 31 8D 83 86 C9 A2 CF
##$RELAX= 
##$RELAX= 
##$RELAX= 
##$RELAX= 
##$RELAX= 
##$RELAX= 
$$ Bruker specific parameters
$$ --------------------------
##$DU= <F:/spectra>
##$EXPNO= 1
##$NAME= <H-C>
##$PROCNO= 1
##$TYPE= <nmr>
##$USER= <she>
##$AMP= (0..31)
100 100 100 100 100 100 100 100 100 100 100 100 100 100 100 100 100 100 
100 100 100 100 100 100 100 100 100 100 100 100 100 100 
##$AQSEQ= 0
##$AQ_mod= 1
##$AUNM= <au_zg>
##$AUTOPOS= <>
##$BF1= 200.13
##$BF2= 200.13
##$BF3= 200.13
##$BF4= 200.13
##$BF5= 200.13
##$BF6= 200.13
##$BF7= 200.13
##$BF8= 200.13
##$BYTORDA= 1
##$CFDGTYP= 0
##$CFRGTYP= 5
##$CHEMSTR= <none>
##$CNST= (0..31)
1 1 145 1 1 1 1 1 1 1 1 1 1 1 1 1 1 1 1 1 1 1 1 1 1 1 1 1 1 1 1 1 
##$CPDPRG= <>
##$CPDPRG1= <>
##$CPDPRG2= <>
##$CPDPRG3= <>
##$CPDPRG4= <mlev>
##$CPDPRG5= <mlev>
##$CPDPRG6= <mlev>
##$CPDPRG7= <mlev>
##$CPDPRG8= <mlev>
##$CPDPRGB= <>
##$CPDPRGT= <>
##$D= (0..31)
0 0.7 0 0 0 0 0 0 0 0 0 0.03 0 0 0 0 0 0 0 0 0 0 0 0 0 0 0 0 0 0 0 0 
##$DATE= 1761042336
##$DBL= (0..7)
120 120 120 120 120 120 120 120 
##$DBP= (0..7)
150 150 150 150 150 150 150 150 
##$DBP07= 0
##$DBPNAM0= <>
##$DBPNAM1= <>
##$DBPNAM2= <>
##$DBPNAM3= <>
##$DBPNAM4= <>
##$DBPNAM5= <>
##$DBPNAM6= <>
##$DBPNAM7= <>
##$DBPOAL= (0..7)
0.5 0.5 0.5 0.5 0.5 0.5 0.5 0.5 
##$DBPOFFS= (0..7)
0 0 0 0 0 0 0 0 
##$DE= 6
##$DECBNUC= <off>
##$DECIM= 32
##$DECNUC= <off>
##$DECSTAT= 4
##$DIGMOD= 1
##$DIGTYP= 9
##$DL= (0..7)
0 120 120 120 120 120 120 120 
##$DP= (0..7)
150 150 150 150 150 150 150 150 
##$DP07= 0
##$DPNAME0= <>
##$DPNAME1= <>
##$DPNAME2= <>
##$DPNAME3= <>
##$DPNAME4= <>
##$DPNAME5= <>
##$DPNAME6= <>
##$DPNAME7= <>
##$DPOAL= (0..7)
0.5 0.5 0.5 0.5 0.5 0.5 0.5 0.5 
##$DPOFFS= (0..7)
0 0 0 0 0 0 0 0 
##$DQDMODE= 0
##$DR= 18
##$DS= 0
##$DSLIST= <SSSSSSSSSSSSSSS>
$$ [...]
##$SUBNAM0= <"">
##$SUBNAM1= <"">
##$SUBNAM2= <"">
##$SUBNAM3= <"">
##$SUBNAM4= <"">
##$SUBNAM5= <"">
##$SUBNAM6= <"">
##$SUBNAM7= <"">
##$SUBNAM8= <"">
##$SUBNAM9= <"">
##$SW= 18.0517779522481
##$SWIBOX= (0..15)
0 0 2 0 0 0 0 0 0 0 0 0 0 0 0 0 
##$SW_h= 3612.71676300578
##$TD= 16384
##$TD0= 1
##$TE= 0
##$TE2= 300
##$TE3= 300
##$TEG= 300
##$TL= (0..7)
0 120 120 120 120 120 120 120 
##$TP= (0..7)
150 150 150 150 150 150 150 150 
##$TP07= 0
##$TPNAME0= <>
##$TPNAME1= <>
##$TPNAME2= <>
##$TPNAME3= <>
##$TPNAME4= <>
##$TPNAME5= <>
##$TPNAME6= <>
##$TPNAME7= <>
##$TPOAL= (0..7)
0.5 0.5 0.5 0.5 0.5 0.5 0.5 0.5 
##$TPOFFS= (0..7)
0 0 0 0 0 0 0 0 
##$TUNHIN= 0
##$TUNHOUT= 0
##$TUNXOUT= 0
##$USERA1= <user>
##$USERA2= <user>
##$USERA3= <user>
##$USERA4= <user>
##$USERA5= <user>
##$V9= 5
##$VALIST= <valist>
##$VCLIST= <CCCCCCCCCCCCCCC>
##$VD= 0
##$VDLIST= <DDDDDDDDDDDDDDD>
##$VPLIST= <PPPPPPPPPPPPPPP>
##$VTLIST= <TTTTTTTTTTTTTTT>
##$WBST= 1024
##$WBSW= 4
##$XGAIN= (0..3)
0 0 0 0 
##$XL= 0
##$YL= 0
##$YMAX_a= 393018
##$YMIN_a= -332451
##$ZGOPTNS= <>
##$ZL1= 120
##$ZL2= 120
##$ZL3= 120
##$ZL4= 120
##$ABSF1= 10
##$ABSF2= 0
##$ABSG= 5
##$ABSL= 3
##$ALPHA= 0
##$AQORDER= 0
##$ASSFAC= 0
##$ASSFACI= 0
##$ASSFACX= 0
##$ASSWID= 0
##$AUNMP= <proc_1d>
##$AZFE= 0.1
##$AZFW= 0.1
##$BCFW= 1
##$BC_mod= 2
##$BYTORDP= 1
##$COROFFS= 0
##$CY= -3
##$DATMOD= 1
##$DC= 2
##$DFILT= <>
##$DTYPP= 0
##$F1P= 0
##$F2P= 0
##$FCOR= 0.5
##$FTSIZE= 0
##$FT_mod= 4
##$GAMMA= 1
##$GB= 0.15
##$INTBC= 1
##$INTSCL= 1
##$ISEN= 128
##$LB= 0.25
##$LEV0= 0
##$LPBIN= 0
##$MAXI= 10000
##$MC2= 0
##$MEAN= 0
##$ME_mod= 0
##$MI= 1.114404
##$NCOEF= 0
##$NC_proc= 0
##$NLEV= 6
##$NOISF1= 3.799351
##$NOISF2= 2.8
##$NSP= 1
##$NTH_PI= 0
##$NZP= 0
##$OFFSET= 14.38212
##$PC= 1
##$PHC0= -2433.108
##$PHC1= 7.992258
##$PH_mod= 1
##$PKNL= yes
##$PPARMOD= 0
##$PSCAL= 0
##$PSIGN= 0
##$REVERSE= no
##$SF= 200.129724274929
##$SI= 16384
##$SIGF1= 3
##$SIGF2= 2
##$SINO= 400
##$SIOLD= 16384
##$SREGLST= <1H.CDCl3>
##$SSB= 0
##$STSI= 0
##$STSR= 0
##$SW_p= 3205.1282051282
##$SYMM= 0
##$S_DEV= 0
##$TDeff= 0
##$TDoff= 0
##$TI= <>
##$TILT= no
##$TM1= 0
##$TM2= 0
##$TOPLEV= 0
##$USERP1= <user>
##$USERP2= <user>
##$USERP3= <user>
##$USERP4= <user>
##$USERP5= <user>
##$WDW= 1
##$XDIM= 8192
##$YMAX_p= 0
##$YMIN_p= 0
$$ End of Bruker specific parameters
$$ ---------------------------------
##NTUPLES= NMR FID
##VAR_NAME=  TIME,          FID/REAL,        FID/IMAG
##SYMBOL=    X,             R,               I
##VAR_TYPE=  INDEPENDENT,   DEPENDENT,       DEPENDENT
##VAR_FORM=  AFFN,          ASDF,            ASDF
##VAR_DIM=   8192,          8192,            8192
##UNITS=     SECONDS,       ARBITRARY UNITS, ARBITRARY UNITS
##FACTOR=    0.0002768,     1,               1
##FIRST=     0,             0,               0
##LAST=      2.2672688,     0,               0
##MIN=       0,             -332451,         0
##MAX=       2.2672688,     393018,          0
$$ Real data points
##PAGE= N=1
##DATA TABLE= (X++(R..R)), XYDATA
0 0 0 0 0 0 0 0 0 0 0 0 0 0 0 0 0 0 0 0 0 0 0 0 5 -6 8 -8 8 -8 8 -11 12 -12 14 -16 20 -20 25 -26 29 -34 35 -42 44 -47
44 -47 54 -59 62 -71 79 -85 95 -105 116 -127 141 -160 177 -201 229 -261 304 -360 435 -540 702
65 702 -965 1448 -2540 6002 -38274 -219489 -64750 285161 381792 148978 -33528 114508
77 114508 382507 393018 142672 -23308 80580 240318 185366 -31850 -149162 -82668 -6178
88 -6178 -65968 -186340 -224691 -181030 -154387 -168232 -163641 -130320 -122100 -135536 -92081 16860
100 16860 75322 15138 -46396 39364 206589 237501 86343 -21335 93294 279862 256040
111 256040 27120 -99545 44256 230567 157279 -106704 -213083 -37464 139346 39100
121 39100 -211370 -269728 -72505 83790 -20955 -223538 -230229 -37770 83542 -10419 -150836
132 -150836 -122550 33397 109242 37153 -41093 -3840 90042 119230 78237 52932 73463 91315
144 91315 82530 80517 94692 78952 21829 -7555 35490 76137 17540 -95935 -119669 -25552
156 -25552 33581 -59002 -196381 -187425 -41677 29663 -80823 -210493 -156313 25471 95222
167 95222 -23046 -130841 -44059 139684 185231 58798 -31358 58290 205692 209291 76077
178 76077 -3207 65089 156380 122794 82 -62207 -19333 24292 -17992 -100035 -129824 -102372
190 -102372 -83940 -102571 -121410 -113235 -97462 -90304 -71680 -31056 -2222 -10506 -17537 28078 100324
203 100324 118198 68501 38937 93481 166900 151272 57632 9809 65437 126650 79601 -36518
215 -36518 -82032 -18651 35175 -22568 -129335 -149962 -71371 -17059 -65995 -142334 -131539 -43961
227 -43961 7423 -27767 -73453 -45155 31734 67907 39805 12372 37202 84181 95904 70186
239 70186 51163 59366 70442 61761 43278 31570 22561 6459 -8113 -9733 -10213 -29460 -57964
252 -57964 -63790 -42411 -30536 -53464 -82403 -72313 -30676 -11053 -35442 -59721 -36064 15144
264 15144 33724 6345 -14115 14320 62072 70826 38024 17936 42308 76446 71394 33986
276 33986 13269 29297 47628 32250 -3902 -21577 -11558 -3554 -19954 -46045 -54711 -45021 -38754
289 -38754 -46911 -56852 -53804 -41281 -32036 -29019 -24536 -14128 -1931 7865 16656 26458 34845 39653
303 39653 43494 49389 54275 52764 45785 40330 38871 35427 24396 9208 -1343 -6046 -12137 -24343
317 -24343 -37694 -44340 -44302 -44618 -48939 -52610 -49451 -40689 -32643 -27967 -22763 -12734 261 10864 17006
332 17006 22459 30857 40108 44833 43716 41548 42644 44286 39889 29202 19258 15618 13593 4615 -10887
347 -10887 -22142 -22611 -20513 -27535 -40955 -46434 -37856 -27541 -29326 -38074 -36248 -19146 -3105 -2655
361 -2655 -9423 -4262 15195 29928 26814 17373 20777 36071 43707 33920 20474 20028 28584 28475 14467
376 14467 305 -1823 1948 -1797 -13813 -23048 -23384 -21251 -23460 -27831 -28768 -26466 -24747 -22921 -17610
391 -17610 -11332 -9508 -10202 -4828 7742 16246 12774 6779 13255 29153 34918 22639 10033 16128
405 16128 32249 32577 11886 -4989 1677 17335 13339 -11432 -27705 -17996 -1510 -6381 -29108
418 -29108 -39771 -25198 -7568 -10814 -27422 -30349 -12735 3872 2119 -7882 -5741 9572 20972
431 20972 18734 12887 15094 22844 25742 22288 18818 17729 15267 10906 8570 8208 3692 -6654 -13642
446 -13642 -10496 -5335 -11381 -25392 -29667 -17806 -6484 -12694 -27282 -26576 -6818 7947 460 -14310
460 -14310 -9843 13210 26715 15516 -523 4688 25733 33811 18220 1210 5388 21472 23365
473 23365 5922 -9172 -5672 5394 4048 -10333 -20173 -16082 -8315 -9381 -16752 -19485 -15091 -10281
487 -10281 -9051 -8474 -5997 -3748 -2791 400 6820 10831 7953 4072 8104 17641 19800 10433 2097
502 2097 6882 17488 16526 2083 -8043 -1638 9532 6222 -10265 -19050 -9669 2290 -1914 -17393
516 -17393 -22333 -10040 2088 -2213 -14699 -15659 -2380 8176 4080 -5159 -3964 7259 14344 10149
530 10149 3485 4448 11009 13768 9886 5309 4699 5884 5270 3086 1196 -924 -3986 -5698 -4505 -3195
546 -3195 -5933 -11093 -12061 -6900 -2461 -5343 -11206 -10237 -1780 3955 444 -5586 -3220 6440 11430 6226
562 6226 -167 2687 11461 13883 6638 -44 2671 9499 9365 1091 -4860 -2267 2935 1595 -5609
577 -5609 -9803 -6854 -2521 -3378 -7949 -9832 -6606 -2696 -2393 -4174 -4198 -1597 1230 2279 2207 2760 3738
594 3738 4731 5501 6092 5946 4890 3993 4195 4835 3985 1461 -512 -384 436 -671 -3464 -5138 -4234 -2868
612 -2868 -3556 -5606 -6171 -4336 -2324 -2406 -3626 -3254 -677 1568 1416 348 1009 3500 5122 4371 2583
629 2583 2774 4723 5674 3706 1028 914 2733 2935 114 -2910 -2703 -398 -246 -3437 -5940 -4520 -1349
646 -1349 -1056 -4133 -5879 -3171 872 1042 -2132 -3220 350 4362 3799 257 -602 3102 6162 4428
662 4428 504 -120 3122 4927 2248 -1567 -1578 990 1654 -989 -3479 -3002 -1196 -1108 -2705 -3254 -2358
679 -2358 -1800 -2044 -1622 -177 169 -1227 -1538 1010 3762 2611 -1108 -1466 3126 6529 3278 -2728 -2670
696 -2670 3834 7129 1608 -5671 -4528 3556 6525 -690 -8303 -5447 3724 5697 -2376 -8963 -4525
711 -4525 4463 5365 -2748 -7584 -2261 5464 4917 -2225 -5090 100 5486 3878 -1356 -2496 1269 3780
727 3780 2072 -468 -353 826 574 -175 605 1205 -777 -3243 -1856 2272 2615 -2809 -6431 -2215 4910
744 4910 4142 -4405 -8313 -949 8076 5447 -5575 -8831 1248 10775 5888 -6544 -8442 3105
758 3105 11646 4824 -7498 -7791 3940 10326 2443 -8083 -6785 3475 7384 -21 -7636 -5147
772 -5147 2513 4158 -1298 -5217 -2597 1619 1764 -579 -1072 208 434 -151 1230 3260 1997 -1866
788 -1866 -2133 3015 6375 1715 -5516 -4366 4326 7802 -253 -9379 -5964 5651 8368 -2608 -11888
803 -11888 -5731 7448 8693 -3868 -11965 -3699 9368 8765 -3989 -10105 -1005 10109 7754 -3731
817 -3731 -7681 590 8605 5226 -3611 -5522 699 5130 1985 -3179 -3433 -150 1090 -577 -1424 -898
833 -898 -1131 -2240 -1293 1733 2067 -1902 -4451 -392 5395 4368 -3131 -5914 1082 8395 5047 -4963
849 -4963 -7031 2345 9748 3915 -7191 -7683 3136 9577 1970 -8801 -7400 3766 8478 188
863 188 -8864 -6072 4151 7024 -682 -7367 -3697 4158 5345 -822 -4806 -1482 3467 3343 -357
878 -357 -1899 79 1825 1257 370 656 646 -610 -869 1102 2495 222 -3212 -2462 1963 3566 -811
895 -811 -5268 -3092 3053 4069 -1794 -6225 -2401 4335 4350 -2429 -5970 -985 5428 4298 -2520 -4856
911 -4856 537 5894 3664 -2520 -3780 1330 5123 2329 -2779 -3076 1080 3402 574 -3023 -2615 480
927 480 1518 -664 -2548 -1744 124 350 -838 -1242 -401 268 40 -128 407 1000 594 182 628 1503 1485
946 1485 405 -40 681 1457 847 -430 -631 156 549 -278 -1334 -1092 -241 -195 -1031 -1545 -834 -60 -141 -948
966 -948 -1000 8 849 502 -407 -412 887 1845 1194 -282 -377 1209 2354 1198 -993 -1329 881 2438 775
985 775 -2269 -2582 467 2568 346 -3392 -3413 554 3148 340 -3984 -3525 1318 4051 555 -4064
1001 -4064 -3017 2490 4818 745 -3918 -2396 3211 4934 519 -3726 -1861 3196 4131 -53 -3393
1016 -3393 -1654 2154 2611 -348 -2562 -1607 484 936 -22 -1036 -1550 -1486 -333 1294 1231 -1422 -3346
1033 -3346 -938 3445 3736 -1443 -5082 -1084 5815 5599 -2233 -6774 -936 7672 6494 -3582 -8419
1048 -8419 -812 8602 6024 -5350 -9416 -395 8794 4869 -6496 -9238 305 8269 3550 -6497
1062 -6497 -7639 1157 7168 2605 -5090 -5139 1628 5428 2040 -2677 -2452 1035 2731 1699 333 -477
1078 -477 -1084 -707 1695 3380 700 -4164 -4154 2217 6216 888 -7602 -6689 3672 9128 772 -10173
1094 -10173 -7660 5904 11300 251 -11804 -7227 8079 12422 -527 -12287 -6002 9348 11900
1107 11900 -1665 -11769 -4479 9201 9765 -2729 -10226 -3062 7432 6605 -3002 -7605 -2012 4528
1121 4528 3502 -1991 -3947 -1436 979 1122 639 144 -1560 -2777 -289 4248 3864 -2636 -6420 -657
1137 -657 7944 6470 -4654 -9769 -234 11159 7499 -7256 -12156 725 13288 7143 -9661 -13212
1151 -13212 1877 14026 5778 -11041 -12555 3105 13392 4086 -10901 -10325 4139 11535 2540
1164 2540 -9025 -7131 4091 8512 1452 -5822 -3926 2804 4679 1049 -1993 -1449 -7 552 1441
1179 1441 2110 -55 -3654 -3111 2671 5870 222 -7538 -5615 4776 9041 -259 -10759 -6549 7447
1194 7447 11270 -1410 -12851 -6065 9885 12176 -2776 -13636 -4685 11226 11447 -4036 -13000
1207 -13000 -3051 11122 9361 -5010 -11246 -1649 9247 6456 -4824 -8431 -697 6324 3580 -3302
1221 -3302 -4833 -434 2671 1447 -571 -1013 -997 -1116 394 2913 2282 -2364 -4635 176 6332 4272
1237 4272 -4426 -7425 761 9152 5033 -6774 -9388 1763 10928 4461 -8907 -9977 3032 11599
1251 11599 3287 -9993 -9226 4365 11086 1871 -9789 -7350 5000 9520 672 -8317 -5010 4751
1265 4751 7187 -63 -5768 -2787 3416 4201 -138 -2810 -1235 1129 1199 498 339 -468 -1866 -1314 1751
1282 1751 3162 -411 -4714 -2917 3542 5423 -933 -6939 -3363 5478 6917 -1779 -8328 -2983 7069
1297 7069 7327 -2828 -8772 -1958 7892 6689 -3677 -8257 -785 7674 5230 -4196 -7039 -3 6443
1312 6443 3406 -4025 -5320 450 4585 1835 -3038 -3255 464 2444 743 -1222 -1057 -22 237 302
1328 302 904 666 -1038 -1770 424 2960 1687 -2415 -3362 895 4620 1920 -3762 -4300 1562 5558
1344 5558 1622 -4882 -4623 2245 5795 929 -5418 -4157 2776 5426 203 -5181 -3124 3087 4624
1359 4624 -325 -4288 -1954 2826 3409 -588 -3075 -1008 2102 2044 -534 -1689 -371 983 673 -198
1375 -198 -344 -150 -305 -320 378 773 -248 -1507 -801 1279 1693 -580 -2382 -838 2146 2177 -919 -2935
1393 -2935 -599 2743 2347 -1333 -3038 -196 2977 2068 -1637 -2852 68 2834 1513 -1800 -2355 258
1409 258 2325 968 -1630 -1769 352 1637 394 -1204 -1077 389 896 78 -578 -386 171 286 20
1426 20 -43 108 14 -124 119 497 302 -321 -411 184 723 232 -631 -666 329 847 110 -854 -651 436 810
1447 810 -61 -887 -524 506 800 -173 -861 -361 556 663 -183 -576 -101 488 481 -135 -412 -12 443 319
1467 319 -169 -241 21 239 112 -196 -188 63 169 8 -214 -162 43 164 28 -294 -217 128 335 -10 -347 -283
1489 -283 222 501 66 -440 -299 433 604 33 -499 -304 401 629 20 -562 -323 382 510 -60 -554 -248
1509 -248 274 434 -63 -459 -183 175 202 15 -196 -120 -14 90 175 67 -107 -149 -29 373 378 -162 -526 -105
1531 -105 635 575 -329 -884 -92 918 681 -546 -1080 -79 1138 649 -834 -1255 95 1228 623 -930
1549 -930 -1176 223 1337 572 -911 -1069 291 1193 440 -760 -807 286 901 283 -523 -577 126 534 181
1568 181 -240 -322 -77 62 171 187 -88 -394 -331 246 591 32 -735 -561 466 991 94 -985 -673 682
1588 682 1203 -9 -1229 -668 929 1274 -136 -1392 -572 1057 1283 -324 -1342 -462 1035 1039 -373
1605 -373 -1245 -400 972 865 -380 -1000 -250 687 555 -231 -635 -189 374 333 39 -179 -249 11 247 345
1625 345 69 -315 -409 101 638 324 -465 -732 103 854 492 -653 -885 105 1030 472 -833 -986 218
1644 218 1078 389 -835 -881 266 1025 372 -786 -779 335 959 267 -720 -627 308 775 214 -595 -486 180
1664 180 552 133 -407 -423 61 282 201 -168 -313 -151 232 274 73 -295 -279 17 371 277 -205 -400 -57 390
1686 390 338 -164 -488 -92 408 435 -127 -553 -138 419 396 -158 -527 -138 346 373 -153 -465 -158 311 330 -94
1708 -94 -360 -189 337 332 -67 -262 -92 308 315 -2 -312 -102 301 325 -12 -293 -158 327 335 -18 -378 -86 317
1731 317 236 -101 -346 -87 259 164 -228 -293 -18 226 110 -146 -174 84 169 26 -148 -63 176 104 -79 -105 27
1754 27 119 55 -83 -42 115 73 -100 -47 119 157 -86 -149 76 240 81 -322 -281 215 428 -7 -498 -244 400
1777 400 539 -101 -672 -133 576 599 -262 -787 -75 721 483 -455 -771 27 786 433 -569 -753 190 733
1797 733 265 -602 -476 251 688 107 -514 -332 262 435 44 -283 -119 156 191 -54 -79 116 6 -140 2
1818 2 293 132 -262 -417 91 557 230 -609 -594 361 890 166 -901 -692 640 1040 50 -1208 -660 770
1838 770 1110 -132 -1248 -502 966 1045 -351 -1182 -368 956 850 -382 -962 -233 804 539 -356 -632
1856 -632 -35 509 249 -222 -293 -24 185 25 -6 21 -76 -302 -81 339 365 -199 -680 -124 704 610 -406 -963
1878 -963 -63 1051 712 -672 -1131 53 1354 686 -982 -1209 235 1437 566 -1078 -1186 415 1414
1895 1414 439 -1089 -998 488 1169 204 -931 -733 427 793 87 -692 -454 307 396 24 -237 -154 -37
1914 -37 53 135 199 48 -273 -219 227 572 70 -638 -516 478 929 35 -983 -553 769 1155 -12 -1234
1934 -1234 -599 931 1182 -291 -1396 -520 1051 1147 -409 -1320 -331 1099 919 -477 -1146 -155 906
1951 906 726 -458 -879 -85 697 448 -278 -531 -53 309 232 14 -183 -80 -59 91 220 221 -218 -387 15
1972 15 628 425 -347 -706 1 826 523 -599 -924 185 1077 501 -794 -1036 238 1140 359 -831 -875
1991 -875 395 1028 239 -859 -698 427 914 135 -772 -496 424 670 88 -601 -326 327 444 -8 -294
2010 -294 -192 143 217 31 -26 -2 -70 -94 180 301 21 -337 -227 344 530 -11 -529 -299 376 628 -96 -668
2032 -668 -265 560 578 -168 -702 -261 553 554 -260 -655 -111 522 473 -343 -618 -95 440 303 -271 -482 43
2053 43 387 212 -182 -244 91 278 -5 -171 -82 55 56 4 -59 48 3 -70 17 32 58 -77 -222 -11 191 81
2077 81 -118 -181 -9 262 134 -222 -181 30 341 30 -187 -181 102 309 103 -229 -128 137 190 47 -167 -104
2099 -104 180 185 -19 -129 -21 100 32 -79 -133 52 144 15 -84 -43 48 82 35 -92 -78 20 107 10 -131 -107 79
2124 79 143 2 -157 -142 23 156 73 -120 -193 87 200 124 -148 -203 56 239 102 -175 -162 28 199 92 -209
2147 -209 -181 1 160 92 -86 -125 -14 135 81 -83 -167 -67 78 118 36 -107 -189 -51 208 183 -105 -273 -131
2170 -131 236 337 -107 -404 -102 341 396 -108 -568 -135 516 513 -161 -647 -197 515 547 -181 -608 -170 591
2191 591 478 -175 -591 -83 509 410 -204 -436 -103 363 349 -118 -307 -140 205 214 29 -126 -154 -28 133 154
2213 154 14 -173 -219 156 405 172 -299 -426 163 659 270 -488 -546 137 817 295 -639 -709 295 929 348
2234 348 -754 -701 320 931 224 -780 -691 407 863 68 -748 -624 336 684 62 -550 -458 254 536 41
2254 41 -347 -236 99 287 140 18 -120 -98 17 241 246 -79 -415 -206 375 563 -156 -657 -292 623 724
2275 724 -205 -842 -313 788 833 -285 -1008 -312 910 790 -493 -1104 -261 900 792 -444 -967 -123
2293 -123 887 564 -452 -791 -64 707 426 -366 -604 8 430 263 -118 -264 -89 103 176 211 -9 -208
2313 -208 -231 181 428 227 -407 -453 176 661 322 -649 -743 202 915 300 -816 -855 322 1048 267 -942
2333 -942 -889 461 1063 234 -969 -727 524 1031 49 -883 -554 472 842 8 -713 -429 421 557 -25
2352 -25 -441 -236 256 312 36 -134 -105 -102 31 135 167 -131 -289 -158 414 513 -140 -659 -216 525 706 -232
2374 -232 -875 -256 705 735 -275 -901 -260 889 687 -435 -1045 -188 911 685 -445 -882 -59 889 484
2393 484 -524 -702 -18 659 376 -308 -412 73 417 221 -229 -289 47 150 135 40 -60 -112 -143 110 264
2414 264 111 -288 -336 83 509 187 -478 -580 264 749 222 -630 -587 248 832 234 -643 -610 365 867 183
2435 183 -728 -521 442 777 39 -670 -402 365 598 -29 -489 -271 335 370 0 -298 -207 168 182 6 -133
2456 -133 -62 -10 14 105 77 31 -177 -91 181 291 -75 -373 -131 363 360 -111 -457 -161 420 453 -186 -575 -132
2479 -132 512 487 -283 -506 -27 547 373 -268 -550 78 489 304 -273 -386 23 362 156 -157 -270 19
2499 19 193 71 -120 -123 43 72 15 17 11 -83 -41 17 142 113 -100 -178 73 235 158 -145 -188 58 291 117 -237
2524 -237 -304 107 278 56 -244 -186 177 310 -13 -273 -190 181 242 -28 -246 -183 170 193 -29 -214 -92 79
2546 79 140 -19 -88 -28 110 69 59 -16 -58 11 -15 30 3 -52 -36 -34 59 87 32 -96 -6 65 105 7 -108 -59 79 31
2574 31 -21 -70 -15 21 51 -3 -29 -44 26 42 -94 -36 1 78 -24 -35 29 -1 -42 -57 21 40 42 -3 89 2 42 -17 -11 30
2604 30 18 39 -22 34 -41 0 14 54 -38 -29 -33 30 64 -6 -32 -29 -4 71 -11 -62 -97 10 89 28 -124 -91 -4 103 67 -86
2634 -86 -114 28 112 3 -111 -136 37 102 111 -95 -115 32 136 93 -65 -66 -38 110 63 -59 -76 -42 14 42 54 -36
2660 -36 -96 -57 50 98 5 -147 -63 43 130 3 -134 -42 114 141 57 -127 -99 134 231 21 -216 -96 188 214
2684 214 30 -129 -7 163 233 -29 -167 -57 130 168 -31 -220 -95 141 180 -28 -105 -107 1 108 -13 -64
2706 -64 -64 29 33 78 27 -106 -64 34 125 165 -118 -184 20 194 63 -112 -190 48 251 125 -114 -207 52 253 141
2731 141 -193 -254 10 281 57 -234 -159 75 190 76 -197 -214 76 123 88 -132 -144 -44 102 40 -51 -109 -53
2754 -53 81 94 11 -60 -94 31 108 64 -139 -148 4 78 159 -10 -179 -85 90 128 -6 -191 -56 139 175 -28 -197
2779 -197 -65 166 201 -66 -259 -11 157 182 -67 -144 -105 84 91 -37 -63 -57 49 77 -50 -110 -71 59 45 20 -87
2804 -87 -50 32 65 17 -33 -13 -56 13 33 10 -63 -5 50 103 21 -23 -71 107 109 -9 -124 -43 88 94 -24 -107 -76 29
2832 29 141 -11 -103 -43 44 102 -7 -101 -117 8 107 8 -40 -37 22 62 56 21 -58 -16 77 38 -56 -71 41 62 104 11 -31
2861 -31 12 52 -21 -90 -10 -29 92 17 -23 -15 48 60 8 -68 -72 49 43 36 -108 -46 35 90 8 44 -42 -7 17 50 17 7 -23
2892 -23 32 33 44 2 -60 39 39 18 -24 -17 -39 56 55 -55 -109 26 36 37 -67 -108 20 150 16 -96 -91 -20 122 -1 -132
2921 -132 -77 45 156 45 -140 -73 116 161 42 -172 -92 49 114 21 -96 -62 45 40 45 -65 -4 34 79 89 -9
2946 -9 -45 -9 5 -9 79 -56 -61 -45 133 112 -10 -109 -23 147 108 -74 -180 -28 180 152 -47 -203 -3 269 118
2971 118 -123 -159 12 193 100 -162 -156 -5 226 121 -45 -150 56 146 39 -132 -126 36 120 -10 -113 -61 25
2994 25 47 40 -6 -31 -49 -30 38 93 29 -64 -34 65 163 9 -154 -161 96 194 53 -188 -98 156 250 -21 -267 -77 211
3021 211 261 -96 -198 -105 216 237 -44 -235 -83 242 162 -87 -180 -31 165 115 -43 -158 8 88 75 -23 -53
3044 -53 -53 45 8 1 72 -6 -79 -47 87 13 -104 -151 -48 176 121 -117 -212 32 250 137 -126 -241 34 293 86
3069 86 -156 -222 19 256 72 -177 -172 36 251 67 -138 -225 100 152 11 -183 -62 124 92 -10 -97 -90 -14 76
3093 76 37 12 -18 36 -20 59 76 -51 -109 -16 51 144 -26 -159 -93 72 142 -9 -148 -54 180 204 -7 -259 -81
3118 -81 156 213 -36 -224 -43 167 182 -68 -217 -76 153 59 -65 -161 13 105 132 -30 -39 -5 67 52 20 -8 -20
3143 -20 3 44 68 9 -15 -10 12 88 73 -60 -102 27 98 80 -112 -141 -10 165 99 -133 -155 66 164 72 -155 -169 87
3170 87 182 17 -138 -109 68 156 66 -99 -124 66 85 -20 -94 -37 62 55 47 -36 12 50 2 1 -49 22 106 44 4 81 37
3199 37 -6 -66 9 71 -9 -61 -52 56 61 1 -75 -15 57 31 -8 -86 -17 64 84 -30 -70 -36 102 25 -41 -80 -4 96 68
3228 68 -39 -46 35 21 13 3 -33 47 63 9 5 49 22 -35 -26 -14 18 -8 -5 -68 -5 -35 17 -89 -76 3 10 -55 -95 -52 36 45 -15
3261 -15 16 -21 89 45 1 -55 30 14 3 -56 -13 14 50 21 31 7 54 15 23 11 20 -33 -16 -21 -22 48 23 -50 6 43 66 18
3293 18 -24 -29 -16 54 -12 -105 -57 -37 11 85 25 -21 11 27 21 6 -15 -13 -19 65 55 -31 -42 -12 30 -13 -61 -27 55 82 0 -29
3325 -29 -1 17 56 5 -42 -92 18 45 -1 -33 -58 17 65 -16 -34 -55 -9 40 18 13 -41 24 16 -11 46 -27 -6 66 87 47 -23
3356 -23 -63 51 90 29 39 -61 -6 30 37 -64 -57 20 56 80 -50 -73 5 5 -40 -53 -103 -21 39 67 -19 -43 -23 -3 52 -30
3386 -30 -53 3 36 57 6 -62 -30 -12 114 53 14 0 -24 52 57 55 -69 -62 61 56 18 -40 -121 55 80 11 -111 -70 13 100
3416 100 28 -70 -101 52 104 -8 -47 -14 16 110 8 -117 -56 2 86 -7 -67 -49 37 30 -2 -42 -41 -18 19 70 18 -19 27
3445 27 11 38 64 15 -45 6 75 38 -55 -58 -59 100 87 -49 -97 7 37 11 -46 -75 -38 56 90 -11 -118 -53 36 109 -9
3474 -9 -84 -22 41 43 3 -37 -16 -6 54 -29 4 36 35 44 3 6 -53 8 18 51 25 0 -28 12 31 -15 -36 -105 -1 47 -10 -63
3506 -63 -92 -43 66 57 -68 -111 17 47 4 -69 -66 41 118 53 -56 -63 27 85 55 -68 -50 13 31 58 -34 -16 -33 30 9
3535 9 -54 -16 -23 60 55 25 11 -11 -44 20 -4 -20 -19 13 18 29 50 -44 -5 35 25 -73 -67 -1 18 60 -31 -100 17 55 57 -24 -63
3568 -63 -38 18 69 24 -64 -4 77 2 28 21 -3 58 55 -27 -27 -4 37 8 9 -8 -46 -50 -32 24 31 -29 -21 24 11 -28 -55 -45 24 33
3602 33 60 -31 -52 34 -11 0 -27 -11 26 36 9 13 -50 53 13 -2 -60 -42 23 -3 11 -85 28 22 34 53 -43 -31 -15 -8 -13
3633 -13 -6 -65 -13 -26 -3 -41 -29 -38 7 -42 48 -24 -35 -50 13 59 50 41 -11 39 45 65 6 -42 -10 29 94 8 -37 -17 -14 -15 -37 -22
3667 -22 0 -21 -9 -57 9 -20 -33 -21 -24 -8 -71 -15 12 -3 15 -35 -37 28 49 36 25 5 28 -75 7 -30 -18 34 50 13 25
3698 25 -21 -12 -9 -5 2 -20 4 -6 -4 -10 -20 -24 52 29 -49 -52 -18 -7 -10 18 14 2 -41 21 44 15 -35 -36 -4 26 23 -62 58 12 36 -20
3734 -20 -5 10 12 -15 -12 9 -25 27 46 26 35 25 -34 -57 52 28 -20 -98 0 18 8 12 -70 24 32 19 -25 -64 -22 -20 -20 -15 -12 19
3768 19 6 77 -37 -24 29 70 89 -24 9 -82 27 29 -18 -34 0 74 23 16 30 26 65 -19 -55 -90 -60 -37 -9 -62 -16 -89
3798 -89 -29 -2 49 -2 -55 -45 0 20 -21 4 -5 14 63 36 -1 36 31 55 38 27 -44 3 68 -16 0 -3 -16 98 10 21 -9
3829 -9 4 47 29 -32 -32 34 21 -10 -37 -23 20 40 -14 -15 -25 -32 2 51 27 -6 -30 -6 6 24 33 -43 -60 88 62 -21 -78 20
3861 20 125 148 6 -41 41 100 -11 8 -28 -7 51 65 23 -35 11 44 18 30 3 -74 0 -7 29 2 1 7 2 20 -18 -16 -27
3892 -27 9 6 3 -50 -12 -8 48 26 -81 -32 63 77 49 13 64 -21 15 -18 -4 -28 -31 82 -6 -55 -25 -25 39 -12 -76 -55 -26 88
3924 88 21 -55 -37 -33 43 32 -65 -38 60 23 64 45 -19 8 -30 63 -2 -42 -10 29 40 25 -48 -2 23 23 73 -61 -49 -16 50
3955 50 -33 -15 21 -49 46 29 -14 -60 -29 -29 6 10 -19 -30 -15 -1 29 -61 21 14 -7 24 -28 23 70 -8 -12 55 28 -18 39 28
3987 28 -2 57 8 10 -1 -20 16 1 45 35 -32 -71 10 -51 -13 7 -43 15 60 -25 -10 -41 -91 -11 10 9 -3 20 -39 -16 12
4018 12 -5 14 -26 -33 13 -8 71 37 -42 -19 21 68 14 -22 -13 31 -2 -5 -2 -68 40 20 -9 37 -33 -35 -33 17 56 10 -32 -9 41
4051 41 18 -4 -5 -31 46 59 -22 -56 -64 58 42 -26 -46 -15 19 -6 -42 -12 -5 49 22 -32 -55 9 36 28 -10 -23 23 -56 -36 -7
4083 -7 23 -25 11 48 4 -81 -41 -57 28 35 5 -25 -54 -18 98 21 -53 -21 69 110 18 -40 -95 40 84 10 -38 -54 29 107
4113 107 41 -70 -60 107 76 -36 -57 -51 91 70 7 -91 -31 10 -11 3 -63 -22 -34 -28 36 -11 -29 -59 12 48 23 -39 -104
4142 -104 -7 20 64 -42 -91 -8 102 72 -4 -104 -16 133 88 -49 -87 37 109 40 -8 -39 -28 141 12 -65 -83 63
4168 63 77 -15 0 -36 8 24 -4 -33 -8 44 -60 31 7 -8 -52 -15 11 59 36 -8 -66 13 65 -2 -44 -54 49 92 24
4197 24 -86 -95 70 185 34 -82 -86 66 130 41 -121 -54 51 142 -26 -120 -63 27 52 -52 -98 -45 48 42 -7 -53 -40
4224 -40 27 49 50 -24 -42 -32 -29 41 -8 -16 7 42 101 68 -51 -108 -2 59 88 -47 -87 39 72 71 -61 -92 65 152 73
4253 73 -75 -93 56 96 48 -128 -95 -2 106 3 -114 -82 -34 42 23 -22 -121 20 12 -4 15 -20 -17 5 -3 53 15 17 -30
4282 -30 23 88 -7 -37 -37 21 113 2 -28 29 57 106 -49 -93 -66 24 132 -20 -111 -33 35 154 -45 -46 -54 72 33 -18
4310 -18 -82 25 19 86 15 -44 -65 85 59 15 -10 17 17 25 -1 -11 -35 -20 52 72 64 -19 -45 -74 41 65 -36 -57 -25 36
4340 36 94 -46 -63 -4 63 71 -39 -102 19 25 29 -5 -17 40 38 4 -18 -47 25 40 -10 22 -7 44 49 6 27 0 42 54 -30
4371 -30 26 28 -44 16 4 15 -10 -26 5 23 52 20 -4 -34 -26 -27 -3 -20 -22 44 45 34 11 8 51 30 14 -20 -30 66 56 -13 0
4404 0 -15 -23 26 27 5 54 7 20 18 31 -12 -55 15 7 4 -26 -65 59 20 65 10 -81 17 30 -1 54 -101 -27 24 13 -2 -11 4
4437 4 53 13 -33 8 29 -41 46 15 -18 8 43 53 40 51 -31 -7 20 30 8 -15 -22 63 -51 50 19 -60 15 0 34 -12
4467 -12 -36 -14 22 5 -25 -45 -1 101 60 25 -9 -42 16 36 38 -7 -19 40 30 57 -21 17 -45 57 0 69 -77 -35 63
4496 63 84 -9 -80 -10 15 67 18 -41 -15 13 65 59 -45 -57 31 36 -44 -37 -71 -3 10 12 -11 0 31 57 -12 -8 -7 -6 54 50 30 -14
4530 -14 -48 58 16 29 -31 -26 -12 20 69 -32 -21 -3 19 18 -29 -76 8 85 25 -106 -54 0 41 107 -30 -100 24 131
4558 131 25 -98 -57 50 48 54 -12 -76 29 31 18 -27 -16 49 53 13 5 -55 59 25 -26 7 21 -10 -20 50 29 -20 -53 -15
4588 -15 51 89 -3 -99 -71 39 49 64 -87 -44 73 75 -80 -73 10 84 94 -3 -111 -38 80 40 13 -14 -46 -19 43 6
4616 6 -4 -3 0 41 17 -26 -15 24 18 24 12 -21 -6 -9 2 30 -31 -56 30 50 30 -30 -48 -2 87 10 4 -65 12 77 50 -18 -46 36
4650 36 94 42 -13 -91 9 20 80 -4 -42 51 82 38 -37 -6 19 13 25 -17 -100 -14 -24 22 3 -42 -35 21 -33 20 19 -25 -25 -9
4682 -9 -15 23 -50 -67 -19 31 35 -18 -11 21 28 41 -55 -17 57 91 17 -4 30 83 38 -79 -36 6 29 32 -35 39 -1 7 53 8 -4
4715 -4 13 -21 -67 -22 -32 -27 -16 -67 46 24 -23 -35 -28 3 3 -8 -49 -33 -7 78 -45 13 40 32 8 81 4 5 8 -34 55 14 12
4748 12 -18 -2 11 -38 51 -30 -23 42 20 -33 -73 -48 -14 40 24 -69 8 9 82 37 -34 -25 -15 34 20 -40 -24 -14 29 26 -7 57
4780 57 38 8 34 -52 -16 -38 -8 -8 -16 -22 -11 11 29 8 -7 9 32 -5 20 -38 -30 -41 35 35 -53 3 -13 49 -6 6 -119 -8
4812 -8 66 -1 -10 -52 16 44 -13 38 -26 41 22 -49 12 -43 -7 75 18 -24 -69 -42 2 1 13 -38 36 21 31 66 -35 -41 -23 32
4844 32 30 -3 -63 3 46 37 -14 -83 -44 54 32 -9 -44 -39 76 43 -26 -43 69 76 84 7 -33 -47 60 29 -53 -34 53 77 32
4875 32 -21 -58 -39 -32 50 -6 -1 -40 -46 43 25 -15 -103 -76 31 63 -1 -64 -92 66 52 -25 -125 -123 33 51 2 -93 -94 69
4905 69 105 43 -94 -56 -9 114 52 46 -35 29 66 1 -21 -20 23 72 18 -71 24 -30 33 48 7 -34 -4 -1 17 33 -21 -40 30
4936 30 93 25 -6 -36 61 63 91 -82 -93 28 88 71 -57 -38 17 109 56 -72 -77 -17 125 66 -38 -25 8 51 15 -72
4964 -72 -32 -21 -44 48 8 -56 -31 22 43 -7 -66 -48 -56 54 -2 39 -28 -16 47 28 -4 -73 -54 68 95 -12 -131 -44 88
4993 88 64 -8 -45 -21 86 25 13 -91 -58 40 51 26 -45 -42 20 64 -27 -49 -58 -7 40 -21 -92 -53 20 39 36 -8 -41 7 7
5024 7 60 -1 -25 5 11 8 15 -33 -46 4 22 16 -31 -2 16 60 -34 -1 -64 51 31 -10 -23 -87 -43 59 -62 -93 -43 34 89
5055 89 -17 5 -20 7 -65 45 -11 12 11 -32 20 -1 10 20 2 30 14 23 -22 24 68 69 -6 -39 15 69 -1 -31 -17 -65 -3
5086 -3 22 -26 -50 -4 31 38 -19 -13 -7 68 -8 -46 49 -9 59 21 34 -11 -13 43 -24 18 15 4 67 21 -2 33 53 18 6 -33 20
5119 20 25 11 35 13 72 -20 43 25 -23 28 8 0 -6 -4 19 -40 30 -11 -17 13 -2 23 32 -25 -11 15 37 42 12 34 -18 -13 -15 -20 -41
5154 -41 50 43 -9 -21 4 -41 -3 1 -9 -14 24 26 43 -35 -37 65 2 37 -35 -9 -46 9 9 10 -20 -94 -17 44 5 36 -59 -12 -18 11
5188 11 -16 -27 -59 -2 65 -6 -74 -52 2 28 -41 -43 -49 58 32 -5 2 -27 80 52 -23 -5 -15 34 48 -2 -34 -52 18 9 -17
5219 -17 -95 -45 16 32 4 -21 -83 -24 57 34 32 -54 -40 -3 104 84 -103 -12 16 57 34 -57 -28 32 108 -47 -72 -116 48
5248 48 88 -32 -25 12 67 45 18 -48 -9 -39 47 5 -15 -47 -7 -3 -25 9 -45 -1 34 54 37 -35 -66 15 55 4 -21 -56 3
5279 3 19 49 -30 -23 4 70 29 -66 -47 37 155 10 -43 -24 21 81 51 -94 -74 -6 44 28 -46 -29 -29 60 44 -31 -88 -18
5309 -18 16 -7 -12 2 -47 -9 52 51 -13 -26 4 15 74 0 -71 -82 58 69 21 -52 -50 59 90 -25 -72 -27 73 109 0
5338 0 -73 -56 48 119 -103 -79 -39 47 76 -53 -45 -13 44 45 -16 -65 0 39 -7 -2 -6 -49 -6 22 10 -4 -60 12 55 113 32
5369 32 -48 -34 -3 108 -13 28 -44 73 61 10 2 -14 -2 29 -12 3 -69 38 14 -14 -61 -12 56 68 -21 -58 -48 6 64
5398 64 -27 -38 -26 23 10 8 -71 -37 46 22 -19 -3 -48 34 21 33 8 5 -21 0 49 57 30 28 -47 63 44 -1 -48 -4 36 31
5430 31 12 -61 -1 3 -20 -67 -34 -53 42 59 -14 -92 54 3 27 -13 -8 20 60 27 -17 -10 -25 1 -18 -16 6 3 24 53 -36 34
5462 34 19 11 -25 16 -20 -29 -48 31 74 -19 31 -39 -14 34 -9 -10 -23 -25 -2 -8 -7 -17 -44 29 -41 -38 55 11 -16 42 24 30 88 37
5496 37 -3 -47 -31 -1 -5 -10 -14 -11 -13 37 -34 -2 -27 -18 4 11 34 67 -11 -57 24 -21 37 -60 -32 39 20 14 -59 -34 -7 1 -2 -34 29
5531 29 21 11 23 -46 11 30 -3 7 38 1 17 -9 10 4 45 -63 -25 46 40 3 -69 3 -52 36 -32 -42 -17 30 32 9 -18 -27
5563 -27 23 21 -21 15 16 49 35 0 -33 10 63 21 50 7 -9 32 -41 66 48 30 -13 -29 20 -22 4 -32 -53 37 -20 3 -27
5594 -27 -10 30 -14 -95 -27 54 -3 49 -30 -62 -45 -23 35 -50 22 22 34 -2 22 -7 17 -13 42 27 14 49 11 5 13 -28 -11 9
5626 9 23 65 1 12 -17 60 41 -9 -48 -39 30 46 -28 -59 41 60 14 -28 -53 7 22 54 7 -21 -59 13 -11 10 -5 -6 0 2
5658 2 30 -27 12 44 -21 63 62 7 -12 61 24 3 -46 -21 67 0 15 -5 -57 -5 28 39 -70 -47 12 -25 19 -108 -95 -27
5688 -27 9 -14 -25 40 59 24 50 -41 1 23 38 6 -38 19 -77 23 53 25 13 16 -4 82 40 -17 -18 -17 1 3 1 -26 -8 -14 11
5721 11 -7 -23 -12 81 34 -3 -50 -83 80 -8 -65 -23 -27 77 -7 -81 -35 5 25 -19 -51 -60 26 -35 11 17 -21 -40 37 4 -9
5752 -9 58 25 18 -1 -28 -11 78 -18 -4 34 -42 13 -8 -12 37 -11 -14 32 29 -29 49 -51 1 26 46 13 -26 35 45 5 -12 -47
5784 -47 7 28 -21 -3 -23 55 -9 47 28 28 25 -13 40 -34 9 -3 -6 -48 1 12 31 -63 6 -22 19 29 -54 9 19 4 -44 8
5816 8 65 -25 -10 21 18 -5 58 43 -53 -36 3 0 30 -19 39 -2 4 15 -34 28 -14 -34 -10 -29 34 80 7 -33 7 -2 68 -32
5848 -32 -65 -35 -32 -40 -29 -38 31 0 -11 -34 -14 -6 -23 -45 -47 -2 30 24 40 37 6 36 -64 -7 -14 -2 -21 -36 -30 36 2 -31 -14 -41
5882 -41 -29 31 54 29 32 54 26 -65 -43 26 40 -51 -33 -55 38 60 -21 -25 6 25 49 -22 -71 -20 -24 15 -21 1 -5 5 53 10
5914 10 -6 53 28 5 33 -46 42 -12 -3 -3 50 -13 -35 -26 -12 23 -60 -79 -41 54 15 -73 -95 -1 64 29 -60 -47 29 65 59 -80
5946 -80 -40 19 75 54 -24 -19 -20 24 -1 -20 7 71 63 33 -20 -6 -11 -46 37 -12 6 9 5 6 -39 -5 -15 -2 36 6 18 -11 -8 52
5980 52 -15 -9 -11 -5 59 31 -19 -76 -2 46 64 -50 -13 -32 41 39 -31 -81 -27 5 10 -1 -46 5 56 26 -29 5 12 -41 -32 44 -18
6013 -18 -42 -8 35 -25 18 -68 -54 10 35 -27 -9 27 1 92 7 1 -72 70 22 30 -54 -85 -13 113 -16 0 -5 25 84 -1
6043 -1 53 -50 -26 13 17 -52 -38 88 58 38 -15 11 23 59 -46 8 -46 17 19 63 -61 -26 -60 38 42 6 -50 11 -30 0
6073 0 70 -24 -27 1 56 67 -3 4 68 47 47 -27 -33 43 30 41 -44 15 -39 46 -7 -24 -9 -25 13 37 8 -51 -36 31 -1 -18 -47
6106 -47 -102 17 -8 32 21 -13 -6 -7 41 -15 -3 1 9 42 31 -37 -37 60 20 1 -9 -34 64 39 24 -65 30 62 64 -6 -76 -19 23
6139 23 1 -39 -51 -31 40 -5 -25 -97 -55 -2 69 -46 -51 -43 -9 -20 74 -10 -12 42 6 49 13 -53 -8 -15 25 11 -30 24 24 27 30
6172 30 -7 -16 -28 36 6 13 -4 29 6 -29 11 -48 -43 20 -16 -43 -6 -7 19 -33 -4 1 -8 29 25 -29 17 -38 26 50 -58 -33 76
6205 76 24 -1 -9 51 2 -4 -11 8 -51 -41 -23 2 74 26 12 -30 39 29 7 -6 -22 -13 8 7 -33 -7 13 -28 -14 -46 7 -31 1
6238 1 -75 -22 5 -3 75 8 54 58 44 27 -4 2 -39 25 -30 -28 -28 84 40 27 42 12 -42 17 23 -52 23 16 10 13 1 0 43 24 20 -24
6274 -24 49 -1 -8 24 33 24 -22 11 52 -23 1 28 -20 42 -59 -11 -3 36 -7 21 -24 -20 32 6 -2 2 -26 -12 -9 27 -33 -14 -19 -59
6308 -59 -6 -10 7 10 4 -5 -14 -52 0 15 15 -20 -49 -21 9 -5 -13 -72 -11 41 24 -5 -10 -31 29 62 41 3 0 18 26 41 -37 -8 38
6343 38 14 -47 -12 -62 -5 -26 -5 -28 12 27 12 14 -19 -44 38 -28 -21 -11 -14 25 53 -9 12 -52 -10 15 22 -19 48 -31 30 34 2
6376 2 -6 27 -26 -49 -1 -4 -38 32 13 -50 -53 -2 40 20 -18 -38 -34 5 -4 -16 -13 37 11 7 -4 -56 -20 -24 64 37 9 -33 -23 -14 -25
6411 -25 -33 -50 28 52 47 -6 58 24 40 78 8 -37 -48 15 9 -54 35 32 11 -12 -21 -60 -75 24 32 -51 -57 28 -14 44 -5 -43 -5 -28
6445 -28 -7 -1 10 -34 3 33 1 -43 -34 -34 16 46 36 6 -21 17 52 17 -33 0 23 -3 -7 -31 -35 20 100 -7 -36 -47 23 43
6477 43 -12 -109 -22 42 -14 42 -9 38 12 0 6 9 6 8 39 -13 57 -29 32 -7 -14 13 6 8 -40 45 68 37 -24 -35 62 90 -11
6510 -11 -23 -5 14 -16 -69 5 -16 -78 35 1 -60 14 33 61 -78 -21 -38 -20 -8 -3 30 15 82 31 14 -30 -27 7 -11 -10 -9
6541 -9 37 71 -14 22 -12 33 53 60 47 24 9 -31 5 -9 43 -51 -37 9 -31 -43 32 -28 -2 5 -14 31 -31 16 78 1 7 10 -39
6574 -39 -36 -46 -43 22 -77 8 0 -14 57 55 23 -5 -23 17 24 -13 -22 -16 -28 12 -24 -43 -74 1 38 -28 -44 -48 -28 -2 17 -5 30 -8
6608 -8 -23 -28 41 45 -1 6 -34 -1 17 33 51 -44 58 -9 -29 3 53 -19 -33 17 76 34 29 19 9 -29 51 13 -39 34 -13 -4 -51
6641 -51 -9 -32 20 -47 14 -32 40 0 -47 44 -28 -26 4 -37 18 9 -31 28 34 34 45 63 2 43 55 -21 -9 -62 10 -7 37 -20
6673 -20 -15 39 46 48 2 27 -16 10 16 29 45 -20 47 55 -38 -22 23 -9 -28 -12 -39 -9 -58 -36 -5 -11 -32 -5 78 13 -4 16 -45
6706 -45 15 49 -36 39 11 5 26 50 -28 30 57 11 -13 -15 1 8 21 35 0 -9 25 26 -3 -34 -17 59 7 9 38 -16 58 80 -31
6739 -31 0 9 33 64 -10 -1 -2 25 48 66 21 -8 17 50 0 -20 -63 -42 54 14 -16 0 -80 6 41 10 -15 -16 18 51 -56 -50
6771 -50 -40 3 12 4 -35 -59 41 11 5 -47 -1 19 53 15 7 -66 35 40 20 32 4 -3 38 22 -6 21 -10 -2 7 7 2 10 40 -5 40
6806 40 25 59 49 14 -20 -53 33 -23 43 4 -44 -6 -2 62 15 -33 1 79 -8 -14 37 -51 16 34 -3 -33 6 43 57 69 17
6837 17 -59 11 10 52 60 -15 29 3 49 21 17 -15 24 3 -24 -22 -35 38 -9 -15 -37 -25 -33 56 -19 10 -10 40 20 -34 7 10 4 44
6871 44 16 7 26 49 29 25 -12 -10 30 55 -39 -10 35 23 25 -2 -25 14 15 -17 -27 6 -10 -18 6 49 34 -5 7 -15 15 14 -58 -23
6905 -23 -67 8 44 5 15 3 -30 -10 47 -34 24 56 -7 -19 34 -8 82 8 28 -28 107 -33 31 17 2 14 -20 -31 21
6934 21 6 43 -42 -50 -37 30 -75 -51 -15 -49 1 15 -66 -47 8 26 9 19 9 -29 47 34 29 14 51 -25 -31 28 62 39 15
6965 15 14 31 -57 51 -59 14 -26 0 -8 2 13 -7 7 57 6 -10 23 12 -13 -3 -7 25 -8 -52 11 -28 7 -12 52 -68
6995 -68 -33 -3 -12 24 -22 -9 20 4 -50 35 33 16 63 22 42 -12 -69 18 8 32 -29 -61 58 14 -21 -23 -91 21 28 -3 1 -9
7027 -9 -51 82 -40 4 -16 -29 35 -17 -5 20 39 -45 -8 19 16 14 34 13 21 7 16 53 49 5 -22 -34 -28 10 -17 40 -42 -44 16
7060 16 21 -78 4 24 -14 -11 1 -10 -29 17 46 -89 -38 -21 29 35 7 -35 -18 89 36 -34 -2 5 13 13 -22 15 20 -10 47 -33 27
7093 27 11 -19 41 7 -44 35 -6 -6 -18 34 -63 -66 37 7 -70 -44 -25 18 14 9 -4 -32 5 27 -5 -26 -16 -7 77 -31 -81 32
7125 32 118 41 19 -44 11 49 28 51 -45 -1 8 60 -31 -16 -2 -16 -15 11 -28 -52 -54 44 7 61 -28 -38 60 13 31 -8 31 17
7157 17 -4 55 -71 -67 5 46 36 35 -7 -28 -5 -12 -55 -46 37 64 26 -41 4 4 39 60 -17 -65 -12 -8 -60 5 -41 0 36 -17 11
7190 11 -54 -52 9 36 -32 -2 -27 4 58 24 -5 -67 -35 -2 26 -7 -47 -25 12 -16 43 -58 10 31 34 -67 -25 -24 8 4 -69
7221 -69 -58 36 12 75 -5 29 8 51 26 -11 0 8 30 45 7 16 52 -27 -3 4 42 -8 -20 6 -21 -7 53 33 16 30 10 -17
7253 -17 2 34 -15 -40 -19 24 75 55 11 -68 -24 -10 53 -49 -24 -34 -37 -5 8 -38 -75 52 41 3 9 -11 42 36 15 29 -17
7284 -17 1 -68 19 -10 9 -8 6 -29 -60 -45 12 1 12 19 32 1 30 41 16 67 -16 68 23 52 -66 -9 3 43 41 -20 -18
7315 -18 19 45 33 -16 21 -23 12 14 -27 -26 -29 43 -40 -24 3 13 2 15 53 -21 15 -29 3 82 -38 12 16 -41 -23 9 37 -24
7347 -24 51 17 -27 -52 -3 38 -33 -50 19 46 -13 -30 -8 -34 -61 25 -37 61 13 -15 -39 -39 37 -42 6 -27 -16 34 -15 -5 -2
7378 -2 -5 -68 39 -14 -35 12 33 90 -26 22 -15 -15 -13 19 20 -37 -67 -22 -33 -50 -67 -15 -23 8 89 -38 1 -23 -18 0 -23 -24 -61
7411 -61 -10 6 30 -37 -37 -5 3 20 6 -71 40 32 34 -31 6 21 -2 50 71 28 -9 -50 -4 -24 -5 -21 -2 -48 -38 2 24 -13
7443 -13 -1 5 -3 32 2 -21 15 -13 -12 68 -17 14 -9 4 -18 6 36 -12 6 2 -27 33 7 65 15 -22 83 60 25 -44 -24 -1
7475 -1 -31 3 -30 5 -41 12 -15 -9 15 -4 -1 -45 -51 -32 17 -12 60 10 29 25 16 -2 7 11 -12 11 12 3 37 0 -7 9 4 -4 46 9 -38
7512 -38 -6 56 -19 -20 1 -19 -12 31 0 -18 -15 -59 -44 2 -2 21 -19 -68 10 -17 -13 -82 -30 -13 33 4 1 -89 -11 38 40 27 -11 48
7546 48 -15 7 21 -11 56 31 1 9 13 49 26 -19 11 32 -24 -7 10 4 -2 4 -1 28 -23 -24 63 -17 10 34 -10 3 12 -31 2 8 30
7581 30 29 -4 -9 -57 32 -6 52 63 13 37 27 62 8 -38 2 -33 16 12 -11 0 12 -4 -39 15 -1 -57 -35 9 6 -57 -4 43
7613 43 -86 -27 12 10 13 4 4 36 13 21 12 3 -17 -56 28 50 -50 51 69 8 -25 56 54 -4 -25 13 9 11 48 22 53 -9 -42 -42
7647 -42 15 -6 -23 17 32 17 12 -6 37 -24 -45 -46 28 -30 34 18 -19 -26 12 -14 -38 2 -8 29 29 -53 -26 -14 47 -8 28 55
7679 55 -51 13 -25 -1 -76 90 -13 -5 5 -30 -28 17 12 -24 9 -18 -44 -19 -25 -69 -38 -8 -18 -41 -14 -20 8 -11 -3 -5 -39 -16
7711 -16 47 32 25 23 -19 17 2 0 55 -36 -30 -28 -5 28 -11 -47 -42 44 -31 18 -54 -74 20 -39 -18 -63 -7 -14 -31 -54 9 -28 -51 -12
7745 -12 -59 56 30 -16 -35 12 3 2 -8 67 -22 -24 12 -15 6 27 22 59 -8 -2 10 16 6 -28 -13 31 21 -9 -17 -51 -20 -68 13
7778 13 28 35 26 33 -17 -42 -25 9 35 10 19 17 32 47 13 16 17 29 19 -26 -48 46 41 9 68 7 64 41 -12 47 -20 -6 -20 -19 38
7813 38 -17 -48 -28 -46 -28 -8 21 10 56 -42 -29 -48 7 5 21 13 -49 -37 20 -23 -25 -18 -8 29 35 -36 -11 52 -4 16 6 20 6
7846 6 33 -25 30 40 25 -2 1 -4 -4 5 -17 34 -13 -25 34 -11 1 33 10 -62 -11 -26 -47 3 -5 -31 -2 33 -38 14 39 30 34 7
7880 7 24 16 42 -27 7 80 -6 -1 36 -18 5 31 -25 -37 22 52 38 -45 -7 -23 14 -7 -26 45 -22 0 -28 -61 -4 29 -59 1
7912 1 0 -3 -2 -34 27 59 -18 2 23 67 -33 2 2 8 9 1 -17 13 72 -13 40 -41 12 -2 45 -19 51 -68 -29 4 -19 2 7 42
7946 42 -51 -35 -9 -14 -5 11 -45 -35 -30 2 -4 -24 -26 -29 -20 38 -33 6 -71 80 44 17 15 8 -4 15 29 23 2 -23 -3 4 20 -27 -40
7981 -40 -25 13 -36 -21 -59 51 18 12 16 -33 -11 -16 23 21 15 30 12 3 45 -16 61 3 91 -22 -24 48 56 24 -14 13 22 20 48 42 -3
8016 -3 -1 11 49 -5 -2 20 34 -43 -35 36 -28 -64 -17 4 -10 9 6 17 -38 17 1 -19 -17 44 -28 -34 43 -26 37 -5 35 27 63 -48
8050 -48 -8 41 72 -12 6 10 5 5 33 41 22 57 -8 -9 -47 23 -11 32 11 -25 -22 -16 -7 -4 19 4 5 -36 -8 4 -31 -18 -47 23 -3
8085 -3 -9 -30 -24 -26 -15 -5 50 33 56 10 73 55 87 16 37 14 -9 26 42 -38 -38 51 -25 7 40 -9 30 4 11 -33 -53 -41 -12
8118 -12 -28 20 -18 11 -43 -14 -4 -76 26 14 31 13 -33 5 58 12 54 -24 59 50 50 65 12 -39 -12 -53 -30 39 -19 -15 32
8149 32 -28 -21 -48 -32 46 39 8 47 -8 -28 -22 21 42 -30 -10 -8 -14 -14 6 26 21 17 -35 27 40 -3 -6 -20 6 3 41 34 -26 46 8 24
8185 24 36 -12 18 20 0 -31
8191c1
$$ Imaginary data points
##PAGE= N=2
##DATA TABLE= (X++(I..I)), XYDATA
0 0 0 0 0 0 0 0 0 0 0 0 -8 8 -8 9 -16 16 -24 25 -32 40 -48 57 -65 77 -90 106 -123 140 -163 189 -214 246
32 246 -279 314 -356 401 -450 503 -564 627 -699 775 -862 952 -1053 1167 -1287 1417 -1562
49 -1562 1723 -1894 2089 -2303 2542 -2807 3110 -3454 3848 -4307 4849 -5499 6300 -7311 8634
64 8634 -10450 13108 -17394 25451 -45984 216234 341278 -32773 15572 252932 380626
75 380626 114035 -160414 -160481 67805 102789 -115122 -332451 -274105 -101433 -65613 -213106
86 -213106 -299021 -219031 -80606 -52944 -91227 -87687 -14385 39787 63276 97104 149289 148588
98 148588 103510 106461 196351 246148 153105 13937 21182 157302 195088 21217 -162535 -118977
110 -118977 70032 96719 -118840 -297052 -192806 36847 53793 -171311 -310052 -153395
120 -153395 86246 84125 -128728 -220703 -42742 166661 137664 -49793 -102571 59297 209016
131 209016 156633 7258 -18451 98380 177840 117918 18613 7907 63588 80118 35091
142 35091 -5633 -11843 -20388 -46781 -53396 -32802 -42274 -105757 -147241 -96697 -18746 -36894 -138731
155 -138731 -169322 -56604 61696 26630 -99262 -107639 50042 177174 111956 -31228 -22978
166 -22978 145756 246129 141995 -12616 779 149967 204687 71642 -76989 -59598 59559
177 59559 77252 -52926 -167074 -136374 -40715 -35027 -126389 -183833 -136113 -59188 -47511 -83565
189 -83565 -86950 -38672 9182 25545 35061 58385 77000 78591 88737 122580 141870 109374 60681
202 60681 63660 109757 111892 32778 -45502 -33817 27775 19943 -79529 -153816 -113546 -30346 -35763
215 -35763 -128948 -175392 -102402 -4629 -6604 -83740 -102067 -13928 76495 66938 379 -5445 71334
228 71334 132564 106308 44234 37246 86146 111422 73348 20423 10604 31643 31944 -1147 -32918
241 -32918 -39750 -36876 -44332 -56131 -59412 -59927 -67235 -70649 -55493 -34012 -32612 -48020 -44831 -9044
255 -9044 24295 18856 -6010 215 44396 75104 56138 21226 26344 67770 86405 53465 12105
268 12105 14865 48118 53561 13169 -26502 -22846 3381 1511 -35468 -64254 -54795 -30949 -32015
281 -32015 -56496 -68759 -51772 -28272 -24379 -33999 -32088 -12150 8001 14189 13834 20689 34706
294 34706 45277 47703 47736 49599 50686 48158 43670 39202 32580 21834 10091 2205 -3668 -13551 -27485
309 -27485 -38374 -41544 -41737 -46188 -53420 -55183 -48331 -39227 -34845 -32663 -25533 -11851 1750 9772
323 9772 14801 22749 33979 42963 45774 44930 45559 47807 47028 40424 31162 24237 19716 12722 815
338 815 -11624 -18657 -21168 -26075 -35953 -44324 -43741 -37115 -34656 -39228 -41033 -31227 -15598 -8130 -10757
353 -10757 -9908 4363 22590 28098 20912 18675 31139 45113 43071 28254 20668 28540 35990 26492
367 26492 6729 -2800 2736 6360 -5357 -23234 -29065 -21950 -17906 -26129 -36424 -35376 -25461 -19566
381 -19566 -21637 -22962 -16874 -7604 -1957 985 5499 10932 14122 16550 21976 27903 27210 20735 18786
396 18786 25663 30406 21421 5955 2010 11600 15479 319 -19875 -21538 -6721 -1812 -19219 -38450
410 -38450 -33960 -12984 -5752 -21991 -36397 -25208 -503 7310 -6938 -16423 -2025 20935 25651
423 25651 11948 4849 17158 32747 31519 17686 11026 17543 23374 17332 5729 139 618 -930
437 -930 -6671 -11730 -14201 -17593 -21903 -21795 -17137 -15716 -21521 -25219 -16992 -3506 -550 -9532 -12671
452 -12671 1522 19346 19510 5051 762 17161 33945 27825 7584 1726 17443 30095 18219
465 18219 -5006 -10612 4356 13339 -719 -21617 -23775 -8794 -1527 -13313 -27447 -24621 -10093
478 -10093 -3536 -10519 -16908 -11205 159 4949 2438 1550 5886 10657 12394 13190 14563 14013 10810
493 10810 9816 13396 15332 9008 -365 -1971 5041 7431 -2729 -15030 -14068 -2772 547 -11324
507 -11324 -22895 -17632 -2549 1314 -10793 -19829 -10572 5961 8779 -3248 -9886 796 15694
520 15694 15854 3811 -1244 8221 18874 15936 4579 203 6698 12327 7918 -1207 -4436 -1290
534 -1290 694 -2670 -7338 -8962 -8343 -8147 -8185 -7587 -7484 -8865 -9222 -5575 -562 114 -3517 -4271 1957
551 1957 8949 8367 2184 751 7787 14306 11148 2615 658 7471 12205 6410 -3056 -4488 2123
566 2123 5120 -1580 -10063 -9837 -2960 -572 -6461 -12498 -10117 -3077 -697 -4775 -8022 -4769 1462
581 1462 3692 1138 -519 2153 6230 7374 5658 4430 5176 6406 6349 5060 3796 2726 1725 992
597 992 530 -267 -2271 -4140 -4381 -3461 -3490 -5151 -6646 -5745 -3506 -2641 -3751 -4381 -2549 291 1313 385
615 385 -7 2152 4534 4876 3404 2741 4214 5771 5094 2725 1489 2428 3339 1913 -1095 -2427 -1241
632 -1241 -252 -1913 -4794 -5361 -3161 -1599 -3111 -5522 -4983 -1553 509 -1132 -3288 -1775 2287 4126
648 4126 1807 -596 1201 5197 6050 2645 -159 1671 5258 4844 462 -2308 -154 2878 1586 -2867
664 -2867 -4678 -2096 451 -1080 -4454 -4930 -2132 -122 -1379 -3181 -2489 -231 766 206 183 1177 1657
681 1657 1261 1668 3114 3422 1337 -303 1476 4383 3443 -1261 -3554 177 4499 2197 -4639 -6512
697 -6512 -510 4828 1192 -6818 -7614 526 6166 1109 -7210 -6527 2722 7604 1394 -6430 -4290 4878
713 4878 8036 1105 -5401 -2319 5395 6634 153 -4488 -1257 4158 3758 -1104 -3406 -867 1583
728 1583 541 -1495 -1587 -786 -1298 -1845 -307 1144 -605 -3735 -2807 2353 4411 -504 -5825 -2747 5625
745 5625 7273 -965 -7527 -2117 8362 8604 -2521 -9251 -1555 9666 7971 -4786 -10471 -1133
759 -1133 9510 5921 -6807 -10502 -475 8366 3621 -7244 -8543 653 6952 2191 -5553 -5096
773 -5096 1942 5328 1593 -2538 -1279 2236 2806 1100 590 1295 523 -910 382 3065 2100 -2933
789 -2933 -4875 138 5236 1828 -6503 -7622 1201 7625 1597 -8923 -8222 3826 10307 1603 -9809
804 -9809 -6934 6716 11914 1121 -9891 -5169 8312 11214 -362 -9611 -3952 7616 8388 -2181
818 -2181 -8900 -3151 5422 4743 -3282 -6834 -2152 3019 1848 -2471 -3199 -652 846 194 133 1018 465
835 465 -1381 -669 3023 4354 195 -4119 -1302 5455 6021 -1663 -7074 -1732 7011 6045 -4279 -9375
851 -9375 -1385 8065 5185 -6371 -9946 -202 8775 4230 -7100 -8803 1525 8888 3257 -6604
865 -6604 -6521 2891 8061 2313 -5267 -4096 3191 6073 1189 -3629 -2157 2297 3176 156 -1771 -771
881 -771 489 117 -337 246 86 -1663 -2417 -165 2311 663 -3421 -3694 1062 4242 817 -4513 -3715
898 -3715 2670 5662 695 -4986 -2937 4230 6162 113 -5100 -1963 4861 5436 -1026 -5152 -1374
913 -1374 4437 3796 -2248 -5086 -1179 3355 2045 -2921 -4290 -783 2394 882 -2476 -2783 108 1853
929 1853 590 -1131 -706 1024 1544 707 223 799 1217 878 428 792 1072 511 -344 -300 571 491 -752
948 -752 -1472 -924 -59 -297 -1383 -1664 -748 41 -377 -1104 -927 150 660 83 -432 167 1170 1212 436 12
968 12 733 1644 1315 89 -531 429 1487 921 -832 -1638 -338 1217 611 -1840 -2791 -742 1580 850
986 850 -2290 -3327 -471 2704 1607 -2319 -3300 378 4020 2422 -2300 -3323 1109 4955 2645 -2696
1002 -2696 -3443 1548 5114 2118 -3384 -3698 1462 4454 1100 -3866 -3648 1070 3375 326 -3494 -2980
1018 -2980 600 2120 146 -2107 -1852 -70 914 865 272 -522 -1227 -299 2086 2915 225 -2956 -1673
1035 -1673 3288 5146 156 -5276 -3034 4556 6611 -785 -7779 -4091 5525 7224 -2117 -9582 -4234
1050 -4234 6625 7351 -3288 -10102 -3293 7577 7115 -3713 -9156 -1668 7946 6355 -3474 -7214
1064 -7214 -257 7110 4830 -2786 -4896 230 4627 2886 -1496 -2693 -491 1151 1105 403 -451 -2208
1080 -2208 -2744 113 3417 1683 -4152 -5939 359 6952 3597 -6122 -8144 1769 10416 4657 -8054
1095 -8054 -9316 3616 12747 4549 -9877 -9682 5068 13349 3159 -11179 -9237 5698 12286 1276
1109 1276 -11254 -7944 5647 9954 -231 -9756 -5757 4792 7026 -688 -6606 -3304 3111 4097
1123 4097 105 -2434 -1303 382 1074 1908 2035 -473 -3303 -1509 4244 5705 -991 -7376 -3410 6763
1139 6763 8325 -2577 -11169 -4248 9388 9885 -4642 -13777 -3753 11618 10195 -6415 -14532 -2285
1153 -2285 12977 9485 -7405 -13553 -414 12862 7868 -7372 -11149 1089 11148 5679 -6298
1166 -6298 -7912 1482 7755 3255 -4204 -4611 623 3422 1359 -1187 -1562 -1326 -1203 594 2704 1021
1182 1021 -3888 -4939 1255 6830 2762 -6601 -7475 2954 10563 3392 -9348 -8922 5095 13013 2779
1197 2779 -11524 -9091 6933 13679 1195 -12847 -8403 7969 12716 -609 -12803 -6792 8009
1210 8009 10555 -2012 -11054 -4726 6971 7583 -2204 -7862 -2594 4870 4614 -1175 -3826 -1079 1874
1225 1874 1818 746 306 -691 -1840 -516 3137 3706 -1379 -5618 -1956 5699 5997 -2999 -8878 -2317
1241 -2317 8202 7208 -4865 -10983 -1638 10210 7344 -6469 -11413 -181 11246 6575 -7406
1254 -7406 -10493 1355 11109 5108 -7360 -8641 2435 9595 3237 -6523 -6261 2534 6838 1660
1268 1660 -4704 -3842 1615 3616 688 -2140 -1676 -91 344 464 971 71 -2195 -2407 1199 4066 1169
1285 1169 -4373 -4219 2547 6552 1346 -6418 -5121 4121 8162 708 -7916 -5179 5332 8526 -359
1300 -359 -8620 -4541 6052 7803 -1526 -8477 -3390 5943 6245 -2326 -7290 -2105 5232 4464 -2380
1315 -2380 -5308 -885 3866 2755 -1644 -2843 -192 2061 1293 -383 -536 -211 -197 61 1241 1331 -825
1332 -825 -2503 -543 2853 2521 -1910 -4244 -593 4304 3100 -2969 -5340 -107 5299 3123 -3813
1347 -3813 -5530 637 5836 2688 -4239 -4915 1367 5673 1893 -4114 -3908 1851 4764 1071 -3578
1362 -3578 -2790 1770 3442 342 -2726 -1735 1294 1909 -79 -1473 -713 448 465 -79 -145 -93 -497 -588
1380 -588 389 1157 205 -1490 -1219 1123 2199 148 -2273 -1496 1772 2801 -165 -2887 -1433 2188
1396 2188 2816 -525 -3183 -1220 2382 2493 -990 -3013 -900 2237 1952 -1179 -2547 -455 1954 1305
1412 1305 -1005 -1803 -3 1501 806 -771 -963 162 894 342 -379 -312 132 281 37 89 210 -59 -349
1431 -349 -74 382 400 -344 -705 -62 614 371 -600 -866 47 845 306 -711 -866 267 918 321 -720
1450 -720 -606 453 882 151 -628 -461 447 744 58 -520 -312 359 487 -48 -521 -171 293 241 -134 -377
1470 -377 -136 129 77 -149 -224 -49 139 94 -125 -199 45 211 182 -140 -262 140 424 197 -325 -348 223 507
1492 507 210 -362 -460 194 565 220 -530 -533 224 617 173 -556 -532 151 468 144 -440 -426 192 410 73 -273
1514 -273 -265 149 289 173 -98 -77 -22 100 198 131 -29 -327 -147 288 382 -55 -687 -356 487 708 -161 -940
1536 -940 -375 712 869 -324 -1127 -410 1006 980 -476 -1262 -283 1162 957 -553 -1331 -111 1189 881
1554 881 -600 -1142 -36 1025 717 -586 -940 -53 772 452 -392 -594 -136 376 263 -98 -262 -227 -23
1573 -23 168 294 87 -372 -460 200 667 392 -590 -764 330 1077 397 -891 -952 408 1304 334 -1116 -1028
1593 -1028 582 1397 210 -1301 -1004 663 1299 81 -1315 -884 707 1174 -18 -1134 -654 689
1609 689 973 -69 -832 -457 421 677 10 -483 -331 157 351 81 -143 -241 -201 90 402 250 -282 -508
1629 -508 -99 596 496 -355 -799 -165 792 703 -409 -1000 -223 924 781 -516 -1070 -154 979 711 -544
1648 -544 -980 -66 942 624 -569 -887 -61 841 503 -518 -785 23 688 381 -373 -577 17 478 272
1667 272 -234 -406 -93 272 285 -22 -246 -174 129 369 204 -175 -325 -84 312 352 -70 -442 -197 334 476
1688 476 -84 -480 -280 261 438 -28 -495 -328 235 422 13 -440 -294 256 497 44 -347 -272 253 377
1708 377 70 -368 -201 175 364 72 -244 -209 129 327 48 -343 -254 159 361 68 -339 -239 187 302 13
1729 13 -326 -275 206 271 -9 -317 -121 179 190 -41 -266 -21 199 150 -139 -244 1 141 72 -177 -22 123
1751 123 102 -107 -89 26 74 32 -150 10 56 46 -113 -76 120 120 -79 -221 9 250 127 -302 -315 117 485
1774 485 221 -458 -469 287 682 90 -682 -387 488 716 -55 -823 -335 674 672 -276 -844 -177 698 605 -397
1795 -397 -774 -67 654 467 -369 -607 119 600 227 -358 -374 83 342 73 -215 -124 123 72 -74 5 111
1816 111 -5 -183 -94 329 293 -208 -578 -27 619 442 -531 -783 94 978 415 -810 -899 291 1148 335
1836 335 -1025 -991 463 1254 166 -1162 -848 597 1193 98 -1123 -662 672 945 -45 -898 -478 540
1854 540 721 -134 -609 -198 331 265 -74 -203 -32 89 10 65 120 -24 -350 -219 294 542 -59 -682 -313
1875 -313 615 872 -217 -1005 -428 936 1015 -463 -1303 -322 1143 984 -621 -1329 -184 1324 908 -770
1893 -770 -1350 -37 1272 697 -758 -1157 92 1086 506 -715 -841 138 733 287 -475 -467 116 386 171
1912 171 -95 -185 -101 -56 142 261 119 -276 -384 131 687 311 -631 -727 266 1053 348 -863 -933 437 1186
1933 1186 287 -1125 -935 668 1337 221 -1277 -846 794 1285 -16 -1200 -660 797 1052 -164 -1079
1950 -1079 -494 759 766 -142 -830 -301 475 537 -62 -432 -134 182 201 15 -15 -151 -155 -26 244 342 -146 -526
1972 -526 -138 549 578 -251 -815 -206 787 739 -309 -1075 -197 945 763 -487 -1103 -9 1050 666 -630
1991 -630 -1008 14 1052 517 -684 -828 202 895 359 -561 -666 203 632 203 -466 -417 187 343 108
2010 108 -213 -189 53 149 98 93 38 -153 -185 74 320 90 -327 -322 135 534 144 -533 -469 269 682 92 -643
2033 -643 -472 425 726 71 -630 -433 431 697 -63 -647 -358 405 514 -162 -577 -234 475 363 -203 -368
2053 -368 -66 330 209 -123 -269 -13 223 72 -88 -106 52 74 36 -3 40 8 -112 -72 83 108 -38 -162 -74
2076 -74 158 231 -65 -238 -39 253 128 -146 -242 31 280 168 -181 -193 14 226 44 -161 -149 91 111 2
2098 2 -175 -102 53 130 6 -151 -75 108 71 -83 -79 37 160 31 -104 -126 19 94 14 -81 -80 -2 159 64 -91
2123 -91 -148 -18 136 112 -94 -234 0 152 112 -126 -203 22 198 213 -79 -243 -77 241 159 -92 -213 -48
2145 -48 215 102 -133 -177 -43 178 183 -26 -161 -85 57 137 12 -95 -154 -15 99 119 -51 -161 -130 199 261
2168 261 -34 -254 -206 198 409 6 -403 -279 289 495 -3 -548 -334 308 641 47 -601 -402 355 616
2188 616 -30 -642 -398 341 550 13 -572 -336 307 471 -5 -423 -213 292 326 -9 -317 -181 101 229
2208 229 83 -51 -80 -109 32 187 97 -172 -287 -34 401 327 -299 -522 -24 568 437 -379 -694 -46 778
2229 778 550 -558 -840 -22 814 455 -580 -883 1 891 447 -584 -801 122 806 406 -566 -672 120
2248 120 715 266 -426 -498 64 388 157 -237 -312 -26 162 225 60 -44 -191 -100 185 407 85 -417 -390 295
2270 295 679 65 -710 -537 435 867 -21 -930 -592 557 953 13 -1019 -580 701 983 -111 -1061 -525
2289 -525 722 957 -198 -979 -374 696 738 -204 -748 -248 540 529 -199 -465 -195 317 288 -44 -244 -152
2309 -152 21 126 176 80 -161 -312 -50 425 348 -330 -696 -82 690 500 -402 -868 -44 914 626 -579 -1047
2330 -1047 32 1063 581 -696 -1010 121 1071 480 -795 -909 275 1017 357 -814 -737 225 789 267
2348 267 -566 -509 238 554 112 -361 -335 104 297 126 -44 -126 -171 -47 100 287 -38 -382 -320 267 536 106
2370 106 -660 -514 428 808 14 -861 -592 581 907 -67 -956 -496 722 942 -146 -1030 -444 686 849
2389 849 -215 -907 -294 653 674 -226 -690 -242 546 456 -213 -406 -68 320 251 -61 -192 -86 70 46 64
2410 64 -24 -111 -250 6 289 241 -155 -425 -41 493 445 -369 -579 -64 740 436 -468 -753 112 797 409 -556
2432 -556 -735 176 809 279 -663 -656 198 734 245 -514 -524 203 582 181 -440 -381 166 403 67 -309 -209
2453 -209 64 163 84 -62 -64 -49 9 65 235 79 -217 -182 162 367 -11 -387 -218 268 474 -38 -492 -308 337
2476 337 520 -101 -549 -252 409 568 -108 -617 -241 474 438 -140 -528 -132 421 324 -111 -414 -53 306 263
2497 263 -175 -265 -26 147 141 -53 -72 -39 19 36 68 76 18 -60 -2 219 147 -55 -207 16 253 192 -92 -219 52
2522 52 316 115 -182 -266 -1 306 169 -224 -242 116 340 123 -227 -264 135 273 62 -169 -163 49 188 35
2544 35 -141 -102 43 85 -36 -58 -16 57 59 -27 -47 0 -25 -100 -21 86 -8 -85 -107 22 130 -1 -117 -86 6 118
2570 118 53 -99 -55 90 111 16 -54 -33 50 100 -15 -28 -10 38 2 -12 -61 -16 74 -15 13 -7 41 39 7 28 11 7 -28
2599 -28 -28 2 104 45 -4 -34 54 42 -2 -30 -13 4 31 3 -36 0 -41 11 -1 68 -49 -94 -27 86 28 -18 -95 -17 88
2628 88 90 -28 -135 -35 113 120 -69 -142 -51 158 122 -54 -153 32 150 121 -24 -91 5 37 62 -49 -78 -63 80
2653 80 89 11 -32 -8 1 26 56 -1 -107 -80 38 105 5 -114 -116 39 139 97 -143 -155 29 215 46 -174 -127 85
2679 85 217 32 -247 -129 110 206 21 -197 -165 71 181 50 -152 -186 83 234 17 -155 -74 71 138 34
2701 34 -139 -111 30 101 74 1 -105 -21 79 94 80 -62 -162 8 201 89 -54 -169 -8 145 126 -59 -266
2724 -266 -81 193 171 -98 -269 20 155 172 -124 -200 24 205 169 -104 -220 -95 231 183 -101 -119 -59 162
2746 162 158 -114 -133 25 158 103 -21 -67 -62 45 50 78 -64 -110 -8 26 85 54 -172 -80 90 128 10 -165 -159 133
2772 133 142 14 -157 -119 85 214 49 -150 -118 113 175 -58 -154 -77 101 158 -43 -130 -80 131 109 20 -141 -48
2796 -48 50 139 50 -95 -100 -2 72 76 -52 -59 18 69 67 -15 -72 -1 64 63 11 -102 -88 -31 72 40 -79 -122 55 124 19
2825 19 -142 -100 10 150 59 -76 -34 1 77 93 -80 -108 64 100 3 -131 -91 -41 48 32 -35 -19 14 81 3 -11 -37
2852 -37 -16 82 37 -8 -37 19 93 6 -22 -72 -53 73 46 -39 -80 -19 72 3 -85 -99 14 45 35 21 -111 -11 69 12
2880 12 -57 -25 7 28 43 -12 8 35 0 52 67 6 22 7 14 -2 -8 -20 -43 54 10 58 -45 -46 93 25 20 -123 19 88
2910 88 53 -124 -141 8 122 79 -85 -109 -64 132 35 -38 -119 68 171 70 -120 -94 35 162 93 -100 -60 32
2934 32 91 14 -119 -14 25 66 55 -34 -30 -37 15 9 -20 14 19 -34 18 80 43 -80 -75 82 78 6 -103 -85 76 178 -7
2963 -7 -134 -40 185 176 1 -213 -73 161 136 -20 -241 -98 166 148 -97 -185 38 171 94 -97 -193 -17 175
2986 175 66 -92 -129 -3 81 48 -13 -72 -58 12 21 60 17 -83 -55 -55 35 67 -141 -104 18 143 -23 -152 -270 60
3012 60 271 33 -185 -209 142 270 60 -218 -183 115 249 101 -223 -215 123 195 -11 -249 -144 91 163 45
3034 45 -205 -85 112 145 -26 -119 -61 56 63 22 -59 -49 -17 -10 53 17 -21 -122 -57 128 141 -41 -136 -121 184 204 -101
3061 -101 -246 -30 199 219 -66 -283 -16 211 232 -114 -255 -5 233 159 -171 -231 13 282 149 -118 -181 -25
3083 -25 174 100 -76 -102 -18 115 31 -135 -71 -21 33 0 5 -13 -45 -52 17 90 -10 -40 -99 37 137 54 -121 -119 51
3110 51 230 88 -161 -207 107 186 28 -187 -212 145 248 32 -203 -119 139 229 -24 -192 -67 112 154 -9
3132 -9 -138 -91 71 95 -26 -103 -46 30 78 7 -5 14 -51 30 28 27 -24 -6 -26 7 65 -78 -110 -30 85 137 -35 -115 10
3161 10 160 152 -108 -186 -84 157 26 -97 -162 28 184 22 -114 -107 62 157 91 -125 -139 64 90 -23 -82 -61
3185 -61 -36 56 50 9 -5 52 -28 -40 -20 40 -34 -5 -40 -44 64 -59 -70 22 -8 91 -72 -69 33 57 23 -79 -79 -16 87
3214 87 40 -104 -27 64 154 -71 -44 -70 18 58 3 -43 -64 24 52 10 -29 -8 27 -21 12 49 46 67 -63 -19 31 8 -59
3243 -59 -5 -8 33 65 4 -51 -11 54 13 -11 -44 9 44 20 -59 46 23 73 -11 -2 -33 52 45 -29 -61 -6 21 -11 -64 -32 -25 -14
3275 -14 48 -47 2 55 -17 -49 -15 -30 -3 -26 -7 32 67 3 -28 16 16 109 -22 -51 -30 33 -42 -4 -18 -31 -22 20 14 -2 39
3306 39 -24 15 42 -48 -61 -43 -22 28 -19 -33 -38 -25 37 -19 -21 -54 -24 34 1 -37 -35 -6 -23 51 -33 -45 -37 94 36 4 -47 31
3338 31 53 7 -5 -45 14 5 18 3 -39 -54 -12 19 41 -69 -39 -15 65 49 0 -121 -20 50 57 -55 -17 12 64 53 -32
3367 -32 -95 -26 60 20 2 -56 -28 64 91 -6 -79 -13 58 61 -30 -94 -36 30 23 3 -41 -14 48 9 -40 -79 -38 -41 26 27 -46 -49 -65
3400 -65 -17 53 17 -14 -73 15 79 16 -52 -72 8 81 62 -80 -137 3 119 32 -94 -42 34 86 40 -91 -32 -28 95 26
3428 26 -44 -69 82 80 54 -43 -46 -2 40 -14 -22 -25 -43 55 26 10 -72 -5 2 83 -12 -34 -76 -45 47 36 24 -138 -53 85 104
3459 104 -43 -99 -7 48 98 7 -146 -79 67 106 -18 -91 -8 101 79 36 -65 -89 7 47 38 -12 -44 33 42 16 -27 7
3487 7 -6 50 -8 52 58 -23 -23 -52 -1 -9 -30 8 71 18 -25 -75 -41 50 48 -38 -51 21 0 54 -69 -102 -24 66 69 -49 -45 22 122
3520 122 25 -31 -20 35 59 45 -66 -6 3 25 44 -3 -4 7 30 13 44 -37 -26 -21 56 1 28 -42 -56 -12 80 -19 -67 57
3550 57 -17 9 4 -86 -42 28 24 10 -92 -5 3 71 17 -58 -33 28 92 28 5 25 23 132 12 -26 -61 -12 33 24 7 -10 15
3581 15 -11 -16 6 -34 25 17 3 27 -26 -50 -60 -8 -54 -19 -70 13 3 35 0 -81 -2 43 33 -46 -72 0 31 8 -7 -76 10
3612 10 7 26 -29 -19 -71 118 15 18 -54 -9 -50 -12 -16 -75 -15 3 11 -22 12 34 -23 6 4 -3 -12 1 -1 -19 -15 -29 -28 -34 12 9 -43
3647 -43 -24 -26 4 64 -3 -124 -53 -18 -15 -14 -35 -17 -18 29 7 -16 -26 29 0 27 -22 45 22 4 19 20 19 -11 37 13 -20 7 2
3680 2 42 43 -9 21 0 10 -9 33 -20 -37 26 -14 -20 -3 -3 -20 42 28 8 15 6 48 5 27 -1 -24 22 12 10 15 -52 -38 4 -6
3714 -6 28 41 -34 13 -39 -3 6 41 50 1 -5 -28 14 -1 -8 -43 -36 -33 -43 28 38 14 -30 -34 7 24 -56 3 -63 2 32 -7 -4 -12 -8 -23
3750 -23 4 33 -64 -29 21 12 -9 -70 9 34 45 -16 3 -2 15 49 6 -45 -10 23 -40 57 -45 18 56 -4 -3 -11 -28 -12 32 2
3782 2 -33 -39 24 37 -1 -53 0 26 -16 19 -47 -6 -49 -23 6 -62 9 -22 41 9 23 -46 -2 -12 50 -7 -9 -62 42 63 56 -68
3814 -68 -55 -26 19 19 -9 -37 -50 28 5 -75 -97 -34 45 -14 -60 -37 17 48 34 -76 -15 -21 -36 75 -25 0 -4 -42 -1 -7 -52
3845 -52 -53 15 19 -5 32 -32 -44 56 37 -64 -22 -31 49 42 -14 -71 -60 40 82 46 -38 -36 -11 15 30 -25 -45 47 39 -31 -43 -25
3877 -25 37 48 11 -77 -70 -27 -20 12 -54 -23 -20 34 -4 -10 23 -17 0 63 16 0 -42 -6 54 7 -29 1 29 43 19 -45 -50 -12 59
3910 59 25 -8 -52 -11 69 31 -70 -79 12 64 65 -71 -15 17 4 18 15 -7 -1 -33 38 -20 -30 -14 59 20 15 19 4 -18 47 -6
3942 -6 4 -17 -47 31 31 3 -22 19 19 -23 -21 -52 -63 4 -13 -37 -29 -4 67 6 -50 -38 -1 23 0 -37 -31 1 -18 51 13 -37 -7
3975 -7 25 26 57 -9 -17 -1 31 4 -29 1 -22 -19 -11 -6 -9 -8 51 36 -15 -101 -39 51 -18 18 -35 19 0 -16 -45 -3 21 -3 11 -27
4009 -27 2 45 61 4 -66 2 5 -11 -25 -36 85 26 -55 -19 -23 -19 4 27 -32 -15 13 -4 17 -29 -44 -20 -46 9 -4 -35 -9
4040 -9 -68 -11 25 -47 -84 -50 53 57 27 -40 -10 11 102 6 -33 -13 55 56 27 -54 -28 79 38 25 6 -63 6 78 6 -16 -7
4071 -7 -24 1 24 26 12 50 72 6 -50 11 -49 18 59 17 -31 -86 -23 57 5 4 -52 -27 21 37 -13 -56 -49 16 38 -27 -39 66
4103 66 114 -34 -93 -74 63 62 -22 -77 -95 42 91 62 -53 -61 -34 91 20 5 -97 11 63 -22 -34 -35 -58 7 16 14 -9
4132 -9 -29 13 5 69 -19 -24 -8 1 61 -6 -28 -72 -6 78 -32 -108 -41 -32 105 -2 -133 -5 57 52 -74 -134 14 72 112 -65
4162 -65 -156 -19 100 64 -84 -66 -32 129 53 -49 -35 -51 55 -27 -64 32 -55 -10 -36 -14 2 -35 -23 18 45 24 -61
4189 -61 -40 -32 38 17 -7 -89 51 91 63 -48 -98 -3 136 15 -101 -72 35 103 20 -102 -49 20 92 20 -113 -42 33
4216 33 99 1 -115 -50 43 56 -4 -57 -60 14 -8 35 4 -19 -73 -73 0 46 -2 -71 -1 -37 52 17 -66 -51 18 80 -57 -68
4246 -68 -81 21 65 -87 -113 -22 132 91 -21 -121 -67 103 77 -37 -87 7 81 75 -89 -116 -22 38 9 -49 8 -43 52
4273 52 0 15 8 -6 38 -13 80 -13 29 -70 -2 10 72 -31 -48 -46 111 19 -77 -71 -23 70 57 -11 -96 11 94 -25 -81 -70
4303 -70 1 104 -12 -117 -55 13 132 -17 -88 -52 26 45 -4 -33 34 -24 93 14 -14 -19 32 25 33 -7 -2 -21 -11 -31 3
4332 3 28 -94 -9 49 32 0 -44 -44 57 68 -33 -22 -60 24 97 -16 -51 15 51 61 36 -51 7 36 70 -20 -91 21 3
4361 3 48 -5 -42 43 39 -10 -16 26 -40 9 -35 1 -1 -39 -6 -19 50 -31 4 8 -6 72 26 -5 -51 15 34 69 -17 -58 4 50 -29
4394 -29 -2 -49 -44 25 44 -15 -60 -11 -4 -14 -14 20 -14 28 49 -28 -4 -15 -76 -11 38 11 -30 -4 -5 -22 30 -37 -53 -14 63 32
4426 32 -18 -36 -17 42 14 -45 19 11 6 -41 -54 -5 -45 -47 17 32 -48 -1 1 -6 -22 -16 -46 -14 38 98 20 -23 -12 -18 63 8 -38 9
4460 9 -15 63 39 -53 4 45 81 -8 -3 -49 23 34 1 -40 -58 37 24 6 -43 26 27 64 9 3 -44 -33 -4 10 -30 -74 -46 -52 53
4493 53 11 3 -14 14 33 28 -39 -12 53 102 8 -31 -26 -9 60 18 -69 -7 -17 66 -4 -53 -45 38 -16 5 -58 -36 -21 -57 -31 -32 -21
4526 -21 2 -39 19 -14 -23 -29 41 57 -19 -34 20 -11 21 78 14 14 -55 24 38 22 -107 -77 36 52 28 -7 -25 65 41 -69
4556 -69 -43 2 -15 5 -82 -69 -16 22 72 -67 -100 -37 12 31 -60 -14 -21 -28 11 11 -20 -10 -33 11 -19 39 -24 -6 2 38 17 41
4588 41 -64 49 94 29 -25 -49 22 133 63 -78 -85 54 92 -12 -84 -52 48 55 -21 -16 -9 36 58 48 -18 -58 72 40
4616 40 53 8 10 -54 15 -38 53 -10 -4 -25 2 -41 50 57 -17 -18 -4 25 -65 -7 81 22 11 -81 -61 50 34 6 -47 -20 57 45
4648 45 10 -91 -38 81 36 17 -121 4 69 17 18 -38 1 59 27 24 -30 -8 15 -32 17 -21 14 -32 -26 5 52 35 -14 -32
4678 -32 20 44 -78 -33 60 34 81 -108 -66 14 103 51 -72 -71 51 81 -25 -49 -50 31 40 -47 -104 -14 -11 4 -16 -26 -37 16
4708 16 -12 -53 15 15 4 2 -1 -6 32 34 5 -42 -11 47 -6 -24 8 37 -44 -5 -14 -22 -34 -25 -1 -37 32 25 67 -39 -20 6 32 -43
4742 -43 -7 -35 9 -4 -11 -8 28 49 13 42 -2 73 -17 20 46 27 -13 -4 -25 25 35 -11 -26 16 -4 19 -45 -26 -52 64 43
4773 43 -7 -25 -47 -6 7 -12 -57 -45 -11 21 -34 -8 24 -16 -3 17 -25 3 -41 53 9 22 -17 -23 13 42 63 -1 12 6 68
4804 68 47 -49 -59 -52 75 24 -14 -55 -21 72 23 -16 -97 -14 53 28 34 -95 -15 57 45 -3 -63 71 -1 39 -2 -36 -17 29
4834 29 38 54 -52 -62 26 -2 17 -11 -65 -66 1 75 12 -51 -107 29 64 19 -78 -77 50 138 -45 -67 -46 101 59 -3 -37
4863 -37 -47 108 95 8 -48 -111 43 68 5 -32 -87 1 38 22 -60 0 -20 -29 78 9 -21 -16 25 22 26 -51 -72 51 34 -11
4893 -11 -46 -100 9 69 47 -51 -117 33 34 12 -101 -76 -14 78 64 -17 -64 53 107 25 -18 -45 -3 94 10 -73 11 6 39
4922 39 6 -25 -17 -1 3 81 -19 6 -7 -87 58 14 -44 -82 10 33 45 -62 -89 -65 92 51 -41 -80 -55 94 93 4 -47
4951 -47 -36 36 53 18 -82 -64 73 25 -53 0 28 59 132 -13 -23 2 39 119 -6 -27 -8 22 29 21 0 -44 -56 -15 43
4980 43 -4 -41 -37 6 68 27 -68 -119 100 88 22 -29 -17 82 82 -6 -58 -34 80 46 28 -97 -49 64 98 -9 -15 -93 18
5009 18 31 109 29 -87 19 35 19 -36 -64 4 16 19 31 -6 -8 23 36 10 24 -55 24 -35 21 4 -17 24 33 10 -4 0 -26
5040 -26 49 70 -54 -36 0 50 4 -36 -14 -4 87 51 -47 -24 -19 76 42 3 -47 22 -13 25 -43 20 -18 38 23 -15 -24 -21 42
5071 42 80 25 28 -27 -15 46 16 -26 -9 0 -4 13 -36 -12 -7 48 -30 -1 -19 -4 -19 40 24 -6 31 16 -21 20 5 29 34 -16 -60
5104 -60 -20 20 9 30 -25 -15 -31 12 69 13 1 25 58 -60 -17 -10 29 24 2 -40 -27 -39 6 4 4 8 -66 -47 53 47 33 -14
5136 -14 18 24 -1 -6 -23 73 28 33 38 51 -16 31 -15 -69 -44 38 -6 -33 16 7 7 40 -20 -93 5 -30 6 1 -11 -8 28 24 18 0 -53
5171 -53 31 47 -16 64 -41 3 38 29 34 -17 -11 4 39 -12 -58 -14 26 -17 -57 -8 -40 32 19 43 -29 -57 16 14 36 -36 6 0
5203 0 -3 -41 -63 -29 -11 18 35 -31 -14 12 31 22 -50 -46 39 9 25 -29 45 2 20 4 19 -29 -9 56 63 38 -39 -70 49 85
5235 85 21 -45 -50 13 80 7 -33 -53 4 58 51 -54 -9 1 87 -19 -32 -30 71 73 -23 -99 -55 -1 19 -13 -18 -82 -9 -25 -14
5266 -14 -39 -41 -54 -17 37 55 6 -32 -14 8 112 -6 -70 87 66 64 -46 -104 -14 74 102 -80 -96 15 88 47 -48 -44 1
5295 1 63 61 -86 -52 54 61 32 -37 -35 3 78 -25 25 -57 -37 -22 22 24 -23 -95 -42 60 37 22 38 25 64 29 42 -67
5325 -67 -62 1 39 8 -39 -19 66 106 39 -56 -49 27 108 -21 -63 -45 59 54 3 -41 -68 16 106 -57 -96 -36 10 61 -14 -49
5355 -49 -80 -4 12 56 -48 -26 -23 -4 9 -35 -13 -41 -55 51 53 -37 -28 26 97 80 -32 -40 -25 66 17 -38 -47 46 82 34 -20
5386 -20 -47 -47 95 47 -41 -83 9 32 37 -86 3 22 61 20 -23 -77 31 49 12 -36 -44 13 14 -14 17 -26 5 -15 33 0 20
5417 20 -11 -28 25 -1 -29 -89 -18 18 25 41 -17 -20 15 33 52 -41 -66 25 16 8 -28 -38 17 -17 4 -25 9 48 35 -48 -69 46
5449 46 13 25 13 -10 21 19 -40 -56 -32 31 31 57 14 -47 25 -7 -67 46 23 30 -86 -25 61 6 -49 -93 1 39 35 -18 -22 9
5481 9 40 17 7 -73 -43 56 -1 10 -34 17 30 41 -64 -68 -9 -14 26 -21 27 37 8 -10 -31 34 36 32 -43 30 16 -11 -53 -32
5513 -32 30 46 65 37 -24 4 79 30 -33 30 34 37 -45 -49 50 -16 -57 -86 -10 3 3 22 10 -34 7 -32 2 -2 35 39 -22 -59 21
5546 21 23 -14 19 10 18 19 61 27 34 -4 6 -30 -49 -3 -19 13 32 -40 -20 14 7 56 49 -63 -16 -9 -24 34 -20 -14 29 27 -25 -6 2
5581 2 25 -1 -36 29 -18 20 16 -7 -20 -8 25 29 47 -66 -3 9 15 -3 -41 -6 34 57 -11 -9 -17 63 -4 18 -9 -33 32 -44 11
5614 11 0 27 23 38 -11 -38 -8 -51 41 62 -3 -60 -21 79 50 5 12 -19 59 19 -20 -65 -99 21 16 14 -60 -70 -31 1 11
5645 11 -108 1 53 25 -2 10 7 23 48 43 20 -22 -5 -62 52 19 -73 4 23 56 -36 -8 -49 7 20 -22 -58 28 47 39
5675 39 23 -68 -44 17 31 56 4 -49 1 76 39 -24 -35 -36 35 -33 -29 -11 -37 22 17 -23 -1 -9 -4 -38 23 12 -2 26 12 1 -6
5708 -6 25 -11 -48 40 -33 -42 38 8 57 -62 -23 -5 34 86 10 -2 -24 74 39 -29 -49 -20 56 39 -42 -41 5 13 5 21 2 1 32
5741 32 16 -35 -17 53 54 16 -30 1 13 -5 48 -56 -10 -29 10 67 15 -46 1 34 -53 8 29 -24 32 -14 6 7 -23 -18 26
5772 26 41 90 -46 -28 38 42 -4 -3 -66 15 35 33 -34 -44 9 34 -42 -32 17 8 -14 -36 43 -11 23 11 -11 -30 22 54 -1 0
5804 0 22 3 -31 -57 -63 -7 51 -5 -10 0 40 -4 -44 1 47 57 15 -25 -5 3 19 -3 26 -32 90 8 -42 -22 6 27 -7 -17
5836 -17 44 12 -48 21 35 20 17 32 -8 -16 2 34 -3 -81 -14 -9 -7 51 2 3 -6 -7 -36 -62 40 -23 6 -9 -16 14 45 -18 5 52
5870 52 51 -5 19 7 5 55 -25 28 17 50 -24 -18 31 35 -39 0 -21 8 36 29 30 -45 17 55 16 -48 -75 42 32 22 -10 -59 -4
5903 -4 20 -13 -38 -26 -10 -31 7 5 13 42 -16 37 26 10 -20 33 34 -28 12 -47 -58 1 58 9 -61 -38 18 47 -1 -28 -5 35
5935 35 67 34 -11 38 51 39 20 -64 -20 1 75 33 -28 -34 2 16 -28 -36 -33 -12 16 40 -33 21 19 33 22 23 27 47 21 12 -22 -37
5969 -37 49 -1 -30 -14 11 -21 56 45 -30 7 -65 58 68 -24 -7 -54 25 83 -9 -21 -47 32 86 -14 -75 -57 32 117 -3
5998 -3 -15 -35 -3 26 -35 -14 -28 25 72 38 -5 -26 53 1 24 36 -20 -28 0 22 28 -60 -9 30 39 23 -51 -83 42 68 -25 -31
6030 -31 -64 -4 48 7 -76 0 20 49 9 -51 -55 -40 -4 35 -53 -38 -3 16 17 -43 -23 13 9 29 -31 34 -38 29 -7 41 -13 41
6062 41 -8 37 3 -40 -12 9 26 -3 17 -31 5 1 52 2 -57 -1 24 28 -4 -51 21 35 1 -7 -14 -44 74 128 26 -9 -6 17
6094 17 56 -12 -54 -31 21 -10 -24 -17 -49 2 5 -22 11 14 -58 32 -50 -27 -15 -10 30 -1 6 -61 -47 -11 46 -19 -15 -7 15 23 9 -64
6128 -64 -17 -6 59 -8 -30 2 -24 103 -32 -22 -46 32 57 -19 4 -7 -13 10 51 -28 -6 15 34 38 -10 -37 -68 -65 32 -33 -12
6159 -12 31 3 15 62 23 -27 -10 39 27 -4 16 -34 18 49 13 -58 14 44 -3 -73 -1 -2 79 68 -49 17 45 -40 -2 -2 0
6190 0 39 17 55 -75 -10 -9 17 -11 5 -9 -27 60 3 -44 15 -67 -24 10 -15 3 -1 20 48 8 -6 3 -25 -12 19 7 51 -9
6222 -9 28 10 -35 -72 -2 25 19 -3 -13 41 29 64 -2 -12 -32 7 -19 -36 -45 18 48 12 47 2 2 60 -46 -7 -24 -2 27 -17
6254 -17 23 58 13 12 -27 45 -40 38 14 12 17 57 25 -20 22 33 12 2 -2 7 -27 9 -17 -57 25 14 33 -2 37 13 14 -12 0
6287 0 -35 -10 15 30 14 -28 -11 -37 -11 104 16 8 26 6 -8 -8 -27 -39 -35 -4 19 24 19 -23 -34 21 -16 31 8 -21 11 43 7
6320 7 5 39 1 -32 66 15 13 33 -59 -2 2 -32 26 61 -2 31 -36 23 26 -9 0 32 -8 -28 20 -12 32 1 -50 17 37 2 -41
6353 -41 -8 74 21 -3 30 -15 19 -31 2 10 -8 -23 55 -21 -93 -5 -2 29 22 17 -29 5 9 11 8 45 26 -9 14 -57 23 -25 34 -2
6387 -2 4 -37 7 30 39 -67 -40 -34 21 19 49 20 62 69 60 -48 -24 -24 -6 25 3 -18 -27 -1 40 1 12 -32 9 85 51 -5 -97 24
6421 24 5 6 -57 24 32 43 56 7 37 -18 3 9 -12 -32 5 21 50 13 -4 0 -12 -11 -12 -1 40 36 43 7 0 -19 25 67 18 -25 35
6456 35 11 27 16 15 -58 -9 50 34 8 -28 -10 43 57 6 -27 -43 16 58 4 -24 7 7 29 -7 4 9 35 31 -41 21 43 10
6488 10 22 0 -19 -38 -30 29 26 -17 10 2 -7 13 -6 -39 -24 25 1 38 -24 11 73 30 30 -15 -6 -4 -21 -18 -39 -27 79 52 -1 34
6522 34 -35 36 -20 -15 -44 -39 28 26 -4 -60 -9 -17 37 73 1 -10 16 -22 -2 17 11 48 -11 41 3 -56 -74 -44 20 41 -2 25 36
6555 36 32 41 -23 -36 -44 36 15 5 -28 -60 -13 14 -59 -10 -1 -4 -10 -6 -16 49 -22 39 -13 -29 20 2 62 -6 -27 11 44 -10 -15 -44
6589 -44 -12 -10 -29 -17 8 2 -31 -24 -5 -42 -3 31 3 -13 -39 34 57 23 -13 10 5 6 20 5 55 -19 -39 76 39 10 -59 4
6621 4 33 29 16 -3 -19 27 -18 -80 -43 8 -21 23 41 -61 -42 -8 -9 81 48 42 -49 -9 -10 38 14 30 -5 -4 19 11 -8 0 31 36
6655 36 -29 -5 25 20 57 -26 5 -20 0 2 -49 -40 29 14 25 -76 -17 -42 8 -52 29 -13 -28 -2 -16 22 13 5 1 -5 -32 -7 2 -8
6689 -8 11 1 12 -28 25 -31 -27 -2 71 -30 -29 -34 -56 46 41 -49 -18 -21 61 -3 -8 17 -47 53 2 13 -64 21 57 -21 45 -40
6721 -40 29 -5 -35 -67 -37 6 -18 19 1 -29 -21 11 35 10 -28 34 77 4 22 -10 8 33 37 52 -50 -3 6 31 11 -3 4 -30
6753 -30 1 12 23 -26 9 3 31 6 -42 10 -6 36 33 -64 19 -32 -16 55 36 -47 15 63 1 13 23 -36 40 14 -9 -80 21
6784 21 12 3 15 -57 5 50 30 -25 31 18 -1 26 9 -5 36 35 42 -14 10 9 -44 29 -39 -10 15 65 44 -23 -79 30 1 26
6816 26 28 -1 -15 -39 0 0 44 -20 44 27 -26 -30 -11 -15 3 15 -28 7 58 4 22 39 -18 -9 53 -8 11 40 -37 -29 21 -64 24
6849 24 -12 42 9 17 27 -10 -25 36 14 -5 -49 -16 -17 43 -48 2 -6 35 -28 18 8 4 54 39 13 6 -46 30 39 -14 -41 2 26
6882 26 -4 -1 -38 -44 -20 -31 6 35 -4 -58 -23 20 -17 -27 -29 -29 12 10 27 -23 12 53 5 13 4 -10 -7 -4 -45 -18 55 -10 -40 -40 1
6917 1 43 6 1 3 -38 -5 15 26 20 52 -35 36 -67 -5 -19 -26 -13 -23 24 32 -7 -3 -20 58 42 39 4 18 -8 -17 17 21 23 13 18 -54
6953 -54 -7 -14 18 8 17 30 -5 -25 26 -16 1 -22 45 0 -5 -29 -16 -40 24 -46 55 -17 7 -31 2 -6 -26 44 31 25 6 -24
6985 -24 -41 -14 11 -45 12 22 8 39 4 -16 42 -28 -11 8 23 7 27 -46 24 -10 -8 10 -37 14 -18 34 8 15 8 37 37 -33
7017 -33 19 -23 10 79 -32 4 52 35 -16 -13 21 45 66 32 20 -28 10 52 25 21 0 -29 -13 -16 -13 -32 -3 1 -23 -11 21 52
7049 52 65 38 1 -58 -4 -3 -4 -12 -11 -10 1 -26 17 48 -75 10 57 26 -10 -46 -38 3 17 -7 -42 -65 -11 60 -20 -1 -14 39 -35
7082 -35 -31 -65 -57 35 -15 -13 -54 -13 11 36 -19 32 -33 12 -28 0 -18 -5 -52 -2 19 -30 -33 -1 -59 69 45 -17 -49 46 44 -36
7114 -36 15 -70 2 1 19 -5 -27 -12 87 20 -23 -14 -4 63 -12 -17 -41 -10 -23 22 26 -23 -23 -25 4 -28 34 -6 36 20 -25 -62 -49
7147 -49 -49 -2 12 -18 -1 -34 16 50 -4 17 17 15 -10 -14 -15 20 93 -14 -36 -40 -53 57 46 -2 -56 -49 -1 8 -9 -67 10 8 17 -4
7181 -4 -15 -3 20 -25 47 -9 -22 -13 16 39 9 -54 15 39 3 14 26 -3 -1 26 41 25 -19 12 5 -10 -65 14 25 23 -18 -7 -2
7214 -2 46 49 1 -31 12 10 1 -61 55 38 29 46 39 -43 -17 32 32 12 -17 -37 -39 -31 -28 -16 17 -25 89 12 1 -27 -42 -9 -11 15 -29
7249 -29 -37 0 16 -58 24 -30 63 56 7 11 -30 43 33 36 -56 -6 -21 41 -31 -49 -9 44 56 18 -31 11 -6 -9 37 -18 -27 -19 -41 62
7283 62 -4 -8 29 -9 2 -23 32 31 38 -9 -21 -25 -29 15 -3 85 22 -18 -73 53 7 28 14 -17 71 19 -7 -19 -13 40 12 -32 -10
7316 -10 -3 -22 23 42 -29 10 30 -15 -16 1 19 -10 2 -19 10 33 30 21 59 -14 18 -18 -12 20 -41 -65 -20 24 -45 -23 -19 -49 12
7349 12 18 -14 0 32 23 1 25 30 -48 12 -1 42 49 -12 -41 -14 5 35 27 -8 -28 6 -43 30 1 -3 16 -4 34 3 -3 46 21 22
7383 22 14 -23 1 -10 -18 -4 -4 -31 11 28 29 -28 3 29 -46 -30 4 9 -18 8 14 -40 22 36 -64 59 2 -11 -22 -8 -13 -19 4
7416 4 -35 -4 -23 -34 -21 21 5 -32 33 20 -22 -14 4 -16 -29 -12 8 35 26 -5 -13 -20 28 -18 -22 7 28 -6 59 1 -37 11 -45
7449 -45 37 18 -19 7 55 -19 5 2 -9 -52 56 -6 -53 -29 18 2 9 36 -20 -1 22 -35 -47 74 -20 -7 -28 3 -2 27 -1
7480 -1 34 -1 -26 -12 3 0 -3 -1 -34 -5 -4 -1 29 16 18 1 49 -12 -31 -15 42 10 -20 -78 -37 51 -31 -20 -20 -41 -39 -18 -13 -25 -2
7515 -2 -45 -14 -10 -29 -30 18 -19 -21 -39 25 6 -8 27 50 -61 -16 37 16 32 6 -7 25 -4 16 14 -12 13 -1 49 51 -26 35 41
7548 41 -78 -6 -17 27 -15 16 7 6 6 41 -21 -20 19 -11 38 49 -57 8 -4 -14 2 15 42 -15 -39 -47 -53 -28 -32 31 56 27 -20
7581 -20 21 30 -42 28 -31 -12 -13 3 -40 30 -18 -19 -34 26 28 -53 -18 2 7 20 -18 -96 12 44 17 18 -29 38 20 -9 -1 -57 -50 4
7615 4 50 46 16 -66 16 33 -31 9 12 15 -17 -4 19 -19 -35 25 26 -15 12 -29 -5 34 12 38 -17 -35 6 -1 38 44 -4 37 -12 8
7649 8 -78 8 54 -14 9 7 -6 -11 -30 -13 22 -2 53 -20 21 -13 -35 -17 -4 39 0 -22 -22 -52 -37 44 12 2 -10 -29 -50 10
7681 10 19 -20 -34 51 -18 -16 17 -54 -7 -13 -6 9 10 -24 25 -1 14 -14 -3 -9 -3 37 -31 -56 -30 65 -36 -7 -76 17 33 -5 0 9
7715 9 -17 21 15 21 15 -15 14 37 59 37 23 -1 -73 -35 14 20 -29 22 -19 -39 89 -37 5 -22 25 2 4 -2 43 -37 45 -48 34
7748 34 49 -3 19 -3 4 -23 7 30 13 4 37 33 -30 -28 17 18 -4 8 -31 -31 2 -3 0 -36 -67 -35 -12 20 -12 -4 4 -2 31 25 12 -12
7784 -12 -58 1 47 -12 -29 21 73 30 33 47 6 -14 40 1 -24 9 55 -16 -21 18 18 -45 -15 34 3 37 -8 49 -24 10 -1 -13
7816 -13 -7 41 41 17 47 -25 12 -23 16 -34 35 -32 -32 -27 39 -3 -21 -10 16 -1 -46 14 10 63 36 -3 9 12 15 -52 -38 8 -46 -30
7850 -30 -58 -27 7 49 60 52 31 -6 -49 46 -35 -13 12 15 -53 -14 28 -20 -40 -29 -17 -29 34 -28 -9 50 48 19 -4 2 16 42
7882 42 18 -21 -27 6 0 40 -28 -23 41 -10 -50 8 -3 -1 52 -49 3 62 -49 -35 -9 -41 36 -26 -8 -39 2 13 -2 35 20
7913 20 -77 -34 -46 27 22 1 -28 -11 -25 -29 -13 -39 25 1 42 -37 -57 -33 26 -44 -30 -73 -8 -39 14 -14 9 -2 33 -24 -37
7944 -37 -38 2 27 16 14 -22 -28 -14 62 30 -44 24 13 32 -12 -27 -18 -32 12 26 -15 -49 73 -1 -46 -2 -28 18 -3 -51 -39 -14
7976 -14 -18 -62 -31 6 11 56 -31 42 22 49 -8 -7 29 -27 -20 -35 11 48 20 -22 22 -5 -6 -60 15 -48 -58 -43 -4 -17 -6 30 13
8009 13 10 5 22 -45 -16 6 -14 7 2 -11 -7 8 -47 32 38 19 45 -2 -6 3 -17 7 -31 60 53 -2 31 -1 -19 6 -22 -3 -35 -39 3
8044 3 18 17 7 -12 32 -35 36 29 57 28 -4 -20 -23 20 12 52 7 -58 16 -34 4 7 -28 -15 -11 16 -45 -17 23 6 35 21 0 -40
8078 -40 -24 41 61 0 -7 -24 -1 -27 -36 0 8 4 -5 12 -2 -15 -50 7 -11 -2 23 -32 -29 -36 22 11 -36 7 -2 25 -23 7 -2 54 13
8113 13 12 0 -8 -41 -49 53 5 -29 -28 7 -21 54 10 -18 32 16 -12 45 7 42 -93 -20 57 29 -57 -25 -44 -14 -2 -17 -43
8144 -43 21 16 20 -22 38 -38 6 12 12 10 13 44 16 33 -1 -9 -23 38 3 11 1 -7 6 13 3 10 -10 22 -10 -26 -6 -10 8 7 -7 -60 -18
8181 -18 -29 -19 -33 -18 6 -6 -26 -15 -58 6
8191F
##END NTUPLES=NMR FID
##END=
