##TITLE=1H_IG-ishdn.sm2
 CDCl3
 8 sc, 
 30.11.2023
##JCAMPDX= 6.0         $$ Bruker NMR JCAMP-DX V2.0
##DATA TYPE= NMR FID
##DATA CLASS= NTUPLES
##ORIGIN= UXNMR, Bruker Analytische Messtechnik GmbH
##OWNER= root
$$ XWIN-NMR		Version 3.5
$$ Thu Nov 30 14:04:59 2023 Russian Standard Time (UT+4h)  she@DPX200
##.OBSERVE FREQUENCY= 200.1313
##.OBSERVE NUCLEUS= ^1H
##.DELAY= (6, 6)
##.ACQUISITION MODE= SIMULTANEOUS
##.ACQUISITION SCHEME= undefined
##.AVERAGES= 8
##.DIGITISER RES= 18
##SPECTROMETER/DATA SYSTEM= spect
##.PULSE SEQUENCE= zg30
##.SOLVENT NAME= CDCl3
##.SHIFT REFERENCE= (INTERNAL, CDCl3, 0, 15.7039)
##AUDIT TRAIL= $$ (NUMBER, WHEN, WHO, WHERE, WHAT)
$$ ##TITLE= Audit trail, XWIN-NMR		Version 3.5
$$ ##JCAMPDX= 5.01
$$ ##ORIGIN= Bruker BioSpin GmbH
$$ ##OWNER= she
$$ F:/spectra/data/she/nmr/H-F/1/audita.txt
$$ ##AUDIT TRAIL=  $$ (NUMBER, WHEN, WHO, WHERE, WHAT)
(   1,<2023-11-30 14:03:56.64 +0400>,<she>,<DPX200>,
      <created by zg, POWCHK disabled, PULCHK disabled
       configuration hash MD5:
       00 E9 B6 7A A2 85 ED C7 34 08 36 98 17 FE 4E 26
       data hash MD5: 16K
       BD CD 13 1D 3A 11 68 BA 41 42 E5 E8 55 55 16 C4>)
$$ ##END=
$$ 
$$ hash MD5
$$ EF 43 39 5C 78 35 1B 1E B4 06 4D 60 E5 7C D4 7C
##$RELAX= 
##$RELAX= 
##$RELAX= 
##$RELAX= 
##$RELAX= 
##$RELAX= 
$$ Bruker specific parameters
$$ --------------------------
##$DU= <F:/spectra>
##$EXPNO= 1
##$NAME= <H-F>
##$PROCNO= 1
##$TYPE= <nmr>
##$USER= <she>
##$AMP= (0..31)
100 100 100 100 100 100 100 100 100 100 100 100 100 100 100 100 100 100 
100 100 100 100 100 100 100 100 100 100 100 100 100 100 
##$AQSEQ= 0
##$AQ_mod= 1
##$AUNM= <au_zg>
##$AUTOPOS= <>
##$BF1= 200.13
##$BF2= 200.13
##$BF3= 200.13
##$BF4= 200.13
##$BF5= 200.13
##$BF6= 200.13
##$BF7= 200.13
##$BF8= 200.13
##$BYTORDA= 1
##$CFDGTYP= 0
##$CFRGTYP= 5
##$CHEMSTR= <none>
##$CNST= (0..31)
1 1 145 1 1 1 1 1 1 1 1 1 1 1 1 1 1 1 1 1 1 1 1 1 1 1 1 1 1 1 1 1 
##$CPDPRG= <>
##$CPDPRG1= <>
##$CPDPRG2= <>
##$CPDPRG3= <>
##$CPDPRG4= <mlev>
##$CPDPRG5= <mlev>
##$CPDPRG6= <mlev>
##$CPDPRG7= <mlev>
##$CPDPRG8= <mlev>
##$CPDPRGB= <>
##$CPDPRGT= <>
##$D= (0..31)
0 1.2 0 0 0 0 0 0 0 0.06 0 0.03 0 0 0 0 0.0002 0 0 0 0 0 0 0 0 0 0 0 0 
0 0 0 
##$DATE= 1701338636
##$DBL= (0..7)
120 120 120 120 120 120 120 120 
##$DBP= (0..7)
150 150 150 150 150 150 150 150 
##$DBP07= 0
##$DBPNAM0= <>
##$DBPNAM1= <>
##$DBPNAM2= <>
##$DBPNAM3= <>
##$DBPNAM4= <>
##$DBPNAM5= <>
##$DBPNAM6= <>
##$DBPNAM7= <>
##$DBPOAL= (0..7)
0.5 0.5 0.5 0.5 0.5 0.5 0.5 0.5 
##$DBPOFFS= (0..7)
0 0 0 0 0 0 0 0 
##$DE= 6
##$DECBNUC= <off>
##$DECIM= 32
##$DECNUC= <off>
##$DECSTAT= 4
##$DIGMOD= 1
##$DIGTYP= 9
##$DL= (0..7)
0 120 120 120 120 120 120 120 
##$DP= (0..7)
150 150 150 150 150 150 150 150 
##$DP07= 0
##$DPNAME0= <>
##$DPNAME1= <>
##$DPNAME2= <>
##$DPNAME3= <>
##$DPNAME4= <>
##$DPNAME5= <>
##$DPNAME6= <>
##$DPNAME7= <>
##$DPOAL= (0..7)
0.5 0.5 0.5 0.5 0.5 0.5 0.5 0.5 
##$DPOFFS= (0..7)
0 0 0 0 0 0 0 0 
##$DQDMODE= 0
##$DR= 18
##$DS= 0
##$DSLIST= <SSSSSSSSSSSSSSS>
$$ [...]
##$SUBNAM2= <"">
##$SUBNAM3= <"">
##$SUBNAM4= <"">
##$SUBNAM5= <"">
##$SUBNAM6= <"">
##$SUBNAM7= <"">
##$SUBNAM8= <"">
##$SUBNAM9= <"">
##$SW= 18.0517328524113
##$SWIBOX= (0..15)
0 0 2 0 0 0 0 0 0 0 0 0 0 0 0 0 
##$SW_h= 3612.71676300578
##$TD= 16384
##$TD0= 1
##$TE= 0
##$TE2= 300
##$TE3= 300
##$TEG= 300
##$TL= (0..7)
0 120 120 120 120 120 120 120 
##$TP= (0..7)
150 150 150 150 150 150 150 150 
##$TP07= 0
##$TPNAME0= <>
##$TPNAME1= <>
##$TPNAME2= <>
##$TPNAME3= <>
##$TPNAME4= <>
##$TPNAME5= <>
##$TPNAME6= <>
##$TPNAME7= <>
##$TPOAL= (0..7)
0.5 0.5 0.5 0.5 0.5 0.5 0.5 0.5 
##$TPOFFS= (0..7)
0 0 0 0 0 0 0 0 
##$TUNHIN= 0
##$TUNHOUT= 0
##$TUNXOUT= 0
##$USERA1= <user>
##$USERA2= <user>
##$USERA3= <user>
##$USERA4= <user>
##$USERA5= <user>
##$V9= 5
##$VALIST= <valist>
##$VCLIST= <CCCCCCCCCCCCCCC>
##$VD= 0
##$VDLIST= <DDDDDDDDDDDDDDD>
##$VPLIST= <PPPPPPPPPPPPPPP>
##$VTLIST= <TTTTTTTTTTTTTTT>
##$WBST= 1024
##$WBSW= 4
##$XGAIN= (0..3)
0 0 0 0 
##$XL= 0
##$YL= 0
##$YMAX_a= 70314
##$YMIN_a= -91391
##$ZGOPTNS= <>
##$ZL1= 120
##$ZL2= 120
##$ZL3= 120
##$ZL4= 120
##$ABSF1= 10
##$ABSF2= 0
##$ABSG= 5
##$ABSL= 3
##$ALPHA= 0
##$AQORDER= 0
##$ASSFAC= 0
##$ASSFACI= 0
##$ASSFACX= 0
##$ASSWID= 0
##$AUNMP= <proc_1d>
##$AZFE= 0.1
##$AZFW= 0.1
##$BCFW= 1
##$BC_mod= 2
##$BYTORDP= 1
##$COROFFS= 0
##$CY= 11.3945322036743
##$DATMOD= 1
##$DC= 2
##$DFILT= <>
##$DTYPP= 0
##$F1P= 15.7292609196834
##$F2P= 12.9074282941183
##$FCOR= 0.5
##$FTSIZE= 0
##$FT_mod= 4
##$GAMMA= 1
##$GB= 0.15
##$INTBC= 1
##$INTSCL= 1
##$ISEN= 128
##$LB= 0.24
##$LEV0= 0
##$LPBIN= 0
##$MAXI= 10000
##$MC2= 0
##$MEAN= 0
##$ME_mod= 0
##$MI= 1.114404
##$NCOEF= 0
##$NC_proc= 0
##$NLEV= 6
##$NOISF1= 3.799351
##$NOISF2= 2.8
##$NSP= 1
##$NTH_PI= 0
##$NZP= 0
##$OFFSET= 15.70392
##$PC= 1
##$PHC0= -24594.27
##$PHC1= 15.45271
##$PH_mod= 1
##$PKNL= yes
##$PPARMOD= 0
##$PSCAL= 0
##$PSIGN= 0
##$REVERSE= no
##$SF= 200.130013532006
##$SI= 16384
##$SIGF1= 3
##$SIGF2= 2
##$SINO= 400
##$SIOLD= 16384
##$SREGLST= <1H.CDCl3>
##$SSB= 0
##$STSI= 0
##$STSR= 0
##$SW_p= 3612.71676300578
##$SYMM= 0
##$S_DEV= 0
##$TDeff= 0
##$TDoff= 0
##$TI= <>
##$TILT= no
##$TM1= 0
##$TM2= 0
##$TOPLEV= 0
##$USERP1= <user>
##$USERP2= <user>
##$USERP3= <user>
##$USERP4= <user>
##$USERP5= <user>
##$WDW= 1
##$XDIM= 8192
##$YMAX_p= 0
##$YMIN_p= 0
$$ End of Bruker specific parameters
$$ ---------------------------------
##NTUPLES= NMR FID
##VAR_NAME=  TIME,          FID/REAL,        FID/IMAG
##SYMBOL=    X,             R,               I
##VAR_TYPE=  INDEPENDENT,   DEPENDENT,       DEPENDENT
##VAR_FORM=  AFFN,          ASDF,            ASDF
##VAR_DIM=   8192,          8192,            8192
##UNITS=     SECONDS,       ARBITRARY UNITS, ARBITRARY UNITS
##FACTOR=    0.0002768,     1,               1
##FIRST=     0,             0,               0
##LAST=      2.2672688,     0,               0
##MIN=       0,             -91391,          0
##MAX=       2.2672688,     70314,           0
$$ Real data points
##PAGE= N=1
##DATA TABLE= (X++(R..R)), XYDATA
$$ [...]
$$ plain form
2107 -144 -1888 -2478 -1618 -225 713 999 1047 444 -758 -577 277 1874 2461 1150 -687 -1716 -1905 -738
2125 -738 253 852 1 -932 -1592 -1841 -903 897 2178 1988 702 -573 -513 171 1089 1519 1094 69 -1243
2144 -1243 -2039 -2168 -803 463 814 115 -1171 -1608 -578 1001 2024 2287 1704 696 -632 -765 -338
2161 -338 980 1598 373 -1397 -2239 -2491 -1311 -246 318 500 -128 -1170 -1016 -71 1862 2693 2554 1044
2179 1044 -317 -768 -608 307 754 456 -600 -1763 -2939 -2454 -942 631 1480 796 -160 -415 22 1369
2197 1369 2176 2246 1840 406 -902 -1429 -759 170 432 -117 -1498 -2343 -2031 -1036 292 1282 1216 652 0
2216 0 -309 323 1362 2498 2057 874 -943 -1309 -1138 -592 141 182 -591 -1883 -1949 -1593 -148 1193 2130
2235 2130 1508 519 -276 -189 990 1775 1676 712 -737 -1860 -2104 -1511 -311 387 652 -785 -1453 -1091 -409
$$ packed form
2107a44j744n90Q60J393R38K86M8o03j202J81Q54J597N87j311j837j029j89J167
2125g38R91N99q51r33o60k49R38J800J281j90j286j275O0O84R18M30m25j025j312
2144a243p96j29J365J266L51o99j286m37J030J579J023K63n83j008j328j33M27
2161c38J318O18j225j770q42k52J180J065N64J82o28j042J54R45J933Q31j39j510
2179A044j361m51J60R15M47k98j056j163j176M85J512J573Q49o84r56k55M37J347
2197A369Q07P0m06j434j308n27O70R29K62n49j381q45L12R95J328R90o6n64o52
2216@l09O32J039J136m41j183j817l66J71N46P33M1p73j292o6L56J445J341R37
2235B130o22r89p95Q7J179P85r9r64j449j123k44N93J200O98K65j437o68L62O82
$$ plain form
2254 -409 1091 2121 1817 670 -175 -918 -230 677 1217 1344 18 -1204 -1981 -1805 -490 637 855 189
2272 189 -631 -1087 -469 754 2056 2045 1456 191 -1018 -896 -160 392 531 -217 -1249 -2135 -2033 -872
2290 -872 401 1457 1536 574 -311 -357 366 1520 1567 1349 60 -1370 -1738 -1467 -535 520 563 -122 -1113
2309 -1113 -1594 -1076 403 1178 1749 1271 142 -422 -356 651 1458 1382 690 -925 -1983 -1738 -1196 -419 408
2328 408 137 -722 -1338 -1059 -81 1512 2275 2228 1083 98 -543 -154 771 715 258 -883 -2151 -2631 -1671
2347 -1671 -562 493 890 317 -352 -710 71 1123 2078 2339 1713 -22 -745 -646 67 547 357 -229 -1282
2366 -1282 -2345 -2285 -1267 358 781 1065 125 -442 -26 835 1953 2298 1914 639 -708 -1210 -1059 -158
2384 -158 195 -242 -1236 -2190 -2418 -1666 -467 737 1499 1035 87 -137 264 1524 2143 2049 887 -701 -1292
$$ packed form
2254d09J500J030l04j147q45p43O88R07N40J27j326j222p77J76J315J127K18o66
2272A89q20m56O18J223J302j1n89j265j209J22P36N52J39p48j032q86J02J161
2290h72J273J056P9r62q85m6P23J154M7k18j289j430l68K71R32J055M3o85r91
2309a113m81N18J479P75N71m78j129n64O6J007Q07p6o92j615j058K45N42P77Q27
2328D08k71q59o16K79R78J593P63m7j145r85o41L89R25n6m57j141j268m80R60
2347a671J109J055L97n73o69l58P81J052R55K61o26j735p23R9P13M80j90n86j053
2366a282j063O0J018J625M23K84r40n67M16Q61J118L45l84j275j347n02J51R01
2384a58L53m37r94r54k28P52J199J204P62m64r48k24M01J260O19r4j162j588n91
$$ plain form
2403 -1292 -1499 -844 -484 60 -532 -1061 -1982 -1820 -337 1248 1876 1514 915 -67 67 456 1199 1635 961
2422 961 -153 -1457 -1972 -1672 -439 475 337 -654 -1403 -1414 -678 347 1372 1959 1391 216 -258 -232 796
2441 796 1360 1269 361 -992 -1630 -1765 -1192 -204 413 515 -479 -781 -569 391 1699 2315 1716 576 -328
2460 -328 -856 -436 79 389 167 -662 -1358 -1954 -1146 272 1130 1044 846 -303 -611 -147 904 1203 1209 678
2480 678 -405 -1268 -1399 -628 135 562 147 -998 -1526 -1199 -353 907 1482 1334 654 -190 -195 -12 1108
2499 1108 1379 1058 -269 -1167 -1917 -1445 -255 132 359 -237 -1013 -1038 -576 1063 1878 1828 1198 261 -354
2518 -354 -314 439 816 659 -364 -1182 -1952 -1899 -1196 299 600 479 -160 -663 -60 456 1503 1776 1308 635
2538 635 -388 -1047 -585 -171 636 559 -833 -1664 -1718 -1215 -172 755 834 815 -336 -530 108 1017 1905 1939
$$ packed form
2403a292k07O55L60N44n92n29r21J62J483J585O28l62n99r82J34L89P43M36o74
2422I61j114j304n15L00J233R14j38r91p49j1P36J025J025N87n68j175m74K6J028
2441G96N64r1r08j353o38j35N73R88O17J02r94l02K12R60J308O16n99j140r04
2460c28n28M20N15L10k22q29o96n96Q08J418Q58q6j98j149l08M64J051K99On31
2480F78j083q63j31P71P63M27m15j145n28L27Q46J260N75j48o80q44nJ83J120
2499A108K71l21j327q98p50M72J190L87K27n96p76k5M62J639Q15n0o30r37o15
2518c54M0P53L77j57j023q18p70N3P03J495L01j21o39n03O03N16J047K73m68o73
2538F35j023o59M62M14Q07p7j392q31n4N03J043R27P9j9j151j94O38R09Q88L4
$$ plain form
2558 1939 1085 -65 -927 -756 -363 32 36 -489 -1227 -2060 -1454 -999 516 1600 1216 495 -15 220 915
2577 915 1288 1673 1066 -229 -1043 -1584 -1433 -378 87 297 -428 -1513 -1334 -552 450 1442 1219 1136 113
2596 113 -199 -123 509 1422 1033 268 -918 -1612 -1173 -835 70 216 -229 -305 -1064 -876 204 1148 1747 1122
2616 1122 378 -502 -192 10 638 843 158 -477 -1023 -1502 -1073 -1 680 543 187 -540 -720 -99 579
2635 579 1443 1373 584 -278 -861 -787 -69 408 631 80 -996 -1489 -1052 -159 593 915 1033 88 -418 -331 280
2656 280 1134 1430 719 -572 -1018 -1543 -1002 -169 563 281 -309 -888 -921 -391 543 1178 1354 464 -333 -519
2676 -519 -161 473 696 765 -198 -983 -1368 -1185 -300 291 373 300 -512 -894 -522 507 1254 1454 1153 444 -157
2697 -157 -293 -260 398 360 -98 -823 -1699 -1365 -766 59 688 805 239 22 -144 230 1177 1396 1226 548 -483
$$ packed form
2558A939q54j150q62J71L93L95Mn25p38q33O06M55J515J084l84p21n10K35O95
2577I15L73L85o07j295q14n41J51J055M65K10p25j085J79P82J002R92k23q3j023
2596A13l12P6O32R13l89p65j186o94M39L38R05J46m45p6p59J88J080R44N99o25
2616A122p44q80L10K02O28K05o85o35n46m79M29J072O81j37l56p27j80O21O78
2635E79Q64p0p89q62n83P4P18M77K23n51j076m93M37Q93P52L22J18r45n06Q7O11
2656B80Q54K96p11j291m46n25N41Q33P32k82n90n79l3N30R34O35J76q90p97j86
2676e19L58O34K23O9r63p85l85J83Q85N91Q2p3q12l82L72J029P47K00l01p09o01
2697a57j36L3O58l8m58p25q76L34N99Q25O29J17n66k17j66L74R47K19j70o78j031
$$ plain form
2718 -483 -766 -875 -51 348 -19 -345 -965 -1523 -1588 -306 677 1166 678 206 -298 205 945 1380 1244 784
2738 784 -48 -1100 -1244 -923 -236 447 -360 -822 -1346 -1100 -292 346 1134 1102 506 5 -63 32 627 1134 1020
2759 1020 227 -844 -1261 -1036 -315 56 177 -170 -729 -842 -631 276 1208 1226 1119 386 -264 -155 142 736
2779 736 725 169 -513 -1169 -1375 -829 78 611 243 -230 -639 -468 105 822 983 1195 468 -178 -586 -352
2799 -352 159 341 445 -176 -702 -1333 -811 -344 605 709 398 -61 -503 -410 567 973 940 359 -116 -831 -770
2820 -770 -531 334 531 256 -377 -1016 -912 -423 557 925 790 234 -409 -199 44 783 900 902 -106 -843
2840 -843 -1210 -1089 -416 323 320 231 -544 -622 -209 394 1154 1054 884 172 -573 -435 261 329 434 199 -644 -1091
2862 -1091 -1197 -580 156 791 509 167 -323 -332 -294 1115 998 886 703 -481 -683 -546 162 304 184 -420
$$ packed form
2718d83k83j09Q24L99l67l26o20n58o5J282R83M89m88m72n04N03P40M35j36m60
2738G84q32j052j44L21O87O83q07m62n24K46Q08O38P88l2n96n01o8R5N95N07j14
2759A020p93j071m17K25P21L71J21l47n59j13K11R07R32J8j07p33o50J09K97N94
2779G36j1n56o82o56k06N46R07N33l68m73m09J71N73P17J61K12p27o46m08K34
2799c52N11J82J04o21n26o31N22M67R49J04l11m59m42R3R77M06l3n81m75p15O1
2820g70K39Q65J97k75o33o39J04M89R80L68j35n56o43K10K43P39J17Kj008p37
2840h43l67J21O73P39lq9p75p8M13O03P60j00j70p12p45J38O96O8J05k35q43m47
2862a091j06O17P36O35k82l42m90rL8J409j17j12j83j184k02J37P08J42j20o04
$$ plain form
2882 -420 -1204 -1282 -1056 172 559 1020 828 -90 -323 -226 597 1055 1011 676 -271 -850 -817 -301 25 437 166
2903 166 -602 -1043 -930 -227 438 855 914 406 -34 63 313 827 973 993 321 -595 -1077 -998 -297 151 -105
2924 -105 -185 -940 -892 -552 227 1139 986 775 267 -184 -273 248 808 764 293 -617 -1013 -1000 -519 -106 260 203
2946 203 -309 -832 -832 47 353 1033 948 143 -236 -228 87 243 704 620 -244 -863 -1103 -945 -64 453 447 -49 -436
2969 -436 -783 -246 373 596 818 397 64 -634 -400 59 371 570 356 -507 -1049 -699 -458 286 392 684
2989 684 74 -424 -767 -163 502 828 646 91 -497 -923 -276 -110 364 390 -179 -438 -439 -594 458 833 833
3010 833 489 -364 -702 -471 64 408 426 255 -435 -817 -506 -179 561 713 371 1 -774 -483 3 621
3030 621 823 671 110 -452 -630 -418 265 877 140 -483 -849 -1173 -591 -246 512 551 285 -167 -396 -25
$$ packed form
2882d20p84p8K26J228L87M61j92r18k33R7Q23M58m4l35r47n79L3N16L26M12k71
2903A66p68m41J13P03O65M17N9n08m40R7K50N14J46K0o72r16m82P9P01M48k56
2924a05q0p55M8L40P79R12j53k11n08m51q9N21N60m4m71r10l96J3M81M13L66n7
2946B03n12n23%Q79L06O80q5q05l79QL15J56M61q4q64o19k40J58Q81N17om96l87
2969d36l47N37O19K23K22m21l33o98K34M59L12J99k14q63n42L50K41P44J06K92
2989F84o10m98l43O04O65L26j82n55n88m26O47J66M74K6n69k59jj55J052L75%
3010H33l44q53l38K31N35L44J8j71o90l82L11L27P40J52l42l70p75K91M86O18
3030F21K02j52n61n62j78K12O83O12p37o23l66l24N82L45P58L9k66m52k29L71
$$ plain form
3050 -25 870 837 739 303 -358 -941 -749 -326 -110 195 -65 -148 -632 -635 -70 819 1062 735 -25 -241 -426 67
3072 67 641 737 495 -225 -855 -929 -578 -85 461 36 -307 -603 -1014 -312 261 763 815 669 177 -182 26
3093 26 296 667 815 335 -465 -942 -732 -592 360 286 130 17 -213 -301 94 905 867 812 310 -460 -478 -122
3115 -122 385 373 263 -283 -739 -683 -512 22 364 425 -138 -444 -436 -67 347 1085 926 480 29 -402 -530 -372
3137 -372 311 323 -54 -703 -798 -850 37 315 603 575 21 -384 -439 -177 434 860 764 -163 -664 -810 -350 240
3159 240 713 497 -323 -566 -759 -373 197 740 985 527 -17 -349 -42 467 706 722 13 -580 -1168 -912
3179 -912 -339 466 498 197 -163 -169 -262 161 696 968 721 104 -694 -736 57 327 420 20 -257 -585 -637 -268
3201 -268 262 741 292 216 -147 -148 -76 537 837 1107 264 -341 -530 -507 -246 182 187 -161 -581 -1105 -708 55
$$ packed form
3050b5Q95l3r8m36o61n83J92M23K16L05k60q3m84lN65Q89K43l27p60k16j85M93
3072F7N74R6k42p20o30p4L51M93N46m25l43k96m11P02N73N02N2j46m92l59K08
3093B6K70L71J48m80q00m77K10J40R52p4j56j13k30q8L95Q11l8n5n02p70j8L56
3115a22N07j2j10n46m56N6J71N34L42O1n63l06QL69M14P38j59m46m51m31j28J58
3137c72O83J2l77o49r5n2Q87K78K88k8n54m05n5K62O11M26r6r27n01j46M60N90
3159B40M73k16q20k43j93L86N70N43K45m58n44l32L07N09K39J6p09n93n88K56
3179i12N73Q05L2l01l60or3M23N35K72k47o17p98m2P93K70R3m00k77l28n2L69
3201b68N30M79m49p6l63jP2O13L00K70q43o05j89K3K61M28Nl48m20n24L97P63
$$ plain form
3223 55 547 845 675 107 -195 -6 341 840 866 478 -91 -931 -1251 -513 -168 81 -301 -301 -758 -739 -337 306
3245 306 899 909 756 384 -114 177 162 616 525 45 -805 -1025 -798 -136 222 100 -10 -492 -476 -332 313
3266 313 847 986 934 84 -197 -312 -69 377 533 234 -227 -788 -946 -493 16 373 205 -66 -542 -556 268
3287 268 608 625 1008 435 65 -115 -155 -72 260 231 -126 -759 -1021 -840 -254 283 310 70 -259 -419 -218 276
3309 276 520 918 541 193 -636 -564 -374 120 140 167 -264 -911 -768 -440 293 612 609 464 2 -166 103 228
3331 228 730 828 141 -505 -950 -499 -123 176 159 -198 -402 -751 -408 -84 578 576 513 156 -372 -164 53 465
3353 465 525 209 -187 -720 -442 -817 -51 313 133 -63 -494 -413 173 348 808 712 334 -119 -445 -569 -138
3374 -138 544 160 -142 -829 -887 -699 87 422 584 308 -183 -267 -311 264 662 720 363 -276 -606 -697 -195 -11
$$ packed form
3223E5M92K98j70n68l02J89L47M99K6l88n69q40l20P38L45K49l82%m57J9M02O43
3245C06N93J0j53l72m98K91j5M54r1m80q50k20K27O62L58j22j10m82J6J44O45
3266C13N34J39n2q50k81j15K43M46J56k99m61n61j58M53N09L57j68k71m76j4Q24
3287B68L40J7L83n73l70j80m0Q3L32k9l57o33k62J81N86N37K7k40l29j60K01M94
3309B76K44L98l77l48q29P2J90M94K0K7m31o47J43L28P33L19lj45m62j68K69J25
3331B28N02R8o87o46m45M51L76K99j7l57k04l49L43L24O62ko3l57n28K08K17M12
3353D65O0l16l96n33K78l75P66L64j80j96m31Q1N86J75M60r6l78m53l26j24M31
3374a38O82l84l02o87n8J88P86L35J62k76m91q4m4N75L98N8l57o39l30r1N02J84
$$ plain form
3396 -11 202 -4 -377 -727 -1052 -134 301 563 578 311 4 12 151 652 526 629 271 -400 -894 -418 -169
3417 -169 47 228 -309 -606 -354 -646 138 729 696 754 -19 -184 -12 416 533 684 -171 -576 -725 -862 -475
3438 -475 -319 -82 24 -413 -450 -465 -116 583 931 799 438 18 -23 -65 76 452 -37 -239 -976 -725 -787 -458
3460 -458 69 326 -64 -282 -384 -231 428 733 892 469 -78 -68 -314 -269 121 73 -49 -594 -1024 -918 -200
3481 -200 -8 170 204 23 -77 -424 -154 636 1301 842 303 -147 -624 -363 -361 -123 12 -158 -521 -1248 -499
3502 -499 152 731 863 343 -222 -287 -131 263 874 479 234 -244 -562 -623 -282 -35 384 -12 -159 -588 -371
3523 -371 -12 298 558 713 266 -94 -483 -95 218 421 130 -323 -642 -1047 -502 -179 291 217 -15 -217
3543 -217 -204 -257 390 824 910 515 30 -362 -620 -286 143 -38 -84 -394 -810 -561 22 279 474 422 33 -61
$$ packed form
3396a1K13k06l73l50l25R18M35K62J5k67l07QJ39N01j26J03l58o71m94M76K49
3417a69K16J81n37k97K52k92P84N91l3N8p73j65J72M28J17J51q55m05j49j37L87
3438d75J56K37J06m37l7j5L49O99L48j32l61m20m1m2J41L76m89k02p37K51o2L29
3460d58N27K57l90k18j02J53O59L05J59m23n47J0k46M5L90m8j22n45m30J06P18
3481b00J92J78L4j81j00l47K70P90O65m59n39m50m77K61KK38J35j70l63p27P49
3502d99O51N79J32n20n65o5J56L94O11l95k45m78l18o1L41K47M19l96j47m29K17
3523c71L59L10K60J55m47l60l89L88L13K03k91m53l19m05N45L23M70p4k32k02
3543b17J3n3O47M34Q6l95m85l92k58L34M29j81m6l10m16K49N83K57J95n2l89r4
$$ plain form
3565 -61 97 288 688 843 431 306 -308 -594 -487 -280 -26 -19 -495 -381 -652 -177 279 528 609 803 230
3586 230 -123 48 356 685 670 44 -395 -630 -729 -344 -75 29 -129 -542 -375 -394 -42 670 981 1081 401
3607 401 84 33 186 292 319 -69 -414 -801 -744 -922 -445 -90 69 -134 -251 -303 3 489 1004 1117 556
3628 556 313 -195 -450 -68 84 211 -440 -708 -879 -555 -671 364 77 183 126 -196 -137 131 768 743 681
3649 681 300 -139 -61 49 -95 -107 -86 -297 -823 -646 -655 -275 419 448 269 161 -16 193 460 661 690 334
3671 334 70 -417 -379 -318 50 210 71 -433 -472 -573 34 307 650 428 104 -227 -209 14 538 826 194
3692 194 -93 -659 -537 -353 -165 406 14 -64 -562 -414 -261 297 932 384 392 -40 -307 -124 21 120 261
3713 261 81 -697 -842 -388 -469 161 290 283 96 -55 -171 222 577 638 692 121 -253 137 -368 -20 108 90
$$ packed form
3565f1J58J91M00J55m12j25o14k86J07K07K54Pm76J14k71M75M56K49Q1J94n73
3586B30l53J71L08L29j5o26m39k35r9L85K69J04j58m13J67j9L52P12L11J00o80
3607D01l17n1J53J06K7l88l45l87N7j78M77L55J59k03j17n2L06M86N15J13n61
3628E56k43n08k55L82J52J27o51k68j71L24j16J035k87J06n7l22N9K68O37k5o2
3649F81l81m39P8J10j44j2K1k11n26J77rL80O94K9j79j08j77K09K67K01K9l56
3671C34k64m87L8O1L68J60j39n04l9j01O07K73L43k22l24l31J8K23N24K88o32
3692A94k87n66J22J84J88N71l92p8m98J48J53N58O35n48Qm32k67J83J45R9J41
3713B61j80p78j45M54q1O30J29pj87j51j16L93L55O1N4n71l74L90n05L48J28j8
$$ plain form
3735 90 -304 -724 -466 -505 125 388 225 239 -109 -187 -22 457 670 811 187 -249 -498 -608 -430 107 63 -35
3757 -35 -325 -393 -275 -31 360 575 722 278 -76 -151 127 446 330 24 -298 -868 -845 -533 87 103 -57 -114
3779 -114 -518 -407 -284 306 940 499 526 334 119 -58 252 323 136 -268 -442 -770 -610 -306 -52 217 192
3800 192 95 -396 -112 247 587 778 594 98 -160 -491 -176 138 135 129 -439 -644 -773 -677 -98 62 144 -82
3822 -82 -52 -56 225 432 653 702 362 128 -826 -403 -296 37 -4 -261 -541 -530 -586 -127 287 392 301 77 -221
3845 -221 -137 204 569 570 350 60 -413 -514 -412 -158 -72 10 -206 -383 -224 -127 132 449 653 196 -85 26
3867 26 312 261 206 380 41 -537 -545 -502 -423 142 147 238 -142 -272 11 43 486 771 164 -39 -260 -203 15 37
3891 37 255 176 -228 -270 -560 -380 203 682 5 1 -285 -152 92 180 437 418 320 -472 -261 -388 -213 -150 137
$$ packed form
3735I0l94m20K58l9O30K63j63J4l48p8J65M79K13J41o24m36k49j10J78N37m4r8
3757c5k90o8J18K44L91K15J47m44l54p5K78L19j16l06l22n70K3L12O20J6j60n7
3779a14m04J11J23N90O34m41K7j92k15j77L10P1j87m04j74l28J60L04K54K69k5
3800A92r7m91K84L59L40J91j84m96k58l31L15L14lon68k05j29R6N79J60Q2k26
3822h2L0mK81K07K21M9l40k34r54M23J07L33m1k57k80J1n6M59M14J05r1k24k98
3845b21Q4L41L65Jk20k90m73j01J02K54Q6Q2k16j77J59R7K59L17K04m57k81J11
3867B6K86n1n5J74l39n78qM3P9N65NR1l80j30K83L2M43K85o07k03k21N7K18K2
3891C7K18p9m04m2k90J80N83M79o77mk86J33K44Q8K57j9r8p92K11j27J75O3K87
$$ plain form
3914 137 -124 -283 -608 -550 141 286 324 401 341 -33 23 -73 409 487 206 -477 -631 -516 -243 -270 -295 -136 67
3937 67 -199 -432 -56 283 643 639 325 -60 -14 -260 125 623 203 -268 -498 -512 -523 -179 62 219 31 -98
3959 -98 -266 -30 250 668 624 417 290 -330 -108 -221 433 13 86 -393 -668 -588 -346 179 324 123 -14
3980 -14 -228 -115 -21 289 742 446 194 -174 -63 -383 59 261 9 -386 -564 -477 -370 212 347 53 129
4001 129 76 -189 -140 277 378 242 325 -55 -597 -451 -156 125 177 49 -203 -341 -391 -87 289 509 304 143
4023 143 17 -135 203 323 513 346 100 -285 -208 -467 -118 -66 74 -200 -111 -187 -295 207 382 440 282 -135
4045 -135 50 -75 -136 -8 397 200 -119 -440 -553 -344 253 263 282 250 -124 9 -128 294 432 377 -44 -294
4067 -294 -538 -482 57 157 180 133 -244 -228 -298 86 265 479 147 194 -91 -227 389 528 433 133 -80 -362
$$ packed form
3914A37k61j59l25N8O91J45L8P7o0l74N6r6M82P8k81o83j54J15K73k7k5J59K03
3937F7k66k33L76L39L60ml14l85M6k46L85M98m20m71k30j4j1L44K41J57j88j29
3959i8j68K36K80M18m4k07j27o20K22j13O54m20P3m79k75Q0K42N25J45k01j37
3980a4k14J13R4L10M53k96k52l68J11l20M42K02k52l95j78Q7J07N82J35k94P6
4001A29n3k65M9M17J01j36Q3l80n42J46K95K81N2j28k52j38n0L04L76K20k05j61
4023A43j26j52L38J20J90j67k46l85P7k59L49N2J40k74Q9p6j08N02J75N8j58m17
4045a35J85j25o1J28M05j97l19l21j13K09N97J0J9l2l74J33j37M22J38n5m21k50
4067b94k44N6N39J00K3m7l77J6p0L84J79K14l32M7k85j36O16J39r5l00k13k82
$$ plain form
4089 -362 -412 -348 -44 117 -10 -91 -335 -524 -357 148 587 594 2 -112 -30 35 144 387 403 -92 -502 -464 -468 -450
4113 -450 -104 208 -89 -77 -184 -414 85 369 402 363 151 -250 -120 -54 249 -39 -82 -465 -527 -412 -162 -48
4135 -48 465 300 -71 -238 -2 10 283 366 540 155 -199 -223 -92 46 103 87 -55 -244 -411 -437 -16 505
4157 505 292 166 59 -135 -80 387 225 379 337 -100 -291 -553 -135 -4 218 -62 -274 -454 -244 -56 166
4178 166 208 452 142 -136 -291 192 19 313 423 37 -193 -169 -391 -60 197 -125 -25 -92 -282 -259 138
4199 138 372 235 131 75 -156 -80 87 359 292 265 -352 -469 -352 -217 115 53 49 75 -244 -165 195 588 115
4222 115 445 144 -107 -264 -133 -183 290 21 -335 -345 -401 -395 162 309 400 34 -68 54 -7 374 236 512
4244 512 317 -211 -488 -264 -127 235 103 242 -57 -161 -213 -168 -36 397 188 -16 -232 -109 109 268 270
$$ packed form
4089c62n0O4L04J61j27q1k44j89J67N05M39Pn92j14Q2O5J09K43J6m95m10L8mJ8
4113d50L46L12k97J2j07k30M99K84L3l9k12m01J30O6L03k88m3l83o2J15K50J14
4135d8N13j65l71j67K36J2K73Q3J74l85l54k4J31J38N7j6j42j89j67k6M21N21
4157E05k13j26j07j94N5M67j62J54m2m37j91k62M18J31K22k80k12j80K10J88K22
4178A66M2K44l10k78j55M83j73K94J10l86k30K4k22L31K57l22J00o7j90K3L97
4199A38K34j37j04n6k31P6J67K72o7k7o17j17J17J35L32o2mK6l19P9L60L93m73
4222A15L30l01k51j57J31n0M73k69l56j0n6ON57J47R1l66j02J22o1L81j38K76
4244E12j95n28k77K24J37L62j32J39k99j04n2M5J32M33k09k04k16J23K18J59K
$$ plain form
4265 270 153 104 -203 -385 -412 -147 271 231 -131 -172 -581 -31 496 420 513 450 19 -51 -205 -95 -93 257 66
4288 66 -40 -271 -274 -264 -97 276 63 73 42 -7 -71 335 502 364 -47 -315 -308 -237 194 -82 -167 -189 -313 -394 -437
4313 -437 28 354 272 43 -186 -88 -36 246 411 414 251 -300 -242 -267 -233 185 -31 -61 -465 -300 -348 79 225
4336 225 406 206 15 -13 -24 354 254 368 183 -176 -239 -504 -58 -152 168 -2 -214 -91 -332 -146 217
4357 217 449 452 483 -25 80 -31 -48 213 308 -1 -363 -527 -269 -133 117 305 113 -157 -300 -42 67 297
4379 297 321 27 61 -196 -117 -178 249 13 375 -3 -334 -314 -254 -87 181 190 -125 -9 219 195 302 434 280
4402 280 118 -300 -324 -38 -36 -45 -13 -317 -291 -414 -60 167 248 247 243 -62 -81 -95 270 270 234 131 59 -268 -157 -138
4428 -138 -70 115 -157 -222 -153 -139 -86 124 362 158 189 79 -7 23 256 11 -26 -74 -364 -487 -146 -257 -107
$$ packed form
4265B70j17m9l07j82k7K65M18m0l62m1m09N50N27p6R3o3m31p0j54J10KL50j91
4288F6j06k31lJ0J67L73k13J0l1m9o4M06J67j38m11k68PP1M31k76q5k2j24q1m3
4313d37M65L26q2k29k29R8N2K82J65Lj63n51N8k5L4M18k16l0m04J65m8M27J46
4336B25J81k00j91k8j1L78j00J14j85l59o3k65M46r4L20j70k12J23k41J86L63
4357B17K32LL1n08J05j11j7K61R5l09l62j64K58J36K50J88j92k70j43K58J09K30
4379B97K4k94L4k57P9o1M27k36L62l78l31K0O0J67K68Rl15J16K28k4J07J32j54
4402B80j62m18k4K86KrL2l04K6j23L54K27Q1jml05j9j4L65%l6j03p2l27J11J9
4428a38O8J85k72o5O9J4N3K10K38k04L1j10q6L0K33k45l7m8k90j23L41j11J50
$$ plain form
4451 -107 108 221 -340 -50 -67 -150 297 204 155 -88 -129 -332 185 -115 156 -49 -187 -285 -213 -208 60 112 27 25
4475 25 -92 -41 164 338 349 389 273 -261 -139 -167 94 -57 -180 -43 -305 -313 -222 -282 176 534 175 54 -76
4498 -76 324 226 346 311 -122 96 -241 -351 -70 -40 319 -51 -2 -242 -460 -335 -16 187 321 244 201 64
4520 64 -1 511 250 216 -57 -403 -529 -427 -345 -124 -47 -318 -244 -43 -13 181 286 368 263 -4 -139 -107 -83
4543 -83 233 57 -7 -152 -293 -601 -234 -125 383 243 13 -36 -244 232 166 373 341 195 -120 -290 -119 -65
4565 -65 169 46 114 -285 -234 -149 -105 146 369 349 -53 -164 -194 46 241 318 96 -223 4 -138 -171 -180 -15 346
4589 346 -66 -292 -264 -130 216 39 132 133 -94 -203 141 214 103 355 156 -230 -72 -248 22 75 -15 -9 -306
4612 -306 -132 -73 170 264 606 261 -95 -104 189 211 229 147 -17 -38 -249 -361 -43 -36 340 257 48 -190 -243 194
$$ packed form
4451a07K15J13n61K90j7q3M47r3m9k43m1k03N17l00K71k05j38r8P2NK68N2q5k
4475B5j17N1K05J74J1M0j16n34J22k8K61j51j23J37k62qR1o0M58L58l59j21j30
4498g6M00r8J20l5m33K18l37j10K81L0L59l70M9k40k18J25L19K03J34p7m3j37
4520F4o5N12k61l4k73l46j26J02Q2K21P7k71P4K01L0J94J05Q2j05k67j35L2K4
4543h3L16j76o4j45j41l08L67J09N08j40k30m9k08M76o6K07l2j46l15j70J71N4
4565f5K34j23O8l99N1Q5M4K51K23k0m02j11l0K40J95P7k22l19K27j42l3rJ65L61
4589C46m12k26K8J34L46j77R3Jk27j09L44P3j11K52j99l86J58j76K70N3r0Ok97
4612c06J74N9K43R4L42l45l56rK93K2J8q2j64k1k11j12L18PL76q3k09k38n3M37
$$ plain form
4636 194 270 409 451 -57 -46 -164 -118 45 173 136 23 -609 -420 -313 -170 5 450 157 4 -112 -28 261
4658 261 293 618 237 -75 -276 -425 -439 28 76 -92 -207 -370 -258 -161 -20 110 352 118 214 84 91 341
4680 341 476 157 118 -432 -242 -120 56 -54 -122 -145 -432 -293 -20 231 439 314 -9 4 90 -21 271 299
4702 299 294 3 -195 -482 -377 -225 -26 61 94 -345 -323 -184 91 345 512 373 226 -134 146 244 205 438
4724 438 186 15 -425 -479 -216 -7 -14 -13 -55 30 -180 11 193 507 442 136 39 -58 -202 45 116 40 -57 -239
4748 -239 -483 52 -299 220 365 268 46 -220 -31 163 183 256 213 97 -117 -416 -188 -87 63 1 -288 -84
4770 -84 -124 27 -185 132 108 105 -97 -171 67 -95 199 330 7 -179 -168 -498 188 232 -89 130 -165 -340 -113
4793 -113 -119 50 386 237 234 -136 -96 28 -8 210 46 -153 -288 -352 -229 -104 139 -42 153 -230 -49 104
$$ packed form
4636A94P6J39M2n08J1j18M6J63J28l7j13o32J89J07J43J75M45k93j53j16Q4K89
4658B61L2L25l81l12k01j49j4M67M8j68j15j63J12R7J41J30K42k34R6j30PK50
4680C41J35l19l9n50J90J22J76j10o8k3k87J39K73K51K08j25l23J3Q6j11K92K8
4702B99nk91j98k87J05J52J99Q7L3m39K2J39K75K54J67j39j47l60K80R8l9K33
4724D38k52j71m40n4K63K09pJm2Q5k10J91J82L14o5l06r7r7j44K47P1p6r7j82
4748b39k44N35l51N19J45r7k22k66J89J94K0P3m3j16k14k99K28J01J50o2k89K04
4770h4m0J51k12L17k4lk02p4K38j62K94J31l23j86J1l30O86M4l21K19k95j75K27
4793a13oJ69L36j49ll70M0J24l6K18j64j99j35o4J23J25K43j81J95l83J81J53
$$ plain form
4815 104 337 372 305 33 -9 -120 -107 -53 -15 245 -99 -499 -419 -214 -28 -196 249 312 93 16 -34 155 439
4838 439 285 91 186 -217 -22 -457 -169 266 -46 -86 -548 -306 -12 0 368 114 310 -73 -19 -4 315 221
4860 221 113 -66 -16 -59 -251 73 4 -12 75 -267 -328 -50 -87 201 229 371 285 6 -174 -7 315 432 -170
4883 -170 68 -358 -256 -130 -286 -317 -60 -128 -155 -252 -159 265 207 578 203 36 110 15 37 410 186 -138 -380
4906 -380 -253 -458 -19 -423 61 151 -281 22 -73 239 414 392 -8 72 -102 -325 -38 -176 -22 82 -324
4927 -324 -11 -149 9 -73 301 -110 -167 -119 -7 -11 182 157 553 112 -2 -29 -269 4 62 51 -102 -365 -4
4950 -4 -272 -253 -41 432 56 86 133 -59 127 253 328 51 -32 -221 23 -221 -80 137 2 -34 -94 -382 -7
4973 -7 96 144 360 272 -66 -272 113 80 329 -86 -9 -255 -437 -304 -44 168 164 28 -101 -22 -166 20 -32
$$ packed form
4815A04K33L5o7k72m2j11J3N4L8K60l44m00Q0K05J86j68M45O3k19p7n0J89K84
4838D39j54j94R5m03J95m35K88M35l12m0m62K42K94J2L68k54J96l83N4J5L19r4
4860B21j08j79N0m3j92L24o9j6Q7l42o1K78l7K88K8J42q6k79j80J67L22J17o02
4883a70K38m26J02J26j56l1K57o8k7r7R3M24n8L71l75j67P4r5K2L73k24l24k42
4906c80J27k05M39m04M84R0m32L03r5L12J75k2m00Q0j74k23K87j38J54J04m06
4927c24L13j38J58q2L74m11n7M8J12mJ93k5L96m41j14k7k40K73N8j1j53k63L61
4950dk68J9K12M73l76L0M7j92J86J26P5k77q3j89K44k44J41K17j35l6o0k88L75
4973gJ03M8K16q8l38k06L85l3K49m15P7k46j82J33K60K12mj36j29P9j44J86n2
$$ plain form
4996 -32 243 121 -91 -244 -219 -302 -101 70 130 70 -148 142 -80 175 337 158 176 223 -145 -131 46 295 59
5019 59 -31 -95 4 -119 154 -22 -108 -87 9 -75 -348 -9 164 213 267 30 -134 -181 262 308 319 233 -463 -284 -371
5044 -371 -212 -288 395 -161 7 -198 -87 31 45 324 16 70 -72 -49 -150 243 196 -16 -115 -122 -294 -198 -137
5067 -137 -61 -15 219 -130 -190 8 50 193 247 181 -11 -111 103 -56 38 118 224 12 -359 -279 -192 -35 192
5090 192 114 257 -252 -28 -122 -29 -4 288 -168 -262 -191 105 -168 48 254 -24 -105 -186 -285 -85 101 81 74 -80
5114 -80 212 86 377 -13 278 164 -187 -147 -85 -195 -7 135 -94 -66 -175 -84 11 -7 234 -27 -30 136 -82
5137 -82 -159 21 251 125 -6 -264 -228 -217 132 251 -69 77 109 -321 3 163 279 209 83 -197 -266 -57
5159 -57 212 -103 152 -108 13 -220 -189 -153 -112 76 216 45 50 -128 -127 353 139 225 182 -222 -396 -254 -153
$$ packed form
4996c2K75j22k12j53K5q3K01J71O0o0k18K90k22K55J62j79J8M7l68J4J77K49k36
5019E9r0o4R9j23K73j76q6K1R6q4k73L39J73M9N4k37j64m7M43M6J1q6o96J79q7
5044c71J59p6O83n56J68k05J11J18J4K79l08N4j42K3j01L93m7k12r9pj72R6O1
5067a37P6M6K34l49o0J98M2J43N4o6j92j00K14j59R4Q0J06k12l71Q0Q7J57K27
5090A92p8J43n09K24r4R3K5K92m56r4P1K96k73K16K06k78q1q1r9K00J86k0pj54
5114h0K92j26K91l90K91j14l51M0O2j10J88J42k29K8j09R1R5j8K41k61lJ66k18
5137h2p7J80K30j26j31k58L6J1L49J19l20J46L2m30L24J60J16p0j26k80o9K09
5159e7K69l15K55k60J21k33L1L6M1J88J40j71Nj78JM80k14Q6m3m04j74J42J01
$$ plain form
5182 -153 137 43 10 -160 -245 -222 7 209 78 174 70 31 -87 -3 -85 347 -117 -7 -150 -119 -216 -279 -28 49
5206 49 60 -329 -76 -153 127 151 283 248 93 -143 154 35 189 -1 -89 -245 -400 -376 -84 -92 232 -34 17
5229 17 -136 -145 64 195 151 -110 -150 -37 -135 -8 15 102 -51 -213 -170 -522 111 20 356 88 -266 -157 -68 106
5253 106 61 298 488 -135 -260 6 -147 -42 163 -108 -139 -319 -133 -188 114 -61 109 156 99 -2 -184 -75
5275 -75 100 264 -15 -169 -18 -202 66 305 47 81 -91 -150 22 58 126 73 180 -31 -254 -120 -160 278
5297 278 119 46 -106 -336 -119 71 -202 148 -217 -33 1 122 187 -85 142 82 -39 39 239 -140 68 185
5319 185 -75 -63 -315 -189 -250 6 16 78 109 15 -37 -1 107 438 282 -137 157 -219 -362 -122 -137 -51 138
5342 138 -194 -349 -216 104 -137 -42 -13 22 49 -93 -97 175 32 427 -139 84 -172 -120 220 -33 182 7
$$ packed form
5182a53K90r4l3j70q5K3K29K02j31R6j04l9j18Q4q2M32m64J10j43L1r7o3K51P7
5206D9J1l89K53p7K80K4J32l5j55k36K97j19J54j90q8j56j55K4K92qL24k66N1
5229A7j53rK09J31m4k61m0J13r8J27K3Q7j53j62M3l52O33r1L36k68l54J09Q9J74
5253A06m5K37J90o23j25K66j53J05K05k71l1j80J86n5L02j75J70M7n7j01j82J09
5275g5J75J64k79j54J51j84K68K39k58L4j72n9J72L6O8n3J07k11k23J34m0M38
5297B78j59p3j52k30K17J90k73L50l65J84L4J21O5k72K27o0j21P8K00l79K08J17
5319A85k60J2k52J26o1K56J0O2L1r4n2L6J08L31j56m19K94l76j43K40j5Q6J89
5342A38l32j55J33L20k41R5K9L5K7j42mK72j43L95n66K23k56N2L40k53K15j75
$$ plain form
5364 7 -204 -160 -124 165 381 196 272 169 63 -3 111 155 273 -225 -106 -2 -329 -189 -85 -23 -309 -33 -74
5387 -74 294 20 192 238 243 262 212 -240 79 320 22 -115 -453 -3 -569 -289 -82 -109 53 43 -51 157 130
5410 130 16 31 198 18 71 -5 -298 92 -13 101 -65 -123 -170 -393 21 49 71 95 22 114 64 -109 127 32
5434 32 243 79 166 -313 -59 -145 106 179 -33 60 -184 43 108 122 257 3 29 176 -107 -15 339 41 -39
5457 -39 274 -78 -199 156 -101 -141 -12 -185 -137 -131 135 -80 227 87 -196 -94 -42 -181 -288 183 206 -110
5479 -110 -212 -397 -236 -75 343 179 150 -76 -80 -49 -126 261 150 -21 -153 -484 -94 -102 368 49 -237 -168 -35
5502 -35 38 -237 -175 281 174 245 17 -48 -190 136 26 108 -33 109 -166 -171 -55 -62 -150 -21 27 -281 181 78
5526 78 187 144 107 84 150 -204 119 100 150 -329 106 -286 -261 -41 -104 343 21 86 4 -198 103 291 190 114
$$ packed form
5364Gk11M4L6K89K16j85P6j03j06o6J14M4J18m98J19J04l27J40J04O2k86K76m1
5387g4L68k74J72M6NJ9n0m52L19K41k98j37l38M50n66K80K07k7J62j0r4K08k7
5410A30j14J5J67j80N3p6k93L90j05J14j66n8m7k23M14K8K2K4p3R2n0j73K36r5
5434C2K11j64Q7m79K54q6K51P3k12R3k44K27O5J4J35k54K6J47k83R2L54k98q0
5457c9L13l52j21L55k57m0J29j73M8OK66k15L07j40k83J02N2j39j07M71K3l16
5479a10j02j85J61J61M18j64k9k26mL1p7L87j11j71j32l31L90qM70l19k86O9J33
5502c5P3k75O2M56j07P1k28o5j42L26j10Q2j41J42k75nJ16pq8J29M8l08M62j03
5526G8J09m3l7k3O6l54L23j9N0m79M35l92K5K20o3M47l22O5q2k02L01J88j01p6
$$ plain form
5550 114 -93 -32 40 75 171 179 -49 108 -304 -390 -187 -207 219 258 16 -18 -99 -59 -68 172 101 178 -60 -70 -167 75
5576 75 134 220 76 -359 -235 47 -292 244 80 -110 -31 377 -35 134 -141 169 268 -61 -126 -195 -105 -207 -5
5599 -5 195 -38 -155 -38 -180 87 63 113 398 -105 167 81 324 293 116 -25 159 -164 -81 -34 -180 -83 222
5622 222 99 -265 -48 -184 90 83 24 278 -276 244 51 232 -13 28 -9 -143 -310 -185 88 85 288 -132
5644 -132 -49 7 -96 178 47 217 211 -181 3 58 -75 172 7 76 143 -300 -9 127 32 66 -222 -195 4
5667 4 -190 -37 252 169 218 107 -18 -61 300 -91 207 -127 120 -97 -74 -106 -87 206 202 129 -89 -183 27 75
5691 75 -160 -43 45 -106 -174 -187 -165 -147 139 -56 -180 -29 101 117 159 -13 170 -10 -125 144 105 -25 255
5714 255 39 -40 -99 -377 -154 127 -94 175 -259 282 -139 85 402 -12 304 245 -39 -15 224 -57 -10 84
$$ packed form
5550A14k07O1P2L5R6Qk28J57m12q6K03k0M26L9k42l4q1M0rK40p1P7k38j0r7K42
5576G5N9Q6j44m35J24K82l39N36j64j90P9M08m12J69k75L10R9l29o5o9R0j02K02
5599eK00k33j17J17j42K67k4N0K85n03K72q6K43l1j77j41J84l23Q3M7j46R7L05
5622B22j23l64K17j36K74pn9K54n54N20j93J81k45M1l7j34j67J25K73lK03m20
5644a32Q3N6j03K74j31J70ol92J84N5j33K47j65O9O7m43K91J36r5L4k88K7J99
5667Dj94J53K89q3M9j11j25m3L61l91K98l34K47k17K3l2J9K93mp3k18r4K10M8
5691G5k35J17Q8j51o8j3K2J8K86j95j24J51J30J6M2j72J83j80j15K69l9j30K80
5714B55k16p9n9k78K23K81k21K69m34N41m21K24L17m14L16n9k84K4K39k81M7R4
$$ plain form
5736 84 58 1 71 -128 -143 -6 261 -10 61 -204 -79 231 89 268 328 99 -194 -455 -138 59 -81 115
5758 115 -319 -30 -202 -59 -51 77 28 -152 256 144 220 69 34 135 348 -258 -183 111 104 89 -80 -15 -38 -365
5782 -365 -77 11 -39 38 203 287 186 16 89 395 187 -113 -71 -457 -29 194 -25 66 -136 -39 -38 -162 22
5805 22 121 222 157 -174 201 37 -92 0 166 145 91 -68 129 -232 57 112 44 95 -136 -27 -159 186 42
5828 42 140 31 83 -21 -86 132 81 -21 -84 -227 -243 -229 -208 -7 175 35 -130 -11 192 -95 202 239 -65
5851 -65 181 -78 -53 -148 -135 -299 178 74 181 -7 58 213 -155 538 284 30 -194 -16 28 260 44 323
5873 323 54 24 -198 47 -274 -261 -48 -103 57 -71 -116 143 279 100 273 -89 12 -73 212 -59 57 -47
5895 -47 -19 -247 -82 -42 -24 -128 -83 18 -104 -18 -28 191 169 128 76 -55 -65 -181 -93 317 134 -160 -226 -160 -116
$$ packed form
5736H4k6n7P0j99j5J37K67k71P1k65J25L10j42J79O0k29k93k61L17J97j40J96
5758A15m34K89j72J43QJ28m9j80M08j12P6j51l5J01K13o06P5K94pj5j69O5k3l27
5782c65K88Q8n0P7J65Q4j01j70P3L06k08l00M2l86M28K23k19R1k02R7Jj24J84
5805B2R9J01o5l31L75j64j29R2J66k1n4j59J97l61K89N5o8N1k31J09j32L45j44
5828D2R8j09N2j04o5K18n1j02o3j43j6J4K1K01J82j40j65J19K03k87K97L7l04
5851f5K46k59K5r5J3j64M77j04J07j88O5J55l68O93k54k54k24J78M4K32k16K79
5873C23k69l0k22K45l21J3K13n5J60j28m5K59J36j79J73l62J01q5K85k71J16j04
5895d7K8k28J65M0J8j04M5J01j22Q6j0K19k2m1n2j31j0j16Q8M10j83k94o6O6M4
$$ plain form
5920 -116 70 112 -84 -37 -222 2 -126 -47 304 123 -32 294 -168 -70 95 138 -67 -9 -168 -364 -33 -67
5942 -67 65 131 -140 -207 236 -5 195 50 428 -106 120 -66 27 -47 219 135 90 -297 -462 -222 -186 -93 -87 31
5966 31 -5 -216 104 256 -23 277 -231 249 -112 14 -198 -400 174 52 -86 -303 -246 -103 -291 155 204
5987 204 -225 -109 -213 -31 173 138 -97 43 -117 -159 -99 -237 -148 -99 127 64 -259 -75 -100 57 -198 434
6009 434 235 -133 97 118 -101 -114 169 69 -321 25 -142 116 113 236 180 -161 -212 258 97 261 99 206
6031 206 -179 72 -126 -261 73 -13 -93 -92 -299 42 66 150 210 167 190 -26 307 -95 26 38 12 156 -40 -163
6055 -163 -198 -215 171 124 288 -166 -256 117 -236 -23 140 30 90 -108 151 179 59 130 -90 83 -86 -180 148
6078 148 -158 -145 -59 -139 -156 -195 -2 -13 168 17 52 -11 31 166 274 269 45 12 -5 -116 -219 -113 19 140
$$ packed form
5920a16J86M2j96M7j85K24j28P9L51j81j55L26m62R8J65M3k05N8j59j96L31l4
5942f7J32O6k71o7M43k41K00j45L78n34K26j86R3p4K66q4m5l87j65K40L6R3OJ18
5966C1l6k11L20J52k79L00n08M80l61J26k12k02N74j22j38k17N7J43j88M46M9
5987B04m29J16j04J82K04l5k35J40j60m2O0j38Q9M9K26o3l23J84k5J57k55O32
6009D34j99l68K30K1k19j3K83j00l90L46j67K58lJ23n6l41n1M70j61J64j62J07
6031B06l85K51j98j35L34q6q0Jk07L41K4Q4O0m3K3k16L33m02J21J2k6J44j96j23
6055a63l5j7L86m7J64m54r0L73l53K13J63j10O0j98K59K8j20P1k20J73j69r4L28
6078A48l06J3Q6q0j7l9J93j1J81j51L5o3M2J35J08nk24l3j7j11j03J06J32J21
$$ plain form
6102 140 67 -105 -79 -28 52 -200 264 243 -289 -226 -29 -148 40 -54 -137 -82 -180 -69 23 232 -57 201 -83 248
6126 248 23 160 -4 108 224 203 73 -164 19 -192 153 -31 232 -75 -140 -61 235 -100 81 98 138 199
6148 199 30 413 48 15 -278 -274 -12 -107 -241 -120 -162 25 -208 -24 21 54 105 150 253 218 90 108 163 53
6172 53 -190 -4 91 71 -90 -221 -49 20 142 33 -50 150 12 271 -68 -30 16 -35 -6 77 -152 -149 137 2
6196 2 83 -67 -39 -20 -109 202 85 90 -1 71 163 98 298 -271 25 83 68 208 143 -124 324 -38 -74 -49 -289 237
6222 237 45 304 -97 -204 15 -141 -59 124 -70 -294 -137 -161 -45 -30 66 -102 -65 -144 -89 -64 -11 251 367
6245 367 94 102 -116 -60 270 49 48 20 -212 -29 8 191 -141 124 211 -137 -32 -131 64 180 162 -137 119
6268 119 49 118 -214 29 102 -2 13 -203 -212 -149 -20 -59 175 -74 57 -65 -44 147 -98 85 12 138 142 -133
$$ packed form
6102A40p3j72K6N1Q0k52M64k1n32O3J97j19J88r4q3N5r8J11R2K09k89K58k84L31
6126B48k25J37j64J12J16k1j30k37J83k11L45j84K63l07o5P9K96l35J81J7M0O1
6148A99j69L83l65l3k93MK62r5j34J21m2J87k33J84M5L3N1M5J03l5j28J8N5j10
6172E3k43J86R5k0j61j31J72O9J22j09q3K00j38K59l39L8M6n1K9Q3k29LK86j35
6196BQ1j50K8J9q9L11j17Nr1P2R2o5K00n69K96N8j5J40o5k67M48l62l6K5k40N26
6222B37j92K59m01j07K19j56Q2J83j94k24J57k4J16J5R6j68L7p9N5K5N3K62J16
6245C67k73Qk18N6L30k21jk8k32J83L7J83l32K65Q7l48J05r9J95J16j8k99K56
6268A19p0O9l32K43P3j04J5k16rO3J29l9K34k49J31j22K1J91k45J83p3J26Mk75
$$ plain form
6292 -133 7 104 119 -29 -12 -164 -236 -233 -128 -55 56 169 -54 -45 86 276 -206 66 -236 -128 46 -226 2
6315 2 275 -391 -253 50 -200 -177 -10 4 -18 28 8 219 -14 130 -43 249 55 -68 -100 53 -54 93 -59
6338 -59 219 173 -18 8 317 -17 143 23 -54 143 -38 19 150 90 -73 8 -182 -181 -145 -131 -118 102 199 -193
6362 -193 -16 140 -86 -22 210 116 -135 78 -144 169 294 -195 63 -148 -330 166 -240 60 -142 120 37
6383 37 -155 -12 -55 149 203 -114 47 -72 -89 52 -131 50 -148 108 -107 -230 -104 -13 53 25 131 111 -121
6406 -121 125 -82 89 -253 213 105 99 -63 -67 79 -14 136 24 -114 -16 46 40 176 25 43 -207 -214 101 -153
6430 -153 257 -72 -203 -48 -152 -160 18 -4 31 86 70 76 11 265 -46 76 -204 39 -160 -2 -178 27 -52
6453 -52 -225 -156 -159 56 16 148 -50 29 -64 -62 -68 95 143 -75 46 230 -262 -319 -393 -21 -149 45 -103 -88 19
$$ packed form
6292a33J40R7J5j48J7j52p2LJ05P3J11J13k23RJ31J90m82K72l02J08J74k72K28
6315BK73o66J38L03k50K3J67J4k2M6k0K11k33J44j73K92j94j23l2J53j07J47j52
6338e9K78m6j91K6L09l34J60j20p7J97j81N7J31o0j63Q1j90JL6J4J3K20R7l92
6362a93J77J56k26O4K32r4k51K13k22L13J25m89K58k11j82M96m06L00k02K62q3
6383C7j92J43m3K04N4l17J61j19j7J41j83J81j98K56k15j23J26R1O6k8J06k0k32
6406a21K46k07J71l42M66j08oj62mJ46r3J50j12j38R8O2oJ36j51J8k50pL15k54
6430a53M10l29j31J55j04qJ78k2L5N5j6Oo5K54l11J22k80K43j99J58j76K05p9
6453e2j73O9lK15m0J32j98P9r3KoJ63M8k18J21J84m92n7p4L72j28J94j48J5J07
$$ plain form
6478 19 -124 -131 -267 -25 -36 146 -92 -104 160 206 -90 125 -12 -195 -206 -46 -110 368 130 -19 139 -80 1
6501 1 161 106 -119 405 48 126 39 -17 212 171 330 62 -216 -145 29 112 -24 106 -234 251 119 105 10 -1
6525 -1 126 57 101 76 97 -123 177 -308 -12 28 -23 133 -79 245 6 197 -184 -100 26 -9 13 253 -37 19
6549 19 88 -194 140 -45 6 -29 -255 170 -98 1 13 -73 -151 78 -29 -250 213 126 -8 86 97 -76 -304 -191
6573 -191 -78 8 -49 142 -8 -79 -36 142 -4 225 -12 -249 62 -260 139 25 -50 105 22 -284 129 -77
6595 -77 92 200 215 -165 -146 -65 133 168 289 316 167 112 -37 -315 173 65 -58 -111 -261 160 188 15 286
6618 286 110 -56 317 -78 41 29 227 -166 5 -43 92 -9 130 168 243 -223 -58 -172 116 121 0 -31
6640 -31 86 86 17 -114 -95 139 2 143 -20 -54 -43 38 30 -197 -146 -185 -277 -190 -1 137 -151 211 -35 184 208
$$ packed form
6478A9j43pj36K42j1J82k38j2K64M6k96K15j37j83j1J60o4M78k38j49J58k19Q1
6501AJ60n5k25N24l57P8q7n6K29m1J59k68k78P1J74Q3j36J30l40M85j32j4r5j1
6525aJ27o9M4k5K1k20L00m85K96M0n1J56k12L24k39J91l81Q4J26l5K2K40k90N6
6549A9O9k82L34j85N1l5k26M25k68R9J2q6p8K29j07k21M63q7j34R4J1j73k28J13
6573a91J13Q6n7J91j50p1M3J78j46K29k37k37L11l22L99j14p5J55q3l06M13k06
6595g7J69J08J5l80J9Q1J98L5J21K7j49n5j49k78M88j08j23n3j50M21K8j73K71
6618B86j76j66L73l95J19j2J98l93J71m8J35j01J39L8P5m66J65j14K88Nj21l1
6640c1J17%o9j31J9K34j37J41j63l4J1Q1qk27N1l9r2Q7J89J38k88L62k46K19K4
$$ plain form
6665 208 276 -54 207 2 20 -159 -241 -15 68 -188 -94 26 -4 -75 -94 161 107 231 -159 -165 157 -173 -5 107
6689 107 111 -7 -155 -333 -26 -236 10 240 128 181 5 -4 195 -41 293 105 330 -283 197 -83 -116 -26
6711 -26 -283 86 -109 -148 -313 36 21 -68 -113 -47 -60 68 -283 154 57 45 37 -54 -31 -60 74 24 58 -319 -97
6736 -97 -85 77 -405 267 -8 -87 26 -176 -56 161 -63 10 -556 -117 -37 12 207 172 -80 -163 -191 -15 -7 40
6760 40 72 144 42 255 -160 -111 187 135 7 -14 -52 -67 -218 -291 -154 177 198 3 -1 37 -127 -27 56 72 -186
6785 -186 -44 -3 -154 1 72 -237 -175 -108 -253 -105 -5 8 -114 91 57 31 -200 328 -1 177 93 285 23
6808 23 -112 -200 -135 13 -65 -28 -119 -76 -166 -147 233 -193 51 -139 -119 -50 261 24 3 -201 7 -143 161 78
6832 78 -2 57 212 -219 -96 193 -257 -4 -19 132 -73 -82 54 -9 -61 -127 77 -34 -356 -106 157 131 35 15
$$ packed form
6665B08O8l30K61k05J8j79q2K26Q3k56R4J20l0p1j9K55n4J24l90oL22l30J68J12
6689A07Mj18j48j78L07k10K46K30j12N3j76rJ99k36L34j88K25o13M80k80l3R0
6711b6k57L69j95l9j65L49j5q9m5O6j3J28l51M37r7j2qr1K3k9J34n0L4l77K22
6736i7J2J62m82O72k75p9J13k02J20K17k24P3n66M39Q0M9J95l5k52q3k8J76QM7
6760D0L2P2j02K13m15M9K98n2j28k1l8j5j51p3J37L31K1j95mL8j64J00Q3J6k58
6785a86J42M1j51J55P1l09O2O7j45J48J00J3j22K05l4k6k31N28l29J78q4J92k62
6808B3j35q8O5J48p8L7r1M3r0J9L80m26K44j90K0O9L11k37k1k04K08j50L04q3
6832G8q0N9J55m31J23K89m50K53j5J51k05rJ36o3n2o6K04j11l22K50K63k6r6k0
$$ plain form
6856 15 -83 -122 -14 85 81 78 220 66 70 -80 -410 -185 -25 -267 21 -166 -332 -38 -140 90 266 -63 -122 -181
6880 -181 -57 -73 -78 269 91 -37 36 -63 -91 -71 -392 86 22 -12 -126 -72 17 111 87 -36 -111 -56 328 167 131
6905 131 -79 122 -113 107 -87 16 325 -89 -12 -112 23 -249 -52 112 128 86 -114 -17 175 66 70 153
6927 153 -133 -39 128 68 64 -21 -219 47 93 -185 -5 -36 120 -153 -42 -237 100 131 301 101 -38 -173 -202
6950 -202 23 -272 44 -50 508 -41 -85 53 -46 176 51 49 0 -84 78 -176 141 59 224 -76 -51 -83 -154 -75
6974 -75 110 -62 -21 -307 245 -23 82 52 -34 239 -4 57 -86 159 -23 69 -184 -95 -331 -50 -110 -15 -116
6997 -116 26 33 -81 244 -8 -37 -75 50 67 -96 -220 -87 71 72 -65 -17 -12 -21 -36 -141 68 127 337 153 -100
7022 -100 231 103 180 44 -46 -22 -107 7 -117 -28 176 132 74 185 90 129 45 132 157 195 42 9 -226 -94 247
$$ packed form
6856A5r8l9J08R9mlJ42j54Mj50l30K25J60k42K88j87j66K94j02K30J76l29n9n9
6880a81J24j6nL47j78j28P3r9k8K0l21M78o4l4j14N4Q9R4k4j23p5N5L84j61l6
6905A31k10K01k35K20j94J03L09m14P7j00J35k72J97J64J6m2k00R7J92j09MQ3
6927A53k86R4J67o0mq5j98K66M6k78J80l1J56k73J11j95L37L1J70k00j39j35k9
6950b02K25k95L16r4N58n49m4J38r9K22j25km9q4J62k54L17q2J65l00K5l2p1P9
6974g5J85j72M1k86N52k68J05l0q6K73k43O1j43K45j82R2k53Q9k36K81o0R5j01
6997a16J42Pj14L25k52k9l8J25J7j63j24J33J58Jj37M8Nrj5j05K09N9K10j84k53
7022a00L31j28P7j36r0K4q5J14j24Q9K04m4n8J11r5L9q4Q7K5L8j53l3k35J32L41
$$ plain form
7047 247 -22 -32 -73 -25 -175 -96 -62 -152 9 139 54 -44 77 32 -34 340 25 -244 73 -133 390 183 125 -104
7071 -104 12 -350 34 68 3 34 -171 416 294 32 83 -13 134 -153 12 25 -82 205 -61 29 -155 -3
7093 -3 -171 -275 -47 130 -119 81 -240 -10 -97 -34 -290 101 139 30 4 45 58 98 319 228 0 -43 25 251
7117 251 243 50 55 -78 142 -77 -181 -131 233 55 5 3 -274 -380 -89 113 68 -55 -2 -235 -108 -35 -149 196
7141 196 79 149 -84 -255 -173 98 225 93 -85 -96 -137 -25 -160 97 287 -68 57 42 146 -87 103 -138
7163 -138 30 41 175 -44 -63 111 -54 -17 -193 -104 -2 2 -177 -198 95 109 26 -131 117 -79 244 -40 19
7186 19 -57 61 -324 -185 421 -22 -308 -191 33 -5 -12 -157 176 -11 16 -99 -17 -154 13 166 42 28 156
7209 156 -6 -90 206 163 32 -36 225 32 21 -40 84 160 205 -25 130 -18 217 87 97 -90 27 10 -80
$$ packed form
7047B47k69j0m1M8j50P9L4r0J61J30q5r8J21m5o6L74l15k69L17k06N23k07n8k29
7071a04J16l62L84L4o5L1k05N87j22k62N1r6J47k87J65J3j07K87k66R0j84J52
7093cj68j04K28J77k49K00l21K30q7O3k56L91L8j09k6M1J3M0K21r1k28m3O8K26
7117B51qj93Nj33K20k19j04N0L64j78n0kk77j06K91K02m5j23N3k33J27P3j14L45
7141A96j17P0k33j71Q2K71J27j32j78j1m1J12j35K57J90l55J25j5J04k33J90k41
7163a38J68J1J34k19j9J74j65L7j76Q9J02Mj79k1K93J4q3j57K48j96L23k84N9
7186A9p6J18l85J39O06m43k86J17K24l8pj45L33j87K7j15Q2j37J67J53j24j4J28
7209A56j62q4K96m3j31o8K61j93j1o1J24P6M5k30J55j48K35j30J0j87J17j7r0
$$ plain form
7232 -80 220 156 -13 14 -172 -303 -114 -182 -25 -132 68 46 107 48 -61 39 -102 150 164 -139 -153 -148 77 77
7256 77 164 -173 -8 -81 58 129 -129 298 52 -145 -347 46 -78 -142 233 135 -109 -74 18 -31 155 -94 36
7279 36 199 -84 189 93 184 157 -100 -315 -287 -54 59 -283 -41 93 -85 -92 31 -8 176 318 96 -9 125
7302 125 -27 122 -134 -90 -53 43 -160 -196 28 42 144 4 -82 104 142 -62 -53 9 36 -20 67 19 -170 -301 -12
7327 -12 -192 -18 95 -85 -77 160 -88 -192 323 -148 50 -14 117 -32 56 143 -267 -158 -154 41 -86 113 6
7350 6 15 -45 -111 -222 72 -14 32 149 -60 125 142 -30 -19 137 112 -17 107 -134 -74 -161 -110 -41 -38 -369 -191 105
7376 105 43 133 -190 169 -161 -57 -189 -72 -20 57 43 -5 -82 -121 52 114 93 186 -167 83 -75 56 172 -267
7400 -267 -74 -26 40 -281 -33 11 170 -301 -47 -229 -193 -218 100 -159 -108 83 84 63 153 493 22 269 -74
$$ packed form
7232h0L00o4j69K7j86j31J89o8J57j07K00k2O1n9j09J00j41K52J4l03j4NK25%
7256G7Q7l37J65p3J39P1k58M27k46j97k02L93j24o4L75r8k44L5R2m9J86k49J30
7279C6J63k83K73r6R1k7k57k15K8K33J13l42K42J34j78pJ23l9J84J42k22j05J34
7302A25j52J49k56M4L7R6k03l6K24J4J02j40q6J86L8k04RO2K7n6Q7m8j89j31K89
7327a2j80J74J13j80QK37k48j04N15m71J98o4J31j49Q8Q7m10J09MJ95j27J99j07
7350FRo0o6j11K94q6M6J17k09J85J7j72J1J56k5j29J24k41O0q7N1O9Ll31J78K96
7376A05o2R0l23L59l30J04j32J17N2P7j4m8p7l9J73O2k1R3l53K50j58J31J16m39
7400b67J93M8O6l21K48M4J59m71K54j82L6k5L18k59N1J91Jk1R0L40m71K47l43
$$ plain form
7423 -74 -252 14 11 10 50 15 -57 29 -28 -4 77 72 48 151 127 -29 -110 -31 196 -26 78 -102 -135 -195 -27 107 -9
7450 -9 -127 123 61 -83 -228 2 -81 -90 -377 132 -51 -108 -45 109 -127 2 -37 -279 74 -93 -129 -51 -180 -15
7474 -15 125 51 43 200 9 -36 -1 -20 120 123 143 -110 -52 -27 -80 -267 15 -146 144 -58 -193 -206 60 -19 181
7499 181 95 -189 -37 -47 -156 -144 -169 92 -143 -229 149 -5 -109 114 34 140 38 -97 198 -96 31 266
7521 266 230 -160 -138 -245 -39 -272 -242 242 -163 119 125 -168 -146 89 292 153 -116 -37 -55 60 -22 156 -158
7544 -158 106 -229 144 -133 -190 -81 207 11 -160 64 202 -2 30 174 140 45 31 -20 98 210 -116 92
7566 92 -47 55 -54 -41 -185 279 37 -214 -33 176 -195 282 157 78 34 53 -151 89 -44 116 137 -36
7588 -36 -23 -61 -102 -250 141 140 -192 -70 -30 243 41 84 107 47 -62 -154 -294 162 65 184 -80 25 -62 -113 -115
$$ packed form
7423g4j78K66ljM0l5p2Q6n7K4Q1nk4J03k4j56q1P9K27k22J04j80l3o0J68J34j16
7450ij18K50o2j44j45K30q3rk87N09j83n7O3J54k36J29l9k42L53j67l6P8j29J65
7474a5J40p4qJ57j91m5L5j9J40LK0k53N8K5n3j87K82j61K90k02j35j3K66p9K00
7499A81q6k84J52j0j09J2k5K61k35q6L78j54j04K23q0J06j02j35K95k94J27K35
7521B66l6l90K2j07K06k33L0M84m05K82Ok93K2K35K03j39k69P9j8J15q2J78l14
7544a58K64l35L73k77n7J09K88j96j71K24J38k04L2J44l4r5j4n1J18J12l26K08
7566I2j39J02j09J3j44M64k42k51J81K09l71M77j25p9m4J9k04K40j33J60K1j73
7588c6J3l8m1j48L91jl32J22M0K73k02M3K3o0j09r2j40M56r7J19k64J05q7n1k
$$ plain form
7613 -115 -208 204 -142 -125 -47 -115 242 46 3 330 -273 -32 68 190 64 36 123 -170 -330 -42 144 53 -100
7636 -100 130 91 -56 146 21 39 141 77 -32 -119 -36 -46 157 -57 18 -56 -111 -232 216 -7 325 -101 -81
7659 -81 -19 -3 190 -119 -109 -9 134 -231 -77 -231 -167 114 -210 -32 206 90 245 207 33 -24 110 -67
7681 -67 146 -269 64 10 -48 38 193 -2 326 -96 130 -70 395 -71 27 128 221 108 63 93 -216 -234 17
7704 17 -87 -195 -38 -295 -79 -24 -119 127 131 93 113 85 25 307 44 117 111 -76 176 21 51 -45 -142 -166 95
7729 95 -51 -164 -51 -270 72 409 -6 -88 -101 17 -82 34 -182 175 85 107 30 -6 25 128 -129 -48 86
7752 86 -108 -136 -211 43 -121 235 -48 -185 -97 155 -86 79 -127 -213 -4 -206 9 -90 -213 270 -19 -181
7774 -181 -157 78 69 220 40 -88 89 -6 -63 -17 -5 155 135 -18 -24 -220 72 -17 -263 258 67 -63 154 -94
$$ packed form
7613a15r3M12l46J7P8o8L57j96m3L27o03K41J00J22j26k8Q7k93j60K88J86r1j53
7636a00K30l9j47K02j25J8J02o4j09q7Q3j0K03k14P5p4n5j21M48k23L32m26K0
7659h1O2J6J93l09J0J00J43l65J54j54O4K81l24J78K38j16J55l8j74n7J34j77
7681f7K13m15L33n4n8Q6J55j95L28m22K26k00M65m66R8J01R3j13m5L0l09j8K51
7704A7j04j08J57k57K16N5r5K46Ml8K0k8o0K82k63P3oj87K52j55L0r6r7k4K61
7729I5j46j13J13k19L42L37m15q2j3J18r9J16k16L57r0K2p7l6L1J03k57Q1J34
7752H6j94k8p5K54j64L56k83j37Q8K52k41J65k06q6K09k02K15r9j23M83k89j62
7774a81K4K35rJ51j80j28J77r5n7M6J2J60k0j53oj96K92q9k46N21j91j30K17k48
$$ plain form
7798 -94 127 167 -107 -273 206 32 -217 -164 -228 43 307 -220 -63 -75 -507 176 130 120 -28 72 19 73 114
7821 114 61 -82 1 -108 -244 -1 178 -288 -48 65 235 -72 118 111 145 -48 -166 93 146 -240 268 -198
7843 -198 -19 -14 -280 -252 -124 -109 105 208 -211 74 -70 180 -1 226 203 136 -96 -66 -8 202 -78 66 87
7866 87 -149 -65 -49 -266 -286 214 -89 -13 46 164 234 -218 77 -56 -13 -60 -24 7 115 -148 -63 40 -122 92
7890 92 -159 -28 138 167 95 -55 17 208 82 -319 276 -110 -19 -242 -327 -142 -37 165 -138 -191 256 267 -127
7913 -127 148 251 216 -56 -85 -141 -167 57 174 -113 -56 -236 -101 -47 -13 11 24 -81 106 -121 -250 -10 86
7936 86 53 -171 15 45 -43 -36 2 109 199 -268 -150 -86 25 35 213 164 92 -137 -111 -143 -43 -33 32 -327 36
7961 36 202 12 48 -76 -133 200 39 -163 60 -41 159 24 29 -90 -154 -65 -217 93 124 -12 27 -52 -87 149
$$ packed form
7798i4K21M0k74j66M79j74k49N3o4K71K64n27J57j2m32O83m6j0j48J00n3N4M1
7821A14n3j43Q3j09j36K43J79m66K40J13J70l07J90pL4j93j18K59N3l86N08m66
7843a98J79Nk66K8J28J5K14J03m19K85j44K50j81K27k3o7k32L0N8K10k80J44K1
7866H7k36Q4J6k17k0N00l03P6N9J18P0m52K95j33M3m7L6L1J08k63Q5J03j62K14
7890I2k51J31J66K9p2j50P2J91j26m01N95l86R1k23q5J85J05K02l03n3M47J1l94
7913a27K75J03l5k72k9n6k6K24J17k87N7j80J35N4L4K4J3j05J87k27j29K40R6
7936H6l3k24J86L0q8PL8J07R0m67J18O4J11J0J78m9p2k29K6l2J00J0O5l59L63
7961C6J66j90L6j24n7L33j61k02K23j01K00j35Nj19o4Q9j52L10L1j36L9p9l5K36
$$ plain form
7985 149 24 188 220 138 248 -122 29 34 352 130 80 209 -3 -193 -11 -232 165 -38 95 -102 44 -25
8007 -25 -51 8 213 48 -110 -88 -11 -24 162 101 68 -16 238 -148 188 141 37 295 58 -154 128 -72 -131 79
8031 79 -54 -113 -214 56 218 97 64 102 107 99 221 -171 -47 -46 -158 44 -5 122 0 28 -37 -158 102 151 -69
8056 -69 168 92 335 -204 10 -61 -308 -94 164 -137 -150 -314 -205 10 30 77 -3 101 178 47 137 35 -155
8079 -155 109 227 -45 127 127 39 95 -34 -77 -33 85 -12 -84 -14 -74 -2 376 -9 4 226 153 -19 124 -225
8103 -225 18 -311 -116 17 -30 -50 87 -87 4 -82 63 128 35 344 -112 133 101 -124 247 -266 53 99 163
8126 163 -212 101 87 64 397 -130 -4 -193 -27 62 -1 -162 11 20 63 -6 -51 -206 41 -5 79 -258 16 -37
8150 -37 55 -219 -13 -106 187 -194 273 147 91 -7 129 -124 -296 -117 149 126 -56 -248 -128 -28 -161 94
$$ packed form
7985A49j25J64L2q2J10l70J51NL18k22n0J29k12j90J82k21L97k03J33j97J46o9
8007b5k6N9K05j65j58K2P7j3J86o1l3q4K54l86L36m7j04K58k37k12K82k00n9K10
8031G9j33n9j01K70J62j21l3L8NqJ22l92J24Jj12K02m9J27j22K8o5j21K60M9k20
8056f9K37p6K43n39K14p1k47K14K58l01j3j64J09K15K0M7q0J04P7j31R0j02j90
8079a55K64J18k72J72%q8N6j29m3M4J18r7p2P0o0P2L78l85J3K22p3j72J43l49
8103b25K43l29J95J33m7k0J37j74R1q6J45O5r3L09m56K45l2k25L71n13L19M6O4
8126A63l75L13j4k3L33n27J26j89J66Q9o3j61J73RM3o9m5j55K47m6Q4l37K74n3
8150c7R2k74K06r3K93l81M67j26n6r8J36k53j72J79K66k3j82j92J20J00j33K55
$$ plain form
8172 94 -48 -110 172 151 3 -48 84 304 4 71 -82 -9 -77 97 10 109 52 101 -10
$$ packed form
8172I4j42o2K82k1j48n1J32K20l00O7j53P3o8J74q7R9n7M9j11
8191a0
$$ Imaginary data points
##PAGE= N=2
##DATA TABLE= (X++(I..I)), XYDATA
$$ plain form
0 0 0 0 0 0 0 0 0 0 0 0 0 0 0 0 0 -8 8 -8 8 -8 16 -16 16 -24 24 -32 33 -40 48 -54 61 -70 81 -90 101 -114 128
37 128 -143 160 -180 200 -223 248 -272 303 -334 368 -406 447 -493 543 -599 660 -728 804 -890
56 -890 989 -1101 1233 -1386 1575 -1800 2088 -2463 2977 -3727 4931 -7190 12952 -65462 -91391
71 -91391 -14113 -18631 -1646 12181 21243 19525 36820 34590 37068 46574 36837 -9530 -33523 -20973
85 -20973 3915 12204 5525 -16136 -30149 -31990 -28090 -24333 -8498 12713 22774 4540 -18032
98 -18032 -11911 20613 42187 43535 31777 13763 -795 -4588 -12226 -18968 -6453 3046 -20310
111 -20310 -48023 -45743 -25959 -2620 19146 21328 8888 10908 20294 17200 18317 33764 36014
124 36014 13300 -15554 -35747 -37119 -17425 1596 161 -11220 -15907 -15474 -14716 -7957 8358 26874
$$ packed form
0@%%%%%%%%%%%%%%%qJ6j6J6j6K4l2L2m0M8n6O5p3Q8j02J15j31J51j71J91k15K42
37A28k71L03l40L80m23M71n20N75o37P02p74Q53r40J036j142J259j388J532j694
56h90J879k090K334k619K961l375L888m551N440o704Q658j2121K0142p8414k5929
71i1391P7278m518J6985J3827R062j718J7295k230K478R506r737m6367k3993J2550
85b0973K4888Q289o679k1661j4013j841L900L757J5835K1211J0061j8234k2572
98a8032O121L2524K1574J348j1758j8014j4558l793p638o742J2515R499k3356
111b0310k7713K280J9784K3339K1766K182j2440K020R386l094J117J5447K250
124C6014k2714k8854k0193j372J9694J9021j435j1381m687M33P58O759J6315J8516
$$ plain form
138 26874 30713 16408 1796 230 10131 22035 19831 337 -17546 -23243 -27005 -26032 -10847 7081
152 7081 9495 1347 -10052 -18361 -8681 16338 28510 21959 14158 6822 -3365 -5745 538 4391
166 4391 5421 1633 -14090 -29024 -23783 -4674 7839 9023 2860 -4729 -8374 -4293 5267 16360
180 16360 25688 25084 11646 -6871 -14709 -6642 3011 2208 -6165 -16443 -25692 -25897 -14780 -1441
194 -1441 11018 22422 21401 7922 1178 7784 15404 17494 12305 -2446 -17793 -21306 -16584 -10987
208 -10987 -1566 7513 3239 -9691 -17282 -13276 -371 14521 21405 15422 5212 -93 -252 2623
222 2623 8383 13089 8570 -3824 -15846 -20106 -14637 -3790 3433 71 -10350 -15217 -11366 -3091
236 -3091 9460 22274 25961 18247 7424 -1110 -3856 2549 9237 4257 -7888 -17961 -22946 -20505
$$ packed form
138B6874L839j4305j4612j566R901J1904k204j9494j7883n697l762R73J5185J7928
152G081K414q148j1399q309R680K5019J2172o551p801p336j0187k380O283L853
166D391J030l788j5723j4934N241J9109J2513J184o163p589l645M081R560J1093
180A6360R328o04j3438j8517p838Q067R653q03q373j0278r249k05J1117J3339
194a441J2459J1404j021j3479o744O606P620K090n189j4751j5347l513M722N597
208a0987R421R079m274j2930p591M006J2905J4892O884n983j0210n305j59K875
222B623N760M706m519j2394j2022m260N469J0847P223l362j0421m867L851Q275
236c091J2551J2814L687p714j0823q534k746O405O688m980j2145j0073m985K441
$$ plain form
250 -20505 -10259 1642 6592 5330 1212 -4291 -4155 6534 18859 22362 15328 3466 -6299 -8783
264 -8783 -3539 3168 4546 -46 -7698 -17096 -21473 -15015 -1019 9324 10611 4636 -2773 -3977 3663
279 3663 13605 16987 14431 8538 -1791 -11722 -12809 -5086 2741 4331 -2481 -13381 -18244 -11196 284
294 284 7638 10557 10090 4001 -2545 -3737 1994 11169 16966 11719 -2329 -13448 -13555 -6398 -1019
309 -1019 1206 140 -4298 -9455 -11137 -6222 5138 16667 17957 6823 -4847 -6420 -408 5195
323 5195 7696 6381 625 -7037 -13146 -14213 -7155 4705 9895 3125 -6779 -9005 -2936 6026 12199
338 12199 13184 8577 2126 -5150 -10449 -7737 2336 9318 3927 -7886 -14473 -12203 -4012 4497 8478
353 8478 7556 5396 641 -4644 -3412 6263 14546 11602 -118 -10441 -13276 -7642 256 3856 2893
$$ packed form
250b0505J0246J1901M950j262m118n503J36J0689J2325L503p034j1862r765k484
264h783N244O707J378m592p652r398m377O458J3996J0343J287n975p409j204P640
279C663R942L382k556n893j0329r931j087P723P827J590o812j0900m863P048J1480
294B84P354K919m67o089o546j192N731R175N797n247j4048j1119j07P157N379
309a019K225j066m438n157j682M915J1360J1529J290j1134j1670j573O012N603
323E195K501j315n756p662o109j067P058J1860N190o770r904k226O069Q962O173
338A2199R85m607o451p276n299K712J0073O982n391j1813o587K270Q191Q509L981
353H478r22k160m755n285J232R675Q283k944j1720j0323k835N634P898L600r63
$$ plain form
368 2893 -266 -5263 -11232 -11084 -2014 9931 14749 9621 883 -4156 -755 6658 9678 7471 2767
383 2767 -3845 -12054 -16667 -12254 -2094 4615 3322 -4326 -9834 -6383 3502 11439 13831 12832 8202
398 8202 518 -5491 -4509 2058 7747 6233 -3051 -14518 -17358 -11587 -3188 2112 4075 3191 -204
413 -204 -2592 -1216 5415 13749 17023 9815 -1848 -8952 -6065 -196 3639 3125 -946 -7436 -13686
428 -13686 -15578 -10534 -215 8923 9754 2637 -2856 -1612 4489 10653 12929 9907 3339 -2735 -7485
443 -7485 -7791 -2807 3442 2960 -4961 -13533 -15470 -9101 601 8249 9464 7563 4002 659 -1193 3438
459 3438 10996 13127 6257 -4281 -12170 -12591 -6728 -924 372 -1548 -4310 -6884 -7388 -1702 7618
474 7618 13766 12639 4987 -3070 -5589 -996 5495 6694 3728 -1390 -7210 -11228 -9310 -2020 4951
$$ packed form
368B893l159m997n969J48R070J1945M818n128q738n039L401P413L020k207m704
383B767o612q209m613M413J0160O709j293p648n508L451R885P937K392r99m630
398H202p684o009R82O567N689j514r284j1467k840N771Q399N300J963q84l395
413b04k388J376O631Q334L274p208j1663p104K887N869L835n14m071o490o250
428a3686j892N044J0319R138Q31p117n493J244O101O164K276l022o568o074m750
443g485l06M984O249m82p921q572j937O369R702P648J215j901l561l343j852M631
459C438P558K131o870j0538p889m21N863N804J296j920k762k574n04N686R320
474G618O148j127p652q057k519M593O491J199k966n118n820m018J918P290O971
$$ plain form
489 4951 6997 3079 -5229 -9261 -5110 3121 8108 9205 7052 2155 -2458 -2766 916 4496 5462 811
505 811 -8065 -15363 -13950 -5359 3295 7423 6586 2410 -1936 -1741 1307 6500 10817 10740 3286 -6408
521 -6408 -10425 -7036 -1821 1413 587 -3962 -7818 -7835 -3464 2554 9101 12482 8131 31 -5308 -4092
537 -4092 1669 7371 7890 1573 -5378 -8806 -8577 -5664 -938 3538 2969 -3031 -8526 -8498 -1084 8022
553 8022 12754 9811 3764 819 -439 -220 1947 5178 3841 -3043 -10986 -14666 -10148 -316 5941
568 5941 4530 -635 -3712 -4049 -2197 3538 9414 13013 10798 3292 -4871 -6178 20 4351 2125
583 2125 -4565 -9458 -11301 -9920 -5896 -102 5522 7104 2704 -3743 -3804 3517 12104 13724 8061 1417
599 1417 -3726 -6464 -6278 -3512 381 2106 -1087 -8669 -12615 -7010 2518 7189 6135 2153 -1618
$$ packed form
489D951K046l918q308m032M151Q231M987J097k153m897m613l08L682L580R66m651
505H11q876p298J413Q591Q654M128q37m176m346J95L048N193M317p7p454r694
521f408m017L389N215L234q26m549l856j7M371O018O547L381m351q100n339J216
537d092N761N702N19o317o951l428K29K913M726M476n69o000n495K8P414R106
553H022M732k943o047k945j258K19K167L231j337o884p943l680M518R832O257
568E941j411n165l077l37J852N735N876L599k215p506q163j307O198M331k226
583B125o690m893j843J381M024N794N624J582m400o447o1P321Q587J620n663o644
599A417n143k738J86K766L893J725l193p582l946N605R528M671j054l982l771
$$ plain form
614 -1618 -1933 650 3958 7724 11193 7995 -1061 -9061 -8627 -2480 2429 2104 -3007 -7738 -8850 -7018
630 -7018 -3450 2762 9048 10633 5165 -2314 -4054 1356 7510 8387 4408 -2193 -6258 -7347 -6364 -3318
646 -3318 1478 4037 -379 -7022 -8853 -3645 4715 10889 9760 3453 -1248 -3151 -3337 -1562 3372
661 3372 6415 3541 -3177 -8230 -7898 -1585 4736 5011 257 -3368 -4716 -4132 -983 4568 8521 8318
677 8318 2760 -4363 -6822 -2799 3821 5685 1930 -3004 -6199 -6674 -5164 -531 5009 6834 3895
692 3895 -1708 -5502 -2873 4456 8248 6150 934 -3482 -6314 -6254 -2807 1529 3850 2586 -2624 -7576
708 -7576 -6110 1165 7396 8434 5124 647 -2888 -3259 -980 2267 5239 4522 -997 -7359 -9559 -5278
724 -5278 853 3529 2676 -1110 -4100 -3662 -577 3381 7865 9348 5982 -1260 -5507 -3809 1273 4463
$$ packed form
614a618l15K583L308L766L469l198r056q000M34O147M909l25n111m731j112J832
630g018L568O212O286J585n468p479j740N410O154Q77l979o601m065j089R83L046
646c318M796K559m416o643j831N208Q360O174j129o307m701j903j86J775M934
661C372L043k874o718n053L32O313O321K75m754l625j348N84L149N551L953k03
677H318n558p123k459M023O620J864l755m934l195m75J510M633N540J825k939
692C895n603l794K629P329L792k098n216m416k832O0L447M336K321j264n210m952
708g576J466P275O231J038l310m477l535l71K279L247K972p17n519o362k200M281
724e278O131K676q53l786k990M38L085L958M484J483l366p242m247J698N082L190
$$ plain form
740 4463 2924 -1443 -6678 -8576 -7158 -3836 1282 5374 5016 86 -3385 -2129 2881 7834 9265
755 9265 5669 34 -4009 -4999 -3417 47 2824 1673 -2894 -8019 -9523 -5660 812 5110 5233 1599
771 1599 -893 -1398 689 4850 8594 8699 3942 -2412 -6515 -6298 -2820 952 1213 -2442 -6132 -7756
787 -7756 -6025 -1184 5248 7828 6570 2830 -863 -1775 1411 5819 6555 4086 -1778 -6322 -7393 -4592
803 -4592 -67 2389 1497 -1999 -6053 -6944 -3427 2772 7185 7277 4206 -41 -2251 -625 2849 5381
819 5381 4285 774 -4417 -7816 -7241 -2975 1254 3365 1652 -2428 -5366 -3112 1667 5976 7512
834 7512 5933 1772 -2434 -3652 -1280 2297 4500 2681 -3047 -7531 -7875 -3820 1078 4157 4185 1542
850 1542 -1877 -3305 -1702 2541 6597 7056 2580 -3315 -5639 -3761 -20 2090 1828 -1054 -4419 -5953
$$ packed form
740D463j539m367n235j898J418L322N118M092l58m930l471J256N010M953J431
755I265l596n635m043r90J582L464K777j151m567n125j504L863O472M298J23l634
771A599k492n05K087M161L744J05m757o354m103K17L478L772K61l655l690j624
787g756J731M841O432K580j258l740l693r12L186M408P36k469n864m544j071K801
803d592M525K456q92l496m054q91L517O199M413R2l071m247k210J626L474K532
819E381j096l511n191l399N75M266M229K111j713m080k938K254M779M309J536
834G512j579m161m206j218K372L577K203j819n728m484l44M055M898L079K8k643
850A542l419j428J603M243M056M59m476n895k324J878L741K110k62k882l365j534
$$ plain form
866 -5953 -4706 -675 5276 8505 6196 862 -2939 -2552 989 3826 4601 1633 -1931 -4996 -6352 -4130
882 -4130 146 3778 3147 -1274 -4894 -5044 -757 4230 6694 5356 2566 -526 -2554 -2499 801 4566
898 4566 4476 -198 -6349 -8883 -6649 -1533 1890 2485 1087 -607 -2134 -1398 2521 7347 9671 6663
914 6663 552 -4396 -4348 -1355 667 567 -1452 -4627 -7182 -7564 -4375 1079 5964 6440 2498 -1981
930 -1981 -2479 1256 5742 6719 5489 2327 -1508 -4720 -5055 -3029 682 1396 -2216 -7174 -7931 -3876
946 -3876 1377 4910 5652 4337 1583 -395 -781 2067 6041 8151 4712 -1948 -6706 -6888 -3827 -1104
962 -1104 -217 -1395 -3351 -4971 -4861 -2311 3130 7828 8387 3658 -834 -1386 937 3871 4592 2141
978 2141 -1155 -4682 -7149 -7012 -3531 1115 2669 178 -3769 -4712 -1831 3043 6520 7074 4951 1742
$$ packed form
866e953J247M031N951L229k309n334l801L87L541K837P75k968l564l065j356K222
882d130M276L632o31m421l620j50M287M987K464j338k790l092k028N5L300L765
898D566r0m674o151k534K234N116L423N95j398j694j527P36L919M826K324l008
914F663o111m948M8K993K022j00k019l175k555l82L189N454M885M76l942m479
930a981m98L735M486R77j230l162l835l212l35K026L711P14l612m958p57M055
946c876N253L533P42j315k754j978l86K848L974K110l439o660m758j82L061K723
962a104Q87j178j956j620J10K550N441M698N59m729m492n52K323K934P21k451
978B141l296l527k467J37L481M646J554k491l947r43K881M874L477N54k123l209
$$ plain form
994 1742 -1232 -2372 -922 2422 3740 1007 -3979 -7333 -6950 -2803 1064 2766 1549 -136 -1717
1009 -1717 -2407 -122 4465 7753 7352 2663 -2591 -4785 -3256 -203 1038 113 -1920 -4200 -5446 -4215
1025 -4215 -345 3951 5494 3546 -555 -2623 -773 2685 5116 4985 2355 -1533 -4179 -5256 -3262
1040 -3262 -146 2231 818 -2604 -6042 -5161 -757 3710 5874 5454 3011 529 -511 257 2508 4030
1056 4030 2717 -1909 -6672 -8246 -6059 -1774 1278 1808 416 -965 -1287 -54 3139 6881 8055
1071 8055 5047 -7 -3572 -3592 -1107 1519 1552 -1171 -3714 -5711 -5646 -3603 226 3346 3084 320 -1929
1088 -1929 -1650 2434 6268 7880 6004 2338 -1273 -3224 -3598 -1414 226 -278 -3492 -6842 -8291 -5607
1104 -5607 -245 3792 4894 3748 2149 1223 2184 4019 6028 6051 3126 -1922 -5935 -6581 -3829 -818
$$ packed form
994A742k974j140J450L344J318k733m986l354L83M147L867J702j217j685j581
1009a717o90K285M587L288m01m689n254k194J529L053J241r25k033k280j246J231
1025d215L870M296J543j948m101k068J850L458K431j31k630l888k646j077J994
1040c262L116K377j413l422l438Q81M404M467K164m20k443k482j040P68K251J522
1056D030j313m626m763j574K187M285L052N30j392j381l22J233L193L742J174
1071H055l008n054l565k0K485K626L3k723k543j997O5K043L829L120k62k764k249
1088a929K79M084L834J612j876l666l611j951l74K184J640n04l214l350j449K684
1104e607N362M037J102j146j599r26R61J835K009K3k925n048m013o46K752L011
$$ plain form
1120 -818 -723 -2209 -4263 -5545 -4797 -1525 2594 5827 6442 4234 1071 -188 2226 5212 5598 3070
1136 3070 -1072 -5405 -7369 -6490 -3808 -1258 25 -1127 -3879 -4876 -1479 3276 6903 7382 4837 1363
1152 1363 -512 -231 1274 2940 3590 1236 -2949 -6782 -7090 -3952 -709 624 -652 -2839 -3656 -1912
1168 -1912 1200 4526 7352 7842 4507 559 -1472 -517 1641 2152 -151 -4422 -7373 -7529 -5435 -2316
1184 -2316 1616 3771 3086 554 -1040 378 4149 6701 5733 2118 -1593 -3265 -3668 -1961 213 1510
1200 1510 425 -3029 -5613 -5251 -1929 2279 3842 2386 -133 -1103 -401 997 4014 5735 5227 1799
1216 1799 -2593 -5308 -3690 -844 709 -598 -3439 -4970 -4816 -2220 1503 4966 6659 5159 1844
1231 1844 -1110 -650 2119 3899 2556 -1044 -4187 -5993 -5701 -3021 -556 1374 1407 -766 -2941 -2196
$$ packed form
1120h18R5j486k054j282P48L272M119L233O15k208l163j259K414K986L86k528
1136C070m142m333j964Q79K682K550J283j152k752r97L397M755L627M79k545l474
1152A363j875K81J505J666O50k354m185l833l08L138L243J333j276k187q17J744
1168a912L112L326K826M90l335l948k031R55K158N11k303m271k951j56K094L119
1184b316L932K155o85k532j594J418L771K552r68l615l711j672m03J707K174J297
1200A510j085l454k584L62L322M208J563j456k519r70P02J398L017J721n08l428
1216A799m392k715J618K846J553j307k841j531J54K596L723L463J693j500l315
1231A844k954M60K769J780j343l600l143j806K92K680K465J930L3k173k175P45
$$ plain form
1247 -2196 1490 5285 6398 4764 1671 -1049 -1643 -788 484 1915 948 -2188 -5704 -7162 -4718 -528
1263 -528 2100 2560 1281 -518 -622 1470 3794 5498 6010 3513 -480 -3558 -3328 -1214 661 642 -1891
1280 -1891 -5076 -5898 -4724 -2093 1061 3489 3326 1464 -335 158 3025 5733 6799 4636 800 -2520
1296 -2520 -4336 -4156 -2813 -1222 -1621 -3463 -5230 -5176 -2360 2136 5500 6043 4130 1328 694 1187 2386
1313 2386 3796 3322 518 -2742 -5620 -5747 -3291 -248 658 -824 -2802 -3723 -2485 425 3519 5096
1329 5096 4823 2289 147 -685 1154 3432 3798 1768 -1461 -4802 -5825 -4850 -1917 67 151 -786 -2414
1346 -2414 -2662 -260 3353 6063 6231 3797 726 -1123 -1396 297 1286 847 -874 -3778 -5605 -5187
1362 -5187 -2045 790 2634 1978 -422 -1737 -642 1958 4253 5011 4078 860 -1949 -3147 -2183 -235
$$ packed form
1247b196L686L795J113j634l093k720n94Q55J272J431r67l136l516j458K444M190
1263e28K628M60j279j799j04K092K324J704N12k497l993l078K30K114J875j9k533
1280a891l185q22J174K631L154K428j63j862j799M93K867K708J066k163l836l320
1296b520j816J80J343J591l99j842j767N4K816M496L364N43j913k802o34M93J199
1313B386J410m74k804l260k878j27K456L043R06j482j978r21J238K910L094J577
1329E096k73k534k142q32J839K278L66k030l229l341j023R75K933J984Q4r37j628
1346b414k48K402L613K710J68k434l071j849k73J693R89m39j721k904j827M18
1362e187L142K835J844o56k400j315J095K600K295P58r33l218k809j198R64J948
$$ plain form
1378 -235 1353 766 -1963 -4035 -4058 -2163 579 3120 3108 1395 -437 -1348 -210 1883 3917 3961 1325
1395 1325 -1894 -3968 -3257 -1163 978 1391 -158 -2103 -3477 -2759 -513 2423 4087 2959 846 -1158
1411 -1158 -1347 537 2666 3160 1400 -1816 -3679 -4566 -3643 -766 1371 1859 309 -1957 -2056 404 3246
1428 3246 4956 3792 1503 -812 -2619 -2334 -1076 967 1572 -422 -3220 -4764 -3400 -480 2286
1443 2286 2842 1699 265 -821 -765 1084 3461 4481 2988 -573 -3576 -3853 -1970 77 642 -100
1459 -100 -1807 -3157 -3482 -1868 1128 3898 4137 2182 -957 -1228 483 2743 3504 2446 74 -2159
1475 -2159 -3719 -3679 -2179 343 1566 -170 -2861 -4160 -2225 801 3523 3939 2979 1514 83 -569
1491 -569 634 2379 3093 1135 -2290 -5429 -5099 -2956 -490 834 345 -138 -803 -1372 565 2830 5017
$$ packed form
1378b35J588n87k729k072k3J895K742K541j2j713j832r11J138K093K034M4k636
1395A325l219k074P11K094K141M13j549j945j374P18K246K936J664j128k113k004
1411a158j89J884K129M94j760l216j863q87R23K877K137M88j550k266r9K460K842
1428C246J710j164k289k315j807K85J258K043O05j994k798j544J364K920K766
1443B286N56j143j434j086N6J849K377J020j493l561l003k77J883K047N65p42
1459a00j707j350l25J614K996K770K39j955l139k71J711K260P61j058k372k233
1475b159j560M0J500K522J223j736k691j299J935L026K722M16r60j465j431o52
1491e69J203J745P14j958l425l139L30K143K466J324m89m83o65n69J937K265K187
$$ plain form
1508 5017 4722 1585 -1617 -2955 -1627 90 1361 1041 -701 -2510 -3589 -3149 -1119 1825 2714 1179
1524 1179 -1110 -2389 -1018 1295 3547 3770 2404 401 -968 -1849 -771 620 1612 686 -2300 -4790
1540 -4790 -4351 -1736 1162 2545 2170 1524 -165 -305 353 2175 3442 2765 177 -2727 -4239 -2493
1556 -2493 -343 1108 1114 -440 -1528 -2081 -1630 680 2815 3817 2660 -133 -1984 -1654 642 1911
1572 1911 2042 347 -1219 -2884 -3216 -2043 199 1871 1836 -152 -2047 -1776 383 3143 3735 2770 748
1589 748 -1126 -1980 -1901 -218 1156 1499 -773 -3108 -3625 -2178 360 2098 1928 1092 -241 -1025 -769
1606 -769 844 3035 3796 2345 -326 -2695 -2431 -853 543 417 -754 -2361 -3572 -3576 -1828 1357 3471
1623 3471 3668 1781 57 -125 1196 2794 2912 1929 -749 -2870 -4037 -3498 -1528 387 1014 -394
$$ packed form
1508E017k95l137l202j338J328J717J271l20j742j809j079M40K030K944Q89j535
1524A179k289j279J371K313K252K23j366k003j369q81J078J391R92r26k986k490
1540d790M39K615K898J383l75o46j689j40O58J822J267o77k588k904j512J746
1556b493K150J451Oj554j088n53M51K310K135J002j157k793j851L30K296J269
1572A911J31j695j566j665l32J173K242J672l5j988j895K71K159K760N92r65k022
1589G48j874q54P9J683J374L43k272k335n17J447K538J738j70q36j333p84K56
1606g69J613K191P61j451k671k369K64J578J396j26j171j607j211mJ748L185K114
1623C471J97j887j724j82J321J598J18r83k678k121j167N39J970J915O27j408
$$ plain form
1639 -394 -2270 -2613 -1060 1611 3338 3145 2477 271 -992 -1124 199 2395 2764 1322 -855 -3249
1655 -3249 -3176 -2008 -383 133 -163 -1697 -2547 -2470 -273 2539 4373 4120 2325 124 -537 34 1428
1672 1428 1724 710 -1230 -3359 -4335 -3495 -1309 548 1693 784 -1054 -1377 -247 1854 3848 3754 2138
1689 2138 -114 -1515 -1610 -190 978 1384 317 -1782 -3369 -3340 -1609 745 1846 1140 -292 -1304
1705 -1304 -1158 381 2350 3315 3201 1523 -1298 -2297 -1733 -11 1121 675 -1228 -2749 -3175 -1753 -18
1722 -18 1926 2461 1468 -421 -1638 -919 1141 2788 3035 1378 -948 -2056 -2280 -907 311 1345 471
1739 471 -1096 -2459 -2325 -491 1913 2874 2152 349 -1098 -896 -129 1137 2052 1814 -35 -2384 -3295
1756 -3295 -2360 75 1714 1449 293 -1076 -1570 -648 1261 2387 2664 1538 -787 -2212 -2200 -363 1459
$$ packed form
1639c94j876l43J553K671J727j93o68k206j263j32J323K196L69j442k177k394
1655c249P3J168J625N16k96j534q50P7K197K812J834k53j795k201o61N71J394
1672A428K96j014j940k129r76Q40K186J857J145r09j838l23J130K101J994r4j616
1689B138k252j401r5J420J168M06j067k099j587K9J731K354J101p06j432j012
1705a304J46J539J969R65j14j678k821r99N64J722J132m46j903j521m26J422J735
1722a8J944N35r93j889j217P19K060J647K47j657k326j108k24J373J218J034q74
1739D71j567j363J34J834K404R61p22j803j447K02P67J266R15k38j849k349r11
1756c295R35K435J639k65j156j369m94R22J909J126K77j126k325j425J2J837J822
$$ plain form
1773 1459 1260 128 -1472 -2680 -1997 -399 1081 2453 1644 -61 -1316 -1614 144 2245 2977 1805
1789 1805 -25 -1928 -2593 -1702 -239 936 971 -774 -2325 -2775 -1167 801 2575 2464 1414 -208
1805 -208 -727 -366 1345 2237 2130 693 -1832 -3247 -3036 -1518 565 783 501 -1101 -1929 -1206 653
1822 653 2205 3109 2116 706 -667 -962 -146 1329 2234 1241 -731 -2825 -2938 -2075 -112 913 895 -327
1840 -327 -1453 -1583 -773 1375 3193 2985 1326 -323 -1424 -646 362 926 995 -224 -1862 -2965 -2771
1857 -2771 -1057 1062 1811 990 -427 -1233 -859 620 1766 2686 1970 523 -1392 -1878 -628 996 1787
1874 1787 1287 -837 -2465 -2600 -1535 -127 1169 1476 533 -560 -865 -230 1416 2875 2760 843 -1210
1891 -1210 -2560 -1793 -411 443 973 419 -732 -1927 -1764 238 1861 2837 1784 -107 -1416 -1719 -456
$$ packed form
1773A459j99j132j600j208O83J598J480J372q09j705j255k98J758K101P32j172
1789A805j830j903o65Q91J463J175L5j745j551m50J608J968J774j11j050j622
1805b08n19L61J711Q92j07j437k525j415K11J518K083K18k82j602q28P23J859
1822F53J552R04r93j410j373k95Q16J475R05r93j972k094j13Q63J963J025j8j222
1840c27j126j30Q10K148J818k08j659j649j101P78J008N64O9j219j638j103J94
1857b771J714K119P49q21j417q06L74J479J146R20p16j447j915m86J250J624P91
1874A787n00k124j628j35J065J408J296L07r43j093l05O35J646J459j15j917k053
1891a210j350P67J382Q54N30n54j151j195J63K002J623R76j053j891j309l03J263
$$ plain form
1908 -456 601 1534 956 -279 -1576 -1805 -674 946 2080 1728 154 -1474 -1987 -981 298 1513
1924 1513 1270 458 -898 -1508 -984 478 1666 1726 176 -1441 -2468 -1980 -710 1280 1802 1321 27
1941 27 -826 -209 451 1624 2263 1063 -809 -2615 -2854 -1493 106 934 839 -448 -1406 -1201 -422 1415
1959 1415 2601 2482 1119 -731 -1540 -921 689 1338 1236 -224 -1529 -2242 -1974 -678 704 1308 356
1976 356 -895 -1663 -905 729 2481 2792 1774 458 -813 -1274 -318 746 1470 629 -1346 -2698 -2685
1993 -2685 -1450 276 1063 750 -9 -749 -870 57 1376 2597 2907 1162 -743 -1240 -547 439 1019 495
2011 495 -662 -2072 -2936 -2552 -1320 800 1825 1044 -63 -813 -69 1586 2835 2594 1242 -72 -1297
2028 -1297 -1862 -1379 79 833 443 -1261 -2232 -2214 -791 774 1671 1459 340 -573 -1019 -755 1107 2216
$$ packed form
1908d56J057R33n78j235j297k29J131J620J134l52j574j628n13J006J279J215
1924A513k43q12j356o10N24J462J188O0j550j617j027M88J270J990N22m81j294
1941B7q53O17O60J173O39j200j872j806k39J361J599Q28r5j287r58K05P79J837
1959A415J186j19j363j850q09O19J610O49j02j460j305p13K68J296J382O04r52
1976C56j251p68P58J634J752L11j018j316j271m61R56J064P24q41j975j352J3
1993b685J235J726P87l13p59p40j21R27J319J221L10j745j905m97O93R86N80n24
2011D95j157j410q64L84J232K120J025p81j107p50P44J655J249k41j352j314j225
2028a297n65M83J458P54l90j704r71J8J423J565Q97k12j119r13m46K64J862J109
$$ plain form
2046 2216 2603 953 -730 -1525 -1192 241 966 262 -797 -1654 -2625 -2062 -585 1312 2482 1713 408
2063 408 -526 -213 1162 1974 1775 524 -900 -2098 -2460 -1738 30 1149 767 -465 -1457 -1305 78
2080 78 1501 2310 1667 406 -810 -1351 -904 289 1557 1629 407 -1405 -2328 -1257 -37 806 917 180
2098 180 -1226 -1172 -999 125 1814 2394 1487 104 -1266 -688 6 862 1052 -260 -1253 -1690 -2072 -1084
2116 -1084 458 1751 1922 702 -640 -922 346 1538 1859 1172 -69 -791 -1761 -1618 -379 639 682
2133 682 -148 -1538 -2034 -1145 817 2056 1987 1090 366 -248 -338 255 1470 1882 909 -935 -2218 -2116 -1447
2152 -1447 86 445 180 -434 -1130 -1012 -362 1192 2514 2351 795 -524 -638 -164 1004 1363 543 -584
2170 -584 -2135 -2560 -2069 -775 685 662 86 -802 -1075 -60 1277 2354 2689 1950 627 -478 -691 -432
$$ packed form
2046B216L87j650j683p95L33J433P25p04j059q57r71N63J477J897J170p69j305
2063D08r34L13J375Q12j99j251j424j198l62P22J768J119l82j232r92J52J383
2080G8J423Q09o43j261j216n41M47J193J268P2j222j812r23J071J220Q43J11p37
2098A80j406N4J73J124J689N80r07j383j370N78O94Q56J90j312r93m37l82R88
2116a084J542J293J71j220j342k82J268J192L21o87j241p22r70J43J239J018M3
2133F82q30j390m96Q89J962J239o9q97p24o14r0N93J215M12r73j844j283J02O69
2152a447J533L59k65o14o96J18O50J554J322j63j556j319j14M74J168L59q20j127
2170e84j551m25M91J294J460k3n76q88k73J015J337J077L35p39j323j105k13K59
$$ plain form
2188 -432 602 702 -477 -2211 -2991 -2426 -930 194 1302 1036 492 -256 -119 639 1712 2604 2235 497
2206 497 -787 -1393 -1023 3 410 -95 -847 -1778 -2256 -1738 -319 1158 1490 806 -197 -642 -176 1215
2224 1215 2304 2482 1217 -300 -1538 -1533 -846 -43 520 -518 -1470 -2193 -1762 -290 850 1983 1993 994
2242 994 171 -216 289 1113 1509 1209 -47 -1776 -2197 -1555 -358 507 677 -198 -1049 -1123 -608 557 1645
2261 1645 2061 1389 358 -800 -441 433 1226 1303 164 -870 -1934 -1615 -956 295 932 351 -226 -813
2279 -813 -769 279 1802 2150 1749 702 -566 -1188 -891 127 549 203 -913 -1699 -1941 -1270 199 1659
2297 1659 1374 1042 92 -393 -38 779 1542 1500 461 -917 -1823 -1746 -485 511 758 335 -1018 -1635 -1429
2316 -1429 -304 934 1908 1726 609 87 -337 243 1456 1826 782 -242 -1621 -2247 -1536 -453 87
$$ packed form
2188d32J034J00j179j734p80N65J496J124J108k66n44p48J37P58J073Q92l69j738
2206D97j284o06L70J026M07n05p52r31m78N18J419J477L32o84j003m45M66J391
2224A215J089J78j265j517j238NO87Q03N63j038r52p23M31J472J140J133J0r99
2242I94q23l87N05Q24L96l00j256j729m21O42J197Q65J70q75q51p4N15J165J088
2261A645M16o72j031j158L59Q74P93P7j139j034j064L19O59J251O37n81n77n87
2279h13M4J048J523L48m01j047j268o22K97J018M22l46j116p86k42O71J469J460
2297A659k85l32r50m85L55Q17P63m2j039j378r06P7J261R96K47m23j353o17K06
2316a429J125J238R74j82j117n22m24N80J213L70j044j024j379o26P11J083N40
$$ plain form
2333 87 367 -227 -1168 -1345 -167 1123 2458 2476 1748 192 -617 -300 45 760 603 -231 -1562 -2016 -2203
2352 -2203 -1169 428 858 814 -429 -744 -104 729 1914 2260 2008 544 -221 -1103 -681 130 726 -167
2370 -167 -1208 -2206 -2222 -1640 -302 640 1115 682 1 -299 322 1320 2350 2496 1000 -161 -1186 -1172 -718
2389 -718 42 -181 -705 -1591 -2170 -1703 -720 762 1615 1321 745 26 236 817 1645 1991 1104 46 -1009
2408 -1009 -1875 -1534 -463 268 -129 -848 -1656 -1353 -476 638 1656 1933 1287 386 -438 14 723 1412 1376
2427 1376 258 -838 -1669 -1414 -817 -132 163 -93 -900 -1225 -972 -61 1196 2113 1757 520 -360 -390 208
2446 208 837 1008 545 -739 -1652 -2206 -1717 -516 756 1048 -135 -579 -325 331 1238 1725 1635 786 -154
2465 -154 -1122 -1192 -23 413 478 -390 -1117 -1662 -837 -71 698 1030 895 296 -488 -529 229 1131 1369 1207 -135
$$ packed form
2333H7K80n94r41j77J178J290J335J8p28j556q09L17L45P15j57q34j331m54j87
2352b203J034J597M30m4j243l15O40Q33J185L46k52j464p65q82M22Q11N96q93
2370a67j041r98j6N82J338R42M75m33o81l00O21R98J030J46j496j161j025J4M54
2389g18P60k23n24q86n79M67R83J482Q53k94n76p19K10N81Q28L46q87j058j055
2408a009q66L41J071P31l97p19q08L03Q77J114J018K77o46r01q24M52P09O89l6
2427A376j118j096q31K55N97O85K95k56q07l25K53R11J257R17l56j237q80l0N98
2446B08O29J71m63j284r13n54M89J201J272K92j183m44K54O56R07M87r0q49r40
2465a54r68p0J169M36O5q68p27n45Q25P66P69L32j35n99p84m1P58R02K38j62j342
$$ plain form
2486 -135 -1159 -1401 -721 53 308 183 -571 -1288 -1287 -599 711 1563 1577 1074 19 -365 172 746 1287 871
2506 871 172 -1192 -1449 -1674 -751 -21 487 -92 -767 -1041 -585 797 1672 1920 1900 419 -261 -298 -159 310
2526 310 544 80 -995 -1784 -2134 -1248 -326 523 696 312 -352 -300 124 944 1665 1622 1076 38 -964 -782
2546 -782 22 212 469 -364 -1209 -1684 -1423 -587 373 1108 932 200 -322 -181 958 1792 1919 1053 364 -756
2566 -756 -1270 -729 -317 -108 -190 -992 -2124 -1783 -819 600 1267 1263 623 382 -180 500 725 1348 1417 158
2586 158 -954 -1487 -1199 -449 339 305 -178 -753 -1305 -1021 -67 899 1655 1316 264 -657 -210 436 1062 1047
2606 1047 366 -149 -1134 -1472 -1040 -302 312 558 -52 -777 -1105 -5 976 1379 1204 867 -109 -553 -592 225
2626 225 1007 804 32 -1132 -1423 -1123 -19 403 879 404 -268 -633 -486 405 989 1475 946 -51 -749
$$ packed form
2486a35j024k42O80P74K55j25p54p17JO88J310Q52J4n03j055l84N37N74N41m16
2506H71o99j364k57k25R23P30N08n79o75k74M56J382Q75K48k0j481o80l7J39M69
2526C10K34m64j075p89l50Q86R22Q49J73l84o64N2M24Q20P21m3n46j038j002J82
2546g82Q04J90K57q33q45m75K61Q36R60P35j76p32n22J41J139Q34J27q66o89j120
2566g56n14N41M12K09q2q02j132L41R64J419O67mo40k41n62O80K25O23O9j259
2586A58j112n33K88P50P88l4m83n75n52K84R54R66P56l39j052r21M47O46O26j5
2606A047o81n15r85l38M32P38O14K46o10p25l28J100R81M03j75l37r76m44l9Q17
2626B25P82k03p72j164k91L00J104M22M76m75o72l65J47Q91N84M86n29r97o98
$$ plain form
2645 -749 -883 -484 228 396 154 -427 -1225 -893 -741 522 1133 1072 665 -230 -775 94 642 869 601 -90
2665 -90 -931 -1276 -900 -319 303 628 138 -782 -1181 -532 565 1067 1393 460 385 -365 -560 40 688 766 265
2686 265 -1108 -1721 -1509 -789 287 553 596 20 -586 -465 176 1198 1753 1316 603 -425 -803 -596 -26
2705 -26 307 -17 -553 -1310 -1611 -1067 -234 593 978 730 6 -262 39 562 1435 1508 893 -2 -638 -944 -560
2726 -560 97 143 -139 -910 -1432 -1135 -491 358 1038 964 262 104 -107 303 695 1310 1019 -118 -984 -1446
2746 -1446 -916 -392 239 5 -559 -1079 -1306 -467 -61 984 1121 917 198 -327 140 180 1008 846 451 -410
2766 -410 -1079 -1313 -1068 -60 177 172 -445 -928 -757 40 973 1429 1072 365 -150 -325 -121 235 937 606
2786 606 -155 -992 -1470 -1187 -208 496 595 123 -333 -605 -392 517 1155 1356 699 98 -446 -601 -173 404
$$ packed form
2645g49j34L99P12J68k42n81p98L32J52J263O11o1m07q95n45Q69N48K27k68o91
2665i0q41l45L76N81O22L25m90r20l99O49J097N02L26r33p5p50j95O00O48P8n01
2686B65j373o13K12P20J076K66M3n76o06J21O41J022N55m37p13j028l78K07N70
2705b6L33l24n36p57l01N44Q33Q27L85k48p24k68L01N23Q73P3o15q95o36l06L84
2726e60O57M6k82p71n22K97O44Q49O80p4p02j58k11M10L92O15k91j137q66m62
2746a446N30N24O31k34n64n20k27Q39M06J045J37k04p19n25M67M0Q28j62l95q61
2766d10o69k34K45J008K37no17m83J71P97R33M56l57p07n15j75K04L56P02l31
2786F06p61q37m78K83R79P04R9m72m56k72K13R09O38K01o57o01n44j55M28N77
$$ plain form
2806 404 666 257 -564 -1097 -1237 -464 644 681 544 233 -432 -389 17 660 1140 868 64 -512 -917 -937 48
2827 48 294 286 -114 -678 -918 -556 42 931 988 711 -12 -541 -302 311 656 688 130 -599 -1143 -1067 -593 353
2849 353 729 357 -78 -663 -581 332 1151 1367 1156 310 -381 -484 -38 212 388 211 -381 -1107 -1074 -1093 -56
2870 -56 586 376 71 -167 -315 -163 302 1235 1397 493 -338 -868 -470 -152 303 366 -180 -620 -1322 -897 -576
2891 -576 402 868 807 321 -472 -84 355 918 1016 763 209 -715 -979 -847 -27 90 49 -426 -1066 -992 -731
2912 -731 412 798 932 528 347 -338 -167 704 968 831 469 -291 -1073 -1184 -474 -17 295 -128 -597 -906
2932 -906 -670 -265 554 1374 748 185 -151 -233 15 598 684 434 -60 -772 -1150 -880 -95 333 475 -272 -718
2953 -718 -893 -424 628 761 745 564 237 -455 -296 413 672 539 434 -758 -856 -980 -299 347 435 386 -205
$$ packed form
2806D04K62m09q21n33j40P73J108L7j37l11o65M3M06O43M80k72q04n76m05k0R85
2827D8K46qm00n64k40L62N98Q89N7k77p23n29K39O13L45L2n58p29n44P6M74R46
2849C53L76l72m35n85Q2R13Q19K16k11q46o91j03M46K50J76j77n92p26L3j9J037
2870e6O42k10l05k38j48J52M65R33J62r04q31n30L98L18M55O3n46m40p02M25L21
2891e76R78M66o1m86p93L88M39N63R8k53n54r24k64J32Q20J17m1m75o40P4K61
2912g31J143L86J34m04j81o85J71Q71K64j37l62p60p82j11P10M57L12m23m69l09
2932i06K36M05Q19Q20o26n63l36q2K48N83Q6k50m94p12l78K70P85M28J42p47m46
2953g18j75M69J052J33j6j81l27o92J59P09K59j33j05j192r8j24O81O46Q8m9n91
$$ plain form
2974 -205 -488 -459 91 577 959 656 -58 -759 -425 -145 317 387 154 -101 -779 -1025 -698 121 593 922 208
2995 208 -624 -519 -607 346 791 801 412 -361 -802 -760 -382 367 602 231 -371 -406 -421 86 747 829 360 -147
3017 -147 -637 -822 -219 116 349 583 -290 -685 -843 -388 58 714 709 256 -446 -550 -168 318 930 865 349
3038 349 -266 -375 -389 130 317 695 -271 -549 -836 -905 -55 579 841 737 122 -217 19 550 866 831 542
3059 542 -302 -821 -927 -567 -174 238 140 -256 -489 -781 -429 573 886 676 481 -245 -462 -248 320 779
3079 779 735 262 -453 -751 -896 -281 96 452 -85 -444 -1001 -609 99 596 1161 1117 286 -190 -352 -79 451
3100 451 488 191 -190 -1029 -908 -802 -124 242 307 35 -645 -612 -185 496 910 960 186 57 -318 -204 -24
3121 -24 434 625 -268 -500 -996 -945 -343 486 471 128 -155 -140 -455 -38 595 932 656 -125 -882 -456 -167
$$ packed form
2974b05k83K9N50M86L82l03p14p01L34K80M62P0k33k55o78k46L27Q19M72L29p14
2995B08q32J05q8R53M45J0l89p73m41M2L78P49K35l71o02l5j5N07O61Q2m69n07
3017a47m90j85O03L35K33K34q73l95j58M55M46O56nm53p02j04L82M86O12o5n16
3038C49o15j09j4N19J87L78r66k78k87o9Q50O34K62j04o15l39K36N31L16l5k89
3059E42q44n19j06L60L93M12r8l96k33k92L52J002L13k10j95p26k17K14N68M59
3079G79m4m73p15k98j45O15L77L56n37l59n57L92P08M97N65m4q31m76j62K73N30
3100D51L7k97l81q39J21J06O78L66O5k72o80L3M27O81M14N0p74j29l75J14J80
3121b4M58J91q93k32m96N1O02Q29j5l43k83J5l15M17O33L37k76p81p57M26K89
$$ plain form
3142 -167 169 299 175 -25 -572 -814 -325 175 465 661 83 -46 -491 83 511 874 433 177 -379 -753
3162 -753 -784 -286 363 316 -3 -578 -713 -497 119 652 826 1028 154 -151 -563 120 483 604 160 -584 -939
3183 -939 -927 -391 258 476 602 134 -111 -317 -105 596 796 568 240 -444 -609 -458 -35 406 369 102 -809
3204 -809 -926 -617 -99 310 632 526 -165 -255 -2 502 1011 829 166 -157 -762 -733 -484 -148 -80 -8 -670
3225 -670 -919 -795 -330 652 988 881 599 -24 -267 228 469 777 565 189 -397 -859 -630 -436 -71 -29
3245 -29 -215 -519 -934 -448 281 750 875 672 387 -73 -143 230 377 691 208 -418 -1083 -946 -723 -66 252
3266 252 -82 -364 -520 -503 -10 434 986 645 294 71 -349 -20 101 367 292 -385 -966 -1201 -444 -55 -108
3287 -108 329 -25 -241 -198 26 182 872 1086 770 -39 -96 -281 -268 478 351 -194 -503 -550 -685 -321 240
$$ packed form
3142a67L36J30j24k00n47k42M89N00K90J96n78j29m45N74M28L63m41k56n56l74
3162g53l1M98O49m7l19n75j35K16O16N33J74K02q74l05m12O83L63J21m44p44l55
3183i39J2N36O49K18J26m68k45k06K12P01K00k28l28o84j65J51M23M41l7k67r11
3204h09j17L09N18M09L22j06o91r0K53N04N09j82o63l23o05K9K49L36O8P2o62
3225f70k49J24M65R82L36j07k82o23k43M95K41L08k12l76n86m62K29J94L65M2
3245b9j86l04m15M86P29M69J25k03k85m60p0L73J47L14m83o26o65J37K23O57L18
3266B52l34k82j56J7M93M44N52l41l51k23m20L29J21K66p5o77n81k35P57L89n3
3287a08M37l54k16M3K24J56O90K14l16q09n7j85J3P46j27n45l09m7j35L64N61
$$ plain form
3308 240 634 617 196 -376 -256 345 670 778 602 114 -281 -412 -423 -82 152 249 -288 -816 -690 -519 136
3329 136 684 846 394 -132 -203 -194 310 809 498 258 -149 -542 -783 -293 284 3 107 -215 -400 -561 -275
3350 -275 237 661 493 279 -138 -522 -56 342 433 390 -295 -480 -844 -517 -28 -40 221 196 -134 -511 -8
3371 -8 263 895 1002 658 -13 -449 -406 -240 116 274 390 -497 -627 -776 -249 368 643 1069 143 -278 -414
3392 -414 330 415 560 476 24 -359 -806 -629 -107 205 127 -374 -753 -904 -306 -86 633 605 371 -198 -228 -323
3414 -323 507 852 678 294 -290 -859 -769 -595 -441 162 -147 -611 -681 -625 -91 739 808 891 238 26 -163 383
3436 383 400 639 228 -338 -665 -725 -695 -346 114 308 -202 -376 -406 -37 432 1153 715 593 226 -125 -158 114
3458 114 10 368 67 -796 -899 -805 -516 411 510 239 -34 -521 -230 -125 786 550 1006 157 -358 -135 -78
$$ packed form
3308B40L94j7m21n72J20O01L25J08j76m88l95j31j1L41K34R7n37n28J26J71O55
3329A36N48J62m52n26p1RN04M99l11k40m07l93k41M90N77k81J04l22j85j61K86
3350b75N12M24j68k14m17l84M66L98R1m3o85j85l64L27M89j2K61k5l30l77N03
3371hK71O32J07l44o71m36M3J66L56J58J16q87j30j49N27O17K75M26r26m21j36
3392d14P44Q5J45q4m52l83m47J77N22L12p8n01l79j51N98K20P19k8k34n69l0r5
3414c23Q30L45j74l84n84n69R0J74J54O03l09m64p0N6N34Q30O9Q3o53k12j89N46
3436C83J7K39m11n66l27o0L0L49M60J94n10j74l0L69M69P21m38j22l67l51l3K72
3458A14j04L58l01q63j03R4K89R27R9k71k73m87K91J05R11k36M56q49n15K23N7
$$ plain form
3479 -78 166 199 -83 -303 -739 -835 -725 -157 242 646 151 177 -254 36 797 629 888 133 -301 -659 -696 -363
3501 -363 171 98 117 -509 -444 -483 -23 264 357 508 143 -36 -287 -57 403 544 598 58 -635 -558 -265 -198 -1
3524 -1 -22 -239 -471 -571 -355 343 655 895 346 -106 22 -245 78 238 275 24 -347 -825 -852 -596 -112 239
3546 239 301 -109 -311 36 270 710 901 781 97 -363 -282 -482 -161 16 -213 -732 -973 -821 -451 174 628
3567 628 663 230 52 -186 155 442 673 548 47 -420 -609 -615 -360 20 -1 -681 -616 -719 -478 -196 453 908
3589 908 437 358 210 162 313 523 667 423 -209 -951 -731 -821 -550 85 45 -234 -599 -409 -86 701 983
3610 983 1140 762 57 -145 -70 522 273 264 -222 -609 -897 -1032 -532 -217 2 111 -403 -133 -168 608 785
3631 785 774 800 353 -243 -425 -90 305 154 148 -540 -700 -866 -643 -324 412 399 101 -158 -188 125 625 899
$$ packed form
3479g8K44L3k82k20m36r6J10N68L99M04m95K6m31K90P61j68K59p55m34l58l7L33
3501c63N34p3J9o26O5l9M60K87R3J51l65j79k51K30M60J41N4n40o93P7K93O7J97
3524ak1k17k32j00K16O98L12K40n49m52J28k67L23J60L7k51l71m78k7K56M84L51
3546B39O2m10k02L47K34M40J91j20o84m60Q1k00L21J77k29n19k41J52L70O25M54
3567F28L5m33j78k38L41K87K31j25n01m67j89oK55L80k1o80O5j03K41K82O49M55
3589I08m71p9j48m8J51K10J44k44o32p42K20r0K71O35m0k79l65J90L23P87K82
3610I83J57l78p05k02P5N92k49rm86l87k88j35N00L15K19J09n14K70l5P76J77
3631G85j1K6m47n96j82L35L95j51oo88j60j66K23L19P36j3k98k59l0L13N00K74
$$ plain form
3653 899 729 331 -292 -232 -514 -252 93 220 -318 -785 -947 -700 -113 95 607 65 -38 -144 -160 400 515
3674 515 760 620 -66 -384 -419 -259 -295 200 -187 -249 -413 -555 -502 31 870 686 668 66 2 123 458 310
3696 310 472 331 -337 -831 -582 -429 149 55 -5 -233 -475 -238 345 389 597 433 419 -236 -305 30 327 369
3718 369 86 -247 -776 -699 -230 -267 254 476 215 -62 -262 -21 583 646 707 511 197 -235 -336 142 61 332
3740 332 -24 -327 -624 -363 -217 519 526 330 -69 -15 163 530 602 432 362 -391 -431 -602 -446 -122 -41 131
3762 131 -222 -547 -424 65 232 703 683 337 -144 -124 -63 22 437 140 190 -499 -642 -494 -288 258 -163 -266
3784 -266 -386 -423 -287 255 856 588 615 453 -352 -161 65 398 208 122 -468 -794 -514 -167 -122 239 280 17
3806 17 -108 -239 122 482 338 675 186 60 -194 -406 -20 -54 160 -198 -287 -671 -555 -148 267 474 231
$$ packed form
3653H99j70l98o23O0k82K62L45J27n38m67j62K47N87K08N12n42j03j06j6N60J15
3674E15K45j40o86l18l5J60l6M95l87o2j64j42N3N33Q39j84j8o02o4J21L35j48
3696C10J62j41o68m94K49J53N78r4o0k28k42K37N83M4K08j64j4o55o9L35K97M2
3718C69k83l33n29P7M69l7N21K22k61k77k00K41O04O3O1j96l14m32j01M78q1K71
3740C32l56l03k97K61J46P36Pj96l99N4J78L67P2j70p0p53m0j71J56L24Q1J72
3762A31l53l25J23M89J67M71k0l46m81K0O1Q5M15k97N0o89j43J48K06N46m21j03
3784b66j20l7J36N42O01k68K7j62q05J91K26L33j90q6n90l26K80L47M5L61M1k63
3806A7j25j31L61L60j44L37m89j26k54k12L86l4K14l58q9l84J16M07M15K07k43
$$ plain form
3827 231 -241 -102 -71 222 704 802 337 45 -52 -543 56 6 30 271 -314 -509 -498 -273 243 480 108 210
3849 210 53 -248 -147 528 673 578 -14 -66 -632 -465 204 74 89 -226 -234 -136 -578 -34 299 620 379 342
3871 342 -321 -206 449 306 669 233 -239 -649 -365 -240 9 190 163 50 157 -142 88 500 465 570 306
3892 306 -302 -192 -405 -50 245 274 6 -100 -602 -162 48 441 301 -34 -104 -119 -181 -123 329 372 492 33
3914 33 -308 -438 -240 301 25 -149 -282 -445 -329 -265 242 722 556 3 258 247 179 470 441 299 -30 -486
3936 -486 -466 -382 -317 -121 154 -81 -302 -348 -321 453 572 751 531 59 -334 39 291 153 397 -118 -383 -526
3958 -526 -371 -176 -226 14 305 -125 -208 -149 -81 153 634 606 70 78 -254 -17 37 311 3 -252 -799 -928 -531
3981 -531 -473 53 568 155 -34 -199 116 250 649 758 180 131 -307 -426 -352 -216 -208 -43 -496 -516 -797 -124
$$ packed form
3827B31m72J39L1K93M82R8m65k92r7m91N99n0K4K41n85j95J1K25N16K37l72J02
3849B10j57l01J01O75J45r5n92n2n66J67O69j30J5l15qR8m42N44L33L21k41l7
3871C42o63J15O55j43L63m36m72m10K84J25K49J81k7j13J07k99K30M12l5J05k64
3892C06o08J10k13L55K95K9k68j06n02M40K10L93j40l35p0j5o2N8M52M3J20m59
3914C3l41j30J98N41k76j74j33j63J16O4N07M80j66n53K55j1o8K91k9j42l29m56
3936d86K0Q4O5J96K75k35k21m6K7P74J19J79k20m72l93L73K52j38K44n15k65j43
3958e26J55J95n0K40K91m30q3N9O8K34M81k8n36Ql32K37N4K74l08k55n47j29L97
3981e31N8N26N15m13j89j65L15J34L99J09n78m9m38j19P4J36QJ65m53k0k81O73
$$ plain form
4003 -124 166 375 236 190 139 35 97 350 501 127 92 -264 -218 -368 -302 77 -130 -13 -432 -233 -102 -142
4025 -142 423 398 77 265 -42 -125 170 208 300 -82 64 -515 -316 -205 -23 397 63 -68 -378 -250 75
4046 75 603 589 492 417 -19 -318 -69 287 403 192 -322 -554 -491 -561 -357 270 169 33 -77 52 -44 219
4068 219 345 564 37 -233 -561 -196 38 106 337 -88 101 -410 -291 -80 314 318 220 225 -88 -323 109 192
4090 192 665 273 46 -285 -379 -406 -36 68 108 -158 -260 -346 -83 -148 355 402 185 73 -196 -116 -48 91 1
4113 1 129 -542 -659 -245 -402 88 283 -131 165 -202 -221 -26 335 470 370 152 -243 -314 -244 183 76 146
4135 146 -72 -395 -544 -422 91 258 180 -8 -336 -339 -116 136 338 415 402 -7 -297 -203 -109 89 -3 -203 -585
4158 -585 -523 -458 58 145 153 433 83 106 -184 -56 162 432 526 101 -380 -51 -68 34 130 -134 -287 -611 -204
$$ packed form
4003a24K90K09j39m6n1j04O2K53J51l74l5l56M6j50O6L79k07J17m19J99J31m0
4025a42N65k5l21J88l07q3K95L8R2l82J46n79J99J11J82M20l34j31l10J28L25
4046G5N28j4r7p5m36k99K49L56J16k11n14k32O3p0K04O27j01j36j10J29r6K63
4068B19J26K19n27k70l28L65K34O8K31m25J89n11J19K11L94Mr8Nl13k35M32Q3
4090A92M73l92k27l31r4k7L70J04M0k66j02q6K63o5N03M7k17j12k69Q0O8J39r0
4113AJ28o71j17M14j57M90J95m14K96l67j9J95L61J35j00k18l95p1P0M27j07P0
4135A46k18l23j49J22N13J67p8j88l28lK23K52K02P7j3m09k90R4R4J98r2k00l82
4158e85O2O5N16Q7QK80l50K3k90J28K18K70R4m25m81L29j7J02R6k64j53l24M07
$$ plain form
4181 -204 -414 258 220 487 270 -57 -103 71 -14 516 232 220 -49 -436 -690 -204 135 -12 90 -176 -510
4202 -510 -291 -163 507 396 158 -31 9 -214 -94 417 392 112 -82 -362 -377 -292 62 54 203 226 -279 -125
4224 -125 187 126 322 560 61 -157 -512 -217 128 266 127 -4 -149 -507 -287 232 582 310 293 136 -398
4245 -398 -81 15 38 242 -134 -40 -395 -417 -315 104 591 194 31 -420 -184 -129 208 367 296 -9 3 -164
4267 -164 4 240 195 271 28 -400 -379 -295 -125 407 -162 279 -142 -466 -195 131 772 663 18 70 -87 -287
4289 -287 -297 98 80 145 -325 -325 -110 -455 42 282 329 -241 255 -239 268 275 399 453 232 -177 -142 -343 -205
4312 -205 216 204 -142 -154 -489 -550 3 180 280 134 192 -46 -44 302 270 209 295 -47 -290 -561 -289 -221 156
4335 156 -290 -351 -376 -419 -290 6 378 313 -81 48 95 65 258 378 475 -150 -447 -437 -378 -238 252 186 -288
$$ packed form
4181b04k10O72l8K67k17l27m6J74q5N30k84j2k69l87k54M86L39j47J02k66l34
4202e10K19J28O70j11k38j89M0k23J20N11k5k80j94k80j5Q5L54qJ49K3n05J54
4224a25L12o1J96K38m99k18l55K95L45J38j39j31j45l58K20N19L50k72j7j57n34
4245c98L17R6K3K04l76R4l55k2J02M19M87l97j63m51K36N5L37J59p1l05J2j67
4267a64J68K36m5P6k43m28K1Q4J70N32n69M41m21l24K71L26O41j09o45N2j57k00
4289b87j0L95j8O5m70%K15l45M97K40M7n70M96m94N07PJ24N4k21m09L5k01J38
4312b05M21j2l46j2l35o1N53J77J00j46N8k38KL46l2o1Q6l42k43k71K72O8L77
4335A56m46o1k5m3J29K96L72o5l94J29M7l0J93J20R7o25k97J0N9J40M90o6m74
$$ plain form
4358 -288 -250 -253 -499 -25 254 349 302 137 -155 -29 156 152 177 -52 -321 -42 -686 97 171 110 164 -103 -308 -267
4382 -267 94 354 332 383 225 -19 242 69 115 187 109 -111 -454 -451 -245 -68 95 -7 180 92 -251 66 94
4405 94 324 234 306 -112 -230 -402 164 -181 231 71 116 -224 -242 -61 226 574 396 244 -124 42 -264 121
4427 121 79 42 53 -353 -364 -123 97 237 -127 96 -331 -193 -173 84 352 573 440 126 -241 -441 -153 191
4449 191 -167 -3 -414 -324 -165 -310 -27 195 22 -163 -138 -178 258 463 469 332 61 -33 116 -69 0 11 -32
4472 -32 -217 -443 -517 -517 35 59 306 218 56 -118 207 285 550 192 128 171 9 -361 -184 -22 -130 -248 -529
4495 -529 -362 -266 -28 176 143 255 307 -83 -7 114 595 383 168 170 -206 -295 -106 -162 -282 -152 6 -207 -464
4518 -464 -13 -5 348 431 431 -43 -126 -79 150 458 132 -5 -246 -301 -383 -177 50 149 84 -176 -161 153 111 120 319
$$ packed form
4358b88L8lk46M74K79R5m7j65k92J26J85mK5k29k69K79o44P83P4o1N4k67k05M1
4382b67L61K60k2N1j58k44K61j73M6P2p8k20l43LK06J77J63j02J87q8l43L17K8
4405I4K30r0P2m18j18j72N66l45M12j60M5l40j8J81K87L48j78j52l68J66l06L85
4427A21m2l7J1m06j1K41K20J40l64K23m27J38K0K57K68K21j33l14l67k00K88L44
4449A91l58J64m11R0J59j45K83K22j73j85K5m0M36K05Oj37k71r4J49j85O9J1m3
4472c2j85k26p4%N52K4K47q8j62j74L25P8K65l58o4M3j62l70J77J62j08j18k81
4495e29J67R6K38K04l3J12N2l90P6J21M81k12k15Kl76q9J89n6j20J30J58k13k57
4518d64M51QL53Q3%m74q3M7K29L08l26j37k41n5q2K06K27R9o5k60J5L14m2RJ99
$$ plain form
4543 319 519 233 -119 8 -263 92 234 -224 -234 -266 -238 -481 -44 -29 60 74 -263 -289 7 84 529 619 129
4566 129 111 157 -211 184 92 93 23 -279 -569 -475 -410 -115 41 162 120 -221 8 384 -74 262 144 -3 -80
4589 -80 -113 -321 62 159 29 -29 -369 -226 -142 -441 281 194 110 164 184 292 24 301 170 152 -228 -222 -445 0
4613 0 -123 97 -117 -74 -446 -244 49 494 515 410 69 14 -93 -234 -65 187 -147 -92 -232 -474 -235 -66
4635 -66 18 328 130 -92 -35 289 202 543 243 280 142 -280 -400 -65 214 -271 134 -574 -773 -245 -254 -10
4657 -10 -36 174 -29 75 -145 69 514 362 217 247 -57 -323 -181 -18 213 82 -123 -352 -404 -264 102
4678 102 364 288 251 36 2 119 235 548 331 11 -265 -389 -295 -96 66 125 -35 -172 -346 -43 99 93
4700 93 581 93 263 176 -17 -47 142 228 304 -162 -170 -557 -313 -166 16 12 33 -127 -102 -111 186 590 453 339
$$ packed form
4543C19K00k86l52J27k71L55J42m58j0l2K8k43M37J5Q9J4l37k6K96P7M45R0m90
4566A29j8M6l68L95r2Jp0l02k90R4O5K95J56J21m2l41K29L76m58L36j18j47p7
4589h0l3k08L83R7j30n8l40J43Q4k99P22q7q4N4K0J08k68K77j31j8l80Ok23M45
4613@j23K20k14M3l72K02K93M45K1j05l41n5j07j41J69K52l34N5j40k42K39J69
4635f6Q4L10j98k22N7L24q7L41l00L7j38m22j20L35K79m85M05p08j99N28rK44
4657a0k6K10k03J04k20K14M45j52j45L0l04k66J42J63K31j31k05k29n2J40L66
4678A02K62p6l7k15l4J17J16L13k17l20k76j24R4J99J62N9j60j37j74L03J42o
4700I3M88m88J70q7j93l0J89Q6P6m66ql87K44J47J82mK1j60K5rK97M04j37j14
$$ plain form
4724 339 68 173 -16 94 263 388 28 -107 -509 -519 12 -165 223 54 -132 -103 -35 135 204 227 179 228
4746 228 21 15 -179 128 -29 -84 -153 -268 -449 -113 -256 459 212 -89 19 -307 30 87 618 295 -65 -57
4768 -57 -300 -259 46 181 260 -115 -84 -372 -423 -93 238 383 3 -156 -51 10 235 208 261 170 -89 -263 -422
4791 -422 -427 266 88 -268 -28 -214 -203 -240 -15 394 346 56 184 -489 93 11 208 -71 167 -100 -262 -482
4813 -482 -77 22 176 209 -256 -76 182 -209 412 444 434 136 -278 99 -135 23 48 73 -181 -320 -346 93
4835 93 -208 281 494 213 96 73 346 266 381 351 -39 -15 -84 -110 -175 -47 -133 -69 -110 -453 -343 -258 53 224
4859 224 291 208 -67 259 154 343 338 59 -144 -301 -438 -288 -176 -108 -106 -318 -41 -538 -8 431 244 220 280
4882 280 7 215 -55 101 138 228 -216 -152 -153 -298 54 -264 -84 -26 -212 -100 -163 413 219 302 199 2 54
$$ packed form
4724C39k71J05j89J10J69J25l60j35m02j0N31j77L88j69j86K9O8J70O9K3m8M9
4746B28k07oj94L07j57n5o9j15j81L36j43P15k47l01J08l26L37N7N31l23l60Q
4768e7k43M1L05J35P9l75L1k88n1L30L31J45l80j59J05O1K25k7N3r1k59j74j59
4791d22nO93j78l56K40j86J1l7K25M09m8k90J28o73N82q2J97k79K38k67j62k20
4813d82M05R9J54L3m65J80K58l91O21L2j0k98m14L77k34J58K5K5k54j39k6M39
4835I3l01M89K13k81j17k3K73q0J15l0l90K4o9k6o5J28q6O4m1l43J10Q5L11J71
4859B24O7q3k75L26j05J89nk79k03j57j37J50J12O8Kk12K77m97N30M39j87k4O0
4882B80k73K08k70J56L7R0m44O4jj45L52l18J80N8j86J12o3N76j94Q3j03j97N2
$$ plain form
4905 54 -329 154 -136 38 -47 -317 -216 -475 -223 -120 169 188 85 -195 99 -38 145 286 245 206 139 -65
4927 -65 22 18 -15 -180 184 -153 -142 -4 -176 -198 -68 -120 169 65 -86 132 525 386 -90 -129 -272 -242 -307 2
4951 2 50 -77 -233 -60 -240 -120 207 462 -7 47 -135 -4 167 80 369 10 -70 19 -289 -323 71 137 -120
4974 -120 170 -160 -37 -373 138 261 261 499 -20 -305 -384 -110 47 45 -60 -85 -140 -77 -362 -56 309 346 -76
4997 -76 138 -273 -164 158 -15 359 -57 -115 -236 -443 147 168 65 -142 -65 -351 -112 19 195 218 259 -54
5019 -54 -60 44 84 348 498 265 -253 -187 -336 22 -112 -119 -76 60 -23 145 34 208 246 136 -35 296 39
5042 39 4 130 323 134 -48 -458 -364 -267 -100 55 -2 170 234 -136 37 -37 218 189 31 198 -3 5 -124
5065 -124 136 166 -176 -265 -204 -367 -113 101 -64 -165 -111 -89 -242 -185 240 130 130 235 71 58 -30 222 71
$$ packed form
4905E4l83M83k90J74q5k70J01k59K52J03K89J9j03k80K94j37J83J41m1l9o7k04
4927f5Q7ml3j65L64l37J1J38j72k2J30n2K89j04j51K18L93j39m76l9j43L0o5L09
4951BM8j27j56J73j80J20L27K55m69N4j82J31J71q7K89l59q0Q9l08l4L94O6k57
4974a20K90l30J23l36N11J23%K38n19k85p9K74J57kj05k5n5O3k85L06L65L7m22
4997g6K14m11J09L22j73L74m16n8j21k07N90K1j03k07P7k86K39J31J76K3M1l13
5019e4oJ04M0K64J50k33n18O6j49L58j34pM3J36q3J68j11J74L8j10j71L31k57
5042C9l5J26J93j89j82m10R4R7J67J55n7J72O4l70J73p4K55k9j58J67k01Qj29
5065a24K60L0l42q9O1j63K54K14j65j01N4K2j53N7M25j10%J05j64j3q8K52j51
$$ plain form
5088 71 214 -82 -356 -462 -525 43 -51 333 115 179 -245 -140 193 -57 -62 -229 -64 -393 -201 -47 180 83
5110 83 -43 -51 -36 -7 -43 151 159 168 23 27 -427 122 169 303 185 29 -228 -154 -337 -83 225 122 -177 -215 -303
5135 -303 24 74 206 460 259 -38 116 -423 -35 129 111 -5 -84 -202 73 -270 83 351 128 -31 -125
5156 -125 49 279 429 263 384 -70 -217 408 -15 -121 138 -5 -153 -257 -342 -154 -127 201 271 81 -6
5177 -6 116 79 350 256 232 -131 -88 -252 56 -98 179 140 -331 -74 -227 -205 -177 62 76 94 159 50 148 193 112
5202 112 -18 270 -51 -259 -211 -105 7 -280 153 -258 -335 -87 -233 248 198 105 384 1 152 -82 60
5223 60 86 181 93 -11 -198 -191 -123 29 143 22 68 14 -184 219 8 242 183 164 -3 77 187 69 -30 365
5247 365 -106 -160 -351 -215 -65 75 -69 -57 71 -95 0 62 239 234 145 -63 -301 -283 -61 -164 19 169 -62
$$ packed form
5088G1J43k96k74j06o3N68r4L84k18O4m24J05L33k50nj67J65l29J92J54K27r7
5110H3j26qJ5K9l6J94QRj45Mm54N49M7J34j18j56k57P4j83K54L08j03k99l8q8
5135c03L27N0J32K54k01k97J54n39L88J64j8j16p9j18K75l43L53K68k23j59r4
5156a25J74K30J50j66J21m54j47O25m23j06K59j43j48j04q5J88K7L28P0j90q7
5177fJ22l7K71r4k4l63M3j64L08j54K77l9m71K57j53K2K8K39J4J8O5j09R8M5q1
5202A12j30K88l21k08M8J06J12k87M33m11p7K48j46M81n0r3K79l83J51k34J42
5223F0K6R5q8j04j87PO8J52J14j21M6n4j98M03k11K34n9j9j67Q0J10j18r9L95
5247C65m71n4j91J36J50J40j44J2J28j66R5O2J77nq9k08k38J8K22j03J83J50k31
$$ plain form
5270 -62 -44 -54 -16 160 -50 87 -12 -25 113 -170 214 119 276 -105 -271 -177 -25 42 134 86 -203 -266 -195 -173 173
5295 173 212 262 184 -158 -212 -175 91 111 114 27 -368 -368 169 -78 68 171 205 -74 -44 66 56 189 444 353 144
5320 144 -74 -109 -73 204 8 -199 119 -87 -195 -95 166 257 333 -74 23 -49 -175 290 195 323 -56 -88 -314
5343 -314 -78 -1 -72 -107 24 103 -261 -9 -49 103 93 138 -8 83 -149 109 7 224 -229 -336 -527 -124 -233
$$ packed form
5270f2J8j0L8J76k10J37r9j3J38k83L84r5J57l81j66R4J52O7R2m8k89o3P1K2L46
5295A73L9N0p8l42n4L7K66K0Lq7l95%N37k47J46J03L4k79L0J10j0J33K55r1k09
5320A44k18l5L6K77j96k07L18k06j08J00K61R1P6m07R7p2j26M65r5J28l79l2k26
5343c14K36P7p1l5J31P9l64K52m0J52j0M5j46R1k32K58j02K17m53j07j91M03j09
$$ [...]
8191A62
##END NTUPLES=NMR FID
##END=
