##TITLE=1H_IG-ishodn.sm
 CDCl3
 8 sc, 
 28.11.2023
##JCAMPDX= 6.0         $$ Bruker NMR JCAMP-DX V2.0
##DATA TYPE= NMR FID
##DATA CLASS= NTUPLES
##ORIGIN= UXNMR, Bruker Analytische Messtechnik GmbH
##OWNER= root
$$ XWIN-NMR		Version 3.5
$$ Tue Nov 28 13:43:33 2023 Russian Standard Time (UT+4h)  she@DPX200
##.OBSERVE FREQUENCY= 200.1313
##.OBSERVE NUCLEUS= ^1H
##.DELAY= (6, 6)
##.ACQUISITION MODE= SIMULTANEOUS
##.ACQUISITION SCHEME= undefined
##.AVERAGES= 8
##.DIGITISER RES= 18
##SPECTROMETER/DATA SYSTEM= spect
##.PULSE SEQUENCE= zg30
##.SOLVENT NAME= CDCl3
##.SHIFT REFERENCE= (INTERNAL, CDCl3, 0, 15.7039)
##AUDIT TRAIL= $$ (NUMBER, WHEN, WHO, WHERE, WHAT)
$$ ##TITLE= Audit trail, XWIN-NMR		Version 3.5
$$ ##JCAMPDX= 5.01
$$ ##ORIGIN= Bruker BioSpin GmbH
$$ ##OWNER= she
$$ F:/spectra/data/she/nmr/H-F/1/audita.txt
$$ ##AUDIT TRAIL=  $$ (NUMBER, WHEN, WHO, WHERE, WHAT)
(   1,<2023-11-28 13:42:16.46 +0400>,<she>,<DPX200>,
      <created by zg, POWCHK disabled, PULCHK disabled
       configuration hash MD5:
       00 E9 B6 7A A2 85 ED C7 34 08 36 98 17 FE 4E 26
       data hash MD5: 16K
       8D 5B 33 B3 C4 5E 44 6C A4 B8 4E B3 AA 0B 23 7D>)
$$ ##END=
$$ 
$$ hash MD5
$$ 1F C8 EF A9 0A 14 4C 81 56 D2 B5 FA 1B 03 66 68
##$RELAX= 
##$RELAX= 
##$RELAX= 
##$RELAX= 
##$RELAX= 
##$RELAX= 
$$ Bruker specific parameters
$$ --------------------------
##$DU= <F:/spectra>
##$EXPNO= 1
##$NAME= <H-F>
##$PROCNO= 1
##$TYPE= <nmr>
##$USER= <she>
##$AMP= (0..31)
100 100 100 100 100 100 100 100 100 100 100 100 100 100 100 100 100 100 
100 100 100 100 100 100 100 100 100 100 100 100 100 100 
##$AQSEQ= 0
##$AQ_mod= 1
##$AUNM= <au_zg>
##$AUTOPOS= <>
##$BF1= 200.13
##$BF2= 200.13
##$BF3= 200.13
##$BF4= 200.13
##$BF5= 200.13
##$BF6= 200.13
##$BF7= 200.13
##$BF8= 200.13
##$BYTORDA= 1
##$CFDGTYP= 0
##$CFRGTYP= 5
##$CHEMSTR= <none>
##$CNST= (0..31)
1 1 145 1 1 1 1 1 1 1 1 1 1 1 1 1 1 1 1 1 1 1 1 1 1 1 1 1 1 1 1 1 
##$CPDPRG= <>
##$CPDPRG1= <>
##$CPDPRG2= <>
##$CPDPRG3= <>
##$CPDPRG4= <mlev>
##$CPDPRG5= <mlev>
##$CPDPRG6= <mlev>
##$CPDPRG7= <mlev>
##$CPDPRG8= <mlev>
##$CPDPRGB= <>
##$CPDPRGT= <>
##$D= (0..31)
0 1.2 0 0 0 0 0 0 0 0.06 0 0.03 0 0 0 0 0.0002 0 0 0 0 0 0 0 0 0 0 0 0 
0 0 0 
##$DATE= 1701164535
##$DBL= (0..7)
120 120 120 120 120 120 120 120 
##$DBP= (0..7)
150 150 150 150 150 150 150 150 
##$DBP07= 0
##$DBPNAM0= <>
##$DBPNAM1= <>
##$DBPNAM2= <>
##$DBPNAM3= <>
##$DBPNAM4= <>
##$DBPNAM5= <>
##$DBPNAM6= <>
##$DBPNAM7= <>
##$DBPOAL= (0..7)
0.5 0.5 0.5 0.5 0.5 0.5 0.5 0.5 
##$DBPOFFS= (0..7)
0 0 0 0 0 0 0 0 
##$DE= 6
##$DECBNUC= <off>
##$DECIM= 32
##$DECNUC= <off>
##$DECSTAT= 4
##$DIGMOD= 1
##$DIGTYP= 9
##$DL= (0..7)
0 120 120 120 120 120 120 120 
##$DP= (0..7)
150 150 150 150 150 150 150 150 
##$DP07= 0
##$DPNAME0= <>
##$DPNAME1= <>
##$DPNAME2= <>
##$DPNAME3= <>
##$DPNAME4= <>
##$DPNAME5= <>
##$DPNAME6= <>
##$DPNAME7= <>
##$DPOAL= (0..7)
0.5 0.5 0.5 0.5 0.5 0.5 0.5 0.5 
##$DPOFFS= (0..7)
0 0 0 0 0 0 0 0 
##$DQDMODE= 0
##$DR= 18
##$DS= 0
##$DSLIST= <SSSSSSSSSSSSSSS>
$$ [...]
##$SUBNAM2= <"">
##$SUBNAM3= <"">
##$SUBNAM4= <"">
##$SUBNAM5= <"">
##$SUBNAM6= <"">
##$SUBNAM7= <"">
##$SUBNAM8= <"">
##$SUBNAM9= <"">
##$SW= 18.0517328524113
##$SWIBOX= (0..15)
0 0 2 0 0 0 0 0 0 0 0 0 0 0 0 0 
##$SW_h= 3612.71676300578
##$TD= 16384
##$TD0= 1
##$TE= 0
##$TE2= 300
##$TE3= 300
##$TEG= 300
##$TL= (0..7)
0 120 120 120 120 120 120 120 
##$TP= (0..7)
150 150 150 150 150 150 150 150 
##$TP07= 0
##$TPNAME0= <>
##$TPNAME1= <>
##$TPNAME2= <>
##$TPNAME3= <>
##$TPNAME4= <>
##$TPNAME5= <>
##$TPNAME6= <>
##$TPNAME7= <>
##$TPOAL= (0..7)
0.5 0.5 0.5 0.5 0.5 0.5 0.5 0.5 
##$TPOFFS= (0..7)
0 0 0 0 0 0 0 0 
##$TUNHIN= 0
##$TUNHOUT= 0
##$TUNXOUT= 0
##$USERA1= <user>
##$USERA2= <user>
##$USERA3= <user>
##$USERA4= <user>
##$USERA5= <user>
##$V9= 5
##$VALIST= <valist>
##$VCLIST= <CCCCCCCCCCCCCCC>
##$VD= 0
##$VDLIST= <DDDDDDDDDDDDDDD>
##$VPLIST= <PPPPPPPPPPPPPPP>
##$VTLIST= <TTTTTTTTTTTTTTT>
##$WBST= 1024
##$WBSW= 4
##$XGAIN= (0..3)
0 0 0 0 
##$XL= 0
##$YL= 0
##$YMAX_a= 46661
##$YMIN_a= -42305
##$ZGOPTNS= <>
##$ZL1= 120
##$ZL2= 120
##$ZL3= 120
##$ZL4= 120
##$ABSF1= 10
##$ABSF2= 0
##$ABSG= 5
##$ABSL= 3
##$ALPHA= 0
##$AQORDER= 0
##$ASSFAC= 0
##$ASSFACI= 0
##$ASSFACX= 0
##$ASSWID= 0
##$AUNMP= <proc_1d>
##$AZFE= 0.1
##$AZFW= 0.1
##$BCFW= 1
##$BC_mod= 2
##$BYTORDP= 1
##$COROFFS= 0
##$CY= 11.3945322036743
##$DATMOD= 1
##$DC= 2
##$DFILT= <>
##$DTYPP= 0
##$F1P= 15.7292609196834
##$F2P= 12.9074282941183
##$FCOR= 0.5
##$FTSIZE= 0
##$FT_mod= 4
##$GAMMA= 1
##$GB= 0.15
##$INTBC= 1
##$INTSCL= 1
##$ISEN= 128
##$LB= 0.24
##$LEV0= 0
##$LPBIN= 0
##$MAXI= 10000
##$MC2= 0
##$MEAN= 0
##$ME_mod= 0
##$MI= 1.114404
##$NCOEF= 0
##$NC_proc= 0
##$NLEV= 6
##$NOISF1= 3.799351
##$NOISF2= 2.8
##$NSP= 1
##$NTH_PI= 0
##$NZP= 0
##$OFFSET= 15.70392
##$PC= 1
##$PHC0= -24380.86
##$PHC1= -1.1473
##$PH_mod= 1
##$PKNL= yes
##$PPARMOD= 0
##$PSCAL= 0
##$PSIGN= 0
##$REVERSE= no
##$SF= 200.130013532006
##$SI= 16384
##$SIGF1= 3
##$SIGF2= 2
##$SINO= 400
##$SIOLD= 16384
##$SREGLST= <1H.CDCl3>
##$SSB= 0
##$STSI= 0
##$STSR= 0
##$SW_p= 3612.71676300578
##$SYMM= 0
##$S_DEV= 0
##$TDeff= 0
##$TDoff= 0
##$TI= <>
##$TILT= no
##$TM1= 0
##$TM2= 0
##$TOPLEV= 0
##$USERP1= <user>
##$USERP2= <user>
##$USERP3= <user>
##$USERP4= <user>
##$USERP5= <user>
##$WDW= 1
##$XDIM= 8192
##$YMAX_p= 0
##$YMIN_p= 0
$$ End of Bruker specific parameters
$$ ---------------------------------
##NTUPLES= NMR FID
##VAR_NAME=  TIME,          FID/REAL,        FID/IMAG
##SYMBOL=    X,             R,               I
##VAR_TYPE=  INDEPENDENT,   DEPENDENT,       DEPENDENT
##VAR_FORM=  AFFN,          ASDF,            ASDF
##VAR_DIM=   8192,          8192,            8192
##UNITS=     SECONDS,       ARBITRARY UNITS, ARBITRARY UNITS
##FACTOR=    0.0002768,     1,               1
##FIRST=     0,             0,               0
##LAST=      2.2672688,     0,               0
##MIN=       0,             -42305,          0
##MAX=       2.2672688,     46661,           0
$$ Real data points
##PAGE= N=1
##DATA TABLE= (X++(R..R)), XYDATA
$$ [...]
797B060o39j435j509n83O81J502J304K50r20j205q58J61J025R52K23r25j179n71
$$ 2060 1421 -14 -1523 -2106 -1425 77 1381 1631 711 -494 -1352 -1191 -166 786 1009 84 -1095 -1666
815a666M24J395J412M80p04j272j105j73R17J174N62m84j294j165l50P85J273
$$ -1666 -1242 153 1565 2045 1341 69 -1036 -1209 -292 882 1444 960 -334 -1499 -1849 -1064 209
832B09O70j17r28q98r6R37J388R08j46j156j466q65K80J138R87J66p57j069p00
$$ 209 879 762 -166 -1064 -1160 -223 1165 2073 1927 771 -695 -1560 -1280 -142 845 1011 254 -815 -1515
851a515M00J152R27K36q19j261p94M74J362J325O88m15j297j209k93M88P12M38
$$ -1515 -1115 37 964 1200 381 -880 -1674 -1200 162 1487 2175 1760 463 -746 -1039 -551 161 599
869E99m24j097r01M4R78J440J004m6r38j057m26N00J060Q40l6j029j295p57J29
$$ 599 175 -922 -1823 -1779 -801 639 1643 1597 659 -398 -824 -324 736 1576 1540 511 -784 -1541 -1412
888a412Q01R51J03o04r80m22O17J283J381M96n72j307r83k19O87Q79M17o35j124
$$ -1412 -611 340 443 -161 -1141 -1563 -946 337 1718 2214 1642 335 -648 -867 -180 699 1116 481 -643
907f43r11j70P35J049P54k89r03q19J5Q94J520J040K6r18j214q19qO36M03k75
$$ -643 -1554 -1724 -989 60 814 525 -378 -1197 -1182 -288 1232 2272 2298 1380 166 -653 -661 -25 378 103
927A03r87j010n32O16J307J302O63k97p98n89K13R62R70J53p77j355j262l65N33
$$ 103 -884 -1894 -2426 -1810 -503 799 1462 1165 367 -222 -9 953 1923 2076 1299 -56 -1318 -1683 -1150
946a150P72M09l44p99o96N8J177J450R74Q5p55j043l74M18Q55N77k82j113j290
$$ -1150 -378 31 -313 -1112 -1808 -1750 -573 877 1851 1936 1181 138 -236 182 1037 1614 1332 219 -1071
965a071q14J89P37P90J41n80p81k98P19J397J343O53l09r86r04k16L33N03k7q34
$$ -1071 -1885 -1696 -959 -169 -28 -608 -1389 -1687 -968 429 1772 2425 2116 1130 226 10 343 846 819 -15
985a5j329r82k31Q45J202Q04J55n54m54J96Q72J205Q12j63j069j227q05l2N13
$$ -15 -1344 -2326 -2557 -1712 -510 294 449 -105 -559 -363 509 1714 2526 2363 1294 67 -738 -770 -257
1004b57M64k74q49j002l75N15J208J234O12k24o87m13K19Q39Q33K55q72j271j060
$$ -257 207 -67 -916 -1918 -2293 -1778 -570 664 1276 1052 365 -48 171 1010 1843 2098 1226 -45 -1105
1023a105l43M03P41K59l26p73o32R9R28J352Q13J43o21p26k17N11P61M53l15j099
$$ -1105 -1448 -1045 -304 -45 -371 -1144 -1776 -1677 -749 603 1416 1559 938 212 -5 506 1267 1720 1405 306
1043C06j264q88M4O76O79O4l39m97n4P61J333J264L97m30j093r67l43L41M29J7
$$ 306 -958 -1846 -1802 -1126 -447 -383 -722 -1219 -1273 -512 821 2085 2482 2052 959 -8 -351 -10 419 436
1063D36o64j016p82J0Q25J067P30L6n53n76N4P59R86O84j34q90j112o18Q9N68
$$ 436 -228 -1244 -2026 -2016 -1191 -124 606 642 89 -487 -433 326 1312 1996 1862 972 -140 -758 -669 -101
1083a01L89j35p68r97l11M10J039J019M18l21n51l21M20Q07Q59K21p02j214j037
$$ -101 288 153 -615 -1612 -1923 -1513 -474 545 963 642 91 -230 190 997 1856 2077 1375 161 -876
1102h76l76J96N15K21l76o60m16K87J044J279Q92m3o47p96l57L16O56L59j75r47
$$ -876 -1252 -1056 -541 -320 -696 -1356 -1772 -1485 -441 838 1730 1687 1040 244 -113 203 859 1218 1043 96
1122I6r74n34J57O07N94j3n19o34j66O57J120J172M25m10p65p32k45L59M10J8
$$ 96 -878 -1412 -1255 -648 -54 -67 -586 -1220 -1386 -729 391 1563 1988 1578 813 81 -164 195 605 623
1142F23o24r19o29p2P66Q62M91j30p05n73J6P57R96P62Ko33q04l49J20L88K82
$$ 623 -1 -920 -1549 -1621 -855 7 498 368 -337 -910 -894 -137 859 1621 1623 990 186 -163 -43 345 627
1163F27k66q72r04m49L89R14Q83L39k44n81l50L03P51P94K08m49q18p79j29L70
$$ 627 361 -511 -1415 -1864 -1475 -561 322 661 417 -164 -514 -211 540 1334 1542 1093 275 -504 -633 -263
1183b63L79K18n01p82n91P4P54J008P26j9n62o64j59L61O63M48j32n66p72l72
$$ -263 116 334 -167 -949 -1540 -1466 -712 296 1022 1003 441 -223 -382 -21 642 1090 958 392 -380 -752
1203g52K84N50M98j39p30q25l45K43Q75R35N11k25o01m12M9M79N12Jn04r22o65
$$ -752 -468 82 580 441 -289 -1114 -1459 -1216 -341 594 1105 880 279 -133 -84 395 907 908 404 -518 -1183
1224a183k5O50P73M87j69o73o14k01M87P04N10n0m72n26j05M31P34M12k56p45
$$ -1183 -1208 -558 215 702 533 -140 -754 -955 -468 236 746 696 224 -302 -407 24 758 1170 914 169
1244A69r06n15K05N93O20K08l20n63l15L89P61O86J85m15o92n86p9M36N52J53
$$ 169 -737 -1252 -1047 -454 166 374 54 -509 -824 -435 326 1012 1197 782 90 -496 -575 -139 413 566
1264E66l93p11n22n7O36P38N35l3n94n86j77L25P04L34q9n71o10j56L67O56N35
$$ 566 173 -538 -1060 -1117 -481 257 792 759 165 -421 -598 -273 431 765 676 105 -505 -661 -294 362 897
1285H97n3o93q40m53J14N60O24K81k23l95k37L50O89N91J55o12p94p29k06L47
$$ 897 844 151 -689 -1142 -1028 -468 156 437 214 -181 -418 -68 621 1212 1367 755 -39 -768 -974 -627
1305f27N71L46k23n52l90R1N54P02M80o9m98o48k33K92N74M38l6n93o72k92J36
$$ -627 -56 290 67 -485 -875 -784 -230 472 952 883 385 -263 -496 -204 370 808 772 179 -493 -785 -649
1326f49N14M91J02m54o48k54J80O70P34J85k15n34m09M6M94N34J54l90q29n94
$$ -649 -135 356 458 4 -644 -898 -718 -48 686 871 656 122 -287 -241 253 787 941 551 -278 -872
1346h72j73L58N78L06p4m95m12O1N37P69N25j5m30n87l73J43L87K92j58n80o47
$$ -872 -1045 -687 -109 197 123 -372 -784 -723 -186 583 1108 1093 663 76 -297 -154 233 525 367 -213 -860
1367h60l66K40O13O77K27k15m70l03K64N37O10J54l67o53n14j34K89N12J32k90
$$ -860 -1226 -986 -373 304 531 316 -154 -457 -193 344 954 1108 741 88 -426 -560 -271 241 373 83
1387H3n99m75q4O02P10M44k7l78m64j52L44M84M15j20n55o19l05J73M58L77mm87
$$ 83 -516 -991 -1075 -473 237 681 654 276 -188 -340 4 488 903 783 228 -391 -696 -523 -65 312 308 -179
1409a79n97k85K53O99O94L60j46m55l25K4L04L54k6m61p10n64j65M68O32M22j4
$$ -179 -776 -1061 -808 -109 585 945 799 344 19 43 347 701 675 214 -496 -1060 -1225 -757 -125 297 283
1430B83k98l90L5L77O57L91j09n29n35k47J12L51K60k49n37n68k48L04O86P15
$$ 283 -15 -405 -370 7 664 1055 946 417 -118 -365 -253 98 358 109 -428 -996 -1244 -940 -254 461
1450D61K90k6m13k83J00L19M32j09m08o27m96m7L66N37K01k26m83m83m2M72N99
$$ 461 751 725 312 29 129 448 880 771 363 -264 -760 -807 -441 96 297 71 -412 -895 -937 -465 134
1471A34N51J14k52l88jK28M46Q3k66p14p58m43R4N02M49J79k23k27r1L83O72N94
$$ 134 685 799 547 159 158 386 832 915 649 -65 -823 -1266 -1172 -670 -221 -42 -265 -492 -583 -200 472 1066
1493A066K21k23o28l70j09K11K10j14n27p24l93K2N01P48M29J69k07k44QL67M06
$$ 1066 1287 1064 436 66 -43 168 378 264 -263 -987 -1380 -1358 -857 -109 320 489 282 38 46 413 819
1514H19J54j97m90n94j94J69M52K75j01n90n66l77J86N65N29K90K1j35l4K82M17
$$ 819 973 776 286 -308 -502 -333 119 394 293 -297 -863 -1240 -1054 -489 40 330 351 216 182 464 881
1535H81L92r3o23q03o40k02K86M38K69j16k16k70J66M17N35L68n5l84l85l2K36
$$ 881 1273 1180 557 -246 -886 -1088 -802 -364 -95 -211 -427 -697 -531 -114 421 789 734 350 -35 -67 169
1556A69L77K63k55n71o04l20L7M27M45J36k32k76j21K41N76N04O8k29m40l56K8
$$ 169 546 809 554 -17 -621 -941 -904 -477 -32 104 -128 -404 -525 -284 292 796 864 635 195 -161 -133
1577a33L97K51L5m22n88n41n8K65N33M11J31j29j41K6L91M23J63k74o39o66k35
$$ -133 264 515 550 128 -460 -1001 -1059 -794 -261 150 281 152 11 37 428 851 1014 740 101 -565 -800
1598h00J84M51L86M1k72l88q1R3L90L17K9k43l94j49K71M96M38J81l40n72m78
$$ -800 -616 -165 221 262 -10 -398 -479 -386 4 321 350 107 -287 -436 -165 331 769 950 610 38 -440
1619d40j31K08K94R1j38l46j70J8M68N64L19q3l52l08j13K28M26J07j64m82o26
$$ -440 -571 -363 -69 22 -116 -462 -632 -614 -146 418 737 654 302 -6 -119 109 535 642 478 -4 -630
1640f30k18N0L78L85J37j75j72q4L54M98L27L2l95n44l63q3L51M08J07k20l85
$$ -630 -848 -798 -420 -35 102 -73 -245 -329 25 523 850 882 487 -57 -420 -503 -152 256 363 143 -242
1661b42k91K5K94L19J90k19k62k90M4M42M81L52k1m81l98l19J43L00J46j05l43
$$ -242 -533 -508 -214 105 295 76 -186 -476 -432 10 491 843 822 341 -57 -376 -233 67 213 108 -235
1682b35l47k01K65M06L81J44k06l31q2J55N10L51pl06n01m43j89K21K13J80j34
$$ -235 -582 -783 -518 -112 269 413 207 -124 -206 -51 459 810 803 497 -4 -447 -636 -415 -202 -22 -156
1703a56k51j50J64M15N01K61j66m30l06k71K25L16K98r1l62k83j73K13K55K37
$$ -156 -407 -557 -393 22 523 784 618 188 -118 -389 -164 152 450 359 -3 -286 -459 -246 9 246
1723B46n9l03m10j61K67M15M73J05j53l10k08j9K35L05Qk76n15k90K3L05L03K28
$$ 246 187 -116 -526 -687 -420 -5 468 573 420 110 -98 -117 118 423 431 155 -360 -650 -627 -322 -19 209
1745B09j10k34j89K0L43M77K01m4m26m02j87Q4J81K15Jl76k33j04K88L28L81O7
$$ 209 99 -135 -324 -304 39 516 717 673 247 -155 -342 -258 -77 138 139 -237 -470 -574 -286 42 423 490
1767D90k69l15k31P7L14L19J04j62m03l18P0K71L14M2k19m12k93L7K96N01K93
$$ 490 221 -94 -325 -248 66 385 489 327 -76 -394 -324 -53 261 303 84 -328 -621 -584 -288 213 506
1788E06o6k79k81rK04K98J33j47l69l76k15J20L15K50K9j27l30j9J80L41L36R1
$$ 506 440 161 -120 -129 75 373 506 359 -10 -386 -601 -481 -166 84 113 -14 -344 -363 -183 158 494 585
1810E85k40l25k10mK47K46L7k87l57k19n2L09L44J50p5k58k57J3L25L79K57n5
$$ 585 345 20 -190 -194 53 299 336 49 -308 -527 -579 -270 74 224 149 -109 -366 -353 -28 351 608 553
1832E53l13l12r0J07K80J35k35k65m46j73J83L84L48M7o9j98nJ60L12K35M1k72
$$ 553 240 -72 -162 -55 225 360 125 -140 -586 -759 -576 -192 156 203 134 -64 -69 91 403 638 679 407
1854D07m38l10r8K43K41M6j35k95j64M5K51M20J76j46k28j65RL43K67J38r6l67
$$ 407 -31 -341 -439 -196 45 91 -44 -339 -503 -458 -207 213 389 243 15 -150 -141 202 469 607 511 144
1876A44l60j42L4K14J29k8k46k95j8K07M16L37J18q9k56k01J09J76K27n0l23l57
$$ 144 -216 -358 -324 -110 19 -9 -255 -550 -568 -361 55 392 510 421 165 -36 73 249 476 426 103 -254
1898b54l09J5J53K54J79p5j96j84J47K96L10K81l6k69l24j51J12K46J27j08l39
$$ -254 -563 -548 -395 -141 38 -37 -233 -417 -270 26 336 617 581 312 -12 -163 -51 195 322 214 -125
1919a25l19j68J29K77K05P1m6k40n3J70M25K50P3j40l70l17j3L2K00L6j91k79
$$ -125 -444 -612 -483 -206 -1 70 24 -216 -269 -99 326 576 649 509 139 -178 -191 -159 41 77 -114 -393
1941c93j90P2K96L34J93p5j82k19j1K86K61K23o2k62k88j88pJ39J12j00k73k33
$$ -393 -583 -511 -215 119 312 237 55 -164 -175 111 372 595 533 271 -17 -205 -212 -73 39 -61 -334 -567
1963e67o1K26L59L95J45r7k03j85J12J58K15j64k48l75k65L1J33K96M6N7k70q5
$$ -567 -628 -402 -43 352 497 400 197 12 124 282 497 333 85 -290 -555 -524 -391 -95 -49 8 -262 -347
1985c47Q2L02L36J78j6k79k68j78J26K74J35o5l12k77j24J8K71J48%k15j58j9
$$ -347 -265 37 373 551 535 256 -12 -190 -64 210 345 280 -32 -309 -433 -415 -144 4 4 -211 -369 -388
2007c88K27L50L61J97j66k26k57o0N7J7j19k31m20j73J07L12M28K08P5p3j63P5
$$ -388 -161 189 550 747 581 355 98 38 95 112 -7 -238 -658 -831 -724 -412 16 224 299 226 63 138
2029A38J77K17K6j41k93l14j99J11K08J01Pk24j62j37J90K88K46J01j80j28j03
$$ 138 315 532 558 417 124 -190 -389 -278 -70 31 38 -186 -348 -485 -295 -7 239 340 160 32 -71
2050g1J30J99J50Q9k09k87k15j16J50J21J8j46k24j28J07L11L94K18n5j05j91
$$ -71 59 258 408 497 288 1 -214 -330 -180 -59 -41 -187 -411 -539 -432 -121 273 491 436 331 140
2071A40m1J00R3K6j54k63l56j13R3K36K80N0j01j36PQ8K51K47J6k14k24j82N2
$$ 140 99 199 292 318 164 -99 -455 -568 -475 -239 41 91 -10 -146 -139 -51 200 447 463 249 25 -157 -105
2094a05J06J45oj48l42o1l7K17K80P2Q7j97k03Q4J50K52J62m4k19l13j44J29J44
$$ -105 1 146 140 -8 -350 -411 -448 -231 49 121 208 11 -192 -108 42 294 456 412 193 -120 -264 -135 9
2117IJ05pk67j69q5O0L09K65M3r1j48n1L2K33J93p8j71k92k33l7J40K04J07n7
$$ 9 114 107 -160 -329 -414 -354 -45 220 263 172 24 -27 5 238 431 353 182 -110 -343 -380 -240 -36 71 14
2141A4j94q6Q2J25L00J28k9k21j76r8R7K09J35j30k89j34n8Q2K40J41j5j59j23
$$ 14 -180 -266 -184 -59 241 369 340 119 -57 -155 -58 151 286 156 -133 -267 -325 -243 -3 138 123 -36 -159
2164a59o0J24K02J58J06j53k16j41K7J53J04mq9l26j17M3J60K18J52p3j36j26
$$ -159 -219 -95 107 265 371 218 2 -139 -112 41 145 141 52 -274 -391 -348 -188 30 182 109 -27 -153
2186a53K9K11K19R7j15j58k59j08M0K52N3q5j22k06n9Q3K74J91K5n9j40q4jK12
$$ -153 -124 87 306 403 288 130 -129 -237 -197 55 108 23 -99 -305 -364 -281 -7 184 209 150 10 -74 -75 137
2210A37J34Mr9k46j21J4N9K01M6j70k06j16L8J73K82P4J8r6j74nR0K09J13q8k54
$$ 137 271 275 176 -70 -191 -177 -118 83 129 -41 -247 -363 -325 -152 130 204 222 126 -48 -53 37 246 359 271 17
2235A7k21q0M4K02J04L7j89j65p4J80J74K83P3j41j68j41L2J08J32K7j86k45j81
$$ 17 -204 -284 -240 -38 66 103 -86 -251 -325 -145 29 312 385 244 76 -65 -33 75 207 234 48 -197 -378
2258c78P4J67J88R8r8j34j39J10P3J94J13j8j36j28o3P3J11Q2q6k21j31o9J6K19
$$ -378 -304 -137 51 149 51 -83 -222 -112 -39 155 268 250 114 -14 -77 -4 107 189 103 -118 -249 -318 -302 -83
2282h3J23Q1p2j29n0N8K03J07O0j15j81j27L2N9J27P6j71j44j39qJ49K20J25p8
$$ -83 40 121 49 -80 -130 -72 131 238 298 183 2 -125 -93 -34 93 169 -2 -146 -285 -293 -144 76 201 123
2306A23p3j07l5J55J31O7r3j46k12n5N4K15R9k2j01j81r8J37K22R4O2q9j60o3
$$ 123 50 -57 -92 63 194 261 168 22 -190 -245 -191 24 123 101 0 -181 -279 -142 80 174 236 147 -13 -76
2330g6Q7Q1J20jj16j88j43lJ38J47J08j22r1j22o6K34R3J54rj81j15n2J01J67
$$ -76 11 92 212 211 95 -93 -236 -239 -101 46 154 32 -59 -181 -247 -13 80 234 225 44 -71 -123 -22 145
2354A45M1n2k13j49q7P5K27J40Nl7r6j22K6K52Q9n4n1j68j92K3J71R2J34j28j29
$$ 145 186 134 -79 -228 -315 -240 -13 127 132 95 -1 -123 -97 155 244 190 139 -29 -221 -198 -27 65 199 71 -58
2379e8j35L6J05J11J32j29j00q2k1J45J44M0J9j50j47j05R5R9J70j57r3j46k5
$$ -58 -193 -157 -52 59 191 62 -38 -120 -141 4 148 188 207 57 -90 -195 -100 -1 169 12 -81 -227 -252
2402b52J8K44J26N7n7n0j34J07O0O5Jj27j80j63J2J90J26N2n1j61k8LJ22J47L1
$$ -252 -234 10 136 193 136 86 -48 59 119 184 185 58 -122 -285 -273 -83 43 95 44 -117 -145 -142 -20 127 158
2427A58j2p9j73k1R7J50P9ok00j41n9JK40O8l7q3j08p1Q8J27J76O3j65r5j20M6
$$ 158 146 67 -106 -127 -30 120 199 193 -7 -148 -207 -206 34 102 65 -18 -126 -197 -109 18 194 257 92 -3 -123 -77
2453g7O0P2J14k8l05j53M5J45J84M9Kj76K4M3L7J20J28r7j78j66l8R8J02J05l3
$$ -77 -17 55 169 141 -164 -317 -272 -127 57 106 108 -68 -44 -1 36 156 284 187 9 -157 -195 -97 5 110 77
2478G7j04j34qJ2K02P4Q8r7j27l8MR2J10Rj41j09j18J2J00J30R7o4j14q5l4J39
$$ 77 -27 -161 -169 -157 45 119 207 110 -17 -55 -51 41 151 160 19 -90 -208 -196 -96 34 131 67 -47 -132 -166 -27
2504b7J70J7k9r0j43mO9J14Q0o9j40j61m9Q9J44J03N3o7j58P5LJ27R4N0j64r2
$$ -27 143 160 131 41 -102 -106 -37 77 157 88 -52 -213 -262 -173 -29 74 127 60 -98 -23 -20 107 201 251 87 -5
2530ej53N5M0J36Mj67p0p7J05O7J54L6J01j32j01J2K7J12M3j6k54j37m4J05J07
$$ -5 -158 -103 -63 73 77 -90 -160 -237 -132 -65 89 125 226 94 -7 5 32 144 187 171 -83 -220 -264 -159 -52
2555e2R2on5j55K4J26P4J11%r1l3p7O9RJ19q0n5j75m4n0J11J22O2k9j02K5m2J91
$$ -52 40 34 -21 -176 -152 -26 48 159 159 68 35 -42 27 36 155 75 20 -155 -199 -249 -138 -16 46 17 -85 -60 -102 89
2583H9Q5N8r8m8j58p7P3P9J15o2j19j85L4K3J47R9O3o9q5lL2J19J19l4q7j94q0
$$ 89 174 232 134 86 -72 -149 -76 3 118 56 -63 -248 -214 -191 -44 55 118 49 -36 -39 -7 112 231 197 110 -84 -164
2610a64K2J16P7J1o1j30jo7J47J57N9m2j05r6P2K5J34K7r7q5j48ML4R2O3j8n5
$$ -164 -142 -26 51 62 1 -129 -130 -197 -50 107 166 124 19 -77 -5 20 154 181 84 -1 -149 -145 -111 -19 44 26 -29
2637b9j7k6L1Q7P2J1r5q3p1O9J02Q9j8p8j67j29J24J03N3j7K8o7r9O8R3O3O8p6
$$ -29 -46 -72 -41 46 118 129 34 -49 -120 -51 51 140 122 44 -123 -252 -128 -25 28 11 39 -28 -127 -59 34 97 165 89
2665H9m3j71K5J1J84K5n5o9j42k3P9R2N0L0j12m2k4M8J09Q0k7l5j22j03L1O3R5
$$ 89 46 -125 -100 -89 95 120 65 -4 -146 -169 -90 2 52 82 -30 -72 -96 -48 61 141 114 79 -43 -146 -115 -52 43
2692D3P0r7o8k8l5R8Q1N1m7j41n1J9Q4J07R5j21l8j63M9J2J44N8k1j03j08O6m0
$$ 43 113 16 -52 -80 -115 -17 64 115 68 -73 -124 -105 -21 86 181 60 22 -141 -92 -80 64 122 101 -2 -110 -44 -84
2719h4J15N6L3j05j02k6O5R0R2lm2j26j23N6M6P8o%j29K3k9J45Q9R0j30j1j72
$$ -84 31 87 120 15 -87 -113 -48 42 134 131 89 -37 -160 -104 -58 20 14 14 -115 -92 -121 24 113 203 73 62 -110
2746a10J6N8J01P9k9r5r6m6P6R5j3L6j38j19j3J03J03M5P3m4r9j4K3Q4N2M2n7
$$ -110 -94 -36 65 144 115 20 -76 -122 -46 49 36 72 -66 -185 -198 -95 8 53 126 82 -17 -31 -8 76 128 170 113
2773A13j82p2j6N0J31Rp2k8l5n9J73R9J58j05p7o0m7M6K6L7j10Kj05p8N7J19J00
$$ 113 -69 -141 -157 -107 24 33 -39 -67 -102 -161 12 111 269 164 87 27 -20 26 52 89 -21 -19 -124 -202 -145 -26 74
2800G4j2j01l7J8kP9J02M1q7m9p6L6M5J7k7L0k06o5P2M0J42J1q%m1l9Q7J01K6
$$ 74 62 -39 -76 -58 -60 19 121 162 75 26 -50 -14 31 48 21 51 -155 -220 -148 -108 34 45 37 37 -4 -43 44 145 171
2829A71n8j31p1J8j3P6P0Jj40q1n2J62Q8%J12k3o0j10j7J29O5j6p6j27m9PM4N4
$$ 171 113 -18 -89 -71 -84 -8 62 63 -77 -158 -210 -48 40 40 152 129 69 -41 -58 71 136 120 44 -83 -132 -125 -81 -27
2857b7Q1j0j47j7k2J49P2O3J9j07l1k7N7JL8j0j16j49j6M0O3J25lmm8j8L4J50
$$ -27 54 44 -103 -120 -142 7 79 142 161 54 23 -4 53 54 92 82 -34 -183 -199 -159 -96 29 26 22 -26 -44 -10 140
2885A40K4L6j30j11J7n7RQ0M7j19j6q9RJ40M8P9M3j09k7J0K0P3L6%j56n3m5rO7
$$ 140 164 200 70 -41 -24 -81 -72 8 55 -64 -80 -169 -160 -20 28 107 150 41 14 24 44 117 153 153 -3 -56 -101 -110 -43
2914d3O2l1n4j16Q4MJ39R2o0L7n6n1K4J7J01l0j46o4n1m1P8M6L5N9q1j13Q9Q1
$$ -43 19 -12 -66 -182 -98 -94 45 137 77 114 58 7 31 48 149 119 -27 -91 -142 -183 -105 -59 -24 35 -46 -159 -70 11
2942A1R7R0q9nj05p2R2J5om9p0q5k4O1N7J37k5kn1J2QJ04O1j6m0q2j18M6p2J45
$$ 11 108 198 109 104 -1 -73 19 34 28 -21 -91 -176 -200 -139 -82 55 30 28 -23 -11 -3 101 162 146 106 24 -94 -48 -120 25
2972B5J6q2n9q4L9R1K1J19l5j06L9PQ2R9Kn3m7j06n6M7N3j8kj19N2j08J27M6J03
$$ 25 41 -41 -100 -184 -145 -54 -33 86 51 -55 -16 -9 73 172 174 121 74 -32 -88 -41 12 -6 -8 -127 -75 -183 -56 -10 93
3001I3Q0o0k7n2m8Q4K4m8K1q9j37L8L0J06n3Q6j29m7M9N0J73o1j6l6j9k2P7L6
$$ 93 173 113 86 34 -14 70 94 46 67 -22 -159 -121 -91 15 -38 48 -81 -128 -79 -29 144 83 67 31 12 -10 67 103
3029A03J7m0j18j7n8L8PP2no2m1k5L2J74R9k3o5p5k2n7R9J3J6n1r7j05L7J05N1
$$ 103 120 80 -38 -55 -113 -75 -68 4 -1 -63 -104 -129 -97 77 176 153 88 13 -9 -66 33 46 62 11 -86 -191 -154 -49 2
3058BRN8j14L4J4K3O6M4q8j3m6k1MQ5j6Qj01j18N5JQ2Q0jJ6p6M9m1J00RL8j29
$$ 2 11 69 -45 -11 3 26 92 136 48 35 -11 -32 -28 57 41 49 -52 -170 -115 -114 -32 48 47 63 -13 36 -5 95 104 142 13
3089A3j35J0n8J50L8k6k5o0q6Q8J6J85J1l5o8L0k7Q4k2K8m4j31k7n8K4J15k5O5
$$ 13 -122 -112 -170 -20 18 -8 -33 -93 -179 -91 -75 110 121 86 18 48 21 105 83 111 67 -64 -91 -149 -125 -10 -35 30
3117C0n9p5J05l7Q0J18j2n0m0p9J6J3K3j9k9r2q9O5RJ10P7o2k1pJ7O2L5L9J1r0
$$ 30 -29 -104 1 -36 44 162 150 100 60 -19 -3 10 33 14 -15 -107 -196 -131 -122 -12 65 3 -18 -25 -8 54 89 128 139 49
3147D9l9l9RK6L3k9j12o4O1K0R2P9j5k3oj7j4J24mo3Lj29q3N0RP7OPqj09QP5J07
$$ 49 10 -29 -20 6 39 10 -102 -166 -105 -85 7 86 71 48 42 25 11 135 131 68 71 -58 -141 -91 -82 -5 1 8 0 -109 -101 -26 81
3180H1pJ2p0j1k7M7K3P1n5m8j01L3n5M5N2j3Mm8K5pJ05J07l8n1p1q7O6OJ1M0q1
$$ 81 74 86 16 5 -22 25 48 119 64 16 -85 -52 -107 -62 -10 -23 -19 -67 -42 -49 56 163 125 74 3 -84 -18 -12 -1 39 -42
3211d2k0o4M7O6J4M1k4Qo0K5k9J23l5L8l3j29J2jN6N3o4J2n2j5L4P2M5mn7m9l7
$$ -42 -62 -126 -79 -13 1 42 18 26 -34 -9 -38 85 50 88 55 -74 -62 -63 -7 46 -18 -6 -58 -73 -39 33 78 74 17 -32 -69
3242f9O6L2J19j8j01l3p7l7L0P9ro1nk1J25m1J17L7j08k2n4J1M5P0l6n8l5n2k5
$$ -69 -3 29 148 130 29 -4 -81 -118 -88 -9 -18 -79 -84 -105 20 -21 96 133 25 3 -51 -40 5 75 39 -19 -54 -106 -131
3271a31Q9O3Qrm0m4j0K7J33l5J8k7q1L3mRP1l9J3n1j58J23j9R0K6o4Jl4M6MN1
$$ -131 -42 21 29 20 -20 -64 -74 -47 86 51 69 42 -39 -6 -10 -1 70 31 44 -7 -165 -42 -61 29 55 -9 -8 -42 4 8 59
3302E9N6J9p2o0o6K6N5j7k1k7o9K1P9P6L2p6J5m1qL9n2J19Kj09LN3n0J9M0mj15
$$ 59 115 134 62 2 -64 -38 17 0 -21 -48 -117 -96 -17 59 91 15 30 -11 -19 20 -32 87 89 -20 -17 36 -14 5 45 41 -74
3333g4M8m7JO4K3QM2n9p2N2j0O3R0q2o4o8K6qN5J5K8q5j2J8QN8J3O6o7mp3O5J4
$$ -74 -26 -73 -72 -8 15 23 65 6 -66 -14 -24 39 129 47 -17 -85 -59 -67 -12 3 31 -54 -66 -48 -40 18 31 97 30 26 -47 18 32
3366C2K5om9n6l2N2j5MP9k7L7p1lJ1O2J0R1j43J7j4l9N8P3r9j2p3m2j5J47K3o
$$ 32 57 51 2 -54 -86 -34 -49 -45 34 7 44 -27 -30 -19 43 53 144 1 18 4 -35 23 96 -3 -15 -88 -130 -145 2 25 19
3397A9l2j7J8J0L3N1lnr6o8M1L1N4qj09O9poJ1K5K5Mkm8M5n3J00j3l3m7l4m2O9
$$ 19 -13 -30 -12 -2 31 82 79 74 -22 -90 -49 -18 36 28 -81 -12 -19 -25 -14 11 36 40 38 -10 35 -18 82 69 36 -11 -45 -87 -18
3430a8J7L5K6m8q0k7Q3KN3N9m8l4nJ6M3m2L7J6j88l0J8M9K5O8j6o1Q2o4M7O3j8
$$ -18 -1 34 60 12 -68 -95 -12 -10 43 102 54 20 15 31 74 32 69 85 -103 -133 -115 -66 -41 27 11 -50 32 -32 15 78 60
3461F0l2n7M3n9K4N2k5k3m8jj1j6O6M6J5j3p5K5O2J1O2p2J3j1q3J4oQ1%m9Lp5
$$ 60 28 -29 14 -45 -21 31 6 -17 -65 -66 -77 -93 -27 19 34 21 -54 -29 33 44 106 34 47 36 -47 -33 -39 42 42 -7 -4 -79
3493g9J2K2L9O0%pr2N3M4J8lk6p8j7m0K0K3R4j5n6K5k3L9K5M4%r1J2kL7m2L1J1
$$ -79 -67 -45 -6 54 54 47 -45 8 52 70 67 41 -37 -54 -94 -74 -51 43 28 -28 -3 -26 13 38 82 82 -9 3 1 38 -4 27 38
3526C8o9Lj04Q5O5jM5l0k2J2n3L7M7O4r7J7j13M6j1K9J4P8p5o3J6NJ6Q9rk8o6
$$ 38 -31 -28 -132 -47 18 17 62 32 10 22 -31 6 53 117 20 37 -76 -30 -41 -12 2 80 5 -58 -42 -37 -21 68 59 31 -35
3557c5P0mL0j1j8k7n2l0%O5J6J2qk3j06J01l0Q8N6l0l7l4J5p3R3L8o9l3k6K3l0
$$ -35 35 31 61 50 32 5 -47 -77 -77 -12 4 16 8 -15 -121 -20 -50 38 94 64 27 -7 8 -65 28 66 -3 -36 -62 -39 -69
3588f9O7RL2Ro0l5L5Q2n3K3j9Ko8%J7RL6j5j2o0N8l3P4l4K2m6N2m1oQ4J0k8l5
$$ -69 -2 7 39 48 -12 -47 -12 70 17 40 21 23 -45 -45 -28 -19 17 2 -10 -70 -12 -45 29 -5 17 -29 23 -18 -24 60 70 42 7
3621Gk4p7P9L3J1p3j2lK2K0KN6K7o5k1lM0OM4o1oj0m6M0j7N8m3k4L4j05N6M5J07
$$ 7 -17 -94 -15 18 29 -44 -56 -59 -37 -17 -15 41 68 3 -18 -21 19 25 69 8 2 -8 -54 -14 -31 27 -16 -40 -6 -111 -55 -10 97
3654I7n7O8r0n4L3k4J30m5p4j9j4m8Q9Lk5N3r5NL4M7n4R6L2p4j8n1N6M0J9o3k5
$$ 97 40 108 18 -36 -3 -27 103 58 -16 -35 -49 -97 -8 -5 -30 23 -72 -67 -33 14 -40 56 88 14 -4 -55 1 41 60 -3 -28
3685b8rmll0K5K0j6J9L5n8N6KM8L6o9L4p0J6QjJ5p1MnPP3l4M4j0j3p8J7Q2L9k
$$ -28 -37 -41 -44 -74 -49 -29 -45 -26 9 -49 7 9 57 93 24 58 -12 4 12 11 26 -45 -41 -46 -39 34 0 44 34 21 -57 -40 42 81 79
3720G9p7p0l8J30MJ1k0l1o4lP8k7R0p7NJ9j1j2N7J7N2n4k7j5l6J5N5k4m3kj1k8
$$ 79 2 -68 -106 24 28 39 19 -12 -76 -79 -1 -28 62 -15 -10 9 -2 -14 43 60 112 58 31 16 -20 -5 50 26 -17 -19 -30 -58
3752e8lL7O1M6q7oqk4L1J5P7q3m4m3N2j7R4k7J4p4O4l3L2L7%N4j03Nm8R4o7L5
$$ -58 -61 -24 37 83 -4 -10 -18 -42 -11 4 81 -2 -46 -89 -37 -54 40 13 27 -47 17 -16 16 53 53 107 4 9 -39 55 -12 23
3784B3n0K8q1ML5N2l2P9r0k1P0KJ2N8k0o8N7o6JJJ9jl4o4nM8L3nQ9m7l3%L1k4
$$ 23 -27 1 -80 -76 -41 11 -21 58 -32 -53 17 19 31 89 69 1 58 -8 -7 -6 13 12 -22 -86 -91 -43 -10 -15 74 27 -6 -6 25 1
3818AlN4J4o6Jo5L7J3oJOnm5j5L7P3JJ5j18Q4J9j8L4J7o7j0r2M5K8K8N9k6n0Q
$$ 1 -2 52 66 0 1 -64 -27 -14 -20 -19 -13 -18 -63 -78 -41 32 33 48 -70 14 33 15 49 66 -1 -11 -103 -58 -30 -2 57 31 -19 -11
3852a1m8R8K5q1Q9l5j9JmL3j5O%j21M9L2n7O7L8n3j4o2M3O8m0P3L0n0r1J02k2
$$ -11 -59 39 64 -17 72 37 18 19 15 48 33 39 39 -82 -33 -1 -58 9 47 -6 -20 -82 -39 29 -11 62 92 42 -49 53 31
3883C1M2l8J3r5n3R8m5L4L8pk7J2l0J7M2O1j3n8n5L3Jk4M4L5p2l9M7l9K8R6%q5
$$ 31 73 35 48 -47 -100 -2 -47 -13 25 18 -9 3 -27 -10 32 93 80 22 -33 0 1 -23 21 56 -16 -55 -8 -47 -19 77 77 -8
3915hj9j9M4K3M7pq4J4m6J3K4j6k5K2j8J2qQ3K0m3M5o3j7PL6mL4Mm1j4l5j7M4
$$ -8 -27 -46 -2 21 68 61 -23 -9 -55 -42 -18 -34 -59 -37 -55 -43 -51 32 52 9 54 -9 -26 -19 17 13 47 51 10 -4 -39 -56 -12
3948a2J3J8q5Q1j5LM3K4m5oj7j7J4O7Kk9n6o3mP5n4Q6Km0M3q5J0O6M6Nm5k9K7
$$ -12 1 19 -66 15 0 3 46 70 25 19 2 -15 -1 66 68 39 -17 -80 -84 -9 -63 23 25 -15 28 -57 -47 19 65 70 25 -4 23
3981B3j6m%J8j0m0Pj2K9J3L3K4r7O6j8k5J5L3O8n9j03J0K7Q4q2M5n8nMQK6M7K0
$$ 23 7 3 3 21 11 -29 -22 -34 -5 8 41 65 -32 34 16 -9 6 39 107 48 -55 -45 -18 66 -16 29 -29 -34 -30 -22 4 51 71
4014G1p5P2r6Q4m5M0K2j9j14O4k3N8p8J9L7ql4j1M4M6j6po0J5jOl3O1rk7k9K4
$$ 71 -4 68 -28 56 11 51 73 54 -60 4 -19 39 -39 -20 17 9 -25 -36 8 54 38 31 -29 -14 -15 -9 -42 19 10 -17 -46 -22
4046b2k4K2oO8k2Mn2KK4K8L7o4loL0l8L1N8k1Kp4n1M3Q1n8Lk2J7l2M5K1P3l0K0
$$ -22 -46 -24 -30 38 16 20 -32 -30 -6 22 59 -5 -8 -14 16 -22 9 67 46 48 -26 -77 -34 47 -11 -8 -30 -13 -45 0 21 94 64 84
4080H4n9lp6R5o3J0k4j1N0p7P2L2K0p6Mj3K2K3JL1o9M2l0o2O3Q6r9N9m2jJ9m2
$$ 84 25 22 -54 41 -22 -12 -36 -47 3 -74 -2 30 50 -26 -22 -35 -13 10 11 42 -27 15 -15 -77 -14 72 -27 32 -10 -11 8 -34
4112c4O0j8Pp2J9KJ1R1Nj5p7R6j52K4lL2N7n7ok0JJ21Mq6P0j4r1M5NM8q7K3l2
$$ -34 26 8 15 -57 -38 -36 -25 66 71 56 -21 75 -77 -53 -56 -24 33 -24 -30 -50 -49 72 76 -10 60 46 -45 0 5 53 -34 -11 -43
4145d3J1lJ0M6K8m1kk6K0K4L3L1l6m5q1M0nL6nj6mk2MJ6pP5J6qp4M2m7M8M4qq
$$ -43 -32 -35 -25 21 49 8 6 -20 0 24 57 88 52 7 -74 -34 -39 -3 -8 -24 -28 -50 -46 -30 -37 38 54 46 -28 14 -33 15 59 51 43
4180D3o3k4O1j7N1k4j8k6j4k5M7L2j0J9p4N5n9N3K1M8j08N8K0q1l9N0J4M3k9n6
$$ 43 -20 -44 17 0 51 27 9 -17 -31 -56 -9 23 13 32 -42 13 -46 7 28 76 -32 26 46 -35 -74 -24 -10 33 4 -52
4210e2M7J1m2P6oj8j8k2OP8l7k4L7n2J1k9LL4J2J8l3k3k0L9N3j3j2l7R0j00M3
$$ -52 -5 6 -36 40 34 16 -2 -24 -18 60 23 -1 36 -16 -5 -34 -31 3 15 33 0 -23 -43 -4 49 36 24 -13 77 -23 20
4241B0J7l7jj0m3QL3K4K8k1lo0RL8l3L6K0j4j3k8L0j7M7n6QJ4o6Q4m3P9qj7Jj6
$$ 20 37 0 -1 -11 -54 -46 -13 11 39 18 15 -45 -36 2 -31 5 25 11 -2 -30 0 -17 30 -26 -18 -4 -70 14 -29 50 42 25 26 10
4275A0q5P1P4j4K0m9K1j31K0J0Q4l7m0OO6q4P1J4m7K9rj9pMM4J2nk4m5J8K4l5
$$ 10 -75 -4 70 56 76 27 48 -83 -63 -53 31 -6 -46 -40 26 -58 13 27 -20 9 0 -19 -26 -22 22 34 29 5 -40 -22 2 -33
4307c3L8ll9M7j6MnN4lk8l8J0M7jN0l1k9n7qL7j0l7O1M4o9k4O0K8l6M6o6m0K7
$$ -33 5 2 -37 10 -6 -2 -7 47 44 16 -22 -12 35 34 84 53 24 -33 -41 -4 -14 -51 10 54 -15 -39 21 49 13 59 -7 -47 -20
4340b0l4O0K4p6J8N4r8N4k1M3%j6J8p3N6J4lL7L2Kn7m9j1L5K7k4kl1PNM8J3M3
$$ -20 -54 6 30 -46 -28 26 -72 -18 -39 4 4 -12 6 -67 -11 3 0 37 69 71 14 -35 -46 -11 16 -8 -10 -41 -34 -29 19 32 75
4373G5o4j7N4p3M0L1j3m3O2p6J8k1MN6k1n1K3l7M7J9j0LK0Kj8M3J6n5L9j22M8
$$ 75 11 -6 48 -25 15 46 33 -10 52 -24 -6 -27 -23 33 12 -39 -16 -53 -6 13 3 6 26 28 10 53 69 14 53 -69 -21
4404b1K3m7M4j0k6L7k4lM8m9N4J9o5KN4m7j8M0Pp0L8m8Q3o1J3mQN3q1N1K2m8L7
$$ -21 2 -45 -1 -11 -37 0 -24 -27 21 -28 26 45 -20 -18 36 -11 -29 11 18 -52 -14 -62 21 -40 -27 -31 -23 30 -51 0 22 -26 11
4437A1PMK8l2j5Pk7LL6nn6k3P1o1R0o3M0rl8L5L1p7K0M3m5J9m7N3j3L8l8L4m0
$$ 11 18 22 50 18 3 10 -17 -14 22 17 -39 -62 9 -52 38 -25 15 6 -32 3 34 -43 -23 20 -25 -6 -53 0 -13 25 -13 21 -19
4470a9oR1l2m6oK8p7L2J8M2m3J2qm5j3Q7%p2R6p8N4n%m5L7K5m8kk2N7l8QL1r3
$$ -19 -25 66 34 -12 -18 10 -67 -35 -17 25 -18 -6 -14 -59 -72 15 15 -57 39 -39 15 10 10 -35 2 27 -21 -23 -45 12 -26 -18 13 -80
4504h0K0M4l7N4K4n7K6l3L8k0oO1n7LoL1K5n9K7K7n5J2RO4m2j3J6J5n3k2L1K1
$$ -80 -60 -16 -53 1 25 -32 -6 -39 -1 -21 -27 34 -23 -20 -26 5 30 -29 -2 25 -30 -18 -9 55 13 0 16 31 -22 -44 -13 8
4536HJ6k4J8k5Kj3K4K2m9M5l3j9K4Op3N4L6K5qk6l9O2j1kJp5K6K9n8Q1m4M7Rp5
$$ 8 24 0 18 -7 -5 -18 6 28 -21 24 -9 -28 -4 2 -71 -17 19 44 36 10 -29 33 22 20 21 -54 -28 1 -57 24 -20 27 36 -39
4570c9O3q8P1l3L7K3p2P2o0L7n3P7o5k9k1J02o7O8mo5M3Kk%k3L5m7N2l7mL9J2
$$ -39 24 -64 7 -26 11 34 -38 34 -26 11 -42 35 -30 -59 -80 22 -45 23 19 -46 -3 -1 -3 -3 -26 9 -38 14 -23 -27 12 24
4602B4Rn5k8K9j8P5l6J4P1j19n3R4K9n6L5M3o0o8P1k3M1J2l5j3MK0m8J6J6M1k3
$$ 24 33 -22 -50 -21 -39 36 0 14 85 -34 -87 7 36 -20 15 58 -2 -70 1 -22 19 31 -4 -17 -13 7 -41 -25 -9 32 9
4633Il2P5j32J28o0j5Q3n3n2M7k0K5J3m3J6N8q4k4J17k1J7n9NJ4l0J0pl7K7k4
$$ 9 -23 52 -80 48 -12 -27 56 3 -49 -2 -22 3 16 -27 -11 47 -37 -61 56 35 52 -7 -2 12 -18 -8 -15 -52 -25 -49
4663d9L7lk0J00m0n9M8L5o7L8mN6r3ML2j1o6M2M3m8M9n3K5j0K0L0m1J8rr3R1P
$$ -49 -12 -15 -35 65 25 -34 14 49 -18 20 16 72 -21 -17 15 4 -62 -20 23 -25 24 -29 -4 -14 6 36 -5 13 4 -89 2 9
4695IK9k7k2PnlK7k1j5lK0m4oL7O4p8M9K8p3j3N2O6p3J0rll0n2O9pM3j1k6j7L7
$$ 9 38 11 -11 -4 -9 -12 15 -6 -21 -24 -4 -48 -54 -17 47 -31 18 46 -27 -40 12 78 5 15 6 3 -27 -79 -10 -17 26 15 -11 -28 9
4730IK7lnr2P3j1j0M0l5k7L8rk7LO3p8M6j0l2N9l7K3n5M7l2nJRL2J9l3qN3l2N9
$$ 9 36 33 28 -64 9 -2 -12 28 -7 -34 4 -5 -32 -29 34 -44 2 -8 -40 19 -18 5 -50 -3 -35 -40 -39 -30 2 21 -12 -20 33 1 60
4765F0j01L0L0J0m6N7k8J9q1QM1j0Jj2PO0K7q4%L6p9N1k4P6p5JP3j4n8J8K5J5
$$ 60 -41 -11 19 29 -17 40 12 31 -50 -42 -1 -11 -10 -22 -15 45 72 -12 -12 24 -55 -4 -28 48 -27 -26 47 33 -25 -7 18 33
4797C3j9J1m0m3M5PJ9m3J7j0P3o3L8j7l0J8nL6rK4m7J8pm8N2n8J0mK1NL8q1Q2
$$ 33 14 25 -15 -58 -13 -6 13 -30 -13 -23 50 -13 25 8 -22 -4 -9 27 18 42 -5 13 6 -42 10 -48 -38 -42 -21 -16 22 -59 23
4830B3M3o9O0n8k7K6%pJ5o5M9k1L5l1L5n2N7l2j9rO9j2PM9n7K1rl3L5j8K6m9j
$$ 23 66 -3 57 -1 -28 -2 -2 -9 6 -59 -10 -31 4 -27 8 -44 13 -19 -38 -47 22 10 17 66 9 30 21 -12 23 5 31 -18 -19
4863a9N4o6J3k8N0Mk6LJ4N5k7L4l2K3n8n4N2k9L7J3Mn4N9K7r8L4N0J1o2NK5oM4
$$ -19 35 -31 -18 -46 4 8 -18 -15 -1 54 27 61 29 52 -6 -60 -8 -37 0 13 17 -37 22 49 -49 -15 35 46 -16 -11 14 8 52
4896E2m8PN0j08j1L7J7m8J10p9jjk3Q2l2M4o8J3MJ4n9P4l7Ql8l6L3L9o0P1J1m0
$$ 52 4 11 61 -47 -58 -21 -4 -52 58 -21 -22 -23 -46 36 4 48 -20 -7 -3 11 -48 26 -11 -3 -41 -77 -44 -5 -65 6 17 -23
4928b3j1M8j8K5L6n4pP9n3mk0j2J4N6r2j3L8jk6M7k2j4jO1j8K1p3M1J0r2P9RM4
$$ -23 -34 14 -4 21 57 3 -4 75 22 18 -2 -14 0 56 -36 -49 -11 -12 -38 9 -13 -27 -28 33 15 36 -37 4 14 -78 1 10 54
4961E4p2J5K3m9j0K3MM8k3nL0p9k6Q8m8P1k8ok1OM7k9l2OL8o5M9O5q6P1m4Nm3
$$ 54 -18 -3 20 -29 -39 -16 -12 36 13 8 38 -41 -67 21 -27 44 16 10 -11 -5 42 13 -19 -13 25 -40 9 74 -12 59 15 20 -23
4994b3O8j9l8K1qp2j0K1J25j26M4J0j6L1mj6O9k8J3Ln4k4L5Q6p0l3oKplL0k8J1
$$ -23 45 26 -12 9 1 -71 -81 -60 65 -61 -17 -7 -23 8 4 -12 57 29 42 45 -9 -33 2 88 18 -15 -21 -19 -26 -29 1 -27 -16
5027a6NRK3m5K0K3j8%j6O3j7o8O2rk4j7J8K1ln5j7R9J6n6K7j8l3O1k1n3N7K1n0
$$ -16 -11 -2 21 -24 -4 19 1 1 -15 48 31 -37 25 16 -8 -25 -7 14 11 -44 -61 38 54 -2 25 7 -26 35 14 -39 18 39 -11
5060a1J4ML3n9J6J8l3Nk0M8j8k1J7rK3OJ1Rp5L7l5j1J3O5l8Jl8okR1K4p1M1m3
$$ -11 3 7 40 -19 -3 15 -18 -13 -33 15 -3 -24 -7 -16 7 13 24 33 -42 -5 -40 -51 -38 27 -11 -10 -48 -54 -56 35 59 -12 29 -14
5094a4O5m1J5o6j7L7J2k8R9n2M0l4n2QqJ4nN2M2m1l4L2K7o7mN7j4m9%j1M7KJ3
$$ -14 51 10 25 -41 -58 -21 -9 -37 62 10 50 16 -36 -28 -36 -22 -27 25 67 26 -8 24 51 -16 -20 37 23 -26 -26 -37 10 12 25
5127B5o4O1n9P0m4JP8n7j3J0k6j7K3P3j09R5pm4l2O3N6j7l9m1NN1Kr1Q4j6k4N1
$$ 25 -39 22 -37 33 -11 -10 68 11 -2 8 -18 -35 -12 61 -48 47 40 -4 -36 27 83 66 27 -14 -9 42 44 -47 37 21 -3 48
5159D8n8O3m5K0k5Mk8k4j2K9O1n0N3l4K1Mm9kL7q4N9nqMO3n6j8L8k8O0k8k2O9
$$ 48 -10 53 8 28 3 7 -21 -45 -57 -28 33 -17 36 2 23 27 -22 -24 13 -71 -12 -17 -25 -21 42 -14 -32 6 -22 38 10 -12 57
5192E7l5o6M6J4ll1J2k5jm5R7n5J18q9J9m9J2lK4jJ2j1%m1PQ5k8j4kj9J3Ok2k1
$$ 57 22 -44 2 16 13 -18 -6 -31 -32 -77 20 -35 83 -6 13 -36 -24 -27 -3 -4 8 -3 -3 -44 -37 48 20 6 4 -15 -2 4 -18 -39
5226c9L9J4m2N5k1l9O3l8jJ7p4J14k9k6K7K0o4L0J0o4M7mJ3L2k0j4nL4Ro4jj0
$$ -39 0 14 -28 27 6 -33 30 -8 -9 8 -66 48 19 -7 20 40 -24 6 16 -48 -1 -5 8 40 20 6 1 35 44 -20 -21 -31
5258c1lPPJ3K4m0K7L4m9K7L4l1M7o2J3k6JL7j5N2n7K0q3O3n2N3Km2J3K6l9K1J0
$$ -31 -34 -27 -20 -7 17 -23 4 38 -11 16 50 19 66 4 17 -9 -8 29 14 66 9 29 -54 9 -43 10 12 -30 -17 9 -30 -9 1
5291AL9m8K8K1j06N4Jk4L9L7r1M9j4N2m5J4K1k6k0P0j4m4J5m2k6J5N3K2j7m2K5
$$ 1 40 -8 20 41 -65 -11 -10 -34 5 42 -49 0 -14 38 -7 7 28 2 -18 52 38 -6 9 -33 -59 -44 9 31 14 -28 -3
5322clL4n5J4k9R8l2l9J1QM6k1l8l8K9K1l9K4j8K8Nn9N5p8J00M8m7J0J4o1J1J6
$$ -3 -6 28 -27 -13 -42 56 24 -15 -4 4 50 29 -9 -47 -18 3 -36 -12 -30 -2 3 -56 -1 -79 21 69 22 32 46 -15 -4 12
5354A2J7p0L6JQJk9K2LpLL8l0J0l4K1j6N7q8M2mM0j2k4j3nj4L4P0p1K3k8j4J6
$$ 12 29 -41 -5 -4 4 5 -24 -2 1 -6 -3 35 5 15 -19 2 -14 43 -45 -3 -7 33 21 -3 -16 -21 -35 -1 69 -2 21 -7 -21 -5
5388eK2rP9n2Lm8ML0l2L3mq%oK3l0l0NJ9o2Q7n2J6PJ2j3k4%j6M0L7l3l0M9l6r
$$ -5 17 8 87 35 38 -10 -6 24 -8 25 21 13 13 7 30 0 -30 -25 -6 -68 19 -33 -17 -10 2 -11 -35 -35 -51 -11 26 -7 -37 12 -24 -33
5424c3RoK0JN3m7n8L5mLL3m5Q8j02O8m5O9mql0Kl2J8L8K1m3j0O0j9l0qM0n3K3
$$ -33 -24 -30 -10 -9 44 -3 -61 -26 -30 -27 6 -39 49 -53 15 -30 39 35 27 -3 -1 -33 -15 23 44 1 -9 51 32 2 -6 34 -19 4
5458Dkk9L4l1L2nN0q7P0l1K6mm4L9j25J10k6k9K3N5m4K5oj2M3Qj3o6K9o9K3L0
$$ 4 2 -27 7 -24 8 3 53 -34 36 5 31 27 -17 22 -103 7 -19 -48 -25 30 -14 11 5 -7 36 44 31 -35 -6 -75 -52 -22
5490b2M5m6j6J4RJ8m5M0J7j1nN3o7LpL1j4N4o5O6l1l5k7M1ll9kJ8M6m2L6NJ0l8
$$ -22 23 -23 -39 -25 -16 2 -43 -3 14 3 -2 51 -16 -13 -20 11 -3 51 -14 52 21 -14 -41 0 -3 -42 -44 -26 20 -22 14 19 29 -9
5524iPRlKj2O7l8l0Rj1N9l1k9L6j6o3O1N8j9o1O4p3k1L7%j2L8m6L3M1r8QP7l1
$$ -9 -2 7 4 6 -6 61 23 -7 2 -9 50 19 -10 26 10 -53 8 66 47 -14 50 -23 -44 -7 -7 -19 19 -27 6 47 -51 -43 34 3
5558CRM0j19L4K5K8K1l7k4K0jk1Mk5M4k7L6n8M8K6Rm6J7On8M9j8k0L7m6L4N1m8
$$ 3 12 52 -67 -33 -8 20 41 4 -20 0 -1 -22 -18 -43 1 -26 10 -48 0 26 35 -11 6 12 -46 3 -15 -35 2 -44 -10 41 -7
5591gK4n6N3j8j5k8N1J1kj6LK0j5k4lM9o0R7q9NN1p4O1j8l5P1p2o9O6N9m7k4K8
$$ -7 17 -39 14 -4 -19 -47 4 15 13 -3 0 20 5 -19 -22 27 -33 64 -25 -20 31 -43 18 0 -35 36 -36 -105 -39 20 -27 -51 -23
5624b3L2p1J6Q4o5L7L0q3L7o5N3PN8n0j5J5K2o6M6Ln6J06r4K1L2j7K3J8l3M5n9
$$ -23 9 -62 -46 38 -27 10 40 -43 -6 -71 -18 -11 47 -3 -18 -3 19 -47 -1 2 -54 52 -42 -21 11 -6 17 35 2 47 -12
5655a2K8L0pJ5q5J00j13j6M3k9O5l0K3m5JL1J7l4P7n9LM3n1k7P6n9J3L2j8on8
$$ -12 16 46 39 54 -31 69 -44 -60 -17 -46 19 -11 12 -33 -32 -1 16 -18 59 0 3 46 -5 -32 44 -15 -2 30 12 6 -52
5686e2oJ21o8m5N0K0l6KjmL6pkl8m0L4nj3P8k5k7O3jm9K2J4M7n8n7lPP2r7Q4k2
$$ -52 -58 63 -5 -50 0 20 -16 -14 -15 -19 17 10 8 -30 -70 -36 -41 -54 24 -1 -28 35 34 -15 7 21 68 10 -47 -50 -43 29 -68 16 -6
5721fl6M2j1L0k8lQj1M1k2n6J7J27r7J1l9O8k5Jl0j3N3k1L2%j26Q8Qm1M8nj1j8
$$ -6 -42 0 -11 19 -9 -12 -4 -15 26 4 -52 -35 92 -5 6 -33 35 10 11 -19 -32 21 0 32 32 -94 -6 2 -39 9 4 -7 -25
5754b5O2p0Q9O3j19m2O5J6j4n3L8l7K1l0oN5o5J18k9k6QK3l7J2l9N8l3K4oL6m1
$$ -25 37 -33 56 119 0 -42 23 39 25 -28 10 -27 -6 -36 -42 13 -52 66 37 11 19 42 5 17 -22 36 3 27 21 57 16
5785A6j6J2ol0L2Ml5j1N5K8q1M3Oq0J03Mj9pm4N3Rqlj3Kj5n8N1OK6l4O8p9J1m4
$$ 16 0 12 6 -24 8 12 -23 -34 21 49 -32 11 17 -63 40 44 25 18 -26 27 36 28 25 12 14 -1 -59 -8 -2 24 -10 58 -21 -10 -54
5820e4K2M7jm0P2q1M3k7O3p2RM9l5l6L5k3ON3r3M1K8m8K7K4J2L6m2k9RP5j08M1
$$ -54 -32 15 14 -26 46 -35 8 -19 44 -28 -19 30 -5 -41 -6 -29 -23 30 -63 -22 6 -42 -15 9 21 57 15 -14 -5 70 -38 3
5852CN0m5L6n8n8J2J01Lp3k7M0k6L3rk1O6o7J6O7o8K1ln8L6J2nO9p2J7K2l1N2
$$ 3 53 8 44 -14 -72 -60 41 44 -29 -56 -16 -42 -9 -18 -39 27 -40 -24 43 -25 -4 -7 -65 -29 -17 -22 47 -25 -8 14 -17 35
5884C5m0P8j04O6j8MpoJ7p0Q9r7JQ4q7M7K1qJ8j1M7j05M0j8J1j8O8n8LJ4J5n0
$$ 35 -5 73 -31 35 17 21 14 8 25 -45 44 -53 -52 32 -55 -8 13 5 23 12 59 -46 -6 -24 -13 -31 37 -21 -18 -4 11 -39
5916c9j0L9QM7n1J8M2j11L7M2m5K1P1o4k1M5L3n4oL6r6L4M1m5N5j9j1%M2m6J3
$$ -39 -49 -10 -2 45 -6 12 54 -57 -20 22 -23 -2 69 5 -16 29 62 8 2 38 -58 -24 17 -28 27 8 -3 -3 39 -7 6
5947Fm3Q4o6N4pn5J7l4K5J0j8m7Q7l0%J6Ql3O8m1J9j0o3L9K3k4j8J2J9J9m3K6
$$ 6 -37 47 -19 35 28 -27 -10 -44 -19 -9 -27 -74 13 -17 -17 -1 7 -26 42 1 20 10 -53 -14 9 -15 -33 -21 -2 17 -26 0
5979@J1j1J6l0jM2k1k6K8%l1K7k3L9j9J4L3r1KL1J3j1M6j8mJ8j1m7K7l7N4m6p
$$ 0 11 0 16 -14 -15 27 6 -20 8 8 -23 4 -19 20 1 15 48 -43 -41 -10 3 -8 38 20 16 34 23 -24 3 -34 20 -26 -33
6012c3J6oLl1K2P1L7n9prn0N6l4N9o4%M3j4J1Kl2jK2j05Q6l3M6%MK8p2M3N3l6
$$ -33 -17 -23 -20 -51 -29 42 79 20 13 4 -46 10 -24 35 -29 -29 14 0 11 13 -19 -20 2 -103 -17 -50 -4 -4 0 28 -44 -1 52 16
6046A6n0P4k0o6O1J7m0J9k4L9K1po9N3Lk1K2p3L4MK7l2j6rJ8M2j3k9M8n8L7k5
$$ 16 -34 40 20 -46 15 32 -8 11 -13 26 47 40 -29 24 27 6 28 -45 -11 -7 20 -12 -28 -37 -19 23 10 -19 29 -29 8 -17
6078a7k5PL7l3K5oK0m5nl4N1mOnL4K1Rk5k8J7lJ3rrN3q8j8Q6j0m7Q3l6k1N0j3
$$ -17 -42 -35 2 -31 -6 -12 8 -37 -42 -76 -25 -29 -23 -28 6 27 36 11 -17 0 -3 10 1 -8 45 -43 -61 25 15 -32 51 15 -6 44 31
6113C1k7K9r9L2L2Pn4k2P3K3J7n1JN3j0o3Q6n2L2j6KPl4n3P7j3o1L4m2L6Q6q9
$$ 31 4 33 -66 -34 -2 5 -49 -71 2 25 42 -9 -8 45 35 -28 58 6 38 22 24 31 -3 -56 21 8 -53 -19 -61 -25 61 -28
6145b8KM7j0l0N7Pp1J3J3J11q7j2Kk7LNJ4r6O0lOQj9j9Q1o3O1n6qL3K4k0qK0k7
$$ -28 -26 21 11 -19 38 45 -26 -13 0 111 24 12 14 -13 -10 -5 9 -87 -27 -30 -24 -16 -35 -54 27 -36 25 -31 -39 -6 18 -2 -10 10 -17
6180a7M0j3%q3Q8om3j2j1J14p4K8K8k5qm%jm5L1K7j2q3P9L8l4qn3N3J8k5MKj5
$$ -17 23 10 10 -73 15 9 -34 -46 -57 57 -17 11 39 14 6 2 2 1 -44 -13 14 2 -81 -2 36 2 -6 -59 -6 12 -13 -9 -7 -22
6214b2m7O4L2o8M2K3j5J3l2j3M8k6ll7P6n4J0J2oo3O1L3m9R4j09K2J7rK9j4l4
$$ -22 -69 -5 27 -41 1 24 9 22 -10 -23 25 -1 -4 -41 35 -19 -9 3 -3 -66 -5 28 -21 73 -36 -14 3 -6 23 9 -25
6245b5M6J3k0n7N4l8PNKL1M1o4K9m2P3q2j8M5L0o3M9j5MM8n5pN8o9JJ5k9J5K4
$$ -25 21 34 14 -43 11 -27 -20 -15 -13 18 59 -5 24 -18 55 -27 -45 0 30 -33 16 1 5 53 -2 -9 49 -20 -19 -4 -33 -18 6
6278FP8p6M1n6K2J9rm9nK1Om2nJ3L9p5R6l8J0kQNM3m7k0K1P4q8K7Rprj5K9l7J4
$$ 6 84 8 49 -7 15 34 25 -24 -29 -8 -2 -44 -49 -36 3 -72 24 -14 -4 -6 2 7 50 3 -17 4 78 -10 17 26 19 10 -5 24 -13 1
6314Ap8M4j0O0Rp7N5J6l1j9k5R0n5N2p2L6J9L9l2q7OJ09o9Q6o0l8kl8R6n2K6K
$$ 1 -77 -33 -43 17 26 -51 4 20 -11 -30 -55 35 -20 32 -40 -4 15 54 22 -65 -59 50 -19 67 7 -31 -33 -71 25 -27 -1 1
6346AL0m6k0M4k5P8j6k8j9J0o6P3m7O8l7l2N4mJ3j6mo9lP3oK5m8L5j8J6J1Jo1
$$ 1 31 -15 -35 9 -16 62 46 18 -1 9 -57 16 -31 37 0 -32 22 18 31 15 11 -58 -61 12 6 31 -17 18 0 16 27 28 -33
6379c3P5k4j01R6k9J5l0M9j4K8n4J7m9KK0qL5J0j5Om8O0q0K6O7n0Q3n1k2J2k9
$$ -33 42 18 -83 13 -16 -1 -31 18 4 32 -22 -5 -54 -52 -32 -40 -5 5 -10 -4 -52 8 -72 -46 21 -29 54 3 -19 -7 -36
6410c6l7J08r8P5L0p8L3k7NnO2l5loK9n8jK0L2K3j6m1N7m1Km0K4O9n8N3j0j8n6
$$ -36 -73 35 -63 12 42 -36 -3 -30 -25 -30 32 -3 -6 -12 17 -41 -42 -22 10 33 17 -24 33 -8 -6 -46 -22 47 -11 42 32 14 -42
6443d2M0j3j4M9k8Rj9%l6O0m2M4Kn4qN8LJ0l5P9p1Pk4MNP3m2Rk1j5M9k7l2L2n4
$$ -42 -2 -15 -29 20 -8 1 -18 -18 -54 6 -36 8 10 -44 -52 6 9 19 -16 63 -8 -1 -25 -21 -16 57 15 24 3 -12 37 10 -22 10 -44
6478d4K3L8k5N6k1rl2l0J1jJK5k6K7k3M9n1M7lPpk5k6L0k1O2%m1K8k5J3n2N8p7
$$ -44 -21 17 -8 48 27 18 -14 -44 -33 -34 -33 -8 -34 -7 -30 19 -32 15 12 19 12 -13 -39 -9 -30 32 32 -9 19 -6 7 -45 13 -64
6512f4N7N0J4m4k3L8k0j5pK2l1J0M2N1o6l8M8n2RNK6m0J0kJRqPnjk3P0q8M0LM5
$$ -64 -7 43 57 13 -10 28 8 -7 -14 8 -23 -13 29 80 14 -24 24 -28 -19 -14 12 -28 -18 -20 -19 -10 -18 -11 -16 -17 -40 30 -58 -18 -15 30
6548C0Mp6K2J4J0mJ1jJ8k1l1K1J04o5l2k5J9n4L6O8q0P3o0L5n6J5K7j1J8j6nk3
$$ 30 34 -42 -20 -6 4 0 11 10 28 7 -24 -3 101 36 4 -21 -2 -56 -20 48 -32 41 -19 16 -40 -25 2 -9 9 -7 -12 -35
6580c5N7m2L1l1M5m2k1m2Q1J5m3L2j9%J6n0K7M4p4j4Q9Lo7M6lk8O4m8M2j7mqj5
$$ -35 22 -20 11 -20 25 -17 -38 -80 1 16 -27 5 -14 -14 2 -48 -21 23 -51 -65 24 27 -40 6 3 -25 39 -9 33 16 12 4 -11
6613a1K2m2k8O7n4M0j8qO6K0m6J9n1R0m8q1N9m7M7m8mO8l1M0l5J3%j7K8p8O6J7
$$ -11 11 -31 -59 8 -46 -6 -24 -32 34 54 8 27 -24 66 18 -63 -4 -51 -4 -52 -56 12 -19 21 -14 -1 -1 -18 10 -68 -2 15
6645A5p5P2K4rj1j7L7r1L5n4J04l9J8J4q0Q0p8RM5k3j6J4M7o6K4J3j7M6K5q0M0
$$ 15 -60 12 36 27 16 -1 36 -55 -20 -74 30 -9 9 23 -57 23 -55 -46 -1 -24 -40 -26 21 -45 -21 -8 -25 21 46 -34 6
6676Fk6J4K7knN0q4N7o6J9N7p5M4M4l4Or4O3n2J9L2m3K3j9P4o2j9Pj0M7m4PO6
$$ 6 -20 -6 21 19 14 64 -20 37 -29 -10 47 -28 16 60 26 32 -62 1 -51 -32 0 -43 -20 -39 35 -27 -46 -39 -49 -2 -46 -39 27
6709B7j5Jm9N7l9L3l3K5j5L8L4p1l0R0o2P5p9M4j2k9Nj4N6o7QP6m6m1j0K0L1K6
$$ 27 12 13 -36 21 -18 15 -18 7 -8 30 64 -7 -37 53 -9 66 -13 31 19 -10 -5 -19 37 -30 -22 54 8 -33 -43 -23 8 34
6741C4n8P2m1k1%k8L3K3m1K1L2J8m7Kk1L1L4pm8%J4J3No0K7l0P2m7O6m2l9L1K0
$$ 34 -24 48 7 -14 -14 -42 -9 14 -27 -6 26 44 -3 -1 -22 9 43 36 -12 -12 2 15 20 -40 -13 -43 29 -18 48 6 -33 -2 18
6774A8m9M8Nm1lj3oN2j5N1q5J5l0N0o1L7l5R6p1L8l6L4Rol0l0K5nL9Kj9L4k2l5
$$ 18 -31 17 22 -19 -22 -35 -41 11 -4 47 -38 -23 -53 -3 -64 -27 -62 34 -37 1 -35 -1 8 2 -28 -58 -33 -38 1 3 -16 18 -4 -39
6808c9J1M8kQl5N7l9o2K4P2k8kj6K3j8n7J3M5M1j5K7j4l1j4K0m7N9n0J6p4J7Q0
$$ -39 -28 20 18 26 -9 48 9 -53 -29 43 15 13 -3 20 2 -55 -42 3 44 29 56 42 11 -3 17 -30 29 -21 -5 -79 -62 18
6840A8oj7K9Qm3L3k7n3Q7j2l5l0OQ0k6l8k1%M1nj2N1Lj3Om3l0O7m5O9r1m8J46
$$ 18 12 -5 24 32 -11 22 -5 -58 29 17 -18 -48 -42 38 12 -26 -47 -47 -6 -11 -23 28 31 18 24 -19 -49 18 -27 42 -49 -97 49
6873D9n1Polk5K5J9o8RL1k1M5j9J0NRj8J6J6m3j5NRk3O6mjn9M4L4o4J2j8l0P2
$$ 49 -2 5 -1 -4 -29 -4 15 -53 -44 -13 -34 11 -8 2 7 16 -2 14 30 -13 -28 -23 -14 -37 29 25 24 -35 9 43 -21 -9 -27 -57 15
6908A5n8N8n7K4lLP6p3K4n5PL2K3%l6K1j0K2l7N4n4L9l5J9M0j2j6oj5Mk8O1m4
$$ 15 -43 15 -42 -18 -21 -18 58 -15 9 -46 -39 -7 16 16 -20 1 -9 13 -24 30 -24 15 -20 -1 39 27 11 5 -10 -6 -34 27 -17
6941a7QL8K8l7j2j0J4J1m2K2m4L4L9m1Km6J9PM1k5k3P3n1M9n3P1p6RM9o2J9k1
$$ -17 -9 29 57 20 8 -2 12 23 -19 3 -41 -7 32 -9 -7 -53 -34 -27 14 -11 -34 39 -12 37 -16 55 -21 -12 37 -25 -6 -27
6973b7O4m8K4j6k3M9l5K1m6O2q2QK1P5m8pl8J0K3nJ2J8j4J9j9k9Q2j10O3K7k4
$$ -27 37 -11 13 -3 -26 23 -12 9 -37 25 -57 -49 -28 47 -1 -8 -46 -36 -13 -18 -6 12 -2 17 -2 -31 51 -59 4 31 7
7004GmJK1l6j6L5Rk2L1p0PkO0pl2L4l2M5qJ5J8q0Q5p6J2n3R9k9j9%j4K8K5l6k2
$$ 7 3 4 25 -11 -27 8 17 -5 26 -44 -37 -39 21 14 -18 16 -16 29 21 36 54 -26 59 -17 -5 -58 41 12 -7 -7 -21 7 32 -4 -26
7039b6K7K0n7R5o2m1R1l6j5q4J02k6N5k1ql2RM3j5p4N9J0j1j4m3K0O1l6rl2O1
$$ -26 1 21 -36 59 -3 -44 47 11 -4 -88 14 -12 43 22 14 -18 -9 34 19 -55 4 14 3 -11 -54 -34 27 -9 -18 -50 11
7070A1p3O8jK1n2RJ1j5R5j01N1m5J0k8jK6M1q4J3PO6k7l7J0L5k4M2k1M2j12M3
$$ 11 -62 6 5 26 -26 -17 -6 -21 74 -27 24 -21 -11 -39 -40 -14 27 -57 -44 -37 29 2 -35 -25 10 -14 28 7 49 -63 -20
7101b0M2k2kl1K0J6m0P6o2K1Rk1j2K1l5O0p6J05k9m9J5K1j2l8j1M9J2q6R2J5k1
$$ -20 22 0 -2 -33 -13 3 -37 39 -23 -2 7 -14 -26 -5 -40 20 -56 49 20 -29 -14 7 -5 -43 -54 -5 7 -79 13 28 7
7132GoK6m5J01j01nK8k9J16p3J0Lrm2L7j3j6j2O2j00R8m6rN5Jl2kj9kOm3K0M5
$$ 7 1 27 -18 83 -18 -23 5 -24 92 19 29 32 23 -19 18 5 -11 -23 39 -61 37 -9 -18 37 38 6 4 -15 -17 -11 -54 -34 11
7165A1L7r4R2q3O1m2m5N0K4k6J9J6rl5M1k8J7k2j6J3M0j0n2J4k3L6J3kj2L5J5
$$ 11 48 -46 46 -37 24 -18 -63 -13 11 -15 4 20 11 -24 17 -11 6 -16 -32 -19 21 11 -41 -27 -50 -14 -1 -3 -15 20 35
7196C5m9O8r1O8o1rP2m9JP2j10N3K3m3K7j5O1rr6M4J1km4P8l0J9k5M2k8K5m0K1
$$ 35 -14 54 -37 31 -30 -39 33 -16 -15 57 -53 0 23 -20 7 -8 53 44 -52 -8 3 1 -43 35 5 24 -1 41 13 38 -2 19
7228A9l5K0rL1k1l3O3J1n1KQk0n3N5j4L6k0M3jm5N2op0L6m7K6L7k1K4k3l2K9l5
$$ 19 -16 4 -5 26 5 -28 35 46 -5 -3 5 -15 -68 -13 -27 9 -11 32 31 -14 38 32 -38 -2 -49 -23 14 -7 17 -6 -38 -9 -44
7261d4N0j5L8L1K8l4m8m0N2j9%J8j9P6l9n9j8L3M1m7j4KN2pL2n5N6p1PL9n6Q8
$$ -44 6 -9 29 60 88 54 6 -34 18 -1 -1 17 -2 74 35 -24 -42 -9 32 -15 -29 -27 25 18 50 -5 51 -20 -13 26 -30 58
7293E8l9J6n1L1j9P0m0j3j2Rk5M7n9j6K8K4Pn9j5K4M3J2K8n7L3p1K0J4L4j7L7
$$ 58 19 35 -16 15 -4 66 26 13 1 10 -15 32 -27 -43 -15 9 16 -43 -58 -34 9 21 49 -8 25 -46 -26 -12 22 5 42
7324D2j07Q9p9L8l0PO6K8p2OJ7m8M9L2l8k5K3N1n4j2N0p7M5j6L1QJ8k9%J8k0o9
$$ 42 -65 24 -55 -17 -47 -40 26 54 -18 -12 5 -43 6 38 0 -25 -2 49 -5 -17 33 -44 1 -15 16 24 42 13 13 31 11 -58
7356e8N5j8L7j0o7P5j6k2K3N3j17N3j0J6l6K6k2J9J7M3k2o5K7K9j3ol3L9M9m1
$$ -58 -3 -21 16 6 -61 14 -2 -24 -1 52 -65 -12 -22 -6 -42 -16 -38 -19 -2 41 19 -46 -19 10 -3 -9 -42 -3 46 5
7386Emk5l0N6j5P5j14M5L0k8k9P6Mq0L4k6M6m5M2j3n2N5K8l9Q3q9j9j9PR0n0M1
$$ 5 1 -24 -54 2 -13 62 -52 -7 23 -5 -34 42 46 -34 0 -26 20 -25 17 4 -48 7 35 -4 79 -10 -29 -48 -41 49 -1 40
7418D0p9M7J0%n1O9k2l0l0Q2k3l0NM0Rm2K9k2m9K5L8roKKl2RL2m0KNmM2l3L7l2
$$ 40 -39 8 18 18 -33 36 14 -16 -46 36 13 -17 -12 28 37 -5 24 2 -47 -22 16 7 1 3 5 -27 -18 14 -26 -24 -19 -23 19 -14 23 -9
7454iL0q0O5J2m8j0K1m1P5n1K2N0n8N6Jrj2l2m6J23n5Qk7k0K4L2n4O8n0K1j2J5
$$ -9 21 -59 6 18 -30 -40 -19 -60 15 -36 -14 36 -22 34 35 26 14 -18 -64 59 4 12 -15 -35 -11 21 -33 35 -15 6 -6 9
7486InjL1q4Q0j1m1j9Oj7L7j6K6L1mj4MJ3n5l3L6J0K7kK6l9l1lJ5L8n6L8j6j6
$$ 9 4 3 34 -50 30 19 -22 -41 -35 -52 -15 -31 -5 26 22 8 12 25 -30 -63 -27 -17 10 8 34 -5 -36 -39 -24 14 -42 -4 -20 -36
7520c6N1jj3J8J1o0j1K6RL6j0n2M4Ol4O4q4lJ01q2M0k4k2K0k0k2M5Rj3l0L9j8
$$ -36 15 14 1 19 30 -30 -41 -15 -6 30 20 -32 12 18 -16 48 -36 -39 62 -20 20 -4 -26 -6 -26 -48 -3 6 -7 -37 2 -16
7552a6Jk1L3j2k6P0J8p6M7Pj4j2kj1j5P9l2rJ8k2j8m6M5O7l5K8n1l3j1O7l3LL5
$$ -16 -15 -36 -3 -15 -41 29 47 -29 18 25 11 -1 -3 -14 -29 50 18 9 27 5 -13 -59 -14 53 18 46 -5 -38 -49 18 -15 -12 23
7585B3k2j2K9k8kjK5K8j2n2qRl8M4j3O8o3L0j2j4J5JK2jn2N4J5l9qM2qoJ8l8J6
$$ 23 1 -11 18 -10 -12 -13 12 40 28 -24 -32 -23 -61 -17 -30 38 -25 5 -7 -21 -6 -5 17 16 -36 18 33 -6 -14 28 20 14 32 -6 10
7620A0m4O2k4J5l1K1n7O5J1n5J4J0J2J8j7J3j0m8J6M8j0l0j2K4K8l2K3mlk0k5
$$ 10 -34 28 4 19 -12 9 -48 17 28 -27 -13 -3 9 27 10 23 13 -35 -19 29 19 -11 -23 1 29 -3 20 16 13 -7 -32
7651c2Q6o1M5k1j3K4J0m0l5j5k0O4k8K5j7K0L7k1j4LK3K5q6M7J5k4j8K7mLnLl1
$$ -32 54 -7 38 17 4 28 38 -2 -37 -52 -72 -8 -36 -11 -28 -8 29 8 -6 -3 20 45 -41 6 21 -3 -21 6 2 5 0 3 -28
7684b8kM3J5m8j2QJ2n9N6k5K4RK6j2k1J8lm4L4K3m8nk4Q1LK4l2n7P5k3J0L6m9
$$ -28 -30 13 28 -20 -32 -24 -12 -71 -15 -40 -16 -7 19 7 -14 4 1 -43 -9 14 -34 -39 -63 18 21 45 13 -44 31 8 18 54 5
7717EnK4Qj09R6m2K8pj8J0k1J6JL8l9J7M2mm9j3K6q5N7P1o7M9po1j9N3k9N0j9
$$ 5 0 24 32 -77 19 -23 5 -2 -20 -10 -31 -15 -14 24 -15 2 44 40 -9 -22 4 -81 -24 47 -20 29 22 -39 -58 -5 -34 16 -3
7750cK2n2N5l9K6L6n9OM4kj3K4j8l2j2K3J8K7o3K8l0O4j30O7J1n5P0j8K2l7K9
$$ -3 19 -33 22 -17 9 45 -14 -8 36 34 21 45 27 -5 -17 6 24 51 -12 16 -14 50 -80 -13 -2 -57 13 -5 17 -20 9
7781In1M6J8l0o1O4k8pN8Om1L8L2p7QJ5J3l5K8k6K3J7L9m7J0m8J1rK9j8L8m2M5
$$ 9 -42 4 22 -8 -69 -5 -33 -40 18 24 -17 21 53 -24 -16 -1 12 -23 5 -21 2 19 58 11 21 -27 -16 -25 4 -14 24 -18 27
7814B7n7K1JPL3o4k5M9j9L3l4k9L0N7mm5N8r5L6mK5j5l8Q1Mo2P1k0m2L6%K3o1
$$ 27 -30 -9 -8 -1 32 -32 -57 -8 -27 6 -28 -57 -27 30 26 -19 39 -56 -20 -24 1 -14 -52 29 33 -29 42 22 -20 16 16 39 -22
7847b2l1J5M7K7m7J1J2J3j4lm5O4n6J3J6Jp3K1M3J5k7mK8qk4M2lk9O2l2J7n9P0
$$ -22 -53 -38 9 36 -11 0 12 25 11 8 -37 27 -29 -16 0 1 -72 -51 -8 7 -20 -24 4 -4 -28 14 11 -18 44 12 29 -30 40
7880D0l9jm9P2j2n5J1K4L1Jl1J9J0p7K4O9m2m1N8j2J4qk1P1k8n6M3j5j5k1J5P
$$ 40 1 0 -49 23 11 -44 -33 -9 22 23 -8 11 21 -56 -32 37 -5 -46 12 0 14 6 -15 56 28 -28 15 0 -15 -36 -21 -14
7912a4j5J0j0M2kk2j0J1K8k0L1k6m0N9l5k8J1LQ2l5m9J1kJ5K9k9k0J7J1rk4OM1
$$ -14 -29 -19 -29 13 11 -11 -21 -10 18 -2 29 3 -37 22 -13 -41 -30 -27 55 20 -29 -18 -20 -5 24 -5 -25 -8 3 -6 -30 -24 17
7945A7n4M0m6O3j6p6O4L3qL6r5K2l1M8J2oJ0o8Q2m3N4k0lMl0lK1kK1l9L5Pl8k1
$$ 17 -37 3 -43 20 4 -72 -8 25 17 53 -42 -20 -51 -3 9 3 13 -55 27 -16 38 18 15 19 -11 -14 7 5 26 -13 22 29 -9 -30
7979c0MJ5M1J0n4j5N0m0o8L0N1O1q0K1K2j8mJ6l1K2k3J2J3k9j8k2M9NK6j1K2K5
$$ -30 -26 -11 30 40 -14 -29 21 -19 -87 -57 -6 55 -25 -4 18 0 -4 12 -19 3 -20 -8 5 -24 -42 -64 -15 -10 16 5 27 52
8011E2oj6%j5j0J4J0NM7j10K3j3Oj1j2j4PM2L%k8L1o3N9j5K5j7K3n2L3lj7j1M7
$$ 52 46 30 30 15 5 19 29 34 81 -29 -6 -19 -13 -24 -36 -50 -43 -1 2 2 -26 5 -58 1 -14 11 -6 17 -35 -2 -5 -22 -33 14
8045A4%l4N5o2m3J03J2m6J1Ml4M3l2Jnj4RJ9j2Rk7M2J0m6OM9k1k5Pm1N6l1L0K
$$ 14 14 -20 35 -27 -70 33 45 -1 10 14 -20 23 -9 -8 -13 -27 -18 1 -11 -2 -29 13 23 -23 -17 32 11 -14 -7 -48 8 -23 7 9
8079IpJ6Nl3J2Ln4K4NK0k3J9J3l2L4jk2k4P5k8n0L7m1L5P0o7RL6m4PjN0m9j2k7
$$ 9 2 18 23 -10 2 5 -49 -25 -20 0 -23 -4 9 -23 11 10 -12 -36 39 11 -39 -2 -43 -8 62 -5 4 40 -4 3 2 52 3 -9 -36
8114c6KM7l6j2K1M3m3lj5L1JJ1L4o0N8j2k8L8o7R2o1m1M6M1k3Kl3L6Kk4pj5l1
$$ -36 -34 13 -23 -35 -14 29 -14 -17 -32 -1 0 11 45 -15 43 31 3 41 -26 66 5 -36 10 51 28 30 -3 33 35 11 4 -11 -42
8147d2O0jmj9J1n8Q6m0j9M3j8m0%M8k5J1nm9N2J3%k5oL3J0l8M9J9k9pJJ5k2L0
$$ -42 18 17 13 -6 5 -53 33 -7 -26 17 -1 -41 -41 7 -18 -7 -12 -61 -9 4 4 -21 -27 6 16 -22 27 46 17 10 11 26 4 34
8181C4L7m8kk3J2k7J8k5M7O1
$$ 34 71 23 21 -2 10 -17 1 -24 23 84
8191H4
$$ Imaginary data points
##PAGE= N=2
##DATA TABLE= (X++(I..I)), XYDATA
0@%%%%%%%%%%%%%%%%%%jRj6J6j6J6j6K4l2L2l3M1m8N6o4P2q1Q9j04J15j25J40
$$ 0 0 0 0 0 0 0 0 0 0 0 0 0 0 0 0 0 0 0 -1 8 -8 8 -8 8 -8 16 -16 16 -17 24 -24 32 -32 40 -41 48 -56 59 -66 74
40G4j56J73j96K18k38K63k91L22l56L91m31M76n23N76o37P06p83Q70r71J091j233
$$ 74 -82 91 -105 113 -125 138 -153 169 -187 204 -227 249 -274 302 -335 371 -412 458 -513 578 -655
61f55J405j622J901k275K809l635N110q553L2654J9522l4170q777j5062j1450
$$ -655 750 -872 1029 -1246 1563 -2072 3038 -5515 27139 46661 12491 3714 -11348 -22798
75b2798p676P671K463j567l359P187J2346J4637P387L027k611n771p583P1O415
$$ -22798 -30474 -22803 -20340 -21907 -25266 -18079 -5733 8904 16291 19318 16707 10936 3353 3424 9839
90I839O396j723o922r402p914n163J154M639K485k806l846j469L449Q595J0940
$$ 9839 16235 14512 7590 -1812 -9726 -14889 -13735 -9096 -6611 -9417 -13263 -14732 -11283 -2688 8252
105H252O773R93l190m748k411L342N137M03n325r355j2103r143j245L915M612
$$ 8252 15025 16018 12828 8080 5669 9011 14148 14551 9226 -129 -12232 -21375 -22620 -18705 -14093
120a4093L792K398J490M614R605J0826P134Q05o772j1933j0919n522n36J788J088
$$ -14093 -10301 -7903 -6413 -1799 7806 18632 25766 26571 19799 7866 -3053 -8575 -9111 -7323 -6235
135f235j394l248j762K763O420O639L675n59m032m032N60N035N943L739q87o345
$$ -6235 -7629 -10877 -12639 -9876 -3456 3183 6858 6299 2267 -1765 -1205 3830 9773 13512 12625 6280
151F280q083m819q07J510K054o4l201l209Q90M729O820O361K293l282n207l072
$$ 6280 -1803 -6622 -7429 -5919 -3865 -3929 -7130 -10339 -9449 -4720 2100 8461 10754 7472 2265 -807
167h07M56L513M319J012l830o173n031k090J552L250J604j400k688r31K701O133
$$ -807 -351 3162 7481 8493 4663 -1510 -6541 -8631 -7079 -3829 -2225 -3625 -6313 -7244 -4543 1590
183A590P179M345r76n074n828l728l27K273J856j306l632l378j117K269M943M172
$$ 1590 8769 13114 12138 7064 1236 -2492 -2819 -546 1310 4 -3628 -7006 -8123 -5854 -911 3261
199C261M52k613l225j577J943N088M643R20k835m892m437j324K166K777P18j851
$$ 3261 3713 1100 -2125 -3702 -1759 3329 7972 8892 6057 1165 -3272 -4596 -2430 347 1065 -786
215g86l230k476P60M138M681K174j189l684l656o67K987M534K892k82l205m192
$$ -786 -4016 -6492 -5732 -1594 3087 5261 4072 388 -3268 -3935 -948 3586 6478 6196 2991 -1201
231a201k411Q55K389J419p72k919l312q87K974M989M089J405k101m160k971J73
$$ -1201 -3612 -2757 -368 1051 279 -2640 -5952 -6839 -3865 1124 5213 6618 4517 357 -2614 -2441
247b441K523K682J136j728l496k389M75K764K941J219k061m154l234r8K791M199
$$ -2441 82 2764 3900 2172 -1324 -3713 -3238 -474 2467 3686 1625 -2529 -5763 -5861 -3070 1129
263A129L060J03k581k777o65J738K920J951q14l601l758j584J125L006K910K80
$$ 1129 4189 4292 1711 -1066 -1731 7 2927 4878 4064 463 -3295 -4879 -3754 -748 2162 2442
279B442k604l072j350J273L390L696J235j810k965k174L4K268K815P37k088l425
$$ 2442 -162 -3234 -4584 -3311 79 3775 5010 3200 235 -1939 -1905 363 3178 3915 1827 -1598
295a598k536k54K257L379J756j159k900k590m85K156L725K473k37k204k596j156
$$ -1598 -4134 -4388 -2131 1248 3004 1845 -1055 -3645 -4130 -1974 1751 4224 3987 1783 -813 -1969
311a969J277K814J750q52l008l538k032R26L167K964Q58j285k300j416J116L127
$$ -1969 -692 2122 3872 3020 12 -3526 -5558 -4632 -1465 1499 2357 1072 -1228 -2644 -1528 1599
327A599K831O63j755l203k840m10J948K224Q73j263k897k295M1K536L401K128
$$ 1599 4430 5093 3338 135 -2705 -3115 -1167 1057 1930 667 -2230 -4525 -4484 -1948 1453 3581
343C581p0k116k501n66J646K551J513o40k820l398j538R56K449K139M54j682k542
$$ 3581 3511 1395 -1106 -1672 -26 2525 4038 3398 578 -2820 -4358 -3402 -953 1186 1640 -42 -2584
360b584j017J486K956K808Q80j646k859k014L00J985K227P32j683l102k379k61
$$ -2584 -3601 -2115 841 3649 4529 2883 24 -1990 -1690 295 2522 3254 1571 -1531 -3910 -4171
376d171J683K458J534n92k126j675L77K485L263K246l56k459k967j545K95J592
$$ -4171 -2488 -30 1504 912 -1214 -2889 -2512 -27 3236 5482 5126 2667 -300 -1845 -1550 42
392D2J184p90k386k465p91J376L125L001J015j145j982j150P25K344K184K82j921
$$ 42 1226 436 -1950 -4415 -5206 -3830 -705 2296 3311 2166 184 -966 -241 2103 4287 4569 2648
409B648l145k489o90J459K084P80j113k033j433L67K615L259J906m08j922k339
$$ 2648 -497 -2986 -3676 -2217 -133 647 -466 -2499 -3932 -3565 -950 2309 4215 3807 1885 -454
425d54r20J208K195J235p02k264k613j351P45K140J631o6j627k030q78J470K957
$$ -454 -1374 -166 2029 3264 2562 298 -2315 -3666 -2921 -781 850 784 -843 -2873 -3751 -2281 676
442F76K761R98j000k222j853M8J418J409N8j706k833k093m4J914K402J519l26
$$ 676 3437 4435 3435 1213 -640 -592 826 2235 2293 587 -2246 -4339 -4383 -2469 -67 1452 1126
459A126j696j424K49K110K618J665m06k365k650j333M65J448J107m17j891k034
$$ 1126 -570 -1994 -1745 365 2983 4648 4242 1877 -773 -2106 -1641 -193 914 497 -1394 -3428
475c428m05J451K731K422O95j546k248j457L37J642J846O54j190k117j336J76
$$ -3428 -3833 -2382 349 2771 3466 1920 -328 -1785 -1448 194 2040 2694 1504 -613 -1949 -1773
491a773J487J939O27j497k470j831p2J678K588J847j55j416j566l17J162J897
$$ -1773 -286 1653 2280 783 -1687 -3518 -3590 -1912 676 2523 2368 952 -614 -931 231 2128
507B128J049p62k338k447j124R22K056J746K11j424j788p38Q68K324K052N08j317
$$ 2128 3177 2415 77 -2370 -3494 -2572 -516 1230 1441 17 -1771 -2509 -1641 683 2735 3243 1926
524A926k021j478J6J534J682L76j243k031j477J1J705K198J023p50j827j742l85
$$ 1926 -95 -1573 -1557 -23 1659 2035 792 -1239 -2716 -2705 -1000 1198 2221 1471 -356 -2098 -2483
541b483J524K218J334j73j521j729o36J006J754J017n86k019k314j037Q71K130
$$ -2483 -959 1259 2593 2420 899 -830 -1466 -460 1294 2311 1725 -294 -2608 -3645 -2774 -644
557f44J928O58r90j677q74P81J741J593L29j279k114j494K87J492J663O41j011
$$ -644 1284 1942 952 -725 -1599 -818 923 2516 2845 1566 -548 -2042 -1755 -263 1400 2041 1030
574A030k117j726k23J389J938J218j84j347j263J05J503J965J197m71j978k195
$$ 1030 -1087 -2813 -3036 -1647 291 1509 1325 -22 -1285 -1180 323 2288 3485 3014 1036 -1159
590a159j041L76J346J216p4j494j664n74J004K084K000P15r51j688r38K64J436
$$ -1159 -2200 -1824 -478 738 664 -830 -2494 -3068 -2064 20 2020 2735 1784 96 -842 -578 858
607H58J530K74j374k049j648k06J197J658Q54p10j528j266Q4J466K159J365j82
$$ 858 2388 2662 1288 -761 -2409 -2615 -1418 240 1094 384 -1144 -2410 -2326 -860 1299 2664 2482
624B482j334j461n32Q62J576Q81n70j846k047j154M61J607J437K74p70j243m62
$$ 2482 1148 -313 -845 17 1593 2474 1904 58 -1989 -3143 -2682 -1075 362 636 -134 -1377 -1839
641a839J041K068J750M24j041j851j660l39R45J138K65r64j640j261K38J587J917
$$ -1839 -798 1270 3020 3444 2403 552 -1108 -1447 -502 636 901 -63 -1703 -2964 -2726 -1139 778
658G78J189k69j200j396k23J177J561J008l98j558j814r15N68J255R83j73j241
$$ 778 1967 1698 498 -898 -1121 56 1617 2625 2227 669 -1145 -2060 -1492 -237 746 573 -668
675f68j441n33J007J913J752O18p66j617r98J22J074J162J19j069j838j351KJ227
$$ -668 -2109 -2642 -1635 278 2030 2648 1882 265 -733 -611 463 1625 1744 675 -1163 -2514 -2512 -1285
693a285J498R05l92j327j005J87J438J798J132k93j595j607p47L61J144P29m10
$$ -1285 213 1118 726 -601 -1606 -1419 19 1817 2949 2656 1061 -546 -1293 -932 212 941 531
710E31j432j259m25Q50J771J582L20r93j316p78M03J453J401L77j038j523j225
$$ 531 -901 -2160 -2585 -1735 36 1618 1938 945 -371 -1149 -746 707 2108 2485 1447 -76 -1301
727a301j91Q15J075R8r24j435q60L52J558K098J282n2j142j273n33N49R78N04
$$ -1301 -1492 -677 398 496 -428 -1863 -2723 -2371 -813 1285 2567 2515 1373 100 -433 116 1094 1598
745A598o54j523j410o13R01J537J202O8r61j266o09O97J550J418K70p93j466r85
$$ 1598 944 -579 -1989 -2602 -1701 -164 1038 1106 145 -1121 -1730 -1033 517 1935 2205 1412 -54 -1039
763a039J26J098R81K36r56j431j085K06J212J366N52m78j377j056j30J172J625
$$ -1039 -913 185 1166 1402 446 -985 -2070 -1864 -652 714 1266 788 -589 -1645 -1775 -603 1022
780A022J037l7j012j205m76N02R27M51n40j485j416m51R00J691J539M97p47j257
$$ 1022 2059 2022 1010 -195 -671 -169 758 1209 669 -816 -2232 -2683 -1783 -92 1447 1944 1197 -60
798f0q04J09R78R19J28r26j315o09M31J307J327N40q29j507j314j83Q35J203Q31
$$ -60 -864 -755 223 1142 1270 344 -971 -1580 -1149 158 1485 2025 1196 -311 -1625 -1808 -973 230 1061
817A061l50j045r04k6Q83J332Q76l15j113j097m34N91J186Q83k80j188j378p72
$$ 1061 711 -334 -1238 -1264 -381 951 1827 1512 399 -698 -1132 -541 645 1528 1248 60 -1318 -2090
835b090L63J255J272L33o04q79n50L75J133R78J00q71j380j037J53J094J307N79
$$ -2090 -1727 -472 800 1133 529 -350 -900 -525 608 1586 1686 815 -565 -1602 -1449 -355 952 1531
853A531m67j331j077k75O74J112O82k80q40p92N9J037J416Q47l53j232j469q40
$$ 1531 1064 -267 -1344 -1619 -945 167 849 569 -271 -1063 -1004 33 1449 2296 1943 711 -758 -1598
871a598K62R40Q70J29p78j005m91O11J198J117L24o12j099p05L69J037R34K40
$$ -1598 -1336 -396 474 603 -175 -1180 -1671 -1060 138 1255 1579 967 -132 -837 -468 569 1503 1743
889A743p78j505j192k18P39J106O25k06q04o56J95R81J285P17l18j140j205l97
$$ 1743 965 -540 -1732 -1950 -1211 -105 520 314 -490 -1146 -951 30 1315 2032 1714 574 -631 -1028
907a028N01J008P34j64j081j224o97K90R43R81K66n27o88j34N57J357J218K55
$$ -1028 -527 481 1215 1051 -30 -1254 -1951 -1661 -718 263 529 2 -686 -820 -263 1094 2312 2567
925B567q85j401j155l06M24P18K53o58r56p57K31J000J428R99j00o79p14q8O69
$$ 2567 1682 281 -874 -1180 -756 -38 215 -443 -1399 -2156 -1925 -925 503 1502 1402 723 9 -79 590
944E90R89M98m83j303j440p53J81R11P50M4o78o45l32P28J335J183L31m70r95
$$ 590 1579 2077 1594 291 -1149 -1902 -1721 -810 -60 -16 -694 -1339 -1671 -943 392 1575 1906 1436 441
963D41o61K04P90P98Nq56j409j143l19N58Q67M90p3o10m05M06J181J378R36j61
$$ 441 -220 -16 774 1572 1577 721 -688 -1831 -2150 -1592 -725 -235 -308 -918 -1323 -917 264 1642 2578 2417
983B417r82j155n33J89N04K71m74j092j221n51N56J158J106M37k87n40j72N70
$$ 2417 1435 280 -253 -64 440 711 237 -855 -2076 -2627 -2071 -913 193 630 343 -197 -369 201
1001B01J211Q49J28q38j297j072k89M32O04J53n93r97o68K94R29J365P49J05o45
$$ 201 1412 2261 2389 1551 254 -818 -1107 -675 -71 82 -511 -1508 -2176 -1882 -953 412 1161 1266 621
1020F21n75J7N93Q91M07m06j149j253o30J40O90N77K1p16o84j75N64J218J101
$$ 621 46 63 656 1547 1954 1548 399 -854 -1484 -1344 -654 -77 -56 -772 -1456 -1631 -1067 151 1252
1039A252M52l35p47m88K12O62O45j48r60j457j107k81N73R05O21m3m22j93L64
$$ 1252 1704 1369 622 134 346 1008 1653 1505 545 -912 -2019 -2300 -1727 -822 -201 -244 -666 -859 -495
1058d95J157J110N32k18j011j108o21J91N84L52l09q79r03l70M94R73R35K54l48
$$ -495 662 1772 2304 2086 1075 -33 -654 -463 121 473 164 -715 -1618 -1988 -1494 -521 414 668 320
1077C20o14j60M64J091P59R5o49j197q65j42M66N99O3n89q93p05J28Q49J098P40
$$ 320 -294 -454 10 1101 1860 1955 1306 109 -756 -898 -432 167 230 -359 -1252 -1957 -1829 -980 118 858
1097H58O5m56l88R2P61Q14L06m75j268j190p35J03O10N28O6m50n45L8O52J117
$$ 858 923 467 79 171 932 1746 2052 1577 309 -881 -1616 -1513 -903 -375 -309 -759 -1304 -1266 -614 503
1117E03Q82K28n17q00m84J82O96N61Q2p06j142r82k09N03O99L18j82m85j72L34
$$ 503 1385 1613 1096 296 -188 -6 690 1251 1333 627 -515 -1497 -1706 -1203 -504 -186 -368 -853 -1025 -691
1137f91R58J108N49k13q94q96l78J65O57M18l16p94p65m65M15O68O70N5m79n65
$$ -691 267 1375 1924 1711 817 -79 -457 -292 365 783 467 -327 -1092 -1557 -1142 -474 196 251 -228 -793
1157g93j03N88J046R01K37n52r34p60q1L20M45R9n72q19n79L9P77Q77N46j23n25
$$ -793 -896 -308 738 1639 1876 1324 390 -370 -451 -131 314 413 -159 -978 -1557 -1518 -741 136 682 559 34
1178C4n32R8O71Q37M88j98q72q93n14J77N14L60n6n85n86j72M88Q56P54J05m87
$$ 34 -498 -400 271 1108 1596 1398 526 -367 -881 -704 -190 170 114 -471 -1057 -1229 -741 115 869 974 487
1199D87p64m28K69P32Q39J61m15q24o81q0L84M28J34m36p93l44J40Q51R95O53
$$ 487 -277 -705 -436 296 1135 1296 881 57 -624 -704 -320 108 242 -194 -987 -1331 -1191 -340 655 1308
1219A308j26o48o96l09L14N38L91j75o20o84k03M10O05N93j02p42p34l02L20P47
$$ 1308 1182 534 -162 -471 -157 381 772 597 -23 -707 -910 -500 105 698 596 -146 -880 -1182 -862 -115
1239a15Q79L02l78n50l73J21M78M83j9n83q30o23l7O18P43M15k08n05m56J20N50
$$ -115 764 1066 688 138 -235 -114 364 847 828 245 -585 -1208 -1245 -627 116 531 323 -182 -638 -518 32
1260C2P30M33j72p05o95l36K19N67M00j08n59o03j87L78P50O18J09n39p48l40
$$ 32 762 1195 1023 318 -377 -713 -494 73 473 365 -194 -797 -984 -606 144 762 871 332 -416 -756
1280g56J12O92N88K90l11o54l49K6N49M85K6n49q20o86lN46Q57N82Pl39m16RM92
$$ -756 -644 48 636 926 615 -39 -388 -362 187 672 698 149 -671 -1357 -1360 -814 43 625 632 293 -123 -114 378
1303C78M83K65k75p87q32l83L46O00N66k5l83o01j93L58O78N79J61m49o15l75
$$ 378 861 1126 851 64 -768 -1151 -805 -205 361 336 -47 -648 -841 -483 195 774 935 486 -129 -504
1323e04J74N13N33J98m80o61n20j23M75N54K58k93n47m77J2N97P14M83p8m45n15
$$ -504 -330 183 716 914 434 -227 -747 -870 -395 159 417 124 -423 -900 -888 -291 423 906 828 383 -132
1344a32j37L04N50K68j66o72p61l64K32N64M89R8l80m69j49M28O96O40J96m30
$$ -132 -269 35 585 853 687 15 -746 -1110 -878 -314 175 273 -107 -576 -725 -297 399 1039 1235 805
1364H05o00m78p1K40N13l6l51o71m30j2N46O84L98j11m08l38q9M81O60L12j61
$$ 805 205 -273 -344 -104 409 373 22 -649 -1079 -1091 -545 139 537 426 18 -320 -409 72 732 1044 883
1385H83n86o36l28J41N23K87p5n09n10k13L34O96N73J48k96n04l07J62N61M82
$$ 883 297 -339 -667 -526 -3 284 209 -300 -810 -1023 -689 7 580 728 432 -72 -379 -217 344 826
1405H26R7l76o64m45j31L74L54J15k88m85l78J76N94Q36N02qm92n01k99J38L04
$$ 826 923 547 -117 -562 -693 -319 35 150 -138 -623 -1001 -825 -231 605 1107 1099 607 106 -193 -55 249
1426B49K05j99n86o26j50K68O15N01J12k28m60j49L35O19N78Q7m02o43n33q6K31
$$ 249 454 255 -331 -957 -1107 -839 -224 277 389 161 -299 -448 -113 506 1084 1171 769 126 -407 -493 -262
1447b62K04Q7l52n74j83J31O63P10N05q3m40m55j25L47L44K87j65n79n20k78K02
$$ -262 -58 29 -323 -897 -1080 -949 -286 424 929 846 406 -49 -174 173 517 804 639 60 -460 -738 -536
1468e36M29K47j47m43n42q5L90P19P72K97j50m28k73PK37K03j35n67p34m49k4
$$ -536 -107 140 -7 -450 -992 -1077 -687 32 804 1101 951 523 250 257 494 697 562 -5 -739 -1188 -1212
1489a212M70N33K46k4l23k38K03O70O74M02j44m84n69m61Q1J94N8l10n09n10J1
$$ -1212 -742 -209 37 13 -310 -548 -345 325 999 1401 1257 773 204 -257 -176 18 76 -234 -743 -1253 -1242
1510a242M28O49O42K06k50m03k98K12M88L51J79l75m56l50J6K48K38j56m93o29
$$ -1242 -814 -165 477 683 433 30 -268 -56 432 783 962 587 131 -219 -203 45 283 127 -366 -995
1530i95m14R0O47P80M81K50k19k37m4K46K43L0l97o52n56k71K70M49L68K2l33
$$ -995 -1409 -1319 -672 108 589 839 620 383 339 585 828 858 461 -191 -747 -1018 -748 -299 69 91 -242
1551b42l77j16L06N22N63J88k31m02k72J16K16L94j17m32n79n11L0M63M27K44
$$ -242 -619 -735 -429 93 656 844 613 211 -61 55 271 665 548 116 -463 -974 -944 -481 -54 190
1571A90p0m19k87O3M85N21M84j20l17m16j99J64K59O8l94n67n68m4L51O59N48
$$ 190 120 -299 -586 -523 -38 483 967 847 530 114 -85 79 338 406 12 -555 -1123 -1167 -816 -157 391
1592C91K46r0m14r0Q3L32R9l4m48m58l23J84M19M11J71k88m76l70p5L55M51K36
$$ 391 637 547 133 43 126 458 557 523 75 -383 -706 -522 -103 308 479 191 -285 -655 -730 -375 76 312
1614C12k7k24j73R3L16M16J43k13n60n91k35J48M06L02m4k94l09p6K98M83M45
$$ 312 285 61 -112 -19 297 713 856 643 83 -508 -743 -595 -189 113 69 -225 -534 -610 -312 171 616
1635F16R6j93l66k27J48K56K16j17m58n81m04N9M55N14L04j7k74j92N3L72K76
$$ 616 712 519 153 -74 74 330 546 429 -29 -610 -1014 -955 -500 14 318 301 27 -165 -112 260 536
1656E36J01k23m33l16k06M02M19K06j04m06m76k42J66L74L04L8j28k96j6K18N17
$$ 536 637 414 -19 -335 -541 -139 280 486 382 -24 -500 -742 -576 -202 102 140 12 -284 -300 -82 435
1677D35M13pl88n13l13L8J96L37K4l33l84k78O1K89O08K02J2k82r8nK88L68J50
$$ 435 848 841 453 -60 -373 -335 -139 198 222 -111 -495 -773 -712 -423 185 387 399 117 19 14 302 670 820
1700H20l27n34n08j98J22M13L10L8j98k49J8J57L75L20n3l47l73j60J21L49M65
$$ 820 493 -41 -549 -747 -625 -212 98 136 -62 -311 -293 -136 239 559 506 159 -214 -374 -253 96 561
1721E61j5k43m12l33%J79L41N4j44k99l10K16L53N33K01j15l53l61J2J33K68J22
$$ 561 546 303 -109 -442 -442 -263 78 132 -12 -311 -621 -405 -52 481 682 567 214 -147 -135 -2 266 388
1743C88j40m11m34r6J69L21L91P4k10j70r9K11L62K93n0k71n19k79PK58L45Q6
$$ 388 248 -163 -597 -693 -524 -203 188 262 52 -118 -217 -6 356 649 599 328 -191 -470 -463 -205 140 226
1765B26j86l09k12P6L44L98Q7j91k84k84K8K79M54J07p6l04m29p7P5K88K03j49
$$ 226 40 -269 -481 -405 -61 337 424 233 -51 -335 -307 -28 426 533 457 153 -276 -353 -278 10 213 64
1787F4k87l13j1K27M59L15P4k36l12j33P0L06K66p5k91m09k77LK69L45J03j05
$$ 64 -223 -536 -547 -320 139 454 528 292 -20 -153 -83 223 489 414 123 -286 -563 -560 -291 54 157 52
1809E2k17j51O4K79M04K21j74k83l87j01K19K69J26j63l20l46n6K19L00J83R1
$$ 52 -165 -316 -252 27 431 652 478 195 -192 -293 -74 195 321 158 -162 -508 -564 -345 -45 138 229
1830B29k59k76j12K83M17K80Q8k36l54k04K9J46J44o7k73l19k67J22L63L32K95
$$ 229 -30 -306 -418 -135 282 562 650 414 60 -144 -115 31 175 108 -165 -484 -751 -629 -266 66 361
1851C61o1k09j40O6J95K51J58j84m30l18o2Q4K75J47o5k71k92q6K04L28L21L7
$$ 361 300 91 -49 17 212 463 621 437 7 -311 -373 -289 -14 133 68 -203 -495 -581 -377 -49 272 309
1873C09j15j71j05J86K61K04k2k91l75k77k0J35K22R7j99k55j59J70L06M27K36
$$ 309 194 23 -82 104 365 569 547 256 -119 -396 -416 -281 -59 38 -161 -416 -575 -405 -99 328 564
1894E64n0k91j55o1J46K15O2j88l85l34j52J34K98K52k3q8k24o1K44L35L09L0
$$ 564 514 223 68 7 153 368 430 242 -143 -477 -629 -495 -197 55 32 -56 -280 -341 -97 238 547 577
1916E77k60k28k09N1K30J08k0k46l61k37n9L28K61J36J5k29k9J23K27L68R9j66
$$ 577 317 89 -120 -69 161 269 249 3 -358 -595 -654 -326 -65 71 86 -143 -172 -49 178 546 645 479
1938D79l07l58j27R0K58J46j03k60k50j66K23L14K59N3j69j83J0J39K92L18j6
$$ 479 172 -186 -313 -223 35 181 78 -182 -432 -598 -375 -61 198 251 82 -101 -91 48 340 658 642
1959F42k66l79l19k1P9J49Pj64j99j03J19L61M08K43m5j99k50J5J07J51K4j91
$$ 642 376 -3 -322 -343 -264 -115 -108 -272 -471 -574 -455 -94 314 557 512 313 63 78 185 336 360 169
1981A69l23l99n5J73K58K42k6j20j73l4J79L83J89j0r2k76k23J73J01K21M4k71
$$ 169 -154 -553 -608 -435 -177 65 39 -81 -254 -288 -109 274 463 453 361 85 -138 35 136 357 401 130
2003A30l92k80PJ85J63R2o0j31m5K08L82L87J68j06k92l53j76m3P7K4j15k33k40
$$ 130 -262 -542 -535 -350 -187 -95 -155 -286 -331 -123 259 646 814 708 416 63 -113 -156 -79 -55 -170 -403 -643
2026f43J9K36M09K50J38j05k53q8J10K32J70l2j88l82j70M5J19J83n6o4k39j34
$$ -643 -624 -388 21 271 409 304 51 -37 73 305 475 443 255 -127 -297 -252 -133 50 -6 -70 -309 -443
2048d43KL04K58J74l1j36j10mK11J56J88j57l41k89j77L3K02M7j4k23j18J29K05
$$ -443 -441 -137 121 295 264 128 18 14 225 381 569 412 71 -218 -395 -362 -160 -113 -127 -350 -468 -339 -134
2071a34M07K49L0j11k03k30K3O2J53q9k39l18j27J11J69L11P3m6k02r0M6K61K66
$$ -134 273 522 552 441 238 8 31 93 246 157 -82 -400 -527 -416 -247 64 137 91 -111 -201 -155 106 372
2094C72J12p7l20k37l9P6K18Q0j25k18k33l8J13K28K71L9j58j74p9J91K88J16
$$ 372 484 407 87 -150 -189 -113 105 185 60 -158 -391 -429 -316 -88 183 222 64 -110 -189 2 290 406
2116D06M5k05k98j80M5J24J45j8k03j40j48Q2K67K74Q2rj30k03%J88J74K3r4l21
$$ 406 451 246 -52 -232 -187 -63 82 64 -139 -279 -427 -345 -78 196 278 269 139 -64 -64 124 298 321 227 -94
2140i4k15r2J10K44J29l2j32j26o7J66K28J76Q3j21l05j34J08J51J45m3j40k44
$$ -94 -309 -401 -291 -47 82 50 -82 -208 -275 -109 119 295 378 257 -48 -182 -74 77 222 179 39 -205
2162b05j46L3K29J86R5r6k13r2M7K31J87J34j54j73k04m7J69J75L1j17j91k51
$$ -205 -351 -318 -89 97 192 96 -117 -209 -162 69 256 390 236 63 -141 -188 -19 156 187 70 -121 -372
2184c72l1J04K06J95Q6j30j13p4J39K27J50k1j59k71j63J03L6J81j9j06j68j46
$$ -372 -403 -299 -93 102 188 58 -55 -129 10 237 387 366 207 -64 -227 -124 -88 93 74 -32 -200 -346
2206c46P8J96K26P1q4j31j17l9J98J79J38j07j94l02oO8J66R1j02j60j26l1J39
$$ -346 -268 -72 154 225 141 10 -107 -146 52 231 369 262 68 -234 -240 -172 -6 85 -17 -177 -303 -334 -195
2229a95K29K00m7k8j64o2M2K26J42%k02k87j65J06O4J39P3j25r8j32P4J68L11
$$ -195 34 234 187 159 -5 -67 -25 201 343 343 141 -146 -311 -205 -141 -2 71 -54 -152 -284 -210 -42 269
2252B69L8j07j60j25J3N8K03K1r7j48j85n7P5J48J77l6j77j26m3J39K50J25P8
$$ 269 307 200 40 -85 -72 -14 189 210 113 -35 -220 -277 -202 -54 123 87 -90 -216 -259 -120 130 255 333
2275C33j07k18j10J2J58Q1k0j47j57k00R6J20K21R2l9j62r0NJ71J74J13o1k00
$$ 333 226 8 -102 -90 68 149 129 -18 -175 -375 -279 -159 62 154 115 -47 -137 -132 39 213 326 265 65
2298F5k00r6J13J62K6lj56j73lJ14K38J32l5n6j14j46J00J15K08r2j09j22j53
$$ 65 -135 -231 -118 44 70 67 -89 -262 -265 -151 87 219 184 128 14 -132 -32 83 291 199 90 -32 -185
2321a85OJ72R4Q3j79j45m7j0J53K22J07n3j50j52j4N6J44R3q5k07j35kQ2J07J49
$$ -185 -179 -7 87 170 -9 -154 -201 -211 -58 164 271 218 68 -84 -98 -42 102 195 110 -97 -232 -234 -152 -45 104
2346A04Qj56j47k2J14K25J26o2j6j75q3J0R9J03k5r8k21q7M4J79J37J23rj91q0
$$ 104 112 -44 -191 -213 -99 126 252 190 174 -1 -84 -74 25 128 103 5 -216 -303 -259 -80 57 180 171 -20 -100
2371a00K2J08J45O5o6k01j21j9O2J49J11m4j63j09r4J05J62J46m9r0j56j1N6K01
$$ -100 -78 30 175 240 174 -27 -148 -167 -105 44 155 111 -52 -161 -255 -150 12 158 109 19 -137 -148 -92 109
2395A09J66l3r8k17r1NJ27J05j0j20j20o8M5J02K70P1J5j91j14%N7R9N7n6k30
$$ 109 275 242 144 -73 -164 -159 -32 73 63 -57 -177 -245 -200 -98 172 243 258 67 -47 -47 10 109 166 110 -120
2420a20m7n8M5K01J06n1o8j60n1J51J03J27L7j73j13o4P4J40J15p7m3j62j47M5
$$ -120 -167 -225 -180 21 127 76 8 -152 -203 -52 51 178 215 42 -71 -135 -61 79 194 117 74 -88 -235 -190
2444a90J15J49L2j13j6r9P8J20O8R1o3j19j05l0N5J25l4l1o4k02J2QJ98J83k4
$$ -190 -75 74 106 -7 -23 -122 -44 76 144 235 172 53 -52 -82 -27 98 64 33 -31 -233 -221 -213 -15 168 144
2469A44r5o1j03R3J32J03o6n1j82r7O7N7J58o6j9j50m5O0J33J28J5Q8k38o5n6
$$ 144 49 -12 -115 -22 110 213 147 96 -86 -183 -116 -59 99 33 14 -136 -181 -121 12 140 155 243 5 -60 -116
2494a16R0J60lq3j31j27j0J10J34J15m6q7j66L9M9J80J12j9j43o7q7lJ70lL8j15
$$ -116 -26 134 131 48 -83 -210 -220 -110 24 139 93 6 -160 -121 -72 108 220 201 58 -9 -96 -99 71 68 106 -9
2520ij84o4O4J35Q9J02k2j35n5O5R1J42jl2j70j08n6MJ20M3m1r5j45J8J56J58
$$ -9 -193 -257 -193 -58 31 133 111 -24 -79 -14 77 219 218 186 16 -92 -148 -144 -24 19 -22 -117 -262 -244 -88 70
2546G0J25k2k9j24m0J1R4R8m6j18j72n9J01J3J34M3r4j30n1P4J70R8R9l0j44j30
$$ 70 195 173 144 20 -20 -9 85 183 137 19 -153 -212 -111 -98 36 79 -15 -145 -196 -122 48 146 245 215 71 -59
2572e9KJ27O2Pr4j88j15L4NJ98Q6l1n3p6j7O7J43J11Nq7j75o5M4R4L3l0o1j49
$$ -59 -57 70 132 139 45 -143 -258 -224 -219 -21 65 34 -19 -95 -112 -45 98 209 214 127 -48 -113 -69 25 58 28 -33 -182
2600a82q0J45L1J26J27r3p2j4qJ2J60N0j01p5p7j15R0J06K7Nr7j25j3P2J17Q7
$$ -182 -262 -117 -86 40 167 74 2 -12 -20 -8 152 202 101 26 -51 -166 -76 30 57 62 -35 -160 -173 -101 16 103
2626A03N7n0j38pO0O5M0J9j42j55l5N9R4R8O7q1j16o5k9J67J00Q5q2j36m8N4J9
$$ 103 160 110 -28 -35 25 90 130 149 7 -148 -183 -124 -30 68 135 54 -62 -127 -156 11 111 196 114 -22 -70 -16 3
2653CR0J3n7j02p8o6Q1J20J11J7j13m9l0J9J25N3m6n7r0o6P5R3N3K0j28m9j30
$$ 3 93 106 49 -53 -131 -197 -116 4 115 132 19 -30 -60 -41 84 137 91 34 -56 -122 -47 46 99 119 -9 -58 -188
2680a88O8P7J04K0oo9r5M0P6P1O2j28r6j05j0R4R5O3kj30mm0P1N5O5K5j14m9l5
$$ -188 -120 -43 61 81 75 6 -89 -49 27 98 160 32 -64 -169 -179 -85 10 73 71 -59 -63 -103 -32 23 88 113 -1 -50 -85
2709h5K0P8J20o5o0l4j32P1P1J20m1o3m7o9KP0J19J0l1m6j12Q1R1J11j5o9j02
$$ -85 -65 13 133 68 8 -26 -158 -87 -16 104 63 0 -47 -116 -114 -44 75 85 54 8 -104 -23 68 179 164 95 -7
2736go2q9O8J13Q6mj48po0P5N0R8jj03q5j9N8J07O1k7j5j36k3o4J13K8L9m6m1
$$ -7 -69 -158 -90 23 109 105 -43 -50 -110 -35 15 113 112 9 -76 -95 -37 70 131 104 89 -47 -70 -134 -21 7 46 0 -41
2765d1r6QJ10J00O6k0j02j0p3Q8P5oJ3j15j71K7J9J18M7or1o2L1Q5J29N8j7k9
$$ -41 -137 -129 -19 81 147 127 25 15 -58 30 105 99 112 -3 -174 -147 -128 -10 37 31 -60 -122 -91 -6 123 181 164 135
2793A35j59Lj3O3K7J2q4o2m7l5O4J40n1j2j2j8mN4J58L0j3j19m9r2K9J08J5Kj96
$$ 135 -24 -21 -34 29 56 68 -16 -78 -125 -160 -96 44 -7 -19 -31 -49 -53 1 159 189 176 57 8 -84 -55 53 68 70 -126
2822a26rl1N6M6J15Q7j03q1nJ15NR0l6o8j20k6k4J3J28J1j02j1p1%R4J47O8o9
$$ -126 -135 -166 -110 -64 51 138 35 -46 -51 64 69 159 123 55 -65 -91 -115 -102 26 37 -65 -76 -147 -147 -53 94 162 93
2850I3m4r0J0LJ07M7q9o1n0k0M4K8Q7l4r9l0j8P2J47O9K9j00n1o1p5J12Mk0m8
$$ 93 49 -41 -31 -28 79 126 37 -24 -74 -94 -50 -22 65 31 -68 -98 -116 -44 103 172 201 101 50 -11 -86 26 30 10 -38
2879c8q4p3j0R8J40P9j6p5K2m4R6PJ14r9o2j15l9L6J25p8Ol5j21M0qJ31J06J5
$$ -38 -122 -195 -205 -107 33 112 96 21 43 -1 95 102 216 117 55 -60 -99 -63 62 -16 -10 -45 -166 -126 -134 -3 103 118
2907A18p9%l1J1J29n6Km4j16j15JP9N3L2q3j8l6N7J28J07M5q4j0j14J8P8K8K4
$$ 118 39 39 8 19 148 92 94 50 -66 -181 -180 -101 -48 -16 -99 -117 -153 -96 32 139 184 100 90 -24 -6 72 100 124
2935A24n7j28p7l6O1R3p8J48q5o3P1Q8P3Q3p4k2k5j02K7J2NPj09o8l2L3Q3R3M1
$$ 124 67 -61 -138 -174 -113 -20 -98 50 -35 -98 -27 61 134 217 143 121 96 -6 21 33 38 45 -64 -132 -164 -131 -48 45 86
2964H6n1Rm8qJ17O7Pk9j00n2m3O1N0m5p1j0k9n1K0J74J1k8m8K8m6P8Q1P5k5l0
$$ 86 35 44 -4 -12 105 172 179 150 50 -2 -45 16 66 21 -50 -60 -89 -140 -120 54 65 37 -11 17 -29 49 130 205 180 150
2994A50j29r6k0J0Q7p1K2l9p4M8R6R5L7L0j39Mj4jJ07K1l7r5n0l0N1K7K7m1p1
$$ 150 21 -75 -95 -85 2 -69 -47 -86 -160 -112 -16 79 116 146 7 11 -3 -4 103 124 87 -8 -58 -88 -37 -10 17 -24 -95
3023i5o8P8M8R6J7K8pq1Qj7N0O9j8r3j13n9N4j3J50l0l9J0q8Q6L8J29M0n1p4k7
$$ -95 -163 -85 -37 59 76 104 97 16 24 7 57 126 108 15 -98 -157 -103 -116 34 4 -35 -25 -113 -27 11 140 180 129 55 28
3053B8j8l9L4O6q3o7p5K8L1J21M7QJ2j67j6L8J83%j5m3q3o8NO2L4ll2r5q9O4R0
$$ 28 10 -29 5 71 -12 -79 -154 -126 -95 26 73 81 93 -74 -90 -52 131 131 116 73 -10 -78 -73 -11 23 20 -12 -107 -196 -132 -42
3084d2Q8P2o1rl6k4O1j5L9J5n6j24m7J41k3N6o9j6j03MJ53P5N5l3K0m8r2L0L3
$$ -42 46 118 57 48 12 -12 49 34 73 88 32 -92 -139 2 -21 35 -34 -50 -153 -149 4 79 134 101 121 73 -19 11 44
3113D4J09q7r6r9l6j7L4J23N1n5j6m1O5PR5O4q4Qq5l5K5J22k3j01m4l2o6R1J1
$$ 44 153 66 -30 -129 -165 -182 -148 -25 26 -29 -45 -86 -21 -14 81 145 61 69 -16 -51 -26 96 73 -28 -72 -104 -170 -79 -68
3142f8J31m5J3k9k9O2OQ1pl0j25j9K0J2J9O9j07j46K2N8Q9R7K1l4m7KlJ7O0j4
$$ -68 63 18 31 2 -27 35 41 122 115 85 -40 -59 -39 -27 -8 61 -46 -192 -170 -112 -23 74 95 61 14 16 13 30 90 76
3172G6k4r4K2j16R3L3J3l5m3l7M7M1L6O4M5p9m0J0J2P6oJm7p3n0j2j3O9M2l7l1
$$ 76 52 -42 -20 -136 -43 -10 3 -32 -75 -112 -65 -24 12 76 121 42 2 12 24 100 94 95 48 -25 -75 -87 -100 -31 11 -26 -57
3203e7k3M6O6N5M4p2p7Jm1N3J6K1j6m6j07K8P7J9Q9l2m5k1oN2K4O3o1Lr1m8L3
$$ -57 -80 -34 32 87 131 59 -18 -17 -58 -5 11 32 16 -30 -137 -109 -32 -13 76 44 -1 -22 -28 24 48 111 50 53 -38 -86 -53
3234e3M8N6J3j03l3k9J3J00J9K3M7q0j4k6P1L4O2j53q2Ol0J4N1O0l9K0ml0J7N7
$$ -53 -5 51 64 -39 -72 -101 -88 12 31 54 101 21 7 -19 52 86 148 -5 -87 -81 -111 -97 -46 14 -25 -5 -9 -39 -22 35
3264C5N9K5o7p8%M0J6Q3r0j6r9lJ4R3M5n2J5m5rLK8R8Mn7n0r8J52o6N0Qn4%m7
$$ 35 94 119 52 -26 -26 14 30 113 23 7 -92 -95 -81 12 57 5 20 -25 -34 -31 -3 95 99 42 -8 -106 46 -20 30 38 -16 -16 -63
3297f3NJ2J7K8ok4l3Q6J1L1j1J1l4q2j9O8Pl9J1j3lj3oM0J6Q5l2p3l6J6N2R5K6
$$ -63 -58 -46 -29 -1 -7 -31 -64 22 33 64 53 64 30 -52 -71 -3 4 -35 -24 -37 -40 -53 -59 -19 -3 82 50 -23 -59 -43 9 104 130
3330A30l6j27J1Ql7L2K0J1p1o6N1K9M7N9K0n6j3K4m0K4Q2l7m9l6o4L5N8M5q0K8
$$ 130 94 -33 -22 -14 -51 -19 1 12 -59 -125 -74 -45 2 61 81 25 12 36 -4 20 102 65 16 -20 -84 -49 9 54 -26 2
3360BK9q0k7J21k7N6n7l3k4N1PP4lo2o6k2J0l9L0P1J8n5J4m4K1N1N6Km7oj7j7
$$ 2 31 -49 -76 45 18 74 17 -16 -40 11 18 92 89 27 -39 -61 -51 -90 -60 11 29 -26 -12 -56 -35 16 72 74 27 21 4 -13
3392a3j7Q0L4n5j02l3J9J16K1J7k0p1L0lJ0J8N4k7m2j4n4J8K3k2M2l7r2kJ37l7
$$ -13 -30 50 84 29 -73 -106 -87 29 50 67 47 -24 6 3 13 31 85 58 16 2 -52 -34 -11 -33 9 -28 -120 -122 15 -22
3422b2M3Q7r5Qm7N4K4K8l3o7j9m6j9R5M7n6L1q1k1J2J18L4M2j0o8j4j1K6k6O0
$$ -22 21 108 13 21 -26 28 52 80 47 -20 -39 -85 -104 -9 38 -18 13 -68 -89 -77 41 75 117 107 39 25 14 40 14 74
3452G4n3j47M1k0J3J14j2P6r9L9p2K3N3N9jl4m5q3L3L2QN6o4r2O3j6O2OO9Kn1
$$ 74 21 -126 -85 -105 -92 22 10 86 -13 26 -46 -23 30 89 88 54 9 -74 -41 -9 -1 55 -9 -101 -38 -54 8 14 83 85 34
3483C4j2l8N4L5j2O2r6p7Nj3Q5j7Qm7m4k4O6M4Q0j6k1r0P5j9OJ5k4m6k6n0L6L6
$$ 34 22 -16 38 73 61 123 27 -50 -45 -58 27 10 18 -29 -73 -97 -31 13 93 77 56 -34 41 22 28 43 19 -27 -53 -103 -67 -31
3515c1K1k9N0j9k6k2O0R1k6kl7m2l6N9rJ3J0j03j7K4lR1L5K3l7l8K3l2N5l3N2
$$ -31 -10 -39 11 -8 -34 -56 4 95 69 67 30 -12 -48 11 2 15 25 -78 -95 -71 -74 17 52 75 38 0 23 -9 46 13 65
3546F5j01l5M7MmM3m0K2Jn3%N4KPN2p9m7L4O4mL7l9Mp3o4O4N3p%k6Lj4j3P9Lm6
$$ 65 -36 -71 -24 -20 -24 19 -21 1 2 -51 -51 3 5 12 64 -15 -62 -28 36 32 69 30 34 -39 -103 -39 14 7 7 -19 -16 -30 -43 36 39 -7
3582gM4m7M7k7K3k1J4j8q8J7LP7J0K3j3p4j7O1l1J08ro7L8m9l2oK3M3k7q4j2l
$$ -7 37 -10 37 10 33 12 26 8 -80 -63 -60 17 27 50 37 -37 -54 7 -24 84 75 8 46 -3 -35 -41 -18 25 -2 -86 -98 -101
3614a01R3K3qM2lo7l9L6L5qM6j8l7o7O8mM1p6O8p6l2P0MLN6m6m6K1m1J52m9N6
$$ -101 -8 15 7 49 46 -21 -60 -24 11 3 49 31 -6 -73 -5 -9 32 -44 24 -52 -84 -14 -10 -7 49 3 -43 -22 -63 89 40 96
3646I6n1p5J7k2ML1k5P2j10L0k5J19n5N1K7n9m7N8q3L5M2k8J2q1N0j1J1K6L3j9
$$ 96 45 -30 -13 -35 -31 0 -25 47 -63 -33 -58 61 6 57 84 25 -22 36 -47 -12 30 2 14 -67 -17 -28 -17 9 42 23
3676B3j9o7J09k7n2O6K9r0j3J2K5M9M0m0l5k5n1L3M5J0k3m6p4P5N0O6k9K8Jj04
$$ 23 4 -63 46 19 -33 33 62 -28 -41 -29 -4 45 85 45 10 -15 -66 -33 12 22 -1 -47 -121 -46 4 70 41 69 70 -34
3706c4P3p6j8O9Rm2k1m3k4N5J06j3L1n3J5p1Q3m5R1p0m3Jj5K6KL1J7o9l2RL7R
$$ -34 39 -37 -55 14 23 -19 -40 -83 -107 -52 54 41 72 19 34 -37 46 1 92 22 -21 -20 -35 -9 -7 24 41 -28 -60 -51 -14 -5
3738eJ9q0J01p5K3N4kL0l7J6m0j9o9O6O1m2J9o6JJ8L7K7N1m1j4o0OJ5M2rJ3l1
$$ -5 14 -66 35 -40 -17 37 35 65 28 44 4 -15 -84 -18 43 1 20 -46 -45 -27 10 37 88 47 33 -27 -21 -6 36 27 40 9
3770Ip2j8M0P1m%o5J6j5L0j9J18lj12L5n4j6N9L0%r5M4q1MQ1k2KRklMP0N0k7J9
$$ 9 -63 -81 -41 30 26 26 -39 -23 -38 -8 -27 91 88 -24 11 -43 -59 0 30 30 -65 -21 -102 -98 -17 -39 -37 -28 -30 -33 -29 41 91 64 83
3805H3p5m7K8l6L5J6l2O2j22J7%N3L1k9L6o3M4m5Q9NN3n8m3p0L9pQ3k3rq7M2O
$$ 83 8 -39 -11 -47 -12 4 -28 34 -88 -71 -71 -18 13 -16 20 -43 1 -44 45 50 103 45 2 -68 -29 -36 47 24 15 -72 -30 -24
3837b4m1J19Jm0O1p8j9rLP8o5L0m1j8QpN3j1n4J9LK1K7lK8ll0l0M8QKl2L8n1n9
$$ -24 -65 54 55 15 76 -2 -21 -30 -27 51 -14 16 -25 -43 -35 -42 11 0 -54 -35 -32 -11 16 13 41 38 8 -22 26 34 36 4 42 -9 -68
3872f8NK8M4L4k1q7j3J5N0R8pn5%k7oL4M0l6m6K8m4M7j11J03M8j8nr3M8KM4nL3
$$ -68 -63 -35 9 43 22 -65 -78 -63 -13 85 78 23 23 -4 -10 24 64 28 -18 10 -34 13 -98 5 53 35 30 -63 -15 -13 31 26 59
3905E9p2j5L2l2N3qPq5QM2j5K6P7n5K0l5o6L8M1J6m5l1Nkj5k1QO3J0J3n5M6j0
$$ 59 -13 -28 4 -28 25 17 24 -61 -53 -11 -26 0 77 22 42 7 -59 -21 20 36 -9 -40 -35 -37 -52 -73 -65 -2 8 21 -34 12 2
3938Bm2M1MJ0j4n0J00K1n2L4p2olPJP7j00O8j4m3J1K3k6M4kMk5l8L4j9R3j04O8
$$ 2 -40 1 5 15 1 -49 51 72 20 54 -18 -24 -27 -20 -19 58 -42 26 12 -31 -20 3 -23 21 19 23 -2 -40 -6 -25 68 -36 32
3971C2r3NN6J0Nl6J9Ll8K2J7M3J2q3j4qJ6J7J8k8L8lm5LP0n7N4k6K6m9%K5L1m3
$$ 32 -61 -56 0 10 15 -21 -2 1 -37 -15 2 45 57 -26 -40 -48 -32 -15 3 -25 13 10 -35 -32 38 -19 35 9 35 -14 -14 11 42 -1
4005aK2j3n6l3L7M7rOJ4p7J1m6J35M6k6m9k5j0m1R9mL0l9o9k4N2l0K6M8o6K3j8
$$ -1 21 8 -48 -81 -44 3 -6 0 14 -63 -52 -98 37 83 57 8 -17 -27 -68 31 27 57 18 -51 -75 -23 -53 -27 21 -45 -22 -40
4037d0K4K4l5J12p0P1o8k8K1k5O8Q1j63m7K4QM4%m1J9l3K5J5k0R1kLo8K9J5n8
$$ -40 -16 8 -27 85 15 86 18 -10 11 -14 54 135 -28 -75 -51 -43 1 1 -40 -21 -54 -29 -14 -34 57 55 58 -10 19 34 -24
4068b4O5n4j7L0m6M4l1P0L1n5l5j7k6M1N6n2K0l3RL5rj6lK4k9l4lM1j1N5K7%j02
$$ -24 41 -13 -30 0 -46 -2 -33 37 68 13 -22 -39 -65 -24 32 -20 0 -33 -24 11 2 -14 -17 7 -22 -56 -59 -18 -29 26 53 53 -49
4101d9n2J11L7j4k6N3l9q1nL8L6J2m5J7j0OJ0J3K1m8M0Qrl3j2M2l0m8M6o3LM0
$$ -49 -101 10 47 33 7 60 21 -60 -65 -27 9 21 -24 -7 -17 -11 -1 12 33 -15 25 33 24 -9 -21 21 -9 -57 -11 -74 -71 -31
4133c1P4pRo2k2L0N4j1O9k7j24k0R4Nj4Nk3lq8M0N5mJ9j7pk5O5K2p6M9mm9L2l7
$$ -31 43 36 45 -17 -39 -9 45 34 103 76 -48 -68 26 31 17 22 -1 -4 -92 -52 3 -1 18 1 -6 -31 34 56 -20 29 25 -24 8 -29
4167b9N3l0K2m5Orj5kN2k0J4k9K9K4Nm7M4j1J4L0j14K6L5kJ0m7K0J7nJ1K8M4q3
$$ -29 24 -6 16 -29 -23 -32 -47 -49 3 -17 -3 -32 -3 21 26 -21 23 12 26 56 -58 -32 3 1 11 -36 -16 1 -4 7 35 79 -4
4200dJ8l3m0M5O8j5n2k5j3lL7PO9m7l7k0O3m0L1rQj9m7Q8rm3Q6q8M4m4kN7m4M
$$ -4 14 -19 -59 -14 54 39 -13 -38 -51 -54 -17 -10 59 12 -25 -45 18 -22 9 0 8 -11 -58 30 21 -22 64 -24 20 -24 -26 31 -13 -9
4234iM7j9l2j8P2j2Nm4Ok9M1k2Q1m7k3O1o6j2k6Q8o7m0O7l7K0n9N2R3p6J7m1M3
$$ -9 38 19 -13 -31 41 29 34 -10 -4 -33 8 -14 67 20 -3 58 -8 -20 -46 42 -25 -65 2 -35 -15 -74 -22 71 -5 12 -29 14
4266A4j4pM1Mk3l8ljqJ0M3J8jl6j2K0l1O2k9N9j12j0K7PLK2J3j7J6n8L5j1M0M0
$$ 14 0 -7 34 38 15 -23 -26 -27 -35 -25 18 36 35 -1 -13 7 -24 38 9 68 -44 -54 -27 -20 -17 5 18 1 17 -41 -6 -17 23 63
4300F3l1m1J7l0J0L0Lo4N3j4JJ1l%Ro1J0M6j3KRM0Rq3%PL9L4o6m3K1L7okMK7n
$$ 63 32 -9 8 -22 -12 18 21 -43 10 -4 -3 8 5 5 14 -47 -37 9 -4 -2 7 47 56 -27 -27 -20 19 53 -13 -56 -35 2 -4 -6 -2 25 20
4337B0pL8m4n9N7j6O0j0r8M9kL2n6K7j08M5J13m4K5Nj7K1j1q6Q7K1%n5J3j0o2
$$ 20 13 51 7 -52 5 -11 49 39 -59 -10 -12 20 -36 -9 -117 -72 41 -3 22 27 10 31 20 -66 21 42 42 -13 0 -10 -72
4368g2L3P6n0Q5j30O2Qk1RPl1O0o1M4m3QO2m2k9j1l0Q8m3K0j6J5l6J2K4L3k0o
$$ -72 -39 37 -13 72 -58 4 12 -9 0 7 -24 36 -25 19 -24 -16 46 4 -25 -36 -66 22 -21 -1 -17 -2 -38 -26 -2 31 11 5
4400EQlk2k9m8N1l2O1l4J5j7Q3l1L0np9K1J8L6j8J6mk5J7j9N4p1L8k8nl3M3n1
$$ 5 13 10 -12 -41 -89 -38 -70 -9 -43 -28 -45 38 7 37 32 -47 -26 -8 28 10 26 22 -3 14 -5 49 -22 16 -12 -17 -50 -7 -58
4433e8M4M8m6P1q0j3j9O8Lk7jmk1J2J2p1N5L3ml8L8lK1N2n4m2M0p1J05l1K5m3
$$ -58 -14 34 -12 59 -21 -34 -53 15 18 -9 -10 -14 -35 -23 -11 -82 -27 6 2 -36 2 -1 20 72 18 -24 16 -55 50 19 44 1
4465AL8r1MJ1N3K9m1j0L3n5K4nOlO2o3l0N5p2M4ML2n7N4p0M1j3N8k1%j3m0JJ10
$$ 1 39 -52 -48 -37 16 45 4 -6 27 -28 -4 -9 -3 -6 56 -7 -37 18 -54 -10 -6 26 -31 23 -47 -6 -19 39 18 18 5 -35 -34 76
4499G6n7k6j0oM1n2M4K9J6pp0Pm8N8KK8O6o5l7K4M9j7o3P8m0q0M2Q1j00MN5l0
$$ 76 19 -7 -17 -23 18 -34 10 39 55 48 -22 -15 -63 -5 -3 25 91 26 -11 13 62 45 -18 60 20 -60 -18 63 -37 -33 22 -8
4531hoN5l3k1M1n5K5m9K3M2J4o3P4k6L2k5m0qJ4j7M1J0l4QK5M2J5l2j02M4j3M8
$$ -8 -14 41 8 -13 28 -27 -2 -51 -28 14 28 -35 39 13 45 20 -20 -28 -14 -31 10 20 -14 -6 19 61 76 44 -58 -14 -27 21
4563B1J8L4p4Qm9j6K7NP5l5ok6M2k8MN1k5m9L5p2L8Jj0K8n5K1J8J1nOM6K5r9k5
$$ 21 39 73 -1 7 -42 -58 -31 -26 49 14 8 -18 24 -4 0 51 26 -23 12 -60 -22 -21 -31 -3 -58 -37 -19 -8 -13 -7 39 64 -35 -60
4597f0N0LL0MK4n4m6K8J1PL%L8k5j8L4n6M9l3J0j6jM0l9j9J37j67K9N6kk9Q6r4
$$ -60 -10 -7 23 27 51 -3 -49 -21 -10 -3 0 0 38 13 -5 29 -27 22 -11 -1 -17 -18 22 -17 -36 101 -66 -37 19 17 -12 74 -20
4630b0lM6p4M8K8K5Pk4n3rJ5k7rP0jl4j7M1j2LM6m4m4L1K6l5L3K7l2jNj6L8l3
$$ -20 -23 23 -51 -3 25 50 57 33 -20 -29 -14 -41 -50 20 19 -15 -32 9 -3 0 46 2 -42 -11 15 -20 13 40 8 7 12 -4 34 1
4664AJ0j8K5k6qm1K5K8K9m9M7Lj0N6m3j6J6l9MOm5M2kj6K8k9n0O4QK1m1J5q3Q2
$$ 1 11 -7 18 -8 -16 -57 -32 -4 25 -24 23 26 16 72 29 13 29 -10 -6 0 -45 -3 -5 -21 7 -22 -72 -8 0 21 -20 -5 -88 -6
4698fj8M2l7%K4pJ5l3l4N0J6k3K6l3J4J1M8j1K6k0o3M4K0no2l0PM7nK9j5m6R2
$$ -6 -24 18 -19 -19 5 -2 13 -20 -54 -4 12 -11 15 -18 -4 7 55 44 70 50 -13 31 51 46 -16 -46 -39 8 3 32 17 -29 63
4731F3j16M0j3L5K1j7l2Kj9JJ9M9mln6j4P0l9j3O5m2l3J1MK4k7L7MJ4j8k3kKJ5
$$ 63 -53 -13 -26 9 30 13 -19 -17 -36 -35 -16 33 29 26 -30 -44 26 -13 -26 39 -3 -36 -25 -21 3 -24 13 17 31 13 -10 -12 -10 5
4765El4J6M0j04N0P3q0N6NQm9K7m3M4j3k5j1M9ql8j9P6mjm4K7pk9N7mo2M8nJ2
$$ 5 -29 -13 27 -77 -27 46 -34 22 27 35 -14 13 -30 14 1 -24 -35 14 6 -32 -51 25 21 20 -24 3 -4 -33 24 20 -42 6 1 13
4799A3k5K7j5J8j0j0K9n2oM1l5N9n8L3k8K3M9K5m4m1o2J07%J3J0q9k1L7O5q8M9
$$ 13 -12 15 0 18 8 -2 27 -25 -31 10 -25 34 -24 9 -19 4 53 78 34 -7 -69 38 38 51 61 -28 -49 -12 53 -35 14
4830A4p4PJ00l5l9M8K6l0l6k3L1M9l5k5M4Mj2k3l2QM3j0l1O8n2j7j7O9K0m0M3
$$ 14 -60 -53 47 12 -27 21 47 17 -19 -42 -11 38 3 -22 22 26 14 -9 -41 -33 10 0 -31 37 -15 -32 -49 20 40 0 43
4861D3m5L6k9j0J8NM8p6mK3j8nJ2kK1L2m0N3j49R1l6P6p6L7k0l2mM0PL6m1M0j3
$$ 43 -2 34 5 -5 13 18 66 -10 -14 9 -9 -14 -2 -4 17 49 9 62 -87 4 -32 44 -32 5 -15 -47 -51 -11 -4 32 -9 31 18
4894A8J3k1l5P1p7J0L5k3L7m6noMM3l8L5k2KO6q8J8L0n9J3%J3L1m5N5l8l0K5L1
$$ 18 31 10 -25 46 -31 -21 14 -9 28 -18 -23 -29 -25 18 -20 15 -7 -5 61 -27 -9 21 -38 -25 -25 -12 19 -26 29 -9 -39 -14 17
4927A7k0QKl7K6J9j1m2P9L3j5k8MK3Mq5J6J6n9K0l0L8J7OK9j2j6k1KN9l8K2l0
$$ 17 -3 5 7 -30 -4 15 4 -38 41 74 59 31 35 58 62 -23 -7 9 -50 -30 -60 -22 -5 1 30 18 2 -19 -17 42 4 26 -4
4960dK3Jj5o6P0m0O6l1J8m4n3R2KJ2k8k9k4L0J5l0K5M4m6L5mJ7l6K8L1q4%P0q9
$$ -4 19 20 5 -61 9 -31 35 4 22 -22 -75 17 19 31 3 -26 -50 -20 -5 -35 -10 34 -12 23 19 36 0 28 59 -25 -25 45 -44
4993d4M2OK7q1N1j9O6q4LN9k1j1qMjk1K4K7k0K1J2Qj09R0Ql0K1m8m5J21m8M5M7
$$ -44 -2 4 31 -50 1 -18 48 -36 -33 26 5 -6 -14 -10 -11 -32 -8 19 -1 20 32 40 -69 21 29 -1 20 -28 -73 48 0 45 92
5026I2j06p0N6Q4m3rM5m6Nk5M1k7pK2k1K3l5N0k6J9p9Q2k9J1n5K7O8j7Mm0J8k3
$$ 92 -14 -84 -28 56 13 4 49 3 8 -17 24 -3 -10 12 -9 14 -21 29 3 22 -57 25 -4 7 -48 -21 47 30 34 -6 12 -11
5058a1J9N1o4NK2L6q2M1ql7J7j2L8KK2m8L0Kj6pN6j0n1L0j01N4k7L6n0Q1j0J4
$$ -11 8 59 -5 0 22 58 -24 17 9 -28 -11 -23 15 17 39 -9 21 23 7 0 56 46 -5 25 -76 -22 -49 -13 -63 18 8 22
5090B2j4K3llL2j6Jk4K0m2L7n3P4j2o7M8l9J3rJ1N2l5jm5L8k4j1P2j7rk0J9k7
$$ 22 8 31 28 25 57 41 42 18 38 -4 33 -20 54 42 -25 23 -16 -3 -12 -1 51 16 15 -30 8 -16 -27 45 28 19 -1 18 -9
5123im1L6MK3p5L8OL1k9J2L5j8oK8J9n3j3JlJ8J6k3L7n5J3n3M5J5M2mK1pl1n2
$$ -9 -50 -14 -10 13 -62 -24 -18 13 -16 -4 31 13 7 35 54 1 -12 -11 -14 4 20 -3 34 -21 -8 -61 -16 -1 41 37 58 51 20 -32
5157c2Kj4P8k8o5L7l0M6LM4o1j7J1L0l8K8O4p8K0J7k2J7M4m6K1l8kl8J0JM6J5
$$ -32 -30 -44 34 6 -59 -22 -52 -6 -3 41 -20 -37 -26 4 -34 -6 58 -20 0 17 -5 12 56 10 31 -7 -9 -47 -37 -36 10 25
5189B5k7K5j6k4N2o3K0N8j09P2l2j3K7l2O7r6N4l7L1jj4J3K1j2J3pk2P2n9K4K3
$$ 25 -2 23 7 -17 35 -28 -8 50 -59 13 -19 -32 -5 -37 30 -66 -12 -49 -18 -19 -33 -20 1 -11 2 -5 -27 45 -14 10 33
5220C3pp9L2O0j7n2N8k3nnj5J06p8k7J1poJ6pj1M5o2j5O9Ko3k5O0M1j5J1m2OJ0
$$ 33 26 -53 -21 39 22 -30 28 5 0 -5 -20 86 8 -19 -8 -15 -21 -5 -12 -23 22 -40 -55 14 16 -47 -72 -12 29 14 25 -17 -11 -1
5254am2J9N7n8J7mQ5q8j0L5k1oJ6l2L8J9j9J0l9k7P3kj4N1p1K5Mm9J8O4l5j3M7
$$ -1 -43 -24 33 -25 -8 -12 73 -15 -25 10 -11 -17 -1 -33 5 24 5 15 -24 -51 22 20 6 57 -14 11 15 -34 -16 48 13 0 47
5287D7l5oj3PJ6j06R1P0j00J07j01L2n6K9K9RL2p8K2K1L5k1k9l2L1L8j8k3RK8
$$ 47 12 6 -7 0 16 -90 1 71 -29 78 -23 9 -47 -18 11 20 52 -26 -4 17 52 31 2 -30 1 39 21 -2 7 35
5317C5m3K3l3mRm1P6p1L2ORk3k5K0LJ7Ml6OK1Ol2P5Pj9l9M1q4O9LMOM1n3o0O9
$$ 35 -8 15 -18 -22 -13 -54 22 -49 -17 -11 -2 -25 -50 -30 -27 -10 -6 -42 -36 -15 -9 -41 34 41 22 -17 24 -60 9 12 16 22 63 10 -50 19
5353A9k8M1j5jom1J6Qm2P9m1K0mRN0m2M1r0j1N5Po9J9J4J4k7N2Nj3ln9L2k0nL5
$$ 19 -9 32 17 16 10 -31 -15 -7 -49 30 -11 9 5 14 64 22 63 -27 -38 17 24 -45 -26 -12 2 -25 27 32 19 16 -43 -11 -31 -36 -1
5388aM4ok2j2n5O8J9n9K8J9%Nm2j1k5L6L2k3K3J5m6J0qL7k1L9m5L3r1J12k6m8
$$ -1 43 37 15 3 -52 16 35 -24 4 23 23 28 -14 -25 -50 -14 18 -5 18 33 -13 -3 -11 26 5 44 -1 32 -59 53 27 -21
5420b1jMLNOJk2lO6jj3k4LJ1n2L0K6rM2k7j9j1Ol2J6J0m7M8L7j4k8lo4O0M5K4
$$ -21 -22 -18 -15 -10 -4 -3 -25 -28 38 37 24 0 3 14 -38 -8 18 9 51 24 5 -6 0 -32 -16 -6 -53 -5 32 18 -10 -13 -77 -17 28 52
5456E2n8K2l6K7l8PK5mJN3m9k7K9L2k8l0O1m8OjKJ4k7Lk3M2rj9K8Qo7O8L2j7n6
$$ 52 -6 16 -20 7 -31 -24 1 -3 -2 51 2 -25 4 36 8 -22 39 -9 -3 -4 -2 12 -15 -12 -35 7 -2 -21 7 15 -52 16 48 31 -25
5491b5K1m0O0k0M4p3L0K5J0m3Qk1m2O6j5J8OJ5k6N7n5j1nL8rm0N7pn6K8K4n4N
$$ -25 -4 -44 16 -4 40 -33 -3 22 32 -11 -3 -24 -66 0 -15 3 9 24 -2 55 0 -11 -16 22 13 -27 30 23 -33 -5 19 -35 -30
5524c0N7jl2Nl2K5qK1mj0K5j0j6lL3m7M3j6k8J6l4jM6j0jj8%j4L8m9J01n9kL5
$$ -30 27 26 -6 -1 -33 -8 -16 5 1 -9 16 6 -10 -13 20 -27 16 0 -28 -12 -46 -47 -1 -11 -12 -30 -30 -44 -6 -55 46 -13 -15 20
5558B0l0Rj4N7o9P9j02O0J1j6J0K2j1l6L5q7O0jO1o9KJ9k3K6q1O6J7m3K3LK5k9
$$ 20 -10 -1 -15 42 -27 52 -50 10 21 5 15 37 26 -10 25 -62 -2 -3 58 -11 -9 10 -13 13 -68 -2 15 -28 -5 -2 23 -6
5590fj3qL1n1lR2p1L9J5k4J4K6n2OK2k0K4m2NQk3K2l0N2n2O3m9QJ3j1j6MM1l9
$$ -6 -19 -27 4 -47 -50 42 -29 10 25 1 15 41 -11 -5 17 -3 21 -21 -16 -8 -31 -9 -39 13 -39 24 -25 -17 -4 -15 -31 -27 14 -25
5624b5L4k3K7m6N5n5K5pK9J5m4j6P9o0L3m7J5QJ5kp3L0KN9k0J4m1QJ0J2j2jK0
$$ -25 9 -14 13 -33 22 -33 -8 -15 14 29 -15 -31 48 -12 21 -26 -11 -3 12 10 -63 -33 -31 28 8 22 -19 -11 -1 11 -1 -2 18
5657A8Nq9K8m2O5K8p7K6pjK1L3j0k2P5j05lN6nkK0l5l8Q4m1M2j8k4Rr5M3L3K7
$$ 18 23 -66 -38 -80 -15 13 -64 -38 -45 -46 -25 8 -2 -24 51 -54 -57 -1 -6 -8 12 -23 -61 23 -18 24 6 -18 -9 -104 -61 -28 -1
5690aQ1l6p9RJ0Kk2K0M2m7l3pP6k0m1oJ6M7l1J3rKON3Lj04N0j2Qj5K9mk2oL0j1
$$ -1 80 44 -35 -26 -16 -14 -36 -16 26 -21 -54 -61 15 -5 -46 -52 -36 11 -20 -7 -16 -14 -8 45 48 -56 -6 -18 -10 -25 4 0 -22 -28 2 -9
5726iM9o6J6L0K1n6K0j0l9O8n7QKL1J3jrL6n8j1kL8o4Q1j7n1J4N0m6R4m4m4M7
$$ -9 40 -26 -10 20 41 -15 5 -5 -44 24 -33 -25 -23 8 21 20 11 47 -11 -22 -24 14 -50 31 14 -37 -23 27 -19 75 31 -13 34
5759C4l4K4k3j2J3jjK4j8k6N7K4n5j3K1l6J1J2l6L0K7l4J0L2J6n8K0k0Qk2l4Q7
$$ 34 0 24 1 -11 2 1 0 24 6 -20 37 61 6 -7 14 -22 -11 1 -35 -5 22 -12 -2 30 46 -12 8 -12 -4 -26 -60 27
5791B7m7K1k6K2qoj9L7pJ5j9%l9QN1j4M1N0n7k5L4l7K7o8J3O9q0R0o8l9J19o7
$$ 27 -20 1 -25 -3 -11 -17 -36 1 -6 9 -10 -10 -49 -41 10 -4 37 87 30 5 39 2 29 -39 -26 43 -37 53 -15 -54 65 -2
5823bl2L4j4MK1m2K7Rj6J4K0J3n5J8l7O1Jj1j5Mk5M7j5m9K8N7m5m8M7J5oPrLN1
$$ -2 -34 0 -14 -10 11 -31 -4 5 -11 3 23 36 -19 -1 -38 23 24 13 -2 2 -23 24 9 -40 -12 45 0 -48 -1 14 8 15 6 9 60
5858F0M5q9k8J0QJ4m6jo0J09k9J6L5m4k5N6m0J0J9J6j0o5L0Mo3M0J1J4k1N9j7
$$ 60 105 16 -12 -2 6 20 -26 -27 -87 22 -7 9 44 0 -25 31 -9 1 20 36 26 -39 -9 -5 -68 -28 -17 -3 -24 35 18
5889A8p4N6J7kl3O2l4K4q%n8PRk1K8j9pj0Q6k8Ok9l3M8qL4l5j2K7J9p8M6k8J9
$$ 18 -56 0 17 15 -18 44 10 34 26 26 -32 -25 -16 -37 -9 -28 -35 -45 41 13 19 -10 -43 5 -3 31 -4 -16 11 30 -48 -2 -30 -11
5923a1K3l9K6J8mM9k2n5j0K9J5j8k3J1N1k9l5N1K9m2k4k5N7m8P0q8L5Jo2O8rO
$$ -11 12 -27 -1 17 13 62 40 -15 -25 4 19 1 -22 -11 40 11 -24 27 56 14 -10 -35 22 -26 44 -44 -9 -8 -70 -2 -11 -5
5955eK5j4l0M2m5k2M1qj4P4j16OL2rK6P2m8j9K4rk5k9M2l7P7q7L8m2QL8kOl3N2
$$ -5 20 6 -24 18 -27 -49 -8 -16 -30 44 -72 -66 -34 -43 -17 55 7 -12 12 3 -22 -51 -9 -46 31 -56 -18 -60 -52 -14 -16 -10 -43 9
5989Ik4K2L1p4K3J9n9L1L8m2O7k1k3k1M3k5M4K0j8qj3ol0kNkJ4j0k0kO2m9K5k3
$$ 9 -15 7 38 -36 -13 6 -53 -22 16 -26 41 20 -3 -24 19 -6 38 58 40 32 19 13 -17 -19 -14 -16 -2 -12 -32 -34 28 -21 4 -19
6023a9O5j37N1Q9mo1N0koM6l9p1PJ1j9O2l1J1%MK4n3L0K5k5j4mJ0j1j7L4L7j0
$$ -19 46 -91 -40 49 45 -16 34 32 26 72 33 -38 -31 -20 -39 23 -8 3 3 7 31 -22 8 33 8 -6 -10 0 -11 -28 6 43 33
6056C3k9N4Ro4Jk9J2RQK7o0qlO4lj7m0L7J6n1O8o5N6j8j8k8M1j1N6Jm3k4K0n9
$$ 33 4 58 67 3 4 -25 -13 -4 4 31 -29 -37 -40 24 21 4 -36 1 17 -34 34 -31 25 7 -11 -39 2 -9 47 48 5 -19 1 -58
6090e8M2L3k9M3o8jM1m5K9K9Pl7L8N0l6j9l9M7k4K8Jk6M5p0J2lj4J2J6N9m9m7
$$ -58 -16 17 -12 31 -37 -38 3 -42 -13 16 23 -14 24 74 38 19 -20 27 3 31 32 6 51 -19 -7 -10 -24 -12 4 63 14 -33
6122c3j4jK7lnj4L6lj7L8m0L5N0o3PJ5l4O1j29P3M1j7m8N7M2p6J2k3J5J2k8L7
$$ -33 -47 -48 -21 -24 -29 -43 -7 -10 -27 11 -29 6 56 -7 0 15 -19 42 -87 -14 27 10 -38 19 61 -15 -3 -26 -11 1 -27 10
6154A0Mj8pQO0n6m0N7k5rmN0j6m8MN4j9J4j9K8n5K0n0O9l5O4l6K8n7L5j8k4O6
$$ 10 14 -4 -11 -3 57 1 -39 18 -7 -16 -20 30 14 -34 -30 24 5 19 0 28 -27 -7 -57 12 -23 41 5 33 -24 11 -7 -31 35
6187C5j8qk9J5jpk4L5m4L8Jk5J2L7l6oNM4jj0mk4l7L0L7LK0j9J5j1K3m0m4Q8q8
$$ 35 17 9 -20 -5 -6 -13 -37 -2 -46 -8 -7 -32 -20 17 -19 -25 -20 24 23 13 9 -15 -52 -22 15 18 38 19 34 23 46 6 -38 50 -38
6222c8J3MLJ6k1M8j3J1j7K8q3O6m1J6lN0l6M7r1Oj3J9O5j0Kk2%j0l8J03m8j4J3
$$ -38 -25 -21 -18 -2 -23 25 12 23 6 34 -49 17 -24 -8 -11 39 3 50 -41 -35 -48 -29 36 26 28 6 6 -4 -42 61 13 -1 12
6255A2l2K4K8qj6k5j8K2P0q6O2Qm2K4j0K0l4j9N2j5l8lL3k2K8L0q2N8k4R6m2k8
$$ 12 -20 4 32 24 8 -17 -35 -13 57 -29 33 41 -1 23 13 33 -1 -20 32 17 -21 -24 9 -13 15 45 -37 21 -3 93 51 23
6287B3L7r4J0Rj8O2l3l4Q4q6L6j0NJ8Kj8k6L3N3m4MJ3n8K8J2J9k7j7J4JM4Jo0
$$ 23 60 -34 -24 -15 -33 29 -4 -38 46 -40 -4 -14 -9 9 11 -7 -33 0 53 9 13 26 -32 -4 8 27 0 -17 -3 -2 42 43 -17
6320a7K7n6O6r9O1lM0jl0J4pK3k6%j1j5JM9k9L5n4K2N5k2l2L3k2p7O1K2k0L0k4
$$ -17 10 -46 20 -79 -18 -21 19 18 -12 2 -5 18 -8 -8 -19 -34 -33 16 -13 22 -32 -10 45 23 -9 24 2 -75 -14 8 -12 18 -6
6353fj0N0o8L6mN0o7mj2j7M5J5J7o5Q3k5J0K3m1Q0o9n4M9mL6j9k3l2O1n3M6J5
$$ -6 -16 34 -34 2 -2 48 -19 -23 -35 -52 -7 8 25 -40 43 18 28 51 10 90 21 -33 16 12 48 29 6 -26 35 -18 28 43
6385D3o1kL9QK9m3oL1l0K7n1M3o5J8L3Jm3K3O6p6n7L6%N2J2J3n8l5M8J0k5J3k4
$$ 43 -18 -20 19 27 56 13 7 38 8 35 -16 27 -38 -20 13 14 -29 -6 60 -16 -73 -37 -37 15 27 40 -18 -53 -5 5 -20 -7 -31
6418c1j4Q1mm1K6j9M0m1K5l9L8K0K0n5l3j2L1JQk5L9ok4J0KJ8l6LJ0l9J02Mo5
$$ -31 -45 36 32 -9 17 -2 38 -3 22 -17 21 41 61 6 -27 -39 -8 -7 1 -24 15 9 -15 -5 -3 15 -21 -18 -8 -47 55 59 -6
6451f%J0Pj6N0n4M4Nl6l9QK5ok0N1K1m6Ml1K7M6p3M8K7k9k3M8o0J4N4m3L5m7L5
$$ -6 -6 4 11 -5 45 -9 35 40 4 -35 -27 -2 -8 -28 23 44 -2 2 -29 -2 44 -29 19 46 17 -6 42 -18 -4 50 7 42 -5 30
6485C0o2O5l1K0k3K4n4qP7m3m1qK4L8m0L8J8j7M0m1nJ3Pj3m8N9J2o0L0Llj0L2
$$ 30 -32 33 2 22 -1 23 -31 -39 38 -5 -46 -54 -30 8 -32 6 24 7 47 6 1 14 21 8 -40 19 31 -29 1 4 1 -9 23
6518B3M1r6O0k0j5k9K5L0RQlq0J8J4n0PM7K8n6L7%K6Mp3RO8l5J2j6K1k8pK2L1
$$ 23 64 -32 28 8 -7 -36 -11 19 28 36 33 -47 -29 -15 -65 -58 -11 17 -39 -2 -2 24 28 -45 -36 32 -3 9 -7 14 -14 -21 1 32
6552C2kj1K9o2m4J17n6JL8J1Qj17K1N8jl0j1K3K0m5j3L6pkPk2K6l3M1j0l0k1J
$$ 32 30 19 48 -14 -58 59 3 4 42 53 61 -56 -35 23 22 -8 -19 4 24 -21 -34 2 -5 -7 0 -22 4 -29 12 2 -28 -49 -48
6585d8R0p8M4j0qO1q1K7j2KL5Qp1P6m6K0nj4j3O2pm3NN0o9J3l0O8n9j9QL8l4l8
$$ -48 42 -36 8 -2 -10 51 -30 -3 -15 -13 22 30 -41 35 -11 9 4 -10 -23 39 32 -11 -6 44 -25 -12 -42 26 -33 -52 -44 -6 -40 -78
6619g8Q4lQK4M7r0J3ok2j3M4n1M9l4L6jKm0L0l5O8l4j5QJ7k2J4L3m5J5K4Kk8J3
$$ -78 6 3 11 35 82 -8 5 -1 -23 -36 8 -43 6 -28 8 7 9 -31 -1 -36 32 -2 -17 -9 8 -14 0 33 -12 3 27 29 1 14
6653A4%J3l5l9K3K8l3l7M6L3mp4J1O1K0j8Pm1J3Pm1Q4m5PRKrK3j9k8M1p1M9L7
$$ 14 14 27 -8 -47 -24 4 -29 -66 -20 13 9 -65 -54 7 27 9 16 -25 -12 -5 -46 38 -7 0 9 11 2 25 6 -22 19 -52 -3 34
6687C4ol6J5J8k9Rk3K0nk1K9m2N8k9JK5l9M3kn6P7rl0K8l9l0ON6k7N1p2O9j8n3
$$ 34 28 -8 7 25 -4 5 -18 2 -3 -24 5 -37 21 -8 -7 18 -21 22 20 -36 41 32 2 30 -9 -39 -33 23 -4 47 -25 44 26 -27
6721b7K8pJ9J9nk7qL8l8J8PLk5L7Lj5l4Q1k4l9n5L1LNM1K3j4k6n3N0Oj0Jj6j6
$$ -27 1 -6 13 32 27 0 -8 30 -8 10 17 20 -5 32 35 20 -14 67 43 4 -51 -20 -17 -12 29 52 38 12 -41 9 15 5 6 -10 -26
6756b6kQN3j5l4L2P8o9K5k6r8P2Ol1O3nj4pj5l6K0rJ5Ml7L7J7q8P3K9m6J4J6K7
$$ -26 -28 -20 33 18 -16 16 94 25 50 24 -74 -2 4 -27 36 31 17 10 -5 -41 -21 -30 -15 -11 -48 -11 6 -82 -9 20 -26 -12 4 31
6790C1q3R0m1k6O3p0K3K0J1k8j6QM4m3Qj3L1L2j00R1m9N1n0N1l1J7pm6L8J0j5
$$ 31 -52 38 -3 -29 34 -36 -13 7 18 -10 -26 -18 26 -17 -9 -22 9 41 -59 32 -17 34 -16 35 4 21 14 -32 6 16 1
6821AL8j1o2jRj3R1p2j3%l5L2Q3p0j5P6k6J5j2o0O1j2J2j1J1oo0L7J4K5pj0l6
$$ 1 39 28 -34 -35 -26 -39 52 -20 -33 -33 -68 -36 47 -23 -38 38 12 27 15 -45 16 4 16 5 16 10 -50 -13 1 26 19 9 -27
6854b7L6kOj0P0p8L8rj0JOk9j9QK6rrnjJ6l8M5l4M8m8N2qJ1k5j4K5k6%JP4l5k6
$$ -27 9 7 13 3 73 -5 33 24 14 15 21 -8 -27 -19 7 -2 -11 -16 -17 -1 -39 6 -28 20 -28 24 16 27 2 -12 13 -13 -13 -12 62 27 1
6891AQ8q0j0l2J3M1L0l5K3rk6n4M8rrL2qKL7j4m7K9J4l5l3N4j3k0K5NQRk5N4l7
$$ 1 89 9 -1 -33 -20 21 51 16 39 30 4 -50 -2 -11 -20 12 4 6 43 29 -18 11 25 -10 -43 11 -2 -22 3 8 16 25 0 54 17
6926A7J2m2N1p0J12l3J3p6K8%ko1K6L0kL3K7n5m3P0l9j9k1L1K5l7JpN2k0J5nk3
$$ 17 29 -13 38 -32 80 47 60 -16 12 12 10 -51 -25 5 3 36 63 8 -35 35 -4 -23 -44 -13 12 -25 -24 -31 21 1 16 11 -12
6959a2k1L6l3N1Ok3K7J4q0O9n8N3Jp6Q6n4J1kL3o6l4J38n7OJ4Nl5Rj4lk5j7J03
$$ -12 -33 3 -30 21 27 4 31 45 -35 34 -24 29 30 -46 40 -14 -3 -5 28 -38 -72 66 9 15 29 34 -1 8 -6 -9 -34 -51 52
6992E2q2Pqj4L8M%J0kl5M8M9q9O9L7r0K1n7M2L7l1L6n7N8j3N3m5j4j7L1o1N5j8
$$ 52 -30 -23 -31 -45 -7 -3 -3 7 5 -30 18 67 -22 47 84 -6 15 -42 0 37 6 42 -15 43 30 83 38 24 7 38 -23 32 14
7025A4nl3Q2n9Ok0kO4q3N8n6N9l5N3m3N1np1L7rK5Rk7k0oJ6l8J19p1L0j7m4M0
$$ 14 9 -24 58 -1 5 -15 -17 47 -36 22 -34 25 -10 43 0 51 46 -25 12 3 28 37 10 -10 -16 0 -38 81 10 40 23 -21 19
7058A9J5n4N0o2O4o6M4p5P3l%Kl6OPJ5nPJ3n6N7KrJ7mJ3l3rl8N2m8L8J3Rm4L9
$$ 19 34 -20 30 -32 32 -34 10 -65 8 5 5 7 -29 -23 -16 -1 -6 1 14 -42 15 17 8 25 21 34 1 -8 -46 6 -42 -4 9 18 -26 13
$$ [...]
8191b7
##END NTUPLES=NMR FID
##END=
