##TITLE=1H_IG-estear
 200.13MHz, CDCl3,
 8 sc
 
 3.2.2025
##JCAMPDX= 6.0         $$ Bruker NMR JCAMP-DX V2.0
##DATA TYPE= NMR FID
##DATA CLASS= NTUPLES
##ORIGIN= UXNMR, Bruker Analytische Messtechnik GmbH
##OWNER= pz
$$ XWIN-NMR		Version 3.5
$$ Mon Feb  3 16:36:02 2025 Russian Standard Time (UT+4h)  she@DPX200
##.OBSERVE FREQUENCY= 200.1313
##.OBSERVE NUCLEUS= ^1H
##.DELAY= (6, 6)
##.ACQUISITION MODE= SIMULTANEOUS
##.ACQUISITION SCHEME= undefined
##.AVERAGES= 8
##.DIGITISER RES= 18
##SPECTROMETER/DATA SYSTEM= spect
##.PULSE SEQUENCE= zg30
##.SOLVENT NAME= CDCl3
##.SHIFT REFERENCE= (INTERNAL, CDCl3, 0, 14.3821)
##AUDIT TRAIL= $$ (NUMBER, WHEN, WHO, WHERE, WHAT)
$$ ##TITLE= Audit trail, XWIN-NMR		Version 3.5
$$ ##JCAMPDX= 5.01
$$ ##ORIGIN= Bruker BioSpin GmbH
$$ ##OWNER= she
$$ F:/spectra/data/she/nmr/H-C/1/audita.txt
$$ ##AUDIT TRAIL=  $$ (NUMBER, WHEN, WHO, WHERE, WHAT)
(   1,<2025-02-03 16:35:02.59 +0400>,<she>,<DPX200>,
      <created by zg, POWCHK disabled, PULCHK disabled
       configuration hash MD5:
       00 E9 B6 7A A2 85 ED C7 34 08 36 98 17 FE 4E 26
       data hash MD5: 16K
       BB 12 6E 75 22 F5 3D 24 00 C0 7A 03 38 4B 38 10>)
$$ ##END=
$$ 
$$ hash MD5
$$ B1 8D 76 EA 7E 61 D7 3D 43 2D 49 C9 36 BC 4D 23
##$RELAX= 
##$RELAX= 
##$RELAX= 
##$RELAX= 
##$RELAX= 
##$RELAX= 
$$ Bruker specific parameters
$$ --------------------------
##$DU= <F:/spectra>
##$EXPNO= 1
##$NAME= <H-C>
##$PROCNO= 1
##$TYPE= <nmr>
##$USER= <she>
##$AMP= (0..31)
100 100 100 100 100 100 100 100 100 100 100 100 100 100 100 100 100 100 
100 100 100 100 100 100 100 100 100 100 100 100 100 100 
##$AQSEQ= 0
##$AQ_mod= 1
##$AUNM= <au_zg>
##$AUTOPOS= <>
##$BF1= 200.13
##$BF2= 200.13
##$BF3= 200.13
##$BF4= 200.13
##$BF5= 200.13
##$BF6= 200.13
##$BF7= 200.13
##$BF8= 200.13
##$BYTORDA= 1
##$CFDGTYP= 0
##$CFRGTYP= 5
##$CHEMSTR= <none>
##$CNST= (0..31)
1 1 145 1 1 1 1 1 1 1 1 1 1 1 1 1 1 1 1 1 1 1 1 1 1 1 1 1 1 1 1 1 
##$CPDPRG= <>
##$CPDPRG1= <>
##$CPDPRG2= <>
##$CPDPRG3= <>
##$CPDPRG4= <mlev>
##$CPDPRG5= <mlev>
##$CPDPRG6= <mlev>
##$CPDPRG7= <mlev>
##$CPDPRG8= <mlev>
##$CPDPRGB= <>
##$CPDPRGT= <>
##$D= (0..31)
0 0.7 0 0 0 0 0 0 0 0 0 0.03 0 0 0 0 0 0 0 0 0 0 0 0 0 0 0 0 0 0 0 0 
##$DATE= 1738586101
##$DBL= (0..7)
120 120 120 120 120 120 120 120 
##$DBP= (0..7)
150 150 150 150 150 150 150 150 
##$DBP07= 0
##$DBPNAM0= <>
##$DBPNAM1= <>
##$DBPNAM2= <>
##$DBPNAM3= <>
##$DBPNAM4= <>
##$DBPNAM5= <>
##$DBPNAM6= <>
##$DBPNAM7= <>
##$DBPOAL= (0..7)
0.5 0.5 0.5 0.5 0.5 0.5 0.5 0.5 
##$DBPOFFS= (0..7)
0 0 0 0 0 0 0 0 
##$DE= 6
##$DECBNUC= <off>
##$DECIM= 32
##$DECNUC= <off>
##$DECSTAT= 4
##$DIGMOD= 1
##$DIGTYP= 9
##$DL= (0..7)
0 120 120 120 120 120 120 120 
##$DP= (0..7)
150 150 150 150 150 150 150 150 
##$DP07= 0
##$DPNAME0= <>
##$DPNAME1= <>
##$DPNAME2= <>
##$DPNAME3= <>
##$DPNAME4= <>
##$DPNAME5= <>
##$DPNAME6= <>
##$DPNAME7= <>
##$DPOAL= (0..7)
0.5 0.5 0.5 0.5 0.5 0.5 0.5 0.5 
##$DPOFFS= (0..7)
0 0 0 0 0 0 0 0 
##$DQDMODE= 0
##$DR= 18
##$DS= 0
##$DSLIST= <SSSSSSSSSSSSSSS>
$$ [...]
##$SUBNAM0= <"">
##$SUBNAM1= <"">
##$SUBNAM2= <"">
##$SUBNAM3= <"">
##$SUBNAM4= <"">
##$SUBNAM5= <"">
##$SUBNAM6= <"">
##$SUBNAM7= <"">
##$SUBNAM8= <"">
##$SUBNAM9= <"">
##$SW= 18.0517328524113
##$SWIBOX= (0..15)
0 0 2 0 0 0 0 0 0 0 0 0 0 0 0 0 
##$SW_h= 3612.71676300578
##$TD= 16384
##$TD0= 1
##$TE= 0
##$TE2= 300
##$TE3= 300
##$TEG= 300
##$TL= (0..7)
0 120 120 120 120 120 120 120 
##$TP= (0..7)
150 150 150 150 150 150 150 150 
##$TP07= 0
##$TPNAME0= <>
##$TPNAME1= <>
##$TPNAME2= <>
##$TPNAME3= <>
##$TPNAME4= <>
##$TPNAME5= <>
##$TPNAME6= <>
##$TPNAME7= <>
##$TPOAL= (0..7)
0.5 0.5 0.5 0.5 0.5 0.5 0.5 0.5 
##$TPOFFS= (0..7)
0 0 0 0 0 0 0 0 
##$TUNHIN= 0
##$TUNHOUT= 0
##$TUNXOUT= 0
##$USERA1= <user>
##$USERA2= <user>
##$USERA3= <user>
##$USERA4= <user>
##$USERA5= <user>
##$V9= 5
##$VALIST= <valist>
##$VCLIST= <CCCCCCCCCCCCCCC>
##$VD= 0
##$VDLIST= <DDDDDDDDDDDDDDD>
##$VPLIST= <PPPPPPPPPPPPPPP>
##$VTLIST= <TTTTTTTTTTTTTTT>
##$WBST= 1024
##$WBSW= 4
##$XGAIN= (0..3)
0 0 0 0 
##$XL= 0
##$YL= 0
##$YMAX_a= 240031
##$YMIN_a= -204844
##$ZGOPTNS= <>
##$ZL1= 120
##$ZL2= 120
##$ZL3= 120
##$ZL4= 120
##$ABSF1= 10
##$ABSF2= 0
##$ABSG= 5
##$ABSL= 3
##$ALPHA= 0
##$AQORDER= 0
##$ASSFAC= 0
##$ASSFACI= 0
##$ASSFACX= 0
##$ASSWID= 0
##$AUNMP= <proc_1d>
##$AZFE= 0.1
##$AZFW= 0.1
##$BCFW= 1
##$BC_mod= 2
##$BYTORDP= 1
##$COROFFS= 0
##$CY= -3
##$DATMOD= 1
##$DC= 2
##$DFILT= <>
##$DTYPP= 0
##$F1P= 0
##$F2P= 0
##$FCOR= 0.5
##$FTSIZE= 0
##$FT_mod= 4
##$GAMMA= 1
##$GB= 0.15
##$INTBC= 1
##$INTSCL= 1
##$ISEN= 128
##$LB= 0.25
##$LEV0= 0
##$LPBIN= 0
##$MAXI= 10000
##$MC2= 0
##$MEAN= 0
##$ME_mod= 0
##$MI= 1.114404
##$NCOEF= 0
##$NC_proc= 0
##$NLEV= 6
##$NOISF1= 3.799351
##$NOISF2= 2.8
##$NSP= 1
##$NTH_PI= 0
##$NZP= 0
##$OFFSET= 14.38212
##$PC= 1
##$PHC0= 170.0758
##$PHC1= 15.19222
##$PH_mod= 1
##$PKNL= yes
##$PPARMOD= 0
##$PSCAL= 0
##$PSIGN= 0
##$REVERSE= no
##$SF= 200.129724274929
##$SI= 16384
##$SIGF1= 3
##$SIGF2= 2
##$SINO= 400
##$SIOLD= 16384
##$SREGLST= <1H.CDCl3>
##$SSB= 0
##$STSI= 0
##$STSR= 0
##$SW_p= 3205.1282051282
##$SYMM= 0
##$S_DEV= 0
##$TDeff= 0
##$TDoff= 0
##$TI= <>
##$TILT= no
##$TM1= 0
##$TM2= 0
##$TOPLEV= 0
##$USERP1= <user>
##$USERP2= <user>
##$USERP3= <user>
##$USERP4= <user>
##$USERP5= <user>
##$WDW= 1
##$XDIM= 8192
##$YMAX_p= 0
##$YMIN_p= 0
$$ End of Bruker specific parameters
$$ ---------------------------------
##NTUPLES= NMR FID
##VAR_NAME=  TIME,          FID/REAL,        FID/IMAG
##SYMBOL=    X,             R,               I
##VAR_TYPE=  INDEPENDENT,   DEPENDENT,       DEPENDENT
##VAR_FORM=  AFFN,          ASDF,            ASDF
##VAR_DIM=   8192,          8192,            8192
##UNITS=     SECONDS,       ARBITRARY UNITS, ARBITRARY UNITS
##FACTOR=    0.0002768,     1,               1
##FIRST=     0,             0,               0
##LAST=      2.2672688,     0,               0
##MIN=       0,             -204844,         0
##MAX=       2.2672688,     240031,          0
$$ Real data points
##PAGE= N=1
##DATA TABLE= (X++(R..R)), XYDATA
0@%%%%%%%%%%%qJ6j6J6j6K4l2M0m8N6p2Q8j04J20j36J60j92K24k56K88l28L76
33B00m24M80n44O08o80P60q48R46j052J168j295J434j584J748j929K127k342K579
51A352k841L131l453L813m219M678n202N807o516P361q388R667j1304J3491j6582
66i205K1292k9415M7124j48847J16287K40223l77443L9184K89292k01401j89857
77b02766L20642N463k72766J36504J60932k53256R64K67137j15167k11556J93451
88B9582Q3755k11250M2627J97878j43284j33148J80097L3658j70615R2227J15905
99A17432j92038l3852K30509p5380j81911J84392O9493k56681O7838K45152j80076
110e122j39247K36042k8275k17931J84151J28693k62212J1223K35589j57344j29047
$$ y = [0, 0, 0, 0, 0, 0, 0, 0, 0, 0, 0, 0, -8, 8, -8, 8, -8, 16, -16, 24, -24, 32, -40, 48, -56, 64, -72, 88, -104, 120, -136, 152, -176, 200, -224, 256, -288, 320, -360, 400, -448, 498, -554, 614, -681, 753, -831, 917, -1012, 1115, -1227, 1352, -1489, 1642, -1811, 2002, -2217, 2461, -2741, 3066, -3450, 3911, -4477, 5190, -6114, 7377, -9205, 12087, -17328, 29796, -119051, -2764, 237459, -139984, -100800, 188492, -12909, -202766, 117876, 123339, -149427, -12923, 148009, -105247, -104283, 162854, 47687, -163869, 29582, 113337, -97913, -55286, 142592, -692, -133840, 46257, 79915, -90700, 1527, 117432, -74606, -108458, 122051, 46671, -135240, 49152, 118645, -138036, -70198, 174954, -5122, -144369, 91673, 63398, -154533, 29618, 158311, -103901, -92678, 142911, -14433, -143480]
121a43480K55783n599k64885J19777J82164j87092m7996K00055p7613j61283J50100
132A9931Q0184j60448K2926J27930j16733p5548J70091J3332j67924N6642J18085
143H8468j24802m3512J66554l2799j54527R6097Q2067j35450K5877J37752j24281
154a8556r1117J73212j147j58800J09236R3933j85350n072J90657q0631j20965
165i4600J40574J0850j56584Q8841J19163j41734l6643J41239o1109j03282J34371
176D1086M7513j55018J3452J22663p0927o1200J12244q95j21378M8117Q9613p9841
188a4571k5923R7919m4995r5747R6943O2551j15755J616J02329p5690o4978J25370
200D9069J1738j24926M8220P4473r9162P41J19310o7835r2676J05123K4426j08019
$$ y = [-143480, 112303, 106704, -158181, -38404, 143760, -43332, -91328, 108727, 31114, -130169, 19931, 100115, -60333, -37407, 90523, -26210, -101758, 68333, 81665, -86259, -29617, 88468, -36334, -79846, 86708, 53909, -100618, -4521, 77546, -57904, -32027, 105725, -18556, -109673, 63539, 62392, -96408, 12828, 106761, -78589, -83661, 106996, 26365, -94600, 45974, 56824, -99760, -10919, 108244, -33490, -70133, 71106, 9997, -93285, 41086, 88599, -66419, -52967, 69696, -1231, -62431, 49813, 48918, -72460, -24343, 65270, -14571, -40494, 57425, 12430, -83317, 13626, 76177, -39578, -37962, 64367, -11323, -76301, 49069, 60807, -64119, -15899, 58574, -40588, -39847, 79463, 11628, -81048, 24075, 48501, -59518]
212e9518N6405Q2321j12026l6126J19270k1084q2325P4158K5750j03318K5407
223c1086R4035n9562m8799P7137j1647q0031O0636O4769q2232k7939P7697k3374
235I604n7766P0050L0310r0713L754P6295m3167l5837P7568j1621q9028M9808
247a0743O5016p1709j1519P6209m7270o2054Q3826K7843q4554K0968N5852o7442
259b5577j5109Q9593k2791p4632N1241K9656o7828K2270O8025n7678m6732O6927
271A7365O190n5860L9208L5309o9064j1059P0171j6574m5264M5157R686o4656
283c9391K1087O2503m0647l4722N0388p845n1682M5391M0829o2144j3973N5526
295B5320k4188l4135N8060Q136o9626J7372N1681m0294j3848N5923k4447n5525
$$ y = [-59518, -3113, 79208, -32818, -68944, 50326, 29242, -53083, 21075, 46825, -56493, -31086, 62949, 3387, -45412, 31725, 20078, -59953, 683, 65452, -16780, -44719, 32978, 9604, -48162, 21888, 52198, -38515, -34761, 41534, -1633, -37470, 40098, 28477, -60551, -10743, 54273, -17436, -28955, 47254, -16, -62070, 21756, 49599, -34955, -13987, 41865, -25577, -40686, 48907, 26116, -48516, 2725, 32381, -35447, -13177, 54848, -2830, -49562, 17365, 23555, -32305, 6903, 42212, -26852, -37911, 32260, 15686, -29578, 15579, 25265, -39391, -18304, 44199, 3552, -31170, 19218, 11373, -40309, 5082, 45911, -16233, -30206, 25320, 1132, -33003, 25057, 33193, -36433, -19061, 32620, -7674, -21522, 34401, 9954, -45571]
307d5571M7596L3128n1852N633M2777m3559k6381O1997M386n3635K1928K6710
319B3157m6010L044N6273k4466m4188L5899J3249m0441K1653L8312m4081k5469
331c3068M6945L30l5038K9743J7830n0594o54N0568j6660k9818L3907J16m5220
344c1613K4421M1474l6572j8953L7580j4215l1511M1773J9333n0188K21L7801
356A9551k4509j4454M4031p808m7116K2806K9340l1044J085L3949k8310k9270
368c1749M0188J3624l5568J0922K2251l4309q207M4171m550l5016J7670J2849
380A2276l0210R929L5712k4169k7052K8689M561k7532K1770K3037l8569j2956
392b4514L8460m610k4581K5398O268l8932R170L5602k0025j5271K7242j1422k9544
$$ y = [-45571, 2025, 35153, -16699, -11066, 31711, -11848, -38229, 23768, 28154, -25481, -3553, 23157, -22853, -19809, 36464, 11998, -32190, 3709, 16958, -23483, -1830, 36482, -7599, -33068, 13877, 14207, -20831, 8912, 26742, -23852, -24506, 26062, 9402, -20416, 13491, 13607, -31613, -7192, 34282, -2290, -21243, 16337, 2122, -29389, 12384, 31717, -18471, -18250, 19551, -4958, -19412, 24619, 16811, -30305, -7499, 21841, -9203, -8118, 25831, -2479, -31749, 8439, 22063, -13505, -2583, 19668, -14641, -22848, 21323, 16773, -18243, -573, 12276, -17934, -8005, 27707, 3538, -23514, 5175, 9736, -17796, 3974, 27011, -11558, -24514, 13946, 9336, -15245, 10153, 16421, -22511, -13341, 22261, 2236, -13035, 14207, 2785, -26759]
405b6759L0653K2714l5086m979K7359j7960j5206L4618L690l5446P229K0524j8505
418g154N84K7371j6920k7395K3782J4740k3947O375K1855k5386j7729L2758Q098
431A7032k6663Q043J3002k4880Q42L2415j1700k4185K0265L701k6730J7988K7465
444B6595l0241j7912K9694j261k0692K1629R387l1807J542K5719j2316p737K2100
457A4700j1102k6594K1921K0878k3337n169K0067j3108j6316K4258J1209k3263
469e856j622J3138j2064j362K3802p415k5656J3806J4938k0232K767K5846j8050
482B040k5212K4362J3927k1703N435J4173k3159m822K8895o096j9647J8128J931
495H252k7684J3845K8723k1194j8013K0659k38j6529J6231J1322k1496l915J5046
$$ y = [-26759, 3894, 26608, -8478, -13457, 13902, -4058, -19264, 15354, 19044, -16402, -9173, 11351, -7154, -6570, 20801, 3881, -23514, 268, 15008, -8939, -2564, 19291, -6095, -23824, 8934, 17032, -9631, -1588, 11414, -13466, -12624, 19791, 8091, -16094, 4171, 7872, -18858, -870, 26595, -3646, -21558, 8136, 6875, -13817, 7812, 17199, -14608, -13066, 12653, 337, -7400, 14700, 3598, -22996, -1075, 19803, -3534, -8703, 11364, -1744, -18060, 6198, 17407, -5856, -7478, 5660, -6404, -7766, 16036, 8621, -17035, -3229, 11709, -8523, -5756, 20090, 2040, -23172, 1190, 15117, -6586, -1151, 13022, -10137, -14959, 13936, 7840, -11807, 6321, 8252, -19432, -5587, 23136, 1942, -16071, 4588, 4350, -12179, 4052, 15374, -6122, -10037, 5009]
508E009o724l498J8004n585k3916R896J9955j2432p997J6405n155k0147J3012
521c173J8031j4015o757J1184r972p228K3188J507k5278Q045J5880k0369j466
534a0423K9378j0465k7771J6372J3787j7039N737J4246k0089p817K2235k854j3678
547h381J5641K053k4870N970K4935r266j5218J0791J613j2709Q153J3060j0396
560A376q159P612k580m770J4508L687k1124j392J9124n529j0941J5849J805k2932
574a3466N035J9903r461o386J2308j0559j2334K1658O509k2058N704J4115j9515
587h547l995K6961l900k2724Q884Q991j1883N859J2608j3938q815J3302j64q352
601e713J1130M510j8533k975J8361Q61j1919M593M159j1693Q41J5114l266j0603
$$ y = [5009, -1715, -5213, 12791, 7206, -16710, -6814, 13141, 709, -7288, 9117, 3962, -16185, -3173, 14858, 843, -5914, 5270, -4702, -11930, 11258, 12765, -12513, -4468, 11412, -8957, -10423, 18955, 8490, -19281, -2909, 10878, -6161, -424, 13822, -6267, -14084, 8151, 5297, -8381, 7260, 9313, -15557, -9587, 15348, 6082, -9136, 1655, 3268, -9441, -1288, 11772, 1376, -6783, 829, -1751, -6521, 7987, 11674, -9450, -10842, 8282, 2753, -8188, 7661, 9466, -13466, -8431, 11472, 2011, -4375, 7933, -2626, -14960, 6698, 13207, -8851, -3147, 10968, -8547, -12542, 14419, 10519, -12205, -3321, 5670, -6213, -354, 12254, -1684, -10499, 2803, 2639, -5713, 5417, 9927, -8606, -11581, 6780, 7641, -4278, 315, 4474, -7219, -6378, 8736, 5470, -5133]
615e133N875m57r703J1992J1758j8072p451J7013l729j1619J6291N159k2054J243
629h887J6603p790l225J3277r960j4278J6387P977j5228L969J0470j5342n892
642a1919J9479K055j4550K548M968q078K753J1754n522j0231N425L175o363N651
656A145R238j1417j0660J2239O482r887L049P215j2657m618J5943K63j0785O877
670B427P13j3943Q248J5652j2625q826J2682l621j0570J4353P113j7027j519J1067
684D124n914j666J2390n286j3679P652Q068p567J398P812q985q378J0841O701
698G511p891j143M226o432k601J1462K070j0836O72N380o641J093J2613n445j3348
713i310P393O650q466M004R110j2234p403J3557J456q635P344J763j4134L325
$$ y = [-5133, 742, 285, -9418, 2574, 14332, -3740, -11191, 5822, 2093, -9526, 6765, 11924, -10130, -8887, 7716, -74, -3299, 9978, 18, -14260, 2127, 10104, -5124, -1155, 9315, -6027, -11919, 7560, 9615, -4935, -2387, 2581, -5497, -2744, 9010, 3488, -6743, -1318, 1857, -4506, 1145, 10383, -1034, -11694, 545, 7027, -2860, 189, 7404, -5253, -9871, 6072, 6335, -4450, 2427, 3140, -10803, -2555, 13097, 472, -8354, 4328, 707, -9863, 4490, 11603, -5424, -6943, 4124, -1790, -3456, 8934, 3648, -10031, -2379, 5689, -1878, -480, 7332, -1653, -10031, 810, 7511, -380, -1523, 2703, -3729, -6330, 5132, 7202, -3634, -2962, 2418, -4223, -3130, 9483, 4038, -9310, -1917, 4733, -3733, 271, 9381, -2853, -10256, 3301, 4757, -3878, 3466, 5229, -8905, -5580]
727e580J4118o074o700P819l358r020R893Q110j0154l442O293l889k535R933R92
742F406j1004j74O819k479p76O919l194r977M100Q367m104j931N398n613p199
757h442R736O452r075j013N520p102j879J2618q19j1507L720M309p313M150R764
772I119q895q214Q690J806n854O371L214j1194j440R863r65l980M761j975q182
787f875M557Q317m139m079L559k349m446O923N604p389m120M827r32k169O960
802D249R74r761j26P303k457j345O537m084r170O300P186n849n41M789o873l889
818f757J0144K234p804J602K233o474K456R161m112p211L948J196m019M939M699
833F235p382m322N644J254k333L730L64p393k45P148q4l293K470j353n880L835
$$ y = [-5580, 8538, 2464, -4236, 3583, 225, -8795, 1098, 9208, -946, -4388, 1905, -1984, -4519, 5414, 6406, -4598, -4772, 2047, -432, -1208, 5711, 2517, -7460, -3360, 5007, 903, -1028, 4370, -1243, -8442, 1294, 7746, -1329, -2342, 3178, -3924, -5803, 6815, 5996, -5511, -1791, 2518, -4795, -645, 9119, 224, -7990, 700, 2506, -3348, 3023, 6237, -4957, -6397, 3466, 2501, -1479, 3282, 1307, -6875, -2318, 5999, 1860, -2219, 1340, -1009, -5455, 1468, 7072, -317, -4437, 390, -542, -2711, 4249, 5223, -4538, -4664, 2639, 182, -1163, 5374, 1290, -7880, -1580, 5606, -243, -784, 4005, -2868, -6757, 3387, 5621, -2183, -581, 1652, -4822, -2366, 6795, 2683, -4528, -580, 616, -3403, 1536, 6235, -1147, -5469, 175, 1429, -904, 2826, 3190, -4203, -4448, 2700, 2616, -677, 1793, 440, -5440, -1605]
849a605P265l824m543L323j381l644O552M108p805k553N088j859j035O837j667
864C257q609K645N483l422P42M759n838n498O863L727m514Q36J595n624k08P285
880C479m4m749J097L3l578L446N704l874n238K686J549k193L154L064n637l689
896d790M735J858j933K433l68o396J209O853j675l286L291j892n477N138O047
911E747n056l282L070k015j218O236L59o485O02K892k839J739N414m117o190L651
927a492L799k220O57J790m134k329M367K117j937K98p14l899J588O009j067m989
943b156J221J472l091J967N250l129n260K321J877j201L151Q29o300n36N602j133
959H84k056M288j504o788K835O310k293k485J579k343j555M816J469l721Q2P33
$$ y = [-1605, 5660, 1836, -2707, 616, -765, -4409, 2143, 6251, -1554, -4107, 981, -878, -1913, 4924, 3257, -5352, -2707, 2776, -646, 96, 4855, -983, -6481, 382, 4109, -405, 431, 2026, -3598, -3806, 3479, 3435, -1314, -217, -184, -3762, -316, 5388, 1514, -3724, -1038, 511, -1682, 1472, 4536, -1101, -4790, -55, 1803, -130, 2303, 1935, -4461, -3252, 3601, 1926, -1360, 1931, 39, -5438, -300, 5747, 691, -2591, 479, -1536, -2754, 3482, 3841, -2644, -2042, 850, -1989, -250, 5164, 1047, -5143, -1492, 2307, 87, 744, 2534, -1600, -3929, 438, 2555, 618, 916, 202, -3697, -2109, 3900, 2833, -2156, -935, 537, -2554, -587, 4663, 1534, -3726, -1405, 472, -729, 2422, 3251, -3049, -3585, 2017, 884, -1172, 3116, 1612, -5176, -2341, 3969, 1676, -809, 770, -1573, -3128, 1688, 3157, -564, -482, 251]
975B51l125J428N668j418n751N40L139p19J98K314j869l655J333K712j76P01N5
992A626m379r48N833J116m436R14J722m285K50O255p39m823P89M96j431L894K073
1009C927n436j377L938j458j296M883k16o392J92M695K0r39P47k134j937K643
1025a40J922j190J07J2l120m24M896J672m369j744K354k90o66L049L06m111m47
1042b183K223k63J473J984m399l129M914K004l585J435J941m848j057N534N72
1057B616k910N03j128k064L736K745l664j352K099j676j035M232J296m430j833
1072b865K340J178J05P36j030k370L70K148K09l9P21k346k701L374L738k844k317
1089a593J927r68j582L688J549l794o67J290j476J815L671l495l941L299J555
$$ y = [251, -2874, -1446, 4222, 2804, -2947, -2407, 732, 13, 211, 2525, 656, -2999, -1666, 1046, 870, 1571, 1626, -2753, -3701, 2132, 3248, -1188, -274, 1448, -2837, -2587, 3668, 2929, -1894, -1105, -609, -2040, 1854, 3927, -1509, -2886, 1052, -406, -1702, 3181, 2965, -3427, -3235, 1460, 1480, 541, 1288, -846, -2783, -140, 1782, 592, 699, 711, -2409, -2833, 2063, 3735, -634, -2378, -24, -314, -980, 2069, 2375, -1736, -2183, 40, -223, 1250, 3234, -1165, -4294, 620, 2624, -961, 474, 2415, -2433, -3490, 2044, 2616, -294, 209, -919, -2983, 753, 3498, -166, -1518, 581, -1095, -2130, 2102, 3398, -1032, -2865, -525, 653, 758, 1494, 464, -1906, -1536, 612, 821, 782, 1503, -843, -3544, -170, 3568, 724, -1593, 334, -634, -2216, 1472, 3021, -773, -1440, -150, -1626, 189, 3860, 365, -3576, -277, 1278]
1104A278k388K073J861m273j723L579R85q14P14j634k456K158K763j223j127N80
1120C53j254j307K532K631k006k854O82J193j20J357P33k857j302K270M09l96
1136F4K034j279m166J805M045j684j381J787k010k146L687J866k777j46L99k394
1152b296J434L971j765l213J319N07j219K093J752k732k023J395J048K94Q80o94
1168G51k378k06K337Q58r47rm28j982P72L383l40k770K86M05j212K000K258k810
1186c2j989J942j49n44K902l03m157N14K885q93K2J738k368k362K673J770j365
1203B84K70l0k421L25L076J72j806k45k43p19J363J958r25k190p0R49J77Q75R33
1222A733j916k056J653J708p86L29L04k583m19L258L38j865O54m46k186J990K876
$$ y = [1278, -1110, 963, 2824, -1449, -3172, 407, 1392, 578, 1292, -342, -2798, -640, 2123, 900, -227, 353, -901, -2208, 324, 2955, 949, -1905, -1223, -30, -150, 1207, 1940, -917, -2219, 51, 460, 64, 2098, 819, -3347, -1542, 2503, 819, -562, 1225, -785, -2931, 756, 2622, -155, -301, 98, -2296, -862, 3109, 1344, -1869, -550, -43, -1262, 831, 2583, -149, -2172, -777, 271, 565, 1445, 751, -1627, -1833, 504, 1362, 415, 406, -22, -2004, -1232, 2151, 1811, -959, -673, -268, -1480, 520, 2778, -32, -2021, -79, -228, -772, 2130, 1827, -2330, -1816, 1069, 176, 198, 1936, -432, -2794, -121, 1649, 284, 554, 524, -1897, -1572, 1504, 1676, -130, -375, -618, -1337, 26, 1984, 1059, -1131, -1201, -252, -75, 800, 1733, -183, -2239, -586, 1122, 336, 665, 969, -1614, -2033, 1225, 1563, -302, 352, -94, -2280, -290, 2586]
1239B586k014j725J168p90n38K872N08l020l77J268m89Q41J754j682k341J080
1255h99J459j72L94J51j797r74J745J502o10p75l13r23K05K178N40k022o13O66
1273b58n81P26K185j167k718Q57J371o32R89R10k607j147K379N41q04J066p32
1290C78k515J158K591p65r86M66j130p81K169J195j539q73J27m12O87J732l37
1307A165j987l91R49L62M18P37r99j890N79J890j1m89J64j236r70J962J399j390
1325B62n51K85j254L82K571l44k285K75N32p37J326J480j966j547J204M48o2J227
1343A246l85k212P1J711J83j76L08j094j246J136J674l02r48l09m35n4J390R15
1361A473j217j150L15J67L22J367j82k185k34J572N8o6R09j085j833J172J639
$$ y = [2586, 572, -1153, 15, -775, -1313, 1559, 2067, -953, -1330, -62, -551, 290, 2044, 362, -1979, -899, 560, 388, 782, 933, -864, -1838, -93, 1409, 799, 24, -289, -1212, -1007, 1171, 1711, -311, -924, -258, -839, -113, 2072, 905, -1813, -956, 415, -217, 772, 1682, -925, -2072, 307, 848, 44, 1110, 378, -2137, -979, 1612, 847, -139, 327, -803, -1584, 585, 1780, 241, -632, -505, -917, -230, 1502, 1165, -822, -1213, -264, 98, 516, 1253, 254, -1636, -1057, 833, 822, 333, 497, -739, -1709, 253, 1652, 262, -289, -4, -1258, -876, 1695, 1351, -934, -659, -127, -864, 462, 1942, -24, -1571, -367, 81, 19, 1246, 861, -1351, -1280, 431, 614, 438, 746, -348, -1594, -458, 1216, 914, -34, -343, -778, -832, 558, 1473, 256, -894, -579, -412, -90, 1277, 1095, -1090, -1324, 248, 306, 240, 1149, 64, -1769, -597, 1042]
1378A042n46j44O4j616j25K272K98j391J11j53j101J063J876q53j564R9J98K27
1396b43J145K13j470p15O56M49L55O49o17j630J6J674N51p55k20l30q37O82J571
1415A144k82j104j30l88l5J736N68j953o04J045k70N8J509m73k022J90J201J07
1433B97M22R2j595n43J519N18n28L29l42j415L26J799L04j100o40r4J56P91O87
1452I83n40r56j28J97L59R82K36j672r29J350Q67n12J55k7j321l7J531K84n14
1471C08p9r56n69J714J016j413n56N85o58o8J640K07j541n19M14L25Q52L07j235
1490b26p56O79M39J7N27o9j307n59J246J097m79q19k23j60K60R51J98q20l88j38
1510e30j72J096J087j297j432Q38P02l67O11L14j400n17J014L96J69K96j168j039
$$ y = [1042, 496, 352, 416, -1200, -1325, 947, 1245, -146, -35, -188, -1289, -226, 1650, 797, -767, -668, -470, -243, 902, 1115, -355, -1070, -414, 35, 390, 1039, 422, -1208, -1192, 482, 1033, 278, 58, -272, -1109, -427, 1144, 862, -242, -372, -760, -795, 941, 1509, -444, -1048, -3, -273, -215, 1294, 821, -1201, -1011, 190, 297, 719, 811, -784, -1327, 192, 710, 182, 511, 169, -1246, -920, 879, 1183, 83, -557, -651, -495, 296, 983, 443, -513, -641, -444, -85, 897, 1133, -539, -1468, -118, 749, 237, 392, 365, -956, -993, 538, 822, 308, 229, -727, -1296, 418, 1434, 21, -535, 50, -608, -676, 964, 1171, -370, -889, -475, -150, 702, 1009, -226, -982, -303, 136, 153, 680, 611, -696, -1255, -9, 1088, 609, -210, -433, -593, -333, 618, 816, -4, -392, -530, -702, 394, 1481, 184, -1248, -410, 292, -75, 536, 850, -550, -1067, -53, 343, 512, 808, -360, -1399]
1528a399J241J116o73k71K14q26l31J261P46o92p89l26K15Q36N59n11q18j03L09
1547b42K02M97M45q47j241N11J349qn20q7n71l05J042N74n51j62l44q17Q62J534
1567A321p24j278L39J59k60R09N23j079o39L33J80N90O38q77j140M70Q25L1M8
1586C69J7p16n58N91R83P8p16n49r4L42P46K87p33n69J85K5L03R40k88j468l2
1607h57J035R6O1K68q71p12Q61N86k22K43l65j164M07J385j10o74jl72k93Q68
1627A69O63m96n75k26p8N78P37k07q84l57L84M49K31J17l69q27l9R66M69m23k84
1648bl71l75P33Q77n02o02Q6l63O8J180J38j194k55M05q1N21O37q25q50M38L59
1669B2J01N27k27j070o7Q03L20qj11n66m31M82P04R8m50m52j79J83N75M84m52
$$ y = [-1399, -158, 958, 285, 14, 228, -598, -929, 332, 1078, 386, -403, -729, -514, 322, 881, 370, -448, -551, -242, -40, 457, 902, 55, -1186, -675, 674, 666, 146, 59, -512, -817, 225, 799, 248, 86, -258, -1075, -213, 1321, 597, -681, -342, -183, -443, 466, 989, -90, -729, -396, -216, 374, 1012, 135, -1005, -535, 290, 321, 369, 386, -330, -888, -297, 686, 764, 48, -501, -595, -253, 493, 780, 47, -522, -337, -312, -9, 931, 643, -825, -857, 178, 274, 335, 603, -268, -980, -119, 467, 245, 488, 123, -1041, -634, 751, 641, -33, -34, -406, -699, 169, 832, 336, -239, -465, -543, 35, 772, 565, -319, -676, -292, 157, 388, 505, 136, -691, -730, 236, 705, 282, -2, -373, -748, -15, 862, 360, -242, -156, -519, -451, 729, 867, -327, -582, -177, -258, 263, 900, 75, -775, -337, 22, 123, 650, 423, -647, -714, 89, 409, 401, 290, -276, -707, -225, 479, 577, 127, -325, -504, -321, 254, 738, 286]
1690B86q13KM41J87M17N2r58m29P69L76q8K40m68r20N03R86j84k81Ro72j41J052
1712C66L68o38k00j64l52O13Q16m10p28o2Q0K37N76N9o49m91J68M93L51Nl88n58
1734e08q4O85M90k88l22j95l37K95R17m1q33j60J01j4O58M25q47n39M02J11J38
1755E4O52l41j042J24O92Q3J35L0p26l62O31M63m9q1l93n03K98P51J45m35m03
1776b77j44J52M04M21j87o89k58M01L52K10N5n92n60M77O01r7k4j12p12rR53K27
1798E92n25r9k51k95O46O55m91m54J3j83K17P66k8q10k25K48J66L65K11m99n30
1819e11R7M50L14N3l11m80j33M82N15j06l98k08j53J05O72K53o71m26K04R8L04
1840A50M72m09p47J48M11N9L33J7q43k53P06K92j19N6l65n26L54O58mk50k29l81
$$ y = [286, -527, -525, -84, 103, 520, 572, -386, -815, -46, 330, 242, 482, 14, -906, -403, 583, 399, 118, 127, -545, -686, 366, 734, 96, -104, -268, -620, -7, 809, 399, -329, -391, -311, -74, 502, 561, -88, -579, -411, 82, 433, 438, 50, -508, -592, 93, 583, 295, -27, -222, -559, -264, 653, 612, -221, -381, -280, -294, 364, 789, -58, -597, -195, -84, 54, 706, 365, -677, -553, 139, 222, 357, 387, -339, -701, -70, 393, 344, 263, -130, -633, -335, 416, 561, 126, -277, -421, -269, 135, 556, 369, -320, -578, -177, 175, 385, 440, -152, -712, -235, 366, 269, 245, 133, -579, -588, 365, 592, 67, -32, -283, -578, 68, 723, 232, -222, -209, -392, -175, 591, 563, -247, -472, -224, -58, 307, 518, 19, -511, -414, 36, 350, 403, 92, -388, -521, -39, 476, 370, -28, -236, -389, -284, 388, 641, -30, -456, -252, -154, 150, 622, 213, -534, -386, 25, 84, 417, 434, -409, -662, 44, 336, 217, 273, -92, -618, -264, 394, 390, 140, -89, -470]
1862d70Q9O69K42l85l53j29O2L24M13n6n97l54L12M28J47l6l31m73J29N97J40
1883C68j55j30m40k26P06N12m61l57J5j89K00O71p0o25j26L9R7N43K19p02m13
1904e24L34K23J22K47k03n98p7M57L67M0k81m37j04L63M25Jl12k24j37O0M79L80
1926F01m35o16J05L41J29K34p6n74j64M06J99J40J07n56n08N28N64j68j78o9l76
1947c66pN87K23k68k49k80m3N73L74l66m30NO7J47L39Q9m12m30R7M90K52j22l12
1970d2l11K2M30K29j32j29k50k96L56O76j75n92o0Q2O4M00J63m64k73R4O3L11
1992A66L75m18o29J79M38O8M9k6m02k16K98L64J05j53m14k32L21M57K0k99k18
2013a67o6L7K48L54r9n58k00L46K94J06n7m00k53L00K82J6R0k01n51R8O81J00
$$ y = [-470, -381, 288, 530, 145, -208, -337, -275, 49, 462, 406, -191, -545, -233, 195, 342, 306, -25, -498, -369, 228, 368, 213, 83, -357, -583, 123, 635, 174, -183, -168, -357, -157, 514, 444, -181, -307, -268, -171, 372, 591, -111, -524, -190, 33, 155, 402, 199, -399, -476, -19, 348, 388, 107, -330, -434, -71, 354, 355, 43, -181, -318, -258, 221, 601, 166, -450, -345, -4, 125, 359, 283, -291, -455, -49, 150, 290, 397, -159, -667, -139, 425, 257, 79, 10, -366, -373, 214, 437, 169, -80, -360, -403, 170, 544, 178, -252, -247, -180, -33, 306, 395, -17, -447, -350, 140, 392, 270, -42, -353, -331, 99, 328, 196, 67, -183, -479, -123, 553, 378, -214, -274, -192, -128, 272, 435, -29, -302, -208, -145, 166, 541, 123, -506, -327, 111, 179, 228, 202, -200, -416, -118, 246, 351, 198, -216, -448, -127, 330, 350, 51, -167, -233, -196, 52, 406, 307, -251, -451, -105, 189, 295, 238, -162, -415, -115, 167, 183, 273, 72, -479, -381, 300, 400]
2035D00l35j27j72q5M10L09k32k27j39j43K87N21j46n18j27J82J59K06P6k63l28
2056b92j4L07L11Lk97l16l3L49L12j09k46j16j33P0M81J61m45l13J07J15K70K25
2078C97l35l84J16J76Q1K88p2n68j19M29K19k0m8k95k42K71L19L8j04k16k79J29
2100b19M20J48k36k86q7J15K31J79k2l59k42J84K95J23j6k65l34J59L96M8j15
2121A17p8k76j16M60K63k36j96j02j35K77M05j55l44n9mQ3L53Q7l98k33R8J87
2143bJ98J04k67k97J6K44K14K7j76k53r7K04L36J9k61j95k2P4K94J73k68l15N9
2166a91J24J46K46j28m46m3L01J22O9J9l60k31L06K50kl1j86k95J41L97N4j74
2188H8j60j59L7L01J78j29k52j50P1K29K12o3k74k17J12K75R0k8j38k61l6L53
$$ y = [400, 65, -62, -234, -319, 91, 400, 168, -59, -198, -341, -54, 467, 321, -197, -324, -142, 17, 223, 299, 36, -292, -306, 1, 312, 315, 18, -298, -331, 18, 330, 221, -25, -141, -274, -204, 277, 438, -7, -320, -213, -98, 172, 397, 62, -322, -206, -30, 51, 339, 267, -301, -420, 9, 228, 208, 160, -135, -377, -106, 213, 251, 147, -69, -348, -219, 201, 349, 113, -173, -260, -145, 86, 265, 243, -116, -358, -174, 121, 244, 228, -37, -371, -212, 184, 232, 117, 39, -237, -353, 107, 370, 134, -62, -164, -299, -22, 383, 228, -116, -175, -179, -96, 257, 344, -54, -287, -189, -2, 196, 300, 33, -264, -248, -4, 210, 237, 61, -192, -289, -85, 251, 270, 9, -186, -208, -134, 160, 333, 65, -250, -191, -67, 79, 325, 197, -249, -292, 9, 131, 200, 219, -141, -372, -66, 184, 182, 151, -35, -330, -189, 208, 262, 88, -72, -231, -194, 107, 285, 156, -96, -246, -175, 54, 266, 203, -71, -288, -176, 99, 189, 161, 23, -238, -274, 79]
2210G9K03j34j47j65r3K65L21j58k46l5r3R7L68M3l76j52P8R2K26J30k89k54P4
2233a66J52J38J27j46l21n5K57K17Oj67j91o8J24K46J04j82k29n7J04K24J63j65
2255A15l16j1J89Q9J26L4l48j88K49J95M2j1k09k70J86K96pp2p9k36j5L50J67
2278B76j65j91r6LK25J88r3k03j40M5J57J97jk33k02N3K43J33p2j06j64p9K16
2301iK57q6j84j21o7J37L16l1k74q5J7K1K35J70k83k45P7J13J33J35j51k86J2
2324a99J79J20P6m4k74j23K08K24J2j23j69r1J04K03J09j17k35o7J14J71J38q1
2346A35k68r0J74J26O2L4k13k31J36K78J6n3j21k10M8K80R5j23r0j37q2K63K35
2369B64j38k17n3J0J29J95k3j91j40J1J45J83J3j88k02L4J91J43l6j15j19q7J32
$$ y = [79, 282, 148, 1, -164, -257, 8, 329, 171, -75, -110, -203, -106, 262, 305, -71, -223, -145, -53, 173, 303, 14, -240, -166, -14, 124, 251, 105, -216, -271, -14, 203, 209, 42, -149, -217, -93, 153, 257, 75, -154, -211, -107, 117, 280, 115, -201, -212, -23, 66, 192, 226, -122, -310, -61, 134, 176, 165, -44, -314, -128, 168, 161, 89, 10, -226, -241, 109, 276, 111, -80, -176, -173, 52, 240, 147, -56, -196, -151, 6, 203, 202, -31, -233, -180, 63, 196, 124, 18, -146, -225, -9, 248, 162, -22, -143, -210, -73, 243, 212, -62, -147, -130, -109, 126, 296, 13, -232, -155, -42, 91, 226, 75, -211, -199, -20, 100, 176, 132, -142, -265, -57, 167, 179, 56, -113, -204, -100, 103, 212, 95, -140, -207, -93, 78, 216, 135, -133, -223, -49, 77, 139, 173, -40, -271, -135, 143, 159, 106, -15, -225, -177, 103, 198, 75, -15, -152, -234, 29, 264, 126, -91, -144, -134, -5, 190, 167, -24, -164, -153, -8, 175, 188, 0, -202, -168, 23, 166, 130, 15, -104, -191, -59]
2392e9K46Rk20j17pP7K24N7k11j44K9L7J54J56j32l03J3J91J01N4m3k42q2J81
2416c1J33L6j4j95j69J51K46J9j33j21p5M9J67J25o9j92j21R0J81R8n1k13j03
2439a92J03J63M5Lj04k17K1K70J06j13j15j15j7K08J53j17j10n6q6J13K66j6k61
2462f8r6O5Q7J47K5j68j38L3R3J26Q6j51j95j6J78J56m7j22r8m6P0J98Q0j66j71
2487a38j9J02J68Q1j65j80L4R9N6J12l0k42r1J85J38J9k5j80j20J45J63Qm8q1
2511ij76L2K41J09j27j43o8L9J57R2m9j39j08M1J34J21j0j77j46P0J76O7m7p3
2535Gj31m2J87J52o5j23j04k7J34J97o2j77k9j3M3J75O9j97j50N9Q7J09O7j37
2559B9j69J4J25Q5M8p0j81o2J42J60K2j27j22l3Q0J53O3j05j50l4Q0J02J19q2
$$ y = [-59, 187, 196, -24, -141, -148, -71, 153, 210, -1, -145, -116, -79, 75, 231, 99, -204, -191, 0, 101, 155, 112, -130, -212, -31, 102, 138, 124, -71, -240, -89, 157, 176, 43, -78, -153, -104, 63, 188, 119, -73, -194, -104, 77, 175, 124, -89, -192, -89, 74, 119, 122, 18, -199, -178, 92, 198, 85, -30, -145, -162, 46, 199, 82, -28, -84, -170, -57, 209, 193, -68, -164, -99, -12, 135, 160, -8, -146, -113, -20, 106, 192, 41, -154, -170, 8, 164, 117, -5, -103, -149, -79, 119, 199, 33, -138, -157, -55, 113, 194, 29, -151, -117, -18, 38, 150, 120, -122, -213, -28, 110, 129, 104, -76, -196, -51, 112, 120, 72, -9, -185, -153, 88, 197, 70, -73, -141, -102, 55, 147, 98, -41, -149, -108, 26, 147, 137, -40, -186, -116, 60, 127, 80, 7, -124, -166, 21, 173, 108, -15, -119, -146, -12, 185, 123, -54, -83, -96, -53, 122, 191, -6, -156, -97, -10, 99, 166, 29, -140, -126, -1, 84, 132, 62, -119, -181, -39, 121, 143, 16, -106, -139, -59, 94, 157, 52, -98, -132, -52, 50, 169, 87]
2583H7j99m3J38P8M8J0j71j40J23J60J5k5r8j59O7K06L2p5p6j00rJ71J23o6j44
2608d7q4K0J23J31l9j45r5K8J16J13lj07j41kJ54J18m4j02q8m3J28J63m1j29p2
2633h8j6N2J80M5j87j14K9P3R4R2j32j60K8R2O3P7o6j79l8J40R9J8n3j28p2R8
2659e3J32M3o6j16p3O6J28R6q5j51m5P6R3P3oj58j17J06J26L0nj02j53O5J89K1
2685A14n6n6j05l3J78J16q6j11n1k3J20J30n0j30n0JP0J33K6j40j29K4J19R3L
2710A07j03j06j5J04J26kq8r6m7P9J64J0j37r0J0L4J12R5j21j48PP6Q5P6o2j76
2736a06l0J25O6K9nj32r6Q9J40K9n1j09p9O8J16O2n1j06n9J4J20J03l2j47r4P5
2762f1J11N1j1r1j23K0J42M8j7o2j26pJ61Q2p6m7o1n6J01J45l2j19n5j7O5J41
$$ y = [87, -112, -155, -17, 61, 109, 119, -52, -192, -69, 91, 106, 81, -17, -176, -109, 97, 129, 54, -22, -122, -131, 40, 163, 97, -47, -131, -111, 12, 143, 104, -41, -136, -108, 8, 121, 118, 11, -130, -132, 22, 140, 96, -6, -94, -137, -9, 154, 113, -16, -88, -104, -52, 128, 173, -14, -128, -99, -26, 68, 160, 28, -132, -104, -12, 51, 128, 62, -117, -155, -15, 84, 102, 49, -79, -151, -53, 79, 122, 56, -60, -133, -67, 61, 157, 72, -79, -124, -48, 45, 118, 112, -46, -163, -57, 69, 99, 94, -8, -161, -96, 93, 114, 58, 2, -103, -136, 42, 158, 72, -39, -90, -113, 7, 137, 87, -43, -93, -92, -22, 111, 137, -3, -132, -108, 11, 104, 107, 4, -102, -117, -13, 113, 111, 23, -73, -120, -41, 123, 133, -4, -94, -84, -50, 62, 157, 36, -112, -105, -29, 56, 132, 70, -106, -136, -11, 55, 84, 79, -53, -149, -60, 80, 109, 58, -51, -130, -62, 54, 116, 65, -41, -100, -86, 34, 137, 105, -42, -136, -61, 50, 101, 90, -1, -124, -104, 38, 86, 69, 7, -119, -126, 35, 117, 41, -6, -67, -123, -22, 123, 91, -28, -83, -100, -35, 106]
2788A06J0j32o9J8M0R5N0r0j26j4J05R2J6q2q3m3P0J13L8q0r2l7M1J24O4j09j09
2815h4%M6P1Q6n0j39m5Q1O5O8k0j50o0R5R2J2lq0j03L7J36N3n9q1o5J1J24O8l6
2844G0q9o2NQ7R4j0j05j03M2R1O8k1n7r7k5J14R0k0n4q2n4J10J24m0q9l9l9L7
2872e4J30M5j22q1J3L1R9N3r9j06K7M9N1O0m1j22l8P7R3J9m3j01m5O4Q3M9n0j01
2900f0l0K0J06R1q4j13j9O2N3N0Qj13p4N2P9N7qq7r8N3J02K9l0k8r3k4J23Q8n5
2929E7o7n8j7R7Q3l0p4n7jM3Q2K4q2q4lQ5P1jn8o2m3P3J00Jo7o4m3O6J16Oq6n3
2961d6qNR2O9q1r6rN7N0O4n2j07j9O0N0N1k2j00n3N2R3K8l4q1n0L6P5M9k9o8n0
2992g4J2P3P3j0j00o2N0O1M4jo8q3J8R6M4kn8q6nJ13M5l9l2n8l4O6R1po5n7j7
$$ y = [106, 116, -16, -85, -67, -27, 68, 118, 28, -98, -112, -7, 85, 101, 19, -64, -107, -37, 76, 114, 34, -58, -95, -54, 70, 134, 25, -84, -84, -38, 33, 119, 69, -70, -115, -34, 31, 99, 79, -71, -131, -36, 56, 68, 65, -15, -118, -81, 55, 108, 49, -32, -97, -86, 38, 106, 70, -19, -81, -76, 11, 105, 95, -10, -113, -71, 20, 88, 67, 10, -87, -112, 2, 92, 72, 18, -64, -118, -8, 116, 76, -13, -52, -91, -54, 76, 121, -1, -82, -69, -38, 61, 114, 15, -91, -64, -15, 36, 96, 55, -67, -105, -28, 65, 84, 41, -60, -105, -41, 42, 91, 41, -60, -90, -70, 36, 127, 43, -70, -89, -27, 26, 76, 84, -29, -103, -51, 28, 85, 77, -10, -108, -55, 47, 76, 46, 18, -75, -99, 24, 112, 57, -10, -68, -85, 12, 95, 65, -9, -66, -67, -24, 58, 82, 0, -84, -87, -2, 69, 68, 10, -52, -95, -22, 78, 79, 12, -52, -95, -29, 87, 93, 7, -46, -54, -49, 43, 112, 31, -65, -74, -17, 33, 97, 45, -62, -81, -21, 29, 80, 58, -42, -95, -43, 50, 78, 44, -37, -87, -51, 24, 73, 44, -24, -74, -62, 11, 84, 74, -26, -88, -38, 23, 67, 66, -2, -85, -67, 29, 73, 71, 13, -73, -78, 35, 80, 41, 9, -49, -83, -17, 74, 67, 2, -55, -72]
3023g2M9R2Kq3m9LL7O5L0n4p2l7P6P4ln1m4l0L6R0jl7n6l8K5R4N1p1p7NOP2N3
3056H5l8r1l4M9L8O2j2r4n8N5P1K5j1p5n2K4Q7L2k6n1o4J8P1O9l2p1m6J7N9N5
3086F2Op5o5K4O5L3J4o2p8KQ7M6k0k8o4l5Q5O5pn9m1l1M9Q9jn8o0LJ7P5K8o2p6
3119g2J4L6M6M2l3o4m1M8O1L0m0n5m1L0P7L1m3m9k7J8O5M0l9p8j3K7L6M9Qj00
3149c7l3M7M1L6Kp2o5K7Q1K8oo2n2%R6L1k2l3n3j3N5P2j3n9m9J0N1M1Qn2o2MO3
3182A0L4Rl7p5lO0M7ml3m6k7L9Q0km4l1l8K0Q4K5n5o3J1MO3M0l4p4j6L3M9L6k5
3215C7p7j8M8L9K9l1l7m3J7O9L7m1n3l1K2L9O2k2p8k6J3N4M9%o7o4L2P5J3km1
3246Dn5LO5L9j6l0n6k0P5O6k1n0l9mK8O4J8o0n1rM6N0J6m6m9j4M3M5Mj1p7k7M3
$$ y = [-72, -23, 69, 71, -12, -61, -58, -21, 44, 74, 20, -52, -89, -13, 61, 58, 7, -37, -67, -31, 59, 58, 21, -35, -73, -48, 46, 97, 26, -51, -46, -40, 32, 85, 47, -44, -78, -29, 9, 71, 59, -35, -93, -38, 33, 58, 47, -28, -80, -56, 31, 63, 37, -14, -78, -60, 11, 80, 48, -23, -69, -52, 7, 62, 68, -7, -72, -48, 17, 50, 64, 2, -76, -74, 13, 59, 39, 11, -53, -88, -3, 62, 55, -4, -45, -76, -27, 62, 61, 3, -57, -54, -37, 38, 66, 4, -72, -58, -22, 24, 66, 33, -31, -72, -24, 37, 67, 27, -28, -69, -39, 38, 69, 26, -23, -50, -32, 33, 73, 34, -44, -57, -30, 6, 55, 63, -37, -70, -23, 18, 54, 56, -16, -81, -54, 27, 55, 49, -13, -65, -65, 31, 62, 40, 7, -46, -59, -4, 68, 55, -4, -53, -43, 8, 49, 57, 5, -57, -53, 10, 44, 53, 16, -59, -62, -2, 45, 41, 8, -38, -65, -26, 54, 52, 8, -23, -61, -41, 43, 68, 13, -50, -39, -35, 28, 68, 34, -40, -56, -23, 26, 62, 37, -40, -58, -10, 29, 58, 27, -10, -53, -36, 33, 70, 29, -24, -55, -33, 6, 68, 46, -32, -58, -45, 9, 58, 58, -9, -73, -41, 34, 47, 45, 4, -51, -48, 17, 56, 40, 10, -46, -66, 9, 75, 54, 4, -35, -39, -11, 53, 71, 11, -40, -49, -3, 47, 63, 17, -32, -46, -3, 42, 46, 35, -42, -69, -26]
3279b6Q1Kl5m6k4J6O8K3l9n5k2J8O1N0l6o7k2L0M7L7qq3k4K7M5M9l0n9m5M5M9
3310B7J9pm4m2NO2L9j6o0l8J3L7M0K2n5o1K3L9L7J2m9n6JO4L6j5j6n2j7N3N6k5
3342C2nn5k3K8P5Jm7l7k1L4N1K0k7o3k5N0M1K5k5p6mL0N9K2l7m0l8J5O9L7m7l8
3374a9k2RN0L9l3m9j6J3M0N8k6o4l3L7L7K5nm9n2K6N1K5Nm9p0L2N5L4j6m4k4k1
3406e6N1N1Jn4l3KL5N4Ol9n1rM7L2Oj9o1j8N5M8Km2l4k9M1N5Om4l3k0K0P5Lm0
3440Hl2nNM0L0k5m7j1J2O0J7k8m9j3J5M6K4k1m6k0NM5N0k8m9k4J1M5M9l4m2l0
3472d2J7L3L2J1o5l8J8L9L4Nm4n0J4M1K5Ol6m3j5N5N4pl9l5qK8M9Pk9n5j0L8M8
3505C8J3l6n0j3L7M5Mj2m1l3L6N1Pl1l7k0J2M4K4m3j9j7NN1L9k2o1j5J5K9M7l3
$$ y = [-26, 55, 57, 22, -24, -48, -32, 36, 59, 20, -35, -57, -39, 22, 72, 36, -31, -53, -23, 24, 61, 53, -30, -54, -27, 18, 67, 37, -22, -67, -22, 27, 46, 39, -5, -47, -42, 20, 59, 43, -17, -55, -42, -5, 35, 57, 2, -59, -36, 3, 40, 52, 3, -53, -52, 12, 48, 33, 17, -35, -52, 1, 57, 32, 27, -28, -51, -23, 52, 53, 6, -31, -52, -18, 33, 53, 26, -37, -62, -12, 29, 54, 29, -47, -51, -21, 38, 60, 23, -17, -55, -40, 29, 66, 19, -19, -41, -32, 18, 57, 24, -25, -41, -28, 12, 70, 44, -20, -53, -16, 21, 46, 41, -8, -60, -34, 17, 42, 47, -2, -72, -40, 15, 49, 33, -11, -35, -56, -5, 46, 47, -7, -40, -38, -3, 51, 57, 18, -33, -42, 5, 37, 43, 24, -37, -55, 0, 48, 50, 8, -26, -55, -14, 41, 47, 3, -30, -50, -30, 45, 48, 8, -24, -29, -24, 16, 46, 21, -26, -37, -25, 35, 52, 24, -25, -38, -23, 23, 47, 26, -20, -40, -35, 10, 60, 32, -17, -41, -30, 15, 64, 30, -12, -42, -25, 8, 40, 51, -14, -52, -34, 5, 39, 44, 0, -50, -36, 5, 30, 36, 0, -43, -58, -3, 51, 44, 5, -30, -38, -10, 39, 46, 17, -38, -48, -10, 38, 51, 15, -35, -48, -11, 34, 38, 26, -15, -48, -12, 39, 46, 15, -22, -42, -30, 14, 38, -5, -24, -41, -36, 15, 54, 32, -29, -44, -29, 0, 47, 14]
3537A4l2k9J8M3L0j6m0k5QL8K9j0m0k0qM9L4rm3k6nK5N0ql9l3J7K9K3Kj4n8MM0
3571bK4J0j5n0pM0K0J3k3l6k0K6N3J8l5k2l2J9M5J9l4l6mJ8L3K8k8l7k6J6L9J6
3603C0nm4rkN9Nk0k7l1OM5M1k7l0l2K0K8L1j2l7k5J4K9L8rm0k3RK4K4Ol4k5j9
3637d2M1K7kk6l3J1J4M1kl2l2RJ5K9J8l3m0KL2J8K1k7m1nK4M1Mj0l3k5J9M6Rk1
3671A7j9l2J8L2J5rl1k2J3L6J4rl6j6OL4J1ml4k5QM1K1k3j6k9J7K7K6j8k0j4l
3704b4K0L9pl8j7J0J7K2Kk3k2J2J1K5Rk5l3LK0K8oj8j5j7K4K6J0k7k5j3K7K9m
3737B0j2l4mJ0L3J4j2k9j8K6J8J5j0k8pJ1K4Noj3l3J6L1J2j3j5j7pL0J5%k5k6
3770b9QK8K1ll6j8J6J0K6qrk6qJ5L3Ok9j4MNL0kj7j9kK0J9Jk6r%J6J2J7j5l2l
$$ y = [14, -18, -47, -29, 14, 44, 28, -12, -37, -29, 9, 38, 28, -12, -32, -40, 9, 43, 34, -9, -35, -40, -15, 35, 27, -12, -45, -28, 1, 24, 26, 12, -46, -42, -2, 22, 32, 17, -33, -40, 0, 20, 33, 10, -26, -46, -20, 33, 51, 16, -6, -38, -19, 26, 45, 11, -25, -29, -11, 22, 50, 22, -15, -41, -25, 14, 30, 25, -19, -28, -30, 29, 34, 14, -13, -44, -38, 7, 48, 21, -9, -41, -21, 7, 38, 26, -11, -36, -22, 7, 45, 36, -4, -27, -18, 6, 30, 36, 2, -23, -42, -1, 26, 24, -2, -35, -24, -10, 31, 29, -3, -35, -26, -11, 18, 36, 3, -37, -35, -3, 15, 36, 9, -32, -37, -13, 28, 32, 22, -11, -36, -17, 29, 38, 17, -2, -34, -16, 16, 31, 22, -9, -31, -18, 18, 32, 23, -13, -29, -23, 11, 22, 18, -16, -41, -33, 8, 29, 6, -10, -39, -22, 5, 31, 13, -7, -21, -24, -4, 35, 28, -10, -27, -17, 0, 22, 24, 1, -21, -9, 2, 27, 36, 11, -22, -19, 1, 29, 23, 5, -10, -27, -3, 23, 33, 6, -19, -32, -5, 24, 20, 8, -26, -30, -20, 13, 27, 15, -14, -32, -6, 12, 27, 17, -11, -18, -7, 17, 22, 16, 3, -30, -14, 17, 29, 16, 1, -16, -23, 7, 22, 22, -3, -29, -21, 7, 28, 25, -11, -29, -13, -3, 23, 15, 6, -20, -28, -13, 20, 26, -3, -17, -13, -8, 22, 20, 3, -16, -18, 2, 21, 22, -4, -13, -13, 3, 15, 32, 17, -15, -18]
3807a8J8K0J2l3j3j8K1K3J3j1k5j5K2J7Lll0JMOK3j0k0oLK5J8j1k7qQK3J2j9o
3842apKJ9J7k4qj5NJ2K5j1j6j2nK6Ojj2Jk0K6K1j7j5j7PPJ5J0j9ojPJ6J0k3j6
3879a4RMJ2Pj7j7J1%K2Kj6rj3QK4Lj6qqLJ6J4j3j7kJJ5J5j1j0j8J9OJ5pj3j1R
3917eK4j3ppmMQK1mk3j3OK0J3j7jk2J8nLJ2j2j7jK2PPj9j9J7J5Omj3lj0J7Qrk
3957bmoOJ3Moj4jJ1MMJk8J3PJ3jk3Oj3J0NJ1mj3j2OJ4jNpmnJ2JMj4j2K3oK2mk4
4000iLJJ9rJ1j4rJNNJ0j0k0J3QKqlkoJ2jJ1j3nLj2QJ0p%NrJ5mpLKkR%j5J1rJ3
4045FNmmnkJ2%jJj4L%MmJ2j9NMMJ3j2Jj5K%MJ4j0r%J4NjmmkoK3j0NprjJ2JolJ0
4093HmjlJ1j2lJ2qnjJ0j1LLNlKj4mJ7Pj8MN%Mj1J3mloJ1lMkj0PPl%pjJ6j6KJ2
$$ y = [-18, 0, 20, 32, -1, -14, -32, -11, 12, 25, 14, -11, -26, -4, 13, 16, 13, -17, -16, -12, -6, 17, 7, -13, -19, -16, 9, 27, 16, -11, -19, -11, 12, 24, 5, -1, -8, -6, 13, 30, 6, -2, -17, -12, 0, 25, 14, -2, -14, -19, 7, 13, 12, 0, 1, -19, 7, 28, 11, -4, -21, -14, -7, 8, 18, -1, -7, -8, -1, 15, 25, 2, -14, -5, -1, 11, 18, 1, -16, -5, -5, 17, 19, 3, -6, -19, -11, 13, 16, 0, -8, -16, -13, 3, 17, 4, -13, -15, -14, 1, 16, 5, -5, -23, -4, 2, 17, 10, -3, -14, -5, 19, 6, -1, -8, -12, -8, 0, 21, 17, -6, -19, -13, 7, 20, 3, 2, -20, -2, -7, -4, 8, -4, -21, -22, 0, 7, 14, -5, -24, -7, 8, 14, 10, -3, -6, -16, 1, 9, 0, -2, -6, -12, -6, 7, 11, 5, -9, -10, 1, 5, 9, 10, -18, -5, 2, 15, 14, -9, -3, -16, -6, -1, 10, 6, -7, -19, -13, 1, 0, 5, -2, -6, -11, 1, 2, 6, -8, -20, 3, -3, 19, 15, -9, -6, -5, 14, 5, 16, 2, -7, -6, -1, 4, 14, 4, -16, -3, 5, 7, -1, -4, -6, -12, 0, -1, 10, -3, -8, -5, -17, -9, 1, -6, -6, -1, -10, 5, 1, -6, -3, -1, -3, 6, 6, -9, 2, -7, 6, 11, 7, 3, -2, -4, 8, 8, 7, 8, -6, -3, -3, 1, -3, 9, -10, -5, -1, 3, 16, 4, 5, -10, -8, -8, -4, 10, 0, -9, -9, 5, 10, 9, 5, 1, -1, -7, 16, 6, 11, 4, -5, -6, 6, 7, 1, -2, 8, 4, 3, 0, 11, -1, -4, 8, 0, -5, -6, 4, -7, -4, -1, 4, 1, 3, -11, -15, 2, 9, -9, -5, 0, 0, 4, -7, 6, 2, -1, -7, 4, 1, 5, 3, -7, 0, 7, 4, 4, -3, -4, 12, -4, -2, 10]
4139A0j0j0Qj0RJ1Kj0JnjQLj4oKJ0jJOqMj0OPNkj0J1Qmkj1rJ3KrJJ2j1kQ%npJ3
4185DpJLLj1kkONrkNNjlMlnOlPlRmnMMMknoKJ9j7Oj1KL%Kl%j9J4Nj0J2j6pK2L
4236DljLk0J3J5mpqRnJ4plK%nOLQj4ojOJ0qOj5LN%%Nj2jLLPq%rOQLKj1mJQnPn
4288bLKJkkJqNJ3mpok%J8nj0NLmL%Qj0j7J1M%lqLpK0lNopMJ2OLj5rlJ3MOj9q%
4338a4J7KOj1j3NMNPLj3qQOmRj9oJ4J0qKqj4OJ8Kj0jj0mK2Oj4oQJNJ6j4j8KK4
4381A3rJ8k0lj5J3LJ%j2mNJ8j0Rpj6nK4Qnoj0j3J9QOj6j1J1KJ5oLk6%J0MJ7j3
4421@oj6K8J2pj6mNMKJ7j7qj0KRQJqpKJJ0mj6%OJ8Rj2j0JlJ6J4j3qrjK0Oj0j1
4464enJ2OlJ7k1rMJ1pJ5qj9pJ5J9mj4j2kQJ7Jj7j4KNJ8Pj0mj1J9MmLk2lK0%Rr
$$ y = [10, 0, -10, -2, -12, -3, 8, 10, 0, 1, -4, -5, 3, 6, -8, -14, -12, -2, -3, -2, 4, -4, 0, -10, -4, 3, 8, 6, -4, 7, 15, 11, 9, -2, -11, 2, 4, -5, -4, 8, -3, -5, 3, 3, -2, -9, 4, -3, -2, 1, 4, -7, -9, -11, -5, 0, -9, -11, -6, -1, -2, -5, -1, -4, -9, -3, -6, 1, -2, 7, 3, -2, 2, 6, 10, 8, 3, -3, -1, 18, 1, 7, -4, -2, 1, 1, 3, 0, 0, -19, -5, 0, -10, 2, -14, -21, 1, 4, 1, 0, 3, -17, -4, 11, 7, 0, -8, 1, -4, 10, 3, 0, 2, 2, -3, 3, 6, 14, 0, -6, -7, -1, 9, 1, 7, -8, -5, 0, 0, 0, 5, -7, -8, -5, -2, 5, -3, -3, -12, -6, 2, 5, 7, -4, -8, -7, 1, -4, 3, -2, 1, 3, 4, 2, 0, 1, -7, -2, 11, 7, 0, -6, -8, -8, 10, 5, -5, 0, 3, -1, 2, 2, 10, 0, -17, -6, -2, -2, -5, -13, -10, -17, 3, 0, 5, -1, -8, -4, 8, 14, 17, 2, -7, -10, 3, 7, 13, -6, -14, -14, 3, 5, 11, 0, -13, -8, -4, 1, 8, 11, -2, -10, -2, 4, 0, 9, -10, -16, -2, 8, 0, 2, -6, -20, -14, 4, 6, -4, -5, -15, -19, 3, 9, -5, -11, -3, -2, 3, 19, 5, -13, -11, 13, 4, 22, 2, -1, -16, -3, 0, 1, 1, -11, -15, -10, 8, -2, 7, 0, -16, -21, 3, 11, 6, 0, -10, -23, -4, 4, 10, -6, -17, -6, -4, 11, 5, 8, -18, -18, -8, -4, 13, 0, -6, -22, 6, 18, 11, -5, -9, -4, 0, 2, 19, 2, -6, -16, -14, -5, 3, 4, -4, -11, -9, -8, 2, -2, -18, -18, -12, 6, 15, 3, -7, -6, -9, 7, 21, 8, 0, -9, -10, 10, 16, 6, -5, -10, 2, 8, 5, 22, 1, -8, -4, 7, 0, 15, 7, -12, -19, -4, 15, 11, -3, -15, -17, -9, 8, 9, -8, -22, -20, -15, 3, 10, 0, -4, -15, 4, 8, 4, 7, -15, -18, 2, 2, 11, 2]
4506BmkKJ7qj0mjJRNqj3lkK9Nrk1j0J1%L3j2j7j7J0K3lKj5j1J0J7Qk1NnrJ1K4
4547A9j1k0NjJ2RRk7mKkJ8jj7j3QPPQj5j7RJ1OJ5j8mj7RL1j0j1KojK5%rj7j1K5
4588ElJ7oj5mkJ7Ljj4j4QK2Jj1jl5J1K8oLoj6J0PJ2lk1J%J5oJ1rj9J5PK2Kk1j6
4629a2LK0J1j1j6moJ3J8j0j4J0pRQNj6k9J0MJ6J7rk2j1K0K1mnj6k2J7K9oLl3J
4666a8J1K7j%j7j0j6L0J4j3j4j2J4QRJk1rQQK0j5k2oKK0Ljj9jJ3lL0j6j7qOJ5
4704@J3rj2j2J0K6Omj0k0nJ3K5qrj9oK0J1Lj8nj3MK6Nk2nlNK3Pj1k9JK0J0Nj4
4743aj3lJ0J9Noj1k0NK6MKj3j7J1KK3k1%k9K1J2MJ5l6nJ0QJ3nk4%j2K7J3nj7j1
4781a9JJ7J5Kk1joJ7J5oj8qoJ3K4Lk4j0%J4RNkl0%J6J2Mj0j9mLJ3J7k0j5mK2J2
$$ y = [2, -2, -4, -2, 15, 7, -3, -7, -8, -7, 2, 7, -1, -14, -17, -19, 10, 15, 6, -15, -25, -14, -14, 19, 7, -10, -27, -17, 6, 3, 5, -10, -21, -11, 6, 14, -7, -2, -7, -16, -5, 19, 8, -12, -7, -8, 4, 13, 22, -5, -9, -7, -9, 9, 8, -9, -22, -14, -7, 0, 8, -7, -24, -15, -4, 2, 17, -1, -5, -22, -13, 18, 8, -3, -1, -7, -8, 17, 17, 8, -9, -20, 5, 2, 19, 13, -2, -6, -8, 9, 12, 11, -3, -17, -9, 13, 14, 3, 2, -33, -22, 6, 0, 3, -3, -19, -9, -2, 10, 7, -14, -13, -13, 2, -4, 7, -2, -21, -6, 1, 23, 25, 4, -12, -9, 11, 22, 11, -5, -9, -15, -2, 16, 6, -8, 2, -5, 4, 12, 17, 1, -28, -18, -14, 2, 19, 10, -12, -23, -3, 18, 14, 9, -7, -29, -12, 17, 11, 14, -19, -18, -7, 20, 19, 19, 2, -8, -24, 6, 20, 7, -7, -19, -5, 3, 12, 13, -8, -17, -9, -1, 19, 4, -18, -24, -22, -2, 1, 0, -19, -20, -7, -10, 20, 4, -13, -21, -15, 0, 13, 4, -8, -20, -10, 16, 22, 18, 8, -12, -17, -4, 21, 13, 4, -15, -21, -1, 10, 13, -5, -10, -23, -19, 7, 12, -10, -15, -18, -13, 10, 17, 6, -23, -22, -2, 8, 13, -1, -14, -17, -7, 12, 17, 11, 0, -20, -15, 11, 15, 17, 4, -13, -2, 0, 23, 2, 2, -27, -6, 6, 10, 25, -11, -16, -6, 2, 15, 10, -14, -14, -26, 1, 14, 9, -8, -19, -18, -1, 14, 16, -5, -6, -12, 5, 20, 14, -4, -12, -18, -5, 19, 22, -2, -12, -12, 2, 11, 16, 14, -16, -16, 0, 12, 16, 6, -13, -17, -14, -1, 16, -4, -19, -23, -1, 11]
4820A1Mj4j9pJ2J8K2j1k7oQJ0K2j7j1k1J8K5kKj7j6OK3Poj3j8J6LOJj3j4KJ6K1
4857B1kk9rlK9KJ0k2j6LJ6J3j0Lj6PNK3mk7%kJ1K1jk0qOnK4Pk1j8j2K6MMpk0l
4897b0OL0Nj5k3QOJ3Kqmk2J2K2J0j0k4jJ5J3Pkk0jkJ2RNk5rpK3K4j5j4j3jJ3J6
4936A5qj0nj5J7J6kk3mMJ3Rjmoj4J5K3nj3krRJ6nj0j2%K1Rkj6j5J0OJ4Jj4j3K
4976hPK1oJk5nmK9lnj6k1QL9Lpj4nOPK0ml1kNL1MLk4k2ML0qJ0j1l0J3K2J0prk3
5018a7NK6lpoj9MJ0K0%j8j3JJ7K6j9qj0jJ6J7rnk2KJ7J4%j7j2pNL4nj5prJ1J5
5057A1J6j5l1jJ0K2J0j0j9j4JK1R%j8j0J1K7Qj7k3pJ2J7%jj1j6JK5J8j2k1j0O
5092a1J4J2kj1rj1K8J7kk6j9J1J1J5pmk3mJ7J0jj3mlJ6K1jk1j5kJ5J7Mk1qoJ9
$$ y = [11, 15, 1, -18, -25, -13, 5, 27, 16, -11, -17, -9, 1, 23, 6, -5, -26, -8, 17, 15, 17, 0, -16, -10, 13, 20, 14, 1, -17, -1, 2, 8, 9, -4, -18, -16, 0, 21, 19, -10, -19, -22, 7, 9, 19, -3, -19, -16, 0, 13, 3, 6, -10, -3, 2, 25, 21, -6, -6, -8, 3, 24, 23, 3, -5, 1, -4, 20, 27, 6, -12, -24, 2, 6, 10, 3, -17, -20, -14, 16, 21, 6, -17, -9, -3, 10, 12, 4, 0, -22, -10, 12, 22, 12, -12, -13, 2, 15, 22, 20, 0, -1, -3, 9, 18, 23, -2, -11, -18, 5, 29, 14, 0, -13, -14, -1, 15, 7, -3, -8, -23, -6, 10, 8, -15, -19, -15, -2, 7, 6, 2, -4, -18, -3, 20, 15, 2, 0, -9, 0, 16, 11, 1, -11, -11, 10, 19, 17, 1, -14, -4, 2, 16, 17, 3, -10, -8, -1, 20, 14, 15, -10, -15, -19, 10, 7, 2, -14, -35, -27, 12, 15, 8, -6, -11, -5, 2, 22, 18, -13, -15, -10, 21, 25, 28, 4, -18, -14, 16, 8, 18, 7, -23, -10, 12, 22, 15, 6, -17, -12, 14, 11, 4, -2, -21, -17, -7, 13, 13, -5, -18, -17, 0, 26, 7, -1, -11, -12, 4, 21, 12, 7, -15, -13, 4, 18, 18, 1, -11, -18, -13, 21, 16, 1, -6, -15, -4, 11, 27, 12, -19, -20, -10, 12, 22, 12, -7, -21, -20, 1, 10, 10, -8, -18, -7, 20, 28, 11, -12, -19, -7, 10, 10, 9, -2, -18, -17, 8, 26, 14, -7, -17, -11, 3, 15, 13, 2, -7, -18, 10, 27, 25, -1, -20, -9, 2, 17, 10, 6, -17, -21, -4, 6, 5, -8, -12, -15, 1, 22, 21, 0, -15, -17, -2, 15, 19, -2, -10, -16, 3]
5129CJ5%rj8rJ1K2Oj2l1OJ2J2Qj8rqPJ6J9k0j0p%K2Pj5mj0mJ9J3%k1j1J3J6Ok
5168A5k0j0kK7Nlj3j8NJ8J0j0j0nj1J6NKlk2lK5M%k0QpK2J1nj8pqJ3K3%j0qoJ9
5208INkLk5mPK0K1k9j3LNJ1Lj1k3lJ0J9Qml3OmK8J0k0j2kqK5J5Kk6nlK3J7j0j5
5248bk0J1J7J0Nk6j4J2J2Rlrk0NJ5Qlk2j2J0J5Rqmj4%J5K0pqj8oJ8J2Rk8m%J3
5287cJ3Pk3lQPJ0Nj9j8OoJ8K1k0j4kJK0J2j2j5j5J5J4JQk2j5J8J5Jlk5j2J4K4
5324A1%Nk2j7J1K2jJ1k2j0PJ6NRk7j7PK5J1j4lj9MjK1Kqk1kJ9OKk0qlK1MJ4k6
5363hj0JJ7QJ0j6j4j5K0J5Nj8j0lJ8J1Lj0j9J0j3K9K0k9j1jkK2J0j9j0rPJ6lJ
5399Cj9pJ0J5J2pj6jLJ2J0j3lj5MJ7KQj5rkL0lnj4mJJ1Qkj7olJ2J1j0Rj8nJ8J2
$$ y = [3, 18, 18, 9, -9, -18, -7, 15, 21, 9, -22, -16, -4, 8, 16, -2, -11, -19, -12, 4, 23, 3, -7, -14, -14, 8, 15, 0, -4, -14, -18, 1, 14, 14, -7, -18, -5, 11, 17, 15, -5, -15, -17, 10, 15, 12, -1, -19, -14, 4, 14, 4, -6, -11, -22, -6, -1, 1, -2, -24, -27, -2, 2, 2, -18, -10, -17, 5, 16, 11, -7, -14, -22, -9, 14, 14, 4, -4, -10, 9, 14, 12, 15, -10, -14, -7, 13, 34, 5, -8, -5, 0, 11, 14, 3, -20, -23, -13, 6, 14, 10, -23, -17, -21, 7, 17, -3, -15, -17, -25, 0, 15, 17, -9, -14, -17, 6, 23, 13, -2, -22, -11, 6, 16, 21, -5, -19, -7, 5, 14, 11, 2, -18, -13, 2, 10, 7, -15, -27, -17, -2, 7, -1, -5, -19, -19, -4, 16, 9, 1, -17, -23, -5, 7, 16, -12, -16, -16, -3, 10, 17, -6, -9, -1, 6, 16, 21, 2, -16, -10, -16, 2, 23, 3, -11, -13, -12, 8, 20, 8, -7, -22, -7, 7, 8, 16, -6, -21, -3, 12, 13, 10, -15, -27, -13, 11, 11, 16, -6, -23, -12, 10, 9, 20, -2, -12, -5, 11, 16, 25, -2, -19, -12, 13, 24, 10, 7, -12, -8, -9, 12, 14, 6, -15, -17, 2, 8, 10, -10, -18, -21, 0, 4, 18, -8, -18, -17, 0, 8, 18, 2, -12, -27, -7, 8, 13, -5, -15, -18, 0, 11, 14, 4, -15, -5, -18, 11, 31, 2, -9, -10, -12, 10, 20, 1, -9, -18, -11, 5, 2, 3, -16, -23, -13, 2, 14, 7, -9, -10, -7, 5, 15, 2, -1, -16, -12, 5, 7, 15, 0, -9, -11, 19, 16, 11, -3, -7, -6, 5, 13, 11, -6, -12, -15, -3, 8, -2, 7, -11, -16, 2, 14]
5440A4qmj2j0RK5nj9rLRJ9jqk1KJ8KMLk5RNJ0J6j3j5lLJ3Kjk1j9J9J6J4j1k2m
5480a6OJ1J3j3j0j3J7J8mooj8J2J1JNnj7MK2mkj5NqJ0K6ok7klJ6Pj0Nk0LJ1J8
5519A6j1j3kj6K0J3Jj6okJ2J2jk5QJLJ4J0j2j9OKJ5Jpj8PRJ3Oj9j3%QJ8oLk5M
5559ikJ1J1nk3%NJ0Rkk1%PQJ5j4jj6PJ7MRk7kJJ0J8Jj2j8%J7Rnj8nOkK4j5rqP
5602hkJ2Rj3j1mOK0nj0j5JJ2NK1k1j0j4L0J0%j3j2oJ7J5mpmj4J4NJ9j7j4j%L0
5640B1j2lk5lJ3J3mPk2qOK2Opj5nQQJ4mnj7LJ7KNk1j0J2J8Q%k1j6PJ6QJj1j4J3
5681EjJ2mk1pLRJ2mj1j2LJ5J6jj3j2kQJ2Mj8pkQK3qrqJ0kJ8Kj4qnMJ1P%k6JRJ3
5725A0KPk5okJ6MJ0k4j5J4J4Kjj5pRJJ9plqJ0%J4j0j0j1J2J5j0J1oj9RNJ1j1p
$$ y = [14, 6, 2, -10, -20, -11, 14, 9, -10, -19, -16, -7, 12, 11, 3, -18, -16, 2, 4, 8, 11, -14, -5, 0, 10, 26, 13, -2, -5, -2, 11, 13, 12, -9, -28, -9, 7, 21, 10, -12, -16, -10, 1, 14, 1, -9, -22, -5, 13, 9, 3, -3, -21, -9, 2, 3, 8, 3, -14, -10, 12, 8, 6, -9, -4, -12, -2, 24, 18, -9, -11, -14, 2, 9, -1, 4, -16, -13, -2, 16, 5, -8, -10, -26, -6, 7, 8, -8, -14, -16, -4, 8, 7, -18, -10, -9, -6, 8, 18, 6, -13, -7, -5, 10, 11, 4, -14, -7, 2, 15, 21, 2, -11, -11, -3, 15, 9, 12, -13, -9, -11, 0, 11, 6, -17, -17, -12, -2, 7, 5, -16, -16, -9, -1, 14, 0, -1, -17, -10, 7, 11, 20, -7, -9, -8, 2, 20, 21, 9, -9, -9, 8, 17, 12, -6, -11, -5, -7, 17, 2, -7, -15, -8, -10, 2, 11, -2, -13, -17, -11, 9, 4, -6, -21, -20, -8, -3, 18, -3, -13, -27, 3, 13, 13, 0, -12, -18, -1, 14, 10, 3, -1, -15, -1, 4, 23, 6, -8, -9, -9, 21, 9, 6, -19, -22, -9, 4, 0, 7, -15, -23, -17, 5, 11, 4, -11, -16, -8, 0, 14, 10, 5, -12, -9, 8, 10, 15, -6, -16, -4, 14, 22, 22, 1, -15, -8, 8, 16, 17, 6, -8, 5, 4, 16, 12, -9, -16, -13, -4, 8, 4, -7, -19, -16, -1, 15, 14, 1, -11, -13, -5, 7, 11, -7, -14, -16, -8, 15, 7, -2, -10, 0, -2, 16, 18, 4, -4, -9, -5, 6, 13, 13, -13, -12, -3, 10, 12, 19, -6, -12, -14, 2, 6, 16, -8, -23, -9, 5, 7, 6, -9, -16, -7, -6, 13, 6, 3, -5, 5, 5, 19, 9, -1, -12, 0, 15, 5, 16, 10, -9, 0, 5, 16, 5, -2]
5764bllOK0jj8j7J1NJ4Kj2j8NJ4J3%j1oj6RK4qlj1mLK4Oj1j2rPJ5Qj4j8KNJ3R
5805A8kj9oLJ4Mj4olMNJ1rjk5K3J3Kj0Nk1J9jQMj9kjJ3KQj4mkOPlmqRLJ0nlj4
5850emKK4rj6nJJ1NOj6j1KJ1ONj0mj5K3NK2j6j8lJ3NN%k0kkJ9lmkpJ7oM%k5kJ8
5894aPK%j4j4NK4n%jj3PKRqQj4KJ1lNnmKPPpnpmJ2J7rpj3P%J7rooj9K2KJ4j5j5
5941a5J3LKjnr%J1J6j1Nj9NJ1J0koqoKK3nrpj4J5QNjj0nmJ0J4j7lpkQJ2Mj2pk
5985a0J1J4nk1MJJJ1Jj2Qj0J4Rmnnj0J1J5kj3j2j0L2Mj1nj6J7J0knj2j3K0LJ1
6023A4pj2j4L%J5J1j0npoK3J1prqJ2NMlj1rMK1Qj1j5oNQJ%j2oNKJ7pokMkO%pk
6069eLjJ1rPmqJ5Nj2J0j7jJ5Kj2NLj1PNOj9%lMJ5Kj1lNlJ0loMj9J3J8j6lrkJ4
$$ y = [-2, -5, -8, -2, 18, 17, -1, -18, -7, -2, 12, 14, 2, -16, -11, 3, 16, 16, 5, -1, -17, -8, 16, 8, 5, -6, -10, -7, 17, 23, 12, 0, -9, -2, 13, 21, 7, -11, -9, -4, 9, 18, 16, -3, -9, -6, 8, 12, -2, -8, -11, -7, -2, 9, 0, -1, -26, -3, 10, 12, 2, 7, -14, 5, 4, 12, 16, -3, -5, -6, 7, 9, 17, 3, -1, -3, 3, 10, 7, 3, -5, 4, 7, 17, 12, 9, -5, -9, -7, 17, 8, -8, -13, -12, -1, 4, 10, -6, -17, -15, -4, 2, 7, -3, -7, -22, 1, 6, 28, 12, -6, -9, 4, 9, 14, 14, -6, -8, -10, 9, 6, 2, 0, -7, 10, 4, 8, 8, -17, -19, -1, 6, 8, 8, -6, -20, -15, 9, 4, 4, 3, -10, -3, -1, 8, 0, 8, -6, -4, 7, 4, 9, 4, 0, 2, 9, 16, 9, 4, -3, -7, 5, 22, 13, 6, -7, 0, 0, 17, 8, 2, -4, -23, -1, 1, 15, 0, -15, -2, 1, 3, 2, -3, -12, -12, -1, 15, 4, 9, -10, -5, 6, 16, 14, 8, 0, -6, -4, 19, 14, 5, -2, -16, -1, 7, 12, 11, 1, -4, -8, 2, 16, -1, -4, -11, -13, -5, 7, 11, -1, -8, -10, 1, 15, 10, -11, -7, -6, -5, 6, 7, -5, 3, -7, 7, 16, 12, 7, 2, -8, 3, 18, 16, 3, -9, -19, 13, 17, 6, 1, -15, 2, 12, 10, 5, -7, -20, 0, 3, 14, 7, -5, -19, -16, -16, -1, 10, 0, -5, -12, -18, 5, 16, 9, 0, -8, 4, 9, 13, 10, -1, -10, -6, 15, 23, 12, -3, -9, -4, 4, 5, 5, -7, -13, -8, -6, 11, 4, -2, -4, 0, -2, 4, 4, -3, -5, -2, -3, 8, -1, 6, 2, -6, 9, 14, 2, 12, -5, -6, 9, 11, -1, 4, 7, -4, 3, 8, 14, -5, -5, -8, -4, 11, 13, 2, -1, 4, 1, 11, 8, 2, 6, -13, 0, 18, 2, -1, -10, -12, 2]
6113BLJ3j9kKjJ8Mj3k2RMJ9klj5NmMJ1nj3jkK4nrnJKPmJ2k7j0J2J8jj0JpJJ1R
6157A2mjj0KKNnj4NOPPoQj8oJ6J1j2%pJLJ1oLk4JQJ3Knj4KjO%mqrK6mKjmMOKn
6206CJ3j9qK2j0mJ5joj0LJ8j0j2lj3K1%Kj2%RklMnroK1jkqNJLJ2lj3kNOQknkp
6252gJ2KMj9MPkO%j0J0j2%OMrpqRRMj4MjmKJ0poJ4kJ0j4%JlJJ0J6j8oLORjnoo
6300dNMMmPj2j3PJ1ljj2OKKNj3NlRpkKjJRnJ8oj1JnJ1NoqJ1j4J2JpkjJ5%lnj1
6348fMJ5j0%klKkQJj4QmlJ2JmoJNJNm%okONJ1ponJ0%J0j3j2J5llmrQNKJkmkJ0
6398A0rJpoJ0kONonJLOKnjpQPj4KJ4j1jRLKj1lkJ6%oj2jnRPMj5o%OrJ0kkJ%J3
6448GjJkj6OJ4lnn%KROmLmqQLJmj2NLJ0j2Rj5PloJ2j3lKOJ1j6mJ4j4J4Jmj0QQ
$$ y = [2, 5, 18, -1, -3, -1, -2, 16, 20, 7, -15, -6, -2, 17, 15, 12, -3, 2, -2, 2, 13, 8, -5, -6, -8, 16, 11, 2, -3, -2, 0, 7, 3, 15, -12, -22, -10, 8, 7, -3, -2, -9, -8, 3, 12, 8, 7, -3, -1, 1, 6, 1, -13, -8, -2, 5, 12, 6, 14, -4, -10, 6, 17, 5, 5, -2, -1, 2, 13, 7, 10, -14, -13, -5, 8, 10, 5, -9, -7, -8, -2, -2, -6, -14, -23, 3, -1, 1, 0, -4, 0, 6, 8, 3, 16, -3, -11, 11, 1, -3, 12, 11, 5, -5, -2, 16, 6, -6, -9, -22, -1, -1, 1, -11, -11, -2, -4, -7, -3, -8, -17, -23, -2, -3, -5, -13, -8, -7, -4, 8, 5, -8, -10, -5, 1, 9, 7, 2, 0, -7, 5, 7, 11, -8, -4, 3, 1, 7, 7, -3, 7, -5, -5, 1, 5, -4, -11, -19, -10, -1, 3, -11, -7, -8, -12, -10, 0, -7, -13, 1, -1, 9, -5, -5, -4, -7, -6, 4, 20, 2, -4, -1, 5, 14, 13, 8, 2, -4, 1, 5, 9, 5, 12, 0, -13, -6, 5, 2, 1, -11, -5, -3, -1, 4, -9, -4, -7, 2, -5, -7, -5, -6, -5, 4, -1, 17, 11, 0, 1, -4, 7, 12, 6, -2, 9, -5, 7, 8, 1, -1, -2, 13, 13, 10, 5, -6, -2, 13, 3, 3, 1, -2, 0, -2, 6, 7, -7, 1, -3, -6, 6, 7, 3, -3, -2, 3, 4, 9, 5, 5, -1, -3, 3, 8, 19, 12, 6, 1, 11, 11, 21, 8, -4, 11, 8, 5, 1, -8, 0, 5, 7, 8, 6, 2, 0, 10, 1, 2, -5, -11, -1, -3, 3, 8, 2, -3, -2, 1, 7, 9, 4, 3, -4, 4, 11, -3, -1, 13, 2, 1, 10, 13, 15, 4, 1, -1, 15, 15, 9, -3, -4, -9, 0, 7, 11, -4, -10, -10, -4, -13, -3, -5, -7, -6, -6, 7, 6, 7, 5, -11, -5, 9, 6, 1, -4, -4, -2, 7, 13, 9, 12, 8, 0, 8, 11, 12, 8, -4, 1, 4, 14, 2, 11, -4, 3, 0, -6, 6, -7, -10, -8, -2, 9, -7, -11, 3, -11, 3, 4, 0, -10, -2, 6]
6495FqOMkj3J2Rmp%lNj4J3J2k1LPrROqj4J6j3RlQk1kJ7mQlqJKNP%j0j0J6NMmm
6542Ej0J9pKrnRNNj0Mj3N%joPj1NJJ1pKj4NJ4j3OMJj2PNlPj4NkOJ2j4LnjJ4Jj2
6589AJP%mJ%mj0NM%Ppj0LMkJ4roqJ2LJNj1lNOJ1lj0JkmOOokM%oJ8j0kMk%J0k0
6639bJjN%JLlJ0j8QMjqmRnNrmJ6j0kJ2j1LOlJ3npj4K1k0K2qKLoj5J4J4j0rKkK
6685aMj5J2j6K0%J7j7j5QKPmLnKkJMlRrJ0%NqjnNPrJ2j6rJ4OqMj0%jlJ3llmJ4
6732A2ppkL%KQmrMkJnJ1J%Pj0LJ0qmnJJ1kOmoNj1QkKj0mNkQpKqQjKKlJ1j1ONL
6784A3j0pJ0lNkoOnL%KjljQJ6k7lQmNKpoPjRj4kJ6j0nJlJ1Kj2JLOK%NlJ0j4JK
6833EKkjJPkpnPQjppnRjLKqoLNJ3popJ2%jMqj0OJ5%%j5J3r%KkLR%pMM%rnnJJ0
$$ y = [6, -2, 4, 8, 6, -7, 5, 14, 10, 3, 3, 0, 5, -9, 4, 16, -5, -2, 5, -4, 5, 11, 3, -11, 5, -8, 1, -2, 6, -15, -17, 0, -4, 4, 1, -7, -6, -4, 1, 8, 8, -2, -12, 4, 9, 13, 9, 5, -5, 14, 7, 9, 0, -5, 4, 9, 14, 4, 8, -5, 0, 0, -1, -7, 0, -11, -6, -5, 6, -1, 1, -13, -8, 6, -7, -1, 3, 4, -8, -1, 4, 1, 8, -6, -1, -3, 3, 15, 1, 4, -1, -2, 12, 13, 1, 2, 9, 9, 5, 6, 6, 2, -8, -3, 1, 1, 8, 1, -9, -6, -2, -4, 10, 1, -5, -13, -1, 2, 3, 8, -3, -6, -1, 5, 16, 13, 3, 4, 2, -2, 4, 10, 4, 2, 6, 6, 0, 18, 8, 6, 10, 8, 8, 18, -2, -1, -2, 3, 3, 4, 7, 4, 14, -4, 4, 8, 7, -1, -5, 4, -1, 4, -5, -9, 7, -3, -5, 7, -4, -1, 5, 2, 15, 10, 3, -11, 10, -10, 12, 4, 6, 9, 3, -12, 2, 16, 6, -3, -1, -3, -1, 3, -12, 0, -16, 4, 4, 21, 4, -11, -3, -1, 6, 2, 5, 0, 2, 0, 1, 5, 2, 11, 2, 12, 12, 17, 9, 8, 3, 8, 15, 6, 18, 2, -7, 7, 13, 5, 9, -1, -1, -2, -5, 8, 5, 2, -2, 12, 5, -2, -4, -1, -1, 1, 9, 5, -4, 0, -2, -1, -6, 5, 6, 6, 13, 3, 6, 16, 8, 4, -1, 0, 11, 9, 15, 11, 5, 10, -1, 7, 5, 7, -3, -7, -2, -4, 4, -3, -1, -9, -1, -2, 0, 2, -1, 10, -1, 5, 10, 13, 3, -4, 6, 3, 8, 6, 0, 6, 1, 4, 4, 6, 5, 2, 1, 9, 25, -2, -5, 3, -1, 4, 6, -1, -7, 0, -1, 8, -6, -8, 8, -2, -7, -6, -9, 2, 4, -8, -7, -4, 2, 4, 4, 9, 6, 16, 2, 3, 5, 7, 5, 4, 5, 12, 10, 3, -2, 5, 13, 12, 5, -2, -7, 2, 1, 4, 6, -2, -8, -5, 0, 13, 6, 0, -7, 5, 5, 4, 8, 0, -10, -4, 11, 11, 11, -4, 9, 0, 0, 2, 0, 3, 12, 12, 5, 9, 13, 13, 4, -1, -6, -5, 5]
6887EoMLjokl%jMmKmQoOJnKOj1J5lMj5MJ2j0LLknLJ3lLkj4KNj1O%%pRnPqnOPP
6940A1j2N%lmQlLjo%RkOjjjlkjjNmJ2j3Pnj1J2nJ0qnKKlLp%%kJ4jJroJ8rKqJ8
6991A1j2O%JRmjj0J0j0J5Rj6MqJ2j2jLlLmLnJoJ%OomLlJ2nKoLKNmLnkLLLKj0O
7041DNPkq%%JnJJ6j2NJnkjOqJ2j0ppKLOkNko%MM%qjJ6rMLNnLmQKqKj0MjJPj4N
7095EjjPj0%J2j3MoMjmNMklNlj0RlkpJ7koOmJ7rMrJ4Kj7MLlpmJ4jpJ3nj1LpJ1
7144EmnJ2j1jj%J0j0PmjOkMJnmJPJLnmQjLKpjKj6K1JrJrONKpj0LkNmN%pRJ0j5
7196eJ4llpMjkPj2ONJpMjJ3lmrJ0%kNppJ6qj2J5ooNqMlRPj0M%qL%Lj1J5lMkon
7247gJPQNpkKQLj1lMkNkplJKNoJ%mMj2LJ0mQpkNmkOpLMMLj1MQnKjjLpJ0KpKnN
$$ y = [5, -1, 3, 6, 5, -1, -3, -6, -6, -7, -3, -7, -5, -9, -1, -7, -1, 0, -5, -3, 3, -8, 7, 4, 8, -7, -3, 9, -1, 2, 5, 3, -2, 1, 14, 11, 14, 12, -2, 0, 5, -6, 0, 0, 0, -7, 2, -3, 4, -4, -9, -3, 4, 11, -1, 4, 4, 1, -3, 5, 2, 5, 4, -2, -2, 7, 5, 11, 10, 9, 8, 5, 3, 2, 1, 6, 2, 14, 1, 8, 3, -8, 4, -1, 9, 1, -4, -2, 0, -3, 0, -7, -7, -7, -9, 5, 4, 5, -4, -10, 8, -1, 1, -7, 11, -1, 5, 5, 6, 15, 11, 10, 0, 10, 0, 15, 24, 8, 12, 4, 16, 4, 3, 6, 3, 6, 2, 5, 0, 1, -5, -4, -4, 2, -4, -8, -5, -8, 4, -1, 1, -5, -2, 0, 5, 1, 4, -1, -3, 0, 3, 6, 8, -2, 4, 9, 16, 14, 6, 6, 6, 7, 2, 3, 19, 7, 12, 13, 8, 6, 5, 11, 3, 15, 5, -2, -9, -7, -4, 2, 0, 5, 3, -3, -3, 1, 5, 5, -3, -4, 12, 3, 7, 10, 15, 10, 13, 9, 17, 19, 11, 13, 3, 7, 6, 7, 14, 0, 5, 4, 3, 10, 0, 0, 12, -1, 3, -3, 1, 0, -4, 1, 5, 3, 0, 5, 2, -8, 1, -2, -4, -11, 6, 4, -2, 4, 0, 17, 8, 12, 3, 17, 19, 2, 6, 9, 6, -1, -5, 9, 8, 1, 14, 9, -2, 1, -6, 5, 1, -4, 8, -3, -4, -5, -5, 5, -5, 2, -2, -3, 3, 1, 5, 6, 1, -3, -2, 5, 6, 9, 4, 0, 8, 7, 10, 12, 5, 4, 6, -10, 11, 12, 3, 4, -5, 1, 6, 8, 1, -9, -6, -8, -3, -7, -2, -2, -9, 0, 10, -5, 9, 6, 3, -4, 0, -1, -3, 4, -8, -2, 3, 4, -3, 1, 0, 13, 10, 6, -3, 7, 7, 5, 10, 3, -4, 12, 4, -8, 7, 1, -5, 0, -8, -4, -7, 2, 9, -1, 3, 3, -5, -2, -2, 1, -10, 5, 2, 6, 4, -2, -7, -6, 1, 9, 14, 7, 5, 7, 15, 18, 7, 4, 8, 6, 11, 9, 2, -1, 0, 2, 7, 1, 2, 2, -2, 2, -10, -7, 3, -1, 7, 0, -2, 3, -1, -3, 3, -4, -1, 3, 7, 10, -1, 3, 11, 6, 8, 7, 6, 9, 2, 12, 14, 7, 9, 4, 9]
7303IpK%OrOj0Rj1kJ1qJ3%rrJNk%jj0J0LJ0j0PJqQpQKqmJ0oOmKoNMpOj4LnJ6n
7353Aj0PJ5j6oJ6lmLj0Rk%%j1RMPj2J9rjrRLkNj2MPnojnJ6j2NkjLj4QJ0nokJJ1
7401Fj5jQmqRO%loJ1oNLMnpRjNnj1KMMnJ%j1J1Kj0oPjOJMnkj0QmQJ7j9mJ2pkQ
7452Cj2OjJ9k4QMJJ0jj4MjPoOmkNmK%mNJq%%KJjpMjJ1j6J2%oOJr%%jjM%MqNlJ1
7505Hj8J1LnNpj%JJKloNJojPooJ6oRMj1Nj2J7jjkJj4J5j1PJ8j7nQ%jJ2j4npOP
7553ClJPj4J2j6RJ4k3NjNj0M%kjJ1KpMj%jPpOKmmJNJQk2J3j3J9j6lJ0J%jJj3P
7600d%kkNmmRj4JJ5nLrNJ4j5PjMkJ1j0pQmJ2JJj0JJ6k1QMoj1ONqJ7j6LnOlnOo
7648fJmJ0JjqKLL%rJ4j4jOQJj%rkJ2%Mj5PLnRqlnJ0qmkPmMm%%LmPqJQmrJ0oRn
$$ y = [9, 2, 4, 4, 10, 1, 7, -3, 6, -5, -7, 4, -4, 9, 9, 0, -9, -8, -3, -5, -5, -6, -16, -6, -3, 7, -3, 4, 5, -3, 5, -2, 6, 8, 0, -4, 6, 0, 6, 2, 4, -2, 3, 7, 0, 6, -8, -5, -10, 6, 1, -9, -2, 13, -3, -9, 7, 4, 0, 3, -7, 2, 0, 0, 0, -11, -2, 2, 9, -3, 16, 7, 6, -3, 6, 9, 7, 12, 0, 4, 11, 6, 0, -1, -6, 10, -2, 3, 1, 0, 3, -11, -3, 7, 2, -4, -6, -5, 6, -9, -10, -2, -6, -14, -5, 1, 1, -2, -8, 3, -3, 2, 5, 9, 4, -3, 6, 5, 10, 5, -6, -4, 0, 4, -1, 0, 0, -11, 0, 2, -8, -14, -7, -8, -2, -1, 3, -2, -4, -14, -6, -10, -2, 15, -4, -8, 4, -3, -5, 3, -9, -3, -4, 15, -9, -1, 3, 4, 14, 13, -1, 3, 2, 9, 3, 9, 5, 3, 8, 4, 6, 6, 2, 7, 8, 0, 0, 0, 2, 3, 2, -5, -1, -2, 9, -7, 5, 5, -1, 5, 6, -3, -3, -3, -4, -5, -1, -1, 3, -5, 0, -3, 8, -10, 1, 4, -1, 4, -3, -4, -4, -3, -2, 0, -3, -9, -4, -3, -9, -10, -3, -9, -15, 1, -5, 4, 8, -3, 2, -10, 7, 6, 5, 3, 4, -10, 5, -6, 1, 19, 2, -3, 5, 5, 4, 16, 2, -3, -10, -4, 3, 0, 1, 8, -6, 6, -10, -1, 13, -10, -5, -6, -1, -11, -7, -7, -9, -10, 1, 3, -4, 0, -1, -1, -2, 5, -2, 4, 6, 2, -2, -1, 4, 5, 13, -9, 4, -9, 10, -6, -9, 1, 2, 2, 1, 2, -11, -4, -4, -6, -8, -3, -7, -11, -2, -16, -15, 0, -5, -2, -11, -6, 8, -7, 0, -1, 3, 1, 12, 2, -5, 3, -1, 11, 12, 13, 3, 4, 20, -1, 7, 11, 5, -6, 0, 5, -3, 14, -2, 1, -4, 2, -1, -6, 0, -6, -5, -9, 1, 2, 1, -7, -5, -2, 1, 1, -8, 6, -8, -9, -3, 5, 6, 5, 5, -4, -6, 6, 6, 10, -5, 2, 5, 0, 9, 1, -2, -7, 3, -5, -9, -11, -4, -8, -4, -8, -8, -8, -5, -9, -2, -10, -9, -1, -5, -14, -4, -10, -1, -6]
7702fJ3j2K1mj8OJ3k0OO%jlPj2J7%j4Lj4PQj0Rj1OoJ4mmj1NkMkJ0q%%J4njpJ6
7746A0qMkKmnPkNj5oK0mOo%%J%jlJ%rMjPjj0J1MpmQoMjNpLKmJ3jlOjj6J3ojKk
7799BjoMQmQj4Mj1NJ1j2JrMQkn%ROLlj3OlQKjLpjLNrJLPrlOLpj1QLPmn%k%KkL
7854ajnM%MKk%lonJ1kJ2pmJ7j3k%jNjLmMOrqJ1j2NLMNj8qMJ3JmnQpLJjNOj6J4
7905FkqNjnRJKjo%%%kJ5j1LjkPjrM%lLj1MPmkrR%mjNMJpokJ8kpLmLLjj1MRKJO
7961A1qj%kJ2qLrOj4J1j7J0LNJmLJ1j7jKMJj7J6j3J6mJmJ3k1J5jMj0QLj6MJ3J
8004A0Jj5LJ1mJ1j0Qk2P%kKLj6J1mRjpLj2J2Jn%JqRMNLj0J3KqJ0rpPPj0OoPkj5
8051gkj%Nj4QJ0%jMpLPpNkNk2J5Oj0Qj1JLQPj1LNplPpMmNrPJ4oNqnPqoPmMMj4
$$ y = [-6, 7, -5, 16, 12, -6, 0, 13, -7, -1, 5, 5, 4, 1, 8, -4, 13, 13, -1, 2, -12, -5, 3, -7, 2, -9, -3, -9, 5, 1, -3, -14, -9, -11, -7, -9, 1, -7, -7, -7, 7, 2, 1, -6, 10, 2, 6, 4, 6, 2, -3, 4, 2, 7, -8, -14, 6, 2, 8, 2, 2, 2, 3, 3, 2, -1, 0, 0, -9, -5, -6, 1, 0, -10, 1, 5, -2, -6, 2, -4, 0, -1, 4, -3, 0, 2, -2, 11, 10, 7, 13, 12, -4, 9, 3, 2, 4, 2, 1, -5, -1, 7, 3, 11, -3, 1, -10, -5, 6, -6, -5, -14, -10, -2, -4, -9, -9, 0, 6, 9, 6, -7, -1, -4, 4, 6, 5, 8, 1, 0, 3, 8, -1, 0, 3, 10, 1, -2, 4, 7, 0, -11, -3, 0, 7, 3, -2, -2, -4, -4, -2, -4, -1, -2, -7, -3, -3, 1, 3, 1, 1, -2, -8, -13, -2, -4, 8, 1, -3, 14, 1, -1, -1, -2, 3, 2, 5, 1, 5, 11, 2, -6, 5, -7, -2, 1, 5, 10, -8, -16, -12, 1, 2, -2, -7, 1, -6, -3, -2, -3, 2, 8, -8, 6, 4, -4, 1, 0, -5, 4, 5, 7, 6, 0, 0, 0, 0, -2, 13, 2, 5, 4, 2, 9, 8, -1, 3, 3, 0, 3, -8, -4, 3, -1, -3, -12, -3, -3, -7, -8, -3, 1, 2, -5, -11, -13, 5, 3, -4, -1, -5, -2, 1, 0, -11, -7, 2, 4, 5, 11, 3, 2, 2, 0, 12, 4, 7, -2, 4, -10, 1, -16, -6, -3, 2, 3, -1, 2, 13, -4, -5, -3, 1, 2, -15, 1, -12, 4, 0, 1, -3, 10, -11, 4, 3, 7, -3, 5, 8, -8, -4, 9, 10, 11, -4, -1, 10, 6, 17, 7, 15, -7, 0, 0, -2, 0, 3, -13, -2, -6, 3, 2, -5, -2, -14, -2, -1, -6, -6, -5, -13, -4, 0, 5, 8, -2, 11, 13, 5, 15, 6, -1, 6, 13, 3, 9, 3, 10, 8, -7, -9, -10, -10, -5, -19, -11, -1, -1, -2, 2, -5, -2, 5, -2, 3, 1, 6, -16, -1, 5, -5, 3, -8, -7, -4, 4, 11, 0, 3, 8, 1, -2, 5, -2, 2, -2, 3, -6, 1, 15, 9, 14, 6, 1, 8, 0, -6, 1, -3, 1, 5, -9]
8103i%OLkkNjoNOqJJKKKolJ1mmPmnOj0J0jLokO%j0J2rNoOm%lqR%nJ5k%Km%rR%
8158A%qRM%r%J4j4LRnmJ4j3J1lj2%QNJrkmkOJ1lj0rRR
$$ y = [-9, -9, -3, 0, -2, -4, 1, 0, -6, -1, 5, -3, -2, -1, 1, 3, 5, -1, -4, 7, 3, -1, 6, 2, -3, 3, -7, 3, 2, 5, -1, -3, 3, 3, -7, 5, -4, 1, -5, 1, -3, -3, -6, -14, -5, -5, -10, 5, 3, 3, 5, 1, 1, -8, 1, 1, 1, -7, 2, 6, 6, -3, -3, 11, -3, 0, 9, 4, 0, 14, 1, 12, 9, -3, -3, 5, 10, 11, 2, 0, -4, -6, 0, 11, 8, -2, -11, -2, 7]
8191G
$$ Imaginary data points
##PAGE= N=2
##DATA TABLE= (X++(I..I)), XYDATA
0@%%%%%%%%%%%%%%%%%%%%%%%%%%%kOqQj2J6j8K1k3K4l0L8m1M5n3O0o6P4q2R3j05
48e5J17j30J41j55J72j85J99k18K37k53K68k82K87k82K63k05P9J87p83K289p225
69e534M5985J99580l13608j00977L45361j28587k47064K76372R9940l12190O9815
80g0907K24231k03327p9493K71807o4140k48857J60624J52370k07963j8417K09518
91A25446r9221j71252J69004Q7767j81059K8901J47661j47880p8410K21416j8538
102H3835k16461J31812J31599k28380o77K63099j29453k03150K16620N9080k36457
113a28533J12434J81478k35867o2799K61452q6842j89359K15782O1794k72768
123a43228O7453K33385j60043j17809K00374j9368j86738J21933J25071j62256
$$ y = [0, 0, 0, 0, 0, 0, 0, 0, 0, 0, 0, 0, 0, 0, 0, 0, 0, 0, 0, 0, 0, 0, 0, 0, 0, 0, 0, 0, -2, 4, -4, 4, -8, 8, -10, 11, -12, 12, -18, 20, -21, 24, -29, 31, -35, 39, -43, 50, -55, 62, -68, 73, -82, 90, -95, 104, -114, 123, -130, 138, -144, 143, -139, 124, -81, -2, 185, -598, 1691, -5534, 40451, 240031, -73577, -174554, 170807, 42220, -204844, 71528, 171468, -140722, -70907, 153324, -50003, -129496, 142311, 78171, -170686, -10062, 142308, -65655, -84072, 125446, 26225, -145027, 23977, 111744, -69315, -40414, 107247, -40633, -119043, 102373, 83835, -132626, -814, 130785, -97595, -98272, 164827, 35374, -167776, 48844, 107924, -128533, -16099, 165379, -70488, -133287, 128165, 41323, -148036, 67746, 129540, -143228, -75775, 157610, -2433, -120242, 80132, 60764, -125974, -4041, 121030, -41226]
133d1226k9633J47882p3135j03260J49936M5511j75979K0909J47714r2184q2293
144h5758J50888M473j68382O6766J25043j19506k9907J42135p9186j20920J56505
155D2151M9464j73632N6031J31139j54266n0728J98129l9706j63778J15062O7767
166G7633j54973M3199J44549j22235q2103J47491j2781j25606J03105P6674j52023
177e7070j7175J44334m3280r3668R4596K8849j21699K6626J10522o5657o0460
188e4082R0762j0408j00118P4594Q3487j10722l3493J12607l9450q6099J05659
199C2737L9879j32098J8150J04788p6146l7834J14397l7054j12149R0850O2416
210F7936j10624J6861R8252q9402o1285J22099Q128j05044M9336N4716r2902J601
$$ y = [-41226, -70859, 77023, 3888, -99372, 50564, 96075, -79904, -58995, 88719, -3465, -85758, 65130, 69603, -98779, -32013, 93030, -26476, -56383, 85752, 6566, -114354, 42151, 91615, -82017, -25986, 105153, -49113, -99841, 98288, 58582, -105196, 9866, 77633, -77340, -34141, 110408, -11827, -93930, 53561, 40780, -84826, 18279, 94953, -57070, -74245, 70089, 26809, -66859, 27737, 56586, -65113, -38487, 72035, 6378, -54082, 36680, 26272, -73846, 748, 84235, -26487, -59980, 52627, 13177, -72922, 32737, 72616, -59482, -41332, 63456, -12690, -50524, 63873, 26819, -85330, 5520, 67936, -42688, -25827, 72425, -16977, -78262, 43837, 51965, -53079, -3743, 50973, -41929, -40328]
222d0328J03827m4751p4974P0174J8737q0530L8937P5020p5148m8951Q2633L136
234B7782o8965M8768M4808q4612j4184Q7712k3152n8201O2023J1789q7263L2540
246b0955Q1595o2907m0753P6141j9088p1637O9641M7360q8694m458P2883m5879
258f751l5850Q2759m788q6814L8359N4693o1231k910P0359m3050o0208O5477K8252
271C8297o3225J7144M6215n7216k3586P3449k337o0186L1205K7731n6882O955
283b2436O6880l2272n1473M6565J4099n2225K8477M8126n6873k9400O1369m460
295A6377m5965M2866K1256o7458M802O4106k9329l4103M9518o417n8303L8471
307d179M7069n1860j4908M8502k5985l5328N6047J6080o0980Q457M1540l4903
$$ y = [-40328, 63499, 18748, -56226, 13948, 32685, -47845, -8908, 66112, -9036, -57987, 24646, 27782, -41183, 7585, 52393, -32219, -46403, 41309, 18157, -40044, 21979, 33768, -53495, -20955, 60640, -2267, -43020, 33121, 14033, -57604, 12037, 59397, -29297, -33755, 39128, -6751, -42601, 40158, 35370, -51444, -13085, 41608, -19623, -22533, 47826, 4776, -55432, 10045, 38297, -24928, -7784, 38431, -18785, -42371, 31078, 28741, -31445, -240, 27491, -29391, -22436, 44444, 12172, -39301, 7264, 21363, -30862, -2385, 45741, -11132, -40532, 20837, 16377, -29588, 13278, 34534, -32924, -28122, 35984, 6655, -27448, 22070, 15653, -42650, -4179, 42890, -8970, -23878, 24624, -1361, -36689, 19358, 35438, -25542, -17085, 24455, -10448]
319a0448j1289N3602j5092n3149L1243L0329l8882M853M0429l5161l3468M7872
331A0839J4236m2225J4890K6607m2268r182N3522p929m2234K5491J5126m0884
343b4011J3477M5693l2115l2336L8191K747l5250K9748K6288m8813j0459M6175
355A9335j2204k6687L5639K629m8208J6267M0598k7603j4799L3214j6045l2806
367c0670L6517K2875l9553j980K9383k3592j5044M1537J762m1831J0998K4816
379A5218k4307p94L4355j8368l3383K7406J7095k8580Q980K5773l2058j8867M0648
392A3118N040l2698J5155J5410l3807K045L9655j5090k7088K4058J810k9229K2649
405A028K7519l4772j5040L2248o486k1402K7829R293l7270J738K9509j2858r986
$$ y = [-10448, -21737, 31865, 16773, -36376, -5133, 25196, -13686, -8833, 31596, -3565, -37033, 10839, 25075, -17150, -2260, 24347, -17921, -27103, 26419, 18490, -23744, 1747, 16873, -24011, -10534, 35159, 3044, -29292, 8899, 11646, -23604, 6144, 32432, -16381, -26840, 19335, 7131, -19556, 16083, 18712, -29496, -13229, 27369, -234, -15033, 18181, 2136, -30670, 5847, 28722, -10831, -12811, 16572, -7020, -22064, 19473, 21235, -20596, -9598, 15218, -9089, -9883, 24472, 6104, -27279, 127, 17222, -11358, -2378, 23395, -8663, -27530, 13118, 18158, -14540, 615, 16025, -17782, -15737, 23918, 8828, -18260, 5798, 7608, -21621, 1028, 28547, -6225, -21265, 10983, 4497, -16905, 10924, 20217, -17053, -15315, 14194, 1336, -8650]
418h650K3615r820k8883K1477K2599k4368m665K3027j6863k0239L0864J3792l1156
431i270o59K0247j6977n779L0410o638l0316J6203J4890k3892P784K8152k5709
444a554k4136L1418R173k5824J2030J5051k8593l869L0769o912j7597J7502k265
457E193k5377J7813K5162k3572j3957K1938m271j8184K0082J4133k5258p101J8867
470E468m956p045J8687l466k6326J0734K1701j6954o385K3422j1255k6688K2470
483e93K0955k3938m753J8301j5221r665K7953m23k5916J2092J1185k3584O741
496f866K9615j8697k4756K1667R273j8781R159J4084k0486q038J9445j036r377
509d794J2643j646k2027Q233K3220j1117j4616J4214J067j8638R962K0170j4242
$$ y = [-8650, 14965, 5145, -23738, -2261, 20338, -4030, -8695, 14332, -2531, -22770, 8094, 21886, -9270, -9929, 10318, -6659, -12438, 17972, 11334, -18982, -2779, 12111, -11781, -3997, 24155, -1554, -25690, 5728, 14901, -10923, 1107, 16158, -12435, -16304, 14465, 7553, -10044, 7458, 5193, -20184, -2371, 22791, -781, -14738, 7200, 2929, -15255, 4827, 18960, -6298, -13399, 5468, 512, -6533, 12154, 8688, -17638, -6904, 14797, -2157, -8542, 14880, 3625, -23063, -593, 20362, -3576, -8329, 9972, -5249, -14914, 13039, 12616, -13300, -1208, 9977, -13607, -6866, 22749, 4052, -20704, 963, 10236, -8545, 614, 14698, -5788, -13826, 5619, 4583, -4794, 7849, 6203, -15824, -7591, 15629, 4512, -10104, 4110, 5177, -13461, -3499, 16671, 2429]
522B429j3487J2846j421r300J7618M752k5848K732K1718j4139q789K5808n136
535I783l0208J4192K2075j7217m055J6034j4188j1553K2791K968j8886R278P726
548H740k1111K631K6253q068k1048J0037Q378j1719M125J3334j0182j1446R320
561g56L347n986Q841M101j8834k969K1174j425j5482J0613O197k0299J967K2917
575A3406p471j4139J1084k262j2879J7313J0292k3184j038J8750j2882q973K4514
588A2531l67k6361O681J6591j0584j115J2650j1019j1397J4543M868j0980N743
601A784O085j5624l587J9435K242j5645J419P888q229j243J4220k209j3909M386
615b987N570p717O603J1255j5924j0578J8335K514j4618J0375Q392k0479j965
$$ y = [2429, -11058, 1788, 367, -8933, 8685, 13437, -12411, -9679, 12039, -2100, -10889, 14919, 9783, -20425, -6233, 15842, -1375, -5430, 10604, -3584, -15137, 7654, 10622, -8264, 1014, 8740, -12371, -9740, 16513, 8445, -12603, -2566, 5812, -5907, -1782, 11552, 1370, -10076, -756, 2591, -3395, 5446, 9547, -9287, -12256, 8918, 7493, -7989, 2624, 8821, -11478, -9511, 13406, 5935, -8204, 2880, 618, -12261, 5052, 15344, -7840, -8878, 9872, -3010, -11983, 12531, 12164, -14197, -7516, 9075, -1509, -2624, 10026, -993, -12390, 2153, 7021, -3959, 1784, 7869, -7755, -11342, 8093, 10335, -5310, -3891, 3997, -4232, -5475, 8745, 6536, -7373, -2987, 2583, -5134, 1469, 12724, -3200, -13778, 4557, 7071, -7547, 2828, 11220, -9259, -11224]
628a1224K0710m538j0445J0836l904j4570J4197J2088j6581k395J2989j0198q042
641a1077J8597L961j7991P7R940n318n58J0396m732j1768N542P245n592J327P703
656G752r136j0431J2404R402j1252k138Q452q264o002J5368K801j4302L055N979
670C688j0742M213J5779j1078j3303J3060K893j1783R680R047j6900m636J4912
683D830k089o397R578k361j3896O962J1685p716l488P592n759q202J0692Q005
697I436r744m378N866k656l108R517K403j1886j152Q536l365k043R996l640j3891
712a0109O634J0843p975j438Q918q785q733J3852M976j1639K822N128j1347J125
726e728J5141m926j1121O989J622q565P362Q966j0763o265Q462q5m205P385J502
$$ y = [-11224, 9486, 4948, -5497, 5339, 1435, -13135, 1062, 13150, -3431, -5826, 7163, -3035, -11077, 7520, 11481, -6510, -6433, 3507, -1811, -2369, 8027, 3295, -8473, -2931, 4314, -1278, 49, 7752, -1384, -11815, 589, 9991, -1261, -3399, 5053, -3211, -9213, 6155, 8956, -5346, -2291, 3688, -7054, -2841, 12938, 1860, -11443, 1617, 4510, -7273, 2407, 11454, -5446, -10082, 4830, 2741, -3656, 5922, 3561, -10335, -3373, 8312, 596, -2892, 4700, -1059, -9261, 1431, 9436, -308, -4686, 1180, -1476, -4584, 4933, 7336, -4550, -5702, 2834, -531, -2574, 7422, 3782, -10109, -3475, 7368, -607, -2045, 6873, -1912, -10645, 3207, 8183, -3456, -634, 4494, -6853, -5728, 9413, 4487, -6634, 355, 1977, -6588, 774, 9740, -1023, -7288, 1174, 1089, -3116, 4269, 5771]
741E771j1200o82R410q40l737M610j635q872L951R864m042n572M553k013o385
756f819Q280P364r950m303P439l017l577J0519M66j3008K192Q416n503J31Q885
771G515p181r632R336N487p360K388M391r464k295J1308M17p239K745P29o707
786e562L744Q814m567o684L701Q71l834N106N154p659n324O299J975l381M128
801B781J382q976o46R156q81m508M454j696q286N635Q850o286m284N305l395m332
817e727R215L282r629n63N159m102M34Q334l652q810M109M515l862K131M332o732
833a566m805O916L169l973J170J078n938j78P808K94n538J009Q25m195K961P008
849F045m049o439L514J744l382M345L989p769l694O812O31l025M518n77q299K284
$$ y = [5771, -5429, -6111, 3299, 2459, -1278, 3332, 1697, -7175, -3224, 6640, 2598, -2974, 1579, -434, -6819, 1461, 8825, -1125, -5428, 2011, -1006, -4583, 5936, 6402, -6606, -4414, 4002, -1501, -1370, 7515, 334, -9298, 38, 5525, -1835, 553, 4944, -4520, -6815, 4493, 4910, -2329, 416, 1145, -5562, -1818, 6996, 2429, -4255, -554, 317, -3517, 1589, 6743, -916, -6240, 59, 2034, -1347, 2781, 4163, -4813, -5459, 3697, 2816, -1692, 2762, 1066, -7220, -1585, 7265, 979, -3305, 2000, -1395, -5727, 3488, 6770, -2859, -3422, 1737, -2365, -1931, 6403, 2751, -6059, -1950, 2565, -1297, 834, 5166, -1566, -6371, 545, 3714, -259, 911, 1989, -3949, -4127, 3681, 3975, -1563, -554, 271, -3924, -963, 6045, 1996, -4443, -929, 815, -2567, 1778, 5767, -2002, -5696, 1116, 1747, -1278, 3240, 2663, -5636, -3352]
865c352P641k977k489M068l692n335O888N018n952j705K966l462o76P007N2o502
881b502L81K443k222K036M840m000n886L330L699k246Q91K533m823l583N568L189
897C648l439J06O03m684R68P143j362n499K330O61m432L927O114n477n080M146
913c27P69k026M482P08o923LN034j568m73M220l342o165M166N390k907j671J836
930A206k725k029M701K444l354j171M74k107J409N290j370n937R45L411j982M35
946c60M308k884n657K879L945j692O47R12n130p51O413n0m022K624P5n770K484
963b029O999k704m731J863l6j495M031J617m678r25K282j512O05M606j677o068
979c852R62M673l93j391J414j344l163J806L547p03j214o7k694m81N498J247n426
$$ y = [-3352, 4289, 1312, -1177, 2891, -801, -6136, 752, 5770, -182, -1887, 1079, -2383, -3059, 3948, 4000, -2502, -2121, 322, -1900, 136, 4976, 976, -4910, -1580, 2119, -127, 764, 3297, -1526, -5109, 459, 3648, 209, 315, 918, -3766, -2798, 4345, 2983, -2516, -186, 475, -3957, -30, 6084, 607, -4473, -327, 442, -1584, 2898, 3606, -3317, -3314, 1720, 152, -321, 3899, 557, -5608, -1442, 3948, 1041, -630, 1206, -1519, -3548, 1153, 3597, 243, -928, -454, -2561, -1152, 4138, 2768, -3169, -2224, 1187, -795, -360, 3948, 1064, -4593, -1714, 2231, 539, 1186, 2098, -3032, -3783, 2630, 2580, -1442, 1182, 1257, -4513, -2029, 4970, 2266, -2465, -602, -638, -2133, 1898, 3515, -1163, -2088, 194, -1318, -713, 3893, 2216, -3852, -2890, 1783, 1390, -1, 1413, 69, -3094, -1288, 2259, 1556, 342, 275, -2419, -2900, 2598, 3845, -1581]
996a581l98L124k577n62N622o30o029P40K887j029J919J816n108j983M977J98
1012A386k605L249L30o041L28N946Nk941K49q51j389K747K171k039j139M47j631
1029a778nM268J070m905j966L419R69j371J722L47l924m09L498K59m49J086l168
1046a337k785M981K927m406m60K701l358j398N645Q45m579j54Q87j290K756K615
1062C590m011k338K946o3j414L161J046m669j639L579J706j011l04q27j703Q07
1078a144K546N6j258M4j250j682L075L482l252l372K360P85j683K580J603m140
1094a250j265K764k75L28K690k908m136L567L045k846K64K051l499j776M276J469
1110B499k304k31n97j678K159K872j781k131P83j00p86K115J999k466k986J344
$$ y = [-1581, -1979, 1145, -1432, -1994, 3628, 2998, -3031, -2291, 596, -433, 1486, 3302, -1806, -3789, 1188, 1386, -1219, 2030, 2360, -3681, -3353, 2593, 2598, -343, -94, -945, -2334, 413, 2584, 545, -594, -147, -1778, -1783, 2485, 3555, -1350, -3316, 103, 1072, -299, 1423, 1770, -2154, -2563, 935, 1194, 745, 1831, -1337, -4122, 859, 3786, -620, -1080, 1621, -1737, -3135, 2510, 3355, -1224, -1378, -491, -1781, 975, 3590, -421, -2759, 187, 124, -1290, 1871, 2917, -1752, -3391, 188, 1894, 883, 579, -248, -1951, -1144, 1402, 1458, 200, 244, -1006, -2688, 387, 3869, 617, -2755, -395, 390, -1293, 1287, 2890, -1250, -2515, 249, -26, 302, 2992, 84, -4052, -485, 2560, -286, -22, 2029, -1470, -3246, 1030, 2499, 195, -36, -633, -2311, -152, 2720, 939, -1192, -409, -509, -1295, 820, 2819, 353, -2633, -1289]
1126a289K244k56R8L24k341j136K824J094j416P12n63l271J680M456j756k960
1142a556J661l83j978L173K156l525j189J644j116O75L413j759l902J556J987
1157H57j173R68J446k705j999K237J706m73j36o96j777L23K578O62j742o46J59
1174d11r39P59K883n87l366K10J707o42R24J804k651k362K529J131j227J568K3
1191A353l826M51L808o31j493J269j394k152K786K275k129q61N64j444L32L017
1207A925j03k638l45P67j36J003J388j311k263L90J740K87k9K95j573j609J934
1224b78K111j219q30M57j550l29L190M87k787OP28j426J399K724k168k553J620
1241d18N60p98K016M80l236m94K315M3j47J140j479k201J518K070n63n74J2j243
$$ y = [-1289, 955, 699, 797, 1121, -1220, -2356, 468, 1562, 146, 858, 295, -2976, -1296, 3160, 1404, -1556, 105, -278, -2256, 917, 3073, -452, -1641, 3, -1113, -438, 2975, 1216, -2686, -1130, 857, -316, 652, 2098, -607, -2606, -369, 1337, 864, 728, 32, -1745, -1422, 1156, 1818, 76, -570, -411, -1350, -591, 2292, 1705, -1661, -1451, 256, -386, 538, 2342, -309, -2671, -142, 989, -238, 1330, 1353, -2473, -2022, 1786, 1155, -338, 931, -463, -2615, 171, 2446, 317, -544, 20, -1424, -1092, 1925, 1822, -816, -1161, -394, -530, 473, 1861, 550, -1713, -1323, 417, 704, 675, 970, -603, -2212, -278, 1833, 614, -216, 241, -1309, -1638, 1552, 2039, -748, -742, -14, -1440, -41, 2683, 515, -2038, -418, 142, -656, 1360, 1840, -1396, -1890, 425, 468, 321, 1461, -18, -2219, -701, 1369, 806, 232, 244, -999]
1259i99n21J957J357j241j315M2j9L87J692J72k308p29J436J64J06J421j070k646
1277b114J056K253o94k19P34k011j082K721R99j688J91m0j900J083K781j012j957
1294h99N54j21n57J869J034k047j178Q46L10M20J145o43k041n0J591N32k50J07
1312F22q40j402Q78K084k42j309k4m27n42J777J312j812j150Q46l29J52K068m11
1330A251k666K47J529m29M90J123j835j650J698J144n91L90k79j895K80K151J23
1347A081r95l4n81p79J283J567p58j459j03K85K54J039M87j444j183Q07P99R4
1365C60O14l37j948n3K052K58q41L59o24j447J245J925q96j007K29p89l6K127
1383A191K56k005j74O18n79P49J587j093j874M78R64J64N44n9j499n01J169O84
$$ y = [-999, -1520, 437, 1794, 553, -762, -720, -739, -352, 1340, 1512, -796, -1525, -89, 75, 181, 1602, 532, -2114, -1058, 1195, 501, 282, 1016, -995, -2077, 644, 1643, -45, 146, 106, -1794, -711, 2070, 1058, -899, -345, -466, -1023, 846, 1880, -167, -1345, -499, -189, 231, 1376, 733, -1308, -1358, 233, 765, 515, 622, -218, -1620, -742, 1342, 1100, -209, -233, -660, -1202, 575, 1887, 75, -1075, -229, -558, -406, 1662, 1251, -1415, -1168, 361, -68, 422, 1545, -290, -1940, -242, 902, 311, 701, 422, -1473, -1193, 958, 1081, 86, 52, -529, -1308, -25, 1542, 784, -675, -778, -493, -239, 800, 1287, -157, -1340, -533, 266, 360, 974, 637, -1311, -1364, 688, 946, 105, 464, -160, -1607, -362, 1563, 667, -340, -111, -900, -936, 1191, 1447, -558, -732, -114, -693, 56, 1643, 550, -1324, -846, 118, 282, 826, 767, -732, -1233, -64, 620]
1401F20q6M5o30j218L79J816L54j320n06J67k85O30J324n41j500K5M19J07J175
1420I75L11k023p04J596K76m46R19l88j917L79J768Rl91j00j139l25J724O30j071
1439H3j95Pq87M12J764k0j585n53N20M75N72K76p84r37K09O88L37M05j35j450
1459g98o39J638J042r54m48J75q13N7J591J81j143k63k54k17J473Q78j691r00
1477a085J002j4k31J243Q8j760l90J066M97K80n3j171n93J029P21k82Qj60r97
1496h02j93J402Q99r12j086N6L85L52O43o7j026l84M17J88O62O50j305j384J123
1515c82J204n79m7K77j137m09J350N39m65j16p39p06J318J186r97p77L91l16j92
1534e97J171N32j077q40J78N72O81J97p64q00J98O33K54J24N0p67q95P48J427
$$ y = [620, 534, 579, -51, -1269, -890, 926, 1280, -40, -546, -379, -664, -34, 1290, 749, -751, -726, -307, -200, 975, 1286, -737, -1441, 155, 431, -15, 904, 516, -1401, -1022, 746, 755, 364, 264, -875, -1200, 524, 1154, 83, -112, -105, -992, -580, 1184, 1164, -421, -974, -454, 21, 593, 869, 85, -852, -643, 45, 382, 787, 652, -798, -1437, 201, 1243, 289, -159, 16, -797, -740, 851, 1032, -111, -374, -628, -845, 628, 1506, -185, -1085, -83, -97, -328, 915, 1003, -757, -1147, -81, 416, 696, 643, -528, -1121, -92, 629, 347, 355, 195, -802, -995, 407, 1306, 394, -692, -636, -251, 101, 744, 677, -349, -733, -316, -128, 534, 1184, -121, -1505, -382, 822, 243, 196, 473, -664, -1073, 277, 816, 351, 235, -504, -1210, 108, 1294, 297, -480, -89, -405, -597, 574, 1106, 29, -811, -633, -61, 620, 817, 53, -747, -549, 84, 338, 462, 512, -255, -1150, -402, 1025]
1553A025k45j034j25m6q8R46M99r04m74J07l07O85J278q58j541N22P92k52M41
1572D21L82j140o26P88M80J73K20q57r54P35J069j71m14q1m57k67P57Q24k75r39
1592c32m02L56N34M59j8q47n15N00L88R3M72l59j320J42J380J16n14N2n53n43
1612i11J003P41n76k31j27p48M46J408k71j117j2J48r5P13M99p78o97J29K98M83
1632C05M55m65r15q3O77M99l6k41l68n05J85R89L04p69m50Pj1O31O96o76q45K85
1654c31J75M1Q33J8j311k34Q60J46R6L69p74q20O88O88j44P8k32q84J13J022K52
1675F49m33k73l69j34O09O29k19o48l43J31M10M31J68o04p19K38P11J50l2j15
1695B37p57k58R58M86m58j26k43o06N63J041l42p16N9k33m5R72K89r51l52K36
$$ y = [1025, 780, -254, -379, -425, -513, 433, 932, 28, -446, -339, -646, 39, 1317, 459, -1082, -560, 232, -20, 421, 803, -337, -963, -175, 305, 478, 698, -159, -1113, -378, 691, 520, 106, 25, -432, -699, 58, 882, 607, -332, -734, -378, 156, 615, 597, -250, -765, -265, 123, 216, 688, 329, -991, -849, 531, 647, 133, 185, -368, -911, 92, 833, 257, 26, -101, -849, -403, 1005, 734, -383, -395, -247, -342, 371, 870, 92, -605, -476, -178, 305, 760, 295, -620, -703, -26, 473, 437, 196, -172, -677, -492, 497, 801, 32, -418, -411, -422, 209, 905, 229, -616, -331, -156, -115, 718, 736, -575, -809, 51, 197, 293, 662, -112, -932, -244, 444, 300, 378, 146, -738, -625, 397, 649, 216, -57, -426, -560, 49, 678, 459, -189, -532, -401, 9, 440, 608, 4, -715, -477, 234, 384, 352, 237, -520, -778, 180, 666, 208, 82, -161, -767, -204, 837, 495, -221, -162, -395, -440, 532, 821, -130, -482, -246]
1715b46l3M53O27n76q61J67M54K18K80j30p04k99M63N58J31k86m51l15J84P07
1735C41L40n22n23L2M5L01O76j89r73q0N13J17L14K18q36n52O84L90j09K70l02
1756A55r31K64R53Kk97p3m82k18P71M77l78l22k21k27M22P11j14o49l21J48L29
1777aL33J52l59o16m0O14L67j01k02m56l22O05O42k93l76l7l77Q1R29J27q22k14
1799c66J37r2N38N11o45o35K71J70J44N29j68q80r9N61K59Q5Rn07m22L40N73J35
1821D48k21l79l02J06N40L86l15n40r0J55K20M49O6p58l77M72L21N7J98m10o72
1842f46L02O56l0n3n7o58j31Q53L19m34j59j68l14M31O77k24m99j52q1K01N94
1863D27R1n73l68J36K57K78J93k31n74j66N08M50p1k93k67k63K69O13J9m33j77
$$ y = [-246, -279, 174, 801, 225, -636, -469, -15, 203, 483, 353, -351, -650, -187, 371, 502, 216, -235, -550, -366, 341, 681, 159, -364, -332, -287, 14, 690, 501, -472, -552, -39, 78, 392, 610, -226, -778, -94, 296, 187, 457, 155, -776, -512, 441, 443, 146, 73, -409, -627, 144, 621, 243, -79, -300, -527, -105, 606, 492, -157, -478, -330, -1, 332, 484, 125, -491, -531, 83, 450, 349, 147, -309, -631, -26, 616, 323, -53, -90, -467, -386, 543, 670, -152, -366, -229, -321, 217, 728, 83, -552, -281, -111, 33, 562, 394, -486, -585, -24, 235, 320, 329, -178, -600, -260, 313, 448, 227, -152, -454, -348, 192, 578, 263, -277, -367, -212, 8, 457, 523, -235, -612, -140, 181, 238, 436, 26, -646, -344, 312, 282, 229, 172, -486, -617, 236, 555, 121, -38, -206, -520, -89, 588, 364, -135, -287, -368, -167, 427, 518, -55, -423, -287, -30, 248, 441, 210, -364, -530, -22, 428, 357, 64, -203, -466, -197, 416, 435, 2, -175]
1884a75j58m1O42M10o50m93K30J10J39M71j73p16m1L61J62K94N1p14l33N58L79
1905C13q7nk16m66R5N92K44k20l80k76R5M53L14k03m07j75J07J92L44J76n21n55
1927e86K95N17P0p1j48m63m9N56K18j38p7l88l40O00O13l59m24K8j26O2N61J18
1949D69m78k87j0J41M81K19n09m68J72K91J34J52p0m36k90L09N05R5l35l24j33
1970c72K09M11J35l21k26q1n4L44N25k84o94J5L66J13J88M9n05k48L18K13J33
1991B34J69m32n58L39O05m7k17q3k63q2M13K95j04l06k95k9M10L86j54m16j75
2012c10J19J72J95J81k33n17l9M99K80j14k16k86j24M00L32j42j45j37l41J84
2032b42O78jn45j38O0N3L34K36l71l12K7P7K48L58k60n65nL70J82M3p4k77k35
$$ y = [-175, -333, -374, 268, 678, 28, -465, -235, -125, 14, 485, 312, -404, -445, -84, 78, 372, 423, -291, -624, -66, 313, 226, 221, 5, -461, -366, 226, 470, 250, -130, -406, -311, 142, 456, 253, -154, -329, -222, -30, 314, 490, -31, -586, -291, 226, 296, 225, 77, -386, -435, 121, 339, 201, 124, -264, -604, -4, 609, 250, -174, -146, -272, -210, 351, 469, -9, -296, -306, -165, 316, 535, 26, -442, -270, 21, 155, 307, 237, -199, -489, -180, 325, 420, 85, -239, -372, -163, 248, 383, 62, -164, -245, -299, 45, 570, 286, -408, -393, -27, 86, 274, 323, -182, -430, -112, 101, 234, 403, -29, -587, -248, 357, 310, 93, 10, -253, -335, 78, 373, 269, -37, -332, -361, 49, 435, 281, -135, -310, -191, -19, 176, 357, 124, -393, -432, 67, 347, 233, 17, -269, -393, 7, 339, 197, 52, -85, -426, -242, 436, 435, -110, -248, -188, -135, 199, 435, 64, -248, -221, -144, 104, 462, 202, -363, -368, 2, 184, 227, 153, -124, -359]
2055c59J51L70J91j64l61j91J48L80K14k48l32l0Q0J33L40K4n20k49L00K51R9
2076B27O3l49l49K42L25J6M4j03m72j3N45J93k33j63j84j08L37L22j27k51j69
2097b07q0K17L72K0l69k70P8K51J96L7j66l10j12L09L13j9j97k18j89K47M12m7
2119B68k85q8j09JM11K26l74k91O1N7K23K91k41m32M3J93R9K04j6m25j74K69K36
2142A47P2n3k75k16J51L13J20j14k40j66O1K72K41q4l65j40J48J84J63L9l00k85
2164c27J82K54M8P3j61l92M9M14R1r5r0k45j31L54K80j73j69r6j48J96L84n2l15
2187f9j39J0J23K55Q7k39k40j0J77K25P9j70k73q7K24K82jj90j54j19O6L46J40
2210C23k66k20k5M3K42K40k34l16L0R7R7K55l4m26j13K56J47Q9Nk79k24J98K42
$$ y = [-359, -208, 162, 353, 189, -172, -363, -215, 165, 379, 131, -201, -231, -151, -18, 322, 346, -174, -423, -123, 128, 227, 290, -59, -408, -166, 159, 175, 219, 116, -356, -369, 176, 369, 136, -27, -211, -319, 18, 340, 213, -38, -207, -287, -70, 302, 322, -47, -317, -239, 12, 208, 245, 79, -231, -343, -34, 279, 260, 63, -155, -344, -97, 315, 268, -17, -105, -214, -213, 198, 424, 50, -241, -180, -123, 100, 391, 150, -282, -239, -46, 53, 257, 241, -184, -358, -89, 147, 219, 166, -109, -325, -174, 139, 259, 145, -95, -261, -200, 72, 313, 229, -136, -276, -128, 56, 219, 258, -42, -327, -145, 109, 157, 230, 69, -323, -274, 140, 231, 136, 46, -199, -330, 24, 304, 131, -38, -134, -282, -86, 298, 246, -69, -208, -198, -75, 180, 267, 28, -212, -222, -45, 180, 259, 89, -184, -271, -47, 235, 234, 44, -110, -229, -163, 183, 323, 57, -163, -188, -145, 97, 337, 103, -213, -183, -86, 11, 266, 232, -194, -307, -51, 96, 185, 190, -89, -313, -115, 127]
2233A27M3j7j65k56O2L16J64j34k19j32O4K06J54j0k34k02P4K07J49K1k13k79
2255b74P9K96P1l9n3k73j15L30K30j19j20j42j38K06L19q1k33n0p4M6L21R9k92
2278fj91K1J12K00J15j85k35k5J47J82J04j27k46j05J52K59N3j73j53o8L4K32
2300I7J81j77k55l0Q5J46K08j02l32l4J60Q3J25O6k89k24J78K21M9oj56k48J02
2323a52K66N6n3r9k02k4K84J79j02j94j40K7J66J71Pj92k06L4J93J40J1j56k21
2346b07qK49J45o3q5j52j33J93K86m6j94q9q9R3K80L1k13j15k3L2K18J68k05k61
2370a88M1J16J18J09r1k20q0J41J56Q7o6k25j24J34K05Q6j33j66n8K6J66J82p9
2393A37k58q8J33J15J23kk52j20J34J35N1P1j68k67R4K78M5n5r0j72j6K27J30
$$ y = [127, 170, 153, -12, -268, -206, 110, 274, 140, -79, -211, -147, 59, 213, 203, -31, -233, -159, 48, 197, 218, 5, -274, -195, 101, 172, 133, 80, -193, -308, 22, 252, 133, 13, -129, -267, -61, 258, 177, -56, -106, -180, -134, 187, 286, -6, -197, -176, -64, 136, 251, 66, -169, -194, -47, 135, 239, 112, -134, -239, -87, 172, 225, 52, -101, -169, -135, 97, 278, 101, -154, -184, -99, 47, 255, 153, -179, -213, -53, 30, 155, 221, -68, -292, -114, 107, 156, 150, -6, -254, -152, 114, 170, 117, 18, -184, -208, 76, 255, 153, -41, -181, -154, 12, 183, 190, -2, -208, -174, 19, 159, 170, 14, -207, -215, 34, 179, 116, 31, -121, -254, -61, 225, 179, -15, -104, -193, -100, 180, 211, -2, -117, -140, -108, 110, 278, 73, -188, -147, -31, 87, 196, 105, -115, -195, -54, 102, 189, 123, -102, -226, -92, 113, 199, 66, -100, -158, -132, 34, 216, 137, -121, -209, -76, 39, 162, 160, -92, -212, -78, 57, 108, 179, 11, -256, -162, 116, 161, 106, 16, -156, -172, 55, 185]
2416A85p9r6j36o4J80K39n9k11j10K8J16J37K8j27j89k1J48J79J4j44j84k7J88
2439eJ54k8r3r4j17P6K64O3k14j24j1N2J99R8j81j61K7K9R6K02r4k87l4J58J18
2464I3N3m1j86j01J07J41P5m3j60j37P1K23Q9j14j48p1N6J07J40rj99j31Q4J54
2488E3R7Mj77j68J13J57L2J0o7k06l4K46J34r5j04j15l5J61J75p3j25o3p6Q5K26
2513A55L0k02j46L1J06J29L5j07j45m1J13J48M5r6j67p8J49J85lj38p1n2L4J71
2537H5J18j47j68oN7J38J19j23k00jJ07M5J12Qk25j22J33J48N0k9j52j32Q8J64
2561F7N7n5r1j21NJ91J19o1j65q3M5J28R6%j45j35N0J37Q7Kj00j79J1K03P5n5
2587H3n6j22p4J56J71n4j13p8o8J00K11j5j74o7j1N3J48P8j40j54RP8J18Q4j00
$$ y = [185, 106, 10, -126, -190, -10, 229, 170, -41, -151, -123, -7, 130, 158, 31, -158, -179, -31, 148, 162, 18, -166, -193, -5, 149, 121, 28, -66, -183, -107, 157, 220, 6, -118, -129, -77, 122, 220, 39, -122, -95, -66, 30, 232, 138, -149, -183, -25, 93, 146, 105, -81, -182, -75, 66, 141, 98, -62, -199, -128, 95, 184, 70, -78, -149, -93, 14, 154, 145, -54, -185, -101, 53, 150, 154, -23, -191, -78, 79, 111, 121, 54, -152, -186, 60, 194, 99, -5, -120, -155, 6, 181, 108, -17, -80, -156, -71, 155, 185, -17, -163, -132, -26, 103, 138, 31, -114, -155, -42, 106, 151, 55, -112, -190, -41, 144, 141, 3, -68, -120, -86, 85, 203, 56, -112, -118, -61, 77, 196, 73, -127, -128, -21, 24, 136, 144, -81, -203, -70, 78, 128, 99, -53, -185, -97, 67, 124, 69, -22, -143, -138, 53, 172, 111, -54, -137, -92, 36, 132, 132, -13, -148, -98, 39, 126, 128, 28, -151, -140, 63, 138, 83, 27, -95, -169, -13, 158, 104, -9, -87, -155, -55, 156, 141, -33, -100, -111, -58, 90, 168, 28, -126, -117, -39, 79, 163, 63]
2612F3j70k8J09J20L7p1j13q3O9J64Q2j24j18m3L8J34J15r6j69k3M9P7J20j6k04
2637h1q7J23Q2N3J9j45j47J01J46K3j2p9j44J8J87R2p8q0j09J5J25J15l0j16r2
2662a01mJ10J14J2j29j27J2J34Q5ko7j34m7J36J33l1r5p5q6J11J82j8j36n2l2
2687a07K2J64P0j31j29J0N9J02Q3q7j49KO5O4R0l3j53p5Q3J24N6o5j12n7M0J14
2713E0Q7n8j26n9K8R5J21n6j60n7Q3P3N1M0j37j27O7J30M5Kr4j34L0J62M7l9m2
2740B2r5n5J35J26k6j03q7j7R6J27lj08r4j3Q0R5M8q7j49j4J14J06pp3q3o2O9
2767e8J35K5q7p8n4M1J62M0j18q3RJ0P7J22p1j54j0M9Q3Q7l6j41o1Q4O2N8jj11
2795a9r9L7J25O0l5j06o6L3Q4R6l0j19o1QQ8R9J2j37j05O0Q7N0K3o6j25mJ28Q5
$$ y = [63, -107, -135, -26, 94, 131, 60, -53, -136, -67, 97, 179, 55, -63, -106, -68, 66, 181, 85, -84, -107, -58, 19, 139, 123, -81, -168, -45, 37, 90, 109, -36, -183, -82, 64, 87, 75, -4, -148, -130, 57, 149, 71, -9, -118, -103, 22, 137, 107, -9, -101, -105, 5, 119, 131, 2, -125, -113, 21, 106, 104, 37, -97, -144, -8, 125, 94, -1, -76, -162, -51, 131, 113, -23, -75, -107, -85, 79, 149, 18, -111, -101, -42, 60, 143, 56, -93, -91, -26, 38, 128, 95, -58, -133, -50, 74, 130, 65, -47, -104, -64, 50, 137, 79, -47, -106, -78, 17, 138, 82, -78, -135, -52, 21, 72, 112, -25, -152, -85, 45, 90, 92, -2, -136, -106, 56, 103, 64, 22, -73, -128, 7, 133, 107, 4, -83, -100, -4, 123, 120, 12, -82, -95, -15, 80, 128, 41, -108, -122, -8, 98, 91, 18, -65, -127, -58, 77, 102, 15, -63, -117, -76, 86, 126, 8, -75, -66, -56, 21, 143, 72, -82, -92, -43, 40, 127, 91, -50, -111, -27, 35, 93, 92, -19, -118, -81, 44, 104, 69, -37, -103, -70, 14, 110, 80, -39, -100, -92, -4, 95, 107, -30, -135, -75, 12, 62, 85, 19, -106, -110, 18, 103]
2823A03k0m2j24m0J36R9l5o7m8o8Q0J35Qj12p3j5N6R8L5r3q7l6O7R3N4o5j27m6
2851a34R4J00L2p0o4o2K7J29N0o7q2n0K1J11R7o6j25pL4M8Q6j4j41m2N6O7N8O
2879I2j08r8O1R3K7Jo8j12J3J22O8k8p4p8J1P4Q4Lq9p5OP4Q3J5p8j11J8R1N0L
2909G0k8r5m6R8R5lo3p4n8Q6J17j8p1m4m8K0J13O3q3r3j3L3P9N5n6r7j7L5P5M2
2939G4rj03o4N0R7M3n8n4m5OQ8Q1m6q3m0J7N5J02k1j38k9M5M3N3L1j04q2L9P6
2968B4M1J7q2j08K8R6L8qk9q5l2R6R5j5q2o3lN8P9J4p2n8j2M7P7K2k9j19k9R6
2998BO7ol5o1n7O2R5Om3n7n8K9J17K3q4m8j6KQ5O8n4r2j8K7O9N1j4r4m7N3N2M8
3030G2op7o1J3R5N9l8o8n9J8O6P0k4p1n9J8N0O9J0q8p6M4N4K5K2m8r6OQ4M5ll1
$$ y = [103, 83, 41, -83, -123, 13, 112, 77, 10, -38, -106, -26, 109, 117, 5, -68, -83, -27, 71, 106, 13, -74, -110, -43, 50, 104, 39, -88, -134, -40, 60, 92, 22, -42, -104, -77, 52, 102, 35, -47, -97, -76, 35, 132, 66, -59, -66, -32, 16, 102, 88, -53, -95, -39, 28, 86, 92, -16, -114, -53, 40, 67, 68, 0, -112, -99, 23, 91, 63, -11, -89, -78, -4, 80, 83, -6, -81, -75, -1, 82, 97, 19, -92, -74, 17, 67, 70, 42, -53, -99, -1, 94, 91, 28, -46, -104, -18, 99, 81, 10, -34, -82, -62, 51, 114, 31, -62, -75, -42, 37, 92, 36, -61, -78, -43, 32, 74, 65, -38, -102, -52, 45, 88, 30, -24, -69, -63, 25, 106, 60, -23, -63, -46, 9, 111, 90, -48, -77, -32, 11, 64, 95, -9, -91, -52, 24, 65, 82, 0, -108, -80, 16, 54, 46, 17, -68, -100, -4, 91, 76, -6, -69, -72, -14, 65, 79, 7, -51, -63, -16, 61, 83, 54, -65, -94, 2, 69, 63, 28, -33, -90, -28, 67, 73, 30, -27, -85, -56, 61, 84, 0, -48, -64, -62, 23, 91, 37, -55, -73, -46, 23, 74, 60, -34, -81, -28, 24, 72, 66, -11, -72, -59, 36, 95, 57, -11, -70, -52, 14, 84, 60, -11, -70, -52, -2, 67, 77, -11, -87, -43, 11, 36, 58, 10, -86, -80, 4, 49, 46, 15]
3062A5q2k5Q1O9on1m7k5N4P8J0o0o5j2M4R1J5o3o9pM2O4J8l1p2m9N0Q0J4l9n4
3093c2m2K8Q7L2p1l9k7mQ3O6n1q3j2J7N5P8j9r3k8K6L4O0Lp8n3K4P2L6rn4o1R
3125d6O8N2j0o2n3kM8O2Op8n7K4L1N1K1n1p9PN7N3Rl4p3k0P3O0j2k9m6l6M2R0
3157F6%n1n1l0L9Q6J1m8n4j0K5M7L7k8p7k0L5O8J4l2m9m3J9P2J8k1m4m9J5P2M3
3188F0l2o3j4MM1O8j3o7l4J4M2O1%p5n3L6L2M8J4o2n5MM6N5lm4p0NN3M4On3m6
3221e1j1L5N6K9n7p1J1M3N0J5l9o0j4N3L9K7k5o3l7O0O7rl2l2m0K9P4K2m9l8k5
3252d3PO7M8n8o3nK2L3M4k0p9k8L0M3M1j1n6l2PN8M4k0m1l5j1O2N4j7o2k6J5L4
3284BM7Po5m9K2M1L8J1n3o8K6N2L3Pl9o7j4P2M2ml0p0j1N2O8qm1l8j8L2N4J9l2
$$ y = [15, -67, -92, -11, 58, 52, 1, -46, -71, -17, 61, 71, 11, -54, -66, -22, 69, 84, 21, -48, -55, -13, 51, 69, 38, -34, -83, -33, 47, 61, 22, -32, -74, -46, 41, 73, 2, -37, -64, -68, 15, 81, 30, -53, -65, -48, 7, 85, 66, -27, -55, -29, 5, 65, 68, -10, -63, -39, 33, 69, 60, 6, -55, -46, 22, 74, 64, 2, -51, -53, -5, 57, 63, -15, -72, -48, -17, 34, 55, 4, -75, -68, -11, 42, 51, 17, -56, -76, -3, 57, 45, 16, -30, -66, -24, 66, 66, 15, -36, -66, -27, 59, 70, 22, -32, -42, -17, 30, 67, 39, -38, -58, -23, 45, 59, 27, -22, -65, -46, 26, 44, 23, -21, -70, -55, 17, 60, 28, -35, -49, -45, -4, 64, 51, -16, -50, -36, 6, 67, 67, -8, -61, -25, 7, 55, 69, 7, -48, -44, 2, 57, 54, 10, -60, -55, -2, 42, 48, -5, -51, -62, -27, 29, 58, 1, -70, -59, -16, 34, 49, 10, -50, -64, -11, 28, 55, 30, -33, -70, -10, 57, 48, 16, -16, -56, -27, 47, 69, 20, -18, -43, -36, 31, 79, 21, -42, -47, -25, 8, 52, 32, -47, -75, -45, -2, 39, 28, -28, -60, -53, 5, 49, 29, -12, -47, -58, 4, 58, 41, -21, -47, -32, 2, 49, 56, -9, -58, -36, 5, 43, 54, 1, -67, -41, 11, 44, 51, 12, -55, -69, 3, 45, 41, 11, -59, -70, -18, 50, 42, 1, -37, -55, -23, 31, 50, 18]
3317A8o4qN2L3K4l6l8l5L8N8J2j7m8m4K0Q3J0m1l6j9qO9L9l4o4j5KN9N0k2p3k8
3349f3J9L0M3J0o3m0J7N0M1kl9n3MN4M2km0m1JM1M7Po8k6J0L1L7Jl6o2J5M6J4
3382B5K9l4p8oN7L5Qk9n5k6M6O4Pm3l7k0K7P7Ol6m7k7L6N1L1k1o6k8M3L7K7pn6
3415a0m4L7N2R%m8m3PO6L5l5l3m1PM7M8k7n5k3J4L0M3Jn8l0RM4K7Rm2l9PN2L3
3449D9Ll8n7mO1L6ll3m5j2L6N6ll3n8%L3N9nl0n0nK9L3K1j9o6k0N3N0pk1l4k6
3483e0J4P2Oj2m2m4K8O7K2k9m4j5RL2M1k1l3m1J1N9K6j9m4m9K3N2K1j7l8k3pL8
3515gL4Lm6k5lL5L8J6o2j9J3J5M0J7l8n6J9K2L4J5k3m0j0L1L7Mk0l7k5K4M4J7
3547D7l0m0j8K3L9K1l5l8k2L4L6Rnn7j3L4L9Kj1l3k3J8M5J1kl9l3K6L1L1j6m1
$$ y = [18, -46, -54, -2, 31, 55, 19, -19, -54, -16, 42, 54, 37, -11, -55, -35, 48, 58, 17, -19, -38, -46, 23, 62, 28, -36, -51, -49, 10, 60, 38, -35, -63, -44, -14, 29, 39, -24, -64, -47, 3, 44, 42, 3, -50, -46, 8, 50, 48, 8, -33, -32, 9, 56, 63, -5, -31, -21, 10, 47, 48, 12, -50, -35, 11, 25, 54, 20, -58, -64, -7, 28, 36, 7, -48, -74, -28, 36, 43, 0, -37, -57, -30, 47, 53, 17, -30, -57, -21, 30, 61, 40, -26, -54, -11, 26, 53, 46, -10, -54, -17, 35, 44, 44, -4, -47, -40, 26, 61, 26, -7, -48, -41, 6, 54, 27, -28, -51, -37, -7, 36, 37, -21, -51, -42, 2, 29, 38, -4, -43, -36, 16, 49, 52, 14, -43, -47, 14, 50, 47, 14, -31, -43, -7, 49, 46, 13, -45, -45, -12, 47, 42, 12, -38, -43, -14, 19, 40, 21, -45, -65, -12, 38, 31, 10, -24, -50, -36, 36, 42, 30, -12, -56, -28, 39, 61, 32, -12, -27, -18, 14, 55, 34, 1, -40, -29, 30, 56, 37, -7, -56, -33, 19, 40, 23, -15, -38, -45, -7, 27, 30, -16, -41, -44, -9, 29, 45, -17, -36, -23, -8, 32, 49, 11, -45, -26, -4, 30, 45, 22, -18, -28, 3, 40, 44, 24, -13, -38, -14, 30, 47, 17, -23, -41, -18, 21, 42, 7, -31, -53, -19, 17, 26, 21, -36, -49, -15, 24, 26, 15, -18, -41, -23, 22, 33, 31, -8, -41, -15, 16, 47, 31, -10]
3579a0k2QM6K9rm6l1QM0L4rn0k6mM4K9pl1k8j4L6M9j7k3l4nK5L9J4m2k7kK5L0
3613A9J6l1l9J1J8L0K1l9k7j0K7M1Ok2n1mJ9L0J5j8l9j1J9K5J2j1l7k2J4L4L9
3644C5l4l1j4J3M1J5rk4k9LM7K5j1l3k4KM4K1j3k7k9KK9L2j4l4l1K9QM1pm1mj5
3678c7K1K1J4k5l1qK2L0Kk2j5qJ5L2J0j6l9PJ1M0J5l0k3kLJ9L4j7m0j3J8K0J6
3711B4rk5k0J2K4Qnk2k9J1K9J1j5j6j0nL7K5j0l6j8MK6M5k4k8j1%L5K2lk0l1k
3745b6L3K0k0ll0QK3K8Jm0k2pK3L0kk3k2qK2K1mpk7lPL2J1k4k4J0K1J6Kj6j2r
3781b1J5L1J8k9j7j4J5L3Kj2k3k2J6J5J6ok4j4KJ4J5kk6j5J4J5J7%l3j1QJ9K0
3814A6oj7k4J1J4J4Jj8mj0K4K7mj5k2J0MJ4J6k9j4j0J5K9%k4k6OJ3J3%rj7j1R
$$ y = [-10, -32, -24, 22, 51, 42, -4, -35, -27, 13, 47, 38, -12, -38, -42, 2, 31, 24, -7, -35, -49, -13, 36, 19, -4, -38, -43, -18, 21, 35, -7, -34, -36, -11, 19, 35, 4, -35, -24, -6, 24, 45, 6, -21, -31, -4, 37, 43, 21, -30, -34, -15, 15, 30, 12, -27, -38, -19, 6, 18, 7, -30, -52, -38, -4, 35, 1, -30, -44, -31, 10, 25, 16, -8, -37, -34, 13, 38, 27, -6, -30, -28, 16, 37, 24, -3, -32, -30, -1, 31, 17, -17, -48, -19, -11, 30, 23, -18, -22, -37, -16, 5, 19, -6, -37, -45, -23, 7, 9, -13, -28, -36, -21, 11, 21, 5, -34, -27, -16, 24, 39, 9, -14, -16, -13, 6, 40, 23, -17, -30, -12, 8, 24, 15, -10, -30, -18, 6, 14, 9, -13, -42, -31, -2, 9, -6, -22, -32, -37, 0, 25, 15, -21, -39, -35, -9, 36, 12, -16, -27, -27, 8, 30, 27, 7, -24, -26, 7, 27, 7, 4, -26, -18, 5, 33, 34, -6, -28, -35, -12, 18, 16, -7, -29, -37, -15, 6, 2, -5, -32, -35, -28, 4, 15, -9, -33, -23, -2, 14, 16, 0, -12, -21, -6, 25, 43, 14, -3, -17, -2, 31, 33, 21, -2, -24, -8, 7, 23, 17, -7, -21, -19, -5, 10, 8, -18, -33, -19, -4, 13, 13, -20, -31, -23, -4, 16, 10, -7, -31, -20, -6, 8, 9, -9, -13, -23, 1, 28, 24, 9, -13, -3, 1, 15, 31, 2, -12, -22, -7, 22, 22, -2, -28, -22, -9, 4, 4, -5, -22, -33, -24]
3849b4J4K4j9k6lK2K1%ok4OkK8Kmk1j2K6mJ1Kj9nQK1Kj2j0j8NK4mMk0j5RJ7JO
3888Ej8k3RJ9J5rqj5kJ7QOj1j5jL0J1mj1j1%QK0kpj3j4K3QOnk2KoJ3kroqJ1QL
3930@j7mJJ2lK1j7kplK3jOrrKJ6Oqnk0K3J2j0J7l1mJ6NQmj9j6K0MQMj9j5J2RJ1
3972A3j6j3rjJ2K2j0mj1L%J4J3j7Jj0QK1%pj9J1NMOj4j2JOJ1Mj2%q%PJ1k3%Jk
4013a4OMPj5OnjJ0kkrOMORj6JOQMKqpKkJ0Jj7K0j3nJ2KrpLjjPnj2lJ1Nljj1J4
4061crQLn%pMQOnj3J5LpJ9qj0KrJ1J0pj2j4J7PJ3j5j9J3MMj0qKMokJ1JjpjKQJ2
4107Ij5jj1J6OJQq%LjK%lj0QJ1qoPj0%J3pLj6KkK%MjqOoJ1j1J5k0jJ5PkmJLKL
4155GqJ3j0oPNPj1%K%krJ1jj1rMJ5j3jjjJ0Jj2Mj0kMNJ1Mj4kJ2Rj4J3nQj1LNL
$$ y = [-24, -10, 14, -5, -31, -34, -12, 9, 9, 3, -21, -15, -17, 11, 13, 9, -12, -24, 2, -2, 9, 11, -8, -13, -5, 16, 18, 6, -4, -22, -17, 7, 3, 7, -13, -28, -19, -2, -1, 5, -13, -36, -27, -8, 7, -2, -10, -25, -27, -10, -2, 4, -7, -22, -23, 7, 18, 14, 3, -8, -8, 0, 20, 18, 11, -2, -16, 7, 15, 21, 16, -6, -4, -10, 3, 1, -8, -14, -22, -11, -3, 0, -17, -21, -20, -8, -11, 10, -7, -9, -16, -19, 4, 3, 9, 0, -9, -7, 9, 15, 7, 2, -18, 5, 17, 7, 24, -7, -11, 5, 10, 18, 14, -5, -21, -1, 3, 11, 15, -4, -19, -7, 2, 13, -3, -16, -25, -26, -14, 8, -2, -6, -17, -14, -14, 0, 13, -4, -3, -13, -5, 16, 16, 9, -10, 1, 6, 10, 16, 2, -10, -9, -3, 8, 12, 0, 0, -8, -8, -1, 10, -13, -13, -12, -14, -8, -4, 3, -12, -6, -11, -12, -2, -4, -6, -15, -9, -5, 1, 10, -6, -5, 1, 9, 13, 15, 7, 0, 2, 0, 10, 11, -6, 14, 1, -4, 8, 10, 1, -6, -3, -4, -5, 2, -3, -15, -18, -7, -2, -5, -6, -17, -3, -12, -4, -1, -6, -6, -13, -9, -1, 5, 0, -13, 2, 5, -2, 17, 9, -1, 1, -8, 3, 13, 6, -6, -20, -3, 4, 17, 2, -17, -4, 0, 4, -6, -14, -12, -8, -14, -16, -5, -4, -5, -12, -13, -11, -3, 9, -6, -7, -18, -2, 4, 5, 13, 5, 5, 8, 7, 9, 9, 6, -4, 4, 15, 7, 1, 8, -2, -2, 11, 4, 7, -9, -7, -9, -7, -7, -3, -4, -12, -6, -12, -1, -12, 3, -17, -18, -3, 4, 2, -2, -1, 2, 4, 7, -1, 12, 2, -4, 3, 8, 15, 4, 4, 6, 6, 4, -5, 6, 5, -6, -15, -11, 4, -9, -10, -11, -12, -2, -1, -13, -9, -19, -21, -17, -12, -1, 3, -11, -13, -1, 8, -6, 7, 2, 10, -1, 2, 7, 10]
4200A0j0kJ3jkj0NKNKjopJ1j3NNr%j6%J5kNj4J4npQJ1ok1J4JJ1Kj2MklK3pj1k
4244cNJ0KPj3jnLJ1jplj0%NNqRj7OJ2llnmKPPjolmOMPqQJj2NPoojJ3pJ6j0lj8
4294a0J6J1j2m%pNMj0Pj7J3j3J7Mj4lnRkJ0Jqj1J6J5Mmj0kOlJ4jrlJ5qLpnj3J4
4337COPLk9JmMRLqqkJ6j0J2j0j9J0K5q%mnKJ4JlqJ1k0J4J9nnj7J4oOKqorK8pn
4382DlpkmRJ0j4j6MLJ0J6j7kMjJ0J4k0j1MPJ0J6j3j0nJ1J2Mj0qpkK0nkmLj0QJ1
4424A7j4j3%J2rJ4jk1JkJ4J2kj2rkJ8Mjj1q%J2K2kpj0k%K6rj4pQkJ2Mpk2jJ3J1
4466A2Nnk1lKK1l%j2j5J1PJ4k4%rJ1J7JJj4qLJ2J0jj5jJ1KJ1kmk1JJ0J3rLk2k
4507a3J2K2j4oj5j1J8J4J2k8opK3RNj1j2J1rJ2J4j8j4MK2NKj1qLRJ0jj1j9MjJ0
$$ y = [10, 0, -2, 11, 10, 8, -2, 3, 5, 10, 12, 11, 5, -2, 9, -4, 1, 6, -3, -3, -19, -19, -4, -6, -1, -15, -1, -6, -13, -5, 6, 0, -21, -7, -6, 5, 7, -5, -1, -3, -6, 17, 10, -1, -3, 2, 12, 14, 21, 8, 7, 2, 5, 16, 15, 8, 5, -5, -5, 0, 5, -3, 6, -11, -5, 7, 4, 1, -4, -8, -6, 1, 8, 7, 1, -2, -6, 0, 4, 11, 3, 11, 12, 0, 5, 12, 6, 0, -1, 12, 5, 21, 11, 8, -10, 6, 17, 5, 1, 1, -6, -1, 3, -7, 0, -17, -4, -17, 0, 4, -10, -13, -18, -9, -11, -1, 0, -8, -19, -3, 12, 16, 12, 2, 0, 6, 3, 17, 16, 7, 4, 19, 11, 14, 7, 2, -11, 3, 9, 16, 19, -10, -9, -13, -9, 0, 3, -5, -13, -15, 1, -9, 3, -7, -26, -16, 9, 1, 1, -3, -8, -6, 8, 9, 6, -2, 9, -11, 3, 22, 17, 12, -5, 9, 3, 9, 11, 3, -3, -12, 16, 9, 4, 1, -6, -8, -12, -3, 7, -7, -23, -19, -16, -6, 10, -7, -9, -5, -6, 4, 18, -2, -13, -9, -2, 8, 24, 11, 1, -4, 7, 19, 23, 13, 5, -2, -4, 16, 11, 9, 5, 8, -2, 6, 17, 3, -10, -10, 2, -7, 7, 6, -15, -14, -16, -2, 10, 8, -4, -13, -15, 3, 7, 6, -5, -13, -13, -1, 21, 19, 12, 2, 0, 0, 26, 17, 3, -4, 4, 2, 14, 18, 11, -11, -12, 1, 12, 17, 12, -9, -12, -10, 11, 8, 8, -4, -19, -8, -1, 13, -11, -11, -20, -9, 8, 9, 10, -4, -12, -9, 3, 13, 12, -3, -4, 7, 9, 20, 18, 14, -7, -6, 4, 17, 8, 11, -11, -13, -1, 21, 7, 1, -14, -25, -7, 7, 19, -9, -15, -22, 1, 10, 15, 4, -8, 3, -6, 6, 20, 2, -12, -8, 14, 19, 21, 10, 2, 5, 14, 24, 23, 12, -7, -3, -4, 6]
4545FQnj4pNPPlk0nJ3J6Nlk0j1J8J0Qj2j2qJ4J8Jmk1LmK4KKj9j4J8OJ0Nk8j5K1
4586BMJ0lpj5oNJ7Mqj2njK1Mrj0LrK8kjj1nJK1qj0kqJ9J2Lnk3JJ2QQok5nRJ1L
4631A0j2j7JOJ7Rkl5LJ2OJ7rqj4LJ8J3nj8nJ0J8%pj4%JNJ6Jj4nj7K7J4%k5j9J0
4671iNK4j2nk2OOJ3rPk5pK4J0Qk0j8NK5%Lmj2j0J0J4J4pj7rJ8J8J5j3k1j2OK0
4709A9jKk7j4J6J0J0pj4j7RJ1J7qj5j1NJ8J1j8j2pJ2QK2plk4J0J8J0%ol3J1K1
4745A6K0j7%l2J7OJ1kk0j1LJ1NJ2k0j5pJ5J3Kj0j4j2J8J2J2j2k3PNK8Lj8lj3J2
4781aJ8J2k0j8RlJ9J7j8j8JNNJ7j6j9MQKJ4j7jj6mJ9NNl7P%K6Lmj1mNOK3nj4j7
4822a3JK5J7rj0k5RJ5RMoj6jJ8Noj0k2j0K5J3Mk4j4kRJ8Kj2j2j2J8K2rQj8rPL3
$$ y = [6, 14, 9, -5, -12, -7, 0, 7, 4, -16, -21, -8, 8, 13, 10, -10, -21, -3, 7, 15, 3, -9, -17, -3, 15, 16, 12, -9, -6, -10, 14, 16, 18, -1, -15, 3, 9, 19, 24, -4, -19, 2, 6, 16, 13, 6, -9, -15, -10, 7, 11, 3, -9, -14, -15, 6, 10, 1, -9, -6, -15, 13, 11, 10, -1, -6, -5, 16, 8, -2, -4, -12, 7, 19, 22, 17, -6, -5, 7, 15, 23, 17, -8, -13, -4, 7, 10, -2, -19, -18, -12, 5, 14, 12, -23, -20, -8, -2, 15, 6, -2, -16, -13, 5, 18, 13, -5, -10, 0, 18, 18, 11, -3, -3, -2, 3, 19, 20, 6, 1, -16, 11, 25, 25, 0, -19, -9, -4, 20, 8, 3, -19, -13, -7, 6, -3, 4, -21, -28, -4, 6, 14, -6, -24, -19, 6, 6, 9, 5, -7, -17, -7, 7, 21, 14, -3, -12, 6, 24, 39, 26, 5, -7, -1, 19, 18, 20, -7, -21, -5, 5, 15, 8, -6, -23, -14, -3, 14, 6, -9, -20, -15, 3, 14, -4, -16, -23, -11, -3, 19, 12, 9, -15, -5, 13, 23, 23, 17, -16, -5, 16, 36, 19, 19, -13, 4, 10, 21, 19, -1, -12, -9, 2, 7, 19, -1, -16, -23, -8, 5, 7, -3, -17, -29, -11, 1, 13, 1, -22, -15, -10, 18, 21, 3, 0, -13, -1, 17, 29, 9, -9, 0, -3, 16, 33, 15, -3, -2, 3, 8, 25, 9, -10, -6, 2, 4, 18, 1, 0, -16, -20, -1, 4, 9, -28, -21, -21, 5, 8, 4, -7, -11, -6, 0, 23, 18, 4, -13, -12, 13, 30, 21, 11, -14, -5, 10, 19, 23, 17, 1, 0, 18, 23, 17, 7, -15, -25, 0, 13, 17, -7, -21, -23, -14, 4, 6, -6, -18, -30, -12, 10, 1, 9, -9, -18, -11, 22]
4861B2Rk0j6j0J2J2K3ql9%K0J7%mj9j5J3J3NRl5j1PNK7k3j5j1RK4J1nj4j7PJ2
4897eJ3Kj2j3OJ4J7oj9j3J4J6J8Jl2j1%J4K7j1qpj6K0J6j7j3mk3K2J8%j2k3MJ3
4933a0%K5k4k0jJ4J7Qpj6KNJ8NJk0qMK6J2j6j8j0J6J4Pj2j9jkK1Okl4nJ0J7J5
4971A8j2j6k3J2J6NRj3k1J1QK5j8omqK4J4Jk2j1MPK6Rj7l6J7J1J7o%m1KK3NLj4
5009aj2lMK4Jj4j8pJ0K1Qqk1mJ0J9Pj1pJJ1kK5j4k9mJ6K4%j0j5qJ0K6kJk9j4J1
5048dQQkk0qMMK0lj9j0%K2J7oj1k3MJ6K4nrk0lK4J1Mj7j6kJ1K2%k0j1nJ2K1%l
5088A5l0mKL0jj0k0nJ5J5Nj8plPJ0QQk6qJK6J1ok4qJ8J8J2j6j8MJ0KK1pl2j7R
5127a3J0L0k0j8qOJ9Qj3j8ljJ3J5Lk3rKJ2J1NMm0J2K2NJ2j8j3NJ2J3%j2j1jQK0
$$ y = [22, 31, 11, -5, -15, -3, 9, 32, 24, -15, -15, 5, 22, 22, 18, -1, -16, -3, 10, 15, 24, -11, -22, -15, -10, 17, -6, -21, -32, -23, 1, 12, 7, -7, -24, -17, -5, 8, 10, -2, -15, -9, 5, 22, 16, -3, -16, -2, 14, 32, 33, 1, -10, -10, 4, 31, 20, 12, 5, -11, 9, 25, 8, -5, -9, -32, -10, 8, 8, -4, -27, -23, -10, -10, 15, -9, -29, -30, -16, 1, 9, 2, -14, -12, -7, 11, 16, 17, -3, -11, -7, 19, 31, 15, -3, -13, 3, 17, 24, 12, -7, -8, -10, 11, 17, 15, -19, -24, -14, 3, 18, 6, -10, -33, -21, -5, 0, 9, -4, -25, -14, -6, 19, 1, -5, -9, -17, 7, 21, 22, 0, -11, -7, 0, 26, 35, 18, -18, -1, 10, 27, 21, 21, -20, -18, 5, 10, 13, -1, -13, -16, -12, 12, 13, -1, -19, -26, -16, 5, 13, 5, -16, -20, -10, 9, 16, 5, -2, -1, 10, 8, 33, 19, -10, -14, 2, 26, 26, 16, 1, -7, 3, 29, 27, 28, -1, -15, -4, 4, 12, 10, -10, -18, -14, -10, 10, 7, -12, -22, -22, 0, 17, 11, 0, -23, -19, -3, 21, 16, 7, -13, -16, 8, 19, 23, 6, -10, -12, -1, 21, 21, 1, -10, -15, -3, 18, 18, 15, -15, -19, -17, 13, 12, 2, -18, -23, -8, 7, 12, -6, -13, -16, -9, 1, 9, 17, -9, -17, -16, 10, 21, 15, -9, -17, 1, 19, 31, 15, -3, 1, 11, 13, 34, 27, -5, -22, -13, -3, 27, 7, -11, -19, -13, 6, 14, 1, -17, -20, -21, -8, 7, 10, -13, -22, -20, -8, 3, 8, 12, -28, -16, 6, 11, 23, 5, -8, -3, 9, 22, 22, 10, -1, -2, 6, 26]
5165B6j1oj2j8K0K0J0k5pj7J0J3jLk8JK3KLj4j0qPL2%kk2j3J1K9J0k3Jpj5K9J3
5202B4j1j6j0QJ9J0pk9mJ3J1J3%k5j1j3K8J1jk6j5J4OJ3Kk2j4J5J6J0Mj5k5K5
5236bJJ8Qok5j4K9J4omk3NJ0K4mk1j3j4J5J6Oj8j6MOJ5Pj1k0KmK7J5j7l0KJ5R
5274@J5j7rrJ2J8J3ok1rJ2J7J7k4j3j1PJ8J8rl4qJ8J2JMk5%rJ2J5Jj3j3j3K9K1
5311A7qj6j6J0J2J7Kj7j3mJ7J5Lqj6kJ2J5Oj7rj2J9J5kj5ookK3jnj8j7JK7Lj5
5349a1rJkK7Qrj8M%J0J7jj8klJ0J9mk0k2K5J1J3mj9rNRJ0j0j7j3J4J0NNj7k2N
5388b2J9MLj4mj0J3K2plj4j0L7PJk2joJ3J5Oj5j2j0K4J0Qk2j3pQJ6%pj6j4OJ8
5426AJkj3JpK4Opj7qmL2J1j6j6%PK0Kqj5mJ7OJ7qk1LLJ2jj0j1pJK2%nj4k0J9P
$$ y = [26, 15, 9, -3, -21, -1, 19, 29, 4, -3, -20, -10, 3, 2, 5, -23, -22, 1, 3, 6, -8, -18, -26, -19, 13, 13, 11, -11, -24, -13, 16, 26, 3, 4, -3, -18, 11, 24, 13, -3, -13, -5, 14, 24, 17, -12, -16, -3, 8, 21, 21, -4, -15, -28, 0, 11, 10, -16, -31, -17, -11, 2, 4, -18, -32, -17, -1, 9, 13, -2, -27, -2, -1, 17, 25, 19, -6, -20, 9, 23, 17, 13, -10, -5, 5, 29, 25, 4, -9, -23, -8, 8, 14, -4, -20, -16, -10, 5, 12, 1, -19, -17, -21, 6, 21, 4, -26, -24, -9, 0, 15, -2, -11, -20, -8, 10, 23, 17, -4, -13, -1, 16, 33, 9, -4, -15, -8, 10, 28, 19, -15, -23, -5, 7, 8, 12, -13, -13, -22, -10, 5, 6, -7, -20, -33, -4, 17, 9, -7, -23, -13, -1, 16, 18, 1, -12, -16, 1, 16, 19, 11, -5, -7, 5, 20, 26, 9, 0, -12, 7, 22, 20, 5, -1, -7, -9, 14, 13, 8, -10, -27, -26, 1, 4, -11, -20, -19, -21, 6, 14, 5, -13, -9, -9, 1, 18, 17, -1, -3, -6, 4, 23, 19, -1, -23, 2, 13, 26, 22, 3, -6, -1, 8, 18, 8, -9, -22, -8, 2, 7, 12, -5, -27, -22, -3, 1, 4, -10, -14, -24, -11, 11, 4, 1, -13, -23, 14, 21, 22, 0, -1, -7, 6, 21, 27, 12, 0, -10, 14, 24, 32, 10, -3, -10, -2, 14, 14, 7, -9, -23, -17, 1, 2, 0, -13, -12, -19, 5, 11, 4, -13, -21, -25, 7, 18, 2, -14, -14, -7, 13, 15, 7, -8, -12, 5, 11, 28, 20, -1, 2, 5, 17, 16, 6, -5, -12, -11, 11, 11, 6, -8, -28, -9, -2]
5468bJ0oj6j5KK3mJ0%k0rK6J2j5Nj7LJ9RlNj9j5K6J2j0Mj5oJ4J0kqj9kMK0J3k8
5507dj2%%K6Nj9mj1qK9Prj1j1J5NK2j4k1J2%QJ5rj6pJ7K0qJj3j2J1NRJ2l3j6M
5546a5J5K0j2ol1RQK9k0mj4PRJ0Kok4%J5J5Qrj2j2K0K4oqj4kPJ3Nj3j7KK2J5n
5585B5j4pk3J8J7mj1lj7K0MRj1j7j0QJ5Qpj8KJ3J7Qk0nqJ5QJ3j0j1MrJ9K0k7j1
5623@mJ1J1nJk0pMK3j2J0k1JpQJ2%rqmJ0JJNj9J3PMPqj4PJ5M%mj7%KK3nkj1j2
5667iJ0J1Oj8jj3J0J0Kj4ppRJ2pnj2J1j1K1J0j5j4PKJ4J3j1Kj5OK1%pj5%NKJ3
5706A6jj1rNLlJ2j4k0QJ7Nj1Kk9J0PJ2pjnkPJ0Nj4ooK3RMj3j7KJ4RNpmj0J0J1
5748A6Nj2j2%PJ4Lj5j5oMMJ5k2mnJ1QRj1pj1J4OJ9j0j2jJ1PJ1prKkQJ1nrj7J7
$$ y = [-2, 8, 2, -14, -29, -27, -4, -8, 2, 2, -18, -27, -1, 11, -4, 1, -16, -13, 6, 15, 12, 17, -2, -17, 9, 21, 11, 15, 0, -6, 8, 18, 16, 8, -11, -13, -9, 11, 24, -4, -16, -16, -16, 10, 15, -4, -8, -19, -27, 2, 9, 0, -11, -22, -7, -2, 20, 6, -15, -3, -3, 5, 20, 11, -5, -12, 5, 25, 17, 18, 5, -7, 4, 9, 18, 30, -3, -19, -15, 0, 20, 8, 2, -29, -20, -12, 17, -3, -7, -21, -14, -5, 5, 7, 1, -23, -23, -8, 7, 15, 6, -6, -18, 2, 26, 20, 12, -2, -4, 3, 16, 21, 8, -9, -7, 15, 30, 25, 11, 4, -19, -1, 16, 12, 1, -2, -19, 1, 5, 14, 3, -14, -24, -16, -1, 7, 0, -18, -16, -3, 14, 22, 2, -3, -11, 4, 12, 25, 15, 4, 8, -1, 18, 38, 11, 0, -4, 7, 18, 13, 14, -6, -13, -9, 14, 2, 12, -9, -8, -15, -7, 5, 5, -4, -12, -16, -6, -5, -4, 1, -18, -5, 2, 6, 13, 5, -9, -2, 13, 17, 17, 13, -4, -4, -2, 21, 16, 14, 3, -9, 1, 12, 18, 0, -1, -14, -4, 6, 8, -6, -13, -20, -11, 1, -6, -11, -23, -12, -23, -2, 8, -7, -21, -14, -12, 2, 15, 4, 6, -9, -3, 18, 18, 11, -4, -4, 1, 3, 16, 15, 4, -5, 0, 3, 0, 12, -2, -22, -14, 3, 8, -3, -1, -30, -20, -13, -1, -8, -9, -14, -16, -9, 1, 6, -8, -14, -20, 3, 12, 16, 3, -14, -12, 2, 11, 16, 9, 5, -5, 5, 16, 21, 9, -3, -3, 4, 18, 21, 6, -9, -15, -11, -7, 8, -14, -18, -23, -12, -4, 5, -6, -13, -24, -10, -4, 15, 5, -7, -8, 3, 10, 21, 14, 5, 7, 5, 13, 24, 19, 10, -7, 10]
5789A0nK6j0k4kMOkMkj5mJ2%Npj1mJ5J9rpj2lJ9MlKj3jJJ8Mj3LpJ3MJ4j4krOj
5833IOqqj3K0LJ2j6j7rK3JJ6j2k6PnJ3JjqmPMK0j7lPmRJ4Jj5j5J6MRj1nrORnO
5877A2j6oLJ1mPpk1LJ3J3qj1oMLJ2Mj0p%MJ8jj1%KlJ5PrpnPMJ6j6j0LoK4j2pk
5921@jnJ6j5Mnjj1J9LqqrJ4MLjrpJ7oK1Kj3rJ2JJ5mpooJ4J1jk2j8J2K2Jjj7j8
5964a7LOK4j5ojrJ0J1nnj4kJ3PNnj0MNNQmj9PJ3K2j1j1%LnjJ7j5JmJJ3Mj6j1l
6007gQJ3j1j4qj0J6J1PJk2%J3NKKj4kJ1J0Rj5j0J3LqJ8pk0J2QljPpj6KOQJ0k4
$$ y = [10, 5, 31, 21, -3, -5, -1, 5, 3, 7, 5, -10, -14, -2, -2, 3, -4, -15, -19, -4, 15, 6, -1, -13, -16, 3, 7, 4, 6, -7, -8, -7, 11, 15, 2, 5, -2, 11, 15, 29, 15, 13, 4, 10, 9, 15, 7, -1, -14, 6, 9, 21, 5, -12, -21, 2, 3, 19, 7, -19, -12, -17, -4, -3, -4, -12, -16, -9, -5, 15, -2, -5, 2, -2, 7, 21, 22, 7, -8, 8, 12, 21, 10, 5, -4, 2, 11, 6, 12, -4, -10, -7, 4, 0, 7, 0, -21, -18, -5, 8, 0, -11, -17, -13, -10, 2, 6, -4, -11, -11, -7, 11, 10, -1, -1, 1, -2, 13, 20, 11, 4, -1, 6, 10, 26, 10, 0, 3, -3, 21, 9, 2, 0, -1, -6, 10, -5, -1, -6, -7, -18, 1, 4, -4, -12, -21, -7, -3, 0, -1, -10, -17, 0, -6, 15, 17, 4, -5, 7, 8, 23, 19, 12, 6, 0, 14, 25, 24, 2, -16, -4, 18, 19, 18, 1, -17, -14, -8, 16, 1, -5, -6, -15, -5, 6, 1, -4, -18, -20, -7, 0, 5, 0, -10, -6, -1, 4, 12, 8, -11, -4, 9, 31, 20, 9, 9, 12, 7, 6, 23, 8, 9, 5, 6, 19, 23, 7, -4, -7, 1, 14, 3, -11, -19, -29, -13, -2, 5, 6, -16, -16, -3, 2, 4, 6, -8, -10, 1, 11, 20, 5, -5, 8, 11, 3, 21, 14, -6, 6, 14, 11, 10, 17, 10, -6, -4, 2, 10, 20, -4]
$$ [...]
8191h
##END NTUPLES=NMR FID
##END=
