##TITLE=1H_IG-eant
 200.13MHz, CD4O,
 8 sc
 
 5.3.2025
##JCAMPDX= 6.0         $$ Bruker NMR JCAMP-DX V2.0
##DATA TYPE= NMR FID
##DATA CLASS= NTUPLES
##ORIGIN= UXNMR, Bruker Analytische Messtechnik GmbH
##OWNER= pz
$$ XWIN-NMR		Version 3.5
$$ Wed Mar  5 14:16:30 2025 Russian Standard Time (UT+4h)  she@DPX200
##.OBSERVE FREQUENCY= 200.1313
##.OBSERVE NUCLEUS= ^1H
##.DELAY= (6, 6)
##.ACQUISITION MODE= SIMULTANEOUS
##.ACQUISITION SCHEME= undefined
##.AVERAGES= 8
##.DIGITISER RES= 18
##SPECTROMETER/DATA SYSTEM= spect
##.PULSE SEQUENCE= zg30
##.SOLVENT NAME= MeOD
##.SHIFT REFERENCE= (INTERNAL, MeOD, 0, 14.3821)
##AUDIT TRAIL= $$ (NUMBER, WHEN, WHO, WHERE, WHAT)
$$ ##TITLE= Audit trail, XWIN-NMR		Version 3.5
$$ ##JCAMPDX= 5.01
$$ ##ORIGIN= Bruker BioSpin GmbH
$$ ##OWNER= she
$$ F:/spectra/data/she/nmr/H-C/1/audita.txt
$$ ##AUDIT TRAIL=  $$ (NUMBER, WHEN, WHO, WHERE, WHAT)
(   1,<2025-03-05 14:14:50.07 +0400>,<she>,<DPX200>,
      <created by zg, POWCHK disabled, PULCHK disabled
       configuration hash MD5:
       00 E9 B6 7A A2 85 ED C7 34 08 36 98 17 FE 4E 26
       data hash MD5: 16K
       98 38 7F D7 87 D3 FB 45 73 D9 6B 70 3E 9A 4F 14>)
$$ ##END=
$$ 
$$ hash MD5
$$ F0 DE 79 3D 48 EC 07 4D 4A 16 18 A4 ED C7 F2 FD
##$RELAX= 
##$RELAX= 
##$RELAX= 
##$RELAX= 
##$RELAX= 
##$RELAX= 
$$ Bruker specific parameters
$$ --------------------------
##$DU= <F:/spectra>
##$EXPNO= 1
##$NAME= <H-C>
##$PROCNO= 1
##$TYPE= <nmr>
##$USER= <she>
##$AMP= (0..31)
100 100 100 100 100 100 100 100 100 100 100 100 100 100 100 100 100 100 
100 100 100 100 100 100 100 100 100 100 100 100 100 100 
##$AQSEQ= 0
##$AQ_mod= 1
##$AUNM= <au_zg>
##$AUTOPOS= <>
##$BF1= 200.13
##$BF2= 200.13
##$BF3= 200.13
##$BF4= 200.13
##$BF5= 200.13
##$BF6= 200.13
##$BF7= 200.13
##$BF8= 200.13
##$BYTORDA= 1
##$CFDGTYP= 0
##$CFRGTYP= 5
##$CHEMSTR= <none>
##$CNST= (0..31)
1 1 145 1 1 1 1 1 1 1 1 1 1 1 1 1 1 1 1 1 1 1 1 1 1 1 1 1 1 1 1 1 
##$CPDPRG= <>
##$CPDPRG1= <>
##$CPDPRG2= <>
##$CPDPRG3= <>
##$CPDPRG4= <mlev>
##$CPDPRG5= <mlev>
##$CPDPRG6= <mlev>
##$CPDPRG7= <mlev>
##$CPDPRG8= <mlev>
##$CPDPRGB= <>
##$CPDPRGT= <>
##$D= (0..31)
0 0.7 0 0 0 0 0 0 0 0 0 0.03 0 0 0 0 0 0 0 0 0 0 0 0 0 0 0 0 0 0 0 0 
##$DATE= 1741169689
##$DBL= (0..7)
120 120 120 120 120 120 120 120 
##$DBP= (0..7)
150 150 150 150 150 150 150 150 
##$DBP07= 0
##$DBPNAM0= <>
##$DBPNAM1= <>
##$DBPNAM2= <>
##$DBPNAM3= <>
##$DBPNAM4= <>
##$DBPNAM5= <>
##$DBPNAM6= <>
##$DBPNAM7= <>
##$DBPOAL= (0..7)
0.5 0.5 0.5 0.5 0.5 0.5 0.5 0.5 
##$DBPOFFS= (0..7)
0 0 0 0 0 0 0 0 
##$DE= 6
##$DECBNUC= <off>
##$DECIM= 32
##$DECNUC= <off>
##$DECSTAT= 4
##$DIGMOD= 1
##$DIGTYP= 9
##$DL= (0..7)
0 120 120 120 120 120 120 120 
##$DP= (0..7)
150 150 150 150 150 150 150 150 
##$DP07= 0
##$DPNAME0= <>
##$DPNAME1= <>
##$DPNAME2= <>
##$DPNAME3= <>
##$DPNAME4= <>
##$DPNAME5= <>
##$DPNAME6= <>
##$DPNAME7= <>
##$DPOAL= (0..7)
0.5 0.5 0.5 0.5 0.5 0.5 0.5 0.5 
##$DPOFFS= (0..7)
0 0 0 0 0 0 0 0 
##$DQDMODE= 0
##$DR= 18
##$DS= 0
##$DSLIST= <SSSSSSSSSSSSSSS>
##$DSPFIRM= 0
$$ [...]
##$SUBNAM0= <"">
##$SUBNAM1= <"">
##$SUBNAM2= <"">
##$SUBNAM3= <"">
##$SUBNAM4= <"">
##$SUBNAM5= <"">
##$SUBNAM6= <"">
##$SUBNAM7= <"">
##$SUBNAM8= <"">
##$SUBNAM9= <"">
##$SW= 18.0517328524113
##$SWIBOX= (0..15)
0 0 2 0 0 0 0 0 0 0 0 0 0 0 0 0 
##$SW_h= 3612.71676300578
##$TD= 16384
##$TD0= 1
##$TE= 0
##$TE2= 300
##$TE3= 300
##$TEG= 300
##$TL= (0..7)
0 120 120 120 120 120 120 120 
##$TP= (0..7)
150 150 150 150 150 150 150 150 
##$TP07= 0
##$TPNAME0= <>
##$TPNAME1= <>
##$TPNAME2= <>
##$TPNAME3= <>
##$TPNAME4= <>
##$TPNAME5= <>
##$TPNAME6= <>
##$TPNAME7= <>
##$TPOAL= (0..7)
0.5 0.5 0.5 0.5 0.5 0.5 0.5 0.5 
##$TPOFFS= (0..7)
0 0 0 0 0 0 0 0 
##$TUNHIN= 0
##$TUNHOUT= 0
##$TUNXOUT= 0
##$USERA1= <user>
##$USERA2= <user>
##$USERA3= <user>
##$USERA4= <user>
##$USERA5= <user>
##$V9= 5
##$VALIST= <valist>
##$VCLIST= <CCCCCCCCCCCCCCC>
##$VD= 0
##$VDLIST= <DDDDDDDDDDDDDDD>
##$VPLIST= <PPPPPPPPPPPPPPP>
##$VTLIST= <TTTTTTTTTTTTTTT>
##$WBST= 1024
##$WBSW= 4
##$XGAIN= (0..3)
0 0 0 0 
##$XL= 0
##$YL= 0
##$YMAX_a= 60254
##$YMIN_a= -96291
##$ZGOPTNS= <>
##$ZL1= 120
##$ZL2= 120
##$ZL3= 120
##$ZL4= 120
##$ABSF1= 10
##$ABSF2= 0
##$ABSG= 5
##$ABSL= 3
##$ALPHA= 0
##$AQORDER= 0
##$ASSFAC= 0
##$ASSFACI= 0
##$ASSFACX= 0
##$ASSWID= 0
##$AUNMP= <proc_1d>
##$AZFE= 0.1
##$AZFW= 0.1
##$BCFW= 1
##$BC_mod= 2
##$BYTORDP= 1
##$COROFFS= 0
##$CY= -3
##$DATMOD= 1
##$DC= 2
##$DFILT= <>
##$DTYPP= 0
##$F1P= 0
##$F2P= 0
##$FCOR= 0.5
##$FTSIZE= 0
##$FT_mod= 4
##$GAMMA= 1
##$GB= 0.15
##$INTBC= 1
##$INTSCL= 1
##$ISEN= 128
##$LB= 0.25
##$LEV0= 0
##$LPBIN= 0
##$MAXI= 10000
##$MC2= 0
##$MEAN= 0
##$ME_mod= 0
##$MI= 1.114404
##$NCOEF= 0
##$NC_proc= 0
##$NLEV= 6
##$NOISF1= 3.799351
##$NOISF2= 2.8
##$NSP= 1
##$NTH_PI= 0
##$NZP= 0
##$OFFSET= 14.38212
##$PC= 1
##$PHC0= -465.5674
##$PHC1= 7.39222
##$PH_mod= 1
##$PKNL= yes
##$PPARMOD= 0
##$PSCAL= 0
##$PSIGN= 0
##$REVERSE= no
##$SF= 200.129724274929
##$SI= 16384
##$SIGF1= 3
##$SIGF2= 2
##$SINO= 400
##$SIOLD= 16384
##$SREGLST= <1H.CDCl3>
##$SSB= 0
##$STSI= 0
##$STSR= 0
##$SW_p= 3205.1282051282
##$SYMM= 0
##$S_DEV= 0
##$TDeff= 0
##$TDoff= 0
##$TI= <>
##$TILT= no
##$TM1= 0
##$TM2= 0
##$TOPLEV= 0
##$USERP1= <user>
##$USERP2= <user>
##$USERP3= <user>
##$USERP4= <user>
##$USERP5= <user>
##$WDW= 1
##$XDIM= 8192
##$YMAX_p= 0
##$YMIN_p= 0
$$ End of Bruker specific parameters
$$ ---------------------------------
##NTUPLES= NMR FID
##VAR_NAME=  TIME,          FID/REAL,        FID/IMAG
##SYMBOL=    X,             R,               I
##VAR_TYPE=  INDEPENDENT,   DEPENDENT,       DEPENDENT
##VAR_FORM=  AFFN,          ASDF,            ASDF
##VAR_DIM=   8192,          8192,            8192
##UNITS=     SECONDS,       ARBITRARY UNITS, ARBITRARY UNITS
##FACTOR=    0.0002768,     1,               1
##FIRST=     0,             0,               0
##LAST=      2.2672688,     0,               0
##MIN=       0,             -96291,          0
##MAX=       2.2672688,     60254,           0
$$ Real data points
##PAGE= N=1
##DATA TABLE= (X++(R..R)), XYDATA
0@%%%%%%%%%%%%%%%%%%%%%%%%%mRj3J6j6J6j6J6j9K3k7L1l4L8m1M6n3N7o3P0p8
46d2Q7r5J04j15J27j40J55j70J87k06K30k58K88l23L65m17M82n67O82q49J108
67F33j573K670j0746K37L0058K1300N902j1495k0760k2290m152R103L134r708
81g687j1128o804J298P458O284j339M3J3028K1475J5991K628q833j3322j0151
95H941m954r882k1227k2722p285J2723K6361K8427J9394O500J826Q06r013k3449
109F446k5801j5468J203J9645K4084R317p655j0369p766n499l749m031m635O842
123a7436K2547K5004J2755k140j1234j4785j2235j1212j8107k1399r523J1720
135d6045K7862L1811K3564Q400l446q302j1107j8941k4496j7066o49J5083K2514
$$ plain form
0 0 0 0 0 0 0 0 0 0 0 0 0 0 0 0 0 0 0 0 0 0 0 0 0 0 0 -4 5 -8 8 -8 8 -8 8 -11 12 -15 16 -18 20 -21 25 -28 29 -34 36 -42
46 -42 45 -50 54 -61 66 -74 81 -89 98 -108 122 -136 152 -171 194 -223 259 -308 374 -475 633
67 633 -940 1730 -9016 -8779 21279 42579 48481 36986 16226 -6064 -10216 -1113 2021 -7687
81 -7687 -18815 -25619 -24321 -16863 -10579 -11918 -11875 1153 22628 38619 41247 32414 19092 8941
95 8941 3987 -5895 -27122 -49844 -57129 -44406 -18045 10382 29776 36276 38102 38908 29895 6446
109 6446 -19355 -34823 -33620 -13975 10109 19426 11771 1402 -6364 -11863 -15612 -19643 -24278 -17436
123 -17436 5111 30115 42870 40730 29496 14711 2476 -8736 -26843 -48242 -57765 -46045
135 -46045 -18183 13628 37192 45592 42146 33844 22737 3796 -20700 -37766 -38415 -23332 -818
148h18J6725J084r454o213j294j948l908n293k585P114J5898J2515n7o862o616
163H288m711l371o422j4173j4000K30J5419K1156J7382P177k198n080l213o057
177A0427j2692j4361o740M330J1061J0079J573n992l339N160Q787M043k373o702
191C261n455M32L455n89n932k690M142P196M186k689r946q531J675R018P236J419
207F188k244k249J552M934R41o075o825j915K038J773k492o340m913M907J3689
222B969J2331L834l956p718o224l255k869n770m937K837R374R946M584k733o602
237A811l389K793L518k141o377m874J86N614P424K517j881j614J387Q2m259q085
253g288q023j522Q829J2808Q097L93l582m282k432j856m071o659l849L590P281
$$ plain form
148 -818 15907 16991 7537 1324 30 -1918 -5826 -11119 -13704 -6590 9308 21823 21766 14904 8288
163 8288 3577 206 -6216 -20389 -34389 -34159 -18740 2416 19798 26975 24777 19697 16484 10427
177 10427 -2265 -16626 -23366 -19036 -7975 2104 3677 -2315 -5654 -494 8293 12336 9963 3261
191 3261 -2194 -1762 1693 1104 -4828 -7518 -3376 3820 8006 5317 -4629 -13160 -11485 -2467 4769 6188
207 6188 3944 1695 3247 8181 9122 3047 -3778 -5693 -3655 -1882 -4374 -10714 -15627 -10720 2969
222 2969 15300 19134 15178 7460 1236 -2019 -4888 -10658 -15595 -12758 -3384 6562 11146 8413 1811
237 1811 -1578 1215 4733 2592 -3785 -8659 -8473 -2859 4565 7082 5201 3587 4974 5056 797 -7288
253 -7288 -15311 -16833 -8004 4804 12901 13294 9712 5430 2998 1142 -2929 -9588 -13437 -9847 -2566
268b566N629J289j665j200L419M909Q3p091q990n263O21N054N018K586J138L032
284F003L609m11o701q640o250J146P309P323J622j635r03J295K054m23m376n893
300d871k616J685K515K87r19J225M570P238M769k643q934p937l566J53K845K161
316d038J493K471N613L660j237n306n640k305K126L447K79k863k166J790M253
331A577L963Q30k580l752j292K75k428l391j012K828O547P132K593l610o041l866
347b227r04l34m86j517l09K571M828L419m08j576n16P60J017j432n255o318j645
364a0332L704N746N130K272J87j180q75k861m983n336r68L492N803N353J332k199
380D285j869K79j66j583l682l355j545K183M019L133R88J651K239J593j781n384
$$ plain form
268 -2566 3063 4352 2687 1487 4906 9815 9898 2807 -6183 -11446 -10825 -5771 -753 1833 2971 6003
284 6003 9612 9201 2500 -6140 -12390 -11244 -3935 3388 5010 3375 2472 3767 5821 5398 1022 -4871
300 -4871 -7487 -5802 -3287 -3000 -3919 -2694 1876 9114 13883 11240 2306 -5631 -9197 -9044 -6199 -4038
316 -4038 -2545 -74 5539 9199 7962 2656 -2984 -5289 -3163 284 563 -2300 -4466 -2676 1577
331 1577 5540 6370 3790 38 -1254 -979 -3407 -6798 -7810 -4982 1565 8697 11290 7680 1639 -2227
347 -2227 -3131 -3465 -3951 -5468 -5777 -3206 1622 5041 4633 3057 2541 3301 4318 2886 -2369 -8687 -10332
364 -10332 -6628 -882 4248 6520 6707 5527 4652 1791 -3192 -8528 -9496 -6004 -201 5152 6484 4285
380 4285 2416 2695 2529 946 -2736 -6091 -7636 -5453 -1434 1699 2687 4338 6577 8170 6389 1005
396A005p592m889O63N339O073L642K353J11l48j553l690n407l133K36L395M078
412B83K650l66r79O00J649j56k568l205k928l81J785K489J347J237K011K327m07
429E388k419n494m002q28L342M230K309N84k14p69l79p05k210j934N33K175K335
446A942J69j678k714q04J648K635J321q76o97p44J51O29q66j600o36J168J082
463A30L89o90j083L47J931K460L22k072l079k322p22J415J830J878K094K481J058
480F367j761m505m709l271L3L622L670L069J838J035O72q54k335l799l674j497
496f099J054J515J726J507K146K231K122n5l293n229l338j604J283L738L737L302
512D743K347P83j744n109n769m059j096K617M252M513K985K015R07n27k126l425
$$ plain form
396 1005 -6587 -11476 -10813 -5474 599 4241 6594 6705 6357 4804 1114 -4293 -7426 -7190 -3795 283
412 283 2933 2567 1588 2188 3837 3681 1113 -2092 -5020 -5401 -3616 -1127 220 1457 3468 5795 5388
429 5388 2969 -2525 -6527 -7355 -4013 217 2526 3110 2896 2127 1748 1043 -1167 -3101 -2568 -393 1942
446 1942 2111 433 -2281 -3085 -1437 1198 2519 1643 946 202 353 982 116 -1484 -2120 -952 130
463 130 519 -171 -1254 -907 1024 3484 3806 1734 -1345 -3667 -4389 -2974 -1144 734 2828 5309 6367
480 6367 4606 101 -4608 -7879 -7846 -4224 -554 2515 4353 5388 6060 5206 2871 -928 -4602 -6099
496 -6099 -5045 -3530 -1804 -297 1849 4080 6202 6147 2854 -2375 -5713 -7317 -6034 -2296 1441 4743
512 4743 7090 7873 6129 1020 -4749 -8808 -9904 -7287 -3035 1478 4463 6478 7385 6858 4732 1307
528A307m095k654n70O26J429J514K471K467K526R18j783l691l523j466O10K186
544a728K597K554P67L91j284k945m201k389o24J636L505L329K144L02O53k92j024
561C391j360j955k113j543o0k38R6R22J831K002J623J003q59j446p70j39P79K14
579A378k8r37q92j304r77j126j12J081K495K314J893O8j335j392q44n2l3K89j17
598C69n99n25n52j274p54k9J322J227K016J271M45l5M75K58p49j557k325k352
616c368j962j94P58J306K441L268K297R67l56k582k647j640q34L61R80J005N71
633C71K11k21l44j028r14q0R12R73Q81J073K24N27P57j20j069k113k266k158j116
652e500M89J118K457L062K545J041k26j660k222k255j056m12K35Q41M12P41K58
$$ plain form
528 1307 -2788 -5442 -6012 -5386 -3957 -2443 28 2495 5021 5939 4156 465 -3058 -4524 -3914 -1728
544 -1728 869 3423 4190 4581 3297 352 -3849 -6238 -6862 -5226 -1721 1608 3752 4054 4707 4415 3391
561 3391 2031 76 -2037 -3580 -3640 -3878 -3782 -2860 -1029 973 2596 3599 2740 1294 524 385 1164 1378
579 1378 1350 413 -479 -1783 -2760 -3886 -3998 -2917 -422 1892 3785 3853 2518 1126 282 230 197 486 369
598 369 -230 -755 -1307 -2581 -3335 -3364 -2042 -815 1201 2472 2917 2882 3357 3615 2866 1309 -1016 -3368
616 -3368 -5330 -5524 -4766 -3460 -1019 2249 4546 5513 5157 2575 -72 -1712 -2546 -2185 -1205 -200 371
633 371 582 361 17 -1011 -1925 -2005 -1093 -120 761 1834 2058 2585 3342 3222 2153 40 -2226 -4384 -5500
652 -5500 -5011 -3893 -1436 1626 4171 5212 4986 3326 1104 -1151 -2207 -2619 -2384 -1543 -1131 -390 -132
669a32N95j51lJ03L4j65l03l18j71K58Q51R42N86o74j030j653j364k94O5Q82J555
690c87J753J295L00l64r41j207r14n16j28j33l14J47J73O26J014R73L67K69l09
709A704r08j655q34l85L43J372J215M15M1l18n74r02n55j66K08M88N09L66Jj47
729B18K46J53K28J21l11q12r41l52l43M72J300J228N47J82o04j030j284n51j73
748a706J99Q57P96N44J97K09j62m66J42m10k37o51n11k71M6Q11R74J089K95L33
768B078o75j097j161r23p9N76P05Q94N40J86j40o58l30k96q8RJ19L20N5J65j98
789BP05J62J11j34r04j042n30j81L95Q79J138Q05O69J6r68q75n72q65k12L79K79
810g43N50J93R3K3J52j6M02j73n7k47o25k89p6M48N22K22N27q2n38q57l24j67
$$ plain form
669 -132 463 312 309 412 446 281 -22 -340 -511 -253 598 1540 2126 1452 422 -1231 -2595 -2889 -2824 -1942 -387
690 -387 1366 2661 2961 2597 1656 449 -465 -981 -1109 -1242 -1556 -1409 -1236 -610 404 1377 1744 2013 1704
709 1704 796 -859 -1693 -2078 -1735 -363 852 1267 1308 990 416 -486 -1041 -1207 -999 -511 -2 364 365 218
729 218 464 617 845 966 655 -157 -1098 -1450 -1793 -1321 -21 1207 1754 1936 1332 302 -982 -1533 -1706
748 -1706 -1507 -650 146 690 887 1096 934 468 610 200 -37 -688 -1199 -1470 -1424 -613 361 1450 1745 2078
768 2078 1403 306 -855 -1778 -1857 -1281 -576 318 858 1044 904 246 -84 -380 -468 -459 -340 -20 35 200 2
789 2 707 869 980 846 -58 -1100 -1630 -1811 -1416 -537 601 1406 2075 2091 1123 248 -324 -1189 -1401 -1022 -743
810 -743 -193 0 93 116 268 252 654 481 424 177 -448 -737 -813 -365 157 379 906 824 286 -571 -895 -1062
832a062J37O21N39M03L8K62p51j14j20j39L3j25n7p6l64q6L61P42O39K52J33l07
854I59n22r10m53j00q2L89P30O67J70m4l33m33n0j78p6l59L06j55J60L02K98N46
876H32J22j40n16p88r82o7J39N52J015R40M81J24p70o46q08m73J09J27J18N95
896c6L56L3kL19k3j43k11m86p16j46L3L60P25O08P08n5l43p07o43p15k21K28M56
919f21L81R07K0J33J4p19k51l29K34o4j50K5J10J34Q7K88K46J46j34m08m52k52
941f55k04M22L48O45L58j16l58m94k63l25J47o7L67K31K95J12k71J83j05K30J22
962F02r2m53o72j06l52J73O60L22L83J99L12o40k85m41k47J90J56M01P5j02j66
983h3OJ67m5L7m3r3j19j25NM2K42N09M51Q1l73p17p16l52J53M03J5M69L97M21
$$ plain form
832 -1062 -925 -304 235 638 676 938 187 73 -47 -186 -153 -278 -335 -411 -775 -861 -500 242 881 1133 1266 959
854 959 437 -473 -926 -1026 -1108 -719 11 678 848 804 471 38 -12 -190 -266 -625 -319 -474 -314 -12 286 832
876 832 954 814 298 -490 -1472 -1539 -1400 -848 167 1107 1588 1712 942 296 -512 -985 -876 -749 -631 -36
896 -36 320 353 351 670 647 504 293 -193 -909 -1055 -1022 -662 63 671 1379 1324 981 274 -369 -1084 -1305 -1077 -621
919 -621 -240 667 687 820 834 115 -136 -465 -231 -295 -445 -420 -310 -176 -89 199 445 591 457 49 -403 -655
941 -655 -859 -437 -89 556 914 798 440 -54 -317 -642 -495 -562 -195 36 331 443 172 355 250 480 602
962 602 510 57 -615 -721 -1073 -900 -240 82 465 664 976 336 51 -390 -637 -447 -291 110 185 83 -83
983 -83 -77 90 45 82 39 -54 -173 -298 -293 -251 -9 500 951 1032 659 -58 -774 -1126 -973 -570 -555 -86 311 732
1007G32J56N3l99m32P6m30P0j52l26P8J84K92M67rJ44l0m85j80r3OQ2L26M31J73
1031G34p8m21p32j23j98k87M98N97p1L97P7M62k60j49j30k7k83J08p31l43K9M11
1053e20L78N72R8n9q6j53J91k63k48r7J57K80j70j22l49j44J91J53M63l22o4N
1075a09J71J42J35q5O5M18m74J38o62m11k75j49O11j7O68K56J78K57j8r9k62m03
1097G5j02k49l62k90L9N2K21O58M86K82k11k97m06j29Q6K52j34P1M29j23o5n20
1119b37m77l14M48J12M8M48L93M9M77J82l21k52k76n35l12m41j75K65L84N63N52
1140E81L79m12r9j35k73l20J39j55N4J45M11j1l10j53m63J95J16J1J91K17P8K00
1162C86M32P6m11j04m23m15m94n6n2J94P37N06K54M6j57j00K83o26j80J0n5R8
$$ plain form
1007 732 888 941 542 110 186 -244 -174 -326 -652 -574 -390 -98 369 360 504 474 -11 -191 -284 -278 -196 130 561 734
1031 734 656 235 -497 -620 -818 -1105 -607 -10 -81 316 393 855 595 446 316 289 6 114 -617 -960 -931 -520
1053 -520 -142 430 528 469 383 230 421 158 -90 -187 -30 250 80 -42 -391 -535 -344 -191 272 -50 -114 -109
1075 -109 62 204 339 254 319 737 263 401 -261 -672 -947 -1096 -485 -502 166 422 600 857 839 740 478 75
1097 75 -27 -276 -638 -928 -889 -837 -616 42 528 810 599 302 -104 -233 -147 105 -29 42 471 348 283 -237
1119 -237 -714 -1028 -580 -468 -420 28 421 470 947 1129 808 556 280 -255 -567 -1008 -1183 -918 -534 29 581
1140 581 960 548 449 314 41 -279 -140 -295 -241 -96 315 304 -6 -159 -622 -427 -311 -300 -109 108 186 386
1162 386 818 894 483 379 -44 -459 -953 -1009 -1061 -867 -130 376 630 676 519 419 702 76 -104 -94 -149 -51
1184e1J43j17j66q1j70K25K25K08n3P5l06K57L57k15L34m45l34j29J4j34j64o3
1206e90J56O75k2R7P9j27J36p2J23k45n8k32j24m9j50l29K25L6K90N57M0j68L5
1229B83J37j76l2m35J97k08J1J25Ok30K54Q6L23k08K0n7j87M2J82L55l6k23n9
1252A70j87j03n55J09j07J12N12J7N65L25k29j43k71J69o78J90l60j81K52P4J29
1273a90J34L9J64L69k73k34k86K89QQ8K80l40K59q3j85m57q1l23K36K62L35K42
1295B53K90j04L3j03j06j68l51j75P1m5j31J84K36L20J19J94J8l50k51l5L9j19
1317a81j3K82p4j64J55j75LO8m64M70P7K73J8K31N9k47k35J04j74m1m01m3j04
1340e76J31J71N98J83j1J49k58m14K11n25j32K49M4J31k15R5J95J18j74R6m6M8
$$ plain form
1184 -51 92 -25 -191 -272 -442 -217 8 216 163 238 -68 189 546 331 665 220 -114 -243 -229 -363 -527 -590
1206 -590 -434 241 219 316 395 268 404 332 455 210 152 -80 -204 -253 -403 -732 -507 -471 -181 376 416 248 283
1229 283 420 244 212 -223 -26 -234 -223 -98 -92 -322 -68 18 341 133 153 96 -91 -49 133 488 452 229 170
1252 170 -17 -120 -675 -566 -673 -561 -49 -32 533 858 629 486 215 384 -294 -104 -464 -645 -393 -319 -190
1273 -190 -56 -17 147 516 243 9 -277 12 20 108 388 48 307 224 39 -418 -499 -822 -586 -324 11 253
1295 253 543 439 472 369 263 95 -256 -431 -360 -405 -536 -352 -116 204 323 517 535 185 -66 -101 -62 -181
1317 -181 -194 88 14 -150 5 -170 -167 -99 -563 -93 -16 257 275 506 565 318 83 187 13 -28 -429 -472 -576
1340 -576 -445 -274 324 507 496 645 387 -27 184 -341 -473 -224 -180 -49 -264 -169 26 144 -30 66 20 68
1362F8J62n0J55q2k98J15J40k39k24j38J9K4J23J65K12o1L82J88l30r9j91p5o8
1385a02l52L06Oj76J8K05j05L76O6R3J32k16J31k47j81L36m50r2j20J80p3K9J52
1408h4J67L3K30J80j38l9m09P7J7j94L5m4J88l4k48Q4j46K52J2R8O4M53r5o1j82
1433B16j13o3l02k95q9K69k25L18J54J78O02l50M28k59j81k32k48j05J38n6m6
1454b61R7R6j41J62q1m0l8J84P3J57L77j54k15o3p5k35j13m96qL21K05P5N14K48
1478E89K88k94pn09j25k52j84J53n0K82j30K88N2K3j1r4J26j26M1L50j36k22J67
1501B19j0k07m49n9K9m8M9M27Q3K60K02Lj3P7j78l20p5k88r9j23Q6J0K89K52M41
1526E58l09j48L8J15JK03k48j71j41k12K00l40J90j13K44j49R2K93J24J72Q2r6
$$ plain form
1362 68 230 180 335 253 -45 70 210 -29 -253 -391 -372 -348 -225 -60 152 91 473 661 331 232 41 -34 -102
1385 -102 -454 -148 -142 -318 -300 -95 -200 176 242 335 467 251 382 135 -46 290 -160 -252 -372 -192 -265 -236 -84
1408 -84 83 116 346 526 388 349 -60 17 34 -160 -125 -169 19 -15 -263 -179 -325 -73 -61 37 101 554 459 398 216
1433 216 103 40 -262 -557 -646 -377 -602 -284 -130 48 650 300 728 469 288 56 -192 -297 -159 -215 -261
1454 -261 -164 -68 -209 -47 -128 -168 -206 -22 51 208 585 431 216 153 78 -157 -270 -766 -774 -453 -248 -173 341 589
1478 589 877 583 576 67 -58 -310 -494 -341 -391 -109 -239 49 101 124 113 19 145 19 60 410 274 52 219
1501 219 209 2 -447 -506 -477 -525 -476 -49 34 294 496 499 486 563 385 65 -10 -298 -397 -520 -434 -424 -135 117 558
1526 558 249 101 139 254 255 458 210 39 -102 -314 -114 -454 -264 -377 -133 -282 -190 103 227 399 481 385
1548C85J68l44j83l56j61m0K83k50L82j0J41J20N8K11j09Q5j00l99K92k46j70
1569b43o5k16J17j19L41j01K55J32K77k2J17j28M2l09j57k97r4j01J09J16K31
1590a15L44q0K7P6j91J17j5k14K45Mj63J8j30m9m54O8J56J14J03K93j09L35j9
1613C61N3M6k93J5l61Rn29K06K14K55K17j11J58L10n06j27J02m9k48J75K06j13
1635a0j15L73m15L10k94k57J43P2J34r0L56L07k1l7j70k16k72j50J3O6M6j57N32
1658A48j5q0L46k84j09mr1p9K12K9k8J56m9J60j78k19p3l71J30J81K29J93o8K03
1682C39m9l0K1l10l96Q9M3L8J46j5K12j15L20j62K47m21J90j46J5k23K91j09N9
1705C4J43k19K0m4qm9K07j5jM9oPK4on4q5l65K05p6K42j36K23j30N8K62k54L03
$$ plain form
1548 385 553 209 26 -330 -491 -531 -248 -498 -116 -126 15 135 193 404 295 380 280 -119 173 -73 -243
1569 -243 -308 -524 -407 -526 -185 -286 -31 101 378 356 473 345 387 78 -79 -376 -470 -571 -462 -346 -115
1590 -115 229 149 176 252 61 178 163 -51 194 198 35 53 -77 -126 -580 -512 -356 -242 -139 154 45 380 361
1613 361 414 460 167 182 -179 -170 -699 -493 -279 -24 193 82 240 550 44 -83 19 -30 -278 -103 103 -10
1635 -10 -125 248 -167 143 -151 -408 -265 -193 -59 -149 207 514 493 456 286 70 -202 -352 -339 -273 -227 -384 148
1658 148 133 53 399 115 6 2 -89 -168 44 73 45 201 152 312 134 -85 -158 -529 -399 -218 11 204 136 339
1682 339 290 260 281 -29 -425 -336 -293 -255 -109 -124 88 -27 293 131 378 -43 147 1 16 -207 84 -25 34
1705 34 177 -42 -22 -66 -74 -123 84 69 68 117 111 118 142 136 82 -3 -368 -163 -239 3 -133 90 -40 18 280 26 329
1732C29j28k63k3K19m0k5j47j34J43k18m3O3n9L81l1L38k56K49k94L03l82j84
1754b02K9j71J8Q0L29j28J4J88J29q8Lj81Q0k67M0L09k59K41l87J7L5O8P4k41
1778b70K93j14K33M0J93j91K23j23m85K51l86p1m2L60J33J32j5o1J5nmq2k7j05
1802a08J1Q4N8n6j07q3k19K41K47k96K43J25J36K36O5l13k36j1j68M7j48k3r5
1825c70K19J41M73j31n9k16J53P3Mm71J49k00m5N19k51j50j06J7P9K21P2j74k7
1848h0K36K72N4k48l41j69j01O2J00j80j38L18L15L32K95l76J25n20J82J2k33
1869h3j45j63j2K45J17K06j87j52J56NJ82j9q6j00K24J95Ol68n23J02L66J36l98
1892b96K86J6m1L24J96j95j4m49rL12j92j21L8k00J92L23l4k50k50J76L10J02
$$ plain form
1732 329 201 -62 -85 134 94 69 -78 -212 -69 -287 -330 -267 -326 55 24 362 106 355 61 364 -18 -202
1754 -202 -173 -344 -326 -246 83 -45 -31 157 286 198 201 20 100 -167 -127 182 -77 164 -223 -206 -171 -103 -29 -270
1778 -270 23 -91 142 182 375 184 407 284 -201 50 -336 -407 -449 -89 44 176 161 100 115 110 106 24 -3 -108
1802 -108 -97 -13 45 -11 -118 -201 -420 -179 68 -228 15 140 276 512 577 264 28 17 -151 -104 -252 -275 -370
1825 -370 -151 -10 463 332 273 57 210 283 287 -184 -35 -235 -280 239 -12 -162 -268 -251 -172 49 121 -53 -80
1848 -80 156 428 482 234 -107 -276 -377 -315 -215 -395 -533 -215 100 432 727 351 476 -44 138 150 -83
1869 -83 -228 -391 -403 -158 -41 165 -22 -174 -18 -13 169 150 64 -36 188 383 389 21 -502 -400 -34 102 -296
1892 -296 -10 6 -35 289 485 290 276 -173 -182 130 -62 -183 -145 -345 -153 170 136 -114 -364 -188 122 224
1914B24r3q9N5p5P3N3j11l44k34L51O0K21k34J04J45K13Q6k71j29l53J03L07J9
1937H1Ln16L30k10L17L81o10J92r6M77O7k03j03J15m80L58j5p2m27q7K69J12J14
1960cJ80m77K41L57j7O3j93j80k87M87l47J61j04k63K31L26M1k96o0k21L26J96
1982A61M6q3l78K85P2K94l33n63L67KQ6L66j58k4j09K29P8l8j17n25l5J81K72
2005G6J36j61k72j77J76M15O6l73j36M3L09lJ15j81k66Q5J61p6K7k13k40L24M03
2028B38N7j2l70j71M26J00j48j34j84p2L08R8n7k82J00M0L18J70m01O3k20K54
2050A21J39l7k79k38Q9Q1L24j58j61k41J78O04j21%j55k6n6L48k30k51k07Q6J87
2073cK06K1l02k96L26J93L42k93k54j74QM14m5N7m67k69L41K5L15k16j58Q5J61
$$ plain form
1914 224 131 42 97 22 95 148 37 -307 -541 -190 -130 91 -143 -39 106 319 405 134 5 -348 -245 62 81
1937 81 84 -432 -102 -312 5 386 -224 -32 -128 349 416 213 110 225 -255 103 88 16 -411 -498 -229 -117 -3
1960 -3 177 -300 -59 298 281 344 151 -29 -316 171 -176 -15 -119 -382 -151 175 216 -80 -140 -361 -35 161
1982 161 207 124 -254 31 103 397 64 -499 -132 -130 -44 322 164 140 31 260 338 300 183 -342 -377 -196 76
2005 76 212 51 -221 -398 -222 193 259 -114 -250 -207 102 99 214 33 -233 -148 13 -63 -36 -249 -489 -165 238
2028 238 295 283 -87 -258 168 268 120 -14 -198 -270 38 136 79 -203 -103 -63 255 425 24 87 -133 121
2050 121 260 223 -56 -294 -205 -124 200 42 -119 -360 -182 422 301 301 146 120 64 412 182 -69 -276 -190 -3
2073 -3 203 224 -78 -374 -48 145 487 194 -60 -234 -226 188 143 200 -267 -536 -195 -170 145 -71 -229 -144 17
2096A7N77m6o19L3L0J90J26k07k97j04QL79K32j32l41j56O01o9J76l10k17j92
2118c21M68m0J74m10m43L51L02J66k87r9j65J11M84o0l02j33K86k64M38k75k16
2139b35k2O1M48N2m1m57R3j9J58M8j18q3k83K49K51J40j55l19%O8M90L9l50k75
2163b60o7N32K8k80j68k66O11J27p0k80j33r9L22N77l49j38k03j98K68L83o3o97
2185d23j00L39K93L02Ml89l36L11J54J23k15m57J13L45l9L01k10m51J11M36l7
2206A75j13p5j80JK95L18j68l81k98K02L26p2r4j76L5L23K52n0l09l19M24j34
2228a8K34K3n95J3K08K66K80j52k99N4j57M99o7k75j98p8K84J82N7l91l6m00M98
2251f8N12l75l66J4K78M39Q9m68j86PP1K28k60j63k15O3M57K2J23j74k13J2K59
$$ plain form
2096 17 594 548 -71 -38 -8 182 308 101 -196 -300 -292 87 319 187 -154 -310 291 222 398 88 -129 -321
2118 -321 147 107 281 -129 -572 -221 81 247 -40 -139 -304 -193 291 231 -71 -204 82 -182 256 -19 -235
2139 -235 -257 -196 252 304 263 -194 -101 -120 38 86 -32 -115 -398 -149 102 242 87 -232 -232 -164 326 365 15 -260
2163 -260 -327 205 233 -47 -215 -481 130 257 187 -93 -226 -325 -3 574 225 87 -116 -314 -46 337 274 -423
2185 -423 -523 -184 109 411 415 26 -310 1 155 278 63 -394 -281 64 25 326 116 -335 -224 212 175
2206 175 62 -13 -193 -192 103 421 253 -128 -426 -224 102 30 -64 -240 -205 118 370 320 11 -308 116 -18
2228 -18 216 239 -356 -343 -135 131 411 259 -40 14 -143 356 289 14 -184 -262 22 204 261 -130 -166 -566 -68
2251 -68 444 69 -297 -283 -5 434 523 55 -131 -124 -53 175 -85 -248 -463 -400 57 79 202 28 -185 -173 86
2274H6K51l43j09j37K75K73M2j75n49J11J91K8M44n04l5J83J78R1j63k09k01J79
2296i3K40P1l55j0j40K06L10k75m3j68J7K0M16j82j71o5J8M08L9o4m96J13k44
2319d48N51J27j25l19J03j14M41L7l07j59o6K58K61j47k17rj42N87j82j57k7k72
2341c26K89J74K19j89l85L01m6J86l5nm48L6L32K95k68l42J76j64K40J14q4k66
2363a96O5K8J23k8j86K5M6L16R4j46j83j78q5L79r9K19m72Q7K09J32K4k22l12
2386c60K27K19J9J51k95j05n4K64L23j60q6o17M62K59Q4r6m73J16J61L00k33p8
2408B8n8m87M30L34kk65j31jK25J15m9j62p7j84M36qj45q7k42L39L13jm11L2k44
2433c02K65L75k39j52j91k0K15K01r1j73l34K83J37L85k05k71k1L12J78j93l10
$$ plain form
2274 86 337 -6 -115 -252 23 296 338 163 -386 -275 -84 -56 388 -116 -151 32 210 301 138 -71 -272 -93
2296 -93 147 218 -137 -147 -287 -81 229 -46 -89 -257 -240 -220 196 14 -157 -222 -204 204 243 179 -317 -204 -448
2319 -448 103 230 105 -214 -111 -225 216 253 -54 -213 -279 -21 240 93 -124 -133 -275 312 130 -27 -54 -326
2341 -326 -37 137 356 167 -218 83 37 223 188 183 -265 -229 103 398 130 -212 -36 -200 40 154 70 -196
2363 -196 -131 -103 20 -8 -194 -169 -123 193 287 141 -42 -220 -305 74 -25 194 -278 -191 18 150 174 -48 -360
2386 -360 -133 86 105 256 -39 -144 -198 66 389 229 143 -474 -12 247 331 235 -238 -122 39 339 106 28
2408 28 -30 -517 -87 247 245 -20 -151 -152 73 188 139 -23 -100 -284 152 144 -1 -88 -330 9 322 321 -90 -58 -302
2433 -302 -37 338 99 -53 -244 -264 -49 152 61 -112 -446 -163 -26 359 154 -117 -138 174 352 159 -151
2454a51j51nJ72M08Kl01l19l1O27K0r8k12J38m9L38k54j53O7m01L74kN6j57o1
2478a43JL55l9K00m88J92J12j96J66k10j7j48K03J85q3q8k62p7J77M06M5k38j68
2501a15j3J46j4J40j22j78P6J20k06K47j59r8O2L23M4j82m2j38K20r4K65k49l63
2524c30k0K89L13k11l2j04mK95j57N8j92L06k65J45k8j01r1o8K52O6P2k15M8k10
2548a84L04j71J62l26N8K24J48k00po1j90K3M88k63j64R1J20R9J32L2m00J09l9
2571a5N2Jl7P0l61L45m9l9j05j4J1K28J9N1j54j67K12k71J09L35l42k45M90j54
2595c0jk7L8n9jM71l93p5K41j38k21K36j47qJ27j44L6K35k01pj16J95j23J55j69
2620a26K20N9j52R0j28p9M2j20n3L22j74K00k95J83K47j08P3k60J92M6j11j07
$$ plain form
2454 -151 -302 -307 -135 273 275 -26 -345 -376 251 271 173 -39 99 50 388 134 -19 48 -353 21 19 75 -82 -143
2478 -143 -142 213 174 374 -114 78 190 -6 160 -50 -67 -215 -12 173 90 2 -260 -337 -160 246 291 53 -115
2501 -115 -128 18 4 144 22 -156 -80 40 -166 81 -78 -176 -114 209 253 71 29 -109 111 17 282 33 -330
2524 -330 -350 -61 252 41 9 -95 -99 196 39 97 -95 211 -54 91 63 -38 -129 -197 55 121 193 -22 26 -184
2548 -184 120 -51 111 -215 -157 67 215 15 8 -53 -243 -220 268 5 -159 -68 52 151 283 315 -85 24 -15
2571 -15 37 38 1 71 -290 55 6 -33 -138 -152 -141 87 106 157 3 -164 48 -223 -114 221 -121 -366 124 -30
2595 -30 -31 -58 -20 -79 -80 391 -2 -77 164 26 -195 41 -106 -114 13 -131 -95 140 -61 -68 -184 11 -112 43 -126
2620 -126 94 153 1 91 -37 -116 -74 -194 -247 75 -99 101 -194 -11 236 128 201 -59 133 179 68 -39
2642c9n5jL22j44l5J94k04k24K04J55mN6j79k15K7O9P2n5qN0j37J12J50n5j57
2667a01k4L37k67j20J86K2n7K26j49m5k59J42j5J01P2K22k25j74Q6J5Q6K27m76
2690a90J46oJ43o4m6k1J93j03j55J50j76J60j14K6Q1M4m9j8K56j23r5j7n0j06
2714a34J16J36k38K65k59J51J00k44j33jK83k80K40J05p7n7m4n4K6K2j16j0K09
2737Fj24K13k2j63J68k53M54k08Q1k88j41J51Q2j8N6o7J17mj23K72l84P0J98r1
2761a8j10J85k3n7N4N3m5j26k08N4J60q1J08q8J35L7J87l13M1L02k60P1p8n1P0
2786aRj72K35j11K72k32q3j61L04O4j28l6j2pn9Q9m1oK77j76M4j29J07j19J15
2811D3j68q6M5O6q5L00j07Q2j69j08K12L4j12K02r2k92K17q8J86Oq0j18K46l12
$$ plain form
2642 -39 -94 -95 227 83 48 242 38 -186 18 173 169 225 46 -169 -142 -73 -1 -56 -64 -14 -151 -39 111 56 -101
2667 -101 -125 212 -55 -175 11 33 -24 202 53 8 -251 -109 -124 -23 49 271 46 -128 -42 -27 59 286 -190
2690 -190 -44 -50 93 29 -17 -38 155 52 -103 47 -129 31 -83 -57 24 68 19 1 257 134 39 22 -28 -134
2714 -134 -18 118 -120 145 -114 37 137 -107 -240 -241 42 -238 2 107 30 -27 -71 -125 -99 -77 -193 -203 6
2737 6 -118 95 73 -90 78 -175 279 71 152 -136 -277 -126 -44 -62 -6 -73 44 40 -83 189 -195 -125 73 -18
2761 -18 -128 57 34 -23 31 84 39 -87 -295 -241 -81 -162 -54 -142 -7 30 217 -96 -55 247 -13 58 -20 -71 -1
2786 -1 8 -164 71 -40 232 0 -83 -244 60 124 -4 -40 -52 -59 -118 -29 -70 -76 201 25 69 -60 47 -72 43
2811 43 -125 -211 -166 -100 -185 115 8 90 -79 -187 25 59 -53 149 57 -235 -18 -106 80 86 6 -112 134 -178
2835a78o9J07Q7r2J26J01j81K62j89k49J48K11R7k91p2Q5M8L07k93J69L5j24j36
2858i1K4J20j62N2o3R5Qj93L98k98N0k9j29L36l09L24l44K23k35J34m9K14p0J53
2882A59q8l57J77K66k59J52q1m7O3R4Q2l49K42R1r6j55J02Q8j06r3K25K1j11J79
2906A99l78K70j72Rp8J6m0J61o4J21j76J84O9k1J7k12N1m0J21R2k63k00J49J85
2930@o3J05p1L5J7J95l32J44Q6p9j48J23q9j34J2K56k79K28J83k86r6L20j09q9
2954g1N8J67K2k80k6J45m7j6oj00K02j78N9J46O5j14lK32j42r6j3j48J67j5j23
2979a15J98l0l9r4N3J52j57J7L30l42N1K20n51K43J9q1k19J82K4J20J46M1l05
3002a37J02J4j03J86j11M2K32k08n1O5j33K0J9K8J50Jj39K99m90R3j6K90j25J33
$$ plain form
2835 -178 -247 -140 -53 -145 -19 82 -99 163 -26 -275 -127 84 181 -110 -182 -97 -49 258 -35 134 169 45 -91
2858 -91 -67 53 -109 -57 -120 -25 -17 -210 188 -110 -60 -89 -218 118 -191 133 -211 12 -223 -89 -138 76 6 159
2882 159 71 -286 -109 157 -102 50 -31 -78 -15 79 161 -188 54 145 49 -106 -4 84 -22 -115 110 131 20 199
2906 199 -179 91 -81 -72 -150 -134 -174 -13 -77 44 -132 52 121 100 117 -95 -44 -84 37 129 -134 -334 -185 0
2930 0 -63 42 -29 6 23 218 -114 30 116 37 -111 12 -77 -211 -199 57 -222 6 189 -97 -193 127 18 -71
2954 -71 -13 154 176 -104 -130 15 -32 -48 -54 -154 48 -130 -71 75 140 26 23 255 113 17 4 -144 23 8 -115
2979 -115 83 53 14 -80 -27 125 -32 -15 315 -27 24 244 -307 -64 -45 -126 -345 -163 -139 -19 127 168 -137
3002 -137 -35 -21 -124 62 -49 -7 225 17 -34 31 -102 -82 -63 -35 115 116 -23 276 -214 -121 -137 153 28 161
3026A61m78K45M8J98j50j0j55J88r1K73r3l98L99r7j94M2K57q4n0j81P6M4j46
3049a96L34j65lL7o6m6k6J22N1n8j80J25L6P7j10m3K06j06K6k0j1J42j68O1j07
3074h8L6k5J17l4L4J15k88j02L13j93L68k62J20j80o1M20k15j5p9P2k2m1N5k08
3098a63R5o4L5k4K28k17J1K26j7j22J27J29k62J97n2k84M2N6J60j99K08n3j19
3121f2R8Q9j13Q5j40R1k12J57l7K8K10j79K40j60l42K27O0jj37J07j09k8K5P7
3145b6J35j76N4km5L17j39n0j86P0J23P3K0k80J98j36NJ19n3J68k07m4O3N3l13
3170b59K40l4Q9j1k33K4K64l7Q1p0J6p8QJ74j38P2J61m54M19m2j01O1k06Q2r6
3195f8M3Q5j11J80j96p0M5mJ60K2r7m2P5J07L3l57K04o5j78J07N6R7l4J07q8n9
$$ plain form
3026 161 -317 -72 -24 174 24 14 -141 47 -44 229 136 -262 137 40 -154 -112 145 61 11 -170 -94 -50 -196
3049 -196 138 -27 -30 7 -59 -105 -131 -9 42 -16 -196 -71 -35 42 -68 -111 95 -11 15 -5 -16 126 -42 19 -88
3074 -88 -52 -77 40 6 40 155 -133 -235 78 -115 253 -9 111 -69 -130 290 75 60 -19 53 31 -10 45 -163
3098 -163 -68 -132 -97 -121 107 -110 -99 127 110 -12 115 244 -18 179 127 -157 -115 -59 101 -98 110 57 -62
3121 -62 36 125 12 97 -43 48 -164 -7 -44 -16 194 15 255 95 -247 -20 40 39 -98 9 -100 -128 -103 -26
3145 -26 109 -67 -13 -15 -60 257 118 68 -118 -48 75 148 168 -112 86 -50 -45 74 21 189 -18 -62 1 54 -259
3170 -259 -19 -53 36 25 -208 -184 80 43 124 54 70 -8 0 174 36 108 269 -185 234 192 91 152 -54 28 -68
3195 -68 -25 60 -51 129 -67 -137 -92 -96 64 86 -11 -53 22 129 162 -195 9 -56 -234 -127 -71 26 -8 99 11 -48
3221d8J21k2J05j09k18K69k20K28oJ5k25J73k02K73p3R4j85J09j17j20K18o7m
3244a1QJ33k48K5Q9J23l06K27Q1J04k3o1M4l71K50k01K33n6pp7p7L6P0j01J56
3269D0k04K18J43q3p5Jr3J93K0r2p1J0kO1K7j32J69j40j53J54j6j00K18J4k33
3294a26K29j62p4K31r8J70r5r1J06Rj43P3j61J99j25j19J24L9Q5J74j83q4OK6
3318A0j38R4o0j17K66N0n1m4m0L6L83m01j68K45J9m3q3o5J71M7k9o2J15j12k5
3343bk10K85K0p8J36j74J13l6J21j06l26J28K1k5j39J52m6J76k42K71M3j72QK43
3367A61j31n7Q5o1K3r1N1Q5r7J05j40n2J74l09K72J11l4K8Q5j99R9m4m5O4j46
3392f3m1J11j50J05J00k01R7O8J3n9Q2j81j24k8K54m3K2J5m8L0j14R4k5K78j84
$$ plain form
3221 -48 73 51 156 47 -171 98 -122 106 100 115 -110 63 -139 134 61 155 -30 79 -38 -158 60 -7 -11
3244 -11 -3 130 -118 -93 -4 119 -187 40 121 225 202 141 185 -186 64 -137 96 40 33 -44 -121 -85 -15 -116 40
3269 40 -164 54 197 114 39 40 -53 140 160 68 -3 7 5 66 93 -39 130 -10 -163 -9 -25 -125 93 107 -126
3294 -126 103 -59 -133 98 0 170 75 -16 90 99 -44 29 -132 67 -58 -177 -53 -14 71 245 62 -22 -16 10
3318 10 -128 -34 -94 -211 55 105 54 10 -30 6 389 -12 -180 65 84 41 -42 -107 64 111 82 20 135 23 -2
3343 -2 -212 73 93 15 151 -23 90 54 175 69 -257 -129 -108 -133 -272 -120 -166 10 -232 39 82 -90 -82 161
3367 161 30 -27 58 -3 20 -71 -20 65 -32 73 -67 -119 55 -254 18 129 95 123 208 9 108 64 19 83 -63
3392 -63 -104 7 -143 -38 62 -139 -42 26 39 -20 62 -119 -243 -271 -17 -60 -38 -23 -71 -41 -155 -61 -86 192 8
3417Hk61L00K7J02l12L34k04m3K11l5j2k00J35J41l76K28j4m5L4M4j70J3Q7J00
3441I2p9R2j13l4J84L2l0o8Q3k3k05jn2K20l15J62M8p4R2j12J18rk3J52j05m5
3467a3J15q7O4o4M2R5k69K24q9k08M35j58P7o7r6J57j1k66J96p8j3J20l0P7k88
3492a35L28k56P2O5o0k2K25m16K09o6j2K43J0j87j47L00j52R8j90L29l02k3j22
3515b11J30k2m7K78j07J35k97M5J28j78Q3J19Q5j51Q8q5L4n7p2j65M09o0J13l45
3539a50J71L4j54K2K25n4l17J03J13j51Q4N8R9O0j96J32l81L96J7j12j80n1K91
3562E9Q3N5k71n6J80n2j17O3J30j85p1J46r5k0P2q8J34J49k94L28k8k55R6J11
3586G4J59l80J59J02j46N4j35N6O5o5M8m2J57j44J89j2j99M3j6nJ48k4p8J8l9
$$ plain form
3417 8 -253 47 74 176 -136 198 -6 -49 162 127 115 -85 50 191 -185 43 29 -16 18 62 -108 -95 -8 92
3441 92 13 105 -8 -42 142 174 144 76 159 136 -69 -70 -122 98 -217 -55 -7 -81 11 -101 17 8 -15 137 32 -13
3467 -13 102 15 79 15 57 152 -117 107 18 -190 245 87 164 97 1 158 147 -119 77 -1 -14 106 76 153 -135
3492 -135 193 -63 9 74 14 -8 217 -199 10 -56 -68 175 185 -2 -149 151 -1 97 -93 236 -66 -89 -211
3515 -211 -81 -103 -150 128 21 156 -141 -96 32 -146 -63 56 141 -10 78 -7 27 -30 -102 -267 142 82 195 -150
3539 -150 21 55 -99 -77 148 94 -223 -120 -7 -158 -74 -16 83 143 -53 79 -302 94 111 -1 -181 -232 59
3562 59 142 197 -74 -130 50 -2 -119 -56 74 -111 -182 -36 -131 -151 -79 -167 -33 116 -178 150 122 -133 -37 74
3586 74 233 -147 12 114 -32 22 -113 -57 8 -57 -9 -51 106 -38 151 139 -60 -17 -33 -38 110 86 8 26 -13
3611a3M2J23k6n5l1K36l97R9n8M1l2J37O4j77q6K17j18O0j34Q1n0kL6l4J32k04
3637a49J52Mn8J19k45K17j24R2j78K62j6M9l88L13j21K0R8j05N4k0L01m27K89
3660A39j91j6J12N9j48L7pp0J20J62j14q1o0Q5J33j16n1l9J71l5l9M9n0O6r9J61
3686A78J0l77J99K5J7r4M4O9j05QR9n3R0l91L30k2j62O6P3p1o6q8K90j10J71Q
3712A38j3rJk23K85j35J1pm2r7O5k2J9J02kq3kkK16j71j5J43J22j57j11j8j10
3739a17L4K3p4K34n2j69j3J31J76k04O5n2l6R2j2r8kJ95m4j09o4r4L61k79P0Q3
3765D5q2j04J45J06p2j47l6K3J13N1P1Qk39l41K95j53L46k21O0L20l04M6P5O5
3789G0l3o2P2Lj80K14j77J14j22K83k00J09j78J43K6J9l5J69j88j82K54r6J4j4
$$ plain form
3611 -13 29 152 126 71 40 276 -121 -22 -80 -39 -71 66 130 -47 -133 84 -34 26 -108 -27 -77 -79 -43 -77 55 -149
3637 -149 3 7 -51 68 -177 40 -84 8 -170 92 76 125 -263 50 -71 -51 47 -58 -4 -24 277 -150 139
3660 139 -52 -68 44 103 -45 -8 -15 -85 35 197 83 2 -58 27 160 44 -7 -46 125 90 51 100 50 116 17 178
3686 178 188 -189 10 35 52 -42 2 71 -34 -26 73 20 110 -281 49 27 -135 -69 4 -67 -133 -221 69 -41 130 138
3712 138 125 116 117 -106 179 44 55 48 6 -91 -26 -48 -29 73 71 -12 -14 -16 200 29 14 157 279 122 11 -7 -117
3739 -117 -83 -60 -134 100 48 -121 -134 -3 173 -31 34 -18 -54 38 26 -72 -74 121 77 -32 -96 -190 171 -108 -38 45
3765 45 -37 -141 4 110 38 -109 -145 -122 -9 42 113 121 -118 -459 -164 -317 29 -192 -132 188 -116 -70 5 70
3789 70 37 -25 47 50 -130 84 -93 21 -101 182 -18 91 -87 56 82 101 66 235 47 -135 119 23 37 23
3813B3L6j28J1J0r2J14J22Q7l10j5nJ66L6j53J11P7L9M7r5l0k21L12j88p1K7J3
3839g7O4q5K32k40K45n3n4M8q2J69p0j8j60O9K46j71k12K05o7o5n6J35q1J80j30
3864b8j16J36k03L06J19l77L15o3l5k33J44J04j45r7K45j65K16j53j8N6K32k40
3886@K9J42j17J09r0k35K20Or5Kk6P9o4l4K4K05l93L60j57j06KM9l7K64k04K04
3912A37j23m7ll9J49J7j21MO2o1j6o3K87j82k2j40K34q0j42J37o7J92k3o5k05
3937a80lN7M6O0R9o7JM6j73J33l5O0j05L8K16l61M4J66j24j06P0J53L7k57M34
3962B49j97j87K14k31J29o1J94m98K74j94J57r1L63j08J06m8J22k21K5Q4K4l6
3984F9o4n0o1k6R4J17r5P8j03J21j52JlN3J79n6nn8N7k64K05j73J04j52J45j37
$$ plain form
3813 23 59 -69 -58 -48 -140 -26 96 183 -127 -142 -147 19 55 -98 13 90 129 176 81 51 -170 142 -46 -117 -90 -77
3839 -77 -13 -98 134 -106 139 86 32 80 -2 167 97 79 -81 -12 234 63 -149 56 -11 -76 -132 3 -78 102 -28
3864 -28 -144 -8 -211 95 214 -163 152 89 54 -179 -35 69 -76 -173 72 -93 123 -30 -48 8 240 0
3886 0 29 171 54 163 73 -162 58 64 -31 -29 -55 24 -40 -74 -50 155 -238 122 -35 -141 -139 -90 -127 137 -67 137
3912 137 14 -33 -36 -75 74 91 -30 -26 36 -25 -41 -104 183 1 -21 -161 73 -7 -149 -12 -79 113 90 25 -180
3937 -180 -183 -126 -80 -20 79 12 13 59 -114 19 -16 44 -61 -23 193 -168 -124 42 -82 -188 -118 35 72 -185 249
3962 249 52 -135 79 -152 -23 -84 110 -388 -114 -308 -151 -242 121 13 119 71 193 -28 -3 81 105 69
3984 69 5 -45 -106 -132 -38 79 -16 62 -41 80 -72 -71 -74 -21 158 102 97 39 96 -168 37 -136 -32 -184 -39 -176
4010a76J2L80Ql88J17P6p5Q3j23m2M5M00l58P0p4K75k06j08K3lJ39r9J50q9k22
4035a85J75j13r2L12j83J72j50O7j35J38o2j28K83k93J31J50k63M10j39j8p1j79
4057a73K03j0j20Q8R3j81K42r8K1l5o2M4p2K8O4R7l51J76j24k4L13q0Rl0j66M3
4083a05J39J40j33k1r6m4j73M58L5l37j6J68k96K15J48j89J66l0K04k25p6R3j5
4106A0j29K65j58J08l4K76n03%J72j09K74j33L2j37J11j69j15M20m9j25m6K00
4128A61r3o4J02o8J17k22l9J98l4p3R8j86J88j7j87J67k5M7k07K11l9j43M8Q4
4152B4j71p7L57j22o1J77k1Pk34Q5j42O7L9R8l7R7j79P8oJ54j85L0Qn1j41O1R2
4179e3J3k17Q9P6j41R3Q4J52j47K06r8j42P9J16j31j09K03Q4l86K21p9K68L5l04
$$ plain form
4010 -176 -164 216 224 -164 -47 29 -46 37 -86 -128 -83 317 -41 29 -45 230 24 -84 -61 -64 75 -24 126 37 -185
4035 -185 -10 -123 -215 97 -86 86 -64 3 -132 6 -56 -184 99 -194 -63 87 -176 234 95 77 6 -173
4057 -173 30 20 -100 -12 81 -100 142 44 65 30 -32 12 -60 -32 32 129 -222 -46 -170 -194 119 39 48 18 -148 -105
4083 -105 34 174 41 20 -76 -120 -293 165 200 -137 -153 15 -281 -66 82 -107 59 29 233 8 -68 25 10
4106 10 -119 146 -12 96 62 338 -165 -165 7 -102 172 39 71 -66 45 -124 -239 181 132 7 -39 161
4128 161 68 4 106 38 155 -67 -106 92 58 -15 83 -103 85 68 -119 48 23 70 -137 74 35 -108 -60 24
4152 24 -147 -224 133 11 -50 127 106 113 -121 -36 -178 -111 -72 26 -11 86 -93 -15 -21 133 -52 -22 -14 -65 -206 -145 -53
4179 -53 -40 -257 -168 -92 -233 -140 -56 96 -51 155 57 -85 -6 110 -21 -130 73 157 -229 -8 -87 181 216 -88
4203h8J26O2N8k79J81q0k25M59k38p5j01PK92p0K35j91m9j2M3j21l5K87r0R3k71
4228h2J77r1j18n3J19K7J93j93j3P8J22l19L13p8j22L1j23L87k36Q1k50J87j40
4251a03J05O3l8k24P9lL02j69J01j62K79m26k8J00K60l79K46k35K28O4J17j30
4273D7o4p9m1J10J43l02J92Q3j72jj9J18N7Q5o0l11N3P7J38j0j07R6O6N2j36M5
4299F0Jj69L4J88p0j26K26l20o7J64K18k51J83j39P9J90j44j88Q1j8k6J50j2l05
4323b61K60J22j43K3J20k92J12K19j91n1q4L23j42j88J94n8n0k9J07N8l0J1j35
4346a05oQ5K2J28j49Oj23L14k68K85k28j79L14K0J74q0j27k44J32J13j07K3j93
4369a93o4L35q9J20k20l3K8K5K18R3j23j71L0J45n8Qo1o6M4J23j49j3J86q8Nj28
$$ plain form
4203 -88 38 100 158 -121 60 -20 -245 214 -24 -99 -200 -193 99 29 264 73 24 12 55 -66 -101 186 96 189 -82
4228 -82 95 4 -114 -167 -48 -21 172 -21 -34 44 166 -153 160 82 -40 -9 -132 255 19 100 -150 37 -103
4251 -103 2 65 27 -197 -118 -121 181 12 113 -49 230 -196 -224 -124 136 -243 3 -232 -4 60 177 47
4273 47 -17 -96 -137 -27 116 -186 6 89 -83 -84 -103 15 72 157 97 -214 -161 -84 54 44 -63 33 99 151 15 60
4299 60 61 -108 -74 114 44 -82 144 -176 -243 -79 139 -112 71 -68 11 201 57 -131 -50 -68 -94 56 44 -261
4323 -261 -1 121 -22 1 121 -171 -59 160 -31 -82 -166 157 15 -173 21 -37 -87 -116 -9 49 19 30 -105
4346 -105 -111 -26 -4 124 -25 -19 -142 172 -96 189 -39 -218 96 116 290 210 83 -161 -29 84 -23 0 -193
4369 -193 -257 78 -11 109 -111 -144 -116 -91 127 220 97 -74 -44 101 43 51 -10 -76 -32 91 -58 -71 115 27 32 -96
4395i6J9K1k0J10O2K9k12M6J9K43j55m4O2j98K23j66L0J15j15Kk9J33nk56K5J44
4421a3q2K29J1l34N3K99j56J75k87J68j81J3J68j66J03j56R6J87j14K01k63J45
4443I6j10p9N5J40j55O1m3K38l8l36L34j62O8%o8m9j11O4O9J4K38k59R2k0m2k2
4469b5j08L1J55q0j10K27k73K39o4J74j20j0m8m5K12q0j84J60P2k29P4o2m8J21
4493b1J07k29J50p5J6K75l00OK24p2j10k15M40k70K4J50l4l70K84P9L9K7m7o9
4517Ip4r0R4J48j65%L48k92M7m7lJ8k8Q1J11l45K22m7J33r8R1j24J41l86K06j9
4543f9K13q6j26J32j5N5j70M0n3j62J53R9k24J60p3K76j58K9q2M9K1P9m0k69J83
4568c8J17k54J34J29l2j2J08k72J64J61k17L45m02J38K7l04K84K7k49L49j75o0
$$ plain form
4395 -96 -77 -56 -76 34 96 125 -87 -41 -22 221 66 22 84 -114 109 -57 -27 88 -27 -25 -54 79 74 -182 -157 -13
4421 -13 -95 134 145 -189 -136 163 7 182 -105 63 -118 -105 63 -103 0 -156 -60 127 13 214 -49 96
4443 96 -14 -93 -38 102 -53 8 -35 203 165 -171 163 1 69 69 1 -48 -159 -95 -26 -12 226 -33 59 39 -3 -25
4469 -25 -133 -102 53 -27 -137 90 -183 56 -8 166 46 36 -12 -57 155 75 -109 51 123 -106 -32 -94 -142 -21
4493 -21 86 -143 7 -68 -52 223 -77 -71 153 81 -29 -244 196 -74 -50 100 66 -304 -20 59 98 125 78 9
4517 9 -65 -155 -61 87 -78 -78 270 -22 25 -22 -25 -7 -35 46 157 -188 34 -13 120 22 113 -11 130 -256 -50 -69
4543 -69 144 58 -68 64 49 104 -66 -26 -79 -241 -88 11 -213 -53 -126 150 -8 21 -61 -12 9 88 48 -221 -38
4568 -38 79 -175 -41 88 56 44 152 -120 44 205 -12 333 -69 69 96 -208 76 103 -146 203 28 -32
4590c2p0J6ML6L36j80k14P1Q4j54R7J30k56L67k9l75K66k32R4J30j52N3Q6j36
4614f0o1J30n8J69k38R0J03m05L71m7j22R2o1J93p7j6L2q1O5MN2j52m7J31j98
4639a91J78j9j03J88RL3O0p6j83OK4J90l59J35j9j79J50K31q8L1L8r8K84j75J5
4664H2j41J53j64P3P1qj80J6k21K97K0j03p9J20J6NL7J15J35l04J95j93M1J23
4688A06l43J7J91K22N9m08k3L04k62Q3K4J11r4R2m1j86Q6K9m2J59J70l66l6K55
4712A07M8l34K56O9j33n3n6J9K08k68M9P4k11L67l18J27J58q7J18j00j01P2Q5
4735I6k13J96L9r1j64K17j16J73k10R9j67J10m8j04K37k0j78M5J4P2J06k80L4
4758a53K23k14K32j03J17k25J16M3j07J6L1j68%L30r4K7k15K04j93J36j19K55
$$ plain form
4590 -32 -102 -86 -82 -46 290 110 -104 -33 51 -103 -6 124 -132 235 206 -169 97 -135 -41 89 -63 -10 76 -60
4614 -60 -121 9 -49 120 -118 -28 75 -330 41 -6 -128 -36 -97 96 19 3 35 -46 19 23 75 -77 -124 7 -191
4639 -191 -13 -32 -135 53 62 95 155 79 -104 -98 -74 116 -243 -108 -127 -306 -156 75 -13 18 56 -42 242 67 82
4664 82 -59 94 -70 3 74 66 -114 -98 -319 -22 -2 -105 -184 -64 -48 -43 -6 109 244 -60 135 -58 -17 106
4688 106 -237 -220 -29 193 252 -156 -179 125 -137 -54 -30 81 -13 79 38 -148 -62 -33 -75 84 254 -112 -148 107
4712 107 155 -179 77 146 13 -40 -96 -77 131 -137 -88 -14 -225 142 -176 -49 109 22 140 40 -61 11 96
4735 96 -117 79 118 27 -137 80 -36 137 -73 26 -141 -31 -79 -183 54 34 -144 -99 -85 -13 93 -187 -153
4758 -153 70 -144 88 -15 102 -123 -7 36 -71 -55 -24 -192 -192 138 44 71 -144 60 -133 3 -116 139
4780A39k57J42K3n3k8Q9j71L8J84K3j10j10O3J82k45J24j81qR9J38R9k01O3j23
4804h1J11o9J24n7l2j56J30j18K39lj16q9JK93j09M0j09j27O3K49l00J46Q4k07
4828i3J21O7J2k74K66j06m1L1j20J02j1M3K4qP3k24K13j34K6Q8k9J43j13ol7N6
4854F9j0k22J93j05J31lM3K2m3k90K59j74K17j13J32j94K15k04O6P1K9o7lM1l07
4879b47M14j29K0Lj08o6R1Pj20J87J8k26J19O1Mk35L69k93J45j20J46k09J50j17
4903a36J61J3j0Q4n3r5N1Ok19K10L9l58K19J68J21M6l11K6j01K09j9J06j96j9
4927e8J96k58P4mp2P8J2j3m3K88l32J68j12J09j88K7K86j75N8j70K29j10j66J13
4951f3P2L4O5j23J01m7j26K69j72R6pk2j54P9J7j85J43j08J28r4K91k12j12L18
$$ plain form
4780 139 -118 24 47 -6 -34 55 -116 -78 106 129 19 -91 -28 154 -91 33 -148 -156 -57 81 180 -21 42 -81
4804 -81 30 -39 85 28 -4 -160 -30 -148 91 88 -28 -117 -116 177 68 108 -1 -128 -65 184 -116 30 114 -93
4828 -93 28 95 107 -167 99 -7 -48 -17 -137 -35 -46 -3 21 13 86 -138 75 -59 -33 55 26 169 56 50 13 69
4854 69 59 -163 30 -75 56 53 96 118 75 -215 44 -130 87 -26 106 -88 127 -77 -11 60 89 22 19 60 -247
4879 -247 167 38 58 61 -47 -113 -22 -15 -135 52 70 -156 -37 24 28 -207 162 -131 14 -106 40 -169 -19 -136
4903 -136 25 38 28 112 59 -36 15 21 -198 12 51 -307 -88 80 201 247 -64 -38 -139 70 51 157 -39 -58
4927 -58 138 -120 -46 -50 -122 -44 -32 -45 -88 200 -132 36 -76 33 -155 -128 158 -17 41 -129 100 -10 -176 -63
4951 -63 9 43 108 -15 86 39 -87 182 10 106 99 77 -77 2 19 -166 -23 -131 -3 -97 194 -18 -130 188
4975A88k27j34R5O0N6J59k33J14j99K35j17M7j34j47L14J88k33J09n8j62J33N6
4997A10m9O8k21J04q4J09P6m23J71J13N2n4L7l3j13j0J18J24n4M8j14q8K03j31
5021d1P5j36J8J14j6k7o7j39J68o0q8K22L7j00P8j79J78J56l20p0R7K17J09o3
5045A63m11L16k65L69k49J76k31L06j63j68K03o4j03Q5k89K64J09l40M43M9o8
5066A32k05p3J09J78k56K43r0j30J12L7Q6J4k17L6l7J15J08k07J26j60J57O7j25
5089B0r5j5K4l8J37Q4k79rL01j66J04oOn0M8j88K20j10O6J4k03LP3J62j39LRQ6
5117F2J11L2k06J40k20K55k43K58Ml57P5r8P2j31L90o9k24k8M0L29j64k7J9jj67
5142a48J22J31j28R7n1j68J06Nq5L05q3L1q1J9R4l05N4j7J85j8k45K48q2J92J45
$$ plain form
4975 188 -39 -173 -78 -18 38 197 -36 78 -121 114 -3 44 -90 -237 77 265 32 141 83 -79 54 110
4997 110 61 129 -92 12 -72 37 113 -310 -139 -26 26 -28 9 -24 -137 -147 -29 95 41 89 -25 -113 90 -41
5021 -41 34 -102 -84 30 14 -13 -80 -219 -51 -111 -199 23 60 -40 38 -141 37 193 -127 -197 -100 117 226 163
5045 163 -248 68 -197 172 -77 99 -132 174 11 -157 46 -18 -121 -36 -325 -61 48 -292 151 200 132
5066 132 -73 -146 -37 141 -115 128 38 -92 20 57 143 157 -60 -24 -61 54 162 -45 81 -79 78 145 20
5089 20 -75 -90 -66 -104 33 117 -162 -171 130 -36 68 62 68 18 66 -122 98 -12 54 68 -135 -132 -59 103 -36 -33 -24 62
5117 62 173 205 -1 139 -81 174 -69 189 193 -164 -89 -187 -115 -246 144 75 -149 -177 -137 192 28 1 20 19 -148
5142 -148 -26 105 -23 74 23 -145 -39 -34 -119 186 103 134 53 72 166 -139 -85 -102 83 65 -180 68 -14 178 323
5167C23l26j20J84j56N8J44j35p0l0j03K29J53k47N0j86J37J0L03k44p7J12J1
5189B0N8k6o6L2l4l0J16r5O2m9j18k52L65J0k9M8J40j26J96l29K66k29J7j13J19
5214d7q9K09p8k4m3K28o8Q2k37j72J87j3nj20L35k0j95R2j5J26k15M0O9J28j73
5239a8M9R1j36r1J38j5J14k00J04k02J20p5N7k3P5J09j76j23L80j26k85L10j07
5262c0K76l84O1k0L38k62Q0q6k2l6j4J43M6m0j22nO8o7J02r4J6n5j56J71J97n0
5288E5J8Pj45l9K74j13N3j0k35K22k30K42j12k6j52Q5j39K39j16K0J77j97N9o
5312f9M2Pl9n0NK30j32RJ0J36p6j00k78L02j16K25j58R2j21J52j11JJ10k2r4O4
5338A9j62J12K13j43KR8mj07k5K7n5K78k00o0Kk2Q4n9O9j76n6j49L43L7p6Q8K5
$$ plain form
5167 323 -3 -123 61 -95 -37 107 -28 -98 -128 -231 -2 151 -96 -46 -232 -95 -85 218 -26 -103 9 20
5189 20 78 52 -14 18 -16 -46 70 -25 37 -12 -130 -382 -17 -7 -36 12 152 26 222 -107 159 -70 -53 -166 -47
5214 -47 -136 73 -5 -29 -72 156 88 170 -67 -239 -52 -65 -70 -190 145 125 -70 22 7 133 -82 -42 27 155 -18
5239 -18 31 122 -14 -105 33 18 132 -68 36 -166 -46 -121 -64 -87 -12 97 -79 -202 178 52 -233 77 -30
5262 -30 246 -138 -77 -97 241 -21 59 -27 -49 -85 -99 44 90 50 -72 -77 -9 -76 26 -68 -52 -107 -263 -92 105 55
5288 55 73 80 -65 -104 170 57 110 100 -135 87 -143 99 -13 -39 -191 -106 -245 -6 -122 -102 75 -122 -63 -69
5312 -69 -27 -20 -59 -109 -104 126 -6 3 13 149 73 -27 -305 -3 -119 106 -52 40 -81 71 -40 -39 71 49 -45 19
5338 19 -143 -31 182 39 41 139 135 28 3 30 -25 253 53 -7 -5 -27 57 -2 67 -109 -165 -314 29 66 -10 78 103
5365A03k16K9J46K5m1j0Q1k37m7L23r2k00J81k17K04K5J06k3l3Q5j99r9o3O7J51
5390D9j06P7K41l24J4K10k08L6J27k30n3L34l00L9L8R4J0r7p8J94Q2K8r1qJ86
5415B64j49J1j7K0j57o7J94k37N8kJ34J32k77J94j17J57j66o5J44k25K97k80K61
5438A07k26j4lPm4j5L9J63J75k73J29m1N1k84J35K2M8J01q8n5J50J15l29K20o3
5463B7N8J05m2j37K8q3pj23K51j72O0m4j05J26P3K36l69J13J33K8k34K24j00J81
5487B27K7l05j4l8J45M6L2j79R1r8l0L76j09P6r3m8K0j69j07J35n1j32L87k04
5511a5J73o9j57L5O8m13O01j0j40j09r6J09m6J02o2M68m69j34J5J17n6lq7J86
5535HMQ6j78j01O6K29k09L9o1J74r0K82k61m0Q6j71k9L78k92rK36j91J45o4K30
$$ plain form
5365 103 -113 -84 62 87 46 36 117 -120 -167 156 64 -136 45 -172 32 57 163 140 107 192 -7 -106 -169 -102 49
5390 49 -57 20 261 -63 -49 161 -47 -11 116 -114 -167 167 -133 -94 -56 38 48 -49 -127 67 149 177 86 78 264
5415 264 115 126 109 129 -28 -95 99 -138 -80 -82 52 184 -93 101 -16 141 -25 -90 54 -171 126 -154 107
5438 107 -119 -133 -136 -129 -173 -188 -149 14 189 -84 45 4 55 -229 -94 -72 -24 77 -11 -66 84 199 -130 90 27
5463 27 85 190 148 11 39 -44 -51 -174 77 -95 -35 -79 -184 -58 15 251 -118 -5 128 156 -78 146 46 227
5487 227 254 -51 -65 -103 42 88 120 -59 32 -66 -96 280 171 247 154 106 126 -43 -150 -15 -66 -198 189 -15
5511 -15 158 89 -68 -33 35 -378 223 213 73 -36 -132 -23 -69 33 -29 439 -30 -164 -149 -32 -88 -91 -178 8
5535 8 12 98 -80 -181 -115 114 -95 -56 -117 57 -33 249 -12 -52 34 -137 -166 212 -80 -89 147 -44 101 37 267
5560B67K3n28R0L40j44L35m88R4R4N9j62J38k13K62K6p0j34J11N9l91L73j42J18
5583A17m45J49J73J74k40K93j61n2n4j0poJ03r5J76j03JN9k77K91N7k47J13k38
5607b29K91j82J12N7qj07M5K83l79r6J27J22Jl6k7r7P7O6j4L0r1K57j95J24m17
5632b86M25j96K44n6r3q1r6J92j27k37J42J40j01R0J74K9j60o5j00J86k09K11
5654B6k73M18n3j01k2j53K07L2m02L85J50j12q6J08j84k3J66M5o8k00J51Pq1j1
5678g4J18L9l98K35J38q4K22j71P6M0k7k38k07L77J8j60J27p1k1K45j65p3J19
5701F5J46k99J33J09Rj01J4J6j92K07j20K1j86J59J17j04j09J25pj67L31k37L49
5724B79j93k6k99K93l0j13J62j4j71J10jj25j5J19k03J98j63J54m8m8J64n5m8
$$ plain form
5560 267 290 -238 -148 192 48 383 -105 -11 83 142 -20 118 -95 167 193 123 -11 100 159 -232 141 -1 117
5583 117 -328 -179 -6 168 -72 221 60 8 -46 -56 -63 -69 34 -61 115 12 13 72 -205 86 143 -104 9 -229
5607 -229 62 -120 -8 49 41 -66 -21 262 -117 -213 -86 36 37 1 -26 -123 -46 20 6 36 -55 202 7 131 -286
5632 -286 139 -57 187 131 38 -43 -139 53 -74 -311 -169 -29 -130 -40 134 163 3 -62 -162 24 -185 26
5654 26 -247 171 118 17 -5 -158 49 81 -321 64 214 102 16 124 -60 -83 83 128 60 -140 11 18 -63 -74
5678 -74 44 83 -315 -80 58 -26 196 25 101 141 114 -124 -331 46 64 -96 31 -40 -61 184 19 -54 65
5701 65 211 -88 45 154 163 62 76 92 -100 107 -13 8 -178 -19 98 -6 -115 10 3 -164 167 -70 279
5724 279 86 60 -239 54 24 -89 73 59 -112 -2 -3 -128 -143 -24 -227 -29 -192 -38 -86 -134 30 -25 -73
5747g3n0p8N7K30l06J86K36l14j6J05j4R5np7K17k39q0J31kj50Q3L7r2K14k27
5772a32M5J37j82K77k79M34m11J48l4j2m1J20j28N5Pk77K08%K53k40P3p8j44K03
5796BM5k2l1o5N9N9j12K92j50p4R7j00k56L48k94L30j65J86O7l25J16k88L92k23
5820a12K27k47Q3J95j57K3qK42j92l22J46k3K03P9k41O4L06n15K88l2L5j42M5
5843e5R0J93l72j00L19M3N9k14ol7L02l60J58m9j78ML12k56J15L3J12j39j6p2
5867a14K36k4j17O5j66J9l2J84j6N0N7j56J35l7l31L67O8k41n5j11L9n7J92O5
5891B0j66L15j38j00j49N5J14M6L9k02L8N8N5J32N0j44Or3R5P4J11pj10j62RR8
5917D4J41k29l6K00l36M16Q2l69J69J03l25K65j34J15n6N7J7j33kK25m19Q1J19
$$ plain form
5747 -73 -123 -201 -144 86 -220 -34 202 -112 -128 -23 -37 58 53 -24 193 -46 -126 5 3 -147 -64 -27 -119 95 -132
5772 -132 -87 50 -132 145 -134 300 -111 37 3 -9 -50 70 -58 -3 4 -273 -65 -65 188 -52 21 -57 -201 2
5796 2 47 25 -6 -71 -12 47 -65 227 77 3 100 0 -256 92 -202 128 -37 149 216 -109 7 -281 111 -112
5820 -112 115 -132 -49 146 -11 12 4 246 54 -268 -122 -145 58 137 -104 -40 266 -249 39 7 42 -100 -55
5843 -55 35 228 -144 -244 75 118 177 -37 -43 -80 222 -138 20 -29 -207 -203 109 -147 -32 1 113 -26 -42 -114
5867 -114 122 98 -19 46 -120 -101 -133 51 35 85 142 -14 121 84 -247 120 188 -53 -108 -219 -180 -237 -45 20
5891 20 -146 169 31 -69 -218 -163 -49 -3 36 -166 -128 -70 -15 117 167 23 29 -64 31 105 216 209 99 -63 -54 44
5917 44 185 -44 -80 120 -216 200 282 -87 82 185 -140 125 -9 106 50 107 124 -9 -11 214 -205 -124 -5
5940ej60J67l7KK8K1J44q9k07o2R5L3k68L32r7L9J60l1k70J06P3j7kj04j5L48
5966A84j19J9p9j28j9J73o6J01J10q3j13j53K0J40KJ07J6j90K3J26j25J56k22
5989a20R6n8N1n3%K3J2N3J26j74Q0pl6J78j06k79K88k77J72P5q8J72mN9j98J38
6015A23j93J3N3Q3k71J99J17n4J26j19k0J18m28kL10p3K63l88J70j14J55j10J24
6038H2j18M0j88K86k28J26j62K00%j16L10j99N6j05J48r3M4n2L6j14O3q8J49k4
6062E3p2J15j64J66k63K51P2O0j49p8Q7K8j03Q1Nn6R5L4j91O8J54k46n4K21k19
6087a05J72j32K86j70L2l4j43J20Mq2N3j58J14Pj72J33K29k68p8N9K33k49K72
6110A23J07k84Q8J52q7j43J76j6k0J3n1l1l9j7Lkq0K2J43j36J60p7n5l8K53l70
$$ plain form
5940 -5 -165 2 -35 -33 -5 16 160 71 -136 -198 -103 -70 -338 -6 -103 -64 96 65 -205 -99 -26 -43 -45 -149 -164 184
5966 184 65 84 5 -123 -142 31 -35 66 176 93 -20 -173 -153 -13 -11 96 112 -78 -55 71 -54 102 -120
5989 -120 -24 -82 -31 -84 -84 -61 -49 4 130 -44 36 29 -7 171 65 -214 74 -203 -31 44 -44 128 124 183 -15 123
6015 123 -70 -57 -4 79 -192 7 124 70 196 77 57 175 -253 -255 55 -18 245 -143 27 -87 68 -42 82
6038 82 -36 4 -184 102 -126 0 -162 38 38 -78 232 33 89 -16 132 39 83 31 67 -47 16 -72 77 53
6062 53 -19 96 -68 98 -165 86 158 218 69 -9 78 106 3 84 89 33 128 162 -29 39 193 -53 -107 114 -105
6087 -105 67 -65 221 51 83 49 -94 26 30 -52 1 -157 -43 -36 -208 -75 154 -114 -192 -133 100 -149 123
6110 123 230 -54 34 186 99 -44 132 116 96 109 58 27 -12 -29 -26 -28 -108 -86 57 -79 81 4 -51 -89 164 -206
6136b06K69N0n4M6k16j02J13QK38l10M3J14l4k0j49L34j95J22k08J08J45J4N1
6159A61l30M7J96rl1j93K59m1l0J60k26p5K73j48N2j3j11J61Nk30J94J26q5p5
6183C7q3J58k19J07k0l4K40l52K45Q4j35j29K81l34K28j11J10j41j38K23Q8o9
6205C6p1R5r4p7m0R0O9Q4j20R7j82J16k93L48k77J69k9l7P9J01m8O8Q1k86L10
6230A89k68j43J98K28l28k52L55R9K27m40K77m6j09K7p4J59r3P0l0l59M20J0k54
6253a37J26l4N2p4M1n7l6K66n6P2j2k02j17K01K65l20j45L7k6K02o5j3k3j24J70
6278il8J76k93Q9N4l8L35j36l7j20q9J07J08j02Q6j53j82L62Nrp2%j31K26k15
6303g6J24P3k20JRj69J97J41Q5k83J28K0l3o0J7J05r8p8l4q1J98J21J0Oq6J32
$$ plain form
6136 -206 63 113 59 105 -111 -213 -100 -92 146 -164 -121 -7 -41 -61 -210 124 -71 51 -157 -49 96 110 161
6159 161 -169 -122 74 65 34 -159 100 59 29 189 -37 -112 161 13 65 52 -59 102 107 -123 71 197 112 37
6183 37 -46 112 -107 0 -20 -54 186 -166 79 163 28 -101 180 -154 74 -37 73 -68 -206 17 105 36
6205 36 -35 60 -34 -111 -151 -61 8 92 -28 69 -113 3 -290 58 -219 -50 -79 -116 -37 64 16 84 165 -121 189
6230 189 -79 -222 -24 204 -124 -376 -21 78 305 -135 142 96 -13 14 -60 99 6 76 46 -313 107 117 -137
6253 -137 -11 -45 7 -67 -26 -83 -119 147 91 163 151 -51 -168 33 298 -22 -167 -130 -156 46 -19 -32 -55 -179 -9
6278 -9 -47 129 -164 -75 -21 -59 276 140 103 -17 -106 1 109 7 93 -60 -242 120 125 116 44 44 -87 139 -76
6303 -76 48 121 -99 -98 -89 -258 -61 80 165 -118 10 30 -3 -63 -46 59 -39 -117 -151 -232 -34 87 97 103 17 149
6329A49j68KJ31L7k00J98j15J13k6r2n2Ml4K03k11L4l3J38l50L94m5j61K16J06
6353B38j91j33J04o8j39J36j16Q9k8J28J6o6j0J31j14j03O8K1O4l7r1j3J58PK9
6378H0j02J09N1lj05Rk59K01j0m4P3r3r3l4N1m1K61o2q4J20K5Q8p4k43K17J1K
6405E1j15p0J60j4J17j21qmJ73j40N2j93P3K17j93K12j65m3l5n1L58k19J42j29
6429E5j99M2N8Q2J05k48K32j41J95j70j01j1K9O8q0q4N4k4J58n7p3j23K99q4m8
6454f6J36j44j7K15j84n3K73n9J45k34J02k23j16L05N8j73J58k86K34J30j50K41
6476B92l88L83l59J05q5M0k34K88k16Q6k9L6J8k5K49m20K70o3n2L6K3J63k26K08
6500A00j31o3P4JLJ22K4P3p4j82K09j55K30k78M5j87J07Q2J66j15k06L3J59l0
$$ plain form
6329 149 -19 -17 114 151 -49 149 34 147 121 29 -23 -19 -53 150 -61 -27 -60 78 -272 122 77 -84 132 238
6353 238 47 -86 18 -50 -189 -53 -169 -80 -108 20 36 -30 -40 91 -23 -126 -58 -37 27 -10 -101 -114 44 51 80
6378 80 -22 87 138 135 30 39 -220 -19 -29 -73 0 -93 -186 -220 -169 -210 51 -11 -95 25 50 138 64 -179 38 49 51
6405 51 -64 -134 26 12 129 8 0 -4 169 29 81 -112 -39 178 -15 197 32 -11 -46 -97 261 42 184 55
6429 55 -144 -102 -44 38 143 -105 127 -14 181 11 -90 -101 -72 -4 -84 -168 -114 -138 20 -37 -110 -233 66 -18 -66
6454 -66 70 -74 -91 124 -60 -113 160 101 246 12 114 -109 -225 80 138 -35 123 -163 71 201 51 292
6476 292 -96 287 -72 33 -52 -12 -246 42 -174 -88 -117 -81 -63 -88 161 -259 11 -52 -104 -68 -45 118 -108 100
6500 100 -31 -94 -20 -19 -16 106 130 203 129 -53 156 1 231 -47 -2 -189 -82 0 166 51 -155 -122 37 7
6524GJ9j09J57j7k67K89j91j50N20j67N5kj87J30K6l8j67J8N1QJ68k80J11J37
6548A21m3P5k52L7L8N6n3K58l34j17K95j33J47R6n6j36j1j04k7K73j31P5k8M1
6572H7R6k04j4L79j29k39J68k10l3P9j7K16j76J1K68l33j16m5J48R2l40K79M8
6595A5K18k34P3k63K85l32J75r5K80j98J69j55j87K41m0R0j17J33n0l7J06j58
6617h1J44Q5j78J58k24J12l1r7K0K33j94N8l3p7L39mp6l70J58K36j72n8J02k56
6641b06K01N0j59K64m0j04L7J13j72K3q4J77J35k71m4J58P6k85k1L5K0n9K89r9
6665C4p5j01k9L02k87L17j17p8j36j0K20K7j98j08L17Rj5k43K55r4J02j36K32
6688A88j81J17p9j9q6M9J92j69Q0j05R4P9j72J27%l07L60j57Ol6q2J15J22j17
$$ plain form
6524 7 26 -83 74 57 -210 79 -112 -262 258 91 146 144 -43 87 113 75 -92 -74 -23 -15 153 -127 -16 121
6548 121 78 153 -99 -62 -24 32 -21 237 -97 -214 81 -52 95 191 135 -1 -12 -116 -143 130 -1 74 46 87
6572 87 183 -21 -35 344 215 -24 144 -66 -99 -20 -37 179 3 14 282 -51 -167 -212 -64 28 -312 -33 15
6595 15 233 -1 72 -191 94 -238 -63 -158 122 -76 93 -62 -249 -8 -48 42 -75 58 8 -29 77 -81
6617 -81 63 148 -30 128 -96 16 -15 -112 -92 141 -53 5 -28 -105 234 230 154 -216 -58 178 6 -52 50 -206
6641 -206 -5 45 -114 150 110 6 43 156 -16 7 -77 100 235 -36 -80 78 154 -131 -152 -117 -97 -156 133 34
6665 34 -41 -142 -171 131 -156 161 44 -34 -170 -180 40 67 -131 -239 78 87 72 -171 84 -10 92 -44 188
6688 188 7 124 45 26 -60 -11 181 12 92 -13 81 160 -12 115 115 -192 168 11 17 -19 -101 14 136 19
6712A9O0J83r4n3k13J74J8m5J0N5K4k36M3R5j2j17o8K61k0n9L0n3N1M6K4j54Q6
6739E5j33m3O8p2L0o0O5J51J68j74Q5j04k1P7J01l48J98K5r0m1k2j09L05J61l18
6764d6k6J90j39j2l2N5l9J52Q2j56K0OK3j81Mk8K5Q3k12L80l22J72OP3j47J5J46
6791I2k86J59J35k29J52j9j50m1L6K89k56K26j05m8J48j11k9R4K7J17k03j27J73
6814D4k40K40O2K1j69J22j53j51J66r2J10L0J09Q8j70j82J76Q3n3q0Kj32J38m5
6838g6J25p7l8m6L54j77k19K41k24K24j86J3K3R8J36l10o2J0O3K65k8k12J73j82
6862a12o9M2R3LN8j28J72j44J28n1l6N2n0O6K32l25N8Q6r2O5k7Q6j15j94K40l5
6888CR4j53K39j90N4K7q3l9K57r9j72J2q2K33j46j9M3j36R9K06k96J20rJ22j85
$$ plain form
6712 19 79 262 168 115 -98 76 94 49 59 114 138 -98 -55 40 28 -89 -157 104 84 25 55 2 53 99 123 -31 55
6739 55 -78 -121 -53 -125 -95 -155 -90 61 229 55 140 36 15 92 193 -155 43 68 -22 -63 -85 -194 111 272 -46
6764 -46 -72 118 -21 -33 -65 -10 -49 103 185 29 49 55 78 -103 -99 -127 -102 -19 -231 149 -173 -1 5 78 -69 -54 92
6791 92 -194 -35 100 -129 23 4 -146 -187 -151 138 -118 108 3 -45 103 -8 -37 57 84 201 -2 -129 44
6814 44 -196 44 106 127 -42 80 -73 -224 -58 -150 -40 -10 99 187 17 -165 11 94 41 -39 -37 -169 -31 -76
6838 -76 49 -28 -66 -112 242 65 -154 87 -137 87 -99 -86 -63 35 171 -139 -201 -191 -128 137 109 -103 70 -112
6862 -112 -181 -139 -46 -43 15 -113 59 -85 43 -8 -44 8 -42 24 256 -69 -11 75 -17 48 21 107 -8 -202 38 3
6888 3 97 -56 183 -7 47 74 -9 -48 209 110 -62 -50 -132 101 -45 -64 -21 -157 -58 148 -148 -28 -37 85 -100
6913a00J97L9j4k05M0J3LM0j21P8r0r8J82J54lJ16j18j0Q7j99J39j53J44r1k24
6938a94L7ML01k09M6j22J71k37j14R1J15l3K52j16M0j86J98q7J98j57Q3R3q8n
6962H1j48J4r7J05K1O6qn1J74k30K7L6J44k7j81J87j90J3J09O0K1j79n2Pl0r1
6988b19K51q3K74l35J56j30K3Q5p2K1j24J1J40k16J10J59K5j36j9J78qk95J54
7011e0m8P5Nj61J56O4j95r7K75J6k71K75k10J75j50J25J1k0j01R6n0J36p3J04
7035H7j08j14K45jq2o0M7j06O4m9J9Q0n5J1K43l97K74o5r5LJ97j47R7n5j1Mr4
7062f8oo3K65j43P4j33J77m0j8J73k98R5M2r7oo6j53L29J1n8k55K74P8k74L10
7087A50l6l3Qp7j51M20l11J8K2L9K27q6l30Q0J12N6m7j23L2K61m21R3l9K2P5m0
$$ plain form
6913 -100 97 136 122 -83 -43 -30 -27 13 -108 -30 -120 -218 -36 118 115 231 113 103 190 -9 130 -23 121 30 -194
6938 -194 -157 -153 148 -61 -15 -137 34 -203 -317 -226 -111 -144 108 -8 32 -154 44 -43 155 -2 81 174 86 81
6962 81 -67 -53 -150 -45 -24 42 34 -17 157 -73 -46 -10 134 107 -74 113 -77 -64 45 105 126 -53 -105 -98 -128 -219
6988 -219 32 -51 223 -112 44 -86 -63 22 -50 -29 -153 -142 -2 -218 -108 51 76 -60 -79 99 91 -204 -50
7011 -50 -98 -23 -18 -179 -23 41 -154 -251 24 40 -231 44 -166 9 -141 -16 -5 -25 -126 -30 -80 56 -17 87
7035 87 -21 -135 110 109 27 -33 14 -92 -28 -77 -58 22 -33 -22 221 -176 98 33 -62 -59 138 -9 88 33 22 26 -68
7062 -68 -74 -137 128 -15 59 -74 103 63 45 218 -80 15 57 -40 -46 -112 -265 64 75 17 -238 36 114 -160 150
7087 150 114 81 89 12 -139 281 -30 -12 10 49 276 190 -140 -60 52 108 61 -62 -30 231 -190 -97 -136 -114 -39 -79
7113g9k9N8L28j2k67Lj8J26l45K00J62j29M4J7r3K04k65q2K76r7K9k62K79p1r
7138c2K1Q5M4O1k64P4m1N3J07j42j8J56k39L55j25j05R2k62K59q6l2M1PN5o0l1
7164b7j76J20k5P6O2J63j48l1P8k03l8L4R7j37J98j81O3N1K6M2r2p5J29J28k63
7189a29J55R1j87j13L0K23J32l16J60j3k0l0l7j4J10m3J45n11M86Nk28m2K89p5
7213F8j99J76L5j59J28J70k46p0J43r2rK24k73n6J44k40L09rj86J90j17J12l1
7236A2p7L66m01J72m8j12rP8n4K86j62p7j4kk2q2K41k17J25k3Q6k07J71p5j7K83
7262B21k52K40j29O6LP4m03L10j09p6J32l6k38K51q0r2K14K0K74k85r0NNJ46j18
7287E3M6k36L1P1p1P1J42j71J36o9j52K44j0L89l68Oj12J60j88L6j25J76j25q
$$ plain form
7113 -79 -108 -50 278 266 -1 2 -16 110 -235 -35 127 -2 42 59 -34 170 -95 -177 99 2 31 -231 48 -23 -32
7138 -32 -11 74 118 179 -85 -11 -52 1 108 -34 -52 104 -135 220 95 -10 82 -180 79 -7 -39 2 9 64 4 -27
7164 -27 -203 -83 -108 -32 30 193 45 14 92 -111 -149 -115 -18 -155 43 -138 -75 -24 2 44 -48 -123 6 134 -129
7189 -129 26 117 -70 -183 -153 70 202 -114 46 33 13 -17 -54 -68 42 -1 144 -367 119 124 -104 -146 143 68
7213 68 -131 45 80 -79 49 219 -27 -97 46 -46 -55 169 -104 -160 -16 -256 53 44 -142 48 -69 43 12
7236 12 -65 301 -100 72 24 -88 -97 -19 -73 213 51 -26 -40 -42 -64 -146 95 -122 3 -20 66 -141 30 -45 -62 221
7262 221 -31 209 80 146 149 223 -180 130 21 -55 77 41 -197 54 -26 -118 96 116 390 105 15 20 25 171 53
7287 53 99 -137 -106 -35 -106 -35 107 -64 72 3 -149 95 85 474 106 112 0 160 -28 8 -117 59 -66 -74
7311g4L08k02K86k46j0j39p1J40r4k7J00M0m2j10M87q6j65P3p7O8l28R2o6J48
7335En1M7L9k64J29R2K71k29K4k7Q1j06rj6P3mj42K3KJ96p2J01m4Kl04J76K2p1
7363e6n4l8L27j73j5K30j82jp9J3l4O0k4J26n1rp2M6j13M0j20K45k06Q8J37m11
7389c26L75P3j33j3j2J89q1Qj77N5l0J01L7j7p1J49j50q3mL02k61P2j1R1M3k90
7415a64K46k06O0J57k90K06j15K23j85Q4%R7j97j35P7N1l8J67j37N7J19k44L40
7438A73J7j89j6j44K6J21j95L44j49J39j98L0M7Nj15J12L0k1r4Kj34M9J57j32
7462a35j22M56k30K15k08j31K38l5k64K15Q5KK0j45J3j39J92R2n0L4J3k13J23
7485B6J36j87J93j42K6J8k23K07k1j88R0jQ6k2m2J64m37M86j12m3J4J08j21j13
$$ plain form
7311 -74 234 32 318 72 62 -77 -148 -8 -102 -129 -29 11 -31 -141 346 260 95 168 91 159 -169 -77 -143 5
7335 5 -46 1 40 -224 -95 -3 268 39 63 36 117 11 2 -14 59 55 -87 -64 -62 134 62 163 119 121 -183 -7 15 -56
7363 -56 -110 -148 179 6 -9 221 39 38 -41 -28 -62 -2 -26 100 49 40 -32 14 -99 -59 -179 66 -140 -52 85 -326
7389 -326 49 122 -11 -24 -36 153 72 80 -97 -42 -72 29 66 49 -22 127 -23 -106 -110 192 -69 3 -8 83 126 -164
7415 -164 82 -124 -64 93 -197 9 -106 117 -68 16 16 113 -84 -219 -142 -91 -129 38 -99 -42 77 -167 173
7438 173 190 1 -15 -159 -133 -12 -207 137 -12 127 -71 -41 6 11 -104 8 38 17 -77 -75 -209 -160 -3 -135
7462 -135 -257 199 -31 184 -24 -155 83 48 -216 -1 84 86 106 -39 -26 -165 27 119 69 103 116 -97 26
7485 26 162 -25 168 26 52 70 -153 54 33 -155 -65 -66 20 -2 -44 120 -317 169 57 14 28 136 15 -98
7509i8K07j67K8J19l42J10L30r4j34L19k28Q7r1l26N5K46l3J61j08o2J92l09K06
7532F8P8M3l54J20K71j94q5J44O1l57L50k77J27O9nj3j17J6k6K4j50K95j23J95
7556A60j36J18n2k0n3l9NK4j98K40j2K0p4l1L9J63k84J87j68L03j17j13K2Q9j2
7581F1j46J95j24P1q4l3N0k6mM4rJ8j53N5O5qJ3K2M1M6j56K14j9k38K2P2JJ26
7609A16j50o1J65n7o4j2L9m0J07o9j01m7L12pj73j47p5K34J39k39r8K41j11N5
7633d3J73j08R6o7K0m9M0k3N8p2r6k43L49M8n2k0l00M65mJ4k96l4j9J8L00m32
7659b77L66j11Q2l58J45J66nk07J69j22J18J44j16q1R6P6k05J45m4j45L6L67j68
7682G1O2r2l6j20K77k34J19o2rJ11k60J88Q8k32J63k5L9m5R5k14M72l09K9j30
$$ plain form
7509 -98 109 -58 -30 89 -253 -143 187 93 -41 278 50 137 46 -280 -225 21 -12 149 41 -21 171 -138 68
7532 68 146 189 -165 -45 226 32 -53 91 152 -205 145 -132 -5 64 59 46 -71 -55 -81 -57 -207 88 -35 160
7556 160 24 142 90 70 17 -22 -17 7 -191 49 37 57 -17 -48 -9 154 -130 57 -111 192 75 -38 -16 73 61
7581 61 -85 110 -14 57 -27 -60 -10 -36 -40 4 -5 13 -140 -85 -20 -28 -15 7 48 94 -62 152 133 -105 -83 -11 -10 116
7609 116 -34 -95 70 13 -51 -63 -24 -64 43 -26 -127 -174 138 131 -42 -189 -264 -30 109 -130 -228 13 -98 -43
7633 -43 130 22 118 51 71 22 62 39 97 25 -71 -314 35 83 31 11 -289 176 172 186 -110 -144 -163 -145 155 -277
7659 -277 89 -22 60 -298 -153 13 8 -199 -30 -152 -34 110 -6 -87 9 85 -120 25 -19 -164 -128 239 71
7682 71 133 41 5 -115 162 -72 47 -15 -24 87 -173 15 103 -129 34 9 48 3 98 -116 356 47 76 -54
7706e4j13J17m8J4K23j8j13k37K11p8J61o4j87k0K48J33j46j46N6J99j73J83k64
7729a16L08n3o1k45K47J4j79qK14k42O0M6K29j87J9j92J03J76k14K34j69J02j2
7752G4j52Q6l3J2J36j43Rm7N6r6K96k81kJ65L5j85M1J00j62J10J49l15j2p5L09
7777G5j92P5J24N0j48mj0o2K59k98K3J09l4K28j80Oj63K23N0q2Q2j58K3J8p3j41
7803b00J61J73r3k1P5l49K39L5k09L98j21r5J1L4l3Q8l58J56K76j52L5j40J48
7826E8k96Q3K50M2j66j63J18K7j97J95m3QJ32J24k16K0m6mn0J27j5K7j65J43J11
7851A04k07K40K8k85J11R7l44K92R0j9P6j41P8J08j79K6M3k17K51L4r1j07R5j22
7875c9j26K99m03%K92q8k09L52j97K9J47m5j95L05k72M3J99lP3j48Q8j9j44L47
$$ plain form
7706 -54 -167 -50 -98 -84 139 121 8 -229 -18 -96 65 1 -186 -206 42 175 29 -117 -61 138 -35 148 -116
7729 -116 192 139 78 -167 80 94 -85 -93 121 -121 -61 -15 214 27 46 -146 -43 133 -81 153 -16 86 74
7752 74 -78 8 -25 -13 123 -20 -11 -58 -2 -98 198 -83 -85 80 115 -70 -29 71 -91 19 168 -147 -159 -234 75
7777 75 -117 -42 82 132 -16 -20 -30 -92 167 -131 -108 1 -33 195 15 21 -142 81 131 49 131 -27 -4 14 -59 -200
7803 -200 -39 134 41 20 95 -254 -15 20 -189 209 88 -7 4 38 5 93 -265 -109 167 15 50 -90 58
7826 58 -238 -155 95 137 -29 -192 -74 -47 -244 -49 -92 -84 48 172 -44 -24 -70 -74 -124 3 -12 15 -150 -7 104
7851 104 -103 137 165 -120 -9 88 -256 36 126 107 183 42 120 228 49 75 118 -99 152 186 95 -12 83 -39
7875 -39 -165 134 -269 -269 23 -65 -274 78 -119 -90 57 12 -183 122 -150 -107 92 89 162 14 102 83 -61 286
7899B86k80Qj13J33J11l12K24J87m93L00J01k03J18k09o7N3L57l21J11n9J06K6
7921F4N5k05K0l2J29n7M4o5J99o3l1j12j31K87j0K5q9N1J43M2l01K2J49o4j59
7946h9q1M21j51j08q4J48j05J08k12R6J46j93J85j87N3J81j30j62O1J02L9J94
7968B32k99L2J36l2k81J58j45J61L50k22J8j24n3K14j35N1J82j31j95J5J51j69
7990h6J72j97K55j34N9k40Q8K60n8k61J31J46k38m9K45j33m1K74k10N1j95l7l2
8013b30J99J5K5n5m5O6K6Noj20K03k68L25P2j28M0j38R8j07J05NO7k67M7J62j55
8039e9l6k01L26j4pJ47k13K26k09J48j95N7PJ59j92M0j51J75K7R9j12j58J23k55
8063b68K03O6K3n3J38M6k85QR8J50j06J22j29j15J58K4j56J35J45q9j07j26K53
$$ plain form
7899 286 6 14 -99 34 145 -167 57 244 -249 51 152 -51 67 -142 -209 -156 201 -120 -9 -68 38 64
7921 64 119 -86 -66 -98 31 -26 18 -47 152 89 58 -54 -185 102 92 117 28 79 222 264 -37 -15 134 70 -89
7946 -89 -170 251 100 -8 -92 56 -49 59 -153 -57 89 -104 81 -106 -53 128 -2 -164 -103 -1 38 232
7968 232 -67 -35 101 69 -212 -54 -199 -38 312 90 108 -16 -69 145 10 61 243 112 -83 -68 83 -86
7990 -86 86 -111 144 10 69 -171 -83 177 119 -142 -11 135 -103 -152 93 -40 -81 193 -17 34 -161 -198 -230
8013 -230 -31 -16 9 -46 -91 -25 1 6 0 -120 83 -185 140 212 84 124 -14 84 -23 82 87 154 -113 -66 96 -59
8039 -59 -95 -296 30 16 9 156 -57 169 -40 108 -87 -30 -23 136 -56 -16 -167 8 35 134 22 -136 -13 -268
8063 -268 -65 1 24 -29 109 155 -130 -122 -24 126 20 142 13 -102 56 80 -76 59 204 115 8 -118 135
8086A35%j54J4Q8j52O8r7l5M0r8P8K20k35K33q7K3m9J61j45O6n8N0l18K44O3J04
8112A59j93o8J84j66J00o2j59K60j41P1N6JJ3j26K35j77Rk88L16J47j9q2j88J38
8136B0j07Q0nQ9m1j45K41R3j72j53JJ2J78k59K35Q6k1j42j05J49J05k01N1Q9j27
8161d9J53j24K10k75Q6j14K07k18K37k79L8J75j65L14k25o4K13L6J0k46k8J15
8183Gr3J90k11j8J89lq0K09
$$ plain form
8086 135 135 -19 -5 83 -69 -1 -98 -133 -93 -191 -113 107 -128 105 18 41 -8 153 8 74 16 66 -252 -8 55 159
8112 159 -34 -102 82 -84 16 -46 -205 55 -86 -15 41 42 55 -71 164 -13 -4 -292 24 171 152 70 -118 20
8136 20 -87 -7 -12 77 36 -109 132 225 53 -100 -99 -87 91 -168 67 153 132 -10 -115 34 139 -62 -11 78 -49
8161 -49 104 -20 190 -85 1 -113 94 -124 113 -166 -128 47 -118 196 -29 -93 120 156 166 -80 -108 7
8183 7 -86 104 -107 -125 64 61 -19 190
8191A90
$$ Imaginary data points
##PAGE= N=2
##DATA TABLE= (X++(I..I)), XYDATA
0@%%%%%%%%%%%%%%%jRj6J6j6J6k4L2l2L9m7N4o2P2q1R0j05J20j37J54j74J97k20
38a16K45k73L04l39L78m19M63n11N64o24O89p56Q31r17J012j118J234j364J514
57G97j684J878k108K386k723L140l677M400n432P040r912J6660o6842m0214O0416
72c5875K9092L9613J5790J1634m081n548k9051l4258k5308P20J1293J9466R949
85C436R92m331M872M217m897j7432j5343m342J4377K5811K4595J0190N34l110
99C9569p643k0933l1211l2205j9435O342L1232L5046K2040J0415N018n40l366
112C4329r296j9710k1635p239O414P375K352l479o719J463J4064J2328K25p384
126C088m538K887R362R474n69j0269q873j947j636p415j0355p284L203J5983J9241
$$ plain form
0 0 0 0 0 0 0 0 0 0 0 0 0 0 0 0 0 -1 8 -8 8 -8 8 -16 16 -16 23 -24 30 -32 40 -41 49 -56 64 -73 81 -93 104 -116
38 -116 129 -144 160 -179 199 -220 243 -268 296 -328 361 -395 436 -481 531 -587 647 -717 797
57 797 -887 991 -1117 1269 -1454 1686 -1991 2409 -3023 4017 -5895 10765 -56077 -96291 -35875
72 -35875 -6783 32830 48620 60254 56173 50625 21574 -12684 -37992 -37272 -25979 -6513 3436
85 3436 4428 97 4969 9186 4289 -13143 -28486 -32828 -18451 7360 31955 42145 42679 39569
99 39569 31926 10993 -20218 -52423 -71858 -65516 -34284 762 22802 33217 38235 37695 34329
112 34329 25033 5323 -16312 -23551 -17137 -9762 -7410 -10889 -17608 -16145 -2081 10247 10472 3088
126 3088 -1450 1437 10799 20273 19704 9435 562 -1385 -3021 -10436 -20791 -28075 -24872 -8889 10352
141A0352Q506n522q436k539L580M675J794m812n864K31J864o532j3844j2153l213
156c1913J0694K0645J6547L523j672P76J470j423p827j5333j5654m884O183P206
170a1662M015L051N063J0010J0526J972j2507j8241j0468J782R791J0675N981
183I988Q77K22J600m013j3089j5724q529L259J4551J6649R116R7p99K908J254
198A8367n138j1843j4427j0066P25P679O060L758N865R431R842M753p032j7168
212H06j5383m265N228Q172O152K322J690L335L379l189j0429r225k447N028P915
227i11M876j524l195K661P529M462k301q538r422n430M84J927m59J255O610J0658
243H682Q843J905q007j2405p373L40L113J151p99j289K096O193N267n36m647k498
$$ plain form
141 10352 18858 13336 4900 2361 5941 10616 12410 7598 1734 1965 3829 -2703 -16547 -28700 -31913
156 -31913 -21219 -574 15973 19496 17824 18600 20070 18647 10820 -4513 -20167 -25051 -18868 -11662
170 -11662 -7647 -4596 467 10477 21003 22975 10468 -7773 -18241 -16459 -6668 4007 9988
183 9988 10865 11087 12687 8674 -4415 -20139 -28668 -25409 -10858 5791 14907 15004 14205 17113 18367
198 18367 13229 1386 -13041 -23107 -22382 -14703 -8643 -4885 980 10411 20253 25006 17974 806
212 806 -14577 -18842 -13614 -5442 710 3032 4722 8057 11436 8247 -2182 -11407 -13854 -8826 -911
227 -911 3965 2441 -754 1907 9436 13898 11597 3059 -6363 -11793 -11309 -9382 -9841 -8586 -1976 8682
243 8682 17525 19430 11423 -982 -8355 -8015 -4902 -3751 -4550 -5839 -3743 2450 7717 7181 2534 36
259C6Q81J760q44n133o731j340P182J0156N584j005n386n374k538r31k908l735
275a0326L06O574Q764N598l75n305n532k43K801n32m484n296k383K774O090M688
291C119J005L81K345K300j268o074q810o315J369P991P506K373j315j311p57O06
307C145p95m446m572j04M112M019J128j306j650J470M570L041l061o964o345k568
323a0326K140M019L394K153L323M794J922l172p200p784l348K287N004K523n03
338g74J7K184K614K421j166l921l805n83J063k65j693j057J996N477O044J243
354I795m726o785m260q55J686J883J042J998L426M043L99l405n041l404m6K610
370a640J768j581k317Q6L054L104K150k63j878j142j90j180k860l058m73L142
$$ plain form
259 36 917 2677 1833 -3300 -10031 -11371 -4189 5967 11551 10546 5160 -214 -2752 -3683 -6591 -10326
275 -10326 -10020 -3446 5318 10916 10541 5236 -296 -539 2262 1730 -2754 -8050 -10433 -7659 -1569 3119
291 3119 4124 4505 6850 9150 7882 1808 -7002 -13317 -11948 -3957 3549 5922 4607 3296 2539 3145
307 3145 2350 -2096 -6668 -6772 -2660 1359 2487 1181 -469 1001 5571 8612 5551 -1413 -7758 -10326
323 -10326 -8186 -4167 -773 1380 4703 9497 11419 8247 1047 -6737 -10085 -7798 -2794 -271 -774
338 -774 -757 1427 4041 6462 5296 1375 -2430 -3013 -1950 -2215 -3908 -4965 -2969 2508 8552 9795
354 9795 5069 -1716 -5976 -6831 -5145 -3262 -2220 -222 3204 7247 7646 4241 -800 -4204 -4250 -1640
370 -1640 128 -1453 -3770 -3684 -630 2474 4624 4361 2483 1341 1151 -29 -2889 -5947 -6420 -3278
386c278N173L800n11l604k720J79R74N21n94j882n94J461J720l41j434LJ934L309
404D116J745k059n283m426p59K081L116K575J575J342J249P73k751m945l902r95
420f548J648K772K160k22O89J925L172R69j648l800m440k519l84K97J071K750
436b108M600N199K748j282o058p110m379l16K220L001L609K977L099J883n34m339
452C210n372l456j094J081J610J542J541K983L799K621n45l444n397m563k224
467g708J09J293K428M743M597L387j0l830o006m670j218J363K597K538K343J707
483C663J052L6k147l687k537o93R54R80Q34O30Q36K682K593P43j903k931l154
500b049k161J91O40O47J471K399K082J45j472k456k025M39K225K333Q27o63j213
$$ plain form
386 -3278 1895 5695 5184 1580 -1140 -961 13 534 -60 -1942 -2536 -1075 645 304 -1130 -1127 807 4116
404 4116 5861 3802 -1481 -5907 -6666 -4585 -1469 1106 2681 4023 5272 6045 3294 -1651 -5553 -6548
420 -6548 -4900 -2128 32 -190 499 2424 5596 6565 4917 1117 -3323 -5842 -6226 -5929 -4858 -2108
436 -2108 2492 7691 10439 9157 3099 -4011 -8390 -8706 -6486 -3485 124 3101 6200 8083 7549 3210
452 3210 -2162 -5618 -6712 -5631 -4021 -2479 -938 2045 5844 8465 7920 4476 -921 -5484 -7708
467 -7708 -7599 -6306 -3878 865 5462 8849 8839 5009 -997 -5667 -6885 -5522 -2925 -387 1956 3663
483 3663 4715 4751 2604 -1083 -3620 -4313 -3359 -2379 -1545 -915 -79 2603 5196 5939 4036 1105 -2049
500 -2049 -4210 -4019 -3379 -2732 -1261 1138 3220 3365 1893 -563 -2588 -2149 76 2409 3236 2573 1360
517A360j591j434q04j073r4J698K602J573O25r48j337p38P58N38j24j193n78K15
535e45P30K94k6j137o62k01k34o55M8R04K364L619K755L47k677l857m335l013
553f281j486N31J969L212M323L071J006q52k485k630j578k85m90o5L53R48J285
570E46J035L23r83j700j527p26o92N22J670K517L687K841P07k233m087m890l542
587f532j905M17K117K868L915L710J637l73j269k170j981j130l73j385m81K36
603b699R06J442Q09Q14m14m87q33n41p00N46J479J914J979Q88j099k617l065k331
621d009j283p9J395J773J957K029J440M89l53o18n27m95j051j175j438j595n03
638d043N98J497J465J570N50K12m1k27j022l08L33J11K05m48o87j261o10K42L92
$$ plain form
517 1360 -231 -1665 -2469 -3542 -3636 -1938 664 2237 2862 1914 577 -161 597 1135 1011 -182 -760 -545
535 -545 185 479 453 -684 -1346 -1547 -1781 -2436 -2388 -1484 880 4499 7254 7601 4924 1067 -3268 -6281
553 -6281 -7767 -7236 -5267 -2055 2268 5339 6345 5493 3008 378 -1200 -1485 -1975 -2040 -1687 -739 546
570 546 1581 1904 921 -779 -2306 -3032 -3724 -3202 -1532 985 4672 7513 8220 5987 1900 -2990 -6532
587 -6532 -8437 -8020 -5903 -3035 880 4590 6227 5854 4585 2415 434 -696 -1069 -2454 -2935 -2699
603 -2699 -1793 -351 458 1272 858 371 -462 -1003 -1703 -1157 322 2236 4215 5103 4004 1387 -1678 -4009
621 -4009 -5292 -5371 -3976 -2203 -246 1783 3223 3712 3359 2741 2214 1719 668 -507 -1945 -3540 -4043
638 -4043 -3445 -1948 -483 1087 1637 1849 1808 1581 559 251 584 695 900 452 -235 -1496 -2106 -1864 -1472
657a472O73Q66K19J75J6q4R9L99Q31N97o8n66j761j817j529j11N18Q57J765J562
677A169Q05L45K11m73r41o59l82j081k85l05l52q1P78J666J099O39j65q06j528
696c46q18l48K13O68J274J045N3k70j232q87j011k2J60L59P06N14N46M76J79J79
716A438j42j09p29j004j136n79l39Q38J551J396J193K29p07j395j305p08k99K65
734a542O35R84Q29J1J56k70l38l09k60J16n14m69m1l39O63Q62Q62N04K23n50j226
755a3q19r38J42M28R62J010N43j36l19l68q36m96J08K6R4N26K8J75J92K39M58
776A006J73j88l83j123j003n06J80N55R39J129P43N70n75j005p03l60m18K86J25
795e58J12J89R5J36J3O20m9O4n8m25o77n71j06O79O70Q98N20K1p79r39r63n48
$$ plain form
657 -1472 -799 67 286 461 477 393 492 891 1722 2319 2251 1685 -76 -1893 -3422 -3533 -3015 -2158 -393 1169
677 1169 1974 2319 2530 2057 1116 457 75 -1006 -1291 -1596 -1948 -2029 -1251 415 1514 2153 1988 1182 -346
696 -346 -1164 -1512 -1299 -631 643 1688 1741 1471 239 -648 -1659 -1681 -1521 -1162 -456 58 604 1080 1259 1438
716 1438 1296 1187 458 -546 -1682 -2261 -2600 -1762 -211 1185 2378 2607 1900 505 -800 -1508 -1807 -1542
734 -1542 -907 77 906 917 1073 803 465 156 -104 12 -502 -971 -1012 -1351 -688 174 1036 1540 1763 1213 -13
755 -13 -832 -1770 -1628 -1200 -238 772 1315 1179 860 492 -344 -840 -732 -706 -612 -86 -58 117 309 548 1006
776 1006 1179 991 608 -515 -1518 -2024 -1844 -1289 -350 779 1522 2092 1517 512 -191 -551 -969 -683 -558
795 -558 -446 -257 -162 -26 -13 607 558 622 564 139 -538 -1109 -1215 -536 134 1032 1552 1573 794 -145 -1108 -1656
817a656j96P90P05P42N26N18p6m78k46l72m75m95k24m82L13O9Q29R30N73N92n04
838A383l81j233r36n00K62Q45O13R65M63l49k61p58p37l15j01N14N9N98M70j37
858D64RJ62N6o6m77l96n87m38o6N93O38N58O81J01m97l50o01n30k70J90N21M91
880A86L54j03o4k30p8o4l8P3J47k6o32J16J26J37L83M25L24m35l97m96n16n2K73
903e87J22M00J50Q8L40k69K9l05R2J33Q0k04m65J89m06K11M08N49L63j03k27p06
925a18n40j77q4L20O84L74O64n3n69k66o39o2q3J47j42P3K24J81L01L29K28M9
947H41j21m11o10m22m41j45P75R10N80r5r2j66p47n37l7J41K66J6J004r9j58j39
969C13k62k88J52j28j90n0l4KL35P92J8K12j32O0n84q09m86l13N73M37O12K50
$$ plain form
817 -1656 -1852 -1062 -357 385 911 1429 1353 875 629 257 -218 -713 -937 -1419 -1106 -1037 -208 722 1295 1887 1383
838 1383 1002 -231 -1167 -1667 -1405 -560 53 1018 1481 1132 871 113 -624 -939 -1040 -526 -467 131 601 464
858 464 473 635 691 625 148 -248 -835 -1273 -1339 -746 -108 450 1131 1232 735 385 -216 -746 -1016 -826 -305 186
880 186 540 437 373 143 65 1 -37 36 183 157 -475 -359 -233 -96 287 712 1036 601 204 -292 -808 -860 -587
903 -587 -465 -65 85 173 513 244 273 -32 60 193 273 69 -396 -207 -613 -402 6 555 918 815 588 -118
925 -118 -658 -835 -919 -599 85 459 1123 1070 501 235 -404 -466 -549 -402 -544 -471 -247 -66 235 564 792 841
947 841 720 309 -301 -723 -1164 -1309 -534 376 956 861 769 603 -144 -681 -718 -577 -311 -295 709 610 452 313
969 313 51 -237 -85 -213 -403 -453 -487 -485 -150 642 660 872 740 800 216 -593 -1079 -1392 -819 -382 230 480
991D80K05J8j45n56k1K5k83J19L94l05k21N9L5K28L07%j65l68l30J24J17k0L91
1014H8L04L84j25J0l82p40k38l9k48N08J56K07K97M2K65K57L29m74k49j37n17
1035c02j55n25J06K81M26Q14l0k01k43j75r6m5L6J23K02K69K74l99l30nl88Q8
1057b75j91J52R3o7L52J53K73O10Q7k79n63l22o47n68l40N64N57N77K37M73j99
1078F77k14l61N8J03j28l38K41p0o2P2l09J39Q5j6j13L0k77L12Q9M93M17L16l30
1101H14m88j15l90q01Pj31K92K88O20L17J43J3j73R8j58J01l41n4l71j5l5k1J41
1124b59J80k76L88M9j65r6J02M74R8R8k09r2k93j92j08k39j51J21K04M24J84j87
1146E5O2k93Q51K9K4j28k21l43k94r1n64O1j19N68K81M73rK98j19k2J69l48k21
$$ plain form
991 480 685 703 558 2 -19 6 -277 -158 236 -69 -290 -231 -196 32 339 339 174 -194 -524 -400 -283 -303 88
1014 88 392 776 651 661 279 -461 -699 -738 -986 -478 -322 -115 182 224 489 746 1075 601 352 215 -302
1035 -302 -457 -982 -876 -595 -169 645 615 414 171 -4 -100 -145 -109 14 216 485 759 360 30 25 -363 -275
1057 -275 -466 -314 -221 -288 64 217 490 1100 1187 908 345 23 -624 -1192 -1532 -968 -411 166 403 876 677
1078 677 463 102 160 263 135 -203 38 -32 -94 -22 -331 -192 -107 -123 -236 -206 -483 -171 -82 411 828 1144 814
1101 814 326 211 -179 -980 -973 -1104 -812 -524 96 413 556 569 396 494 336 437 96 42 -329 -344 -379 -400 -259
1124 -259 -79 -355 33 82 -83 -179 -77 397 495 593 384 292 -1 -193 -301 -540 -691 -570 -366 58 242 55
1146 55 117 -176 675 704 728 600 379 36 -258 -349 -913 -852 -971 -403 -122 351 342 640 521 499 668 320 99
1169I9l76k96j06M34Pn9N1O96k90j56j32M5k01K87L16M06nK1l52n64k0m13j39
1192g47m79K46Q18K31L90J32L3L0j27j37l05n05l74J57N6J55O19n4K63O2mm67
1214gm01j16L93K55L95K3R7l50l48P1m14o6k54r9L65L88Q8L31L68N3J98o4n25
1237C81n01m65J88m93M21J11M32N3K95J64m47R1j59k5m7L89j80J14l61pl48R9
1259b95J05j57O2M1M42k50J2K92J43K14k24J91o46k62m2l74K89Q6J84l4L16K74
1281C67Qok94L08j1k07K1j56k55j43P6M7J9N2RJ49J87P2n4M0l37L65r7J61m02
1306h1K1l95l9J09J17J32K12j54K62K30j03n7N1J45K7m33K1j17m28l3K50j47L01
1329a09J35Q3J61RN6J47l46j41P8j06m1k72j95J06N97k11M25p4j8l41o6J00J34
$$ plain form
1169 99 -277 -573 -679 -245 -238 -297 -246 450 160 4 -128 -83 -284 3 319 725 720 741 389 -175 -195 -608 -747
1192 -747 -1226 -980 -162 69 459 591 624 654 527 390 85 -420 -794 -637 -581 -426 193 139 402 464 460 -7
1214 -7 -408 -524 -131 124 519 542 639 289 -59 12 -402 -468 -722 -821 -456 -68 20 351 719 772 970 906 381
1237 381 -120 -585 -397 -890 -469 -358 74 127 422 586 139 230 71 46 -1 388 208 322 -39 -46 -394 -295
1259 -295 -190 -347 -285 -244 198 -52 -40 252 395 609 385 576 -70 -332 -374 -748 -459 -373 -189 -223 93 367
1281 367 375 369 75 383 372 165 186 30 -225 -368 -292 -245 -226 -174 -165 -16 171 243 189 229 -108 257 160 321 -81
1306 -81 -60 -455 -494 -385 -268 -136 76 -78 184 414 311 254 305 450 477 44 65 -52 -480 -513 -263 -410 -109
1329 -109 26 109 270 279 335 482 136 -5 73 -33 -74 -346 -541 -435 162 -49 376 302 284 -57 -123 -23 111
1352A11P8j09R0j9o8p7j58k81J45m8J12o6L96J95J60J4N3j04m62n0l72j60l6Q2
1376e74J40M00L00j8K17m3k72L7l27J32k24J62o9M32m6k39J46l70k44K23m8K30
1398e5JJ63K84J29J60l63p3k33j60o49j4K3L56J66L64L07J34P1M7k41k10m77J80
1421i0r4J51k39K62p0K2L6l23J42J22K0K34n5L7K53j00J1l21M9k76l71J09p2J98
1445c65J47L03J84J27J38Q7k00k51k78n6N8j77j05JK24P0p6o4J32K26K32M6k21
1468A82K06k07j55l9k0k81j79K24j23j83M03K51K38L90k65Q6k65j59q2k42N86
1489C66o39K45l68J21J7mJ56K13k3J23L76k79J67qr3l29j33j68j48j32J41p4K96
1512a77K14J42L41j22J08k3k23l55p9J1k16J65r1k8J62o8J34q1N7K98j97L18N4
$$ plain form
1352 111 189 80 170 151 83 6 -152 -433 -288 -336 -224 -290 106 301 461 475 528 424 -38 -88 -460 -620 -656 -574
1376 -574 -434 -34 266 248 465 422 150 187 -140 -8 -232 -70 -139 293 247 8 154 -216 -460 -237 -285 -55
1398 -55 -54 109 393 522 682 319 246 13 -147 -796 -810 -787 -431 -265 99 406 540 611 658 417 207 -270 -90
1421 -90 -184 -33 -272 -10 -80 -58 -22 -345 -203 -81 -61 173 118 155 408 308 319 -2 47 -229 -600 -491 -563 -365
1445 -365 -218 85 269 396 534 621 421 170 -108 -164 -106 -283 -388 -387 -163 -93 -169 -233 -101 125 357 403 182
1468 182 388 181 26 -13 -33 -314 -493 -269 -392 -575 -172 79 317 707 442 528 263 104 22 -220 366
1489 366 -273 -28 -396 -275 -258 -262 -106 107 84 207 583 304 471 463 370 41 -92 -260 -408 -540 -399 -473 -177
1512 -177 37 179 520 398 506 483 260 -95 -174 -163 -379 -214 -305 -333 -171 -239 -105 -186 -129 169 -28 290 344
1535C44J14Q0l29k36j62j52l42N1R3P2M99j95M46L23k22M0j1k47l50n3j41q1j3
1558d72M28m4j70L11l1q6m9J31J90j47j6L42j01m5k70J32l13n5k69J05lO7N35
1581A70J13J61M9K45l90j38l31j28k34K60k52J29M09j65M38j33j75J61Ml36R5
1602d8L34l26N7Q4j77Kr3q9OJ33j35K42K71j25M34q0R0m29j91k31J02j22j42J34
1626b99J88R5l6J01J11l9Mm6K03l17J2J50m6r1J79M5m71l3n4J51j32M45k3J35
1650B32P0m4j46Qp4j34P5k07J21J0jJ25j06N2M9l6J35j27PL9J26K37k25j91k57
1675b62K07k94J65J4J17Pj74N07m4P8j66m0j58J81l34j4J25p3kJ58k0J43j58O3
1699B6lP1k95L20J3J05J17j63k29j7K8k21J6N9j62k00N64L14j08J85m0j4k05k4
$$ plain form
1535 344 458 538 209 -27 -189 -341 -683 -632 -539 -467 32 -163 283 606 384 424 413 166 -184 -237 -378 -459 -472
1558 -472 -44 -88 -258 53 22 -64 -113 18 208 61 45 387 286 241 -29 103 -210 -265 -534 -429 -432 -365 170
1581 170 283 444 493 738 348 210 -121 -249 -483 -223 -475 -346 63 -102 336 203 28 189 193 -143 -48
1602 -48 286 -40 17 101 -76 -74 -167 -256 -250 -117 -252 -10 261 136 570 490 580 151 -40 -271 -169 -291 -433 -299
1626 -299 -111 -16 -52 49 160 121 125 79 282 -35 -23 127 81 -10 169 214 -257 -290 -344 -193 -325 120 97 232
1650 232 302 258 112 120 46 -88 -13 -220 -99 -89 -90 35 -71 -19 30 -6 129 2 9 48 174 411 186 -5 -262
1675 -262 -55 -349 -184 -170 -53 -46 -220 287 243 321 155 115 -43 138 -196 -210 -85 -158 -160 -2 -22 121 -37 26
1699 26 23 94 -201 119 132 237 354 191 -38 -55 -27 -248 -232 -173 -335 -535 29 343 235 420 380 366 161 137
1723A37k21k79J17l8J61L68r5k17p0J51%L1k72J66J23K7m3J16k5l17K12m4j31
1746a43j74k3j75M62L67p5K85j58j09k46N7l46j6l9k14M58J44O9j27m1K73j25
1768A04L21l44l1r1M4K27P6j17k23j69j21K9M1K65j83J17M68J67r0k11q0j71j
1791B7O9p3o26J90N3N43r8J55p3l15K57K43k5l35N9r2q4J41J30k50j21o2Q4J94
1815ij08O3K04o3K83q1J75n60j05lk5j7q5J31K4J51J86J27k78J17j42M35j13l46
1839c9j75K8K17K1Rm03L5k5L01j03M53j09J58o5J28l7k31k81j48k4J73J39l09
1862b87o8J35L57m6N1L12l80L5m9m5J38n2k29j60O4L78k01k47m9J02K92K32K75
1885E58m60l4J94L24k30m57m49J36L19J4J78l31K18K98L9K2j14j75m24J45K47
$$ plain form
1723 137 -84 -363 -246 -284 -123 245 150 -67 -137 14 14 45 -227 -61 62 89 46 162 137 -180 32 -12 -143
1746 -143 -317 -340 -515 -53 314 239 524 366 257 11 68 -278 -294 -333 -547 -89 55 124 -3 -44 229 104
1768 104 425 81 50 -41 3 230 306 189 -34 -203 -324 -295 -254 11 -172 -55 413 580 490 279 199 28 27
1791 27 96 23 -603 -413 -360 183 85 240 167 -148 109 352 327 -8 51 -41 -125 16 146 -104 -225 -287 -203 -9
1815 -9 -117 -54 150 87 370 289 464 -96 -201 -204 -229 -246 -331 -200 -176 -25 161 288 10 127 -15 420 307 -39
1839 -39 -214 -186 31 52 61 -342 -307 -332 -31 -134 319 210 368 303 431 394 163 -118 -266 -290 -117 22 -287
1862 -287 -355 -220 137 91 142 454 74 109 60 15 153 101 -128 -288 -224 154 -47 -294 -343 -241 51 283 558
1885 558 98 64 258 582 352 -105 -554 -418 -99 -85 93 -238 -20 278 317 339 225 50 -374 -229 18
1906A8K17k44j93N2k2L80J56n64k01J94L75L6J65j70m9J35n6l1l66k08P3q1K00
1929a84K99k09J02J74J15L24l71k77j49L8K31K0o2j41j01J19L12j59J96n32P2
1950a83M5L46J80K4m65J48%k5K9m70p1K03l5L58P7r9M5k25O05j71j56k02k22J48
1974a16L30j67j74l43K24J71L59j11k92q1J86K27J21j25l23k10K14L50q8k33k03
1995b84J5M01J2K08j75l81R4K51J56j60r8l17j09L62J07j60l7k33L10J34J62j70
2017H8pj15L51J12J2p27J24N7M4J98j56k85j4M10N3K26P1n27J69j29N16j35m60
2040a24j05j04K43M18j64k49j59k7M95J9r9l28J47N9K19%k60l13j06J50M22l28
2062a94J75k49L6L47M02p7m01j48K28J21j09n7k95k94M20L79j09k40j12P7L11
$$ plain form
1906 18 235 -9 -202 -150 -172 208 364 -200 -401 -207 168 204 369 199 150 285 229 198 -168 -376 -303 -384 -184
1929 -184 115 -94 8 182 297 621 250 -27 -176 -138 93 113 51 -90 -191 -72 240 81 277 -255 -183
1950 -183 -138 208 388 412 -53 95 95 70 99 -371 -442 -239 -274 84 161 62 107 -118 487 316 160 -42 -264 -116
1974 -116 214 47 -127 -470 -246 -75 284 173 -119 -200 -14 213 334 209 -114 -324 -110 240 152 -81 -284
1995 -284 -269 132 144 352 177 -204 -110 141 297 137 39 -278 -387 -25 82 -78 -115 -348 -38 96 258 88
2017 88 81 -34 317 429 441 -286 -162 -105 -61 137 -19 -304 -318 92 145 371 442 -85 84 -45 471 336 -124
2040 -124 -229 -333 -90 328 164 -85 -244 -271 224 243 144 -184 -37 22 241 241 -19 -332 -438 -288 134 -194
2062 -194 -19 -268 -232 115 517 440 39 -109 119 240 131 74 -221 -515 -95 284 175 -65 -177 -100 211
2083B11K03n8k61m23J04L26L7k29j07o9J19L26j33J7m89J94J79K71K13k29m01
2104a99k7M52k3n9m49j03J61L51J60j01j08k71N4M81k2k23j10j21n1K80J12k81
2126i7k79l1L32J88r1k7l84J02M24M96m10l81j48L14Q0M4k76k61J81J58L20J55
2148D09m40M0j26M40O1l55k17j24j3L43L54j48k39j74J53K34j1l00K7k27M69J59
2170C15n3l36l41K53J52K72n8l52n5J31L43J59k59k60l88M61J75K1l23O4l55M31
2192cL63j55l25l70N46J53M1j44j00j09j76M14Ql77j24J87L07O1M4m11J47l79
2214d02N10O6Rn61M6J56Q8K52j94r5k67K68O63j85m38J2k00L03L35j77k11l24
2236c46Q6L94L8J83n90K9K22J06J90n6l52p0L46k9j59q3j42l56N25L61k02k84
$$ plain form
2083 211 414 356 95 -328 -224 102 139 -90 -197 -266 -147 179 46 63 -426 -232 -53 218 431 202 -199
2104 -199 -226 226 203 144 -305 -408 -247 104 264 163 55 -216 -162 319 297 74 -36 -157 -208 72 184 -97
2126 -97 -376 -407 -75 113 22 -5 -389 -287 137 633 223 -158 -306 8 88 132 -144 -405 -224 -66 254 409
2148 409 -31 9 -117 323 384 29 -188 -312 -325 18 372 224 -15 -189 -36 198 187 -113 -86 -313 156 315
2170 315 262 -74 -415 -162 -10 262 204 -148 -203 -72 271 430 171 -89 -477 -16 159 180 -143 -79 -434 -3
2192 -3 360 205 -120 -490 56 209 250 106 6 -103 -279 135 143 -234 -358 -171 136 197 241 -170 -23 -402
2214 -402 108 174 183 -378 -332 -176 -88 164 -30 -125 -392 -124 539 354 -84 -72 -272 31 366 189 -22 -346
2236 -346 -260 134 172 355 -235 -206 16 122 312 256 -96 -166 180 151 -8 -91 -233 -589 -64 297 95 -189
2258a89j88J96K49L27k31k45k53M09J19K88n14j43k46L32L30o9j66k67P1J48L93
2279C51j94k26j27P5J59J2L06o14M4J47L42R8m04k28J25K59J37J74n12l10J94
2300a92M3K71m9o0j33J4Q3M49k65l92L9Q3M98q8l96k16J00L21K54ln15j87K66
2323g5J24L12j39l69k4J48J00J10k63m2j45L74M9k4l20q1N9k4O34m66j98LK82
2346B5R9K7j05j10j13L85j61K58k16P0j51n3K1K57l08k65K26J09k4K34l02R0n7
2369f4L85M3j65j89k75K26M2J14j34k16M0J34K04K2l0k55J14J68J72l03k38j1
2391b16J38K41m7l9l11Q3n1L40J04j18j02k77M09Nk39M7k45K46l1N3m2q3o8M5
2415a58K49K59j56l68J04L15j01n1j85j66R4L12r5P9j46q8j3R3J42P6j54l84L96
$$ plain form
2258 -189 -377 -181 68 395 164 -81 -334 75 194 482 -32 -175 -421 -89 241 172 6 -261 -190 -42 351
2279 351 157 -69 -196 -121 38 50 356 -258 -214 -67 275 373 -31 -259 -134 125 262 436 -76 -386 -192
2300 -192 -149 122 73 13 -120 -106 -23 426 161 -231 -192 -109 389 301 -95 -311 -211 110 364 361 -154 -341 -75
2323 -75 49 361 222 -147 -171 -23 77 187 -76 -118 -263 111 160 136 -184 -265 -206 -230 404 -62 -260 -257 25
2346 25 124 151 46 -64 -177 208 47 305 89 159 8 -45 -24 233 -75 -340 -114 -5 -29 205 -97 -7 -64
2369 -64 321 364 199 10 -265 -39 3 117 -17 -233 -193 -59 145 167 137 -118 -4 164 336 33 -205 -216
2391 -216 -78 163 116 77 -234 -151 -202 138 242 124 22 -255 154 159 -80 -33 -278 -32 -63 -10 -52 -135 -203 -158
2415 -158 91 350 194 -174 -70 245 144 93 -92 -258 -164 148 53 132 -14 -102 -115 -22 120 196 42 -342 54
2438E4L5J07k43l62K39J89j28J91p8k85J51M52q4k69Q0j75J02K50l7k39k70J50
2460a70L2K10Lk72n0J50K40J38j25n6r6k21J85K25j15r6j91j47K89L31l58k6O2
2483e8l1K30r4j16k18J84K0J88J50j68k33J2J2R9n0N6j01l0K00J69k29j60L23
2506A55j0j09Q4k67m3M4P9L12n47K00Q2p8RJ75L6k98J01L28m15L31l56j80J84
2529a83L19O9l85K15j45K66J08Or2j91p3Q2J2n4M4k86Q6L28j80K94k09p2k5J63
2553I7M2J46j74j35O6J1L2j24l9m5M8K0l0m6j5n4N60k16r3k36J31P1K21l66J49
2578B1k78O1OL94j69N7Kl11L05P1L6m2k16j90J95K87j98l71K61L60j36m48L15
2601A2J63k23j1K22M4j63O1j66P6q7J98r8l00J98J01J08j11j06J97k93J97j07
$$ plain form
2438 54 89 196 -47 -409 -170 19 -109 82 4 -281 -130 322 238 -31 49 -126 -24 226 189 -50 -320 -170
2460 -170 -138 72 75 -197 -247 -97 143 281 156 100 4 -217 -32 193 78 -18 -209 -356 -67 264 -94 -120 -58
2483 -58 -89 141 47 -69 -287 -103 -83 105 255 87 -146 -134 -122 -23 -73 -17 -118 -148 52 221 -8 -168 155
2506 155 145 36 120 -147 -190 -146 -67 245 -302 -102 -20 -98 -89 86 122 -176 -75 253 -162 169 -187 -367 -183
2529 -183 136 205 -180 35 -110 156 264 270 178 -13 -86 -4 8 -46 -2 -288 -202 126 -54 240 31 -41 -66 97
2553 97 139 285 111 -24 42 53 85 -39 -78 -123 -75 -55 -85 -131 -146 -200 360 144 51 -185 -54 17 238 -128 21
2578 21 -257 -196 -190 204 35 92 94 -217 88 159 195 153 -63 -253 -58 229 31 -340 -79 281 145 -303 12
2601 12 175 -48 -59 163 207 44 105 -61 15 -72 126 28 -272 -74 27 135 24 -82 115 -178 19 -88
2623h8K3p4j7K88k07L39o50R2J43P8L20j55j63j53J93J99nj36r8P4k11K56p5k5
2647e2p6o5M13j4j4k84J73p1J62k3kJ5k70Q6k5J2qj1m0J4j18J63Mj11K89l9k36
2674a28J73K6j73J63k6j13j68J53J78j70j8J63O1k4p1j46O3P0L2O0nj81O2j25
2698a44J76r2l4R8q7J72k60o0J45J07K31k03j39K5R7j01J27n3j0k92K19Q5J9P1
2722I7J2O6l08Q8l3Pq0J15O5J19j60p3r0L54m0l15J68k35J11J01J28k30K37o6
2746C8Qk3M3%j75N4O1j0k55r2M29k46J76r5J45k0o7J04j86k9P9qO7L06l82L6N8
2773A6j54O5J69q0J12J77j72Lq1J2j67K54l68O3J54K13k68O4R7j97l2OJ58L0n1
2798B3j56L46k55q8J5J66R0j04n0P9L4n8J11k1l40K91j38qJ39j29J61k38O9k5
$$ plain form
2623 -88 -65 -139 -156 132 -75 264 -386 -294 -151 -73 247 92 -71 -224 -31 168 163 27 -71 3 -208 48 -27 -52
2647 -52 -128 -193 220 206 192 -92 81 10 172 149 147 162 -108 -22 -47 -35 -43 -54 -94 -80 -198 -35 -31 -142 147 108 -128
2674 -128 45 71 -102 61 35 -78 -246 -93 85 -85 -103 60 121 97 26 -120 -57 13 45 105 100 -81 -19 -144
2698 -144 32 -60 -94 4 -83 89 -171 -231 -86 21 252 49 -90 -65 32 -69 58 5 -5 -297 -78 7 26 97
2722 97 109 175 -133 -45 -78 -71 -151 -36 29 148 -12 -85 -175 179 139 -176 -8 -243 -132 -31 97 -133 104 38
2746 38 46 23 66 66 -109 -55 6 -4 -259 -351 78 -168 8 -87 58 38 -29 75 -111 -140 -61 -69 -2 304 -78 -42 16
2773 16 -138 -73 96 16 128 305 133 136 55 67 -100 154 -214 -151 3 216 -52 12 109 -88 -120 -114 44 74 23
2798 23 -133 213 -42 -130 -115 51 141 37 -13 66 100 42 153 132 -208 83 -55 -63 76 -53 108 -130 -61 -86
2822h6J1j8J07o6O7j85J80jj94K48PJ7rl98J99J63k15K16n7l8r8K30jk4j31P1
2848eK8N4j32q4L02l64N18k28O8p5O9j18j75K19k26j33L89O1l42J68M4n4J4L1
2872B9J61j89o4O1P3m7n2jr2J63k68J09Q8R4N9P4k0N6l42J05J99j22k29R1J30
2897F6j89J98l72K49J85j45lO4J33k56J7J2K11k34j03J94m8k11L75k50J52O1j31
2920b5M7j43R8m0K46k29J84r2j30j60J72M7J11j18k5N2K8k5R8n7k15Q4l8L60j14
2945A16r2J09pl53q3L94P9l87J95O6K06k45K6m8O1j10O3j44n9J03K45k49n6Q0
2969i0J18k0k9Q3j91r9%J56J10j63QJ19N7j80O4j50J60J31l24J32K54j68r1K81
2993A68j63m4J2J10J75l96J02o3J05r4l8J1R3pK8J48m1j51j8J26j91J98N9j14
$$ plain form
2822 -86 -75 -93 14 -52 15 -170 10 9 -185 63 70 87 78 -320 -121 42 -173 43 -14 -52 -150 80 79 55 -76 -5
2848 -5 23 77 -55 -139 163 -201 317 89 157 82 151 33 -142 77 -149 -282 107 168 -174 -6 38 -16 -2 29
2872 29 190 1 -63 -2 71 24 -28 -29 -121 42 -226 -117 -29 65 124 198 178 234 -108 -3 196 74 -155 -64 66
2897 66 -123 75 -297 -48 137 -8 -11 53 186 -70 -53 -41 170 -64 -167 27 -21 -232 143 -107 45 106 -25
2920 -25 22 -121 -23 -63 183 -46 138 46 -84 -244 -72 -25 86 -32 -57 -5 23 -2 96 39 -176 -92 -130 230 116
2945 116 24 133 126 -227 -310 84 163 -224 -29 37 243 -2 24 -24 37 -73 -10 -154 -213 -110 135 -114 -170 -90
2969 -90 28 8 -21 62 -129 -228 -228 -72 38 -125 -117 2 59 -121 -57 -207 -47 84 -240 -108 146 -22 -113 168
2993 168 5 -39 -27 83 258 -138 -36 -99 6 -88 -126 -115 -22 -29 -1 147 106 -45 -63 63 -128 70 129 15
3017A5j6q5K55m7q9k01L54j92j58L10j58l0J75k03K38j10j11j44O8J76J13j19
3039D1j28J22L6M2p9Lk08K40n5j56L8O5J19j77N5nr3J96M6Qj47J18k05K64l50
3064b10P3J39J2j8j08R0Q1j27J33L5j44O6kO4j97K08Q0k65j85K20J32k1k81k4
3088b49K93R8Lp0j85J35l8l5L57k32j30k72K46J05O3J6j25j20L14m05K03M0J43
3111A55k78M3J49p6L4k6J60k14J48l9k61kK63j03Q4j19N3OJ82j44J29j46j86J62
3135b6Q9l30M55k3m20L02p6rJ13j36J96M0k09J90m44L84j30m4J91o4r5m9J86O7
3159A58l99K56j37J58j21PQ3L6L2m9mJ25j29Q0j53l8J78j29r6L1N5O3Q3k72J71
3184a1qM3q8J35k90K44p5l8O3k2r3J48J16j58q9k1J21j85K39j02J69Kk60L41j26
$$ plain form
3017 15 -1 -86 169 122 33 -168 186 -6 -164 146 -12 -42 133 -70 168 58 -53 -197 -129 47 160 41
3039 41 -87 35 71 113 34 37 -171 69 14 -142 -104 -39 80 -97 -42 -47 -140 56 102 110 -37 81 -124 140 -210
3064 -210 -137 2 14 -4 -112 -22 59 -68 65 100 -44 22 20 84 -113 95 175 -90 -275 -55 77 56 -225 -249
3088 -249 44 142 145 75 -110 25 -13 -48 309 77 -53 -325 -79 26 89 105 -20 -140 174 -231 -28 12 155
3111 155 -123 -80 69 -7 27 1 161 -53 95 56 -205 -207 56 -47 37 -82 -29 -23 159 15 144 -2 -188 -26
3135 -26 63 -267 188 165 -255 47 -29 -38 75 -61 135 175 -34 156 -288 96 -34 -78 113 49 -46 -95 91 158
3159 158 -241 15 -122 36 -85 -78 5 41 73 24 20 145 16 96 -57 -95 83 -46 -142 -111 -56 7 90 -182 -11
3184 -11 -19 24 -64 71 -219 25 -50 -88 -25 -47 -140 8 124 -34 -123 -144 -23 -208 31 -71 98 100 -160 181 55
3209E5l1K38j39j44l2J00l2j2Mq8k05M50j91Q1k04JJ43MP7J20q8j71K38j92J4
3234dN9P3j04k58L06j21J97o2j28J89k33J12r9q7N3RM1J50j86J98j92q2M9Qk51
3259c63M93Nk15o5J83k6j55m6J64p7j9K2K99j72M0N8j78K17k39k5J78q8O8Q8j38
3284Il0j48K18p1Pj53R5M5nj36K11J67k47J35n0j63K01k85O5K49j61J36j41J36
3308H4j05J36j3p0k8k01L48j54k0K0J07j11p4K53k8K3r6qk74M06M9j86R1j99L9
3333a1J74j35r7J80q2l1N2N4j38J3P8j46r1K48n9j35J71m9Q3N0q9Q2q3l7j47J33
3359a2J60k22J74j37J24l28J36N0J40n2j1k07J16J76l61J48o6J74q5O4j85J75
3381b9P4N0j05J01j23J35m5j52R8k9J33l8n5n6R9o2r3P2K20l29J68q6M6KP4j7
$$ plain form
3209 55 24 262 123 -21 -53 47 15 3 7 -81 -286 164 -27 54 -150 -149 -6 -2 75 195 107 -64 174 -18 -4
3234 -4 55 128 24 -234 72 -49 148 86 -42 147 -86 26 -73 -160 -107 -98 -57 93 -93 105 -87 -169 -120 -112 -363
3259 -363 130 135 -80 -145 38 12 -143 -189 -25 -102 -121 -99 200 28 68 126 -52 165 -74 -99 79 -9 59 147 9
3284 9 -21 -169 49 -22 -15 -168 -73 -28 -33 -169 42 209 -38 97 47 -116 85 -200 -135 114 -47 89 -52 84
3308 84 -21 115 102 32 4 -197 151 -3 -23 -3 104 -7 -81 172 144 167 71 63 -211 195 244 58 149 -50 -11
3333 -11 163 28 -69 111 29 -2 50 104 -34 -21 57 -89 -180 68 9 -126 45 -4 79 129 40 122 39 2 -145 -12
3359 -12 148 -74 100 -37 87 -241 -105 -55 85 33 22 -185 -69 107 -254 -106 -172 2 -83 -19 -204 -29
3381 -29 45 95 -10 91 -32 103 58 -94 4 -25 108 70 15 -41 58 -4 -97 -25 195 -134 34 -52 -6 -4 70 53
3407E3o0j2K67k33j57M21n68N28j52m2O3K1K5j1k02J07lo0q7j47K41R4K9J9k07
3432g3P6j84M0M89l52j13L09k80L53k40j56L2k8J61p3j08O3N8r7J38r0J8nk8P5
3457a5o2R0q2O6r5J75k56K0J50n4kOJ21l1J15j61q4N6j99R0Q3J12O3j74J43j95
3483a20K36j18K11j41nqm5j34R9j82K76J97k08j98P5J15j48LK2N7m9J34O4j0L2
3508A55j64q8p5R6J04p5r3K30j64N0N7j15O6j9k8K9K26j77lJ04k22K19Q8k47k
3533d8K87l43m6J08M2l3j5L9R1k72M05j25k68Q9K53l76K32J21m4k14J2J17j61
3556a49J18j3K35k33j9K6P0j07J46L5q4p2p2K51j22r6K27k16q2K15k21K04q5R4
3580E0O6j51O1k8J47J27j77K01l74Q7n6J07j27m4K6J8l8M9M8qJ10j23J48k27K44
$$ plain form
3407 53 -7 -19 248 15 -142 279 -289 239 87 45 108 129 154 143 -59 48 45 -15 -102 -249 -8 86 115 134 -73
3432 -73 3 -181 -141 348 -4 -117 192 -88 265 25 -131 -99 -127 34 -39 -147 -84 -26 -123 15 -75 -57 -62 -90 -15
3457 -15 -77 13 -69 -3 -98 77 -179 -159 -9 -63 -65 -59 62 31 146 -15 -99 -43 -242 -152 -69 43 106 -68 75 -120
3483 -120 116 -2 209 68 63 55 10 -124 -25 -207 69 266 58 -140 -65 50 -98 -95 -73 -16 -65 69 133 123 155
3508 155 -9 -97 -172 -76 28 -47 -140 90 -74 -24 33 -82 -16 -35 -63 -34 192 15 12 116 -106 113 201 -46 -48
3533 -48 239 -104 -150 -42 0 -33 -48 -9 82 -190 215 90 -178 -89 164 -212 20 141 97 -117 -105 12 -149
3556 -149 -31 -44 191 -42 -61 -35 35 -72 74 109 25 -47 -119 132 10 -86 141 -75 -157 58 -163 41 -44 50
3580 50 116 -35 26 -2 145 272 95 296 -78 9 -47 60 -67 -111 -85 -67 -105 -56 -8 -16 94 -29 119 -108 136
3605A36l26J71j07K97j13l6J5R9Oj26J27k05L06q5j4L2j37q6r7j11L33q6j46K03
3629E0j38J80j69L6J1j85J03J23J30k21J19L5j99M4J27j25K0J66k30K11p3J09
3651A24k75K34J31L5k56M1l2j93J58r1J47j28K75j38KJ6r8J50j09Q8j20J3Q8L0
3675I2q9j12J14M2J47p0n9pm7j64K30k07J40K5l7N0j53M98k47j06o0j41K57k07
3699a11L0n5k0J24j96L77k50L07j00O1k24L24l27J65m3q1m9j52L71J4m58K43J64
3722A14j1J2q8M5j77K85j33K23k76j73O6Q3p0pK95l80L18k89J40P7j01J57j06
3745Dj93K14k3J12j46MK53j93L7M9j13K1O5J20k58J24P9n5k63L68k42j00K28j14
3769b2j3k9p1J38J01j92j8K94j36N9l7r6J66j00k35K04n7J9j98K61J57j63J26
$$ plain form
3605 136 -190 -19 -126 171 58 22 37 136 142 16 143 -62 244 159 145 177 40 -46 -143 -254 79 -7 -153 50
3629 50 -88 92 -77 -41 -30 -215 -112 11 141 -80 39 74 -125 -81 46 -79 -59 107 -123 88 15 124
3651 124 -151 83 214 249 -7 34 2 -191 -33 -124 23 -105 170 32 34 50 -48 102 -7 81 -39 -26 62 92
3675 92 3 -109 5 47 194 124 65 58 11 -153 77 -130 10 35 -2 48 -105 393 146 40 -20 -161 96 -111
3699 -111 -81 -136 -156 -32 -228 149 -101 206 106 167 -57 267 -60 105 62 -19 -68 -220 151 165 -293 -50 114
3722 114 103 115 27 72 -105 180 47 270 -6 -179 -113 -30 -100 -107 188 -192 126 -163 -23 54 -47 110 4
3745 4 -189 25 2 114 -32 -28 225 32 69 118 5 26 91 211 -47 77 156 101 -162 206 -36 -136 92 -22
3769 -22 -35 -64 -135 3 104 -88 -106 188 52 111 74 -22 144 44 -191 13 -44 -25 -223 38 195 32 158
3792A58j64J30o4j11K16l40MK36j30l0MJ5J28l60K75L07l60M4K98l77j6J30K1
3815A4k2m5N7J32rj11J8OJ36q0r0j41J82k1n8J64j92J32J7jp3O0o8r7J21J95l01
3842g5R1r8k20M96k18j7J73j53J15N0k04j84Q2K24j21N6j3k69L90j57j00K37j9
3865F6j71m9K40q2p4J97n9J10l22Q1J33K5Q9j38J41j67J71j48k3R3r4j77J99k23
3889a82L74k36q0N8Oj17J75J65j28j14P3K81j93j69N5j5m5J43R5j07j38j52M27
3912A76k16K4k23J89P9j41L8J37P7p4oj64oP7K53l71P3J23Q7j75n2N1J74j12k5
3937gJ94j16j80K93j77q0m5J75l7J43j78M1K47k06M8J32k98KQ3Q1J14p9j29j19
3961i8l2K97j99j00K03r4l2M2J3pJ14k82J36J67k97L6l2M5L3J19l1m0J16n2j96
$$ plain form
3792 158 -6 124 60 -51 165 -175 -171 65 -65 -95 -91 -76 52 -308 -33 274 -86 -42 256 -121 -137 -7 14
3815 14 -8 -53 4 136 127 16 34 40 176 96 6 -135 47 26 -32 132 -60 72 89 88 15 75 7 -90 31 226 -75
3842 -75 16 -82 -302 194 -24 -41 132 -21 94 144 -60 -244 -162 62 -59 -3 -16 -285 105 -52 -152 85 66
3865 66 -105 -154 86 4 -70 127 68 178 -144 -63 70 95 184 46 187 20 191 43 20 113 19 -158 41 -182
3889 -182 192 -44 -124 -66 -60 -177 -2 163 35 -79 -6 275 82 -87 -32 -47 -92 51 146 39 -99 -251 176
3912 176 -40 -16 -239 -50 29 -112 -74 63 140 66 60 -104 -110 -33 220 -151 -78 45 132 -43 -95 -44 130 18 -7
3937 -7 187 71 -109 184 7 -73 -118 57 20 163 -15 26 273 67 115 247 -51 -49 34 115 229 150 21 -98
3961 -98 -130 167 -32 -132 71 -23 -55 -13 0 -7 107 -175 -39 128 -169 -133 -165 -120 -87 32 1 -39 77 25 -171
3986a71J68J47j99J34j37j2K54m89M26l25J93LPJ9j47R0L3k14J73K2K01k31j4
4009f9L2P5m14K07R0K24j68MP5N7m4M5Pp6k4p3J9J40k55p5K38nj78R4K65m0q1
4036G0k33K31J12j97j10L17j31k6P7K7j37K23M4j54k63J28J0q3K33j34n8J1j20
4059a63J56J03r9m0N0j6m7LJ00j78K02r4j15J95K16m52J15m7l0K42M1n8o0J6q7
4084d7M2j01J15q9J9R2j65k6K25j91K78j88J64j53j13J23Pj89K04J20l57K06J39
4107A15o1j23q2J86J4J10n2q1j97J61Q5J47r4j90O3m0P5j02J41j00M1q8J49j02
4131b5r2M7%J80l23L27j03N9J06q0m6J59k49jK07j49k83L78J4k87R9J08k0R4k24
4156a04J43L7j13pJ23k07J65Q1j72ql3R3M8n9K31l38J71l8J53r8q0Q0j09J0L96
$$ plain form
3986 -171 -3 144 -55 79 -58 -70 184 -305 121 -204 -11 -8 -1 18 -129 -39 -6 -220 -47 -25 176 -55 -69
4009 -69 -37 38 -376 -169 -79 145 -23 -19 56 113 69 114 121 45 21 -52 -33 107 -148 -223 15 10 -168 -74 191 151 70
4036 70 -163 68 180 -17 -127 190 59 33 110 137 0 223 267 113 -150 -22 -12 -95 138 4 -54 -43 -163
4059 -163 -7 96 -3 -43 7 -9 -56 -53 47 -131 71 -23 -138 57 273 -179 -64 -111 -141 101 142 84 24 40 -47
4084 -47 -5 -106 9 -80 -61 31 -134 -160 65 -126 152 -36 128 -25 -138 -15 -8 -197 7 127 -230 -24 115
4107 115 54 -69 -151 35 49 159 107 26 -171 -10 75 222 128 -62 1 -39 36 -66 75 -25 16 -72 77 -25
4131 -25 -117 -70 -70 110 -213 114 11 70 176 96 50 209 -40 -41 166 17 -266 112 126 -161 -62 46 26 120 -104
4156 -104 39 76 -37 -44 79 -128 37 118 -54 -62 -95 -2 46 -13 218 -120 51 13 166 68 -12 68 -41 -31 365
4181C65k30l57K40L3k29Q1M4J21k54Q7j69K82R5j81p3K79j00R2q7q4P3%m2J28
4205A14k0k1j77R4lP6j00J77p4nj79K18k03R6N6Kj58K62k10J46J74m60J86q0K20
4230A31j01M6rkJ06k73l6Q7K84o1k65O5q7K3j88K89N6k22K74J9o4o3L5J25l19
$$ plain form
4181 365 135 -222 18 51 -178 -97 -53 68 -186 -99 -268 14 109 -72 -145 134 34 126 39 -45 28 28 -14 114
4205 114 94 73 -104 -10 -13 63 -37 140 66 61 -118 100 -103 -7 49 51 -107 155 -55 91 265 -195 -9 -89 131
4230 131 30 76 67 65 171 -102 -138 -51 233 172 -93 -28 -115 -92 -280 9 65 -157 117 136 72 9 44 169 -150
$$ [...]
8191a8
##END NTUPLES=NMR FID
##END=
