##TITLE=1H_IG-cross1
 CDCl3
 8 sc, 
 27.11.2023
##JCAMPDX= 6.0         $$ Bruker NMR JCAMP-DX V2.0
##DATA TYPE= NMR FID
##DATA CLASS= NTUPLES
##ORIGIN= UXNMR, Bruker Analytische Messtechnik GmbH
##OWNER= root
$$ XWIN-NMR		Version 3.5
$$ Mon Nov 27 13:50:57 2023 Russian Standard Time (UT+4h)  she@DPX200
##.OBSERVE FREQUENCY= 200.1313
##.OBSERVE NUCLEUS= ^1H
##.DELAY= (6, 6)
##.ACQUISITION MODE= SIMULTANEOUS
##.ACQUISITION SCHEME= undefined
##.AVERAGES= 8
##.DIGITISER RES= 18
##SPECTROMETER/DATA SYSTEM= spect
##.PULSE SEQUENCE= zg30
##.SOLVENT NAME= CDCl3
##.SHIFT REFERENCE= (INTERNAL, CDCl3, 0, 15.7039)
##AUDIT TRAIL= $$ (NUMBER, WHEN, WHO, WHERE, WHAT)
$$ ##TITLE= Audit trail, XWIN-NMR		Version 3.5
$$ ##JCAMPDX= 5.01
$$ ##ORIGIN= Bruker BioSpin GmbH
$$ ##OWNER= she
$$ F:/spectra/data/she/nmr/H-F/1/audita.txt
$$ ##AUDIT TRAIL=  $$ (NUMBER, WHEN, WHO, WHERE, WHAT)
(   1,<2023-11-27 13:49:37.81 +0400>,<she>,<DPX200>,
      <created by zg, POWCHK disabled, PULCHK disabled
       configuration hash MD5:
       00 E9 B6 7A A2 85 ED C7 34 08 36 98 17 FE 4E 26
       data hash MD5: 16K
       37 72 A3 02 4D AC 2A D4 D1 26 BF 1D A7 B0 50 09>)
$$ ##END=
$$ 
$$ hash MD5
$$ 1C 83 43 7A 6F 23 81 16 FD EA 62 0D 9F 29 AA 19
##$RELAX= 
##$RELAX= 
##$RELAX= 
##$RELAX= 
##$RELAX= 
##$RELAX= 
$$ Bruker specific parameters
$$ --------------------------
##$DU= <F:/spectra>
##$EXPNO= 1
##$NAME= <H-F>
##$PROCNO= 1
##$TYPE= <nmr>
##$USER= <she>
##$AMP= (0..31)
100 100 100 100 100 100 100 100 100 100 100 100 100 100 100 100 100 100 
100 100 100 100 100 100 100 100 100 100 100 100 100 100 
##$AQSEQ= 0
##$AQ_mod= 1
##$AUNM= <au_zg>
##$AUTOPOS= <>
##$BF1= 200.13
##$BF2= 200.13
##$BF3= 200.13
##$BF4= 200.13
##$BF5= 200.13
##$BF6= 200.13
##$BF7= 200.13
##$BF8= 200.13
##$BYTORDA= 1
##$CFDGTYP= 0
##$CFRGTYP= 5
##$CHEMSTR= <none>
##$CNST= (0..31)
1 1 145 1 1 1 1 1 1 1 1 1 1 1 1 1 1 1 1 1 1 1 1 1 1 1 1 1 1 1 1 1 
##$CPDPRG= <>
##$CPDPRG1= <>
##$CPDPRG2= <>
##$CPDPRG3= <>
##$CPDPRG4= <mlev>
##$CPDPRG5= <mlev>
##$CPDPRG6= <mlev>
##$CPDPRG7= <mlev>
##$CPDPRG8= <mlev>
##$CPDPRGB= <>
##$CPDPRGT= <>
##$D= (0..31)
0 1.2 0 0 0 0 0 0 0 0.06 0 0.03 0 0 0 0 0.0002 0 0 0 0 0 0 0 0 0 0 0 0 
0 0 0 
##$DATE= 1701078577
##$DBL= (0..7)
120 120 120 120 120 120 120 120 
##$DBP= (0..7)
150 150 150 150 150 150 150 150 
##$DBP07= 0
##$DBPNAM0= <>
##$DBPNAM1= <>
##$DBPNAM2= <>
##$DBPNAM3= <>
##$DBPNAM4= <>
##$DBPNAM5= <>
##$DBPNAM6= <>
##$DBPNAM7= <>
##$DBPOAL= (0..7)
0.5 0.5 0.5 0.5 0.5 0.5 0.5 0.5 
##$DBPOFFS= (0..7)
0 0 0 0 0 0 0 0 
##$DE= 6
##$DECBNUC= <off>
##$DECIM= 32
##$DECNUC= <off>
##$DECSTAT= 4
##$DIGMOD= 1
##$DIGTYP= 9
##$DL= (0..7)
0 120 120 120 120 120 120 120 
##$DP= (0..7)
150 150 150 150 150 150 150 150 
##$DP07= 0
##$DPNAME0= <>
##$DPNAME1= <>
##$DPNAME2= <>
##$DPNAME3= <>
##$DPNAME4= <>
##$DPNAME5= <>
##$DPNAME6= <>
##$DPNAME7= <>
##$DPOAL= (0..7)
0.5 0.5 0.5 0.5 0.5 0.5 0.5 0.5 
##$DPOFFS= (0..7)
0 0 0 0 0 0 0 0 
##$DQDMODE= 0
##$DR= 18
##$DS= 0
##$DSLIST= <SSSSSSSSSSSSSSS>
$$ [...]
##$SUBNAM2= <"">
##$SUBNAM3= <"">
##$SUBNAM4= <"">
##$SUBNAM5= <"">
##$SUBNAM6= <"">
##$SUBNAM7= <"">
##$SUBNAM8= <"">
##$SUBNAM9= <"">
##$SW= 18.0517328524113
##$SWIBOX= (0..15)
0 0 2 0 0 0 0 0 0 0 0 0 0 0 0 0 
##$SW_h= 3612.71676300578
##$TD= 16384
##$TD0= 1
##$TE= 0
##$TE2= 300
##$TE3= 300
##$TEG= 300
##$TL= (0..7)
0 120 120 120 120 120 120 120 
##$TP= (0..7)
150 150 150 150 150 150 150 150 
##$TP07= 0
##$TPNAME0= <>
##$TPNAME1= <>
##$TPNAME2= <>
##$TPNAME3= <>
##$TPNAME4= <>
##$TPNAME5= <>
##$TPNAME6= <>
##$TPNAME7= <>
##$TPOAL= (0..7)
0.5 0.5 0.5 0.5 0.5 0.5 0.5 0.5 
##$TPOFFS= (0..7)
0 0 0 0 0 0 0 0 
##$TUNHIN= 0
##$TUNHOUT= 0
##$TUNXOUT= 0
##$USERA1= <user>
##$USERA2= <user>
##$USERA3= <user>
##$USERA4= <user>
##$USERA5= <user>
##$V9= 5
##$VALIST= <valist>
##$VCLIST= <CCCCCCCCCCCCCCC>
##$VD= 0
##$VDLIST= <DDDDDDDDDDDDDDD>
##$VPLIST= <PPPPPPPPPPPPPPP>
##$VTLIST= <TTTTTTTTTTTTTTT>
##$WBST= 1024
##$WBSW= 4
##$XGAIN= (0..3)
0 0 0 0 
##$XL= 0
##$YL= 0
##$YMAX_a= 67132
##$YMIN_a= -77641
##$ZGOPTNS= <>
##$ZL1= 120
##$ZL2= 120
##$ZL3= 120
##$ZL4= 120
##$ABSF1= 10
##$ABSF2= 0
##$ABSG= 5
##$ABSL= 3
##$ALPHA= 0
##$AQORDER= 0
##$ASSFAC= 0
##$ASSFACI= 0
##$ASSFACX= 0
##$ASSWID= 0
##$AUNMP= <proc_1d>
##$AZFE= 0.1
##$AZFW= 0.1
##$BCFW= 1
##$BC_mod= 2
##$BYTORDP= 1
##$COROFFS= 0
##$CY= 11.3945322036743
##$DATMOD= 1
##$DC= 2
##$DFILT= <>
##$DTYPP= 0
##$F1P= 15.7292609196834
##$F2P= 12.9074282941183
##$FCOR= 0.5
##$FTSIZE= 0
##$FT_mod= 4
##$GAMMA= 1
##$GB= 0.15
##$INTBC= 1
##$INTSCL= 1
##$ISEN= 128
##$LB= 0.24
##$LEV0= 0
##$LPBIN= 0
##$MAXI= 10000
##$MC2= 0
##$MEAN= 0
##$ME_mod= 0
##$MI= 1.114404
##$NCOEF= 0
##$NC_proc= 0
##$NLEV= 6
##$NOISF1= 3.799351
##$NOISF2= 2.8
##$NSP= 1
##$NTH_PI= 0
##$NZP= 0
##$OFFSET= 15.70392
##$PC= 1
##$PHC0= -24231.53
##$PHC1= 14.6527
##$PH_mod= 1
##$PKNL= yes
##$PPARMOD= 0
##$PSCAL= 0
##$PSIGN= 0
##$REVERSE= no
##$SF= 200.130013532006
##$SI= 16384
##$SIGF1= 3
##$SIGF2= 2
##$SINO= 400
##$SIOLD= 16384
##$SREGLST= <1H.CDCl3>
##$SSB= 0
##$STSI= 0
##$STSR= 0
##$SW_p= 3612.71676300578
##$SYMM= 0
##$S_DEV= 0
##$TDeff= 0
##$TDoff= 0
##$TI= <>
##$TILT= no
##$TM1= 0
##$TM2= 0
##$TOPLEV= 0
##$USERP1= <user>
##$USERP2= <user>
##$USERP3= <user>
##$USERP4= <user>
##$USERP5= <user>
##$WDW= 1
##$XDIM= 8192
##$YMAX_p= 0
##$YMIN_p= 0
$$ End of Bruker specific parameters
$$ ---------------------------------
##NTUPLES= NMR FID
##VAR_NAME=  TIME,          FID/REAL,        FID/IMAG
##SYMBOL=    X,             R,               I
##VAR_TYPE=  INDEPENDENT,   DEPENDENT,       DEPENDENT
##VAR_FORM=  AFFN,          ASDF,            ASDF
##VAR_DIM=   8192,          8192,            8192
##UNITS=     SECONDS,       ARBITRARY UNITS, ARBITRARY UNITS
##FACTOR=    0.0002768,     1,               1
##FIRST=     0,             0,               0
##LAST=      2.2672688,     0,               0
##MIN=       0,             -77641,          0
##MAX=       2.2672688,     67132,           0
$$ Real data points
##PAGE= N=1
##DATA TABLE= (X++(R..R)), XYDATA
0 0 0 0 0 0 0 0 0 0 0 0 0 0 0 0 0 0 0 0 0 0 0 0 3 -7 8 -8 8 -8 8 -8 11 -15 16 -16 19 -22 24 -27 30 -35 35 -43 43 -50
44 -50 57 -61 66 -73 82 -91 100 -108 120 -134 148 -165 184 -206 233 -264 306 -356 422 -514 649
65 649 -860 1225 -1987 4163 -20983 -77641 22465 67132 22556 8925 4172 -1746 855 -13104
79 -13104 -29245 -31236 9614 51006 14703 -11294 19386 5795 -12687 300 -19673 -23426 8387
92 8387 11099 1489 -13423 -11205 30607 21263 -22963 -3836 15257 1250 -3404 -21339 -25309 4863
106 4863 11714 -3512 -13811 1322 34250 9437 -28189 -153 4370 -16347 7799 5217 -16271
119 -16271 13346 28428 8830 -2294 -5435 5130 5683 -9602 -4204 -5213 -5559 19463 3002
132 3002 -25878 -910 9368 -5109 -1799 -1615 5955 11134 -7655 -6109 -1975 -15270 878 8766
146 8766 -7421 5665 12536 -195 4252 180 -9144 -6641 -7477 -558 -3109 -12715 15688 26263
160 26263 -3963 1526 11669 -5382 -3717 -4415 -12431 2142 9849 6162 2927 -5038 5400 8148
174 8148 -11833 -5477 244 -13293 -160 5975 -10782 -3512 5684 5203 6007 -6478 -2753 11121
188 11121 -1748 -4595 810 -9166 2322 11032 -5603 -1012 9350 4559 2358 -6912 -7828 1787
202 1787 -5774 -2414 6750 -4225 5080 16756 -2829 -5007 4057 -2691 -1223 -1975 -5885 3764 2953
217 2953 945 2925 -9047 -3977 6714 -8378 -7105 5308 -1411 2177 4842 -4576 544 1993
231 1993 -437 4574 -3167 -1753 10705 -152 -3242 5946 -3178 -2466 2697 -6285 -3227 1515 -1310
246 -1310 4204 -396 -2811 5927 -3300 -4796 6996 -2749 -3790 8085 1046 -1175 2100 -2647 1968
261 1968 789 -5562 600 -3222 -4050 5988 -3325 -6023 6464 449 -1795 3868 -2717 -47 5334
276 5334 -87 807 -2699 -2497 9821 1512 -7885 2687 1659 -1410 797 -8399 -4469 6692 384
291 384 -2826 -2647 -1091 9141 2180 -8043 3250 3477 -1525 3520 -3834 -4089 7808 3830 -1362
306 -1362 -2824 -5169 5085 3190 -9453 -3288 912 642 6037 -4965 -8509 9165 7984 -2816
320 -2816 -4522 -3370 6767 6228 -7662 -2968 3265 1059 4469 -4099 -9608 5309 5414 -2986 -1760
335 -1760 -4159 816 6064 -2984 -3419 686 1283 9271 2618 -8827 3999 8846 -1239 -3681 -6346
350 -6346 -1143 6697 -2866 -5849 1065 1745 5202 -821 -11262 544 5419 -4216 -1636 -1442 -817
365 -817 7524 3548 -1196 954 -1355 3472 2280 -9811 -3344 5169 499 2116 -1205 -4600 5597
380 5597 3957 -4417 -1703 -431 3617 4002 -5946 -963 6117 -753 1454 2613 -3876 1511 2280 -3224
396 -3224 -1154 -3378 -2876 2037 -3916 -3257 2023 -1258 2995 3512 -6422 -740 4588 -1874 -491 1211
412 1211 1740 5641 -669 -2505 2582 -2466 -522 3967 -3337 -609 3498 -2013 677 316 -5013 309
428 309 1785 165 1797 -1825 2436 8496 -2805 -5514 996 -2462 -1557 -452 -4387 1554 3715
443 3715 -467 758 -3431 -3376 2921 -3408 -4409 2304 -592 3030 7609 -1187 -862 4681 1818 -17
459 -17 -4451 -3025 6448 1318 -4816 742 468 1426 2914 -5592 -2956 4486 -504 -2339 -1817 -1424 4010
476 4010 456 -3508 2630 164 -628 5063 -1586 -4865 477 -1402 -1530 -1369 -3399 3799 4657 -1501
492 -1501 -433 -2391 -1709 4741 -2099 -3627 7219 5067 -825 -5 -877 1994 704 -4236 767 1775
508 1775 -1683 2569 -756 -3139 2592 -2361 -5682 558 -1144 -971 2447 536 2915 1712 -3037
523 -3037 952 -641 -4634 2371 1679 -2696 2045 1600 13 897 -2544 305 2527 -3040 -1326 -95
539 -95 -1398 5109 2024 -3752 4435 5245 -1413 -1259 -1681 750 2077 -3298 -1564 1131 -2028 1695
555 1695 92 -5203 1315 2378 -2577 -573 -2525 -3084 2634 319 -1264 1842 2007 5852 2682 -6756
571 -6756 -1763 3530 -1277 -1437 -1244 607 6048 415 -4576 -956 -86 2261 1084 -5069 884 5868
587 5868 -800 -362 663 -1681 2392 1167 -3313 -1135 -343 2381 2557 -4835 -2669 1921 -2569 -1757
603 -1757 -731 -2982 3987 4612 -2559 -827 1062 1526 2677 -2461 -1217 3700 -268 -385 1123 -2372
619 -2372 1833 3931 -2049 -1867 -1568 -1668 1926 -1634 -2642 3020 1223 596 1568 -3651 401 4916
635 4916 -1271 -2290 336 -521 975 -1823 -2724 2108 193 -227 2213 -2808 -2281 2006 -2537 -1456
651 -1456 1721 -685 2881 3676 -485 868 156 -927 1810 -2148 -1802 3528 44 -1186 1077 -2021
667 -2021 -71 754 -2663 -49 -120 -1996 2111 560 -1664 2126 46 -103 2697 -2028 -1523 3149
683 3149 490 -589 -990 -2123 1792 10 -3007 853 143 -871 1770 -2117 -1873 3192 440 385
699 385 1824 -1659 732 2262 -1028 479 -105 -147 3126 -1434 -4288 642 425 -219 -201 -3101 619
716 619 3078 -2223 -1649 806 529 3373 157 -2671 2874 1634 -1358 856 -1440 -383 2127 -1038
732 -1038 -669 -339 -2184 1450 152 -3858 535 1684 277 1968 -1728 -1272 3889 25 -2234 667
748 667 641 2356 914 -3403 849 1645 -1914 -149 -964 -1160 1846 -1434 -1690 1992 -376 340 2101
765 2101 -1047 429 1255 -1377 1393 379 -2016 1852 876 -1642 411 -951 -386 840 -2911 -1196
781 -1196 1601 -1377 -232 719 -767 2265 109 -2246 2541 1759 -954 1072 -8 366 1341 -2307
797 -2307 -352 1842 -1149 325 -70 -2106 1461 461 -2163 841 -599 -1086 1990 -651 -506 2225
813 2225 387 1363 373 -3317 567 1716 -2247 -871 -536 -402 2025 -1657 -2599 1915 704 79 -5
830 -5 -2363 1492 2408 -1608 395 1414 191 2493 236 -1772 1399 256 -305 34 -3389 -690 2223
847 2223 -1122 -904 97 -381 2549 -136 -3588 698 1582 -189 89 -1672 362 3187 -865 -1099
863 -1099 738 -897 712 -364 -3264 82 945 -462 1169 -837 -1014 2522 193 -592 846 -269
879 -269 2034 2180 -2356 -94 2008 -226 152 -1351 -1255 2145 -617 -2308 634 -743 -517 223 -2481
896 -2481 -178 1514 -921 1184 1169 -955 1062 401 -708 1002 -1198 -811 1981 -948 -1122 1214
912 1214 -375 740 433 -1880 1066 368 -1761 1284 704 -475 1558 -272 345 2164 -914 52
928 52 2055 -848 -914 -1231 -1962 1253 -322 -2587 991 954 -541 12 -1704 -486 1725 -1351 -523 1305
946 1305 -169 1930 1804 -995 955 388 -1085 824 -1533 -1745 1842 631 -367 -447 -1676 1476 1608
963 1608 -2882 -292 2067 575 696 -1482 -987 2833 438 -2083 191 -107 772 566 -2769 -567
979 -567 1005 -1587 -20 -186 -1543 1271 745 -732 727 -541 664 3026 -784 -1183 1279 298
995 298 894 -214 -2189 1458 1895 -1766 -1058 -498 326 1488 -1865 -928 2072 -607 -787 707 -970
1012 -970 1014 1782 -749 631 435 -1013 705 -630 -1280 420 -904 46 1101 -1714 -94 2049
1028 2049 -1107 -972 -233 -699 1454 124 -671 2657 949 -630 362 -943 43 1257 -1256 85
1044 85 1511 -1196 -881 -676 -992 1070 -478 -1011 1542 -473 -1197 1268 -361 73 1689 -446 430
1061 430 747 -1185 432 463 -889 440 -486 -426 1302 -1500 -1589 1809 -196 -896 201 -496 1345 964
1079 964 -1338 573 1204 -78 858 -943 -939 1774 -446 -1548 153 -683 148 667 -1610 -164 359
1096 359 -387 1185 -795 -1626 2091 809 -1010 795 240 916 1501 -1523 -1075 425 -143 634 -443
1113 -443 -1441 1622 -110 -2348 -162 -72 11 1781 -191 -406 777 -372 343 346 -1045 1675 1623 -908
1131 -908 -73 -768 -754 1020 -884 -1312 775 6 -55 -462 -1635 1171 1450 -1098 572 619 -485 868
1149 868 40 -836 768 -240 -238 311 -1030 -38 535 -1219 -126 -312 -1457 684 454 -1269 1071 638
1167 638 -52 717 -358 619 1445 -570 361 1199 -1064 -272 57 -839 738 -141 -1225 877 309 -610
1185 -610 36 -896 318 1197 -1322 185 1494 -434 267 -14 -951 606 167 -901 356 -762 -656
1202 -656 469 -1112 -633 593 -321 939 889 -1763 237 1238 -201 154 -220 460 2235 -694 -1155
1219 -1155 1001 358 380 -94 -1662 170 731 -1242 -377 -178 -231 1240 -152 -951 795 -118 148 1103
1237 1103 -1353 -492 1239 83 -43 -261 -646 1530 118 -1996 -111 382 115 507 -1222 -83 1969
1254 1969 -527 -418 693 433 1540 532 -1205 613 483 -590 573 -631 -853 640 -497 -608
1270 -608 128 -1113 280 546 -1671 -447 207 -171 945 -388 -796 1771 545 -752 499 132 515
1287 515 596 -1161 -142 534 -762 167 65 -501 841 -163 -645 952 -94 -340 775 -484 -43
1304 -43 617 -399 749 785 -698 669 116 -1474 -275 -405 -609 147 -1155 -492 975 -446 -260 560
1322 560 -262 888 62 -1132 1067 991 -292 499 213 245 820 -725 -536 809 -436 -10 65 -1117
1340 -1117 357 322 -482 552 76 -423 1131 170 -634 538 95 467 130 -1624 -20 808 -677 -662
1358 -662 -244 -267 809 -864 -1478 723 443 -62 248 -622 542 1145 -489 378 789 -139 761 158 -817
1377 -817 119 107 -284 592 -1080 -584 1153 -121 -449 -33 -490 925 29 -1798 242 1178 103 275
1395 275 -232 217 977 -786 -825 370 -530 -84 -39 -782 401 260 -709 676 83 -523 680 292 92
1414 92 621 -410 488 1054 -721 -299 867 31 74 -309 -595 393 -596 -1163 340 18 -209 212 -672
1433 -672 261 842 -749 38 1201 -65 -246 29 -131 1037 -310 -681 407 -270 -445 203 -622 30
1451 30 636 -882 41 496 -581 515 496 -89 484 -136 141 1092 -622 -533 969 36 -384 -534 -960
1470 -960 395 533 -1109 -49 358 88 443 -707 -436 1495 125 -333 554 -65 382 648 -518 96
1488 96 12 -467 620 -620 -695 566 17 -347 49 -930 -54 1055 -467 -440 659 613 806 -383 -978
1507 -978 1044 658 -585 229 -261 -277 675 -565 -689 153 78 370 -77 -806 425 315 -494 364 -179
1526 -179 -58 1461 145 -675 123 53 275 -413 -984 539 482 -574 -278 -445 -388 840 -227 -706 799
1545 799 67 -435 -171 -287 522 816 -78 675 164 -576 544 -194 -855 185 127 -325 34 -527 -15 338
1565 338 -293 47 265 -357 578 90 -652 616 700 -528 213 -65 -36 248 -491 155 175 -672 -227 -289 -1112
1586 -1112 573 767 -496 511 316 -133 485 -125 60 650 133 316 -45 -900 570 620 -808 -165
1604 -165 336 -271 -172 -988 -798 360 -123 -162 401 -199 782 694 -1090 199 666 -269 60 133 -200 135
1624 135 -159 -94 148 -358 354 700 -660 -411 176 -360 263 214 -551 906 768 -73 -139 -109 688 520 -799
1645 -799 -482 470 -474 -338 11 -529 204 98 -652 -72 -273 -330 612 -288 -120 623 -167 375 540 -338
1665 -338 283 1079 -123 -321 -418 -10 397 -636 -370 691 -48 -365 141 -388 429 879 -275 151 584
1684 584 -279 -64 -218 -48 746 -349 -304 567 -559 -912 -104 -640 -372 11 -431 436 71 -222 660 225
1704 225 -199 642 18 92 827 -341 -343 738 -46 -156 182 -200 717 -73 -934 196 -72 -375 -23 -315
1724 -315 91 961 -88 -310 493 181 160 -41 -372 160 -147 -345 407 -444 -576 437 -205 -520 127 -81
1744 -81 369 303 -853 -7 656 187 446 25 117 1169 112 -751 151 291 212 -58 -819 86 111 -442 -22
1765 -22 83 -534 593 68 -581 86 -118 -109 581 -129 -252 614 156 180 -262 -552 559 195 -1048 -253
1785 -253 253 112 214 -471 -60 980 116 -48 505 105 610 262 -541 395 115 -372 334 -26 -384 141
1805 141 -368 -408 -313 -729 35 380 -294 -66 200 130 363 -157 -240 843 76 -478 53 51 287 177 -696 1
1827 1 449 -320 -161 142 -84 405 -218 -326 679 116 -22 377 -81 58 453 -228 348 298 -490 -36 71
1848 71 -597 -301 82 -304 376 -515 -252 445 -102 -276 90 20 403 215 -557 554 508 -162 -46 116 -36
1869 -36 401 -484 -376 429 -218 -188 204 -451 114 373 -4 335 156 -316 546 114 -393 199 68 251 494
1890 494 -801 -124 585 -221 -271 -274 -189 373 -214 -605 516 356 16 230 -263 194 489 -280 -107 475 -154
1911 -154 193 84 -453 48 -2 -272 276 -253 -356 390 -15 -251 -117 -116 323 300 -587 349 591 107 79 -136
1933 -136 41 623 -496 -375 331 -36 -239 -123 -279 26 163 -206 220 58 -255 532 -98 -80 472 176
1953 176 131 601 -320 33 347 -202 91 -280 -452 198 -289 -777 453 150 -350 -1 -162 137 605 -130
1973 -130 150 377 218 279 -204 -146 500 80 -467 41 -166 -177 148 -413 -238 329 -257 54 125 -424 321
1994 321 407 -131 261 134 66 492 -135 -550 344 35 -122 -126 -683 262 318 -453 170 228 -235 285 -33 -220
2016 -220 424 332 234 166 -142 263 269 -195 -102 40 -292 425 -178 -839 -166 14 -213 -21 -252 291 716 -414
2038 -414 10 290 -112 314 264 -463 408 391 -205 24 -138 -105 161 -103 -94 175 -216 43 108 -406 153 495
2060 495 7 26 178 -81 341 -159 -279 287 -210 118 -154 -639 34 291 -500 -281 -50 -143 20 -26 -2
2081 -2 427 17 12 361 -300 88 485 -166 29 161 -251 46 -111 -151 208 259 -100 102 -634 -32 521 -342
2103 -342 -153 484 58 -20 -58 -270 550 280 -214 64 24 91 26 -707 -385 389 -213 -218 6 -100 29 10 51
2126 51 439 -37 45 513 -48 -287 502 272 36 143 -418 151 446 -499 -298 -120 -50 103 -622 -300 510
2147 510 89 -302 159 22 173 185 -401 87 273 -49 108 -49 -170 387 -237 -258 82 -141 -165 434 -149
2168 -149 -346 -1 -71 363 53 -90 714 440 -205 -131 -78 -252 385 -257 -448 456 26 -345 -322 -75 395
2189 395 -205 -435 112 -8 -415 85 129 -158 471 122 167 222 -22 163 153 -225 -89 -228 -145 295 27 -362
2211 -362 432 199 -193 -82 -132 333 256 -300 150 419 -78 104 -100 -266 360 -69 -506 -4 -23 -300 -230
2232 -230 -199 -36 77 -240 378 289 -297 161 331 25 151 -78 302 393 -199 -250 435 98 -43 -109 -293 312
2254 312 151 -686 -225 219 121 118 -99 97 356 -231 -116 290 -171 -69 26 -262 30 138 -435 126 -152
2275 -152 -238 -33 17 -141 -26 -241 195 463 -21 135 314 205 248 -25 -288 574 114 -536 -197 -7 3
2296 3 404 -307 116 2 -252 -114 -139 -88 298 152 -238 153 144 194 422 68 -81 127 -97 12 -176 -367
2318 -367 -122 133 -381 -90 -74 3 239 -250 1 185 -27 -190 137 143 224 236 -211 208 47 -93 -27 -55 -254
2341 -254 -19 -329 -63 91 -128 131 58 -231 64 146 124 51 137 -60 234 -35 -357 12 150 3 -24 -353
2363 -353 -65 121 -253 -90 25 10 261 -69 -244 242 174 21 266 -7 102 298 -31 -200 168 -50 35
2384 35 40 -317 -103 -10 87 6 -308 -271 318 -12 -240 171 147 246 126 -233 41 247 55 95 -101 -70 271 -279
2408 -279 -465 67 -136 39 -25 -287 8 264 -110 277 46 -103 268 -88 -233 34 135 -141 226 -218
2428 -218 -65 132 -113 -58 -220 28 127 -28 -320 265 230 13 -42 -234 71 359 -132 -16 154 59 53 128 -206
2451 -206 -102 -37 -154 123 -261 -225 71 -63 -146 117 -35 117 103 -216 236 320 -33 -21 -47 -10 152 -125 -193
2474 -193 78 -164 -101 43 -260 -92 88 -27 158 -4 -66 139 134 -67 63 11 298 7 -175 136 266 -37
2496 -37 -232 -34 -164 62 -114 -305 54 347 -24 48 -142 65 212 -113 -84 291 61 -179 19 -118 -33
2517 -33 -17 -6 163 -295 -217 -115 -149 -249 75 -152 282 204 -242 32 372 146 -55 -170 -82 282 -115 -289
2539 -289 70 124 82 14 -250 -184 41 -191 -37 -76 139 -27 3 -3 252 35 110 420 -205 -220 152 -77 -6 -42
2563 -42 -114 300 -27 -418 129 -105 -57 151 -128 120 353 -292 -305 117 264 159 -69 65 505 80 -195
2584 -195 77 -187 33 125 -101 -257 147 -111 -49 14 -49 120 157 -38 283 -47 -178 284 -111 -119 182 182 -154
2607 -154 -205 -308 141 162 -287 -98 7 -16 342 -177 -154 271 282 -114 78 189 18 12 -241 99 103 -170 71
2630 71 121 -286 79 91 -35 -37 -155 -9 174 -9 7 209 175 158 -143 -358 228 320 -222 -185 203 10 -54 -397
2654 -397 -296 157 90 -62 -16 -11 121 -17 -151 211 287 -96 57 64 -168 23 58 165 -22 -126 -17 335 -125
2677 -125 -55 -209 -126 212 -79 -186 0 233 -98 -153 -181 190 332 -203 -35 202 60 10 127 -142 65 119
2699 119 -171 52 -133 46 169 -185 71 29 -25 145 62 -231 21 179 -153 -128 -129 32 225 -374 -175 -88
2721 -88 -78 -41 -101 -153 -60 211 -110 -32 93 -69 -67 161 -17 510 69 142 68 -276 -99 164 35 -86 -131 -49
2745 -49 -63 -287 -58 166 64 -90 156 -195 143 84 -242 112 35 -102 -65 -116 -91 191 8 -181 -28 -77 -57
2768 -57 166 -144 -23 13 144 293 138 -14 204 252 -33 69 -15 62 191 -35 -46 203 19 -171 -258 -310 49
2791 49 160 -177 -188 118 -43 31 69 4 460 71 -238 -20 42 144 142 -165 -79 -27 -152 -22 -189 -196 51 -9
2815 -9 -278 -106 -37 251 249 -81 89 208 22 12 -70 -55 109 108 -234 142 37 -123 -94 -325 128 80 -204 -36
2839 -36 182 -59 169 42 -195 75 -123 71 32 -176 -4 147 151 -88 -155 -280 -152 101 -305 -90 51 9
2861 9 -132 -172 -207 347 -28 -77 83 -6 -47 160 -114 66 81 -56 8 -171 -155 148 25 -73 -25 -129 -81 189
2885 189 -189 37 211 1 41 11 -99 301 123 -246 -6 11 178 122 -17 70 237 -68 -109 -180 70 41 85
2908 85 -47 164 103 -32 222 -105 87 34 -63 140 -65 -125 44 128 -118 -68 -68 14 82 -151 -74 260 -11 -92
2932 -92 -3 19 247 116 -275 -101 330 -165 -62 -17 -31 154 -81 -169 -35 -128 -67 137 -129 -67 81 22 -10 -124
2956 -124 -57 150 152 -9 40 144 131 119 -259 -226 58 -64 -41 15 6 210 -194 -169 182 100 -105 140 18 -53 -66
2981 -66 -45 -231 190 -105 -107 26 39 45 -167 93 169 -208 -144 328 77 -234 -102 80 308 95 38 137 57 -100
3005 -100 -30 -61 -132 78 -94 -176 20 45 -12 -56 -217 -74 -3 -62 72 143 -194 131 31 -34 166 16 -107 200
3029 200 -116 31 49 80 -117 74 132 56 -83 -157 33 184 47 102 -18 -4 188 -173 29 132 -141 76
3051 76 -56 -147 175 29 -204 210 -88 -107 27 -91 -189 30 143 62 120 -132 144 225 -38 68 -118 30
3073 30 143 -127 -124 37 180 -29 -124 -110 118 159 -262 -80 124 -166 188 -33 -238 214 38 47 -14 150 -66
3096 -66 189 -171 -43 -58 0 27 -34 -122 -84 218 -17 -23 67 69 188 11 -81 139 82 139 207 -127 -40 84 -155 -267
3122 -267 77 -55 -70 2 -251 3 -119 -83 -25 -41 -1 219 96 -185 -144 -55 19 -11 -45 37 179 -90 -61 -401
3146 -401 87 167 -311 -56 27 -64 -60 -17 -240 133 212 181 51 105 24 33 -84 12 85 -101 84 32 -82 -246 -101
3171 -101 -89 45 30 -5 89 40 -112 30 -23 205 -99 80 69 70 -28 -71 -29 16 124 -145 -124 -36 -48 -98 49 -158
3197 -158 50 152 23 4 64 -136 155 -51 -44 81 2 180 64 -73 -107 -33 -150 -112 -67 55 85 51 -117 75
3221 75 22 -218 -40 75 -1 63 62 -57 102 -247 -21 100 8 -121 -13 2 -108 -114 -379 0 31 -6 150 87
3245 87 1 -35 -107 -40 8 -164 111 95 -1 106 -318 -133 168 42 -48 114 -273 79 64 -47 -28 95 -49 82
3269 82 9 -57 -59 -1 -96 -62 -153 -36 -44 69 -59 -47 -34 54 -3 -169 167 32 38 -39 -15 8 161 -290 191 178 59
3296 59 74 -88 -83 28 -74 -152 -53 48 -154 240 117 12 22 18 -136 76 -116 221 155 131 138 38 -128 42
3320 42 8 -229 74 -88 -160 63 -229 51 83 -190 61 -17 -126 12 93 90 123 -44 81 -105 3 -112 -87
3343 -87 -122 -4 -44 -57 90 -117 -35 53 137 27 15 66 57 80 -200 -11 71 133 4 -15 29 332 86 -26 -132
3368 -132 -137 37 -38 -17 -52 -77 -86 -40 -79 -46 43 260 -53 53 30 -143 54 -22 -89 69 -141 -27 50 -163 44
3393 44 144 -10 -65 -116 -87 -10 -159 70 56 95 90 65 -54 27 113 8 71 74 -54 26 -4 -100 57 43 -114 -28 -72
3420 -72 149 141 -34 55 59 54 -91 -136 -75 55 39 -179 -182 -96 -33 20 -60 -80 29 36 -142 -218 181 -43 -34 49 170 68
3448 68 27 -34 74 -10 147 -104 32 -82 -91 -90 -14 5 75 158 -89 114 -203 23 120 173 -7 0 -192 -43 107
3473 107 -53 67 214 87 -51 -49 48 83 -146 -14 -188 -10 -43 67 -104 157 98 85 167 38 185 125 81
3496 81 -66 -35 9 79 -143 -117 -136 -107 12 -113 -67 67 52 107 112 129 11 -200 -3 77 44 -26 80 61 152 -129
3522 -129 14 78 -16 -189 -5 -80 -20 -78 -156 96 60 -8 -58 81 240 53 0 109 119 -70 9 90 -87 -70 -96
3547 -96 -71 13 47 -225 115 -147 52 -36 -16 9 75 -54 28 127 51 24 1 -87 -65 -16 28 187 -42 -43 -1 46 16
3574 16 57 37 237 190 -8 -26 89 -118 160 -100 31 88 174 -76 -134 -50 67 -110 -31 -127 -47 83 -16 -88 -71
3599 -71 73 16 -9 270 -36 243 210 184 -86 -62 32 314 59 -152 151 145 -3 -5 -25 -68 -50 -46 16 17 94 -12 170
3626 170 -32 161 -79 43 -132 -95 33 83 -45 54 48 -109 -70 -115 -82 205 -122 -79 41 -10 -131 74 -95
3649 -95 -30 -127 91 173 -62 -20 -102 287 -58 -16 -18 -224 130 29 -33 -93 47 55 81 -164 -72 12 -74 87 -40 -20
3675 -20 67 -11 46 -26 -87 -149 40 -10 -138 -15 14 -175 106 -59 53 -125 -6 -65 101 -100 23 117 51 131
3699 131 -26 31 48 -28 58 -24 -155 119 8 103 30 24 121 38 119 -78 84 -40 -137 -148 54 85 57 -1 -62 60
3725 60 0 117 -94 3 10 62 -3 -41 52 18 -35 -42 150 167 -31 126 26 -67 -97 -49 47 -68 40 -74 176 -138
3751 -138 5 129 -19 137 -180 -102 76 128 28 -30 102 3 227 -30 -61 128 15 -67 -57 -142 15 5 -14
3774 -14 44 -182 51 112 47 -59 99 75 46 183 93 168 11 -106 84 -73 -43 -107 -241 -151 -96 -89 24 65 -39
3799 -39 16 34 -122 139 -26 34 -14 13 138 -34 123 126 18 -37 -67 17 44 -34 -26 -77 -25 -94 -7 58 34 -27 -108 -29
3827 -29 138 144 199 2 79 111 -226 -134 -29 -12 -103 -198 104 -38 118 123 -115 23 -126 -150 -13 -67 -35 97 35
3852 35 -199 -46 -12 165 165 -127 -109 -18 -99 -83 -114 -167 -73 -48 -153 163 12 66 -14 -2 -60 211 62 18 46 25
3878 25 -4 -79 -26 -163 -157 -17 -58 -101 -157 -84 85 -103 -31 43 77 -8 -3 -127 19 80 -16 -137 10 98 45 -204 -33
3905 -33 11 -36 -37 109 -91 104 -90 33 3 -84 94 -13 102 96 1 45 226 35 73 31 94 -73 191 -82 -33
3930 -33 -50 -76 -67 32 -89 -24 -147 -101 233 179 10 122 162 97 -66 41 50 67 -114 50 -1 34 -16 -8 -119 -51 -203
3957 -203 96 159 -116 -161 -78 -75 39 50 -7 89 -31 7 34 -64 -52 56 86 -29 -166 -59 -61 73 -31 53 47 -52
3983 -52 -47 -94 -47 -4 -102 62 79 -23 -77 163 -79 -78 -65 -111 17 121 -103 75 41 52 43 56 -18 -188 -13 189
4009 189 157 14 -11 79 -200 -197 71 37 115 -92 75 -50 67 -112 -9 -27 20 43 -22 22 156 39 25 126
4033 126 78 -170 89 -1 149 127 -96 4 -62 70 -5 -31 219 51 -98 -7 242 -15 51 -43 89 -79 38
4056 38 -86 87 -114 39 76 -162 -14 -35 89 29 -35 121 118 -115 -70 126 67 -6 29 -169 -13 -4 -64 -72 -28 -30
4082 -30 -31 77 36 -133 96 -12 -80 -13 307 114 -12 -14 137 64 68 50 -262 57 40 81 -93 -8 10 -66 68 -59
4108 -59 42 73 -115 99 68 -55 -4 -81 224 7 119 87 94 -101 82 77 14 -34 5 -103 -44 28 -157 -92 65
4133 65 87 87 -82 20 57 36 -101 -39 23 -76 181 -10 -3 -115 84 70 65 -21 -67 -155 25 -118 -61 -118 43 112 166
4160 166 59 121 78 -112 58 106 92 22 157 6 122 -28 -165 27 63 130 64 -78 55 -63 -12 183 181 247
4184 247 202 -54 -22 108 -119 -55 -124 133 59 130 -56 -223 55 -6 49 -95 -132 52 -152 42 94 -59 161
4207 161 -95 -19 141 -36 35 68 32 79 -148 -65 -68 -37 -48 201 -66 -182 116 -106 114 69 -16 80 135 -25 121
4232 121 172 -32 123 83 16 108 60 -230 85 -30 -101 74 -72 -158 69 -241 52 4 -230 18 -20 49 174
4255 174 -117 -58 -59 -29 28 -10 97 -100 86 -70 -130 -90 10 114 -50 -118 63 172 74 53 -76 114 -31 73
4279 73 119 63 126 41 -190 -28 41 9 -115 -120 88 -16 -158 -88 -110 107 -47 51 60 14 39 58 -70 -42 99 153
4305 153 -201 77 -60 103 25 -32 187 -184 21 -67 94 -53 -3 -221 15 -112 17 -14 138 83 -29 -89
4327 -89 -13 -24 65 27 -12 55 -135 -33 -81 -77 39 60 -40 85 -10 72 -125 -136 117 -70 -107 -2 -73 -16 -191 -47
4353 -47 27 -81 -6 -25 127 77 30 54 14 31 109 193 0 58 88 168 -62 79 30 76 61 -65 -38 -103 -14 -63 28
4380 28 161 125 -182 -50 -50 -79 51 -70 89 -91 85 -161 -7 26 -16 119 95 -140 7 21 41 -51 172 40
4404 40 -94 12 174 111 37 -134 -37 73 -234 27 -5 44 -219 172 44 6 -56 -35 -36 -103 49 -137 -77 -99 73
4429 73 266 178 60 31 81 64 76 79 -15 100 125 0 -149 77 -116 -9 -45 50 57 -114 66 -72 -131 -51 -32 231
4455 231 73 66 213 106 -5 28 -99 -23 -35 -117 -27 -39 75 10 -143 124 117 4 102 96 -72 18 79 -119 64
4480 64 -19 -2 -39 93 105 -7 19 -91 -14 57 100 -69 -80 -193 76 49 -128 75 11 -12 -46 19 -14 -39 -67 -216
4506 -216 -70 -48 -90 59 34 -147 11 -68 -148 73 44 -44 18 120 239 65 -72 1 -10 -172 159 169 -16 -272
4530 -272 7 -61 18 -77 -1 8 -80 -81 -9 139 94 170 -154 80 -24 -146 -70 40 17 -302 -39 -27 88 4 -65 -142
4556 -142 -18 69 -10 -211 -58 39 122 -119 21 -128 -3 84 61 43 -24 26 127 -67 7 45 -98 -76 117 -2
4580 -2 -159 -12 -200 31 117 75 -88 41 -14 95 104 -148 -21 126 -70 -32 -12 -112 -44 -34 -114 -25 53 -21 -1
4605 -1 70 176 -198 21 121 -135 -9 102 16 -108 -71 -26 64 98 92 126 -112 104 5 -11 -30 -8 51 -77 31
4630 31 113 -94 152 245 -4 61 -110 -4 -21 58 98 104 64 98 59 -90 24 4 -30 -63 17 30 161 -73 -7 116
4656 116 186 69 -16 -131 75 -4 33 -73 -158 58 -65 -68 -83 -8 34 -186 -89 30 59 71 198 -24 -128 42
4680 42 26 -47 -22 -26 101 -143 53 54 -99 -165 -140 38 -48 51 64 -135 129 -3 36 119 61 164 -53 -94 123 -15
4706 -15 0 32 -49 77 -91 -57 -55 -50 -186 104 -33 -5 -103 -65 39 72 -31 13 19 -182 48 111 -84 -113 -85 68
4732 68 42 -60 187 -186 38 -72 -26 53 130 7 -29 17 -4 -131 48 -52 99 -9 18 -123 -108 -35 -101 -36
4756 -36 40 81 -64 -48 -21 20 8 -132 99 -198 -210 27 55 -90 -189 66 53 36 44 47 94 46 -77 86 -146 -65
4782 -65 -143 28 -7 -22 91 -217 -36 -132 -12 36 14 170 -34 -54 -17 76 -61 -16 -108 0 138 -22 -156 -141
4806 -141 -11 -50 -114 -197 90 25 111 50 50 3 -137 101 29 -43 -51 41 -54 123 1 -59 77 -46 -76 166 -27 120
4832 120 -6 -70 207 -47 8 -78 22 49 92 14 112 55 189 -71 -49 -95 21 -48 -44 33 -75 -53 -13 113 126 -71
4858 -71 63 41 91 47 17 68 124 105 -54 75 50 75 -180 -75 38 -58 54 92 -155 -109 -38 -78 -23 4 -21 -50
4884 -50 -40 -69 16 -1 -42 3 150 -132 44 113 28 -70 37 -69 -61 73 107 -37 -16 -86 -125 111 -72 14 -56 173
4910 173 75 -110 -83 180 -80 52 -13 -49 6 -82 -20 93 43 24 130 203 -130 -45 129 97 121 56 -33 25 -15 32
4936 32 -19 -65 -56 5 -121 104 -17 -12 135 146 55 178 24 -65 134 73 -22 32 -42 -18 64 -70 -175 -34 -12 -141
4962 -141 -17 65 124 -43 -68 -30 -69 -25 -150 17 -71 5 -42 80 137 -33 -44 -66 25 -111 92 96 -52 45 -79
4987 -79 42 -2 13 80 -21 -58 -36 62 101 -223 -49 11 -16 38 -138 55 -106 99 -80 -160 209 -261 -112 -79
5011 -79 -51 -179 14 -24 58 65 131 57 12 13 -180 227 17 187 117 4 115 -31 111 -109 156 -21 97 64
5035 64 90 -32 -85 -122 28 162 23 168 50 228 80 -10 -223 88 -48 -24 35 -5 48 -81 104 -87 -4
5058 -4 19 -69 -28 -10 90 22 -77 19 69 97 55 -32 -30 -120 -92 -32 -9 -93 92 -31 44 72 -55 -60 52 29 197 91
5086 91 78 55 -49 -95 -3 -141 -246 50 -35 -8 30 -61 -14 83 -145 -7 -48 156 -9 12 66 309 5 -58 -99
5111 -99 -60 -128 -167 -15 59 66 45 -147 178 157 -206 27 128 77 33 -50 -12 55 -120 -141 23 -107 -143 48 56 -204
5137 -204 -20 -29 -84 -111 106 -23 2 -100 55 3 118 30 20 -26 -89 -54 64 57 -109 29 -35 -19 77 16 18 113 -119
5164 -119 -81 49 123 -66 5 -95 -102 -109 4 96 -83 13 -57 131 7 -151 -93 82 -184 111 176 -171 139 -80
5188 -80 -48 -180 -50 158 109 -6 67 14 -76 -49 82 61 -47 -34 -81 32 -75 96 22 80 -27 89 85 59 -24
5213 -24 157 -87 -103 93 148 -144 174 115 -28 113 -46 -22 66 -73 118 -151 31 -8 -69 1 -14 219 -28
5236 -28 -4 -94 -137 -131 16 45 -104 -43 79 39 125 59 -158 -89 60 57 31 -39 43 -55 -14 -58 62 19 -161 4 -50
5263 -50 53 -168 -1 19 35 164 144 -160 -58 163 33 94 -114 32 -61 -107 51 64 -23 173 -107 27 33 191
5287 191 80 53 146 -22 108 -3 -10 80 -28 -186 -97 98 -121 85 -254 -51 -35 -1 61 -39 -19 21 24 -65 31
5312 31 -12 -87 111 -3 100 -39 64 39 17 2 -88 -94 -39 -25 -43 -29 -43 -20 16 -106 32 -138 -160 -48 -68 -144
5338 -144 48 86 96 -20 -25 188 -50 -2 -65 49 -203 -99 4 143 54 -78 11 -128 -15 -121 -26 177 -11
5361 -11 -86 -78 -84 42 139 270 -10 -24 83 7 -202 -31 -26 -41 -90 44 -108 39 -16 -18 -2 -77 -44 -121 163 -59 -47
5388 -47 22 -2 50 -7 139 163 -45 -10 62 67 -16 149 40 52 -74 -19 123 -130 26 -137 82 -141 -190 -107 112
5413 112 194 -74 146 67 157 -117 86 -50 -222 -1 9 -10 51 -109 -70 67 -64 18 38 -59 89 26 -193 -13
5437 -13 5 15 -161 26 49 48 106 -166 108 10 2 -47 122 -118 -114 99 -15 -10 -55 150 -88 127 -57 -71 -107 -20
5463 -20 174 109 -125 40 -15 139 -107 66 67 -164 84 -27 -8 115 91 140 15 45 -63 -145 -35 -28 167 -98
5487 -98 -84 9 19 139 98 11 39 -41 -103 -11 4 99 167 -54 -3 -70 -83 -5 27 -105 129 130 -106 -153 -64 192 4
5514 4 -199 165 114 -166 -2 -9 153 77 -122 117 233 -73 -48 231 -1 -4 -1 97 -119 -38 -81 111 -4 95 -82
5539 -82 53 -40 -57 -59 -47 55 -211 25 -94 103 62 -129 50 9 4 -148 -153 -214 83 -18 26 25 7 51 -4 50 -7
5566 -7 -13 28 -12 -34 131 62 -99 254 38 149 26 -70 154 173 -82 -107 207 -99 -29 154 -150 82 -85 144
5590 144 91 -128 36 -94 76 -97 62 13 -7 -175 -151 151 -106 10 -16 13 181 -28 -157 -118 146 6
5612 6 -12 -115 223 38 -5 136 175 139 117 -19 -133 -5 25 -82 -81 93 -149 -37 -97 -44 36 47 -12 -142 -53
5637 -53 6 -161 -30 126 171 -65 -271 -67 -9 10 161 41 -47 -135 -158 -82 37 48 7 -6 -38 13 -26 67 7 -97
5663 -97 128 69 -137 51 85 83 30 137 10 23 -64 -59 -79 -81 11 83 270 -47 -83 157 -107 67 -50 95 -113
5688 -113 -184 63 -67 -3 8 26 -216 162 172 -42 46 -11 17 26 -259 27 -59 62 -8 120 57 -6 -28 4 -40 -73
5714 -73 -128 -33 53 -53 -30 -148 -20 104 -28 -97 -118 -87 62 -48 269 45 -50 50 23 -106 226 42 -127
5737 -127 117 116 -148 188 -31 -90 45 78 11 -102 63 -52 78 1 65 189 -56 -113 36 124 73 -53 58
5760 58 -132 17 -167 -52 -1 -78 31 -15 -161 -7 13 -119 -32 206 -43 1 17 -82 -21 22 35 154 -140 0
5784 0 107 53 35 147 43 -78 -55 -32 -18 -27 -55 -47 9 48 -69 -13 -32 45 13 118 -25 14 92 -130 41 38 115 -27
5812 -27 -150 100 74 12 -43 73 -190 -54 101 68 93 -1 155 -47 -6 -23 137 -73 7 61 126 -249 20 141
5836 141 59 79 5 34 76 133 94 8 37 26 88 59 -29 139 -23 42 -24 -161 47 -13 117 21 -11 -12 -38 89 -25
5863 -25 -51 96 -86 33 -133 62 -96 31 85 150 -46 39 -65 -6 -29 4 -119 76 -81 153 -77 65 -55
5886 -55 -79 248 -69 -49 -82 18 1 -15 -35 -27 0 -74 -110 -132 104 24 77 -7 69 140 -155 1 -14 19 187 -30 -141
5913 -141 -23 -20 -29 67 10 -128 123 10 32 -82 -56 -49 56 -6 264 -82 93 196 74 -97 -130 -97 -10 -136 1
5938 1 -39 -33 104 -81 38 30 -55 40 55 85 123 72 -122 158 -43 66 -56 -20 152 -5 -39 64 105 -28 -27 -69
5964 -69 15 39 -93 -90 -24 205 63 62 43 -120 -92 -120 -129 -33 -8 54 22 -78 -96 193 -30 33 142 81 -16 55 -4 179
5992 179 65 -49 60 -5 30 -51 88 66 30 -61 18 -1 -37 -138 87 -24 -119 31 -171 -72 0 1 -82 145 -97
6017 -97 205 57 -14 53 11 -27 75 84 189 145 27 3 -28 -6 155 17 -99 118 32 -153 94 -35 -9 0 39
6042 39 4 58 -82 -30 -150 266 -39 -216 272 -7 31 97 -53 -96 100 82 0 57 -56 -26 17 56 25 28 -28 111
6068 111 30 42 -119 62 -38 -311 58 -8 -64 38 -72 47 -1 200 3 -77 -26 16 -11 2 24 -7 162 -61
6092 -61 137 108 5 -49 -42 -138 3 -15 155 -240 96 189 -213 45 -17 20 18 62 -74 27 -57 101 154 -254 152
6117 152 -59 89 -23 154 84 -105 -126 -159 -225 -178 172 113 34 -109 10 -19 -54 33 -13 -96 55 -129 -127 -67 -21
6142 -21 -186 92 3 -3 -13 133 101 31 -112 76 25 13 -118 -154 104 81 -30 -105 178 193 38 9 92 -117 -213
6167 -213 -114 94 164 -228 -123 -56 -12 81 40 -100 -116 4 -72 -62 80 -29 -10 -71 -62 16 51 15 -112 63 44 40
6193 40 -19 70 -1 88 65 144 -23 -3 35 -22 -81 -49 73 87 -70 -141 -54 -96 69 -109 -19 -70 180 -192 19 145
6219 145 47 153 -84 -32 218 -38 -47 -105 -4 38 -73 -127 -1 52 -22 -88 70 212 24 158 -77 27 -32 6
6243 6 147 -45 -8 -36 -90 62 -161 -126 16 13 -2 -62 -103 176 -37 -88 -11 -108 -74 -184 -14 74 84 -32 9 104
6269 104 14 41 77 122 22 64 20 110 17 -62 -28 66 78 92 145 -107 -23 147 -4 -10 40 19 -62 2 -47 60 -162
6296 -162 -71 45 -26 -131 -88 -84 -4 15 37 38 -78 27 38 -90 145 -90 -104 27 -77 72 -40 -91 -21 10 38
6321 38 -90 41 -48 13 10 -9 39 -57 19 28 0 23 -17 23 196 -20 3 26 -9 -111 86 -35 -151 -74 -80 -25 118
6348 118 -100 -162 -138 99 15 -205 72 -1 45 -36 -48 227 -15 103 -15 -76 68 -84 125 40 53 -76 -61 -210
6372 -210 -94 16 -78 -72 8 47 69 -102 -72 90 -65 -227 3 188 18 7 -63 212 -101 18 33 164 -25
6395 -25 113 139 5 -34 -41 87 98 92 -41 -3 -102 -145 80 150 -37 -2 -96 34 -89 44 14 -62 -144 -47 164 -92
6421 -92 36 -53 34 30 -131 -38 -107 2 100 -2 35 165 -46 105 82 96 -41 50 35 6 11 -81 -34 74 43 94 103
6448 103 206 -156 72 59 52 -33 106 64 113 11 -27 1 -31 139 -137 104 116 -88 26 -141 -61 227 -70 79
6472 79 -60 71 -66 75 29 139 -180 -112 -107 -125 -12 53 78 124 -45 -40 55 -15 -50 -19 -15 -69 -79 12 131 -22 -110
6499 -110 -81 31 4 134 5 -143 -3 33 74 -138 41 -31 -163 -22 -115 -122 76 -74 43 -131 -89 40 77
6522 77 6 67 -24 -15 -75 -43 -33 -155 -78 -47 -54 112 1 18 56 -147 8 49 14 71 128 -23 38 27 -14 104 78 -42
6550 -42 101 -1 -28 91 -120 112 -169 67 -139 69 70 101 -21 -8 -106 -3 55 99 68 182 -65 160 45
6573 45 22 113 3 38 157 -30 26 25 -75 -29 160 27 115 39 -97 -107 -53 3 -44 -110 -16 -1 -249 59 -64 -251
6599 -251 -86 7 -42 -98 -9 -29 46 -75 -8 -109 -174 103 66 -122 62 -55 -109 -10 -140 209 -16 77 35 -19 -20
6624 -20 -85 10 73 -6 -43 -17 41 3 -41 -49 -62 -61 33 -116 140 -20 -125 22 -40 -124 -199 7 27 -35 -38 -24 -75 -13 -105
6653 -105 53 -117 -11 24 -167 -232 134 11 11 -16 -28 68 202 19 157 -88 -78 23 -28 75 20 -104 -157 -22
6677 -22 51 27 17 37 -112 -49 -113 -5 71 53 124 35 154 39 139 144 -6 58 -56 31 92 49 -91 103 82 73 -184
6704 -184 -30 55 51 70 -212 -32 -94 40 225 70 54 2 84 -41 3 124 -133 215 26 26 51 -159 -31 119
6728 119 72 12 -100 -200 131 75 87 37 -146 121 19 -126 57 144 -81 -125 -167 34 -91 157 -67 15 -127
6751 -127 -80 71 -48 20 -139 95 61 156 46 12 59 65 -21 -21 75 -55 -29 -57 -89 60 -46 -2 90 -228 86 -18
6777 -18 157 140 44 61 57 53 -30 -84 137 41 -126 41 -124 -8 76 -99 -109 -57 143 -23 52 -125 -213 58 -109
6802 -109 -96 -67 -138 7 0 137 -86 -41 27 137 108 10 35 75 25 4 140 126 -189 14 74 83 -14 -182 -8 -6 -28
6829 -28 -175 118 45 173 -73 88 -62 -12 0 -57 -150 -127 97 -3 -140 8 39 -48 -91 -20 131 -10 126 -106
6853 -106 33 37 -93 -197 -81 -13 -87 37 -34 235 67 3 20 -138 76 64 -50 -51 -45 77 31 -9 27 40 -141
6878 -141 -209 -93 -18 129 -1 -48 77 10 51 7 -40 -102 79 176 30 -73 -85 -69 47 34 117 -26 -128 100
6902 100 -169 106 92 -50 95 59 -78 40 94 14 78 78 -69 95 -65 155 -66 143 23 -204 -83 11 20
6925 20 46 116 113 72 31 -144 -96 -97 -190 35 -70 -37 312 21 -22 105 -28 192 64 213 -97 -39 -91 76 115
6950 115 22 -82 -15 -26 48 44 129 -155 -42 66 -142 46 33 66 58 55 -5 -174 5 -79 33 -3 99 -66 79
6975 79 -6 -7 72 0 2 -65 -29 126 -22 -33 69 70 -121 -45 204 44 225 5 52 83 125 -49 -35 92 -12 39
7001 39 94 6 -94 116 48 -94 33 -128 50 170 -152 19 68 5 30 36 63 67 -40 53 28 9 233 124 -137
7026 -137 -96 -56 -147 -115 12 49 159 -153 80 -40 -275 64 -4 60 -10 28 -36 -98 37 -123 47 42 -82 -10 -89
7051 -89 -89 -62 -28 2 -24 35 -112 73 -52 -72 20 139 -61 162 43 49 -60 -44 46 -79 28 82 30 9 63 41
7077 41 62 100 113 66 -117 -101 -96 -71 -28 -71 36 -50 19 -52 -91 -166 98 -103 -96 -26 -21 -84 -26 -259 69 -11 25 103 29
7106 29 -98 -125 -111 -74 114 113 24 -83 94 -43 100 -47 -7 11 -83 8 83 64 50 23 -112 -99 33 60 -1 -153
7132 -153 -29 -128 -93 10 112 204 64 89 108 135 95 22 -34 21 89 47 10 48 -29 28 -117 14 -16 53 41 41 94
7159 94 -4 -17 -111 -124 -75 -32 45 -58 6 -24 26 -140 -45 -83 98 81 -232 -116 16 -61 -30 -84 -72 -14 102 57 -97
7186 -97 -55 26 45 -90 -87 -120 -159 51 -75 -78 -91 144 38 -179 80 -34 33 75 84 -104 -88 32 68 -109 -18 25
7212 25 157 79 -37 110 -104 11 50 16 15 -68 -52 92 21 127 102 -30 126 -7 71 173 -52 -3 108 118
7236 118 53 24 -94 43 -20 55 43 90 65 -62 -37 35 38 96 -43 -4 -106 -68 14 -14 60 -60 58 -133 14 138
7262 138 3 79 75 -22 40 -157 94 -42 162 132 38 -17 70 -72 7 42 82 103 70 81 87 -83 79 61 85 -106
7288 -106 -77 -119 -37 -211 19 -77 30 65 24 -77 146 18 115 -32 7 32 -11 3 32 -13 36 189 -69 -26 -22 11
7314 11 2 61 -211 92 82 -51 216 13 -75 -109 -72 137 0 124 -24 123 -132 -41 -120 6 -168 -135 7 -8
7338 -8 23 -24 -41 89 53 152 -64 -109 104 -128 50 -188 -7 -26 -45 20 -57 105 7 -33 33 10 5 -122 116 159
7364 159 66 21 97 78 -13 33 147 -10 -25 -44 -167 82 117 -22 -72 47 -189 102 -79 -132 73 -33 -22 -15 -81
7389 -81 169 -62 92 85 -75 11 -22 -14 -109 13 -78 -25 -54 -40 -47 -86 163 160 111 -19 3 39 -22 29 -68 50 48 30 -121
7418 -121 113 89 202 49 114 -63 -23 53 -120 85 110 17 -106 114 12 -31 -25 -123 -62 -10 -27 -123 -124 51 -31 43
7444 43 11 15 13 146 29 -177 -41 -88 31 63 -13 41 -83 17 -71 -126 4 20 55 46 -97 175 -24 -169 114
7469 114 -19 -35 73 -169 14 110 136 37 -45 98 -110 156 -117 73 17 10 54 112 9 73 -40 -103 28 -40
7493 -40 52 46 -7 10 87 81 -141 -113 -1 -136 118 -86 -33 -39 -82 -30 -174 -70 121 -19 49 -218 -130 84 -142 7
7519 7 -9 -60 88 126 -116 -32 -102 -35 98 1 -7 -33 53 13 -128 -64 26 123 27 -39 -10 259 115 -324 77 114 -24
7546 -24 -53 -159 142 98 2 4 54 70 -118 -6 41 76 15 68 67 184 -24 -38 14 -43 -7 -44 153 83 248 -40 -9
7573 -9 -16 -42 -50 -77 -69 19 -68 -220 38 -100 34 21 5 121 44 -48 111 2 -107 -30 132 98 70 57 79 128 -34
7600 -34 132 -16 -33 147 -9 -52 -53 31 176 151 -58 -51 46 3 -120 58 96 90 46 49 93 46 161 -101 -143 108 72
7627 72 101 -50 119 -170 -76 -24 -95 78 -50 -61 -17 -57 79 78 -76 -46 -129 69 150 80 21 66 143 78 52 34 66
7654 66 118 -63 -8 -50 -67 -70 -164 -92 -31 28 -112 151 -135 160 94 -56 74 -114 -15 -48 18 -162 -113 171 132 -87
7680 -87 57 14 -78 107 -19 -7 -69 -14 -62 74 -41 4 66 139 17 -60 -19 59 28 -111 33 194 -19 -98 -37
7705 -37 107 -64 192 76 -119 -8 -30 70 94 77 -67 -35 -39 30 -33 87 -13 159 97 -13 58 63 -80 -96 -79
7730 -79 -130 58 -29 -183 122 -37 -189 -48 -41 -19 -12 -130 -77 42 -31 -12 -209 -87 -81 -79 174 44 -5 41 -82 105
7756 105 86 -145 6 -30 284 93 -46 160 80 20 23 111 134 9 21 -38 49 46 -153 57 -8 39 -105 -177 -114 -24
7782 -24 107 87 21 28 -98 -115 -64 -128 -28 -144 40 -125 6 -138 -38 -26 15 -107 -48 50 29 -97 53 60 -27
7807 -27 77 11 55 -151 40 -96 -53 22 31 22 147 115 -68 7 -75 132 -11 33 157 36 112 -120 2 44 -44
7832 -44 51 21 -116 -59 -32 6 -2 -133 107 -86 25 -12 22 41 64 36 21 157 -31 -36 93 -83 39 123 -18 -41
7858 -41 -92 -120 35 -8 -77 52 -50 -57 -84 -77 -8 94 -63 -62 -114 -96 -50 -179 -84 -17 91 139 -1 -33 -151 -72 51
7885 51 126 85 76 4 -35 -31 -169 -57 -33 168 28 -75 -84 111 107 14 14 -60 -187 -129 -44 -79 -10 -18 -37 37 92 -10 -35
7914 -35 -30 96 -119 -56 24 191 -116 -57 -32 -107 27 -65 -55 -6 -75 46 -97 -26 -92 38 -16 87 -60 -101 -127 57
7940 57 60 -59 -64 95 -26 -66 -9 -54 11 -4 -6 54 13 174 155 87 -57 163 -38 78 -15 -110 -20 -41 18 32 37 82
7968 82 -52 -22 85 -105 27 -124 -84 -19 21 -10 49 103 -66 79 -10 -86 -22 69 78 57 16 74 19 -181 90 121
7994 121 15 -20 138 -30 103 34 66 -29 -32 161 -49 -205 -39 -11 -34 101 -1 -35 -20 31 -89 -151 -121 -3
8018 -3 -123 -41 -125 45 -29 253 -35 19 94 -98 173 111 -13 -95 21 -9 27 -105 -30 -17 -76 55 50 30 94 -35
8044 -35 -29 -8 -17 -79 -31 -137 -221 -6 -90 -41 31 -135 34 -132 -2 -29 -90 28 73 -15 -14 -182 26 115 -27 92
8070 92 1 -7 -19 39 -115 50 -26 -100 57 93 2 74 59 -113 -122 -149 -96 167 -121 128 -21 -64 -115 -42 -147 139
8096 139 41 -60 5 163 178 -11 53 91 0 -17 70 34 177 -45 62 -43 38 -83 -8 9 110 -63 -64 101 -103
8121 -103 -155 -50 111 -130 171 33 32 2 -11 -62 -76 -97 197 -27 -175 91 143 68 121 -82 -112 122 -58 25
8145 25 -20 23 22 9 -75 83 9 -60 -10 72 -46 6 92 -32 12 -102 -52 101 27 -77 54 74 -116 131 57 181
8171 181 58 -130 -91 -25 105 -44 -24 5 124 -30 -171 -98 107 94 59 -46 121 136 131 100
8191A00
$$ Imaginary data points
##PAGE= N=2
##DATA TABLE= (X++(I..I)), XYDATA
0 0 0 0 0 0 0 0 0 0 0 0 0 0 0 0 8 -8 8 -8 8 -16 16 -16 24 -24 32 -33 40 -48 56 -64 72 -81 91 -105 116 -132
36 -132 149 -166 186 -206 229 -256 285 -315 348 -385 424 -468 516 -570 626 -690 761 -840 929
55 929 -1027 1139 -1270 1420 -1597 1809 -2070 2399 -2827 3410 -4253 5593 -8062 14126 -64972
70 -64972 -47306 47843 -17158 -8769 18107 31140 26318 10934 -19694 -22650 -5291 22250 -11645
83 -11645 -35422 11128 27735 2257 18310 8553 -8538 12092 8493 -16901 -21912 -16123 17836
96 17836 17840 -24334 -5221 31088 11979 1346 -3910 -10211 10099 9645 -18211 -25041 -8173 20221
110 20221 8540 -25697 3384 24675 -8741 -3852 244 -28100 -7299 17107 -3398 -8052 3432
123 3432 14377 16218 -2748 -4083 2898 -2570 13143 7959 -21415 991 19606 -5299 -8997
136 -8997 -2678 -834 7789 -3162 -3146 11058 -1151 3 6868 -16082 -13633 2902 -5597 2066
150 2066 12288 5343 7536 4240 -3373 -9432 -22675 -5891 11999 -12452 -7463 19802 7416
163 7416 1463 6256 -6555 -1586 5130 -4717 -5699 -3901 6138 16191 -193 -573 11616 -3419
177 -3419 -2065 6980 -11554 -10241 4336 -902 -2388 -6719 -4878 12171 3929 -5729 4115 -3319
191 -3319 -2980 6516 -9715 -10037 7707 4717 2132 1697 -331 8030 183 -7986 115 -8546 -7148
206 -7148 10169 -1917 -6199 11503 6475 533 1780 -5001 326 3101 -2666 2430 -1093 -436 11504
221 11504 -1843 -9771 3904 -2218 -6167 1490 -4829 -1623 5218 -771 883 -2756 -6864 5738
235 5738 665 -6311 7219 4419 -704 6677 -1641 -4327 2448 -2473 -618 157 -4331 4458 1291
250 1291 -5828 5482 58 -7799 4739 1415 -5151 2723 1188 2583 5212 -2428 1051 2026 -3585
265 -3585 3811 -954 -8549 3839 1677 -6508 1541 -1251 -2732 5003 -635 -2482 -656 -2462 6625
280 6625 3333 -8742 2714 7451 -630 2173 -2402 -2998 7613 62 -8065 -3482 -1843 4585 2051
295 2051 -9023 1620 7120 -2906 379 -1445 -4990 6498 4617 -4067 -723 14 5887 6765 -7140
310 -7140 -3428 4737 -618 509 -4727 -9706 6758 8324 -6614 -5584 103 5843 6183 -7281 -4385
325 -4385 6800 2050 1048 -1584 -7661 5271 8141 -5092 -3748 -865 119 5226 -3002 -6692 832
340 832 -10 2217 62 -9952 2148 12222 212 -2643 462 2178 7382 -1980 -8913 958 2935
355 2935 2368 971 -6659 2526 9731 -4101 -6449 -2167 -4363 1676 986 -4706 1222 3013 3975 4599
371 4599 -6184 -3347 7184 -256 -3179 -1224 -4372 3786 5240 -5410 -2343 2228 1760 2343 -5675
386 -5675 -3494 6252 -121 -2453 2869 -2104 1345 6328 -189 1055 2289 -832 2549 -2024 -5575
401 -5575 1395 -943 -1278 2535 -5191 -2783 5351 -2380 -4381 212 -764 1894 -593 -3224 3966 1697
417 1697 -847 4079 -1813 -3267 3935 -533 -567 3201 -2372 141 2634 -3001 -2210 -2748 -759 7265
433 7265 350 -3553 6479 4134 -838 314 -4391 -1940 2566 -2030 -359 1065 -302 4909 -416
448 -416 -6838 -979 -2696 -4024 2114 -2981 -3226 5711 3593 2 -1257 -1457 5746 2340 -6652 323
464 323 3413 705 2551 -3153 -2644 6270 1515 -3355 -68 -301 1985 47 -5650 36 1816 -1458
480 -1458 4408 1979 -3263 2918 1953 -2376 -1223 -3426 731 3414 -3618 -2526 350 -936 3212
495 3212 -1571 -6902 2896 2895 -4811 -829 2407 3727 3939 -1673 394 3072 -2401 122 1604 -1389
511 -1389 4579 2898 -3443 1308 378 -4300 -1251 -2070 -1023 1502 -1468 2141 3773 -2404 1019 1466
527 1466 -5605 -1667 1248 -1321 1566 548 1093 3899 -2306 -3633 -145 -2663 636 1232 -5157 1630
543 1630 5711 -2369 -1573 1689 2529 4333 -45 -1027 2801 -682 -579 689 -4096 1076 5351 -1146
559 -1146 -410 -97 -3080 373 -1542 -5328 -955 809 2364 2602 -4529 -138 7018 -186 -3247 -950
575 -950 -796 3009 -44 -4982 1165 3528 1833 752 -5190 -2095 4442 -1743 -3007 2449 680 2799
591 2799 2908 -2689 -1373 1568 1593 2482 -2562 -1506 4907 369 -2257 -216 -3060 -160 1944 -5237
607 -5237 -3388 2566 1726 1990 -1427 -2461 2985 -363 -2967 1026 -483 1534 5213 -1109 -2337 1059
623 1059 107 1937 -353 -3328 1787 1044 -2682 -385 -2645 -780 5700 452 -2273 2368 1260 192
639 192 -825 -2945 1251 1455 -1188 2060 -364 -1840 2982 -984 -3510 258 -2074 -1391 1543 -2071
655 -2071 -643 2041 466 2310 256 -1955 2659 860 -2520 1148 175 478 2955 -885 -571 866
671 866 -2466 -114 474 -3165 750 1009 -1351 1946 -630 -2149 3191 826 -1688 308 -177 2044
687 2044 1924 -2593 81 1258 -2148 395 -1216 -2989 2655 784 -2266 639 -1717 -1018 2285 -574
703 -574 10 1638 214 2666 196 -3920 1558 2783 -800 49 -1590 -191 2619 -2581 -3393 1183
719 1183 35 953 -154 -3289 1744 2795 -1799 471 546 -386 2616 233 -1062 1056 -437 781
735 781 1112 -3759 -750 2326 -1186 -152 -1324 -2300 3050 708 -3275 932 1587 781 771 -2782 304
752 304 3604 -648 -21 1033 -855 1057 -886 -2904 1036 -25 -1521 1245 -825 -752 1861 -691
768 -691 466 1288 -1857 1254 2085 -1451 792 1317 -246 1418 -1215 -1386 2077 -985 -1719 393 -1586
785 -1586 12 260 -2965 1137 2191 -2115 207 936 -242 1518 -771 -521 2682 -376 -939 881
801 881 -1405 1003 1417 -1906 417 578 -1717 736 -584 -2294 1290 430 16 1267 -1401 1025
817 1025 3728 -1210 -1060 1016 -564 805 -1171 -2844 1845 1288 -1499 -427 -1706 125 2023 -2457
833 -2457 -1777 1565 -455 924 683 -1669 1752 2282 26 930 -822 -450 2883 -917 -2391 343
849 343 -444 1229 732 -2890 765 2696 -1030 -1253 -1652 -761 2422 -563 -1640 2231 781 803 795 -2404
867 -2404 -447 1675 -1232 -449 -571 -1943 1665 123 -2409 309 -177 343 1736 -2017 -615 3239
883 3239 537 -157 224 -460 2224 983 -2062 1301 1105 -615 833 -1751 -1404 1249 -1729 -1104 594
900 594 -1635 326 1394 -691 885 448 -1247 1490 -284 -1761 1391 90 -223 756 -1600 209
916 209 1366 -1665 200 1019 -1630 65 -223 -1143 1621 -56 -412 3189 654 -631 968 -86
932 -86 1037 579 -2787 168 1632 -1480 -231 -372 -708 2021 -1198 -2468 435 -968 -550 909 -1448
949 -1448 509 2084 -368 907 257 -1546 1589 769 -1726 -428 -753 905 2112 -2464 -1281 2411
965 2411 -83 -986 -780 -941 2853 1417 -2199 468 1264 445 748 -1609 -224 2385 -655 -780 442
982 442 -1879 -197 470 -1946 -490 -291 -401 1907 -840 -2145 1546 745 9 525 -1110 1451 2650
999 2650 -1621 -1210 758 497 1272 -944 -1488 2270 -26 -1838 404 -673 -244 1346 -1276 -106
1015 -106 1306 -331 972 827 -1136 490 -361 -942 849 -1257 -532 2363 -582 -1846 156 -847
1031 -847 219 -57 -1615 1045 984 -1619 415 471 364 1993 -256 -456 1822 -681 -1131 681 58
1048 58 1071 272 -1518 670 -252 -2412 678 30 -695 1507 -256 -631 924 -841 202 1254 -507
1065 -507 661 646 -423 1141 -568 -2050 1721 411 -1707 345 -360 -27 542 -1833 -567 1473
1081 1473 -351 350 176 -586 2135 719 -1630 616 267 -149 799 -885 -450 1190 -545 -58 -305
1098 -305 -2149 893 798 -1906 212 791 163 1016 -870 -895 1560 678 490 417 -941 1132 584 -2494
1116 -2494 -214 547 -419 838 -708 -1685 342 -315 -302 604 -605 992 1895 -1241 -656 525 -224
1133 -224 1470 689 -1185 884 293 -1084 -510 -1512 244 1533 -1547 -659 1029 -660 433 837
1149 837 -818 606 801 -537 718 -159 -136 1286 -681 -426 627 -988 397 769 -1674 -155 308
1166 308 -1345 -349 -356 -341 1175 -172 -104 1580 -313 -338 1013 -418 512 596 -1169 646 790 -1108 -123
1185 -123 -305 -42 934 -1105 -902 1571 -330 -793 556 -378 537 1243 -331 550 188 -694 652 -588
1203 -588 -1182 590 -249 -426 394 -1837 -519 1356 -725 -469 106 18 1380 -481 -1764 1162 1456
1220 1456 217 586 -300 438 1713 -926 -732 212 -381 365 -109 -1304 774 599 -453 696 -941
1237 -941 -938 1128 108 -821 -13 -321 1044 490 -1840 15 1224 -93 -36 -1394 -852 1271 -562 -1635
1255 -1635 470 141 569 443 -1105 555 1532 -169 806 487 -502 1195 479 -570 257 -123 21 988
1273 988 -1095 -779 534 -281 -25 -670 -1549 736 470 -1414 298 508 135 691 -808 -215 1134 -369
1291 -369 -353 400 -797 349 73 -1118 683 364 -620 521 -92 -692 518 -403 20 824 -437 668
1309 668 1370 -335 554 1049 -160 341 -997 -1139 614 -750 -1225 464 -176 -96 185 -1237 271 1021
1327 1021 -1058 -256 511 -125 603 -186 -471 1300 135 -362 673 -687 -91 710 -661 -182 -50 -683
1345 -683 480 148 -952 793 829 304 521 -900 43 1683 -352 -863 511 137 608 -346 -1338 566
1363 566 408 -1126 -576 -665 -371 742 -733 -565 884 -399 237 838 -553 463 992 124 385 -607
1381 -607 -746 1163 207 -772 306 67 458 308 -1390 -199 1038 -499 -644 -293 47 1145 -41
1398 -41 -441 1241 349 -469 133 -527 -134 349 -824 -80 269 -921 186 355 -450 92 -469 -285 958
1417 958 -487 -489 1366 367 -71 197 121 772 409 -800 513 352 -703 -105 -584 -365 617 -884 -493
1436 -493 881 -277 -603 277 33 851 230 -746 791 521 -460 330 -51 -232 462 -661 -546 447 -661
1455 -661 -69 727 -522 -46 -367 -417 847 129 -539 1228 691 -614 -98 -310 474 725 -877 -401 429
1474 429 -352 8 -788 -667 1303 -15 -953 188 15 -191 591 -115 22 594 -17 402 110 -659 719
1493 719 672 -753 19 -475 -398 856 -395 -1084 281 178 89 -311 -1017 971 972 -528 108 337 71 685
1513 685 -341 -730 629 336 11 -57 -755 24 568 -733 -70 65 -547 752 351 -1013 259 745
1531 745 312 213 -299 507 1036 -593 -495 6 -399 777 122 -1140 303 229 -1188 -488 -406 51 661 -282
1551 -282 -101 363 -499 485 781 -465 448 715 -459 113 -183 -115 495 -274 4 208 -487 69 378 -804
1571 -804 325 794 -708 -188 350 -46 506 74 48 501 -496 -231 250 -897 59 278 -1012 -358 -12
1590 -12 -516 70 213 -178 604 159 -166 -3 -603 353 1201 -404 8 1045 239 -154 -335 -354 453 -222
1610 -222 -785 14 -387 -96 296 -834 -227 1210 -69 -31 445 -389 27 -96 -703 225 -242 161 714
1629 714 -506 -683 312 -194 -60 -17 -774 177 461 -599 -335 270 707 977 -49 -102 1125 38 -530
1648 -530 381 -288 89 301 -644 -370 13 -455 532 -314 -732 139 -444 -496 438 -262 -38 924 -55 -513
1668 -513 234 275 768 -93 -558 705 -121 -1033 -210 -45 -77 747 -239 -155 589 -135 -247 151 96 673 141
1689 141 -365 654 311 -599 375 -188 -245 35 -439 -356 -116 -683 -58 225 -711 129 277 -287 634 -27
1709 -27 -525 711 198 -240 311 -64 614 162 -686 304 443 -324 70 -231 -426 493 -264 -645 684 230
1729 230 164 415 -153 321 330 -351 164 68 -499 273 119 -780 -86 -7 -245 116 -928 -385 604 -110 -225
1750 -225 -81 -295 852 236 -799 660 1011 353 229 -277 157 653 -416 -249 384 -270 115 249 -740
1769 -740 -30 111 -301 403 -215 -493 534 139 8 10 -295 664 695 -662 -231 435 -228 -158 -687 -636 450
1790 450 -70 -638 364 108 285 381 -390 -88 574 21 209 383 -117 398 412 -39 304 -148 -131 471 -648
1811 -648 -787 164 -176 3 -118 -536 574 365 -666 -13 509 -110 266 -327 -48 691 -382 -429 198
1830 198 -263 9 -62 -559 407 134 -452 110 -95 -341 380 -29 173 650 -132 238 484 -284 -170 445
1850 445 -71 57 -210 -483 533 -65 -780 138 -104 -140 -87 -780 59 575 -111 -147 261 150 331 -243 -243
1871 -243 420 90 -313 210 -316 -231 366 -286 -202 196 -323 240 251 -531 106 241 47 394 -271 -103 853
1892 853 139 -411 42 -93 351 -31 -718 58 150 -396 -148 -323 -264 537 -225 -261 608 88 94 270 -323 206
1914 206 540 48 258 -138 -386 513 24 -364 116 18 -92 11 -714 -318 478 -154 -121 -92 132 580 160
1935 160 -378 450 560 -232 239 -284 -196 271 -247 -43 -13 -369 34 -52 -474 251 284 -359 277 -21 -301
1956 -301 597 178 -61 308 -91 312 66 -811 178 468 -511 -152 -376 -305 348 -220 -438 284 -45 138
1976 138 131 -250 474 402 -280 243 447 -185 216 -42 -299 135 -379 -229 -192 -775 -152 554 -454 -230 44
1997 44 -314 339 164 -363 406 492 -68 -14 -415 228 522 -418 -60 266 -492 -82 69 -399 241 204 2
2018 2 -128 -138 126 637 -125 169 430 68 273 213 -663 19 267 -282 -136 -289 -198 241 -364 -486 241 -269
2040 -269 7 34 -373 104 457 -188 -161 42 116 227 15 -202 323 -175 -147 369 -440 -64 475 -74 -92 -1
2062 -1 -108 369 33 -260 426 99 -45 239 -284 73 520 -171 -315 121 105 -108 -65 -130 71 -370 -516 99
2084 99 -149 -89 661 -212 -227 418 -18 89 164 74 140 192 -102 -138 -361 -36 696 171 -237 340 -116 -232 9
2107 9 -283 343 384 -130 69 240 12 246 -285 -278 612 -163 -621 19 -49 -179 -29 -498 -99 94 -433 324
2129 324 -240 -283 379 268 -220 75 25 268 738 24 34 221 298 170 -504 -490 554 -58 -664 -24 -52 139
2151 139 -23 -414 -136 332 -26 29 -45 -278 206 -54 -204 277 14 -224 435 100 -677 -80 -154 -78 -52 -290
2173 -290 408 466 -347 -133 465 51 425 44 -250 445 98 -314 -67 -63 456 105 -547 -153 -15 -458 -19
2194 -19 -81 -226 163 102 -14 230 -57 -18 335 -109 -276 50 -100 256 -227 -554 122 330 -313 -259 138 228
2216 228 299 -378 -107 270 -79 -84 299 -22 499 187 -253 200 317 -152 49 -203 -251 -41 -351 -79 29
2237 29 -521 -158 231 -201 -129 134 -60 196 -208 -245 322 90 -72 3 40 393 433 -530 -195 204 -128 -182
2259 -182 -164 -69 377 57 -242 253 156 -5 351 -57 15 -110 -154 46 -11 -108 133 249 -198 -84 -404 -177
2281 -177 101 -291 -412 219 -24 -44 92 -238 518 160 -381 108 317 47 62 -302 -43 251 -189 133 77
2302 77 -137 -78 155 -316 -57 157 -84 195 93 -178 166 217 63 236 -195 79 287 -254 -262 142 -71 53
2324 53 -157 -165 247 -148 -305 95 4 -6 118 -103 46 305 -121 22 201 82 -6 -126 -302 -7 86 -207
2346 -207 347 -8 -397 233 -124 -168 -53 -253 158 173 -159 151 276 149 114 -101 -18 324 -96 -330 -18
2367 -18 -26 -30 -135 -252 -27 124 -194 24 -13 -128 203 -78 -50 23 118 103 133 -397 -37 312 -33 -20 -50 -385
2391 -385 27 -118 -452 -29 125 131 -7 -429 -2 330 -70 -290 45 130 215 -8 -107 207 207 -55 -155 -172 -175
2414 -175 85 -132 -231 -85 -172 136 250 -151 130 235 301 41 -40 190 393 107 -79 -42 -64 32 6 -549 -72
2437 -72 238 -158 -184 -36 -241 229 41 -45 268 -26 306 321 -210 -115 240 31 -5 -168 -194 -42 -206 -372
2459 -372 -27 -9 15 121 -368 -35 299 -14 -93 271 30 115 189 -122 222 196 88 -28 -104 -6 187 -146 -97
2482 -97 -10 -122 -139 -2 -247 11 28 -35 282 -99 -60 326 179 -143 32 64 173 107 -328 -92 123 -179 -327
2505 -327 -188 4 367 -207 -192 317 282 11 -1 45 128 316 153 58 -41 -263 104 159 -184 158 -8 -228 -58
2528 -58 -363 -340 369 89 -83 -186 9 223 -55 -396 260 188 -163 3 -148 71 321 -298 -113 235 -1
2549 -1 29 -152 -418 37 121 -10 388 -81 -125 166 226 -38 17 197 148 180 -304 93 36 -99 100 -294 -87
2572 -87 211 -196 -422 -111 179 -143 -63 240 109 9 -216 12 215 81 240 69 -16 205 -127 -276 -40
2593 -40 16 81 312 131 65 -82 -232 283 197 -329 249 71 -198 -61 21 38 188 -93 -327 27 -47 -204 -259
2616 -259 -300 58 56 -439 -57 276 -112 104 -75 61 196 -22 61 211 -83 259 150 -331 41 -17 -146 154
2638 154 70 -270 14 -146 -2 2 -274 323 522 -223 7 217 -22 -83 -187 -133 96 -81 -57 -162 -173 152
2660 152 170 -187 70 220 107 19 -69 -124 108 151 -23 118 -26 79 303 -81 -166 26 -25 -16 -75 -302 -62
2683 -62 99 -132 -77 -66 258 178 -142 -94 179 90 -21 52 -23 -7 194 -140 -66 -71 -122 85 -198 -219 76 -151 -174
2708 -174 10 -177 68 189 98 69 62 108 219 46 -85 162 80 -207 -22 -115 111 71 -79 -140 -6 -49 -3 174
2732 174 -52 203 29 -152 70 -28 48 203 -48 -96 136 23 134 -37 -289 20 76 -157 -25 96 82 -110
2754 -110 -109 -208 347 143 -223 178 -28 141 -48 -196 9 -255 -44 116 -40 -191 220 -94 -93 -45 -141 3
2776 3 142 -102 -63 81 56 243 -52 -108 262 40 -254 68 -112 130 102 -298 -120 100 -90 -46 -314 -130
2798 -130 182 -79 -27 23 234 51 135 -9 27 130 -70 47 11 -300 138 14 -78 -56 -30 -2 53 -174 -174 272
2822 272 59 -245 59 -34 218 222 -48 -17 62 -62 -40 -148 -53 84 -211 -240 26 -119 -142 -12 -335 -90 14
2845 14 -48 172 -17 -29 101 186 -109 36 24 -27 162 -208 -115 103 -96 -157 -150 0 211 -96 -451 221 1
2868 1 -48 89 -242 159 145 -8 45 -74 -9 21 120 -11 -44 22 52 51 -157 -183 49 164 8 66 92 173 292 -306
2894 -306 -100 140 113 4 -78 7 291 181 -145 -69 227 10 63 -171 4 -38 -259 -130 -22 -82 184 101 28
2917 28 32 -65 122 214 -234 -111 254 -4 -36 -205 -110 -24 -13 -107 128 201 31 162 38 -69 188 -25 63 -67
2941 -67 25 150 -47 -184 -66 5 -93 96 -66 -86 -11 -116 -70 101 -12 134 171 -249 -45 36 104 99 -130 -39
2965 -39 333 112 -194 -106 -18 55 -204 -268 -119 25 -25 75 2 38 97 69 31 2 70 16 119 45 -72 70 -17
2990 -17 -37 31 -88 128 -27 -282 -32 -20 119 250 -148 -96 -40 53 125 43 50 82 -52 -209 140 134 -81 -64 -71 69
3016 69 30 -8 -47 107 57 288 106 -117 108 134 94 74 117 48 123 -5 -166 19 26 70 7 -198 177 250 -140
3041 -140 -176 -151 -187 83 61 -236 232 69 -84 51 -138 139 76 99 32 159 -41 34 179 -119 8 45 -90
3064 -90 28 -299 -3 147 -16 38 78 132 21 -23 33 201 301 14 -56 -137 23 108 -360 -293 85 -181 -46
3087 -46 -135 -58 -16 11 -107 104 128 178 81 -108 46 30 -57 112 -3 -163 18 165 -151 -512 -38 -18 84 -150
3111 -150 -344 89 117 36 23 -8 124 295 -39 40 60 -242 140 -170 -163 45 34 61 117 -92 -225 165 -42 -367
3135 -367 -59 -80 66 30 -68 218 37 -127 -119 -17 9 164 80 -233 15 -178 -202 -172 -72 155 39 -53 -8 -112
3159 -112 88 103 85 -66 -36 -34 154 118 -126 -100 131 -84 185 -313 -119 205 -204 -178 163 -105 130 60 -102
3182 -102 85 209 -47 -91 119 -37 106 89 -165 143 -4 -94 59 -7 -65 187 -48 26 92 -54 26 50 -4
3205 -4 155 85 163 208 -106 88 104 -93 -287 95 304 -12 -10 -34 78 191 -133 -125 125 149 111 38 110 65 -54
3230 -54 -52 148 0 -108 141 13 116 125 -33 -41 -178 -83 186 60 21 -11 -160 -61 188 47 -12 -64 6 152 92
3255 92 -165 -24 -71 -117 -60 6 -3 -27 -182 -38 182 -194 -47 101 78 63 40 -115 4 89 109 -9 63 -134 34
3280 34 -89 -172 177 -113 -32 -29 -66 -51 -99 -88 185 -78 -128 59 -142 124 -70 -80 205 18 -186 -55 -1 129
3304 129 11 -84 -110 -127 -149 96 81 60 100 65 50 -47 180 87 120 48 -81 204 186 80 13 -34 -22 101 -57 -76
3330 -76 75 -70 -129 61 9 215 122 77 -95 104 -3 -120 6 -36 83 -17 68 -13 42 182 115 -210 -109
3353 -109 -87 -32 3 -88 -336 34 -51 -108 218 0 123 6 -78 46 170 84 -10 1 62 -41 -151 -99 48 7
3377 7 52 -141 -7 -53 -48 135 11 -14 22 133 163 8 -67 17 196 201 -13 -48 25 -117 -22 -25 148 109 130 -10 59
3404 59 71 -12 199 -17 -51 84 106 51 -110 -38 102 -62 -305 -69 -60 -30 -86 55 -26 168 35 -23 -134 -65 88
3429 88 30 -108 39 78 -69 -115 -44 82 95 -188 -105 -82 12 133 -233 118 -93 -20 18 -58 122 -58 -130 83
3453 83 32 60 -73 -41 156 -49 -85 25 -50 -90 -3 -88 148 114 -104 18 60 24 118 -56 174 1 -9 -31 143
3478 143 135 113 -130 -134 -72 33 -18 -10 10 -140 79 -74 87 71 68 114 -27 -187 -109 111 31 96 -158 -99 109 -127
3504 -127 -168 -76 -16 64 -71 -200 129 206 -156 41 -116 115 35 -8 12 100 -39 -41 -42 -187 127 65 62 63 -156 -120
3530 -120 58 -33 -202 -18 -39 -1 19 -75 94 223 25 24 133 -95 -153 81 -16 58 205 -126 -122 32 -105 105
3554 105 81 -104 94 107 -27 130 19 53 43 87 3 60 -48 -42 19 210 -72 -243 69 -39 -239 -111 -72 6
3578 6 -83 -125 -40 -37 -49 -50 147 -13 -116 27 55 40 62 132 105 -119 -119 -31 52 -163 2 57 -23 -1 12 -27 -42 81
3606 81 -47 52 38 -14 -10 -34 128 141 82 -79 -147 -17 -20 -161 -81 -18 88 -51 -155 26 28 -42 -87 34 -132 -33
3632 -33 45 83 -101 -207 66 -32 129 64 -57 43 -11 -17 -9 6 -96 -33 28 97 108 -62 2 5 98 154 -12 21 7
3659 7 56 201 13 -211 -28 -18 30 -98 -98 27 66 -155 116 -106 -101 156 -64 81 172 140 -47 148 -156 131
3683 131 -109 -169 54 -54 -6 -1 -28 -173 -24 201 -40 79 52 3 69 90 201 85 -108 48 -103 -125 67
3706 67 23 -76 9 -79 13 7 -66 -106 55 -72 -52 -65 87 83 -1 -141 37 128 18 -54 54 53 47 -69 -119 144 32
3733 32 131 -54 -56 13 57 7 149 -48 61 78 -70 -39 -113 -20 -36 114 -37 -110 90 -100 10 -29 61 259 108
3758 108 -123 112 -22 -5 -82 60 -3 -19 -198 -83 -91 -4 69 13 -54 -147 6 92 7 -63 79 -128 104 35 -143
3783 -143 5 -30 82 173 -44 111 -48 38 -200 -271 34 131 -67 -33 -45 -50 -36 -158 -105 -61 60 -39 34 1 147
3808 147 -36 80 206 7 -36 83 118 151 57 164 106 76 -182 -112 30 -142 -183 -11 -239 157 -113 64 143
3831 143 197 -32 150 -99 19 -95 -66 77 -18 -8 90 -146 -88 -14 -7 -11 -94 -225 -3 12 100 -262 50 -25 181
3856 181 52 -38 218 131 -18 -47 -11 -130 -61 -62 3 -168 68 -12 34 -72 -79 84 -98 -13 72 -80 91 148 19
3881 19 55 107 -101 81 -109 24 159 19 74 11 53 73 21 40 179 17 -58 7 207 134 -107 -3 10 0 -36
3906 -36 105 -42 -78 117 -169 29 26 -139 -15 -137 -62 49 -19 157 140 115 -103 -25 118 -58 65 72 138 -59
3930 -59 -129 -159 64 -4 -125 -127 123 -27 30 14 -80 46 193 -133 -21 -82 121 -192 -21 -37 -80 78 -181 -164
3954 -164 -7 -193 -74 0 -67 -57 -229 120 25 -68 -222 39 -61 104 52 -25 24 22 -2 -19 53 -143 -173 47 -20
3979 -20 77 93 -78 -57 -27 -162 32 128 18 63 -177 8 102 96 -97 4 -112 -27 58 80 -175 75 -132 -104 -112
4004 -112 43 -15 23 -6 128 -158 94 -70 35 -83 118 47 33 93 16 -6 -128 -83 188 49 -74 25 -89
4027 -89 -16 80 -5 131 199 115 37 8 63 -6 -156 -45 179 -42 -30 -80 -60 -98 -32 104 -8 92 40 -31 -24 13 -3
4054 -3 13 -8 -39 10 -19 -6 -97 -39 73 -46 85 -3 -97 -64 38 -92 173 118 16 58 14 -178 93 -10 25 75
4080 75 85 15 131 -27 131 -28 19 -229 -45 -50 143 -46 -151 53 -94 33 151 -76 -173 94 -60 96
4102 96 39 -107 -9 58 -59 69 168 52 -51 -75 -160 28 14 -13 -115 25 11 42 64 -108 30 79 -48 11 35
4127 35 89 19 211 64 -23 -66 15 -183 58 62 1 100 43 -166 154 55 83 -43 -372 86 -68 60 -127 164
4151 164 -26 40 53 62 29 -44 -7 235 -228 3 29 -152 -111 38 103 24 -23 -99 67 -82 -122 -8 150 -32 -75
4176 -75 -106 -97 79 30 -83 49 -208 -54 40 -107 -37 34 52 151 -151 -89 123 -142 -94 17 79 -166 53 55 168
4201 168 89 -168 -45 -102 25 56 103 -111 222 -100 55 -115 -25 118 -21 104 72 -108 148 -64 -125 -145 127
4224 127 12 106 -13 -25 14 281 -65 45 -65 -81 -8 101 102 -31 4 -6 -145 -64 14 -9 -10 -103 -37 161 -35
4249 -35 -129 -54 13 64 -64 62 -46 101 139 -86 -11 36 -76 -4 64 30 23 43 90 -114 109 13 -59 -171 154 101
4275 101 -76 137 60 38 16 -247 -88 61 -72 -53 76 132 -13 25 60 -185 -50 52 50 -28 -93 -109 68 -1
4299 -1 38 65 131 -58 170 -10 35 -85 57 72 2 -71 13 52 42 -64 -196 4 -144 -103 28 -98 157 -13
4323 -13 62 -96 145 72 -107 180 33 19 1 -39 -68 -128 -60 73 -188 30 58 -6 -85 7 -31 49 -1 -1 -34 -30 8
4350 8 -152 -37 115 82 -85 -46 17 22 24 -79 -78 69 55 139 20 -335 -24 123 145 -131 0 -27 63 79 -31 -68
4376 -68 -14 3 39 75 1 -140 -69 -148 -157 25 -83 -123 -122 -48 -58 -58 131 46 -126 -199 22 259 -76 50 -47 -55 -8 -141
4404 -141 -167 -56 -19 -90 -34 53 -32 -153 -88 44 104 58 -161 77 -256 35 -156 31 -44 -189 22 -121 -73 18
4428 18 20 -20 18 157 -99 -64 79 -91 20 -67 -58 -17 -80 -138 122 29 28 -103 124 15 105 -32 -50 -84 55 60 -61
4455 -61 32 -36 -70 -29 -20 -71 50 136 55 -95 -103 -77 -32 -39 15 66 -24 62 20 38 1 -85 7 38 44 -71 -36 127 33 27 64
4486 64 78 -13 -27 -97 -29 -93 50 -48 -65 -59 -157 49 41 -111 0 137 22 53 -34 26 40 135 143 38 57 -65 -39 152
4514 152 -23 -182 -77 -59 150 -65 -7 103 -62 -46 116 80 -5 -19 -17 -60 -17 -26 -141 151 9 -91 -76 -28 -58
4539 -58 -68 -5 -26 -109 44 38 -78 -57 19 90 116 -4 48 116 13 -16 151 -88 -59 87 -49 30 -76 109 -26
4564 -26 -63 -56 -41 13 85 -147 -64 -54 30 -297 -7 30 -34 -113 59 20 45 31 2 -39 24 14 -87 -46 -86 -6 178 97
4592 97 65 42 6 123 77 -72 19 78 13 -73 5 -57 -112 23 -191 -62 176 -24 -119 100 83 -132 -94 -50 -142 18
4618 18 -3 -18 -16 -19 -160 -30 34 38 44 107 79 -119 67 73 -34 -1 16 47 -17 23 26 33 78 -11 -85 -116 -34 -73 -52 -29 160
4649 160 22 102 -113 129 -114 -80 34 -11 -158 169 86 -34 72 133 -133 33 60 -6 36 -110 83 -194 -72
4672 -72 -164 -74 55 26 54 48 107 63 -29 52 146 20 184 22 -82 78 30 -55 55 88 65 -98 -95 15 -27 83
4698 83 84 31 -145 -15 -97 56 -147 -52 30 127 21 102 38 -66 146 61 -55 156 37 -40 -50 -12 2 -23 17 -139
4724 -139 90 -165 -52 -87 252 -47 21 -44 51 75 -16 -193 -2 33 -26 -16 -136 -43 -32 -77 -174 -120 148 -5 115
4749 115 -24 -9 98 -105 89 13 43 86 28 127 7 51 -73 113 -105 -73 183 -138 69 84 126 -76 236
4772 236 -22 89 -43 176 54 75 25 122 73 -73 5 -158 39 -210 -161 -83 -2 39 -86 -25 -208 -123 -26 -72
4796 -72 25 6 -143 130 125 23 124 90 97 -224 90 -132 104 -18 -110 33 -5 -82 16 -83 -129 -307 31 -38 -5
4821 -5 138 -43 -21 -154 22 45 -44 107 -65 42 -10 -115 0 25 26 105 116 154 27 94 19 7 87 -126 201
4846 201 -32 156 -213 -100 63 148 -126 11 -20 -45 -17 -20 97 -66 -178 -67 167 147 -15 -86 103 27 132
4869 132 70 -74 68 125 -5 -98 14 89 103 55 219 104 99 -115 70 -48 -48 7 -44 -58 85 23 -136 155 -115
4894 -115 -4 5 27 -104 -62 -13 74 57 -67 -64 107 -53 -130 29 28 50 20 79 -43 74 124 184 -54 57 27 38
4920 38 -103 -156 -150 151 123 103 80 5 -62 24 -33 100 -90 47 49 -34 88 69 194 81 -53 -18 100 -175 -16
4945 -16 -2 109 58 48 66 -50 67 94 37 -220 111 -138 -63 -13 -2 -78 -56 99 67 -25 -124 -166 8 -38 21 33
4971 33 -17 -41 31 214 -52 -2 78 -53 -199 -38 158 -68 -69 -296 -46 -181 -87 219 79 -91 -144 -123 -4 43
4995 43 -37 -50 -42 23 -6 36 -76 -24 -66 -15 -5 -34 125 113 97 76 -102 -127 39 -128 131 -84 202 79 -128 50
5021 50 119 -244 36 -172 33 -59 101 -21 15 -111 108 36 -20 67 -13 29 17 133 245 148 -10 -37 52 -66
5045 -66 94 3 -109 -77 18 -55 47 -127 41 -72 19 7 105 -110 -151 81 -62 -6 -140 -17 182 -28 65 98
5069 98 -44 78 -150 -171 68 60 33 -104 42 -24 27 -56 -36 -65 -83 138 106 -184 72 80 -48 -40 132 -125 65
5094 65 63 56 61 69 0 -109 105 -149 58 -55 9 -45 62 -78 -116 35 -75 -18 50 -6 -43 -118 -60 0 11 -113 -98
5121 -98 -43 -41 -61 10 -94 -26 40 -36 34 -33 72 9 73 29 105 -18 -21 -28 51 -40 -110 -242 -123 -72 -78 -72 -78 -197 126 320
5151 320 -69 32 32 172 6 -15 88 251 -13 49 39 64 0 -41 -74 8 205 29 -45 -76 160 -32 54 253
5175 253 262 25 36 90 23 -43 155 36 24 59 41 -2 9 -184 14 -134 -137 72 69 105 90 -127 -58 -94 -34 14 143
5202 143 -221 4 -71 -15 -151 -77 -5 57 78 -29 -83 76 -44 109 37 -126 -101 97 86 -129 -83 -128 24 -75
5226 -75 -195 -27 116 -103 -116 12 -86 121 108 -262 -110 58 -1 120 -55 -26 -5 160 173 136 84 32 121 114 -69
5251 -69 -5 -97 -8 -59 102 72 -188 67 104 68 -18 1 -247 -5 71 -30 38 -43 -85 29 163 -70 72 -60 159
5276 159 147 -23 -10 50 -106 -145 -62 65 169 -53 -24 -176 -29 60 98 41 34 110 -92 17 -23 106 2 -39 58
5301 58 -42 -4 -96 95 74 111 -33 23 134 82 -40 -123 -98 100 -52 128 -34 -60 203 -35 86 -28 -166
5324 -166 153 130 -10 65 75 98 -71 -43 38 -16 -12 15 3 67 -30 -33 119 44 -128 -157 -130 160 58 -59 31 -4 -95
5351 -95 16 -57 28 -106 48 -44 118 -70 -48 6 100 108 25 -89 -196 -50 -23 -43 -34 100 -73 -74 3 59 107 49 181
5378 181 11 126 -58 37 134 56 -42 166 -15 301 -97 -205 -64 -166 50 215 24 -97 72 125 228 75
5400 75 -3 -26 -18 62 258 -7 -66 -23 142 -31 39 55 -85 25 -2 -67 -29 106 -107 -14 -24 21 39 46 244 19
5426 19 90 26 41 35 22 54 172 121 51 182 -90 -228 -155 55 -13 56 -103 37 15 -13 122 -97 -119 -101 18 89
5452 89 119 -76 13 78 2 -51 -38 25 -165 10 116 -48 -259 47 46 -77 227 29 82 156 -76 -128 56 -48
5476 -48 122 -35 -29 -67 -21 106 -132 41 -128 -90 37 156 -78 -71 -27 -59 -90 -75 -95 40 -67 51 -67 3 -57
5501 -57 -52 73 -102 -127 -139 23 58 -109 -80 170 -36 146 -78 106 -148 -96 129 13 -56 83 56 140 50 -115
5525 -115 2 49 -98 -80 -26 -25 5 32 -81 -53 -35 -20 97 -38 -14 76 -56 -15 157 47 -32 -123 40 -72 -14
5550 -14 82 88 83 33 110 -17 101 159 229 3 146 12 30 38 27 -4 10 -3 -184 -32 -7 12 -118 11 53 -5 20
5577 20 51 -4 -60 -9 121 37 4 85 217 93 7 31 -138 -66 -138 15 -68 -94 16 -53 11 125 91 -84 -86 -36 108
5604 108 65 118 86 176 -104 40 -43 107 79 43 -29 -15 16 0 2 -105 39 165 -78 -121 -136 26 39 75 -100 112
5630 112 109 25 1 9 -48 -90 160 88 229 -10 -126 -1 -57 82 78 22 39 -9 -81 -18 17 -8 19 -15 27 12 -23 -47
5658 -47 1 58 15 -37 114 -96 120 4 1 -82 83 -63 159 21 178 -212 -18 -7 -95 67 -35 6 -16 142
5682 142 18 -11 -54 -19 74 -45 -54 18 47 -78 49 -76 -4 -91 -31 -52 -50 -94 -102 -45 42 54 15 -217 -200 -69 64
5709 64 -67 9 61 -79 -107 27 40 221 39 -23 35 -70 90 33 11 46 68 -107 14 -147 -86 -41 -45 335 -63
5734 -63 -101 -118 49 31 77 108 14 120 -123 -30 144 31 96 32 31 139 -158 107 -56 58 -60 -24 -189 126
5758 126 -158 -185 100 10 -136 -97 35 -82 75 -173 -113 82 30 1 41 63 40 -56 22 24 115 38 -134 37 66
5783 66 52 -161 6 27 24 -124 -80 14 -59 -29 -24 55 171 -25 82 -57 48 17 -8 -26 21 46 11 27 -61 172 -41
5810 -41 -8 35 -4 137 -107 -172 78 138 32 -25 -8 86 119 -63 -38 -84 53 -90 25 29 -99 98 35 100 23 -44
5836 -44 -18 13 16 43 -19 79 70 68 86 6 50 -48 45 124 50 -88 -17 21 -56 98 -250 -29 -159 56 61 -41 44 -8 -42
5865 -42 -3 41 -213 35 -40 99 121 -58 159 -97 72 -81 17 -76 -124 197 -62 -69 10 -145 68 48 -74 -71 -35
5890 -35 -31 97 66 8 97 54 -210 -24 -85 -99 179 -35 -65 100 -8 -83 -70 -67 -49 43 -20 -224 44 41 -26 9 52
5917 52 65 -10 -88 133 -109 -110 -68 -116 -38 2 20 54 128 45 -4 48 111 7 128 -19 139 19 82 -134 30 -111
5943 -111 185 -59 -119 139 58 23 -70 225 -36 51 63 132 29 17 -17 -94 112 9 -19 -152 87 155 32 46
5967 46 19 -84 248 35 -163 64 -220 59 -46 66 -69 92 83 -72 -42 65 6 -48 -6 28 -109 88 18
5990 18 -140 -22 -33 21 -7 -28 -106 73 -21 35 143 -41 -96 -78 -6 103 315 -49 39 69 -38 -23 122 1 70
6015 70 107 -118 -94 -14 -9 20 125 -198 65 -69 125 -51 -86 39 -17 -82 23 -69 0 102 48 -11 -30 23 -19 5
6041 5 -4 6 17 -117 8 72 70 2 -48 -116 48 11 -5 -46 -50 -36 -24 24 -97 117 180 94 133 198 -137 65 -15 106
6069 106 98 36 5 64 -88 89 -112 -8 -82 25 -49 181 -31 -61 -34 84 30 30 -70 268 80 -17 -42 30 41
6094 41 18 -4 -269 31 -59 8 30 -134 -34 90 -140 17 -100 -118 88 30 -58 -195 99 19 -98 124 9
6117 9 -11 95 -79 -29 72 -16 -137 -85 -2 93 50 -111 -8 109 74 -44 64 53 26 -21 -61 -22 110 -129 -53
6142 -53 134 -144 9 39 45 -125 27 20 -111 171 -27 15 -31 -125 98 -90 34 102 -83 114 99 57 -83 58
6166 58 1 -117 43 -7 -24 -9 124 -33 43 -39 -14 32 76 -45 76 -18 97 -93 4 5 -111 59 -18 -77 50
6191 50 -200 -125 -153 -56 -75 -159 125 40 -163 113 -150 33 -7 -91 26 113 59 -15 10 49 -7 -60 7 -44 110 132
6217 132 -1 -79 7 116 41 -5 13 52 60 -41 73 73 69 -167 -103 18 -159 154 91 -108 -153 163 42 -167 41
6242 41 -61 -150 -97 -89 61 -114 82 48 -6 19 -29 112 -150 10 58 -123 43 116 -102 -106 -21 43 -2 35 -78 15
6268 15 -37 -41 -113 -8 23 -110 76 12 144 -141 -97 -9 -75 -14 -44 -74 55 16 -30 -3 -148 -84 13 31 7 -109 95
6295 95 10 40 91 -17 104 -13 -89 -42 13 38 -58 121 -26 -15 -17 -55 -23 -27 161 7 129 -49 98 -198 22
6320 22 -4 -79 -136 -16 122 -77 -65 -36 77 18 51 -134 -110 9 -137 -17 41 8 139 -63 -161 -155 56 127 131 52
6346 52 -50 203 71 -264 -86 -90 -163 72 -165 -140 57 240 -22 -2 67 150 5 -3 -106 194 10 41 44 -178
6370 -178 99 82 164 26 15 -24 213 -137 -196 5 -1 143 -85 -62 -29 -87 -64 84 94 64 35 -165 -217 14 -90
6395 -90 -4 -22 -31 140 79 -68 -140 -49 88 -35 73 -54 -39 140 94 -33 80 -46 -98 -7 -43 39 -76 -27 86
6420 86 6 -17 56 -61 69 -49 -82 1 -53 -81 53 63 13 73 -30 -19 25 61 -51 -154 -174 16 30 43 -74 31
6446 31 -93 118 -12 -222 28 22 23 18 -154 -15 62 -29 30 16 -136 4 30 10 -61 9 -100 -70 -163 18 9 -22 224
6473 224 -31 51 208 143 115 -85 88 276 -187 -56 -28 -31 73 -24 -58 -140 -3 37 -120 -74 -68 242 49 65 -74
6498 -74 -37 -187 87 28 78 -4 -118 -146 32 -16 31 84 80 61 126 124 18 121 -30 -29 58 35 73 17 -147 -63 -31 57
6526 57 126 -117 -28 168 -74 -50 -3 -20 -98 175 48 -41 62 207 -14 147 -12 117 126 -73 119 130 -88 -96
6550 -96 -114 -32 -11 35 -114 -37 72 157 24 27 -42 -109 -27 -160 24 -17 -25 230 -23 25 -1 33 136 66 -188 105
6576 105 -123 -79 -62 -144 66 -249 -126 -81 -152 59 -68 -13 35 -26 120 -128 -82 -34 -13 -63 -57 -93 12 75 19 33
6602 33 -36 -44 17 149 -92 10 -220 -65 -10 275 75 -19 60 -68 72 0 101 -15 31 58 144 102 5 -63 -91
6627 -91 16 132 116 120 -3 86 -110 123 -101 -54 100 148 -219 98 53 -17 42 -17 -98 11 -24 87 25 -70 44
6652 44 65 12 -9 181 125 -98 34 -65 -199 -50 -38 -29 -90 -192 -167 76 5 -72 -133 1 68 -8 99 -18 90
6677 90 -60 -74 -72 -7 64 25 -7 -163 -12 24 8 -28 136 -42 68 66 53 -12 -31 -52 25 141 8 20 -70 79 54
6704 54 -21 -16 26 -110 15 88 18 -97 -7 -118 -31 55 79 49 108 126 80 -2 -103 -173 15 -30 -82 78 84 141 -111
6731 -111 51 53 -73 -158 -40 48 4 11 -199 -27 -42 -39 -146 -42 63 -159 -42 -28 69 -3 -193 -18 62 -51 -18
6756 -18 12 -86 -5 -51 -12 29 -112 127 -47 -80 190 -92 -83 37 -124 -26 79 216 130 -8 -112 -87 64 -24 -73
6781 -73 208 -64 99 -4 -81 10 -19 18 -30 -93 29 -8 50 207 49 -31 91 -76 -25 103 2 -36 -130 -120 -124
6806 -124 -147 -4 102 -60 -110 -49 -76 64 -82 -5 -87 29 -41 45 15 55 -17 -111 -50 -13 9 19 -126 -52 92 21
6832 21 1 -94 -139 -99 70 124 87 -12 31 -37 -189 269 7 -34 -153 56 -74 78 -113 -169 30 43 81 -19 -2
6857 -2 72 61 -4 64 -27 -235 152 30 -24 35 43 -23 -27 50 51 -72 -8 131 -62 -15 -79 40 37 71 43 -142 37 -135
6885 -135 -127 184 -20 -16 23 -18 15 -11 -18 -86 -81 -68 -48 35 -72 -101 61 -32 12 -130 -57 -32 181 124 -29 22 83 142
6913 142 69 189 94 14 16 -70 -82 1 -19 97 -39 -44 -81 -116 49 -172 -23 55 30 -64 33 -138 177 118 147 -80
6939 -80 -78 39 134 -53 -47 -7 -34 126 -207 -121 -47 -45 68 -66 37 -55 3 -47 -45 87 -91 -16 66 61 -90 -15 10 -7
6967 -7 38 100 31 -55 23 -89 -34 20 -8 31 -88 208 -6 -103 35 -22 -8 -20 182 -148 -159 -25 110 158 60 -63
6993 -63 6 -19 37 -40 11 -64 -81 -131 11 10 -6 -7 -46 32 -56 -125 -91 -13 -95 158 -13 -68 -31 -49 7 41 19 144 -46
7022 -46 43 83 -132 58 238 -64 143 -2 81 -16 73 100 121 125 31 56 77 116 -142 -48 90 7 150 -59 -20 66
7048 66 27 -84 -42 143 -87 -50 52 42 -27 103 -99 -149 39 63 -70 159 -90 36 -13 -21 -22 -119 -70 -40 148
7073 148 -95 64 -104 -126 135 -74 -148 -24 5 -198 72 123 15 125 -145 -132 102 176 -14 -45 37 119 -45
7096 -45 44 -90 120 -57 76 44 50 46 126 -40 -40 20 -153 139 39 -87 135 -3 -73 44 63 -126 -114 -1 50
7121 50 -21 -40 -98 -239 -55 -37 34 67 -6 -199 -82 13 71 67 37 -68 -49 -138 0 -30 67 -21 -62 106 -5 -63 59
7148 59 -29 -69 47 42 51 -132 28 -76 37 -96 -90 -65 -13 2 74 68 18 188 124 128 1 38 177 34 108 -70 21
7175 21 -68 -38 -98 -36 -139 129 -9 -130 80 -37 -23 114 -93 46 218 125 -202 -61 -131 32 65 -44 -70
7198 -70 -45 -195 30 -54 -78 171 62 206 6 -106 -29 66 192 -54 -42 111 -93 -2 86 104 161 -19 60 171
7222 171 64 26 -2 -15 -53 -133 -32 -25 27 -33 -58 52 162 -157 -146 -96 -120 -215 68 3 84 -96 130 26 -126
7247 -126 -193 3 -99 11 66 28 18 102 142 -59 -113 -57 20 61 87 -24 2 177 139 74 -121 -39 -16 -67 -83 -84 47
7274 47 57 29 12 -71 -65 35 -26 73 109 11 -23 98 -122 -45 -26 29 -61 -176 -21 89 -16 66 -47 84 126 59
7300 59 89 -181 35 -29 131 -146 51 -27 64 59 18 103 -75 -11 40 63 105 -47 126 -50 -133 -25 115 124 -65
7325 -65 70 -25 -151 40 -14 -104 16 44 -61 54 -13 -23 35 166 26 102 -15 -135 42 36 31 39 12 6 -117 43
7351 43 -47 -5 15 -39 -8 94 -12 91 -165 -1 17 4 155 -65 -36 36 65 -44 -59 165 74 -102 -70 24 -58
7376 -58 -71 -23 58 -58 -6 20 55 -47 -69 -6 25 112 144 -79 67 49 -136 32 40 -172 1 3 -21 22 -87 41
7402 41 -144 8 -39 -12 30 18 -57 -75 3 90 88 -101 12 -36 45 -133 172 2 -26 -98 -51 -128 -39 -36 79 -95 70
7429 70 168 -19 -33 221 75 -28 -84 -62 4 25 -114 -99 33 -88 35 -117 66 43 49 -6 -113 84 11 57 -155
7454 -155 24 -36 -12 -154 -86 88 21 -57 61 149 -80 56 -50 -34 92 -24 -94 -76 54 175 -23 33 17 -195
7478 -195 64 -6 19 22 -7 33 -125 -5 11 -71 -91 -81 144 -218 57 9 -187 121 30 26 122 113 -99 -94 -49 44 -62
7505 -62 197 -83 -128 -147 28 -7 99 168 -91 -34 -36 -46 -35 81 -190 41 -38 52 124 -32 -29 52 -104 -69 -78 -21 -42
7532 -42 68 -59 -156 -26 24 4 -235 -83 142 -65 -62 43 120 15 -61 28 144 34 -8 13 6 129 -8 111
7556 111 -31 117 -133 -73 -14 -60 -55 157 -35 -20 36 -144 -23 4 -49 89 143 -101 30 18 -96 -210 -70 195
7580 195 -105 -82 -71 -124 -69 -49 85 -99 119 4 -23 54 -36 -3 -12 103 -92 43 115 44 -114 -135 -114 116 -61
7605 -61 26 78 81 -20 -7 19 -35 133 168 -62 54 14 -189 -97 43 75 -44 -80 115 206 29 12 -86 -52 -115 37
7631 37 64 94 138 -130 8 -71 -77 202 25 120 -93 32 -220 -50 35 112 -66 -36 42 104 135 44 -48 -8 -21 51
7657 51 15 33 26 86 58 19 33 -71 -28 -127 -36 25 5 -88 38 -99 91 -33 -16 66 -9 240 -4 -127 142 101
7683 101 -113 -9 73 -62 32 -42 -31 91 -59 36 -125 89 -9 112 35 -66 4 -87 138 61 60 -12 154 -31
7707 -31 -10 -58 -6 -112 -56 182 181 -17 -40 -161 -183 102 33 -3 8 -20 -8 66 16 -159 -52 -36 9 -8 44 -49 54
7734 54 -170 76 -163 -122 2 8 0 0 58 -27 92 -81 7 -92 17 71 133 3 -189 -33 -40 -65 -21 -179 43 162
7760 162 42 83 45 -61 -143 0 38 -36 -90 21 20 8 -21 -89 -194 -156 92 -108 -38 -17 -49 -79 -91 185 -75 37
7786 37 43 -42 17 -53 167 70 25 27 -25 29 -32 -31 -93 -3 72 -34 -32 20 -32 143 -126 -61 -109 -171 -69 -79 -25 74 112 -5
7816 -5 190 -162 132 -40 139 208 -200 -165 122 -67 -19 118 -118 -46 62 91 -219 33 139 -63 40 -53 -40
7839 -40 75 1 71 -96 -16 -135 192 40 49 27 14 81 -107 -95 -13 22 174 9 -109 81 0 -69 146 88 77
7864 77 -11 -97 7 -15 -124 -154 70 232 54 -112 46 47 113 159 96 191 13 130 131 -46 126 -110 27 -142
7888 -142 -84 43 48 104 -64 -57 176 155 -115 62 -101 -115 14 -25 179 12 72 26 -153 -116 106 -71 54 -100
7912 -100 -175 139 105 39 -21 97 -105 149 -151 221 -76 100 -88 188 88 -150 174 40 35 142 97 38 -69
7935 -69 -46 140 96 72 74 38 11 -83 17 41 -124 -20 -1 -102 15 -69 -89 -34 -25 25 -102 89 36 63 149 90 21
7962 21 -77 112 70 31 -30 111 92 79 -21 27 39 179 -69 -80 -73 118 -37 -125 111 72 78 -38 -25 58 -70 -58
7988 -58 72 -81 114 53 15 -10 31 57 182 -203 -10 136 -213 -12 44 80 -16 23 62 -111 -47 -28 130 9
8012 9 15 19 48 129 91 31 -96 -32 10 -35 -76 -50 95 -44 -88 -23 -38 -276 -60 135 -113 44 78 -11 -70 232 122
8039 122 93 -76 114 112 65 111 16 0 34 -78 79 36 52 15 30 -62 59 8 -51 31 124 194 84 1 141 -66
8065 -66 28 131 -153 23 86 5 132 26 -93 -36 -20 -100 106 -33 77 66 -82 129 -38 10 132 -39 81
8088 81 110 112 -7 72 55 63 70 -52 -14 144 94 -71 -111 171 8 57 9 4 35 28 -4 -119 -36 -109 -141 117 -24 132
8116 132 -11 30 64 5 76 -47 60 65 85 -47 26 -21 77 -3 -67 115 32 -166 -125 39 -18 -59 187 220 261 -69
8142 -69 -128 22 -55 52 -123 -15 12 -45 80 -127 -25 49 -45 -67 -57 -30 53 -7 183 -108 79 -38 -116 177
8166 177 -12 14 9 61 -75 132 -92 89 -7 105 -70 93 36 -222 155 43 -67 -82 -60 -102 97 -61 160
8189 160 80 143
8191A43
##END NTUPLES=NMR FID
##END=
