##TITLE=1H_IG-crBrtol
 CDCl3
 8sc, 
 16.2.2024
##JCAMPDX= 6.0         $$ Bruker NMR JCAMP-DX V2.0
##DATA TYPE= NMR FID
##DATA CLASS= NTUPLES
##ORIGIN= UXNMR, Bruker Analytische Messtechnik GmbH
##OWNER= root
$$ XWIN-NMR		Version 3.5
$$ Fri Feb 16 14:24:38 2024 Russian Standard Time (UT+4h)  she@DPX200
##.OBSERVE FREQUENCY= 200.1313
##.OBSERVE NUCLEUS= ^1H
##.DELAY= (6, 6)
##.ACQUISITION MODE= SIMULTANEOUS
##.ACQUISITION SCHEME= undefined
##.AVERAGES= 8
##.DIGITISER RES= 18
##SPECTROMETER/DATA SYSTEM= spect
##.PULSE SEQUENCE= zg30
##.SOLVENT NAME= DMSO
##.SHIFT REFERENCE= (INTERNAL, DMSO, 0, 15.7039)
##AUDIT TRAIL= $$ (NUMBER, WHEN, WHO, WHERE, WHAT)
$$ ##TITLE= Audit trail, XWIN-NMR		Version 3.5
$$ ##JCAMPDX= 5.01
$$ ##ORIGIN= Bruker BioSpin GmbH
$$ ##OWNER= she
$$ F:/spectra/data/she/nmr/H-F/1/audita.txt
$$ ##AUDIT TRAIL=  $$ (NUMBER, WHEN, WHO, WHERE, WHAT)
(   1,<2024-02-16 14:23:28.09 +0400>,<she>,<DPX200>,
      <created by zg, POWCHK disabled, PULCHK disabled
       configuration hash MD5:
       00 E9 B6 7A A2 85 ED C7 34 08 36 98 17 FE 4E 26
       data hash MD5: 16K
       AC 94 AA 6E 8F 0D 32 13 71 A5 E7 8F 74 AB F1 28>)
$$ ##END=
$$ 
$$ hash MD5
$$ BE B1 0B 03 71 2E 9A 22 3E A2 D8 EC AE 24 E2 F3
##$RELAX= 
##$RELAX= 
##$RELAX= 
##$RELAX= 
##$RELAX= 
##$RELAX= 
$$ Bruker specific parameters
$$ --------------------------
##$DU= <F:/spectra>
##$EXPNO= 1
##$NAME= <H-F>
##$PROCNO= 1
##$TYPE= <nmr>
##$USER= <she>
##$AMP= (0..31)
100 100 100 100 100 100 100 100 100 100 100 100 100 100 100 100 100 100 
100 100 100 100 100 100 100 100 100 100 100 100 100 100 
##$AQSEQ= 0
##$AQ_mod= 1
##$AUNM= <au_zg>
##$AUTOPOS= <>
##$BF1= 200.13
##$BF2= 200.13
##$BF3= 200.13
##$BF4= 200.13
##$BF5= 200.13
##$BF6= 200.13
##$BF7= 200.13
##$BF8= 200.13
##$BYTORDA= 1
##$CFDGTYP= 0
##$CFRGTYP= 5
##$CHEMSTR= <none>
##$CNST= (0..31)
1 1 145 1 1 1 1 1 1 1 1 1 1 1 1 1 1 1 1 1 1 1 1 1 1 1 1 1 1 1 1 1 
##$CPDPRG= <>
##$CPDPRG1= <>
##$CPDPRG2= <>
##$CPDPRG3= <>
##$CPDPRG4= <mlev>
##$CPDPRG5= <mlev>
##$CPDPRG6= <mlev>
##$CPDPRG7= <mlev>
##$CPDPRG8= <mlev>
##$CPDPRGB= <>
##$CPDPRGT= <>
##$D= (0..31)
0 1.2 0 0 0 0 0 0 0 0.06 0 0.03 0 0 0 0 0.0002 0 0 0 0 0 0 0 0 0 0 0 0 
0 0 0 
##$DATE= 1708079007
##$DBL= (0..7)
120 120 120 120 120 120 120 120 
##$DBP= (0..7)
150 150 150 150 150 150 150 150 
##$DBP07= 0
##$DBPNAM0= <>
##$DBPNAM1= <>
##$DBPNAM2= <>
##$DBPNAM3= <>
##$DBPNAM4= <>
##$DBPNAM5= <>
##$DBPNAM6= <>
##$DBPNAM7= <>
##$DBPOAL= (0..7)
0.5 0.5 0.5 0.5 0.5 0.5 0.5 0.5 
##$DBPOFFS= (0..7)
0 0 0 0 0 0 0 0 
##$DE= 6
##$DECBNUC= <off>
##$DECIM= 32
##$DECNUC= <off>
##$DECSTAT= 4
##$DIGMOD= 1
##$DIGTYP= 9
##$DL= (0..7)
0 120 120 120 120 120 120 120 
##$DP= (0..7)
150 150 150 150 150 150 150 150 
##$DP07= 0
##$DPNAME0= <>
##$DPNAME1= <>
##$DPNAME2= <>
##$DPNAME3= <>
##$DPNAME4= <>
##$DPNAME5= <>
##$DPNAME6= <>
##$DPNAME7= <>
##$DPOAL= (0..7)
0.5 0.5 0.5 0.5 0.5 0.5 0.5 0.5 
##$DPOFFS= (0..7)
0 0 0 0 0 0 0 0 
##$DQDMODE= 0
##$DR= 18
##$DS= 0
##$DSLIST= <SSSSSSSSSSSSSSS>
$$ [...]
##$SUBNAM2= <"">
##$SUBNAM3= <"">
##$SUBNAM4= <"">
##$SUBNAM5= <"">
##$SUBNAM6= <"">
##$SUBNAM7= <"">
##$SUBNAM8= <"">
##$SUBNAM9= <"">
##$SW= 18.0517328524113
##$SWIBOX= (0..15)
0 0 2 0 0 0 0 0 0 0 0 0 0 0 0 0 
##$SW_h= 3612.71676300578
##$TD= 16384
##$TD0= 1
##$TE= 0
##$TE2= 300
##$TE3= 300
##$TEG= 300
##$TL= (0..7)
0 120 120 120 120 120 120 120 
##$TP= (0..7)
150 150 150 150 150 150 150 150 
##$TP07= 0
##$TPNAME0= <>
##$TPNAME1= <>
##$TPNAME2= <>
##$TPNAME3= <>
##$TPNAME4= <>
##$TPNAME5= <>
##$TPNAME6= <>
##$TPNAME7= <>
##$TPOAL= (0..7)
0.5 0.5 0.5 0.5 0.5 0.5 0.5 0.5 
##$TPOFFS= (0..7)
0 0 0 0 0 0 0 0 
##$TUNHIN= 0
##$TUNHOUT= 0
##$TUNXOUT= 0
##$USERA1= <user>
##$USERA2= <user>
##$USERA3= <user>
##$USERA4= <user>
##$USERA5= <user>
##$V9= 5
##$VALIST= <valist>
##$VCLIST= <CCCCCCCCCCCCCCC>
##$VD= 0
##$VDLIST= <DDDDDDDDDDDDDDD>
##$VPLIST= <PPPPPPPPPPPPPPP>
##$VTLIST= <TTTTTTTTTTTTTTT>
##$WBST= 1024
##$WBSW= 4
##$XGAIN= (0..3)
0 0 0 0 
##$XL= 0
##$YL= 0
##$YMAX_a= 45943
##$YMIN_a= -46998
##$ZGOPTNS= <>
##$ZL1= 120
##$ZL2= 120
##$ZL3= 120
##$ZL4= 120
##$ABSF1= 10
##$ABSF2= 0
##$ABSG= 5
##$ABSL= 3
##$ALPHA= 0
##$AQORDER= 0
##$ASSFAC= 0
##$ASSFACI= 0
##$ASSFACX= 0
##$ASSWID= 0
##$AUNMP= <proc_1d>
##$AZFE= 0.1
##$AZFW= 0.1
##$BCFW= 1
##$BC_mod= 2
##$BYTORDP= 1
##$COROFFS= 0
##$CY= 11.3945322036743
##$DATMOD= 1
##$DC= 2
##$DFILT= <>
##$DTYPP= 0
##$F1P= 15.7292609196834
##$F2P= 12.9074282941183
##$FCOR= 0.5
##$FTSIZE= 0
##$FT_mod= 4
##$GAMMA= 1
##$GB= 0.15
##$INTBC= 1
##$INTSCL= 1
##$ISEN= 128
##$LB= 0.24
##$LEV0= 0
##$LPBIN= 0
##$MAXI= 10000
##$MC2= 0
##$MEAN= 0
##$ME_mod= 0
##$MI= 1.114404
##$NCOEF= 0
##$NC_proc= 0
##$NLEV= 6
##$NOISF1= 3.799351
##$NOISF2= 2.8
##$NSP= 1
##$NTH_PI= 0
##$NZP= 0
##$OFFSET= 15.70392
##$PC= 1
##$PHC0= -24956.66
##$PHC1= 10.85264
##$PH_mod= 1
##$PKNL= yes
##$PPARMOD= 0
##$PSCAL= 0
##$PSIGN= 0
##$REVERSE= no
##$SF= 200.130013532006
##$SI= 16384
##$SIGF1= 3
##$SIGF2= 2
##$SINO= 400
##$SIOLD= 16384
##$SREGLST= <1H.CDCl3>
##$SSB= 0
##$STSI= 0
##$STSR= 0
##$SW_p= 3612.71676300578
##$SYMM= 0
##$S_DEV= 0
##$TDeff= 0
##$TDoff= 0
##$TI= <>
##$TILT= no
##$TM1= 0
##$TM2= 0
##$TOPLEV= 0
##$USERP1= <user>
##$USERP2= <user>
##$USERP3= <user>
##$USERP4= <user>
##$USERP5= <user>
##$WDW= 1
##$XDIM= 8192
##$YMAX_p= 0
##$YMIN_p= 0
$$ End of Bruker specific parameters
$$ ---------------------------------
##NTUPLES= NMR FID
##VAR_NAME=  TIME,          FID/REAL,        FID/IMAG
##SYMBOL=    X,             R,               I
##VAR_TYPE=  INDEPENDENT,   DEPENDENT,       DEPENDENT
##VAR_FORM=  AFFN,          ASDF,            ASDF
##VAR_DIM=   8192,          8192,            8192
##UNITS=     SECONDS,       ARBITRARY UNITS, ARBITRARY UNITS
##FACTOR=    0.0002768,     1,               1
##FIRST=     0,             0,               0
##LAST=      2.2672688,     0,               0
##MIN=       0,             -46998,          0
##MAX=       2.2672688,     45943,           0
$$ Real data points
##PAGE= N=1
##DATA TABLE= (X++(R..R)), XYDATA
$$ [...]
$$ plain form
1756 -20 336 788 89 -481 114 -20 -991 -1045 -16 134 -871 -889 474 571 -267 -386 605 967 203 -361
1776 -361 530 952 15 -924 -87 696 -459 -1247 -709 541 -7 -1450 -457 798 505 -700 -293 1229
1794 1229 1067 72 -47 1081 787 -285 -666 334 406 -833 -1419 -199 327 -656 -1281 -219 441 -146
1812 -146 -753 94 1035 576 -8 357 937 587 -184 -204 409 -90 -701 -714 -85 -202 -734 -656 333 280 -405
1833 -405 -65 632 56 -281 -127 655 346 -387 -73 656 499 -379 -387 284 422 -352 -611 323 520 -514
1853 -514 -604 451 794 -97 -910 76 765 -69 -749 -122 971 220 -730 -337 945 507 -642 -305 684
1872 684 192 -865 -646 390 311 -702 -803 407 569 -224 -591 330 930 66 -354 499 806 -167 -303
1891 -303 104 638 -2 -792 -305 338 -410 -857 -151 488 -39 -632 -36 684 -54 -445 190 722 206 -289
$$ packed form
1756b0L56M52o99n70N95j34r71n4J029J50j005j8J363R7q38j19R91L62p64n64
1776c61Q91M22r37r39Q37P83j155p88N38J250n48j443R93J255k93j205M07J522
1794A229j62r95j19J128k94j072l81J000P2j239n86J220N26r83o25J062O60n87
1812a46o07Q47R41m59n84L65N80l50p71k0O13m99o11j3O29j17n32P8R89n3o85
1833d05L40O97n76l37J54P82l09p33L14P29j57q78qO71J38p74k59R34J97j034
1853e14r0J055L43q91q13R86O89q34o80O27J093p51r50L93J282m38j149L37R89
1872F84m92j057K19J036p9j013j01J210J62p93l67R21O00q64m20Q53L07r73j36
1891c03M07N34o40p90M87O43p48m47P06O39n27n93N96P20p38l91O35N32n16m95
$$ plain form
1911 -289 376 876 258 -280 -29 553 242 -719 -723 122 263 -1028 -881 406 299 -613 -555 862 632 -269
1931 -269 16 1127 963 -29 -438 28 619 -151 -960 -484 390 -63 -1267 -604 595 280 -850 -58 1232
1950 1232 483 -569 148 995 315 -217 52 366 60 -577 -717 -145 313 -391 -722 121 433 -530 -993
1969 -993 409 792 -448 -290 871 749 -467 -413 376 391 -91 97 356 -68 -238 -399 -145 89 340
1988 340 -730 -461 563 2 -963 -231 1339 625 -439 298 1012 -25 -635 178 806 164 -181 -413
2006 -413 -234 -1 -580 -940 -65 972 -157 -950 -53 827 -281 -803 1056 1325 263 -471 625 457
2024 457 -654 -345 -107 9 -222 -526 -709 -406 543 -294 -753 223 550 -659 -971 848 312 -371 267
2043 267 1422 267 -526 142 569 103 -285 185 -203 -219 -280 -1005 -874 313 26 -855 171 1152 -319
$$ packed form
1911b89O65N00o18n38K51N82l11r61mQ45J41j291J47J287j07r12N8J417k30r01
1931b69K85J111j64r92m09M66N91p70q09M76Q74m53j204O63J199l15j130P92J290
1950A232p49j052P17Q47o80n32K69L14l06o37j40N72M58p04l31Q43L12r63m63
1969i93J402L83j240J58J161j22j216N4P89J5m82J88K59m24j70j61K54K34K51
1988C40j070K69J024n61r65P32J570p14j064P37P14j037o10Q13O28o42l45k32
2006d13J79K33n79l60Q75J037j129p93Q97Q80j108n22J859K69j062p34J096j68
2024D57j111L09K38J16k31l04j83L03R49q37m59R76L27j209l12J819n36o83O38
2043B67J155j155p93O68M27m66l88M70l88j6o1p25J31J187k87q81J026R81j471
$$ plain form
2062 -319 -1118 748 1512 -134 -336 803 596 -772 -936 112 192 -48 -261 -798 -356 110 -517 -639 773
2081 773 1334 -490 -583 857 854 -838 -349 1455 563 -683 -118 251 -529 -634 -183 186 70 74 -455 -669
2101 -669 378 250 -627 61 1438 413 -1115 -92 867 -17 -516 704 684 -649 -811 98 70 -209
2119 -209 224 68 -143 173 -304 -788 130 812 114 -444 848 592 -883 -794 983 657 -692 67 673
2138 673 -226 -621 -92 242 337 336 -45 -461 115 111 -824 -531 1132 344 -1065 -29 873 -21 -734 543
2158 543 1225 112 -366 164 4 -291 -187 -127 -198 233 -315 -972 -498 463 -60 -583 635 1062 -187 -573
2178 -573 704 909 -240 -121 833 248 -705 -414 -215 -229 -113 -469 -533 -175 15 -483 -374 566 665 -269
2198 -269 171 1188 218 -631 137 1061 152 -495 200 319 -536 -757 -355 -233 -40 -323 -667 -117 322 -51
$$ packed form
2062c19p99J866P64j646k02J139k07j368j64J048Q0k40k13n37M42M66o27j22J412
2081G73N61j824r3J440lj692M89J804q92j246N65L69p80j05M51L69j16Mn29k14
2101f69J047j28q77O88J377j025j528J023R59q84m99J220k0j333j62R09k8k79
2119b09M33j56k11L16m77m84R18O82o98n58J292k56j475Q9J777l26j349P59O06
2138F73q99l95N29L34R5jl81m16N76mr35K93J663p88j409J036R02q94p13J277
2158E43O82j113m78N30j60k95J04O0p1M31n48o57M74R61n23n23J218M27j249l86
2178e73J277K05j149J19R54n85r53K91J99j4J16l56o4L58J90m98J09R40R9r34
2198b69M40J017r70q49P68R24r09o47O95J19q55k21M02J22J93k83l44N50M39l73
$$ plain form
2218 -51 -354 613 1178 112 -533 653 923 -112 -350 402 330 -417 -817 -29 -46 -495 -636 -344 416 249
2238 249 -141 -58 754 868 -142 -86 1033 545 -530 -263 462 -89 -856 -687 171 -259 -753 -485 126 124
2258 124 -198 -160 419 839 175 -264 279 705 -175 -503 -148 372 -403 -793 -152 206 -153 -527 122 443
2278 443 115 -274 151 443 56 -193 -229 447 226 -232 -275 532 423 -247 -352 333 503 -392 -269 342 367
2299 367 -476 -484 318 169 -138 -451 209 428 -45 -481 178 765 -10 -471 -4 635 97 -369 53 290 124
2320 124 -246 -165 302 -58 -458 -37 364 102 -432 -177 339 136 -305 -213 429 439 -235 -302 462 447 -151 -170
2342 -170 248 219 -416 -533 108 105 -505 -685 38 294 -61 -400 234 589 281 -8 231 980 198 -405 129
2363 129 365 -105 -474 -638 -116 -176 -701 -486 297 -69 -422 -111 472 761 122 -43 647 759 -71 -245
$$ packed form
2218e1l03R67N65j066o45J186K70j035k38P52p2p47m00P88j7m49j41K92P60j67
2238B49l90Q3Q12J14j010N6J119m88j075K67P25n51p67J69Q58m30m94K68O11k
2258A24l22L8N79M20o64m39N43M26q80l28L55N20p75l90O41L58l59l74O49L21
2278D43l28l89M25K92l87k49l6O76k21m58m3Q07j09o70j05O85J70q95J23O11K5
2299C67q43qQ02j49l07l13O60K19m73m36O59N87p75m61M67O39n38m66M22K37j66
2320A24l70Q1M67l60m00M21M01k62n34K55N16k03m41R2O42J0o74o7P64j5n98j9
2342a70M18k9o35j17O41lo10j80P23K56l55l39O34L55l08k89K39P49p82o03N34
2363A29K36m70l69j64N22o0n25K15P83l66l53L11N83K89o39j65O90J12q30j74
$$ plain form
2383 -245 275 239 -522 -933 -224 51 -581 -705 81 141 -71 -220 281 410 295 -88 285 679 355 -410 -249
2404 -249 542 -36 -636 -290 163 -169 -460 -125 109 -125 -476 -300 345 405 -103 -174 522 562 -8 -266 320
2425 320 610 -269 -521 2 167 -495 -644 219 167 -441 -582 32 152 -4 -109 253 577 349 -175 -181 517
2446 517 387 -340 -187 416 125 -760 -412 173 -119 -435 -106 465 -60 -121 -156 147 181 -135 -95 31 448
2467 448 -37 -578 5 524 -134 -628 282 601 -406 -655 392 363 -303 -235 99 282 -244 -366 79 224
2487 224 276 43 -103 210 288 -379 -208 524 441 -291 -564 400 -114 -701 -298 303 17 -465 -205 60 -97
2508 -97 -77 -215 180 677 415 -336 -202 617 20 -584 299 673 -202 -889 -111 311 -505 -457 278 184 -405
2529 -405 -188 32 -64 497 171 -133 356 550 -254 -567 280 562 -313 -354 536 32 -932 -398 319 93 -452
$$ packed form
2383b45N20l6p61m11P09K75o32j24P86O0k12j49N01J29j15l83L73L94l24p65J61
2404b49P91n78o00L46M53l32k91L35K34k34l51J76O45O0n08p1O96M0n70k58N86
2425C20K90q79k52N23J65o62j49Q63n2o08j41O14J20j56j05L62L24k28n24oO98
2446E17j30p27J53O03k91q85L48N85k92l16L29N71n25o1l5L03L4l16M0J26M17
2467D48m85n41N83N19o58m94R10L19j007k49J047k9o66O8L34J83n26j22M45J45
2487B24N2k33j46L13P8o67J71P32q3p32k73R64n14n87M03O01k86m82K60K65j57
2508i7K0j38L95M97k62p51J34Q19n97o04Q83L74q75o87P78M22q16M8P35r4n89
2529d05K17K20r6N61l26l04M89J94q04l13Q47K82q75m1Q90n04r64N34P17k26n45
$$ plain form
2550 -452 110 172 -164 -275 -86 59 448 470 31 -128 380 167 -737 -294 803 -1 -731 -124 313 -675
2570 -675 -942 278 540 -91 -33 217 -208 -85 317 94 250 541 190 -537 52 568 -415 -545 574 361
2590 361 -843 -640 306 108 -428 119 335 319 172 219 -74 64 557 128 -43 538 392 -612 -502 440
2610 440 201 -616 101 564 -379 -973 134 389 -177 68 520 209 -60 84 74 74 661 331 -599 -72 319
2631 319 -468 -714 212 624 -598 -541 493 53 -633 -256 632 308 -34 147 244 72 218 13 -238 185
2651 185 433 -467 -593 245 -112 -800 -218 765 -13 -761 -97 521 -198 -348 468 366 144 147 -28 145 194
2672 194 213 -215 -151 460 -222 -785 -179 416 -313 -547 469 407 -260 -431 486 201 81 59 218 44 16
2693 16 -187 -138 222 123 -372 -559 389 160 -428 -451 529 132 -319 -340 314 -17 -407 234 361 205 67 39
$$ packed form
2550d52N62O2l36j11J89J45L89K2m39j59N08k13r04M43J097q04p30O07M37r88
2570f75k67J220K62o31N8K50m25J23M02k23J56K91l51p27N89N16r83j30J119k13
2590C61j204K03R46j98n36N47K16j6j47M7k93J38M93m29j71N81j46j004J10R42
2610D40k39q17P17M63r43n94J107K55n66K45M52l11k69J44j0%N87l30r30N27L91
2631C19p87k46R26M12j222N7J034m40o86L77Q88l24l42J81R7j72J46k05k51M23
2651A85K48r00j26Q38l57o88N82R83p78p48O64O18p19j50Q16j02k22Lj75J73M9
2672A94J9m28O4O11o82n63O06N95p29k34J016o2o67j71R17k85j20k2J59j74k8
2693A6k03M9L60r9m95j87R48k29n88k3R80l97m51k1O54l31l90O41J27j56j38k8
$$ plain form
2715 39 -61 259 61 -304 88 410 -169 -512 -60 457 -212 -545 -32 312 -423 -412 105 385 70 -264 85
2736 85 456 212 -164 8 128 323 -383 -227 212 -12 -507 -438 254 234 -369 -192 543 170 -169 -81 568
2757 568 206 7 -10 117 305 -41 -313 -122 213 -117 -551 -93 102 -64 -449 1 421 53 -314 126
2777 126 344 15 -182 197 467 245 -254 -217 182 156 -278 -382 200 5 -292 -342 136 -63 -196 7 169
2798 169 403 -132 -248 310 457 -7 -149 137 272 -140 -240 -42 254 -239 -165 -28 226 -173 -385 -86
2818 -86 378 -70 -240 107 466 198 -239 48 398 259 -254 -135 48 124 -315 -52 -24 96 -383 -341 174
2839 174 286 -89 -321 110 195 -117 -290 243 331 -155 -139 235 336 83 -208 -73 196 -142 -304 -68 130
2860 130 -238 -489 -151 141 187 -65 90 292 141 -71 -58 397 258 -190 -123 284 77 -145 -298 -31 101
$$ packed form
2715C9j00L20j98l65L92L22n79l43M52N17o69l33N13L44p35J1N17K80l15l34L49
2736H5L71k44l76J72J20J95p06J56M39k24m95O9O92k0o03J77P35l73l39Q8O49
2757E68l62j99j7J27J88l46k72J91L35l30m34M58J95j66l85M50M20l68l67M40
2777A26K18l29j97L79K70k22m99L7L99k6m34j04N82j95k97n0M78j99j33K03J62
2798A69K34n35j16N58J47m64j42K86J35m12j00J98K96m93P4J37K54l99k12K99
2818h6M64m48j70L47L59k68m37K87L50j39n13J19J83P6m39K63K8J20m79M2N15
2839A74J12l75k32M31Q5l12j73N33Q8m86J6L74J01k53k91J35K69l38j62K36J98
2860A30l68k51L38K92M6k52J55K02j51k12J3M55j39m48O7M07k07k22j53K67J32
$$ plain form
2881 101 -292 -397 6 23 -130 -73 221 562 -24 -249 329 382 -77 -207 116 187 -97 -321 -22 50 -159 -497
2903 -497 -352 42 -71 -466 -333 421 153 -196 185 397 167 -177 -85 229 117 -206 -125 50 178 -222 -405
2924 -405 231 305 -132 -436 44 224 -191 -226 159 536 25 -108 302 345 -136 -17 182 137 -77 -400 -237
2945 -237 108 52 -363 -76 -48 175 -355 -425 337 179 -214 -28 523 295 -107 -213 164 285 60 -6 -225
2966 -225 -88 -294 -209 -2 317 -24 -199 -32 210 -88 -208 84 446 131 -97 150 273 -136 -231 -57 114
2987 114 -109 -221 -372 81 -78 -43 15 96 346 -226 -426 101 227 -220 -326 473 412 -125 33 410 -19
3008 -19 -243 -34 217 143 73 -232 -263 -96 -17 -226 -235 165 -260 -626 -242 373 -74 -184 401 589 -6 -143
3030 -143 -33 303 -181 -291 -128 -135 -93 -182 -434 -123 202 37 -231 114 401 -180 -375 418 445 -209 6 350
$$ packed form
2881A01l93j05M03J7j53N7K94L41n86k25N78N3m59j30L23P1k84k24K99P2k09l38
2903d97J45L94j13l95J33P54k68l49L81K12k30l44R2L14j12l23Q1J75J28m00j83
2924d05O36P4m37l04M80J80m15l5L85L77n11j33M10M3m81J19J99m5k14l23J63
2945b37L45n6m15K87K8K23n30p0P62j58l93J86N51k28m02j06L77J21k25o6k19
2966b25J37k06Q5K07L19l41j75J67K42k98j20K92L62l15k28K47J23m09r5J74J71
2987A14k23j12j51M53j59L5N8Q1K50n72k00N27J26m47j06P99o1n37J58L77m29
3008a9k24K09K51p4p0l05l1J67P9k09rM00m25l66L84O15m47j10N85J88n95j37
3030a43J10L36m84j10J63pM2q9k52L11L25j65k68L45K87n81j95P93K7o54K15L44
$$ plain form
3052 350 124 -253 -114 217 42 -62 -323 -266 -268 -58 -278 -154 270 267 -331 -179 463 99 -299 117 717 -124
3074 -124 -217 233 342 -54 -89 -43 8 -144 24 -238 -395 138 23 -374 412 523 -97 -258 348 488 -83
3095 -83 -207 379 128 -376 -269 55 -66 -165 164 -171 -214 -114 -152 -184 -33 279 -123 -255 346 454 -294 -160
3117 -160 562 361 -403 -19 194 -261 -416 -90 34 -58 222 23 -8 139 59 -115 119 538 146 -404 -23
3138 -23 538 -238 -304 395 327 -129 -301 21 10 -294 -40 -16 -25 -139 4 -296 -19 313 -101 -115 311 455 -214
3161 -214 -295 644 252 -348 -192 447 -123 -380 -64 58 12 -177 -189 -219 82 139 -284 8 491 221 -106 62
3183 62 247 -112 -336 218 156 -126 -112 144 79 -257 -78 -23 -61 -64 6 -26 214 212 -267 -60 127 174 -200 -198 214
3208 214 167 -274 -71 146 36 -322 -16 130 -151 -262 14 -60 222 -47 -119 -67 271 226 -225 188 406 284
$$ packed form
3052C50k26l77J39L31j75j04k61N7kK10k20J24M24ln98J52O42l64l98M16O00q41
3074a24r3M50J09l96l5M6N1j52J68k62j57N33j15l97P86J11o20j61O06J40n71
3095h3j24N86k51n04J07L24j21r9L29l35m3J00l8l2J51L12m02j32O01J08p48J34
3117a60P22k01p64L84K13m55j55L26J24r2K80j99l1J47q0j74K34M19l92n50L81
3138b3N61p76o6O99o8m56j72L22j1l04K54K4rj14J43l00K77L32m14j4M26J44o69
3161b14q1R39l92o00J56O39n70k57L16J22m6j89j2l0L01N7m23K92M83k70l27J68
3183F2J85l59k24N54o2k82J4K56o5l36J79N5l8lP0l2K40km79K07J87M7l74KM12
3208B14m7m41K03K17j10l58L06J46k81j11K76p4K82k69p2N2L38m5m51M13K18j22
$$ plain form
3230 284 -306 -13 296 149 -217 -115 172 -226 -439 -234 -107 -70 55 30 117 6 -75 -208 137 528 148
3251 148 -111 136 182 -244 -218 145 279 -249 -331 -200 147 -156 -208 -32 154 43 -14 72 370 250 -238 -21
3273 -21 75 53 -159 -285 253 46 -378 -215 65 134 -418 -173 40 48 -319 -134 47 144 -244 -37 268 125
3295 125 -95 -46 218 241 5 -246 -4 34 -321 -309 -100 164 -62 -320 144 133 153 -50 65 266 263 -89 79
3318 79 253 348 -275 -119 125 18 -164 -212 -58 -99 -283 -190 222 145 -93 -88 204 400 56 -199 198 198 70
3341 70 -278 114 232 117 -294 -45 63 -128 -77 104 120 -88 -177 -46 360 43 -200 100 427 136 -212
3362 -212 -64 200 -71 -185 -38 131 29 -202 -72 -5 -10 -373 -393 62 186 -119 -7 172 157 -67 -150 85
3384 85 271 149 -353 -21 248 31 -243 -17 10 -74 -293 -11 204 71 -251 -18 123 211 -63 95 379
$$ packed form
3230B84n90K93L09j47l66J02K87l98k13K05J27L7J25k5Q7j11q1j33L45L91l80
3251A48k59K47M6m26K6L63J34n28q2J31L47l03n2J76J86j11n7Q6K98j20m88K17
3273b1R6k2k12j26N38k07m24J63K80O9n52K45K13Ql67J85J81R7l88K07L05j43
3295A25k20M9K64K3k36k51K42L8l55J2K09K64k26k58M64j1K0k03J15K01ll52J68
3318G9J74R5o23J56K44j07j82m8J54m1j84R3M12p7k38NK92J96l44k55L97%j28
3341G0l48L92J18j15m11K49J08j91N1J81J6k08q9J31M06l17k43L00L27k91l48
3362b12J48K64k71j14J47J69j02k31J30O7nl63k0M55J24l05J12J79j5k24q3K35
3384H5J86j22n02L32K69k17k74K26K7q4k19K82K15j33l22K33J41Q8k74J58K84
$$ plain form
3405 379 31 55 -129 143 226 -102 -115 176 207 -27 -297 110 88 -225 -210 140 204 13 -201 96 222 -164
3427 -164 31 131 363 -151 -125 31 242 -48 -251 -127 47 -23 -415 17 119 -26 -254 -6 194 219 -18
3448 -18 122 193 220 76 -107 157 242 -51 -186 191 215 -335 -347 -108 -46 -259 -153 168 119 -110 -74 46 67
3471 67 214 -11 118 74 176 64 -6 121 152 -143 -32 82 -413 -398 12 265 -191 -208 139 112 -85 -51 256
3494 256 404 135 131 -162 -97 131 9 -258 121 257 -402 -485 -21 106 -324 -38 193 313 25 13 251 101
3516 101 224 58 130 -21 19 -97 -141 210 283 -254 -143 75 10 -355 -268 208 -121 -69 103 101 -173 13 36
3539 36 -10 237 106 -140 -194 117 152 -367 97 388 -34 -283 178 47 -405 -73 109 159 -138 110 142 -76
3561 -76 -115 123 17 38 32 -164 -159 -90 151 -280 27 290 60 -412 -157 237 -102 -286 139 123 63 6 -42 -11
$$ packed form
3405C79l48K4j84K72Q3l28j3K91L1k34k70M07k2l13J5L50O4j91k14K97J26l86
3427a64J95J00K32n14K6J56K11k90k03J24J74p0l92M32J02j45k28K48K00K5k37
3448a8J40P1K7j44j83K64Q5k93j35L77K4n50j2K39O2k13J06L21m9k29L6J20K1
3471F7J47k25J29m4J02j12p0J27L1k95J11J14m95J5M10K53m56j7L47k7j97L4L07
3494B56J48k69mk93O5K28j22k67L79J36o59q3M64J27m30K86K31J20k88j2K38j50
3516A01J23j66P2j51M0j16m4L51P3n37J11K18o5l65Q7M76l29N2J72kk74J86K3
3539C6m6K47j31k46n4L11L5n19M64K91m22k49M61j31m52L32J82N0k97K48L2k18
3561g6l9K38j06K1oj96NO9K41m31L07K63k30m72K55L94l39j84M25j6o0n7m8L1
$$ plain form
3585 -11 79 123 -189 -175 100 -111 -189 -120 113 91 -301 -168 207 -345 -450 119 241 -30 -85 306 36 22 35
3608 35 132 73 223 93 -56 -88 113 -280 -326 53 96 -181 -278 154 85 -297 -8 233 122 222 79 62 -11
3631 -11 239 81 -83 96 53 -215 -166 -114 129 -348 -30 271 -116 -378 33 135 -181 -117 185 380 93 57
3653 57 -109 -20 252 234 136 145 233 72 -367 -96 270 -127 -197 251 134 -220 -230 218 234 -97 125 145 -26 -25
3677 -25 -22 -184 10 44 -141 -358 -19 -112 -292 -78 199 38 -264 115 351 64 -135 53 139 -95 177 -8
3699 -8 -12 -121 -210 -135 -44 -18 -29 -277 -105 217 -214 -130 226 220 -168 -42 190 3 -42 -185 113 28 -192 102 -52
3724 -52 -29 -18 23 -4 64 25 -351 -275 142 -2 -197 53 84 62 -143 8 182 31 -127 142 99 67 16 -133
3748 -133 -266 51 -233 -118 -148 145 -47 -19 2 162 41 33 256 60 12 -53 -19 177 -78 74 75 -23 -110 -141
$$ packed form
3585a1R0M4l12J4K75k11p8O9K33k2l92J33L75n52j05N69J22k71n5L91k70j4J3
3608C5R7n9J50j30j49l2K01l93m6L79M3k77r7M32o9l82K89K41j11J00j43j7p3
3631a1K50j58j64J79m3k68M9N2K43m77L18L01l87k62M11J02l16O4L02J95k87l6
3653E7j66Q9K72j8r8RQ8j61m39K71L66l97p0M48j17l54j0M48J6l31K22K0j71J
3677b5Lj62J94L4j85k17L39r3j80K14K77j61l02L79K36k87j99J88Q6k34K72j85
3699hmj09q9P5R1K6j1k48J72L22m31Q4L56ol88J26K32j87m5j43K98q5k20K94j54
3724e2K3J1M1k7O8l9l76P6M17j44j95K50L1k2k05J51J74j51j58K69m3l2n1j49
3748a33j33L17k84J15l0K93j92K8K1J60j21qK23j96m8o5L4J96k55J52Jr8q7l1
$$ plain form
3772 -141 -211 31 35 -100 -60 84 147 -51 -84 242 252 -138 -51 47 186 -85 53 362 111 -174 -121 72 142 19
3796 19 -156 -175 160 -86 -104 148 103 -127 13 246 316 45 37 11 8 119 -47 -64 -18 -77 -77 -298 -76 50 -207
3821 -207 -158 -24 174 -132 -107 84 291 -133 -115 68 91 19 -58 73 -4 -160 -74 -44 -143 -98 -77 -14 21 56 -167
3846 -167 20 -55 127 4 135 92 82 -21 48 197 -20 -22 34 40 123 -271 -144 -54 -16 -213 82 133 202 -57 9
3871 9 245 -38 34 -34 4 242 -215 -34 146 132 -174 -239 14 -55 13 -207 -158 116 101 -85 -105 157 49 -143
3895 -143 86 294 249 -92 -64 211 54 -91 -165 -3 10 -280 -32 -18 55 -298 -201 -23 118 -172 -201 -48 248
3918 248 114 -100 152 22 -33 64 37 221 -61 73 -29 131 -117 -92 51 -35 -153 3 3 163 105 -89 56
3941 56 385 103 95 4 16 34 -23 -130 -17 78 -74 -283 -81 11 22 -148 -11 83 -146 -25 62 253 -125 -203
$$ packed form
3772a41p0K42Mj35M0J44O3j98l3L26J0l90Q7R8J39k71J38L09k51k85N3J93P0j23
3796A9j75j9L35k46j8K52m5k30J40K33P0k71qk6lJ11j66j7M6n9%k21K22J26k57
3821b07M9J34J98l06K5J91K07m24J8J83K3p2p7J31p7j56Q6L0r9M5K1O3L5L5k23
3846a67J87p5J82j23J31m3j0j03O9J49k17kN6OQ3l94J27R0L8j97K95N1O9k59O6
3871IK36k83P2o8L8K38m57J81J80j4l06o5K53o9O8k20M9K74j5j86k0K62j08j92
3895a43K29K08m5l41K8K75j57j45p4J62J3k90K48J4P3l53R7J78J41k90k9J53K96
3918B48j34k14K52j30n5R7k7J84k82J34j02J60k48K5J43q6j18J56%J60n8j94J45
3941E6L29k82qr1J2J8n7j07J13R5j52k09K02R2J1j70J37R4k29J21Q7J91l78p8
$$ plain form
3965 -203 171 -56 5 -158 -43 51 -70 -64 -202 133 -18 -57 49 63 114 -336 -252 110 61 41 -86 241 45
3988 45 8 -20 54 67 -134 -104 22 -186 -90 -243 111 93 -79 -30 -244 120 150 -85 -26 128 13 -204 178 -32
4012 -32 -149 -181 200 -117 -29 -133 -9 109 28 -128 -38 76 106 -100 -41 241 397 26 -110 183 258 -116 46
4035 46 97 67 -181 -174 -59 9 -53 130 -42 -109 132 41 -123 136 16 -117 -101 121 14 -44 136 122 -21 -229
4059 -229 -49 -28 -81 -256 119 35 -36 -53 9 78 85 98 -14 76 305 -70 -102 60 179 -156 -34 154 229 -125
4083 -125 32 100 -54 -86 -93 18 3 3 -50 -160 143 17 -1 -75 200 121 -55 -4 16 108 -158 38 -42 -73 -164 -34
4109 -34 -152 -114 130 66 -1 139 209 -113 106 277 -35 -178 31 123 -19 -44 318 -27 -252 -104 -174 -212 -85
4132 -85 -73 -102 -89 -129 175 -166 -97 187 -121 -3 95 95 -157 71 241 16 40 28 134 21 -132 -73 27 -152
$$ packed form
3965b03L74k27O1j63J15R4j21Oj38L35j51l9J06J4N1m50Q4L62m9k0j27L27j96
3988D5l7k8P4J3k01L0J26k08R6j53L54j8j72M9k14L64L0k35N9J54j15k17L82k10
4012c2j17l2L81l17Q8j04J24J18q1j56R0J14L0k06N9K82J56l71j36K93P5l74J62
4035D6N1l0k48PJ15O8o2J83j72o7K41r1j64K59j20j33J6K22j07n8J80j4j43k08
4059b29J80K1n3j75L75q4p1j7O2O9PJ3j12R0K29l75l2J62J19l35J22J88P5l54
4083a25J57O8j54l2pJ11j5%n3j10L03j26j8p4K75p9j76N1K0R2k66J96q0l1r1J30
4109c4j18L8K44o4o7J40P0l22K19J71l12j43K09R2j42k5L62l45k25J48p0l8J27
4132h5J2k9J3m0L04l41O9K84l08J18R8%k52K28J70k25K4j2J06j13j53N9J00j79
$$ plain form
4156 -152 8 100 230 154 133 -15 8 191 114 -99 -18 181 -12 -64 53 102 -24 -41 -189 -141 -311 -184 30
4179 30 121 180 20 -46 28 100 -7 67 126 245 -62 -67 -21 63 -292 4 189 51 -25 -191 -50 -144 -9 51 -11
4204 -11 63 77 -63 -11 116 91 43 -61 155 -167 -74 28 172 -120 -107 -22 -25 -211 -324 -120 67 -38 61 -142
4228 -142 148 393 244 22 131 285 -116 -142 -58 50 -171 -18 136 -128 -106 -212 83 33 -133 44 -56
4249 -56 138 87 34 24 338 -47 2 -27 148 70 -55 0 -62 33 -231 111 -7 -192 -173 -85 21 -24 -130 88
4273 88 178 135 23 55 60 -57 -21 46 181 24 -47 21 60 35 -111 41 151 -72 -86 -39 199 153 36 -19 -79 198
4299 198 186 -69 60 92 17 -299 -82 12 -42 -254 -42 128 -183 17 98 64 -76 100 103 63 78 16 33 -20 200
4324 200 22 62 33 -30 -57 -162 54 -127 114 -160 130 153 7 -32 22 152 37 186 -20 -290 -184 -76
$$ packed form
4156a52J60R2J30p6k1j48K3J83p7k13Q1J99j93n2J17M9j26j7j48M8j70J27K14
4179C0R1N9j60o6P4P2j07P4N9J19l07nM6Q4l55K96J85j38p6j66J41r4J35O0o2
4204a1P4J4j40N2J27k5m8j04K16l22R3J02J44k92J3Q5lj86j13K04J87j05R9k03
4228a42K90K45j49k22J09J54m01k6Q4J08k21J53J54k64K2j06K95n0j66J77j00
4249e6J94n1n3j0L14l85M9k9J75p8j25N5o2R5k64L42j18j85J9Q8J06m5j06K18
4273H8R0m3j12L2Nj17L6O7J35j57p1O8L9k5j46J52J10k23j4M7K38m6j17n5o0K77
4299A98j2k55J29L2p5l16K17R4n4k12K12J70l11K00Q1l4j40J76Lm0J5o2J7n3K20
4324B00j78M0k9o3k7j05K16j81K41k74K90K3j46l9N4J30j15J49k06k70J06J08
$$ plain form
4346 -76 -45 368 196 420 -198 405 -284 -114 -272 -257 524 -215 464 148 -144 -396 -5 -266 -234 163 45
4367 45 318 -147 406 -54 288 10 -83 -241 -33 169 -39 -228 52 5 -81 10 -39 -5 118 -23 -115 66 217
4390 217 -111 -183 173 62 -270 -137 25 4 -59 -51 -46 116 -205 -123 192 42 26 141 13 157 112 -21 228
4413 228 152 11 51 -110 -53 49 -36 -55 17 -243 -163 -140 10 23 -134 84 -4 43 28 32 50 163 -142 -3 155
4438 155 128 -23 -87 127 -37 -16 -47 -24 120 -95 -59 62 109 35 -126 105 -7 -17 87 73 94 -40 -227 23
4462 23 -39 53 -119 -99 82 -24 -153 -96 213 17 -129 -89 214 60 -107 45 38 189 -81 -127 130 215 42
4485 42 -177 -17 148 -106 -131 92 -71 -211 -58 131 20 -137 221 97 76 24 33 79 59 241 -66 -100 99
4508 99 -60 -105 -88 -8 -105 -261 119 -67 39 -79 -30 83 -23 42 40 83 16 82 22 42 -33 -183 -36 -34 91 19
$$ packed form
4346g6L1M13j72K24o18O03o89J70j58J5P81p39O79l16k92k52L91k61L2L97j18
4367D5K73m65N53m60L42k78r3j58K08K02k08j89K80m7q6R1m9L4J23j41r2J81J51
4390B17l28p2L56j11l32J33J62k1o3QNJ62l21Q2L15j50j6J15j28J44m5j33K49
4413B28p6j41M0j61N7J02q5j9P2k60Q0K3J50J3j57K18q8M7j5MJ8J13l05J39J58
4438A55k7j51o4K14j64K1l1K3J44k15L6J21M7p4j61K31j12j0J04j4K1j34j87K50
4462B3o2R2j72K0J81j06j29N7L09j96j46M0L03j54j67J52pJ51k70m6K57Q5j73
4485D2k19J60J65k54k5K23j63j40J53J89j11j57L58j24k1n2RM6k0J82l07l4J99
4508I9j59m5J7Q0r7j56L80j86J06j18M9J13j06O5kM3o7O6o0K0p5j50J47KJ25p2
$$ plain form
4534 19 -149 5 -18 -46 -123 39 8 36 -58 74 35 -9 93 -11 11 43 -2 -182 151 137 -233 -127 89 -56
4558 -56 -185 -121 62 -117 -180 -52 55 3 -69 99 159 -99 9 140 38 -16 210 -294 11 45 182 -187 98
4581 98 -64 -18 -146 -39 191 -28 24 73 124 20 99 159 128 -41 -54 -25 6 97 73 -210 175 -19 -102 -43 223
4606 223 153 -132 -78 -10 45 -68 102 122 144 -166 42 -142 47 72 -186 -43 49 7 -63 -17 265 -129 -55 180
4630 180 208 48 63 88 162 99 -31 -140 55 35 -28 -174 -66 123 -151 -277 73 5 -89 -203 233 43 -220
4653 -220 197 51 2 -120 255 196 13 110 21 -146 -84 34 174 -107 154 60 69 -98 105 102 -81 -32 -39 -123 29
4678 29 18 155 32 31 43 95 -60 -93 -23 -201 60 14 -177 -57 83 1 -178 34 131 -135 15 228 37 -206
4702 -206 -82 70 -126 22 -5 -98 40 -102 -123 -107 127 153 -128 -110 94 249 -80 -40 3 20 -113 -32 60 9
$$ packed form
4534A9j68J54k3k8p7J62l1K8r4J32l9m4J02j04K2L2m5j80L33j4l70J06K16j45
4558e6j29O4J83j79o3J28J07n2p2J68O0k58J08J31j02n4K26n04L05L4J37l69K85
4581I8j62M6j28J07K30k19N2M9N1j04P9O0l1j69j3K9L1R1k4k83L85j94q3N9K66
4606B23p0k85N4O8N5j13J70K0K2l10K08j84J89K5k58J43R2m2p0M6K82l94P4K35
4630A80K8j60J5K5P4o3j30j09J95k0o3j46J08J89k74j26L50o8r4j14M36j90k63
4653b20M17j46m9j22L75n9j83R7q9j67O2J18J40k81K61r4Rj67K03lj83M9pq4J52
4678B9j1J37j23jJ2N2j55l3P0j78K61m6j91J20J40q2j79K12R7k66J50K13j91k43
4702b06J24J52j96J48k7r3J38j42k1J6K34K6k81J8K04J55l29M0M3J7j33Q1R2n1
$$ plain form
4726 9 161 27 51 8 -71 -6 -15 52 -207 -14 7 56 -52 -31 110 75 -103 -74 83 -37 -90 -130 98 35 54 -28
4752 -28 -42 145 -192 80 -89 -23 -129 48 -137 45 51 -165 41 92 29 -22 -64 -135 179 79 92 -36 12 -77
4776 -77 -16 -23 -144 -77 -141 141 56 -167 109 -20 32 -113 6 -101 64 -5 -136 -68 333 -25 -80 -139 98 36
4800 36 -20 27 -50 168 -121 -74 -13 33 -114 99 22 108 -71 77 52 67 -97 -148 90 45 -56 -62 142 18 -139
4825 -139 -264 -190 208 115 48 114 144 9 -222 77 176 7 32 47 62 -186 -291 -3 -100 -124 122 92 -263 -105
4849 -105 -115 -145 -4 55 -2 24 17 123 -83 -291 -46 166 40 2 -67 55 131 -139 24 55 103 142 200 27 -74
4874 -74 -155 -11 47 97 141 -105 155 51 -154 22 163 92 -165 -113 -78 114 -92 -27 28 -51 -73 91 39 -25 -210
4899 -210 45 -42 -86 -132 117 71 -59 -53 -149 -14 76 -47 -41 59 7 20 -29 -82 75 111 64 -41 84 198 72
$$ packed form
4726IJ52j34K4m3p9O5rO7k59J93K1M9j08K1J41l5j78K9J57j20n3m0K28o3J9q2
4752b8j4J87l37K72j69O6j06J77j85J82Ok16K06N1o3n1m2p1L14j00J3j28M8q9
4776g7O1pj21O7o4K82q5k23K76j29N2j45J19j07J65o9j31O8M01l58n5n9K37o2
4800C6n6M7p7K18k89M7O1M6j47K13p7Q6j79J48k5J5j64n1K38m5j01oK04j24j57
4825a39j25P4L98r3o7O6L0j35k31K99R9j69K5J5J5k48j05K88r7k4K46l0l55J58
4849a05j0l0J41N9n7K6pJ06k06k08K45K12j26l8o9J22P6k70J63L1M8L9N8j73j01
4874g4q1J44N8N0M4k46K60j04k05J76J41p1k57N2L5J92k06O5N5p9k2J64n2o4j85
4899b10K55q7m4m6K49m6j30Or6J35R0j23OJ00n2J3m9n3J57L6m7j05J25J14j26
$$ plain form
4924 72 -67 2 -45 -70 14 129 84 -10 0 3 -80 -41 262 107 -50 -29 46 64 -41 -121 -165 -67 39 35 126 -115 203
4951 203 65 18 -58 7 -287 7 8 110 58 -169 -6 39 30 115 29 50 33 47 34 278 -13 74 38 140 13 25
4977 25 45 -47 -4 -107 -93 -31 -81 -140 107 -121 12 -17 16 -157 -72 113 12 37 192 -125 43 2 -150 102
5001 102 -160 -44 -6 162 -15 -98 22 -8 45 128 -41 115 130 211 67 148 -26 -155 96 -29 -178 31 -8
5024 -8 -33 49 122 15 28 10 49 -36 -25 191 -204 -67 85 -74 -38 85 -40 89 -55 29 256 -160 -31 216
5048 216 44 40 -5 -192 32 103 -98 20 84 146 -3 -5 102 -72 -131 -119 169 -221 -154 -44 117 -55 121 89
5072 89 -54 -30 162 64 46 104 143 164 -11 176 133 -134 -390 41 -258 74 81 165 62 -88 95 -142 19 -59
5096 -59 -44 -59 -47 160 -27 -91 -34 -125 -90 1 83 -101 25 62 -103 25 13 -98 -88 -67 -16 -17 -78 -10 42 -26 -107
$$ packed form
4924G2j39O9m7k5Q4J15m5r4J0Lq3L9L03j55j57K1P5J8j05q0m4R8J06mR1k41L18
4951B03j38m7p6O5k94K94JJ02n2k27J63M5rQ5q6K1j7J4j3K44k91Q7l6J02j27J2
4977B5K0r2M3j03J4O2n0n9K47k28J33k9L3j73Q5J85j01K5J55l17J68m1j52K52
5001A02k62J16L8J68j77q3J20l0N3Q3j69J56J5Q1j44Q1j74j29K51j25j49K09l9
5024hk5Q2P3j07J3j8L9q5J1K16l95J37J52j59L6J23j25J29j44Q4K27m16J29K47
5048B16j72mm5j87K24P1k01J18O4O2j49kJ07j74n9J2K88l90O7J10J61j72J76l2
5072H9j43K4J92r8j8N8L9K1j75J87m3k67k56M31k99L32PQ4j03j50J83k37J61p8
5096e9J5j5J2K07j87o4N7r1L5R1Q2j84J26L7j65J28j2j11J0K1N1jo1O8N2o8q1
$$ plain form
5123 -107 5 54 -20 -146 56 -166 44 189 284 -116 55 12 -34 -185 -2 62 -11 -99 117 71 26 32 48 3 179
5148 179 115 -42 -40 -162 -97 3 -59 -57 150 -201 -15 -109 -66 -78 -46 -142 42 281 -30 192 -19 140 -105 103
5172 103 -8 -89 85 -6 118 115 162 -85 27 -82 -8 9 9 -102 -11 -111 36 169 76 175 44 -96 -17 80 -21
5197 -21 72 -42 11 127 -61 19 189 100 -146 103 44 158 145 14 -141 24 -17 3 8 78 92 18 -287 159 65
5222 65 7 9 98 2 -12 -129 240 26 10 86 68 134 -137 -169 159 -57 116 24 -43 165 134 50 -15 -40 -37 -262 109
5249 109 -59 -16 29 100 86 -102 24 -51 -101 -30 51 -184 264 38 6 -61 131 55 43 -106 162 -227 -32 200
5273 200 70 -24 -17 38 256 -20 66 70 -1 117 -112 -47 159 25 -125 93 -4 -19 -98 -119 -21 58 -152 89 53
5298 53 51 -119 -41 23 -54 -72 -47 44 44 282 82 -141 99 31 -142 -16 -246 55 -17 -120 49 132 155 89 -50
$$ packed form
5123a07J12M9p4j26K02k22K10J45R5m00J71m3m6j51J83O4p3q8K16m6m5OJ6m5J76
5148A79o4j57Kj22O5J00o2KK07l51J86r4M3j2L2r6J84K39l11K22k11J59k45K08
5172A03j11q1J74r1J24lM7k47J12j09P4J7%j11R1j00J47J33r3R9j31j40P9R7j01
5197b1R3j14N3J16j88Q0J70q9k46K49n9J14j3j31j55J65m1K0NP0J4p4l05M46r4
5222F5n8KQ9r6j4j17L69k14j6P6j8O6k71l2L28k16J73r2o7K08l1q4o5k5Lk25L71
5249A09j68M3M5P1j4j88J26p5n0P1Q1k35M48k26l2o7J92p6j2j49K68l89J95K32
5273B00j30r4PN5K18k76Q6Mp1J18k29O5K06j34j50K18r7j5p9k1R8P9k10K41l6
5298E3kj70P8O4p7j8K5R1%K38k00k23K40o8j73J26k30L01p2j03J69Q3K3o6j39
$$ plain form
5323 -50 79 63 -77 150 39 117 288 -43 123 -49 51 66 23 -48 68 -86 -119 43 58 -239 -68 71 -368
5346 -368 -119 63 -346 -179 228 -39 103 119 -302 319 36 57 -147 150 -29 -28 -31 -23 -193 69 60 37 -6 -20
5370 -20 -35 87 163 -106 138 23 -98 75 -46 -5 -38 -115 -19 -83 -3 -151 -35 -23 -58 -151 -30 140 -75 181
5394 181 47 4 -50 99 -93 -14 47 137 207 -63 31 -214 94 19 -82 -62 -55 238 -52 59 22 93 33 13 131
5419 131 -134 162 -11 105 -53 -58 -3 148 -39 -258 120 -74 -7 7 45 -77 -63 -74 -52 7 17 101 37 -25 -106
5444 -106 78 -225 -48 92 -70 -40 -57 -116 24 98 -168 65 106 -3 -65 -101 -2 17 -12 134 -79 9 -71 -160
5468 -160 -158 -161 247 87 95 25 34 -108 -14 -1 261 21 129 -111 -83 -14 -171 -27 195 23 -23 73 46 100 -173 -2
5494 -2 -63 74 176 -47 87 91 -126 15 -63 -98 -172 28 19 -52 80 -2 212 -87 -84 -216 -209 134 73 -58 -56 171
$$ packed form
5323e0J29j6j40K27j11P8J71l31J66j72J00J5m3p1J16j54l3J62J5k97J71J39m39
5346c68K49J82m09J67M07k67J42J6m21O21k83K1k04K97j79JlQj70K62rk3m3j4
5370b0j5J22P6k69K44j15j21J73j21M1l3p7R6o4Q0j48J16J2l5r3J21J70k15K56
5394A81j34m3n4J49j92P9O1R0P0k70R4k45L08p5j01K0PK93k90J11l7P1o0k0J18
5419A31k65K96j73J16j58nN5J51j87k19L78j94O7J4L8j22J4j1K2N9J0Q4o4o2q1
5444a06J84l03J77J40j62L0j7n9J40P4k66K33M1j09o2l6R9J9k9J46k13Q8q0q9
5468a60KlM08j60Qp0Rj42R4J3K62k40J08k40K8O9j57J44K22j72m6R6k7N4k73J71
5494bo1J37J02k23J34Mk17J41p8l5p4K00rp1J32q2K14k99Lj32PL43o1j31KK27
$$ plain form
5520 171 -28 107 -165 203 310 -33 56 55 187 32 4 30 -179 30 -98 173 -55 -189 -123 -10 121 -12
5542 -12 -191 154 -128 36 188 -66 -29 -105 26 -19 -19 -91 -48 7 97 60 -58 -195 -124 -21 -62 -57 44 181 -29
5567 -29 10 -5 30 -128 38 209 36 -27 -22 -176 -98 -30 -25 -170 155 107 -12 6 41 182 -141 -26 8 -30 -123 -2
5593 -2 -71 -1 -59 67 -65 63 43 -14 -86 -92 -45 139 133 94 170 100 152 -182 -65 -247 100 87 10 40 -161 47 -150
5620 -150 220 5 -383 -150 -86 191 37 131 -359 -217 75 173 -148 -661 261 -52 -194 7 213 -455 -128
5641 -128 158 -257 70 -37 -116 -176 440 -310 -341 -384 -70 -254 55 88 -341 155 212 161 235 323 363 -43 -17 8
5665 8 141 -29 -27 -137 47 -10 16 87 16 52 17 -181 34 -164 30 279 -273 23 158 -53 -87 417 79 -82
5689 -82 -75 75 10 -212 -208 -197 -104 254 207 -337 -267 -133 74 -2 -175 -232 543 -130 -92 490 -177 47 109 183 -256
$$ packed form
5520A71j99J35k72L68J07l43Q9jJ32j55k8K6k09K09j28K71k28j34O6J13J31j33
5542a2j79L45k82J64J52k54L7p6J31m5%p2M3N5R0l7j18j37P1J03m1NJ01J37k10
5567b9L9j5L5j58J66J71j73o3Nj54P8O8Nj45L25m8j19J8L5J41l23J15L4l8r3J21
5593bo9P0n8J26j32J28k0n7p2oM7J84ol9P6p0N2l34J17j82L47j3p7L0k01K08j97
5620a50L70k15l88K33O4K77j54R4m90J42K92R8l21n13R22l13j42K01K06o68L27
5641a28K86m15L27j07p9o0O16p50l1m3L14j84L09L3m29M96N7n1P4Q8M0m06K6K5
5665HJ33j70Kj10J84n7K6P1p1L6l5j98K15j98J94K49n52K96J35k11l4N04l38j61
5689h2PJ50o5k22MJ1R3L58m7n44P0J34K07p6j73n7P75o73L8N82o67K24O2P4m39
$$ plain form
5714 -256 61 -69 131 26 66 -105 -18 24 28 -10 80 136 -59 35 163 329 65 152 355 319 -22 241 -98 -70
5738 -70 -79 -105 231 -669 291 67 141 66 -107 50 -202 111 -42 4 -111 54 -61 42 -132 6 -170 -12
5760 -12 27 14 102 -90 -107 97 90 -17 -270 -4 -24 40 79 36 84 -88 -332 -100 30 -177 17 -88 -10 42 -41
5785 -41 -24 -12 -24 -30 178 1 138 115 -196 199 65 -50 -132 6 -61 -172 -124 70 69 -34 -86 -55 -17 36 -225
5810 -225 -38 -20 60 -52 130 -31 25 -44 45 56 -19 93 -35 -63 -28 -153 -129 -110 -74 -72 -30 77 46 32 -80 -75
5836 -75 136 -122 26 59 -267 -139 78 -85 79 55 -5 98 -16 76 22 36 -17 -127 -25 65 108 186 -10 -30
5860 -30 124 79 -58 101 67 -6 -47 173 181 74 -158 -103 44 -31 -4 109 99 54 -40 -69 35 81 -19 50 -19 124
5886 124 -80 43 -17 -85 -88 -76 -130 -95 139 -28 -166 52 -44 -54 -13 -87 61 -99 -9 124 -9 -34 -6 91 54
$$ packed form
5714b56L17j30K00j05M0j71Q7M2Ml8R0N6j95R4J28J66k64Q7K03l6l41K63l39K8
5738g0rk6L36r00R60k24P4p5j73J57k52L13j53M6j15J65j15J03j74J38j76J58
5760a2L9j3Q8j92j7K04pj07k53K66k0O4L9m3M8j72k44K32J30k07J94j05P8N2q3
5785d1J7J2j2oK08j77J37k3l11L95j34j15q2J38o7j11M8J94jj03n2L1L8N3k61
5810b25J87J8Q0j12J82j61N6o9Q9J1p5J12j28k8L5j25K4J9L6KM2J07l1j4j12N
5836g5K11k58J48L3l26J28K17j63J64k4o0J03j14R2n4J4n3j10J02R0M3P8j96k0
5860c0J54m5j37J59l4p3m1K20Qj07k32N5J47p5K7J13j0m5r4k9J04M6j00O9o9J43
5886A24k04J23o0o8lJ2n4L5K34j67j38K18r6j0M1p4J48j60R0J33j33k5K8R7l7
$$ plain form
5911 54 -34 15 -88 148 25 -38 -23 117 -83 6 -59 -60 -27 14 174 35 150 -60 25 83 108 140 -137 -115 47
5936 47 -34 -78 -101 -166 163 57 -124 55 106 36 24 142 15 -22 57 100 63 -35 -57 81 51 -5 -32 62 104 -2
5962 -2 -34 102 106 -89 -13 33 53 -73 44 -57 -145 -76 146 -22 35 -87 -4 152 -114 1 -119 -108 26 53 59
5987 59 242 131 -3 -76 -84 69 169 -12 33 197 -141 67 -166 53 -97 24 -114 114 -38 -69 108 73
6009 73 -46 16 -34 -73 61 167 -72 -65 -126 -99 149 -27 -127 65 111 1 -125 -60 48 10 -118 -136 -52 -82 -22
6034 -22 145 27 -72 -85 -68 -12 130 17 138 -163 -80 -88 -72 119 -12 -25 27 26 111 141 -19 -312 168 -138 -38
6059 -38 -4 4 214 165 -47 -142 31 77 250 -236 91 -35 -76 89 -164 -122 -107 -93 149 -304 2 -187 -22 -22
6083 -22 42 0 188 -60 109 -200 125 -58 -25 3 103 -183 -105 92 -80 93 -194 25 -150 -1 -75 76
$$ packed form
5911E4q8M9j03K36j23o3J5J40k00Q9o5jL3M1J60j39J15k10Q5N8K5L2k77K2J62
5936D7q1m4k3o5L29j06j81J79N1p0j2J18j27l7P9M3l7r8k2J38l0n6k7R4M2j06
5962bl2J36Mj95P6M6K0j26J17j01q8O9K22j68N7j22Q3J56k66J15j20J1J34K7O
5987E9J83j11j34p3qJ53J00j81M5J64l38K08k33K19j50J21j38K28j52l1J77l5
6009G3j19O2n0l9J34J06k39Po1K7K48j76j00J92M6j10j26O5J08l8j28j8Q4l0O0
6034b2J67j18r9j3J7N6J42j13J21l01Q3qJ6J91j31j3N2jQ5L0j60k93M80l06J00
6059c8L4QK10m9k12r5J73M6J73m86L27j26m1J65k53M2J5J4K42m53L06j89J65%
6083b2O4m2J88k48J69l09L25j83L3K8J00k86P8J97j72J73k87K19j75J49p4J51
$$ plain form
6105 76 32 -97 -198 118 93 104 26 -188 16 49 -199 -10 57 -19 -49 -93 -87 153 192 41 -149 -121 -9 150 -61
6130 -61 -188 -12 -295 -338 -283 -82 20 200 60 544 391 153 4 -116 -252 598 487 66 -23 17 -172 273
6152 273 294 121 10 -112 -21 -83 -115 27 -17 -150 -139 229 -5 -138 76 -77 -140 -28 -16 -152 -38 -178 42
6175 42 -59 -26 29 -28 78 -177 -35 35 -68 167 5 73 -123 116 61 111 -21 -28 16 105 121 -97 216 -119
6199 -119 34 50 3 68 181 -38 -51 -71 -126 50 -13 117 -80 13 -139 70 -41 98 281 14 29 -40 63
6222 63 317 -202 97 79 -162 -178 -3 65 34 67 4 17 -35 -94 117 123 18 -159 -33 138 15 42 58 130 -38
6247 -38 9 -42 61 -37 -221 -178 45 -65 -35 -28 -40 35 50 50 250 48 50 230 9 3 140 -197 -19 -77 -128 -223 59
6274 59 202 109 -102 -166 139 1 108 83 37 -7 42 225 49 -4 3 58 -50 29 -5 5 4 -134 -7 -40 251 -127
$$ packed form
6105G6m4j29j01L16k5J1p8k14K04L3k48J89O7p6l0m4OK40L9j51j90K8J12J59k11
6130f1j27J76k83m3N5K01J02J80j40M84j53k38j49j20j36Q50j11m21q9M0j89M45
6152B73K1j73j11j22R1o2l2J42m4j33J1L68k34j33K14j53o3J12J2j36J14j40K20
6175D2j01L3N5n7J06k55J42P0j03K35j62O8j96K39n5N0j32pM4Q9J6k18L13l35
6199a19J53J6m7O5J13k19j3k0n5J76o3J30j97R3j52K09j11J39J83k67J5o9J03
6222F3K54n19K99j8k41j6J75O8l1L3o3J3n2n9K11Oj05j77J26J71j23K7J6P2j68
6247c8M7n1J03r8j84M3K23j10L0Pj2P5J5%K00k02KJ80k21oJ37l37J78n8n1r5K82
6274E9J43r3k11o4L05j38J07k5m6m4M9J83j76n3PN5j08P9l4J0jj38J27l3K91l78
$$ plain form
6300 -127 26 112 -94 218 -111 -52 72 30 -97 60 12 7 90 11 167 -85 -8 -36 -70 46 79 -139 188 116
6324 116 -37 -35 27 34 83 108 15 47 -36 9 101 -174 -45 22 -41 29 -284 46 -110 -79 66 1 -13 -69 0 200 44
6351 44 -1 16 78 161 -94 -49 16 101 -46 -59 -133 -188 14 81 58 94 29 113 6 74 -1 13 113 80 116 -23 -202
6378 -202 -70 -19 -84 47 30 -1 11 109 -50 -77 -89 118 -8 -267 -44 28 -79 121 -11 -15 -203 -13 37 -61
6402 -61 29 -103 -109 -183 -197 -144 1 -35 26 52 -85 -1 -151 -111 70 161 97 -68 -36 -228 -163 -60 102 -83 -93 52
6428 52 41 -46 37 17 -158 93 -31 -62 -77 120 18 -25 -43 -15 189 52 40 80 194 -30 38 -38 -160 -21 51
6453 51 -176 26 -64 37 60 49 111 -86 171 -73 127 30 64 150 195 61 -137 -63 10 249 94 -41 -4 -169
6477 -169 59 -83 45 7 73 -56 47 51 -44 -57 -63 179 -115 197 -72 0 93 7 87 52 66 -71 -94 43 -94
$$ packed form
6300a27J53Q6k06L12l29N9J24m2j27J57m8nQ3p9J56k52P7k8l4J16L3k18L27p2
6324A16j53KO2PM9K5r3L2q3M5R2k75J29O7o3P0l13L30j56L1J45o5j4n6O9K00j56
6351D4m5J7O2Q3k55M5O5Q5j47j3p4n5K02O7k3L6o5Q4j07O8p5J4J00l3L6j39j79
6378b02J32N1o5J31j7l1J2R8j59k7j2K07j26k59K23P2j07K00j32mj88J90N0r8
6402f1R0j32op4j4N3J45l6O1K6j37Q4j50M0J81R1o4j65L2j92O5J03J62j85j0J45
6428E2j1q7Q3k0j75K51j24l1j5J97j02m3j8K8K04j37j2M0J14k24O8p6j22J39P2
6453E1k27K02r0J01K3j1O2j97K57k44K00r7L4Q6M5j34j98P4P3K39j55j35L7j65
6477a69K28j42J28l8O6j29J03Mr5j3oK42k94L12k69P2R3q6Q0l5J4j37k3J37j37
$$ plain form
6502 -94 -59 -25 147 -8 -146 -224 -33 -141 51 88 -91 102 285 -48 78 88 -211 115 -20 9 -87 -43 191
6525 191 109 -94 99 -152 -2 54 72 97 -38 -154 -70 44 -41 -30 60 -66 151 0 -63 -111 -110 104 -11 12
6549 12 -88 24 44 68 144 -64 103 145 33 12 -39 96 -246 -116 -102 61 -51 5 -25 -38 -7 -97 -92 131 -130
6574 -130 -61 -23 107 55 50 63 83 60 -19 -104 3 -67 50 -12 -191 53 -7 -115 -158 58 -88 -217 39 45 104 -85
6600 -85 -148 -6 -100 -44 -144 -168 -79 -200 -122 -250 -42 144 -129 137 -54 -48 29 134 103 -40 -39 32 117 34 23 106
6626 106 81 -97 101 -87 88 71 161 108 -20 136 159 42 68 -74 -56 62 104 76 68 165 74 -48 -100 -200 23
6651 23 -258 -63 63 -236 44 25 2 -75 58 -10 -101 -142 141 -77 109 -121 -84 199 -166 196 128 2 -32
6674 -32 -51 -78 -25 -28 -37 125 45 85 79 97 8 33 -72 95 55 -133 39 72 -60 34 -5 57 -75 -153 -66 -72 -35 -161
$$ packed form
6502i4L5L4J72j55j38p8J91j08J92L7j79J93J83l33J26J0k99L26j35K9r6M4K34
6525A91q2k03J93k51J50N6J8K5j35j16Q4J14q5J1R0j26K17j51o3m8JK14j15K3
6549A2j00J12K0K4P6k08J67M2j12k1n1J35l42J30J4J63j12N6l0j3L1r0NK23k61
6574a30O9L8J30n2nJ3K0k3p9q5J07p0J17o2j79K44o0j08m3K16j46j29K56ON9j89
6600h5o3J42r4N6j00k4Q9j21P8j28K08J86k73K66j91OP7J05l1j43JP1Q5q3j1Q3
6626A06k5j78J98j88J75j7R0n3j28J56K3j17K6j42J8J18M2k8qR7r1j22n2j00K23
6651B3k81J95J26k99K80j9k3p7J33o8r1m1K83k18J86k30L7K83l65L62o8j26l4
6674c2j9k7N3lrJ62q0M0oJ8q9K5j05J67m0j88J72L3j32R4l9O2j32p8Q7oL7j26
$$ plain form
6702 -161 144 -97 -7 19 -29 29 -21 0 60 -1 107 -45 32 80 112 53 -87 41 58 28 91 16 -109 -215 -104
6727 -104 98 155 -144 -126 -38 -7 -33 37 0 82 33 -11 -178 -10 39 33 110 -86 -165 55 -136 -106 -24 -83 -79 -184 -207
6754 -207 151 82 -95 144 176 7 -71 147 26 105 119 -174 -96 82 165 -93 -67 -50 -26 36 -39 52 -67 53
6778 53 127 -42 9 103 17 -13 87 102 -52 -72 -78 112 111 -24 22 8 -55 57 -22 -27 -6 -68 -157 -145 -49 113 95 116
6806 116 20 -213 -128 146 -93 131 54 124 -154 196 211 134 44 -29 111 102 23 -73 163 170 130 103 67 -198 -116 143
6832 143 89 91 -155 -33 -39 -10 -96 134 -62 62 -113 159 183 14 42 39 -23 -111 -154 -134 -56 66 -83 49 -64
6857 -64 -218 -3 -106 -10 8 118 136 100 -26 -92 137 -36 -7 -119 222 -112 -148 -37 -158 36 0 195 83
6880 83 -227 -45 -161 -259 2 50 -42 -14 8 125 40 41 63 -63 145 91 86 -75 110 -70 -13 -122 1 -42 47
$$ packed form
6702a61L05k41R0K6m8N8n0K1O0o1J08j52P7M8L2n9j40J28J7l0O3p5j25j06J11
6727a04K02N7k99J8Q8L1k6P0l7Q2m9m4j67J68M9oP7j96p9K20j91L0Q2n9Mj05k3
6754b07L58o9j77K39L2j69p8K18j21P9J4k93P8J78Q3k58K6J7K4O2p5R1j19J20
6778E3P4j69N1R4q6l0J00J5j54k0oJ90jj35M6j4o3J12p9nK1o2q9J2R6J62j8K1
6806A16r6k33Q5K74k39K24p7P0k78L50J5p7r0p3J40rp9r6K36Pm0k7l6k65Q2K59
6832A43n4Kk46J22oK9q6K30j96J24j75K72K4j69K8lo2q8m3K0P8J22j49J32j13
6857f4j54K15j03R6J8J10J8l6j26o6K29j73K9j12L41l34l6J11j21J94l6J95j12
6880H3l10J82j16r8K61M8r2K8K2J17q5JK2j26K08n4nj61J85j80N7j09J23m3Q9
$$ plain form
6905 47 -28 -96 100 -114 69 -59 -12 -68 81 -54 7 -85 72 78 -107 -15 17 56 -67 -138 -19 19 140 -28 2
6930 2 -11 -39 -190 -170 69 52 168 50 101 -49 61 -138 -162 30 -89 227 -134 -44 -38 12 -11 19 74 150 23
6955 23 -117 71 -67 -62 -97 75 -46 125 116 -70 5 -2 -65 -128 -116 -53 1 -181 22 35 -47 -110 211 -95 -48 -73
6981 -73 -65 -27 106 -8 3 -27 -202 3 200 -164 -132 -76 74 -66 34 47 -24 14 -61 68 53 -33 -36 2 157 -57
7007 -57 54 -57 -75 5 65 -34 -44 52 55 83 -27 113 -200 -141 147 -4 1 -66 9 184 -51 -37 -112 -272 68 -135
7033 -135 -130 -5 -49 96 -42 -27 120 76 -36 -149 -51 92 124 -39 44 -136 88 87 110 -16 -6 172 119 -53
7057 -53 -95 -82 93 24 126 36 22 35 87 -7 -31 -3 -78 -51 -143 -178 83 81 -130 -9 -3 -60 13 -169 -7 62 -39
7084 -39 25 20 22 79 182 -39 -9 157 70 124 59 9 -33 -46 -4 65 -109 143 -145 -57 -19 -38 90 -83 117 270
$$ packed form
6905D7p5o8J96k14J83j28M7n6J49j35O1r2J57Oj85R2L2L9j23p1J19L8J21j68L0
6930Bj3k8j51K0K39j7J16j18N1j50J10j99k4J92j19L16l61R0ON0k3L0N5P6j27
6955B3j40J88j38Nl5J72j21J71rj86P5po3o3J2O3N4j82K03J3q2o3L21l06M7k5
6981g3QL8J33j14J1l0j75K05J97l64L2N6J50j40J00J3p1L8p5J29j5q6lL8J55k14
7007e7J11j11j8Q0O0r9j0R6LK8j10J40l13N9K88j51No7P5J75k35J4p5j60L40k03
7033a35NJ25m4J45j38J5J47m4j12j13R8J43L2j63Q3j80K24jK3j26J0J78n3j72
7057e3m2J3J75o9J02r0j4J3N2r4k4K8p5K7r2l5K61kk11J21On7P3j82J62O9j01
7084c9O4nKN7J03k21L0J66q7N4o5n0m2j3M2O9j74K52k88Q8L8j9J28j73K00J53
$$ plain form
7110 270 71 -41 -204 -73 146 -105 63 10 -42 20 -17 -213 146 36 67 75 -47 -125 -251 164 42 -53 78
7133 78 -11 112 17 239 76 130 -10 -71 -50 -8 58 -144 12 63 183 83 128 49 -34 106 69 -25 86 -98 101
7158 101 -7 -90 -25 41 96 86 -128 -20 -131 76 113 19 119 -37 142 -116 7 -149 -162 -7 -165 58 200
7181 200 136 104 56 -10 -100 132 -59 -45 -13 -133 65 3 -95 31 -78 -29 -33 111 292 -77 15 27 24 91 -85 -7
7207 -7 -9 -140 50 91 -7 -214 34 -26 -55 -163 51 66 -3 40 -100 127 25 58 -6 -35 -152 -6 -54 -140 32
7232 32 21 -15 -271 23 40 79 50 -106 -61 0 7 -51 34 44 125 -35 -78 -35 -93 -32 -59 39 70 68 -66 36 72 -120
7260 -120 -9 -15 25 37 -52 172 -219 -150 -39 17 -55 54 41 -92 87 83 -26 -374 -91 162 -111 -14 84 -18
7284 -18 -72 -27 -103 56 -161 141 -90 -48 63 -183 -234 17 33 163 -67 -81 34 -219 10 -179 -8 -1 -125
$$ packed form
7110B70j99j12j63J31K19k51J68n3n2O2l7j96L59j10L1Qj22p8j26M15j22r5J31
7133G8q9J23r5K22j63N4j40o1K1M2O6k02J56N1J20j00M5p9q3J40l7r4J11j84J99
7158A01j08q3O5O6N5j0k14J08j11K07L7r4J00j56J79k58J23j56j3J55j58K23J42
7181B00o4l2m8o6r0K32j91J4L2j20J98o2r8J26j09M9mJ44J81l69R2J2lO7j76P8
7207gkj31J90M1r8k07K48o0k9j08K14J5o9M3j40K27j02L3o4k9j17J46m8q6J72
7232C2j1l6k56K94J7L9k9j56M5O1Pn8Q5J0Q1j60m3M3n8O1k7R8L1kj34J02L6j92
7260a20J11oM0J2q9K24l91O9J11N6p2J09j3j33J79mj09l48K83K53k73R7R8j02
7284a8n4M5p6J59k17L02k31M2J11k46n1K51J6J30k30j4J15k53K29j89J71Pj24
$$ plain form
7307 -125 -30 -26 -86 -86 50 70 58 -77 27 -21 64 -5 72 72 -63 199 -64 -25 -204 -24 39 -46 101 -58 -51 -197
7333 -197 47 92 44 56 18 -38 -129 100 34 -51 -50 -14 106 -91 -163 -237 33 -90 -76 93 -52 71 -75 -39 -73
7358 -73 -66 198 -44 266 -18 -107 121 -78 -44 -3 -217 -28 -78 33 71 82 128 105 -148 5 -270 -73 -41 -107
7382 -107 14 44 -91 55 -59 19 -44 -133 87 -28 -76 47 -14 -296 -22 -107 137 50 113 -87 11 66 54 197
7406 197 -153 39 -75 -67 -123 -79 -4 91 15 -40 -179 -5 31 13 -18 -73 -17 -112 -54 -47 -29 47 -66 48 -45 14 76
7433 76 -113 -4 49 -6 116 -34 40 -46 70 -80 103 32 -32 140 -5 -133 86 -64 -249 193 -7 56 -131
7456 -131 -11 -2 -47 -109 162 -15 -39 32 106 -25 48 42 -52 52 -45 15 34 152 71 33 94 24 -43 34 -75 -31 -3
7483 -3 -48 126 129 -14 256 -20 -76 -51 -70 69 107 -53 241 117 -116 5 -67 -56 -104 22 -42 -93 -103 -46 -2 78
$$ packed form
7307a25R5Mo0%J36K0j2j35J04m8Q5o9P7%j35K62k63L9j79J80O3q5J47j59Pj46
7333a97K44M5m8J2l8n6r1K29o6q5JL6J20j97p2p4K70j23J4J69j45J23j46L6l4
7358g3PK64k42L10k84q9K28j99L4M1k14J89n0J11L8J1M6k3k53J53k75J97L2o6
7382a07J21L0j35J46j14P8o3q9K20j15m8J23o1k82K74q5K44q7O3k00R8N5j2J43
7406A97l50J92j14Qn6M4P5R5p6n5j39J74L6j8l1n5N6r5N8PJ8P6j13J14r3N9O2
7433G6j89J09N3n5J22j50P4q6J16j50J83p1o4J72j45j28K19j50j85M42k00O3j87
7456a31J20Rm5o2K71j77k4P1P4j31P3or4J04r7O0J9J18q1l8O1p0o7P7j09M4K8
7483cm5J74Lj43K70k76n6K5j9J39L8j60K94j24k33J21p2J1m8J26o4n1j0N7M4Q0
$$ plain form
7509 78 71 54 39 -104 -40 21 -14 -99 47 144 110 -71 -26 -34 -30 -31 -125 1 135 1 -57 -75 -51 -69 16 131 121 -143
7537 -143 -4 53 -66 -16 72 -90 -239 -133 -213 -102 -29 -3 -55 154 87 180 34 187 87 -131 -143 5 76 -111
7561 -111 -141 8 -240 -65 17 72 320 133 -65 -15 -60 -48 11 32 -208 -34 -75 -36 -13 81 -64 -26 34 185 79
7586 79 -41 -74 63 23 -135 -147 -40 -7 -20 179 108 61 33 -146 -76 80 -12 -115 -90 108 78 -59 88 57 -13
7611 -13 -34 -61 -15 -86 -2 46 22 28 153 -173 -228 127 -96 -10 -40 91 -54 -80 -181 -48 87 141 110 30 -23 -18 -11
7638 -11 1 -88 23 22 106 -33 134 -75 -78 -3 72 -91 32 -54 61 -13 -39 9 68 87 66 -104 -57 170 -141 139
7664 139 57 57 -150 -82 14 -54 -26 -89 -24 71 -113 -70 8 52 -122 196 -148 -169 -106 38 -142 -90 3 -132 130 -8
7690 -8 -27 -25 71 -56 71 42 67 41 170 -11 -34 -213 -94 46 -128 86 143 -156 3 -32 162 -105 103 -117
$$ packed form
7509G8pj7j5j43O4O1l5q5J46R7l4j81M5qMjr4J26J34j34n8j8K4j8Q5J15j0k64
7537a43J39N7j19N0Q8j62j49J06q0J11P3K6n2K09o7R3j46J53j00k18j2J48P1j87
7561a11l0J49k48J75Q2N5K48j87j98N0m5J2N9K1k40J74m1L9K3R4j45L8O0J51j06
7586G9j20l3J37m0j58j2J07L3j3J99p1m7k8j79P0J56r2j03K5J98l0j37J47l1p0
7611a3k1k7M6p1Q4M8k4OJ25l26n5L55k23Q6l0J31j45k6j01J33J35N4l1q0n3NP
7638a1J2q9J11jQ4j39J67k09lP5P5j63J23q6J15p4k6M8N9J9k1j70M7K27l11K80
7664A39q2%k07O8R6o8K8o3O5R5j84M3P8M4j74L18l44k1O3J44j80N2R3j35K62j38
7690hj9KR6j27J27k9K5k6J29j81k3j79J19J40j74K14N7k99J59l5J94k67K08k20
$$ plain form
7714 -117 -68 97 302 191 28 -14 -20 71 -51 86 -2 -79 99 -161 -82 23 -5 93 -92 -7 -35 36 22 -135 269
7739 269 114 75 -10 -61 -76 -10 -33 53 -11 -68 -14 -95 -36 141 94 -15 93 -52 -65 79 -33 -144 -12 76 93
7764 93 -144 -163 45 -31 -19 -191 63 56 -62 44 12 -28 64 -107 53 149 64 -29 51 14 -133 174 3 301 149
7789 149 -94 -47 -94 -170 33 -86 -10 108 -95 16 135 -90 163 152 9 52 -47 -52 11 -86 14 151 -92 -1
7813 -1 4 -40 165 -50 53 -33 72 -27 126 100 -54 107 -95 -64 -39 -240 -159 -13 145 64 -66 -87 98 63 -4
7838 -4 84 133 -6 -62 178 90 -95 -82 55 145 30 17 110 -47 -72 -78 93 9 -52 -48 -112 10 -31 207 2 -83 96
7865 96 -102 -36 -111 -6 66 -48 -112 -85 127 -195 -23 101 -102 -9 49 -43 36 -18 27 -27 57 8 -63 93 75 -21
7891 -21 54 -40 85 75 91 178 158 -244 27 -43 -50 -32 -140 123 -99 -30 -104 -64 -185 79 144 -52 219 12 -167
$$ packed form
7714a17M9J65K05j11j63m2oR1j22J37q8p7J78k60P9J05k8R8j85Q5k8P1j4j57M04
7739B69j55l9q5n1j5O6k3Q6o4n7N4q1N9J77m7j09J08j45j3J44j12j11J32Q8J7
7764I3k37j9K08p6J2j72K54pj18J06l2m0R2j71J60R6q5r3Q0l7j47L07j71K98j52
7789A49k43M7m7p6K03j19P6J18k03J11J19k25K53j1j43M3r9nO3r7J00J37k43R1
7813aNm4K05k15J03q6J05r9J53k6j54J61k02L1K5k01Q1J46J58q1j30k1J85l5o7
7838dQ8M9j39n6K40q8j85J3J37R0j15j3R3j57k5oJ71q4o1Mo4J22m1K38k05q5J79
7865I6j98O6p5J05P2j14o4K7K12l22J72J24k03R3N8r2P9n4M5n4Q4m9p1J56j8r6
7891b1P5r4J25j0J6Q7k0m02K71p0pJ8j08K63k22O9p4M0j21K64O5j96K71k07j79
$$ plain form
7916 -167 -48 58 165 -84 113 -104 -43 78 1 -95 -18 -50 -14 -117 51 138 146 -63 -176 56 -117 108 -178
7939 -178 6 61 -74 -49 -65 155 240 173 -131 34 42 -170 -117 -210 -201 32 54 -1 99 -159 -52 47 -71 55 161
7964 161 -110 -56 -229 -126 -1 -56 -78 -72 66 -78 101 25 94 -92 -28 90 136 84 -179 144 100 43 2 -82 120
7989 120 83 -146 83 146 -163 24 -15 -106 52 -52 59 -2 120 -45 22 88 284 -32 -38 -123 4 -15 162 -67
8013 -67 -31 -178 -8 79 -130 -273 39 -84 74 45 39 51 -195 -33 90 119 -115 -104 -19 -183 -3 -10 161 29
8037 29 9 131 93 -4 -16 93 93 -3 45 -4 44 33 -101 18 -56 -11 -111 102 164 75 70 69 73 -51 95 -19 15 43
8065 43 42 161 55 109 -99 -47 66 135 -59 -67 125 -59 -258 46 -8 -72 29 109 -111 -42 14 -90 -99 -85 33
8090 33 65 -160 -115 -56 5 -96 -11 4 -221 -99 27 34 18 -43 -233 196 61 -6 -73 33 -161 -25 20 5 86
$$ packed form
7916a67J19J06J07k49J97k17O1J21p7r6P7l2L6j03J68Q7Qk09j13K32j73K25k86
7939a78J84N5j35K5j6K20Q5o7l04J65Qk12N3r3RK33K2n5J00k58J07R9j18J26J06
7964A61k71N4j73J03J25n5k2OJ38j44J79p6O9j86O4J18M6n2k63L23m4n7m1q4K02
7989A20l7k29K29O3l09J87l9r1J58j04J11o1J22j65O7O6J96l16oq5J27j9J77k29
8013f7L6j47J70Q7k09j43L12j23J58k9oJ2k46J62J23K9k34J1Q5j64J80pJ71j32
8037B9k0J22l8r7j2J09%r6M8m9M8j1j34J19p4M5j00K13O2q9njMj24J46j14L4K8
8065D3jJ19j06N4k08N2J13O9j94qJ92j84j99L04n4o4J01Q0k20O9N6j04rJ4J18
8090C3L2k25M5N9O1j01Q5J5k25J22J26Pj6o1j90M29j35o7o7J06j94J36M5j5Q1
$$ plain form
8115 86 -50 54 12 -117 3 -21 146 -41 81 100 36 -158 169 -84 -134 76 135 30 -122 76 -136 46
8137 46 -37 -68 -157 41 -67 -28 -108 9 -44 55 -61 -142 -45 -62 7 -118 44 -184 71 -39 46 -96 -52 211 -4
8162 -4 -60 28 -44 -52 -124 41 -22 -60 -43 -98 67 -23 38 30 -143 -21 -34 50 -59 -105 -100 -32 136 163 59 -113 44 172
8190 172 85
$$ packed form
8115H6j36J04m2j29J20k4J67j87J22J9o4j94L27k53n0K10N9j05j52J98k12J82
8137D6q3l1q9J98j08L9q0J17n3R9j16q1R7j7O9j25J62k28K55j10Q5j42M4K63k15
8162dn6Q8p2qp2J65o3l8J7n5J65r0O1qj73J22j3Q4j09m6NO8J68K7j04j72J57J28
8190A72q7
8191H5
$$ Imaginary data points
##PAGE= N=2
##DATA TABLE= (X++(I..I)), XYDATA
$$ plain form
0 0 0 0 0 0 0 0 0 0 0 0 0 0 0 0 0 0 1 -8 8 -8 8 -8 15 -16 16 -19 24 -25 32 -35 41 -48 52 -59 67 -75 85 -96
38 -96 107 -119 133 -148 164 -182 200 -223 246 -271 296 -327 360 -398 437 -482 533 -591 657 -730
58 -730 818 -920 1043 -1195 1384 -1630 1968 -2459 3243 -4696 8331 -40567 -38735 6786 -37366
73 -37366 -41057 -6243 13495 -4428 -164 16542 32880 37309 28710 7081 12229 24517 3279
86 3279 -23723 -3077 14837 -10742 -32095 -13160 -32 -11120 -11983 5013 9772 7941 10775
99 10775 3453 -5811 5564 12874 -2870 -8877 2661 -2357 -19313 -16102 -4104 -5834 -3248 6004
113 6004 -604 -6807 9487 14095 -3312 4681 30269 20405 -6738 -2100 15153 6280 -9302 -6062
127 -6062 1737 -618 -9052 -20783 -20344 -1845 1701 -17666 -15332 11755 11627 -13554 -9684 19842
$$ packed form
0@%%%%%%%%%%%%%%%%JrJ6j6J6j6K3l1L2l5M3m9N7o7P6q9J00j11J26j42J60j81
38i6K03k26K52k81L12l46L82m23M69n17N67o23O87p58Q35r19J015j124J248j387
58g30J548j738J963k238K579l014L598m427N702p939J3027m8898J832M5521m4152
73c7366l691L4814J9738j7923M264J6706J6338M429q599k1629N148J2288k1238
86C279k7002K0646J7914k5579k1353J8935J3128j1088q63J6996M759j831K834
99A0775p322r264J1375P310j5744o007J1538n018j6956L211J1998j730K586R252
113F004o608o203J6294M608j7407P993K5588r864k7143M638J7253q873j5582L240
127f062P799k355q434j1731M39J8499L546j9367K334K7087j28k5181L870K9526
$$ plain form
141 19842 21520 -95 645 17092 13703 -1555 -7244 -1837 6596 4414 -9864 -13637 1419 4919
155 4919 -11938 -12366 11236 15623 -4413 -6101 8835 6273 -5142 -3345 1024 -1468 -4227 -8210
169 -8210 -12487 -7861 864 -1186 -5557 3575 11309 4896 2549 9734 10889 8175 9399 5743 -1910
184 -1910 -1245 1953 -6956 -14974 -5720 1870 -8746 -15544 -3989 3921 -1194 -4315 1954 9643 9369
199 9369 804 -3515 4085 10504 727 -10720 -834 10687 -2409 -15951 -3203 10699 2023 -8721
213 -8721 -1447 10367 6945 -3716 -3605 6552 10128 -13 -9339 -1418 7965 -2839 -14532 -5224
227 -5224 6059 -1527 -12106 -5900 4835 2140 -5114 -1869 5944 7672 3594 271 3504 8900
241 8900 6173 -576 35 4174 2234 -4333 -5903 -2986 -3030 -4826 -4938 -5576 -4212 478 410 -3172 -103
$$ packed form
141A9842J678k1615P40J6447l389j5258n689N407Q433k182j4278l773J5056L500
155D919j6857m28K3602M387k0036j688J4936k562j1415J797M369k492k759l983
169h210m277M626Q725k050m371R132P734o413k347P185J155k714J224l656p653
184a910O65L198q909q018R254P590j0616o798J1555P910n115l121O269P689k74
199I369q565m319P600O419r777j1447R886J1521j3096j3542J2748J3902q676j0744
213h721P274J1814l422j0661J11J0157L576j0141r326P921R383j0804j1693R308
227e224J1283p586j0579O206J0735k695p254L245P813J728m078l323L233N396
241H900k727o749O11M139j940o567j570K917m4j796j12o38J364M690o8l582L069
$$ plain form
258 -103 6912 6906 372 282 7268 7657 -487 -3830 964 4517 -1111 -9357 -6164 3226 1440 -9097 -7245
275 -7245 5467 7060 -3795 -6054 6454 11217 -192 -6114 3016 9660 919 -8693 -3550 6623
289 6623 2336 -9719 -7439 4412 5380 -5985 -8252 3699 8481 -1072 -6109 1866 7872 2436
303 2436 -4299 -1113 5380 2899 -3664 -3484 2026 2424 -2573 -4776 -255 2668 -779 -3302 -1213 1489
319 1489 1977 -86 -1355 175 2986 3271 -162 -2259 1619 4582 599 -3978 -1778 2787 1310 -4942
335 -4942 -5376 1234 2536 -4111 -6566 763 6088 -411 -6752 789 9905 4067 -5367 -858 9446
350 9446 6910 -4606 -5367 5258 6578 -3949 -8533 -179 5616 -2262 -9757 -3422 6060 635 -8359
365 -8359 -3295 6659 4530 -4868 -3555 5804 6288 -1373 -3688 1986 5342 1083 -3872 -915 4145
$$ packed form
258a03P015oo534r0O986L89q144l343M794L553n628q246L193R390j786j0537J852
275g245J2712J593j0855k259J2508M763j1409n922R130O644q741r612N143J0173
289F623m287j2055K280J1851R68j1365k267J1951M782r553n037P975O006n436
303B436o735L186O493k481o563J80N510L98m997k203M521K923l447k523K089K702
319A489M88k063j269J530K811K85l433k097L878K963l983m577K200M565j477o252
335d942m34O610J302o647k455P329N325o499o341P541R116n838r434M509J0304
350I446k536j1516p61J0625J320j0527m584Q354N795p878p495O335R482n425q994
365h359N064R954k129r398J313R359M84p661k315N674L356m259m955K957N060
$$ plain form
380 4145 2028 -2992 -2070 2373 1975 -1963 -1818 1349 580 -1252 -1334 -1639 -1520 175 -426 -3099 -2968 1102
398 1102 1530 -2599 -2684 2409 4304 1143 -2031 317 4650 3984 -1906 -2685 4423 5832 -2728 -6377
414 -6377 2205 6292 -2485 -7377 1437 6246 -1507 -7226 -2625 4573 1976 -5503 -5107 3026 3939 -4821
430 -4821 -7615 2013 7881 -1101 -6768 2889 8365 363 -4628 2518 8120 3281 -2104 -541 3583
445 3583 2748 -1943 -4031 254 3470 -2611 -8011 -3037 1377 -3310 -6122 -757 1970 -1677 -2619 390
461 390 758 1346 4550 3747 889 3369 5232 1015 -1492 1606 3284 964 -1825 -2968 -2953 -1358 -1100
478 -1100 -4170 -3016 4156 2619 -6102 -4152 5701 4429 -3815 -1716 6399 3705 -5369 -5645 453
493 453 2541 -925 -4641 -2462 4094 2779 -5758 -3708 9047 8997 -2262 -1698 8730 6435 -4885
$$ packed form
380D145k117n020R22M443l98l938J45L167p69j832q2l05J19J695o01k673J31M070
398A102M28m129q5N093J895l161l174K348M333o66n890p79P108J409q560l649
414f377Q582M087q777m892Q814M809p753n719M601P198k597p479L96Q133R13q760
430d821k794R628N868q982n667R657N476q002m991P146N602m839n385J563M124
445C583q35m691k088M285L216o081n400M974M414m687k812N365K727l647r42L009
461C90L68N88L204q03k858K480J863m217k507L098J678k320k789j143J5J595K58
478a100l070J154P172j537q721J950R853j272q244K099Q115k694r074k76O098
493D53K088l466l716K179O556j315q537K050J2755n0j1259N64J0428k295j1320
$$ plain form
508 -4885 -3804 4736 3826 -3106 -5879 -4046 -1819 -3348 -7338 -5524 2517 4150 -4310 -5674 3400
523 3400 5753 -779 733 8335 6174 8 741 1732 405 1638 2988 -270 -2382 -91 -1552 -6067
539 -6067 -3607 1908 225 -2211 -1052 -1481 -2454 187 183 -2455 1466 6693 591 -6809 -474 6237
555 6237 -65 -4703 2474 6397 24 -4655 -1872 2504 3598 901 -1316 2137 5621 -1006 -8759
570 -8759 -1191 8953 1581 -8576 -1956 5117 -2534 -9313 -2520 4776 2386 -2457 -2595 -164 2351
585 2351 1188 -2589 1081 8136 3733 -4981 -1570 5405 1068 -4599 726 5426 729 -3223 -1282
600 -1282 -1169 -1206 1538 915 -1938 -413 1005 -3106 -4936 -512 1944 -238 -218 548 -1897 -1484 1821
617 1821 938 113 5430 6124 -1390 -3223 3632 4661 -2629 -2619 3708 2928 -4119 -5787 -2452 990 623
$$ packed form
508d885J081Q540r10o932k773J833K227j529l990J814Q041J633q460j364R074
523C400K353o532J512P602k161o166P33R91j327J233J350l258k112K291j461m515
539f067K460N515j683k436J159m29r73K641mk638L921N227o102p400O335O711
555F237o302m638P177L923o373m679K783M376J094k697k217L453L484o627p753
570h759P568J0144p372j0157O620P073p651o779O793P296k390m843j38K431K515
585B351j163l777L670P055m403q714L411O975m337n667N325M700m697l952J941
600a282J13l7K744o23k853J525J418m111j830M424K456k182K0P66k445M13L305
617A821q83q25N317O94p514j833O855J029p290J0O327p80p047j668L335L442l67
$$ plain form
634 623 -2787 -3910 2163 3628 -4056 -5815 4066 7398 -1636 -4077 4331 5521 -3106 -4909 1750
649 1750 4329 792 -2845 -2469 1256 1764 -2729 -3460 3023 5763 -1057 -4663 1447 3941 -1680 -2477
665 -2477 2717 2912 -1514 -3008 -1001 -650 -651 -660 -1228 -1099 618 121 -2818 -461 2598 1622 665 1982
683 1982 1321 282 1517 1471 -603 55 3322 624 -4307 -1990 2192 -624 -4453 -1540 1997 659
699 659 -3150 -3235 698 2999 368 -2256 589 5064 1589 -4121 -737 5968 2663 -3746 -1633 3979
715 3979 1503 -4415 -3671 2202 2271 -2469 -3993 -267 2583 -218 -3862 -576 4568 2106 -2976 -703
731 -703 4434 2284 -2357 -1130 3134 1504 -2217 -2242 -135 430 -1041 -2462 -1082 877 188 -1378
747 -1378 -647 1130 1603 717 444 1107 681 930 923 -568 -975 715 862 -1478 -2672 -295 966 -1436
$$ packed form
634F23l410j123O073J465p684j759R881L332r034k441Q408J190q627j803O659
649A750K579l537l637L76L725N08m493p31O483K740o820l606O110K494n621p97
665b477N194J95m426j494K007L51jrn68J29J717m97k939K357L059r76r57J317
683A982o61j039J235m6k074O58L267k698m931K317M182k816l829K913L537j338
699F59l809q5L933K301k631k624K845M475l475n710L384O705l305o409K113N612
715C979k476n918P44N873O9m740j524L726K850k801l644L286N144k462n082K273
731g03N137k150m641J227M264j630l721k5K107N65j471j421J380J959o89j566
747a378P31J777M73q86k73O63m26K49pj491m07J690J47k340j194K377J261k402
$$ plain form
765 -1436 -2947 159 2644 434 -2395 -388 3488 2911 -1752 -1708 3176 3577 -1631 -3724 1211 3635
781 3635 -1703 -4894 -568 2868 -1022 -4888 -1397 3729 1667 -3138 -1551 4436 4022 -1607 -1864 3261
797 3261 4581 -909 -3543 706 2781 -895 -4278 -1718 1411 -192 -3426 -2090 1494 1316 -1130
812 -1130 -896 1733 2511 604 -408 1289 1661 392 -183 -54 350 406 4 -518 -984 -443 904 194
830 194 -1621 -924 1190 1060 -1196 -2023 570 1825 -932 -2890 63 2332 -51 -2990 -437 3418
846 3418 1504 -2710 -874 3723 2725 -2331 -2779 2455 3547 -1986 -4000 472 3408 -803 -4293 -802
862 -802 3428 758 -3442 -1237 3251 1985 -2467 -2017 2540 2475 -2203 -3088 1121 2392 -1043 -2800
878 -2800 -335 2194 331 -1810 -449 1951 1495 -314 114 1719 1417 -43 -139 798 76 -822 -507
$$ packed form
765a436j511L106K485k210k829K007L876n77m663M4M884M01n208k093M935K424
781C635n338l191M326L436l890l866L491N126k062m805J587N987m14n629k57N125
797C261J320n490k634M249K075l676l383K560L129j603l234J336L584j78k446
812a130K34K629P78j907j012J697L72j269n75J29M04N6m02n22m66N41J347p10
830A94j815O97K114j30k256q27K593J255k757j958K953K269k383k939K553L855
846C418j914m214J836M597r98n056m48N234J092n533k014M472K936m211l490L491
862h02M230k670m200K205M488j266m452M50M557o5m678q85M209J271l435j757
878b800K465K529j863k141J361K400m56j809M28J605l02j460r6R37p22q98L15
$$ plain form
895 -507 -782 -1601 -1550 -859 -1474 -2215 -829 614 -94 -1507 -78 2246 2221 278 422 2920 3675 740
913 740 -1627 988 2677 -361 -3956 -1317 2144 -1477 -5338 -2373 2005 387 -2886 -1388 2806
928 2806 2832 -793 -1463 2469 4378 662 -2867 16 3516 -718 -4782 -1276 2581 -351 -3705 -1448
944 -1448 2242 847 -1288 41 2646 2811 823 -746 486 2111 278 -2162 -462 1004 -1277
959 -1277 -3514 -1584 55 -1461 -1586 773 434 -862 486 1346 154 659 2653 1903 205 -166 804
976 804 320 -185 -223 -527 393 703 -1892 -3282 367 2106 -1810 -2621 1849 2368 -2565 -3202 1429 2853
994 2853 -377 -1212 591 1736 320 -1877 -1439 2291 3360 -1081 -2856 1732 3026 -2481 -3425 2548
1010 2548 3700 -1719 -2659 986 1023 -1785 -1652 404 1748 874 -1548 -2653 49 2093 -663 -1850
$$ packed form
895e07k75q19N1O91o15p41J386J443p08j413J429K324k5j943J44K498P55k935
913G40k367K615J689l038l595K639L461l621l861K965M378j618l273J498M194
928B806K6l625o70L932J909l716l529K883L500m234m064L506L857k932l354K257
944a448L690j395k135J329K605J65j988j569J232J625j833k440J700J466k281
959a277k237J930J639j516j25K359l39j296J348Q60j192N05J994p50j698l71R70
976H04m84n05l8l04R20L10k595j390L649J739l916q11M470N19m933o37M631J424
994B853l230q35J803J145j416k197M38L730J069m441j775M588J294n507r44N973
1010B548J152n419r40L645L7k808J33K056J344q74k422j105K702K044k756j187
$$ plain form
1026 -1850 2294 2852 -1754 -2416 1446 1218 -685 542 1640 -439 -1479 -6 -642 -1264 924 1997
1042 1997 -495 -866 533 -190 -751 687 924 113 1033 756 -2727 -2659 1539 915 -3024 -1230 3043
1059 3043 267 -4020 -1198 2974 1756 75 1111 1894 1417 146 -1695 -463 3364 1874 -3315
1074 -3315 -2671 2170 -611 -5539 -2198 3623 1278 -3468 -1443 1743 407 -459 761 1802 2695 1735
1090 1735 -1446 -1618 1930 1237 -2380 -1250 2519 267 -3966 -2051 1281 -606 -1193 1334 1149 -629
1106 -629 85 488 -644 85 2337 1439 -599 -100 152 -1281 -645 935 -159 -547 983 -530 -3199
1123 -3199 -799 2248 -222 -1868 1852 2910 -1250 -2492 1289 2561 303 -260 511 685 733 -1414
1139 -1414 -2769 117 2594 -761 -3673 51 2429 -1855 -3904 1615 3954 -62 -1854 1198 1988
$$ packed form
1026a850M144N58m606o62L862k28j903J227J098k079j040J473o36o22K188J073
1042A997k492l71J399p23n61J438K37q11R20k77l483O8M198o24l939J794M273
1059C043k776m287K822M172j218j681J036P83m77j271j841J232L827j490n189
1074c315O44M841k781m928L341N821k345m746K025L186j336q66J220J041Q93r60
1090A735l181j72L548o93l617J130L769k252m233J915L332j887n87K527j85j778
1106f29P14M03j132P29K252q98k038M99K52j433O36J580j094l88J530j513k669
1123c199K400L047k470j646L720J058m160j242L781J272k258n63P71J74M8k147
1139a414j355K886K477l355k912L724K378m284k049N519K339m016j792L052P90
$$ plain form
1154 1988 -88 -717 303 1570 1953 -391 -2921 -819 1431 -823 -2569 699 2052 -1459 -2604
1169 -2604 572 1238 -601 46 1768 775 -187 336 267 3 1080 1091 -387 -345 68 -773 -1363 -222 -269
1188 -269 -1188 2 681 -1411 -2040 936 1695 -912 -280 2373 1665 -995 -543 1447 1470 -279 -919 -25
1206 -25 732 -90 -2708 -1932 1432 1245 -2464 -2048 2135 1701 -1935 -1117 2596 2466 -1027 -1016 1483 1466
1224 1466 -668 -1634 -276 1372 111 -2215 -1309 1556 812 -1748 -839 2053 1520 -1203 -390 1893
1240 1893 902 -695 -175 592 540 -657 -1028 -303 -159 -189 -711 -533 78 -192 -541 352 804 -136 -5 1150
1260 1150 730 -581 -275 1259 418 -980 -92 1092 416 -998 -520 1111 881 -735 -1157 730 1453
1277 1453 -949 -1853 282 1634 -682 -2396 -230 1696 -139 -2126 -417 2142 1007 -1092 -198
$$ packed form
1154A988k076o29J020J267L83k344k530K102K250k254j746L268J353l511j145
1169b604L176O66j839O47J722r93r62N23o9k64J077J1j478M2M13q41n90J141m7
1188b69r19J190O79k092o29K976P59k607O32K653p08k660M52J990K3j749o40Q94
1206b5P57q22k618P76L364j87l709M16M183m34l636Q18L713j30l493J1K499j7
1224A466k134r66J358J648j261k326R06K865p44k560R09K892n33k723Q13K283
1240A893r91j597N20P67n2j197l71P25J44l0n22J78O11k70l49Q93M52r40J31J155
1260A150m20j311L06J534q41j398Q88J184o76j414M78J631k30j616m22J887P23
1277A453k402r04K135J352k316j714K166J926j835j987J709K559j135k099Q94
$$ plain form
1292 -198 2253 1718 -886 -725 1704 1841 -790 -1897 550 1343 -1137 -2394 -423 945 -506 -1891
1308 -1891 -626 1156 366 -936 91 1418 1130 -381 -88 1067 751 -562 -643 300 71 -868 -720
1325 -720 -192 -311 -621 -83 548 191 -51 853 1350 574 -73 455 1323 358 -1207 -490 756 -292 -2213
1344 -2213 -1548 228 -252 -2024 -1349 870 1256 -619 -424 1949 2937 586 -319 1824 2686 384 -1578
1361 -1578 -338 1283 -414 -3154 -2044 167 -544 -2709 -1946 840 1015 -908 -779 1689 2443 398
1377 398 -37 1619 2243 414 -1143 -96 535 -698 -1815 -1047 -272 -440 -1171 -542 546 586 35 670
1395 670 1413 821 249 648 862 127 -794 -18 78 -1128 -1211 -287 -179 -840 -851 -36 809 186 -511 490
1415 490 1819 906 -442 350 2023 942 -1344 -706 1529 659 -1647 -1410 656 152 -1468 -1489 331
$$ packed form
1292a98K451n35k604J61K429J37k631j107K447P93k480j257J971J368j451j385
1308a891J265J782p90j302J027J327k88j511K93J155l16j313q1R43k29r39J48
1325g20N28j19l10N38O31l57k42R04M97p76o47N28Q68r65j565P17J246j048j921
1344b213O65J776m80j772O75K219L86j875J95K373R88k351r05K143Q62k302j962
1361a578J240J621j697k740J110K211p11k165P63K786J75j923J29K468P54k045
1377C98m35J656O24j829j557J047O31j233j117P68P75j68p31O29J088M0n51O35
1395F70P43n92n72L99K14p35r21P76R6j206q3R24J08o61j1Q15Q45o23o97J001
1415D90J329r13j348P92J673j081k286O38K235q70k306K37K066n04j620k1J820
$$ plain form
1432 331 1010 -527 -1299 12 1591 346 -1423 55 2277 899 -1380 -259 1718 414 -1438 -229
1448 -229 1241 245 -945 -656 287 356 -195 -382 384 943 -35 -1429 -248 1036 -170 -1253 65 679
1466 679 -1049 -1177 461 487 -331 123 1276 499 -122 569 739 6 200 206 -192 -216 -467 -1319 -760 809
1486 809 135 -1495 180 1608 -298 -1380 1166 2547 368 -745 821 970 -586 -1305 -561 379
1502 379 258 -1024 -1831 -336 958 -760 -1520 1324 2945 -82 -1457 1323 1919 -402 -749 1244
1518 1244 1073 -682 -1237 -986 -700 -166 -499 -944 441 857 -873 -1635 913 1548 -172 -19 1583 701
1536 701 -967 -219 1120 62 -360 954 385 -1280 -756 -297 -762 -251 320 -391 -449 249 -293 -1089 894
1555 894 1892 391 -415 1695 1473 -1633 -1052 1680 1129 -1236 -689 212 -890 -1815 -983 -203 586 938
$$ packed form
1432C31O79j537p72J311J579j245j769J478K222j378k279J121J977j304j852J209
1448b29J470r96j190K89R43O9n51j87P66N59r78j394J181J284j206j083J318O14
1466F79j728j28J638K6q18M54J153p77o21O91J70p33J94Ol98k4k51q52N59J569
1486H09o74j630J675J428j906j082K546J381k179j113J566J49j556p19P44R40
1502C79j21j282q07J495J294j718p60K844J621l027j375K780N96k321l47J993
1518A244j71j755n55K51K86N34l33m45J385M16j730p62K548O35j720J53J602q82
1536G01j668P48J339j058m22J314n69j665N24M59m65N11N71p11n8O98n42p96J983
1555H94R98j501q06K110k22l106N81K732n51k365N47R01j102r25Q32P80P89L52
$$ plain form
1573 938 -523 -1009 1232 1461 -899 -33 3162 1769 -1477 -1110 1356 143 -1781 -328 955 -133
1589 -133 -1014 -920 -806 -31 637 -234 -2 1698 981 -1542 -663 1583 692 -906 616 1399 -796 -1437
1607 -1437 -111 133 -940 51 511 -358 -1047 -393 -383 -283 797 709 20 571 807 -599 -639 1623 1261
1626 1261 -634 -365 1349 -576 -2118 -557 1179 -378 -1465 -240 78 -461 -554 -270 594 1626 1001
1643 1001 -601 14 1628 194 -1501 355 2186 -230 -2080 -311 765 -1058 -1431 241 1036 -51
1659 -51 -598 -752 42 795 357 -316 659 1513 -269 -1655 316 1115 -409 -566 866 826 -1019 -672 751
1678 751 329 -450 130 346 -145 -97 -70 -246 111 416 -203 -77 495 -82 -988 -212 1167 159 -927 581
1698 581 1007 -751 -1158 316 865 -445 -635 27 332 -190 -529 -207 960 974 -298 -690 1034 965 -649
$$ packed form
1573I38j461m86K241K29k360Q66L195j393l246L67K466j213j924J453J283j088
1589a33q81R4J14P75O68q71K32J700p17k523Q79K246q91j598J522P83k195o41
1607a437J326K44j073R91M60q69o89O54J0J00J080q8o89N51K36j406m0K262l62
1626A261j895K69J714j925j542J561J736j557j087J225L18n39r3K84Q64J032o25
1643A001j602O15J614j434j695J856J831k416j850J769J076j823l73J672P95j087
1659e1n47j54P94P53m38o73R75Q54j782j386J971P99j524j57J432m0j845L47J423
1678G51m22p79N80K16m91M8K7j76L57L05o19J26N72n77r06P76J379j008j086J508
1698E81M26j758m07J474N49j310j90O62L05n22l39L22J167J4j272l92J724o9j614
$$ plain form
1717 -649 -926 1160 1438 -871 -1208 391 568 -1019 -905 178 375 -656 -920 -179 538 433 -722 -124
1735 -124 1364 1006 -414 -299 1289 760 -476 -140 733 -2 -1107 -906 -160 -351 -831 -761 -60 91 -539
1754 -539 -335 474 875 238 -47 710 1064 71 -358 508 558 -639 -889 115 68 -1042 -932 164 248 -508
1774 -508 -495 426 780 239 -164 503 1327 224 -580 -91 1112 186 -1222 -763 639 -83 -1352 -894 480
1793 480 256 -950 -650 649 782 29 -308 976 1216 196 -537 804 956 -282 -1080 -70 564 -652
1811 -652 -1254 -601 261 -281 -659 -285 567 337 -139 205 974 702 -75 -22 743 453 -592 -541 247 156 -812
1832 -812 -402 246 -63 -780 -285 563 212 -417 -215 645 605 -475 -304 492 406 -428 -751 524 768 -516
1852 -516 -723 304 785 -313 -687 219 795 -254 -1053 34 956 -29 -915 -229 707 475 -653 -187
$$ packed form
1717f49k77K086K78k309l37J599J77j587J14J083J97j031k64P41P17j05j155N98
1735a24J488l58j420J15J588n29j236L36Q73p35j105K01P46j91m80P0P01J51o30
1754e39K04Q09M01o37k85P57L54r93m29Q66N0j197k50J004m7j110J10J096Q4p56
1774e08J3R21L54n41m03O67Q24j103q04M89J203r26j408M59J402p22j269M58J374
1793D80k24j206L00J299J33p53l37J284K40j020p33J341J52j238p98J010O34j216
1811f52o02O53Q62n42l78L74Q52k30m76L44P69k72p77N3P65k90j045N1P88r1r68
1832h12M10O48l09p17M95Q48l51o29K02Q60m0j080J71P96q6q34l23J275K44j284
1852e16k07J027M81j098l74R06N76j049p99J087R22r85q86O86R36k32j128M66
$$ plain form
1870 -187 876 539 -543 -411 366 559 -566 -743 327 495 -708 -845 240 378 -133 -623 304 840
1888 840 -19 -309 247 683 315 -318 81 631 63 -681 85 638 -205 -753 -143 470 -226 -892 -163 310
1908 310 -58 -382 -289 423 290 -431 204 777 473 -110 -104 711 446 -507 -668 434 385 -997 -1030 186 376
1929 376 -829 -672 604 792 -165 -238 552 790 336 -156 276 905 166 -1086 -610 562 -98 -1298 -573
1948 -573 720 38 -1047 -421 797 262 -151 388 640 472 50 -198 314 682 82 -555 -3 473 -515
1967 -515 -972 -37 558 -654 -782 376 245 -739 -541 574 332 -16 90 477 206 35 35 -56 1068 782
1987 782 -408 -605 449 106 -1345 -412 966 206 -1333 -500 837 -51 -733 225 952 285 -20 15
2005 15 294 656 11 -180 129 686 -298 -1630 -733 664 -515 -1374 226 944 -684 -789 337 574
$$ packed form
1870a87J063l37j082J32P77J93j125j77J070J68j203j37J085J38n11m90R27N36
1888H40q59k90N56M36l68o33L99N50n68p44P66N53q43n48O10O13o96o66P29M73
1908C10l68l24R3P12j33p21O35N73l04n83OQ15k65r53j61J102m9j382l3J216J90
1929C76j205J57J276J88r57p3P90K38m54m92M32O29p39j252M76J172o60j200P25
1948e73J293o82j085O26J218n35m13N39K52j68m22k48N12L68o00o37N52M76r88
1967e15m57R35N95j212j28J158j31r84J98J115k42l48J06L87k71j71%r1J124k86
1987G82j190j97J054l43j451R33J378p60j539Q33J337q88o82R58P27o67l05L5
2005A5K79L62o45j91L09N57r84j332Q97J397j179q59J600P18j628j05J126K37
$$ plain form
2023 574 -329 308 1035 698 269 -139 -563 4 608 -148 -740 283 215 -1566 -879 343 224 -648 -230
2042 -230 330 -454 -810 562 601 790 567 175 325 148 -188 -158 -274 521 213 -1016 -790 374 -703
2061 -703 -1406 308 1275 -275 -744 572 679 -393 -83 990 905 217 -40 -329 -346 51 -347 -576 407
2080 407 563 -1181 -1304 367 639 -818 -425 1410 624 -782 -224 719 165 -29 414 307 -195 -225 -674
2099 -674 -641 123 288 -762 -289 858 128 -1564 -176 1231 141 -570 424 697 -660 -703 524 378
2117 378 41 300 342 -264 8 -588 -712 399 912 -302 -882 -23 680 -838 -705 1234 858 -485 -256
2136 -256 682 -116 -758 75 656 322 -10 -173 -405 93 93 -602 -135 836 320 -1099 -643 519 -334 -950
2156 -950 205 1042 -251 -601 61 585 60 69 352 306 247 61 -736 -368 368 -115 -929 30 401 -733
$$ packed form
2023E74r03O37P27l37m29m08m24N67O04p56n92J023o8j781O87J222j19q72M18
2042b30N60p84l56J372L9J89k23l92J50j77l36L0j16P95l08j229K26J164j077
2061g03p03J714R67j550m69J316J07j072L10J073q5o88k57k89j7L97l98k29R83
2080D07J56j744j23J671K72j457L93J835p86j406N58R43n54j94M43j07n02l0m49
2099f74L3P64J65j050M73J147p30j692J388J407j090p11R94K73j357m3J227j46
2117C78l37K59M2o06K72n96j24J111N13j214n80Q59P03j518J33J939l76j343K29
2136b56R38p98o42Q33N81l34l32j63k32M98%o95M67R71n16j419M56J162q53o16
2156i50J155Q37j293l50O62N24n25RK83m6n9j86p97L68P36m83q14R59L71j134
$$ plain form
2176 -733 -1084 396 1010 -427 -194 924 386 -121 200 482 399 240 84 -53 0 -2 -685 -761 300 194
2196 194 -649 -540 657 174 -883 80 1073 463 -420 365 747 -67 -364 102 460 1 -220 -761 -178
2215 -178 241 -275 -1003 168 590 -402 -904 299 907 -153 -372 836 1036 63 -154 404 402 15 -418
2234 -418 -164 42 -225 -840 -676 37 28 -467 -203 833 697 -263 44 981 716 -95 -13 541 134 -827 -620
2255 -620 -91 25 -505 -646 -113 201 -37 -491 187 764 112 -203 352 704 158 -324 184 577 -207 -629
2275 -629 -59 361 -164 -435 -114 426 173 -522 -219 71 162 -584 -206 524 336 -374 -334 590 342 -439 -339
2296 -339 524 306 -274 -340 270 409 -316 -358 -18 194 -145 -435 -77 486 -175 -545 117 644 18 -445 -48
2317 -48 553 116 -226 10 439 123 -367 26 346 -25 -423 -295 345 40 -295 -466 388 332 -490 -169 423
$$ packed form
2176g33l51J480O14j437K33J118n38n07L21K82q3j59j56j37N3ko83p6J061j06
2196A94q43J09J197m83j057R63R93o10q83P85L82q14k97M66L58m59k21n41N83
2215a78M19n16p28J171M22r92n02J203O08j060k19J208K00r73k17N58kl87m33
2234d18K54K06k67o15J64P13rm95K64J036j36r60L07R37k65q11Q2N54m07r61K07
2255f20N29J16n30j41N33L14k38m54O78N77o52l15N55L52n46m82N08L93p84m22
2275f29N70M20n25k71L21N40k53o95L03K90R1p46L78P30j88p10M0R24k48p81J00
2296c39Q63k18n80o6O10J39p25m2L40K12l39k90L58N63o61l70O62N27o26m63L97
2317d8O01m37l42K36M29l16m90L93L20l71l98J28O40l05l35j71Q54n6q22L21N92
$$ plain form
2338 423 399 -83 -27 384 536 -101 -86 545 485 -366 -608 -50 286 -423 -813 -378 30 -199 -407 21 545
2359 545 130 -127 390 863 318 -61 290 648 254 -440 -473 -15 -238 -570 -823 119 -31 -562 -304 395
2379 395 490 8 -57 685 651 -67 -140 327 471 -145 -471 18 171 -365 -502 -335 328 -359 -667 -42 620
2400 620 238 -290 271 832 334 -257 72 811 135 -348 -80 275 -54 -706 -264 193 -107 -308 -443 79
2420 79 295 -401 -246 467 830 -10 -142 408 705 40 -362 444 339 -445 -445 -73 109 -445 -378 -97 266
2441 266 51 -300 -62 666 283 -147 -119 695 319 -366 -157 484 -136 -606 -245 578 -203 -739 -272 144
2461 144 80 -148 100 59 258 -251 -305 86 556 207 -358 56 578 -278 -524 358 544 -192 -393 188 120
2482 120 -436 -295 143 205 182 3 -260 220 328 -300 -356 466 558 -469 -465 659 288 -617 -91 651 29
$$ packed form
2338D23k4m82N6M11J52o37J5O31o0q51k42N58L36p09l90M35M08k29k08M28N24
2359E45m15k57N17M73n45l79L51L58l94o94l3M58k23l32k53R42j50n31K58O99
2379C95R5m82o5P42l4p18p3M67J44o16l26M89J53n36j37J67O63o87l08O25O62
2400F20l82n28N61N61m98n91L29P39o76m83K68L55l29o52M42M57l00k01j35N22
2420G9K16o96J55P13L63q40j32N50K97o65m02Q06j05p84%L72J82n54O7K81L63
2441B66k15l51K38P28l83m30K8Q14l76o85K09O41o20m70L61Q23p81n36M67M16
2461A44o4k28K48m1J99n09n4L91M70l49n65M14N22q56k46Q82J86p36k01N81o8
2482A20n56J41M38O2k3j79k63M80J08o28n6Q22R2j027MJ124l71r05N26P42o22
$$ plain form
2503 29 -464 -28 7 -169 -159 -189 49 64 36 -512 -328 503 258 -288 277 753 62 -491 124 837 -228 -229
2525 -229 467 241 -627 -354 73 -1 -9 60 -273 27 364 -304 -604 314 975 -209 -357 391 475 -739 -406
2546 -406 679 253 -578 -209 158 -439 -420 -96 109 156 202 -211 -414 414 399 -350 76 930 311 -689 5
2567 5 564 -279 -489 509 382 -524 -474 -154 -177 -102 70 89 61 431 -117 -505 61 826 -9 -307 426 606
2589 606 -695 -612 592 228 -669 -256 409 -178 -533 -460 -122 -139 344 224 -50 207 545 -505 -117 1136
2609 1136 452 -507 -88 761 -378 -689 -25 575 -313 -502 58 -168 -451 -296 -59 221 567 257 -151
2628 -151 -57 546 -162 -426 444 766 -297 -762 -6 142 -715 -264 456 8 -270 -206 -134 -218 238 60 75
2649 75 434 486 -113 -438 396 379 -546 23 586 -98 -773 -242 381 -353 -496 140 148 -196 -431 -91 137 368
$$ packed form
2503B9m93M36L5j76J0l0K38J5k8n48J84Q31k45n46N65M76o91n53O15P13j065j
2525b29O96k26q68K73M27p4qO9l33L00L37o68l00R18O61j184j48P48Q4j214L33
2546d06J085m26q31L69L67n97J9L24K05M7M6m13k03Q28j5p49M26Q54o19j000O94
2567EN59q43k10R98j27r06N0L20k3P5J72J9k8L70n48l88N66P65q35k98P33J80
2589F06j301Q3J204l64q97M13O65n87l55P3L38j7M83j20k74K57L38j050L88J253
2609A136o84r59M19Q49j139l11O64O00q88j89N60k26k83J55K37K80L46l10m08
2628a51R4O03p08k64Q70L22j063m65P56J48q57M51P20m48k78O4P2q4M56j78J5
2649G5L59N2n99l25Q34j7r25N69N63o84o75N31O23p34j43O36Ql44k35L40K28K31
$$ plain form
2671 368 507 -51 -69 583 42 -522 181 702 -139 -771 169 222 -552 -433 37 19 -233 -129 187 98 -90
2692 -90 -57 31 393 541 -313 -358 436 199 -392 -183 658 121 -707 -338 127 -93 -629 -34 541 -148 -274
2713 -274 -90 204 248 105 -128 221 398 127 -325 56 416 -72 -600 86 193 -332 -592 -31 150 -334
2733 -334 -256 67 247 13 -36 51 489 295 -53 -179 422 410 -447 -322 235 322 -366 -248 36 -89 -425 -90
2755 -90 204 102 -363 2 236 336 26 -157 20 424 -61 -307 45 244 2 -310 -168 199 -192 -536
2775 -536 -207 258 -82 -157 18 43 22 -99 222 441 249 -76 19 387 216 -245 -322 135 69 -363 -535 39
2797 39 61 -219 -515 44 245 -195 50 312 429 0 -53 351 519 85 -303 118 350 20 -364 -39 118
2818 118 -194 -556 -284 187 54 -439 -54 409 415 -114 74 327 273 -156 -135 360 283 -178 -371 101 213 -276
$$ packed form
2671C68J39n58j8O52n41n64P03N21q41o32R40N3p74J19M70j8k52J04L16q9j88
2692i0L3Q8L62J48q54m5P94k37n91K09Q41n37q28L69M65k20n36N95N75o89j26
2713b74J84K94M4j43k33L49J77k71m52L81L60m88n28O86J07n25k60N61J81m84
2733c34P8L23J80k34m9Q7M38j94l48j26O01j2q57J25N57Q7o88J18K84j25l36L35
2755i0K94j02m65L65K34J00l10j83J77M04m85k46L52J99k42l12J42L67l91l44
2775e36L29M65l40p5J75K5k1j21L21K19j92l25R5L68j71m61p7M57o6m32j72N74
2797C9K2k80k96N59K01m40K45K62J17m29n3M04J68m34l88M21K32l30l84L25J57
2818A18l12l62K72M71j33m93L85M63On29J88K53n4m29K1M95p7m61j93M72J12m89
$$ plain form
2840 -276 -406 185 205 -139 -330 110 183 -151 -154 11 275 -21 -233 318 532 99 -357 16 293 -4 -410
2861 -410 34 276 -2 -588 -171 235 126 -469 -106 400 175 -83 -29 356 175 -3 -13 165 306 -158 -338
2882 -338 4 242 -306 -495 -16 36 -325 -377 131 217 -14 -59 242 436 232 -103 213 423 195 -35 -40 182
2904 182 41 -213 -364 233 111 -386 -194 186 -31 -299 -36 311 125 23 -52 229 -1 -240 -63 184
2924 184 284 -144 -274 -61 204 -222 -418 14 391 -180 -428 52 269 96 -312 138 170 48 114 43 284
2945 284 355 -74 -286 307 121 -496 -313 171 224 -338 -434 261 50 -371 -12 459 56 -106 -5 187 261
2966 261 -122 -177 115 69 -64 -332 -164 340 -266 -542 93 416 -79 -420 -37 210 -272 -195 254 274 -135
2987 -135 -188 4 182 -5 -83 -294 3 255 -388 -317 59 247 -235 -360 368 307 -313 -169 465 147 -2
$$ packed form
2840b76j30N91K0l44j91M40P3l34lJ65K64k96k12N51K14m33m56L73K77k97m06
2861d10M44K42k78n86M17M06j09n95L63N06k25k58N4L85j81j78j0J78J41m64j80
2882c38L42K38n48j89M79N2l61n2N08Q6k31m5L01J94k04l35L16K10k28k30nK22
2904A82j41k54j51N97j22m97J92L80k17k68K63L47j86j02p5K81k30k39J77K47
2924A84J00m28j30K13K65m26j96M32L77n71k48M80K17j73m08M50L2j22O6p1K41
2945B84P1m29k12N93j86o17J83M84N3n62r6O95k11m21L59M71m03j62J01J92P4
2966B61l83n5K92m6j33k68J68N04o06k76O35L23m95l41L83K47m82P7M49K0m09
2987a35n3J92J78j87p8k11K97K52o43P1L76J88m82j25P28o1o20J44O34l18j49
$$ plain form
3008 -2 135 363 250 127 66 36 102 183 -175 -106 224 -51 -472 -310 268 82 -523 46 394 -83 -292 168
3030 168 404 21 43 144 140 -102 117 -31 -75 315 41 -414 19 128 -411 -552 315 201 -278 -305 319 94
3052 94 -83 131 475 436 39 -31 -203 -75 91 -31 -163 219 241 -437 -408 278 35 -496 1 391 -26 -397
3074 -397 294 349 213 -70 302 156 143 -138 -227 -37 35 -17 -464 -117 232 -270 -576 33 539 -75 -351 451
3096 451 372 -131 -183 516 287 201 23 70 -57 -74 -330 -301 123 248 -276 -431 220 70 -314 -37 653 279
3118 279 -79 285 362 -133 2 183 127 -71 6 -115 -290 313 -88 -120 -139 310 -25 -443 -39 424 85 -244
3140 -244 263 492 -133 -384 311 208 -241 6 212 50 -182 -260 -443 -134 5 -212 -265 289 165 -553 -316
3161 -316 372 359 -72 -6 360 14 -180 33 161 198 -168 6 -23 65 57 -322 -178 289 86 -313 -44 366
$$ packed form
3008bJ37K28j13j23o1l0O6Q1l58O9L30k75m21J62N78j86o05N69L48m77k09M60
3030A68K36l83K2J01mk42K19j48m4L90k74m55M33J09n39j41Q67j14m79k7O24k25
3052I4j77K14L44l9l97p0j72J28J66j22j32L82K2o78K9O86k43n31M97L90m17l71
3074c97O91N5j36k83L72j46j3k81q9J90P2n2m47L47L49n02l06O09N06o14k76Q02
3096D51p9n03n2O99k29q6j78M7j27j7k56K9M24J25n24j55O51j50l84K77O90l74
3118B79l58L64P7m95J35J81n6j98P7j21j75O03m01l2j9M49l35m18M04M63l39l29
3140b44N07K29o25k51O95j03m49K47K06j62k32p8j83L09J39k17n3N54j24p18K37
3161c16O88j3m31O6L66l46j94K13J28L7l66J74k9Q8ql79J44M67k03l99K69M10
$$ plain form
3183 366 1 -276 206 507 -42 -257 232 261 -109 -264 -134 65 19 -72 -85 -49 -42 -106 -130 29 178 -258 -283
3206 -283 276 353 -214 -69 364 240 -195 -52 69 168 -65 -1 -19 112 -219 -408 -106 243 63 -385 -135
3227 -135 172 13 -323 56 223 89 -165 184 427 -132 -193 37 48 -112 -101 -334 -47 90 -172 -137 101
3248 101 160 -195 -268 368 185 -160 15 288 272 -71 -50 123 149 -216 -297 35 77 -196 -339 -171 69 -4 -301
3271 -301 -35 199 238 -239 -103 250 -14 -92 -84 334 77 -282 -153 58 10 -262 -109 71 -253 -224 -311 68
3293 68 0 49 -251 187 241 8 10 328 431 -114 -26 135 244 -61 -332 -186 21 7 -433 -29 95 -64 -143
3316 -143 97 374 304 -124 53 287 179 19 -20 202 86 -200 -315 151 -62 -350 -163 -50 130 -250 -129
3337 -129 239 209 37 -45 216 385 42 27 52 103 -89 -162 -182 141 -80 -179 109 -22 -30 -127 -131 269 102 -154
$$ packed form
3183C66l65k77M82L01n49k15M89K9l70j55J30J99m6r1j3L6Po4k4J59J49m36k5
3206b83N59P7n67J45M33j24m35J43J21R9k33O4j8J31l31j89L02L49j80m48K50
3227a35L07j59l36L79J67j34k54L49K43n59o1K30J1j60J1k33K87J37k62L5K38
3248A01N9l55p3O36j83l45J75K73j6l43K1J73K6l65q1L32M2k73j43J68K40p3k97
3271c01K66K34L9m77J36L53k64p8QM18k57l59J29K11m8k72J53J80l24K9q7L79
3293F8o8M9l00M38N4k33KL18J03n45Q8J61J09l05k71J46K07j4m40M04J24j59p9
3316a43K40K77p0m28J77K34j08j60l9K22j16k86j15M66k13k88J87J13J80l80J21
3337a29L68l0j72q2K61J69l43j5K5N1j92p3k0L23k21r9K88j31qr7mM00j67k56
$$ plain form
3361 -154 73 215 80 43 6 344 187 -36 43 271 -37 -298 -215 16 222 -214 -389 206 68 -63 -158 90
3383 90 533 -20 -166 199 532 193 -104 132 85 -146 -317 -14 -26 -26 -166 -113 88 20 -158 -86 159 136 -15
3406 -15 -3 -8 85 -194 24 159 120 -20 -138 241 8 -201 -109 26 52 -173 -4 43 -97 -172 -220 -79 175 41
3430 41 2 29 293 132 -102 302 314 236 -281 24 -47 -45 -402 -118 53 -199 -71 -72 38 81 -141 -73 160 383
3454 383 85 -97 96 373 -96 -186 280 33 -31 -216 65 26 -387 -51 0 101 -10 -128 -243 208 254 -73
3476 -73 2 139 190 -202 -108 239 125 -212 -72 71 -13 -263 -200 41 -136 -52 -216 -82 -9 -201 -23 193 222
3499 222 -15 -212 178 394 10 -157 38 286 -177 -201 263 -47 -267 -100 146 47 11 79 58 71 157 -183
3521 -183 -25 401 135 -222 -247 219 147 -436 -77 14 76 -51 -255 -18 -137 -184 -40 60 69 92 -67 -76 125
$$ packed form
3361a54K27J42j35l7l7L38j57k23P9K28l08k61Q3K31K06m36j75N95j38j31r5K48
3383I0M43n53j46L65L33l39k97K36m7k31j71L03j2%j40N3K01o8j78P2K45k3j51
3406a5J2nR3k79K18J35l9j40j18L79k33k09R2J35K6k25J69M7j40p5m8J41K54j34
3430D1l9K7K64j61k34M04J2p8n17L05p1Kl57K84J71k52J28jJ10M3k22O8K33K23
3454C83k98j82J93K77m69r0M66k47o4j85K81l9m13L36N1J01j11j18j15M51M6l27
3476g3P5J37N1l92R4L47j14l37J40J43q4k50O3K41j77Q4j64J34P3j92J78K16K9
3499B22k37j97L90K16l84j67J95K48m63k4M64l10k20J67K46r9l6O8k1J3Q6l40
3521a83J58M26k66l57k5M66p2n83L59R1O2j27k04K37j19m7J44J00RK3j59rK01
$$ plain form
3544 125 218 -158 11 430 22 -257 28 139 -87 -327 415 160 -318 -286 286 -148 -120 204 161 237 268 40
3566 40 29 -140 215 39 -254 160 295 -268 -270 292 -17 -282 70 141 -84 -338 -21 46 184 117 52 -153 65
3589 65 -9 -264 83 309 168 -113 -49 397 -107 -331 -184 155 -132 -256 39 -32 -179 -104 -19 132 317 32
3611 32 -29 128 359 -125 -197 271 431 26 -263 -42 -123 -290 -207 221 22 -238 55 178 -193 266 179 -84
3633 -84 106 187 146 -30 -9 251 -239 -225 186 74 -398 -123 287 -217 -247 184 111 -166 -30 199 135 187 -40
3656 -40 252 101 353 -22 -371 114 119 -158 -226 246 94 -407 -192 159 16 -94 17 24 53 41 87 193 188 129
3680 129 -125 -185 78 128 -218 -171 280 2 -264 -79 284 -199 -254 160 189 -6 -55 100 -64 129 128 51 -71
3703 -71 303 -19 -75 -32 198 -89 -457 -42 250 -73 -165 249 31 -184 -43 77 136 -95 -292 -19 22 156
$$ packed form
3544A25R3l76J69M19m08k79K85J11k26k40P42k55m78L2N72m34K8L24m3P6L1k28
3566D0j1j69L55j76k93M14J35n63kN62l09k65L52P1k25k54L17O7J38o7o5k05K18
3589F5p4k55L47K26j41k81O4M46n04k24J47L39k87j24K95p1j47P5Q5J51J85k85
3611C2o1J57K31m84p2M68J60m05k89K21q1j67Q3M28j99k60K93J23l71M59q7k63
3633h4J90Q1m1j76K1K60m90J4M11j12m72K75M10n04l0M31p3k77J36K29o4N2k27
3656d0K92j51K52l75l49M85Nk77o8M72j52n01K15L51j43j10J11PK9j2M6J06nn9
3680A29k54o0K63N0l46M7M51k78k66J85L63m83n5M14K9j95m9J55j64J93jp7j22
3703g1L74l22n6M3K30k87l68M15K92l23r2M14k18k15J41J20N9k31j97K73M1J34
$$ plain form
3725 156 32 155 120 42 -230 -218 201 226 -352 -150 161 8 -274 -88 143 -154 -192 79 184 74 114 7
3747 7 87 222 157 -129 149 121 59 -280 -110 -104 -93 -280 66 228 -86 -133 259 110 -109 -145 203 276 167 -18
3771 -18 87 159 145 -64 -156 99 82 -367 -92 4 1 -160 -101 105 18 -114 -23 -18 116 4 136 143 73 155 -15 -136
3797 -136 44 -132 -132 -153 224 -78 -329 -199 113 -328 -266 -202 280 138 -30 -20 173 58 -32 133 41 -55 -207
3820 -207 -261 -161 -15 -174 -305 167 133 -96 -170 218 115 -136 19 300 101 44 15 135 193 99 61 8 160
3843 160 -140 -257 3 112 -37 -153 -17 67 -34 -49 233 82 95 -274 45 254 12 112 -79 177 -117
3864 -117 -123 -108 -59 -19 -260 14 122 -127 -73 -184 173 92 150 -14 158 105 80 -83 142 19 -19 -84 -85 21 -150
3889 -150 -94 -103 127 16 -136 -200 269 189 51 151 189 25 -108 29 24 175 -31 -123 12 201 -147 -175 29
$$ packed form
3725A56j24J23l5p8k72J2M19K5n78K02L11j53k82J86K31k97l8K71J05j10M0j07
3747GQ0J35o5k86K78k8o2l39J70OJ1j87L46J62l14m7L92j49k19l6L48P3j09j85
3771a8J05P2j4k09r2K55j7m49K75R6lj61N9K06q7j32R1NJ34j12J32Pp0Q2j70j21
3797a36J80j76%k1L77l02k51J30L12m41O2O4M82j42j68J0J93j15r0J65r2r6j52
3820b07n4J00J46j59j31M72l4k29p4L88j03k51J55K81j99n7k9J20N8r4l8n3J52
3843A60l00j17K60J09j49j16J36Q4j01j5K82j51J3l69L19K09k42J00j91K56k94
3864a17oJ5M9M0k41K74J08k49N4j11L57q1N8j64J72n3k5j63K25j23l8o5jJ06j71
3889a50N6rK30j11j52o4M69q0j38J00L8j64j33J37nJ51k06r2J35J89l48k8K04
$$ plain form
3912 29 8 -87 -186 -48 45 -86 114 -2 157 -16 -275 118 38 165 -39 203 221 12 84 -106 -19 19 -201
3935 -201 -111 107 54 -140 -26 292 56 24 20 284 179 -27 -42 36 -77 -94 -47 267 28 -164 -180 39 179
3958 179 -207 -118 -79 3 -164 -93 8 110 26 9 104 186 -111 -4 -8 97 104 -103 -5 -37 6 -70 -160 33 -103 -85
3984 -85 5 129 89 -164 5 74 256 -45 -31 150 100 87 15 -14 9 55 -24 -23 225 -36 -95 -23 212 -9 -57 -27
4010 -27 214 -21 -146 102 66 -43 -37 31 -57 129 -42 -4 187 -47 58 -35 -47 38 -199 -99 16 238 -178
4033 -178 -208 105 120 -95 249 173 277 -210 2 -195 -49 73 -160 -104 -23 -166 -247 -36 80 -65 -12 65 290
4056 290 61 38 145 61 -139 112 323 24 -69 19 -58 129 23 112 -175 -27 135 -119 -138 150 215 -63 25
4079 25 85 -9 -49 -12 194 21 -88 209 -44 -115 -204 -239 -90 187 -6 -75 -24 258 85 -200 -82 -74 133 -167
$$ packed form
3912B9k1r5r9J38R3j31K00j16J59j73k59L93q0J27k04K42J8k09P2j90Q7L8k20
3935b01R0K18n3j94J14L18k36l2mK64j05k06j5P8j13j7M7L14k39j92j6K19J40
3958A79l86Q9L9Q2j67P1J01J02q4j7R5Q2k97J07mJ05Pk07R8l2M3p6r0J93j36J8
3984h5R0J24m0k53J69O9J82l01J4J81n0j3p2k9K3M6p9JK48k61n9P2K35k21m8L0
4010b7K41k35j25K48l6j09OO8q8J86j71L8J91k34J05r3j2Q5k37J00J15K22m16
4033a78l0L13J5k15L44p6J04m87K12j97J46J22k33N6Q1j43q1K11J16j45N3P7K25
4056B90k29k3J07q4k00K51K11k99r3Q8p7J87j06Q9k87J48J62k54j9K88O5k78Q8
4079B5O0r4m0L7K06j73j09K97k53p1q9l5J49K77j93o9N1K82j73k85J18QK07l00
$$ plain form
4103 -167 78 352 -92 75 147 112 51 17 -169 -284 -36 -65 -87 -51 5 23 -235 -88 283 -42 -70 291 183
4126 183 -271 -92 99 22 -24 101 -93 -137 -95 51 65 122 -24 -112 -154 14 2 -77 203 353 -1 208 120 151
4150 151 -113 -34 14 235 -42 -119 -101 -80 -138 53 -307 20 199 20 -152 132 196 -129 -60 92 201 102 -265
4173 -265 176 171 -227 129 99 63 185 111 -193 -5 107 44 -27 143 -22 70 -64 85 147 -208 29 -21 48 -326
4197 -326 -178 -43 -166 -130 62 52 35 -48 -323 79 67 6 -46 -107 20 -57 -232 -16 104 -29 -48 101 202
4220 202 47 -148 -17 24 -174 -242 -134 -114 -230 -284 -136 173 -109 -199 -52 37 47 -98 55 -4 -45 -13 -33 231
4244 231 119 -112 -97 -54 -96 -109 -193 -64 104 110 -108 -4 140 -69 -44 -88 86 61 48 56 136 -149 -140 78 -100
4269 -100 18 -204 47 15 -23 -47 -145 -12 25 51 -130 77 63 -92 -97 213 91 -93 -40 39 138 -172 -234 106
$$ packed form
4103a67K45K74m44J67P2l5o1l4j86j15K48k9k2L6N6J8k58J47L71l25k8L61j08
4126A83m54J79J91p7m6J25j94m4M2J46J4N7j46q8m2J68j2p9K80J50l54K09q8L1
4150A51k64P9M8K21k77p7J8K1n8J91l60L27J79j79j72K84O4l25O9J52J09r9l67
4173b65M41nl98L56l0l6J22p4l04J88J12o3p1J70j65R2j34J49O2l55K37n0O9l74
4197c26J48J35j23L6J92j0j7q3k75M02j2o1n2o1J27p7j75K16J20j33j9J49J01
4220B02j55j95J31M1j98o8J08K0j16n4J48L09k82r0J47Q9J0j45J53n9m1L2k0K64
4244B31j12k31J5M3m2j3q4J29J68Ok18J04J44k09K5m4J74k5j3QQ0k85RK18j78
4269a00J18k22K51l2l8k4r8J33L7K6j81K07j4j55nL10j22j84N3P9R9l10o2L40
$$ plain form
4293 106 22 -11 -195 108 69 -97 39 34 112 -34 -86 -149 3 140 37 3 147 112 -17 -59 125 -60 -139 -172
4317 -172 58 82 13 82 -20 107 112 138 72 44 90 7 -12 23 -250 -84 -112 115 116 -184 -205 133 -219 -186 -195 -112 277
4344 277 -156 496 326 -227 -110 -82 206 205 -202 123 308 93 120 441 201 358 69 -67 455 699 -228
4365 -228 -145 141 45 -226 87 198 219 66 -3 93 18 -55 -57 -15 179 26 -152 4 217 -3 -152 -107 171 26
4389 26 -180 24 220 -106 7 -149 10 217 -32 24 -68 -9 -77 117 37 95 -117 -40 49 13 -151 58 175
4412 175 -84 116 120 138 232 55 -318 -62 -37 -21 -170 1 36 -140 -90 -174 -26 156 -27 65 -47 39 -115 18
4436 18 179 85 -69 -51 135 75 -106 16 15 66 -52 -185 -196 -121 -260 -35 -1 42 -195 -127 88 -19 33 -12 26
4461 26 114 -97 -150 -27 73 56 -103 -46 -109 -141 -199 -113 -93 161 54 86 0 92 110 11 -58 203 93 -186 112
$$ packed form
4293A06q4l3j84L03l9j66J36nP8j46n2o3J52J37j03l4J44l5j29m2J84j85p9l3
4317a72K30K4o9O9j02J27NK6o6k8M6q3j9L5k73J66k8K27Jl00k1L38l52L3rQ3L89
4344B77m33O52j70n53J17K8K88jm07L25J85k15K7L21k40J57k89j36N22K44r27
4365b28Q3K86r6k71L13J11K1j53o9R6p5p3kM2J94j53j78J56K13k20j49M5K78j45
4389B6k06K04J96l26J13j56J59K07k49N6r2N9o8J94q0N8k12P7Q9l6j64K09J17
4412A75k59K00MJ8R4j77l73K56K5J6j49J71L5j76N0q4J48J82j83R2j12Q6j54J33
4436A8J61r4j54J8J86o0j81J22jN1j18j33j1P5j39K25L4M3k37O8K15j07N2m5L8
4461B6Q8k11n3J23J00j7j59N7o3l2n8Q6K0K54j07L2q6R2J8r9o9K61j10k79K98
$$ plain form
4486 112 84 63 -188 36 -153 -25 -216 42 -149 -111 -153 -91 -46 -228 -88 -27 -152 -68 -50 -61 92 23 23 -132
4510 -132 29 -55 -228 89 30 -48 -258 -2 51 -101 93 24 -39 112 -87 -4 -186 198 32 -110 165 177 -37
4533 -37 -38 105 -43 -28 -102 29 81 -149 40 98 -166 -48 -171 195 -47 124 -89 109 28 52 23 -81 5 -61
4557 -61 -164 17 112 -84 2 55 117 -6 -238 125 82 7 109 59 107 224 73 -80 -42 88 -23 -1 -108 81
4581 81 -158 -182 25 -48 -65 -130 -73 -134 28 -173 30 74 -7 90 137 89 -4 -108 -164 80 104 -199 273 78 24
4606 24 -12 107 200 93 11 131 -24 -6 -55 157 53 8 32 -20 -55 12 -27 -338 -122 -33 -100 -151 -112 -34 -3 -8 103
4633 103 182 114 76 -25 124 -144 162 33 -105 44 -29 -124 -64 -11 -10 -124 81 269 -161 -62 92 59 17 138
4657 138 132 52 79 234 -64 -7 90 -50 -62 108 -11 107 24 196 78 -260 -60 -1 26 -86 77 113 -38 234
$$ packed form
4486A12k8k1k51K24j89J28j91K58j91L8m2O2M5j82J40O1j25Q4J8j1J53o9%j55
4510a32J61q4j73L17n9p8k10K56N3j52J94o9o3J51j99Q3j82L84j66j42K75J2k14
4533c7jJ43j48J5p4J31N2k30J89N8k64J18j23L66k42J71k13J98q1K4k9j04Q6o6
4557f1j03J81R5j96Q6N3O2j23k32L63m3p5J02n0M8J17j51j53L8J30j11K2j07J89
4581H1k39k4K07p3j7o5N7o1J62k01K03M4q1R7M7m8r3j04n6K44K4l03M72j95n4
4606B4l6J19R3j07q2J20j55J8m9K12j04m5K4n2l5O7l9l11K16Q9o7n1L9P8L1nJ11
4633A03P9o8l8j01J49k68L06j29j38J49p3r5O0N3Jj14K05J88m30R9J54l3m2J21
4657A38oq0K7J55k98N7R7j40j2J70j19J18q3J72j18l38K00N9K7j12J63L6j51K72
$$ plain form
4681 234 1 84 11 -38 -134 -61 -11 74 61 -153 125 -68 -92 177 272 -56 42 134 43 -229 131 69 -10 138 7
4706 7 -2 -160 49 -209 -100 -15 -143 -165 41 -59 -69 -152 -72 -12 64 -42 5 130 53 -172 105 108 -5 103 -105
4731 -105 -15 -77 -1 -233 -19 121 -30 -184 62 105 -154 -137 23 90 -116 -102 -6 -90 -24 76 25 32 292 -17
4755 -17 -54 -36 -29 -224 5 -55 -5 -49 -64 28 45 -118 -23 -72 7 94 189 -10 -165 128 -56 -112 89 -218 -20 -140
4781 -140 68 -75 -58 -85 76 73 -218 22 81 99 57 -144 175 -47 -88 75 223 -86 138 149 -153 -12 -188
4804 -188 -98 -70 33 104 -109 55 -35 48 -136 231 -20 -64 -122 138 28 44 105 108 202 51 30 -10 125 -38 63
4829 63 -17 -123 -144 115 74 77 -67 -11 124 146 136 -68 -56 280 -105 -36 -40 -96 59 -30 -80 37 12 101 53 39 -39
4856 -39 -27 -122 -18 129 105 -36 133 -153 -58 -103 30 -71 51 -62 -19 -52 -167 10 73 -9 -133 -12 42 -74
$$ packed form
4681B34k33Q3p3m9r6P3N0Q5j3k14K78j93k4K69R5l28R8R2r1k72L60o2p9J48j31
4706Grj58K09k58J09Q5j28k2K06j00j0q3Q0O0P6j06M7J25p7k25K77Lj13J08k08
4731a05R0o2P6k32K14J40j51j54K46M3k59J7J60O7k06J4R6q4O6J00n1PK60l09
4755a7l7J8Pj95K29o0N0m4j5R2J7j63R5m9P9Q7R5j99j55K93j84n6K01l07J98j20
4781a40K08j43J7k7J61lk91K40N9J8m2k01L19k22m1J63J48l09K24J1l02J41j76
4804a88R0K8J03P1k13J64r0Q3j84L67k51m4n8K60j10J6O1LR4j51k1m0J35j63J01
4829F3q0j06k1K59m1Lj44N6J35K2j0k04J2L36l85O9mn6J55q9n0J17k5Q9m8j4p8
4856c9J2r5J04J47k4j41J69k86R5m5J33j01J22j13M3l3j15J77O3q2j24J21N4j16
$$ plain form
4880 -74 24 -149 -50 107 -33 -65 -67 42 5 -104 -11 62 -29 -59 -150 -24 -57 133 -40 -55 69 -54 194 -37 134
4905 134 0 -19 -113 -2 9 -160 72 84 -1 -157 -182 -162 58 8 -224 -92 52 -196 82 165 68 -89 32
4928 32 135 158 -36 107 -65 2 203 -105 -126 84 105 -112 17 63 -61 -60 43 -84 59 -157 153 89 26
4951 26 58 84 117 -94 64 138 -2 -58 -169 19 36 -70 45 -55 -72 96 -72 -256 -28 46 61 -41 47 -104
4975 -104 -11 -5 -174 -249 -101 -59 -135 -47 -40 8 -32 -27 -2 43 -34 110 51 -135 129 -79 -87 -43 105 34 45 143 105 -96
5003 -96 20 26 37 -143 -74 55 -50 -72 -46 169 -94 181 6 -98 -143 183 -107 -9 79 133 -6 0 -9 58 -137
5028 -137 -55 -116 -8 87 -78 -73 -15 163 207 25 50 -93 -5 144 -33 205 -26 -75 -175 19 -131 -27 132
5051 132 29 -75 92 -236 -24 49 -91 -47 64 -14 -264 167 -28 -43 -80 187 35 -75 11 19 -95 20 -153
$$ packed form
4880g4R8j73R9J57j40l2kJ09l7j09R3P3r1l0r1J26l3J90j73j5J24j23K48k31J71
4905A34j34j9r4J11J1j69K32J2q5j56k5K0K20n0k32J32J44k48K78Q3r7j57J21
4928C2J03K3j94J43j72O7K01l08k1K10K1k17J29M6j24JJ03j27J43k16L10o4o3
4951B6L2K6L3k11J58P4j40n6j11J88J7j06J15j00j7J68j68j84K28P4J5j02Q8j51
4975a04R3Oj69p5J48M2p6Q8PM8m0NK5M5p7J44n9j86K64k08qM4J48p1J1R8l8k01
5003i6J16OJ1j80O9J29j05k2K6K15k63K75j75j04m5L26k90R8Q8N4j39OrO7j95
5028a37Q2o1J08R5j65NN8J78M4j82K5j43Q8J49j77K38k31m9j00J94j50J04J59
5051A32j03j04J67l28K12P3j40M4J11p8k50M31j95j5l7K67j52j10Q6Qj14J15j73
$$ plain form
5074 -153 -38 -161 79 170 119 116 138 -96 -124 20 186 56 -213 -157 113 -241 66 -50 -64 -105 30 -87 -70
5097 -70 7 -40 18 51 114 -186 -206 39 -44 165 -20 264 -45 -159 7 82 -32 87 -35 208 56 -9 -47 -72
5121 -72 -11 124 -64 2 -40 -135 -14 188 264 175 -40 112 109 56 -4 -96 -79 -166 -98 -16 -148 58 214 -66 -69 18
5147 18 4 -244 57 -153 -70 -49 -24 46 -139 -105 80 46 -85 -45 116 -31 -200 -16 82 -241 4 -77 -44 61
5171 61 101 58 -6 -49 99 -97 153 279 5 -161 -108 -34 -17 96 49 69 125 -61 -106 154 -154 -55 35 -2 129
5196 129 18 -271 64 28 -150 60 16 -209 -177 -160 -74 -157 -73 -26 46 -13 5 38 -97 38 -61 -74 -19 97 -37
5221 -37 -97 -72 -38 157 69 -43 102 79 -152 -84 151 -91 -75 -68 -16 -42 37 53 61 107 -41 -81 86 -226 -78 33
5247 33 -143 -109 -23 75 -9 -22 -24 1 69 -102 -28 7 144 66 0 62 55 26 72 128 -96 71 39 -10 -7 109 0 -228
$$ packed form
5074a53J15j23K40R1n1lK2k34k8J44J66j30k69N6K70l54L07j16j4m1J35j17J7
5097g0P7m7N8L3O3l00k0K45q3K09j85K84l09j14J66P5j14J19j22K43j52o5l8k5
5121g2O1J35j88O6m2r5J21K02P6q9k15J52ln3o0r2J7q7O8Q2j32K06J56k80lQ7
5147A8j4k48L01k10Q3K1K5P0j85L4J85l4j31M0J61j47j69J84R8l23K45q1L3J05
5171F1M0m3o4m3J48j96K50J26k74j66N3P4J7J13m7K0N6j86m5K60l08R9R0l7J31
5196A29j11k89L35l6j78K10m4k25L2J7Q6q3Q4M7P2n9J8L3j35J35r9j3N5J16j34
5221c7o0K5L4J95q8j12J45k3k31O8K35k42J6PN2k6P9J6QM6j48m0J67l12J48J11
5247C3j76L4Q6R8q4j3kK5O8j71P4L5J37p8o6O2pk9M6N6k24J67l2m9LJ16j09k28
$$ plain form
5275 -228 -2 -252 17 0 -74 24 32 9 -27 8 174 -70 -138 90 -45 74 94 212 -99 25 41 -161 -191 78
5299 78 91 -136 89 80 -109 -20 124 88 75 42 124 -31 106 -78 -1 -60 -220 -115 -19 -180 -155 60 -406 102
5323 102 226 -120 129 105 117 85 10 162 -106 -99 29 62 43 40 8 0 87 -140 -33 -9 116 -56 -99 196 -274
5348 -274 -263 -22 -27 58 155 292 183 -168 87 -92 -79 2 -77 -80 -100 78 -95 -197 -41 136 -70 -79 -94 118 3
5373 3 -150 33 135 79 -60 139 10 -146 -68 -115 4 39 171 143 -94 -187 164 -108 -62 0 -92 -83 46 176
5397 176 25 151 156 69 74 1 -128 54 -30 -27 -160 -183 -60 26 -133 -16 -4 -104 23 -27 98 79 21 261 -27
5422 -27 -106 40 -75 104 -104 -135 271 -60 -204 -18 -147 19 -78 228 38 -117 -216 -26 23 40 17 -117 66
5445 66 -32 3 -227 -84 -30 -94 158 106 11 76 -109 156 -4 1 -42 98 178 168 -69 -87 30 22 -37 -114 57 -4
$$ packed form
5275b28K26k50K69j7p4R8Qk3l6L5J66k44o8K28j35J19K0J18l11J24J6k02l0K69
5299G8J3k27K25rj89Q9J44l6j3l3Q2j55J37j84P7n9j60J05R6j61K5K15m66N08
5323A02J24l46K49k4J2l2p5J52k68PJ28L3j9ll2qQ7k27J07K4J25j72m3K95m70
5348b74J1K41nQ5R7J37j09l51K55j79J3Q1p9lk0J78j73j02J56J77k06rj5K12j15
5373Cj53J83J02n6j39J99j29j56P8m7J19L5J32k8k37r3L51k72M6O2r2RJ29J30
5397A76j51J26Nq7Np3j29J82q4Lj33k3J23Q6j59J17J2j00J27n0J25j9n8K40k88
5422b7p9J46j15J79k08l1M06l31j44J86j29J66r7L06j90j55r9J90M9J7k3j34J83
5445F6r8L5k30J43N4o4K52n2r5O5j85K65j60Nm3J40Q0j0k37j8J17qn9p7J71o1
$$ plain form
5471 -4 -1 117 -17 -63 -149 16 127 7 -132 -36 -145 -69 -77 70 -80 174 -32 154 170 -19 12 -24 47 -44 -109
5496 -109 21 -42 44 -85 -172 -64 52 5 -105 17 163 199 36 -133 -14 86 173 -21 -15 -155 -19 -149 22
5519 22 117 135 18 -213 22 -64 -302 141 -12 -104 74 -13 58 -30 -60 74 -110 -47 -168 102 222 117 -205
5542 -205 -225 203 -96 -52 38 26 -149 178 208 4 -21 20 219 85 -81 32 -25 101 132 65 -193 172 -48
5565 -48 -35 12 -49 6 -17 -234 121 33 -100 -26 -3 151 -57 -142 53 184 -136 -74 -70 -145 60 16 -157 -97 -22 -50
5591 -50 47 118 -223 -221 -161 92 -54 -104 19 93 119 227 -185 -195 -23 -120 -20 45 -29 -141 -9 36 -121 38 -152
5616 -152 49 134 -122 -136 77 21 452 675 -176 47 -2 234 -234 -13 8 -284 -34 194 -61 -101 256 315
5638 315 210 -465 -72 375 147 -94 419 188 16 -56 -370 15 233 756 162 134 54 161 222 285 59 38
$$ packed form
5471dLJ18j34m6q6J65J11j20j39R6j09P6qJ47j50K54k06J86J6j89L1l6P1r1o5
5496a09J30o3Q6j29q7J08J16m7j10J22J46L6j63j69J19J00Q7j94Oj40J36j30J71
5519B2R5J8j17k31K35q6k38M43j53r2J78q7P1q8l0J34j84O3j21K70J20j05l22
5542b05k0M28k99M4R0j2j75L27L0k04k5M1J99j34j66J13n7J26L1o7k58L65k20
5565d8J3M7o1N5k3k17L55q8j33P4K3J54k08q5J95J31l20O2Mp5K05m4j73O0P5k8
5591e0R7P1l41KO0K53j46n0J23P4K6J08m12j0J72r7J00O5p4j12J32M5j57J59j90
5616a52K01Q5k56j4K13n6M31K23q51K23m9K36m68K21K1k92K50K28k55m0L57N9
5638C15j05o75L93M47k28k41N13k31j72p2l14L85K18N23n94k8q0J07O1O3k26k1
$$ plain form
5660 38 -20 23 -166 102 5 -220 -49 -43 113 -118 39 -15 16 -26 106 32 16 -124 84 65 -69 138 163 -19
5684 -19 185 47 -264 37 -72 190 -86 160 -84 16 -34 129 -7 278 -243 -244 70 369 -132 254 46
5705 46 -549 -34 -298 78 183 142 -177 64 -81 224 93 102 -5 83 -48 52 -86 -38 -108 -80 -44 43 -12 50
5729 50 -252 76 11 -83 376 -78 84 20 232 104 512 304 -102 423 -284 545 -139 -527 305 75 28 -65
5751 -65 187 90 31 111 41 199 34 86 107 -13 -84 109 12 37 56 -6 136 56 -5 -95 85 17 -98 -55 -100 -94 30
5778 30 56 79 -95 -147 -216 86 -97 192 117 -4 -28 18 -176 41 -199 20 93 -52 -45 76 126 37 44 -25 36 97
5804 97 -62 13 -65 67 49 -184 192 -19 9 -61 -30 -147 -26 168 -31 71 -32 147 119 45 50 77 -9 -235
$$ packed form
5660C8n8M3j89K68r7k25J71OJ56k31J57n4L1m2J32p4j6j40K08j9j34K07K5j82
5684a9K04j38l11L01j09K62k76K46k44J00n0J63j36K85n21jL14K99n01L86k08
5705D6n95N15k64L76J05m1l19K41j45L05j31Rj07Q8j31J00j38M8p0K8L6Q7n5O2
5729E0l02L28o5r4M59m54J62o4K12j28M08k08m06N25p07Q29o84l88Q32k30m7r3
5751f5K52r7n9Q0p0J58j65N2K1j20p1J93r7K5J9o2J42q0o1r0J80o8j15M3m5OJ24
5778C0K6K3j74n2o9L02j83K89p5j21k4M6j94K17k40K19P3j45PJ21N0q9Po9O1O1
5804I7j59P5p8J32j8k33L76k11K8p0L1j17J21J94j99J02j03J79k8p4NK7q6k26
$$ [...]
8191a25
##END NTUPLES=NMR FID
##END=
