##TITLE=1H_IG-benzol
 200.13MHz, ,
 8 sc
 
 13.8.2025
##JCAMPDX= 6.0         $$ Bruker NMR JCAMP-DX V2.0
##DATA TYPE= NMR FID
##DATA CLASS= NTUPLES
##ORIGIN= UXNMR, Bruker Analytische Messtechnik GmbH
##OWNER= pz
$$ XWIN-NMR		Version 3.5
$$ Wed Aug 13 14:36:15 2025 Russian Standard Time (UT+4h)  she@DPX200
##.OBSERVE FREQUENCY= 200.1313
##.OBSERVE NUCLEUS= ^1H
##.DELAY= (6, 6)
##.ACQUISITION MODE= SIMULTANEOUS
##.ACQUISITION SCHEME= undefined
##.AVERAGES= 8
##.DIGITISER RES= 18
##SPECTROMETER/DATA SYSTEM= spect
##.PULSE SEQUENCE= zg30
##.SOLVENT NAME= CDCl3
##.SHIFT REFERENCE= (INTERNAL, CDCl3, 0, 14.3821)
##AUDIT TRAIL= $$ (NUMBER, WHEN, WHO, WHERE, WHAT)
$$ ##TITLE= Audit trail, XWIN-NMR		Version 3.5
$$ ##JCAMPDX= 5.01
$$ ##ORIGIN= Bruker BioSpin GmbH
$$ ##OWNER= she
$$ F:/spectra/data/she/nmr/H-C/1/audita.txt
$$ ##AUDIT TRAIL=  $$ (NUMBER, WHEN, WHO, WHERE, WHAT)
(   1,<2025-08-13 14:34:16.96 +0400>,<she>,<DPX200>,
      <created by zg, POWCHK disabled, PULCHK disabled
       configuration hash MD5:
       00 E9 B6 7A A2 85 ED C7 34 08 36 98 17 FE 4E 26
       data hash MD5: 16K
       F7 C8 FC 61 49 57 42 C6 FB C1 22 8E E3 3D 30 02>)
$$ ##END=
$$ 
$$ hash MD5
$$ A9 CC 6C 08 45 AB 32 8D 5D 89 3E E4 0B B8 54 5A
##$RELAX= 
##$RELAX= 
##$RELAX= 
##$RELAX= 
##$RELAX= 
##$RELAX= 
$$ Bruker specific parameters
$$ --------------------------
##$DU= <F:/spectra>
##$EXPNO= 1
##$NAME= <H-C>
##$PROCNO= 1
##$TYPE= <nmr>
##$USER= <she>
##$AMP= (0..31)
100 100 100 100 100 100 100 100 100 100 100 100 100 100 100 100 100 100 
100 100 100 100 100 100 100 100 100 100 100 100 100 100 
##$AQSEQ= 0
##$AQ_mod= 1
##$AUNM= <au_zg>
##$AUTOPOS= <>
##$BF1= 200.13
##$BF2= 200.13
##$BF3= 200.13
##$BF4= 200.13
##$BF5= 200.13
##$BF6= 200.13
##$BF7= 200.13
##$BF8= 200.13
##$BYTORDA= 1
##$CFDGTYP= 0
##$CFRGTYP= 5
##$CHEMSTR= <none>
##$CNST= (0..31)
1 1 145 1 1 1 1 1 1 1 1 1 1 1 1 1 1 1 1 1 1 1 1 1 1 1 1 1 1 1 1 1 
##$CPDPRG= <>
##$CPDPRG1= <>
##$CPDPRG2= <>
##$CPDPRG3= <>
##$CPDPRG4= <mlev>
##$CPDPRG5= <mlev>
##$CPDPRG6= <mlev>
##$CPDPRG7= <mlev>
##$CPDPRG8= <mlev>
##$CPDPRGB= <>
##$CPDPRGT= <>
##$D= (0..31)
0 0.7 0 0 0 0 0 0 0 0 0 0.03 0 0 0 0 0 0 0 0 0 0 0 0 0 0 0 0 0 0 0 0 
##$DATE= 1755081256
##$DBL= (0..7)
120 120 120 120 120 120 120 120 
##$DBP= (0..7)
150 150 150 150 150 150 150 150 
##$DBP07= 0
##$DBPNAM0= <>
##$DBPNAM1= <>
##$DBPNAM2= <>
##$DBPNAM3= <>
##$DBPNAM4= <>
##$DBPNAM5= <>
##$DBPNAM6= <>
##$DBPNAM7= <>
##$DBPOAL= (0..7)
0.5 0.5 0.5 0.5 0.5 0.5 0.5 0.5 
##$DBPOFFS= (0..7)
0 0 0 0 0 0 0 0 
##$DE= 6
##$DECBNUC= <off>
##$DECIM= 32
##$DECNUC= <off>
##$DECSTAT= 4
##$DIGMOD= 1
##$DIGTYP= 9
##$DL= (0..7)
0 120 120 120 120 120 120 120 
##$DP= (0..7)
150 150 150 150 150 150 150 150 
##$DP07= 0
##$DPNAME0= <>
##$DPNAME1= <>
##$DPNAME2= <>
##$DPNAME3= <>
##$DPNAME4= <>
##$DPNAME5= <>
##$DPNAME6= <>
##$DPNAME7= <>
##$DPOAL= (0..7)
0.5 0.5 0.5 0.5 0.5 0.5 0.5 0.5 
##$DPOFFS= (0..7)
0 0 0 0 0 0 0 0 
##$DQDMODE= 0
##$DR= 18
##$DS= 0
##$DSLIST= <SSSSSSSSSSSSSSS>
$$ [...]
##$SUBNAM0= <"">
##$SUBNAM1= <"">
##$SUBNAM2= <"">
##$SUBNAM3= <"">
##$SUBNAM4= <"">
##$SUBNAM5= <"">
##$SUBNAM6= <"">
##$SUBNAM7= <"">
##$SUBNAM8= <"">
##$SUBNAM9= <"">
##$SW= 18.0517328524113
##$SWIBOX= (0..15)
0 0 2 0 0 0 0 0 0 0 0 0 0 0 0 0 
##$SW_h= 3612.71676300578
##$TD= 16384
##$TD0= 1
##$TE= 0
##$TE2= 300
##$TE3= 300
##$TEG= 300
##$TL= (0..7)
0 120 120 120 120 120 120 120 
##$TP= (0..7)
150 150 150 150 150 150 150 150 
##$TP07= 0
##$TPNAME0= <>
##$TPNAME1= <>
##$TPNAME2= <>
##$TPNAME3= <>
##$TPNAME4= <>
##$TPNAME5= <>
##$TPNAME6= <>
##$TPNAME7= <>
##$TPOAL= (0..7)
0.5 0.5 0.5 0.5 0.5 0.5 0.5 0.5 
##$TPOFFS= (0..7)
0 0 0 0 0 0 0 0 
##$TUNHIN= 0
##$TUNHOUT= 0
##$TUNXOUT= 0
##$USERA1= <user>
##$USERA2= <user>
##$USERA3= <user>
##$USERA4= <user>
##$USERA5= <user>
##$V9= 5
##$VALIST= <valist>
##$VCLIST= <CCCCCCCCCCCCCCC>
##$VD= 0
##$VDLIST= <DDDDDDDDDDDDDDD>
##$VPLIST= <PPPPPPPPPPPPPPP>
##$VTLIST= <TTTTTTTTTTTTTTT>
##$WBST= 1024
##$WBSW= 4
##$XGAIN= (0..3)
0 0 0 0 
##$XL= 0
##$YL= 0
##$YMAX_a= 688023
##$YMIN_a= -864754
##$ZGOPTNS= <>
##$ZL1= 120
##$ZL2= 120
##$ZL3= 120
##$ZL4= 120
##$ABSF1= 10
##$ABSF2= 0
##$ABSG= 5
##$ABSL= 3
##$ALPHA= 0
##$AQORDER= 0
##$ASSFAC= 0
##$ASSFACI= 0
##$ASSFACX= 0
##$ASSWID= 0
##$AUNMP= <proc_1d>
##$AZFE= 0.1
##$AZFW= 0.1
##$BCFW= 1
##$BC_mod= 2
##$BYTORDP= 1
##$COROFFS= 0
##$CY= -3
##$DATMOD= 1
##$DC= 2
##$DFILT= <>
##$DTYPP= 0
##$F1P= 0
##$F2P= 0
##$FCOR= 0.5
##$FTSIZE= 0
##$FT_mod= 4
##$GAMMA= 1
##$GB= 0.15
##$INTBC= 1
##$INTSCL= 1
##$ISEN= 128
##$LB= 0.25
##$LEV0= 0
##$LPBIN= 0
##$MAXI= 10000
##$MC2= 0
##$MEAN= 0
##$ME_mod= 0
##$MI= 1.114404
##$NCOEF= 0
##$NC_proc= 0
##$NLEV= 6
##$NOISF1= 3.799351
##$NOISF2= 2.8
##$NSP= 1
##$NTH_PI= 0
##$NZP= 0
##$OFFSET= 14.38212
##$PC= 1
##$PHC0= -1454.77
##$PHC1= 9.19228
##$PH_mod= 1
##$PKNL= yes
##$PPARMOD= 0
##$PSCAL= 0
##$PSIGN= 0
##$REVERSE= no
##$SF= 200.129724274929
##$SI= 16384
##$SIGF1= 3
##$SIGF2= 2
##$SINO= 400
##$SIOLD= 16384
##$SREGLST= <1H.CDCl3>
##$SSB= 0
##$STSI= 0
##$STSR= 0
##$SW_p= 3205.1282051282
##$SYMM= 0
##$S_DEV= 0
##$TDeff= 0
##$TDoff= 0
##$TI= <>
##$TILT= no
##$TM1= 0
##$TM2= 0
##$TOPLEV= 0
##$USERP1= <user>
##$USERP2= <user>
##$USERP3= <user>
##$USERP4= <user>
##$USERP5= <user>
##$WDW= 1
##$XDIM= 8192
##$YMAX_p= 0
##$YMIN_p= 0
$$ End of Bruker specific parameters
$$ ---------------------------------
##NTUPLES= NMR FID
##VAR_NAME=  TIME,          FID/REAL,        FID/IMAG
##SYMBOL=    X,             R,               I
##VAR_TYPE=  INDEPENDENT,   DEPENDENT,       DEPENDENT
##VAR_FORM=  AFFN,          ASDF,            ASDF
##VAR_DIM=   8192,          8192,            8192
##UNITS=     SECONDS,       ARBITRARY UNITS, ARBITRARY UNITS
##FACTOR=    0.0002768,     1,               1
##FIRST=     0,             0,               0
##LAST=      2.2672688,     0,               0
##MIN=       0,             -864754,         0
##MAX=       2.2672688,     688023,          0
$$ Real data points
##PAGE= N=1
##DATA TABLE= (X++(R..R)), XYDATA
0 0 0 0 0 0 0 0 -1 0 0 8 -8 9 -16 16 -24 26 -33 45 -50 65 -79 90 -111 129 -149 179 -204 238 -274 312 -360
31 -360 409 -464 528 -593 670 -752 841 -943 1050 -1168 1299 -1441 1597 -1766 1949 -2154
47 -2154 2374 -2615 2883 -3174 3499 -3856 4255 -4704 5208 -5783 6441 -7208 8114 -9200
61 -9200 10536 -12220 14424 -17444 21864 -28974 42347 -76487 361286 573186 -140339 -578699
73 -578699 -818632 -573421 -137469 363194 575809 492035 113051 -274832 -511159 -428739
83 -428739 -129948 247540 461362 432478 162055 -167172 -395462 -385606 -175234 124570 328510
94 328510 342675 157387 -102249 -296787 -311234 -152772 89120 269406 295034 153230 -65259
105 -65259 -239087 -269800 -150595 46800 204713 238147 132672 -42731 -185531 -213710 -116843
116 -116843 45099 175445 200804 109664 -41023 -163072 -187270 -103599 36040 149067 171700
127 171700 93951 -35450 -139945 -159576 -85417 37114 135616 153562 82161 -35732 -131085
138 -131085 -149854 -82433 30364 123305 143376 81058 -26018 -115257 -135679 -77152 25003
149 25003 110772 130872 74768 -23980 -107795 -128560 -75317 20195 102526 124859 75447 -15756
161 -15756 -95930 -119428 -74127 12561 90039 114414 72968 -8943 -83652 -108770 -71409 5336
173 5336 76454 101525 67491 -4329 -71531 -95417 -63266 5162 69335 92220 60947 -5345
185 -5345 -67968 -90602 -60510 4372 66342 89723 61319 -2050 -63753 -88400 -62305 -836
197 -836 60309 86419 62731 3537 -57091 -84395 -63272 -6276 53582 82302 63867 9376
209 9376 -49766 -79979 -64407 -12472 45825 77554 64926 15789 -41836 -75276 -66159 -19966
221 -19966 36778 72387 67153 24750 -30635 -67915 -66813 -28591 24578 63038 65487 31500 -19315
234 -19315 -58286 -64141 -34046 14162 53562 62232 36112 -9587 -48936 -60261 -37672 5399
246 5399 44710 58332 39221 -1508 -40775 -56908 -41036 -2604 36982 55781 43720 7749
258 7749 -31937 -53826 -46108 -13602 25706 50273 47124 18462 -19479 -46129 -47118 -22589 13735
271 13735 41893 46865 26330 -8059 -37489 -46223 -29858 2322 32667 44979 32847 3387
283 3387 -27332 -42779 -34955 -8506 21949 40027 36214 12933 -16923 -37242 -37181 -17192 11706
296 11706 33820 37465 20895 -6422 -29727 -36528 -23387 2081 25873 35137 24930 1264 -22846
309 -22846 -34142 -26519 -4391 20079 33452 28363 7828 -16787 -32088 -29654 -11003 13394 30230
322 30230 30090 13298 -10804 -28837 -30782 -15517 8308 27615 31666 18241 -5142 -25595 -31799
335 -31799 -20362 2000 22913 30732 21215 -47 -20884 -29665 -21330 -843 20106 29556 22076
348 22076 1846 -19587 -30082 -23486 -3533 18566 30243 24850 5249 -17365 -30317 -26039 -6992
361 -6992 16147 30318 27401 8940 -14580 -30043 -28607 -11122 12542 29048 29108 12716 -10676
374 -10676 -27902 -29128 -13769 9324 27022 29288 14735 -8145 -26365 -29601 -15925 6727 25512
387 25512 29697 16927 -5343 -24468 -29489 -17667 4203 23553 29312 18177 -3364 -22926 -29348
400 -29348 -18801 2473 22402 29463 19650 -1360 -21559 -29394 -20402 220 20609 29112 20813
413 20813 600 -19896 -28973 -21298 -1427 19316 28993 22075 2451 -18537 -28993 -22899 -3797
426 -3797 17358 28565 23421 4979 -16056 -27855 -23538 -5823 15076 27263 23731 6646 -14122
439 -14122 -26719 -23957 -7597 12905 25823 23779 8129 -11988 -25067 -23576 -8544 11290 24574
452 24574 23664 9174 -10426 -23958 -23663 -9856 9436 23150 23454 10347 -8518 -22364 -23187 -10670
466 -10670 7826 21687 22978 11055 -7144 -21177 -22924 -11556 6335 20502 22901 12176 -5335
479 -5335 -19718 -22727 -12805 4263 18708 22385 13250 -3228 -17715 -21907 -13648 2156 16498
492 16498 21278 13946 -1082 -15218 -20492 -14072 82 13782 19405 13847 695 -12460 -18224
505 -18224 -13458 -1256 11233 16999 12895 1644 -10116 -15706 -12166 -1842 9102 14378 11137
518 11137 1639 -8414 -13230 -10114 -1219 8022 12331 9248 862 -7735 -11495 -8411 -469 7391 10614
533 10614 7345 -252 -7512 -10100 -6456 999 7797 9874 5913 -1588 -8133 -9740 -5429 2140 8390
548 8390 9616 4955 -2714 -8951 -9806 -4767 3225 9467 10215 4904 -3340 -9800 -10583 -5161 3301 9910
564 9910 10779 5365 -3228 -10012 -11037 -5666 2989 9989 11276 6050 -2593 -9753 -11315 -6420 2066
579 2066 9273 11114 6550 -1642 -8762 -10751 -6496 1363 8299 10354 6410 -1135 -7896 -9922 -6281
594 -6281 851 7302 9308 5881 -867 -6881 -8612 -5204 1164 6717 8134 4645 -1597 -6796 -7876
609 -7876 -4234 1945 6855 7624 3774 -2348 -7037 -7430 -3322 2864 7365 7452 2951 -3468 -7926 -7813
625 -7813 -2990 3752 8413 8244 3185 -3844 -8758 -8599 -3399 3897 9106 9028 3703 -3892 -9454 -9628
641 -9628 -4306 3569 9510 10100 4983 -2963 -9297 -10296 -5550 2368 8848 10326 5935 -1795 -8434 -10281
657 -10281 -6297 1237 7973 10160 6588 -561 -7270 -9772 -6753 -58 6423 9062 6473 336 -5844
672 -5844 -8476 -6177 -363 5465 8070 5964 552 -4963 -7538 -5675 -723 4436 6735 5056 486
687 486 -4186 -6113 -4356 10 4234 5766 3778 -502 -4427 -5623 -3435 850 4615 5510 3058 -1325
703 -1325 -4946 -5558 -2800 1770 5353 5826 2791 -2050 -5782 -6179 -2990 2069 5988 6452 3180 -1979
719 -1979 -6103 -6619 -3278 2019 6197 6840 3478 -1980 -6358 -7097 -3767 1799 6359 7313 4057 -1568
735 -1568 -6297 -7397 -4220 1361 6193 7450 4373 -1216 -6205 -7576 -4645 940 6067 7691 4914
750 4914 -612 -5817 -7600 -5073 373 5567 7510 5088 -286 -5484 -7520 -5207 150 5472 7695
765 7695 5532 170 -5289 -7743 -5769 -580 4976 7662 5974 882 -4720 -7664 -6227 -1352 4363
780 4363 7556 6489 1802 -3841 -7272 -6544 -2176 3269 6821 6401 2378 -2939 -6478 -6301 -2539 2606
796 2606 6207 6200 2707 -2272 -5894 -6155 -2886 1943 5563 5974 2998 -1629 -5299 -5878 -3139 1399 5034
813 5034 5790 3322 -1061 -4655 -5627 -3411 684 4293 5349 3398 -447 -3981 -5194 -3478 214 3696
829 3696 5029 3481 63 -3363 -4797 -3542 -330 2945 4494 3459 535 -2657 -4165 -3335 -632
844 -632 2388 3947 3264 757 -2154 -3744 -3170 -842 1923 3499 3067 945 -1711 -3298 -2977 -1022
860 -1022 1580 3131 2971 1116 -1370 -3017 -3006 -1346 1018 2745 2915 1518 -681 -2325 -2688 -1561
876 -1561 343 1947 2395 1501 -198 -1665 -2176 -1405 104 1426 1915 1347 27 -1204 -1652 -1131 -38
893 -38 1002 1392 894 -114 -1035 -1326 -817 155 1051 1371 907 -98 -1008 -1333 -945 7 897 1282 894 22
913 22 -910 -1332 -1050 -162 837 1367 1220 393 -617 -1331 -1318 -671 307 1115 1340 859 -39 -896 -1295 -1006 -220
934 -220 702 1222 1137 473 -389 -1047 -1166 -721 21 784 1076 848 209 -503 -884 -843 -339 296 687 676 285
955 285 -255 -629 -618 -269 245 597 638 303 -208 -579 -622 -338 138 499 472 175 -226 -496 -441 -88 392 622
977 622 514 52 -442 -726 -536 -36 509 745 532 -108 -751 -976 -625 140 960 1255 894 -51 -1032 -1478
997 -1478 -1126 -111 1027 1553 1226 117 -1135 -1740 -1407 -148 1284 2023 1668 278 -1342 -2279 -2005
1014 -2005 -511 1335 2437 2226 677 -1373 -2700 -2531 -888 1366 2993 2965 1283 -1282 -3230 -3434
1030 -3434 -1781 946 3235 3730 2207 -622 -3159 -3937 -2556 326 3107 4110 2876 -19 -2990
1045 -2990 -4268 -3213 -321 2816 4327 3473 628 -2618 -4325 -3656 -866 2455 4320 3787 1038 -2364
1061 -2364 -4389 -3956 -1238 2231 4433 4153 1492 -2105 -4474 -4334 -1684 1930 4460 4450 1895 -1812
1077 -1812 -4514 -4634 -2100 1694 4512 4827 2375 -1534 -4524 -4941 -2598 1288 4419 5027 2761 -1144
1093 -1144 -4370 -5061 -2867 1025 4343 5161 3021 -925 -4337 -5261 -3186 757 4251 5317 3319 -652
1109 -652 -4298 -5413 -3430 567 4304 5541 3614 -406 -4293 -5712 -3841 249 4232 5774 4014
1124 4014 -115 -4203 -5874 -4155 -7 4205 5973 4346 160 -4181 -6134 -4564 -345 4109 6194
1139 6194 4704 498 -4098 -6310 -4892 -638 4051 6446 5116 817 -4039 -6603 -5392 -1090 3899
1154 3899 6672 5600 1316 -3795 -6742 -5830 -1537 3662 6805 6047 1753 -3543 -6901 -6275 -2023 3412
1170 3412 6966 6539 2313 -3266 -7043 -6774 -2609 3078 7067 7012 2905 -2935 -7079 -7258 -3261 2645
1186 2645 7062 7511 3648 -2308 -6994 -7657 -3964 1991 6822 7764 4245 -1750 -6747 -7945 -4573 1404
1202 1404 6604 8101 4958 -1033 -6413 -8173 -5273 630 6189 8202 5528 -305 -5966 -8265 -5798
1217 -5798 -49 5734 8306 6137 498 -5407 -8253 -6384 -874 5038 8095 6509 1232 -4745 -7975
1232 -7975 -6640 -1549 4442 7849 6819 1880 -4114 -7782 -6996 -2217 3709 7490 6999 2514 -3355
1247 -3355 -7255 -6988 -2704 3074 7059 7018 2950 -2740 -6867 -7040 -3205 2417 6585 6940 3389 -2116
1263 -2116 -6300 -6834 -3428 1946 6128 6778 3562 -1727 -6015 -6798 -3761 1454 5753 6755 3874 -1224
1279 -1224 -5576 -6683 -3966 1024 5395 6645 4060 -834 -5248 -6615 -4254 541 4987 6606 4388
1294 4388 -303 -4790 -6522 -4476 85 4550 6396 4606 129 -4363 -6329 -4716 -379 4143 6307
1309 6307 4848 674 -3893 -6157 -4953 -911 3590 6003 4999 1125 -3346 -5873 -5036 -1317 3156
1324 3156 5757 5103 1556 -2906 -5618 -5177 -1823 2591 5422 5201 2012 -2301 -5199 -5183 -2192 2063
1340 2063 5075 5212 2373 -1758 -4862 -5207 -2625 1416 4610 5127 2757 -1159 -4405 -5052 -2845 960
1356 960 4192 5042 3002 -713 -4065 -5052 -3252 393 3789 4954 3428 -72 -3461 -4914 -3538 -244
1372 -244 3211 4759 3645 479 -2959 -4655 -3784 -787 2634 4507 3871 1070 -2315 -4351 -3913 -1325
1388 -1325 1994 4148 3980 1637 -1679 -3972 -4024 -1894 1286 3723 4075 2218 -923 -3450 -4066 -2442
1404 -2442 471 3050 3902 2629 -82 -2715 -3754 -2737 -243 2368 3584 2810 526 -2006 -3305
1419 -3305 -2803 -791 1652 3086 2770 956 -1355 -2844 -2694 -1084 1129 2688 2694 1244 -897 -2465
1435 -2465 -2631 -1372 652 2239 2579 1434 -461 -2076 -2492 -1496 338 1916 2417 1578 -167 -1790
1451 -1790 -2426 -1649 -5 1653 2370 1719 100 -1587 -2342 -1785 -218 1446 2309 1887 380 -1338 -2312
1468 -2312 -1988 -531 1218 2266 2080 691 -1087 -2240 -2163 -792 1007 2257 2209 933 -905 -2274
1484 -2274 -2359 -1170 754 2249 2512 1361 -589 -2201 -2602 -1542 421 2128 2678 1690 -252 -2116
1500 -2116 -2841 -1972 12 2001 2924 2194 243 -1848 -2950 -2391 -519 1696 2960 2578 767 -1529
1516 -1529 -2953 -2740 -1011 1310 2943 2897 1260 -1077 -2828 -3045 -1544 794 2715 3049 1734 -556
1532 -556 -2565 -3140 -1967 342 2441 3185 2160 -98 -2263 -3145 -2305 -177 2011 3073 2370 363
1548 363 -1867 -3006 -2440 -495 1713 2924 2523 654 -1570 -2909 -2604 -850 1340 2816 2665 1013
1564 1013 -1194 -2699 -2641 -1101 1068 2589 2643 1172 -941 -2533 -2662 -1311 781 2442 2699 1418
1580 1418 -624 -2303 -2666 -1501 546 2245 2669 1565 -385 -2161 -2678 -1660 279 2053 2675 1799
1596 1799 -101 -1908 -2615 -1888 -91 1738 2554 1916 226 -1583 -2452 -1952 -371 1394 2338 1929 460
1613 460 -1227 -2175 -1914 -582 1053 1989 1793 583 -930 -1872 -1724 -598 835 1758 1644 576 -789
1630 -789 -1660 -1573 -556 728 1519 1439 500 -727 -1454 -1349 -390 780 1471 1327 349 -822 -1511 -1357 -389
1649 -389 795 1543 1356 454 -776 -1501 -1401 -487 718 1475 1430 526 -660 -1464 -1418 -614 571 1371 1365 644
1669 644 -455 -1271 -1298 -588 445 1239 1251 548 -459 -1169 -1204 -544 452 1161 1201 530 -419 -1118 -1163 -500 394
1690 394 1055 1070 474 -427 -1082 -1133 -491 413 1075 1125 517 -390 -1064 -1104 -517 388 1084 1088 497 -360 -1101 -1141
1712 -1141 -579 390 1129 1224 663 -313 -1050 -1244 -736 192 1024 1277 854 -124 -994 -1325 -964 -31 881 1287
1732 1287 1023 182 -713 -1226 -1100 -366 550 1158 1115 457 -364 -1020 -1144 -611 170 832 1060 719 48 -624
1752 -624 -922 -797 -211 442 776 744 357 -184 -582 -674 -395 -12 399 578 436 154 -233 -439 -444 -227 25
1773 25 272 440 321 117 -124 -308 -362 -222 9 229 337 292 49 -142 -306 -359 -176 96 300 390 242 -16
1795 -16 -261 -403 -260 10 249 400 287 -4 -277 -439 -310 16 358 515 373 5 -405 -602 -433 -39
1815 -39 419 645 532 71 -420 -747 -620 -127 467 842 746 218 -442 -899 -851 -332 387 925 960 423 -366
1836 -366 -969 -1038 -504 338 1005 1095 603 -290 -1043 -1259 -752 214 1054 1315 886 -83 -1022 -1378 -969 6 992
1857 992 1414 1046 64 -995 -1472 -1193 -183 920 1497 1275 313 -826 -1529 -1365 -411 795 1555 1425
1875 1425 504 -720 -1557 -1531 -620 662 1572 1664 747 -551 -1520 -1671 -881 459 1487 1686 930 -391
1893 -391 -1531 -1757 -987 347 1493 1831 1106 -218 -1464 -1867 -1214 110 1386 1830 1289 -60 -1412
1910 -1412 -1897 -1345 -10 1381 1947 1483 119 -1288 -1994 -1559 -251 1190 1963 1614 373 -1120 -1979
1927 -1979 -1698 -446 1071 1975 1773 552 -1023 -1983 -1851 -657 911 1942 1876 715 -831 -1919 -1915
1944 -1915 -791 801 1943 1935 850 -753 -1949 -2035 -955 681 1954 2083 1046 -626 -1952 -2139 -1162
1961 -1162 574 1960 2220 1262 -434 -1952 -2362 -1395 356 1936 2460 1564 -178 -1790 -2442 -1677 33
1978 33 1719 2436 1782 64 -1633 -2458 -1875 -196 1589 2448 1923 317 -1473 -2438 -2016 -461 1407
1995 1407 2401 2073 564 -1299 -2401 -2120 -642 1218 2375 2183 786 -1113 -2335 -2245 -854 1020
2011 1020 2310 2283 964 -913 -2271 -2290 -1025 838 2257 2367 1155 -749 -2209 -2401 -1205 658
2027 658 2185 2474 1310 -589 -2168 -2478 -1388 510 2157 2527 1509 -383 -2097 -2623 -1637 295
2043 295 2068 2660 1785 -104 -1969 -2636 -1873 20 1885 2690 1978 142 -1777 -2704 -2092 -303 1680
2060 1680 2700 2193 466 -1523 -2623 -2249 -659 1331 2572 2331 765 -1224 -2485 -2367 -914 1044
2076 1044 2389 2355 1009 -892 -2276 -2319 -1099 770 2151 2293 1140 -670 -2102 -2257 -1136 598
2092 598 2009 2302 1199 -548 -1955 -2240 -1241 460 1905 2236 1309 -383 -1880 -2247 -1342 291 1820
2109 1820 2277 1440 -198 -1748 -2258 -1504 103 1658 2230 1546 -32 -1577 -2242 -1609 -41 1519 2266
2126 2266 1695 176 -1439 -2224 -1760 -303 1313 2174 1838 405 -1202 -2105 -1815 -507 1074 2045 1846
2143 1846 586 -991 -2006 -1840 -687 847 1848 1802 738 -765 -1834 -1816 -769 710 1767 1788 831
2160 831 -636 -1736 -1858 -928 537 1663 1846 1013 -469 -1621 -1848 -1048 336 1576 1860 1119 -278
2177 -278 -1528 -1867 -1195 165 1441 1904 1288 -11 -1360 -1874 -1366 -52 1264 1838 1405 173 -1183
2194 -1183 -1879 -1519 -300 1073 1836 1598 442 -913 -1801 -1645 -598 771 1739 1725 714 -664 -1680
2211 -1680 -1763 -843 506 1567 1775 974 -336 -1460 -1794 -1132 149 1325 1774 1218 4 -1183 -1709
2228 -1709 -1278 -168 1043 1647 1348 304 -916 -1571 -1374 -442 724 1444 1372 490 -641 -1402 -1364 -557
2246 -557 570 1348 1363 610 -491 -1337 -1406 -728 393 1303 1521 833 -269 -1203 -1459 -936 156 1155 1475
2265 1475 1000 -79 -1111 -1544 -1116 -59 1038 1581 1209 198 -965 -1564 -1322 -312 858 1567 1371
2282 1371 432 -787 -1570 -1475 -565 681 1565 1569 725 -566 -1484 -1641 -878 399 1413 1687 994 -266 -1379
2301 -1379 -1711 -1134 104 1285 1742 1236 44 -1194 -1744 -1345 -193 1081 1700 1354 291 -1001 -1694
2318 -1694 -1430 -390 868 1621 1471 465 -804 -1653 -1562 -600 686 1594 1586 688 -605 -1537 -1618 -734 524
2337 524 1501 1614 826 -464 -1490 -1659 -895 379 1444 1682 979 -294 -1401 -1698 -1055 221 1336
2354 1336 1716 1073 -158 -1323 -1735 -1172 86 1256 1715 1228 26 -1183 -1715 -1251 -104 1144 1674
2371 1674 1274 147 -1064 -1654 -1326 -207 988 1629 1352 266 -931 -1592 -1334 -286 893 1569 1338
2388 1338 292 -907 -1560 -1339 -319 858 1538 1340 332 -817 -1555 -1343 -358 784 1505 1302 344
2405 344 -846 -1531 -1334 -339 882 1590 1361 330 -897 -1642 -1402 -395 890 1660 1483 410 -933
2422 -933 -1744 -1569 -489 897 1800 1662 576 -870 -1837 -1750 -691 801 1816 1830 802 -729 -1849
2439 -1849 -1905 -908 631 1816 1966 1036 -526 -1763 -2018 -1129 400 1645 2014 1241 -284 -1628 -2000
2456 -2000 -1233 179 1504 1962 1315 -118 -1456 -1956 -1359 26 1353 1857 1360 35 -1300 -1851 -1332
2473 -1332 -71 1241 1836 1364 90 -1251 -1812 -1392 -126 1225 1820 1388 178 -1159 -1836 -1398 -222
2490 -222 1089 1807 1426 232 -1122 -1815 -1477 -300 1054 1816 1533 406 -989 -1798 -1591 -470 921
2507 921 1763 1624 547 -821 -1742 -1641 -608 715 1704 1663 726 -613 -1594 -1639 -792 520 1495 1591 805
2526 805 -426 -1410 -1568 -833 387 1353 1530 869 -315 -1241 -1508 -913 196 1123 1441 905 -139 -1056
2544 -1056 -1359 -876 112 986 1309 857 -28 -888 -1194 -851 -23 777 1093 786 -11 -755 -1062 -697 9 732
2564 732 954 618 -68 -717 -942 -602 112 717 889 555 -127 -748 -897 -511 169 761 923 463 -199 -786
2584 -786 -912 -509 177 797 920 521 -159 -783 -908 -525 160 797 930 524 -153 -727 -937 -563 92 747
2604 747 990 625 -61 -716 -918 -637 31 662 909 664 -7 -658 -901 -644 -8 604 880 667 73 -551
2624 -551 -857 -669 -102 533 861 689 147 -485 -822 -656 -212 435 802 708 256 -339 -728 -731 -282 281 658
2645 658 663 286 -230 -601 -647 -310 145 532 573 375 -115 -468 -574 -333 44 389 474 316 -27 -318 -385 -232
2667 -232 -15 235 356 265 23 -242 -289 -215 16 175 265 170 3 -144 -219 -160 -7 142 152 79 -13 -99 -146 -90
2691 -90 -7 68 89 96 -7 -24 -58 -47 -9 9 -5 -21 -25 2 30 14 34 -2 -35 -61 -7 11 83 120 43 -56 -63 -143 -95 18 113
2722 113 183 107 -43 -171 -200 -98 19 165 219 132 -51 -191 -258 -186 -12 185 296 216 14 -217 -271 -257 -46
2745 -46 182 325 291 51 -179 -332 -291 -94 142 311 339 141 -95 -316 -332 -193 54 282 303 208 -26 -259
2767 -259 -338 -241 -2 178 297 243 58 -122 -242 -211 -94 52 173 168 63 -27 -89 -124 -102 -7 35 51 43 38 39 28 6
2794 6 -32 -66 -108 -50 8 99 135 157 5 -103 -201 -215 -81 99 241 244 113 -65 -281 -325 -176 76 304 386 234
2819 234 -40 -329 -433 -319 -11 307 481 336 13 -342 -506 -394 -61 320 559 480 119 -294 -611 -545 -189
2840 -189 283 580 596 241 -215 -570 -617 -316 179 609 704 392 -154 -596 -739 -471 18 521 718 495 10
2861 10 -460 -695 -555 -82 424 699 556 130 -352 -643 -594 -180 282 625 579 216 -231 -565 -578 -255 186
2882 186 527 546 243 -156 -495 -513 -279 99 468 525 289 -119 -382 -490 -295 88 346 433 230 -132 -382
2903 -382 -458 -242 72 345 432 243 -116 -379 -389 -214 102 311 403 217 -66 -356 -408 -235 89 329 431 253
2925 253 -60 -345 -421 -254 4 327 394 278 -3 -305 -440 -298 5 266 449 341 28 -256 -459 -371 -117
2946 -117 234 396 376 141 -134 -368 -390 -210 89 307 377 269 11 -230 -358 -294 -88 173 318 315 152 -64
2968 -64 -247 -306 -178 -17 159 225 211 78 -115 -225 -274 -151 10 158 231 224 69 -106 -220 -247 -135 29 173
2991 173 257 170 -19 -153 -262 -253 -66 143 306 298 119 -94 -275 -317 -177 32 275 312 208 7 -263 -333 -217
3014 -217 18 253 369 261 27 -218 -416 -304 -26 290 410 330 34 -285 -406 -332 -48 268 461 369 47
3035 47 -282 -503 -388 -80 282 486 427 122 -299 -531 -464 -107 331 568 499 152 -371 -672 -600 -182 364 709
3057 709 683 230 -349 -725 -716 -283 308 751 781 328 -319 -813 -878 -405 286 839 935 543 -215 -847 -1032 -617
3079 -617 167 841 1040 679 -94 -815 -1084 -756 18 796 1162 825 72 -739 -1143 -908 -163 676 1124 937
3099 937 215 -649 -1141 -1008 -319 580 1134 1034 363 -548 -1107 -1107 -426 445 1099 1089 443 -413 -1079 -1125 -494
3120 -494 412 1089 1120 535 -357 -1043 -1125 -611 312 1038 1134 579 -294 -1009 -1177 -615 254 973 1204 672 -224
3141 -224 -1021 -1231 -733 202 989 1253 790 -157 -975 -1242 -791 113 961 1239 834 -63 -948 -1261 -885 35
3161 35 930 1270 902 -8 -901 -1298 -942 -45 878 1294 954 89 -873 -1331 -1012 -103 876 1350 1039 140
3181 140 -829 -1363 -1083 -214 798 1353 1136 247 -779 -1357 -1182 -305 731 1376 1238 371 -729 -1371 -1291
3200 -1291 -429 653 1362 1304 485 -638 -1388 -1330 -538 566 1362 1381 596 -514 -1351 -1411 -661 477 1321
3219 1321 1425 698 -406 -1318 -1437 -737 379 1299 1481 818 -362 -1263 -1481 -873 269 1232 1499 914
3237 914 -215 -1226 -1520 -955 138 1187 1548 1013 -108 -1178 -1583 -1083 47 1133 1585 1159 17
3254 17 -1093 -1624 -1208 -127 1030 1596 1256 196 -990 -1624 -1387 -310 904 1628 1424 413 -842
3271 -842 -1587 -1483 -523 733 1553 1540 615 -611 -1531 -1569 -728 529 1474 1609 845 -414 -1416 -1615 -927
3290 -927 239 1312 1576 982 -140 -1215 -1538 -1041 6 1086 1521 1165 110 -958 -1469 -1173 -198
3307 -198 836 1394 1167 299 -737 -1311 -1143 -344 654 1227 1094 380 -574 -1166 -1116 -436 460 1088 1086 463
3327 463 -409 -1005 -1055 -489 384 978 1043 530 -309 -950 -1014 -529 262 887 1026 581 -199 -845 -998 -620 134
3348 134 810 997 648 -96 -768 -1055 -687 8 693 994 763 44 -622 -949 -740 -130 540 924 762 181
3368 181 -478 -887 -794 -272 412 832 841 334 -310 -776 -800 -398 216 739 780 412 -197 -668 -815 -474 86 601
3390 601 788 490 -33 -578 -764 -579 -23 481 704 592 124 -419 -740 -615 -166 362 700 632 197 -299
3410 -299 -668 -638 -272 267 610 631 289 -179 -563 -609 -331 145 568 633 364 -101 -529 -608 -398 43 457 627
3432 627 431 -10 -440 -629 -441 -11 417 611 489 26 -432 -643 -523 -97 357 603 536 126 -341 -619
3452 -619 -543 -170 337 643 540 136 -331 -660 -635 -199 335 672 660 273 -291 -695 -694 -317 263 673 730 322
3474 322 -228 -698 -814 -404 210 708 860 465 -166 -716 -890 -561 115 697 931 642 -59 -693 -968 -702
3494 -702 -11 692 1020 785 144 -629 -1055 -873 -223 582 1045 940 308 -497 -1025 -987 -425 413 1002 1051 491
3515 491 -329 -928 -1088 -576 184 852 1052 637 -104 -794 -1027 -659 32 739 998 707 18 -679 -972 -735
3535 -735 -52 618 917 724 88 -554 -879 -722 -89 512 861 684 118 -488 -823 -693 -139 448 837 681
3555 681 171 -460 -788 -678 -196 413 767 670 188 -416 -743 -664 -222 368 747 644 202 -352 -701 -642 -206
3576 -206 355 702 636 210 -353 -703 -648 -211 343 713 643 252 -318 -684 -638 -230 302 704 649 225 -304 -689
3598 -689 -647 -250 272 655 667 243 -253 -665 -645 -242 276 625 659 253 -292 -640 -634 -276 269 695 674 282
3620 282 -232 -647 -674 -297 252 645 664 312 -207 -656 -707 -325 240 653 694 375 -217 -628 -750 -394 148
3641 148 590 735 387 -131 -587 -735 -412 127 569 734 443 -46 -550 -712 -443 53 543 721 519 1
3661 1 -487 -704 -511 -28 474 677 506 74 -435 -672 -521 -68 386 628 540 118 -356 -633 -521 -132 326
3682 326 565 533 148 -296 -553 -519 -164 243 549 522 204 -230 -500 -509 -209 156 421 453 259 -134 -415 -457
3704 -457 -261 83 354 413 250 -36 -293 -402 -240 9 223 312 207 14 -234 -252 -195 8 157 236 144 -21
3726 -21 -153 -159 -125 29 91 124 69 -57 -70 -86 -29 54 94 56 -47 -102 -92 -27 67 122 101 40 -75 -146 -102 2 122
3753 122 181 127 -8 -170 -232 -168 -25 153 276 151 24 -157 -282 -207 -61 136 258 210 55 -160 -296 -207
3775 -207 -76 106 262 241 78 -121 -242 -236 -58 143 257 245 80 -114 -229 -220 -93 118 253 235 73 -85
3797 -85 -223 -209 -99 111 235 222 100 -117 -251 -220 -93 122 260 228 55 -155 -267 -244 -69 178 269 243 91
3820 91 -155 -334 -306 -86 119 298 332 137 -170 -337 -326 -174 108 318 352 187 -66 -305 -361 -208 56 297
3842 297 379 240 2 -269 -352 -257 -22 224 344 264 43 -174 -310 -315 -83 163 284 270 107 -103 -294 -284 -177
3865 -177 56 238 281 172 -20 -175 -234 -152 28 156 213 164 39 -123 -191 -167 -40 66 132 90 51 -48 -95 -51
3889 -51 -41 41 76 64 27 -17 -18 -49 12 20 14 26 -48 -34 -2 13 14 40 50 -46 -90 -83 -19 52 62 52 28 -54 -48 -75 -21 29 84
3922 84 89 29 -40 -72 -92 -62 11 69 96 84 -17 -58 -82 -79 -23 79 95 61 28 -64 -97 -68 -36 60 104 64 41 -28 -72 -72 -50
3953 -50 6 68 93 35 -8 -64 -61 -40 -18 50 54 58 31 -31 -46 -48 -68 -7 21 26 24 9 -39 -25 -36 23 16 -4 10 6 -7 -27 -7 -1 -14
3988 -14 0 -19 19 -3 16 28 6 -11 -6 -13 -20 -5 21 49 30 -15 -18 -40 -53 -26 35 65 69 30 -61 -56 -72 -63 6 87 87 48 -19 -85
4022 -85 -80 -84 -27 71 124 104 17 -41 -155 -143 -70 17 123 150 131 -18 -94 -143 -133 -9 104 181 166 47 -103 -209 -196
4049 -196 -97 50 195 203 138 -28 -187 -227 -124 12 138 206 166 4 -163 -229 -194 -66 119 222 220 62 -114 -223
4073 -223 -217 -87 121 243 228 101 -50 -199 -208 -93 88 214 255 131 -67 -201 -212 -140 27 176 224 128 -49
4096 -49 -174 -234 -116 75 196 224 131 -45 -201 -237 -151 35 173 280 128 -30 -187 -275 -182 33 255 286 160
4119 160 -43 -249 -290 -177 5 220 332 217 -3 -218 -335 -253 9 271 355 295 37 -260 -393 -342 -57 227
4141 227 421 347 73 -224 -402 -393 -150 203 407 426 148 -199 -430 -427 -214 137 440 447 221 -127 -397 -485 -272
4164 -272 99 368 494 281 -88 -396 -498 -344 46 381 496 339 -33 -377 -500 -382 -1 345 499 379
4184 379 34 -324 -526 -420 -70 295 529 440 97 -302 -518 -481 -126 253 502 458 143 -246 -499 -478 -175
4205 -175 217 507 488 226 -197 -511 -525 -247 171 471 495 279 -111 -451 -520 -323 98 443 556 325 -70
4226 -70 -411 -550 -383 27 387 563 388 7 -404 -563 -404 -19 380 571 417 34 -336 -517 -447 -120 323
4247 323 552 465 120 -281 -562 -474 -161 266 499 499 167 -241 -493 -475 -182 201 473 498 195 -175 -468 -520
4269 -520 -211 154 461 494 213 -159 -464 -503 -222 136 443 498 280 -102 -418 -518 -311 105 448 533 316
4290 316 -113 -455 -527 -321 97 438 555 357 -23 -440 -565 -378 50 421 577 396 -21 -407 -583 -416
4310 -416 11 417 608 444 33 -428 -642 -512 -113 383 656 558 121 -364 -661 -575 -148 335 690 590 224
4331 224 -318 -683 -662 -258 259 628 690 287 -200 -655 -696 -338 173 619 687 416 -140 -614 -737 -470 52
4352 52 560 780 531 -4 -543 -736 -531 -15 522 739 531 45 -444 -722 -591 -111 413 696 587 131
4372 131 -367 -694 -591 -209 359 652 605 180 -354 -652 -649 -220 332 678 635 222 -310 -661 -614 -289 285 668
4394 668 660 271 -284 -650 -693 -302 239 662 727 322 -218 -685 -757 -395 194 649 751 430 -149 -661 -781 -456
4416 -456 122 660 824 527 -94 -655 -818 -569 54 597 858 618 20 -582 -847 -638 -74 578 866 679
4436 679 110 -513 -906 -726 -184 457 821 756 213 -427 -871 -812 -295 383 838 825 330 -344 -833 -860 -394
4457 -394 281 806 876 425 -208 -759 -841 -483 176 734 861 476 -116 -706 -869 -570 74 680 872 591 -57
4478 -57 -617 -879 -603 -29 607 872 650 81 -534 -823 -667 -97 516 849 712 201 -462 -783 -724 -207 418
4499 418 778 711 264 -322 -736 -725 -267 308 718 711 319 -243 -676 -712 -356 208 618 698 336 -182 -605 -683
4521 -683 -361 134 577 691 386 -131 -580 -672 -391 97 508 638 421 -95 -548 -656 -443 49 505 691
4541 691 443 -44 -506 -657 -492 -29 474 651 477 52 -438 -670 -526 -96 403 618 545 126 -367 -630
4561 -630 -562 -158 302 612 538 199 -261 -569 -579 -240 213 513 562 261 -192 -520 -574 -300 140 439 539 293
4583 293 -101 -437 -515 -303 63 408 476 290 -28 -368 -494 -320 40 337 473 332 -14 -306 -478 -331 -11
4604 -11 300 419 313 36 -291 -416 -320 -39 278 413 333 42 -257 -416 -318 -42 241 376 335 69 -245 -385
4626 -385 -329 -94 211 389 361 110 -192 -414 -377 -112 161 395 367 143 -171 -390 -414 -191 150 394 406 214
4648 214 -119 -401 -414 -257 69 331 403 265 -47 -305 -431 -268 -10 286 403 314 29 -287 -439 -324 -27
4669 -27 268 401 329 53 -229 -401 -354 -88 197 406 367 109 -187 -393 -390 -165 132 365 385 185 -111 -377
4691 -377 -400 -215 93 328 410 206 -61 -302 -425 -280 9 307 427 317 38 -262 -409 -348 -56 199 380
4712 380 342 79 -224 -382 -342 -106 182 347 324 131 -151 -373 -332 -144 105 341 366 167 -91 -294 -371 -216
4734 -216 92 286 359 220 -41 -289 -336 -230 11 259 350 215 -11 -249 -327 -212 -42 239 337 270 7 -220
4756 -220 -341 -272 -4 173 325 273 43 -177 -324 -300 -89 164 286 240 97 -166 -322 -302 -108 144 290 292
4778 292 150 -114 -282 -278 -130 100 282 284 136 -90 -240 -312 -156 57 231 295 157 -35 -231 -301 -184 29
4800 29 236 276 146 -18 -232 -302 -206 -2 196 304 210 18 -204 -281 -216 -22 178 234 211 44 -133 -255 -202
4823 -202 -64 138 260 196 45 -124 -240 -213 -95 96 235 214 59 -99 -184 -202 -102 68 168 188 83 -56
4845 -56 -225 -189 -93 44 147 191 94 -67 -172 -169 -115 -5 140 173 107 -12 -113 -162 -111 -1 95 145 108 10 -92
4870 -92 -145 -90 3 94 107 93 35 -80 -120 -116 -2 58 82 86 11 -33 -73 -65 -43 63 69 57 8 -50 -57 -52 -2 40 49 45 21 -73 -49
4903 -49 -28 28 50 47 17 -19 -64 -47 2 23 39 27 -3 -51 -59 -44 31 37 52 21 -24 -45 -66 -39 4 37 45 43 15 -72 -32 -66 9
4936 9 71 72 3 -34 -46 -36 -54 1 50 82 49 -50 -42 -53 -7 12 58 32 18 -33 -43 -49 -15 35 34 49 10 -29 -60 -44 -1 40 80
4969 80 33 -21 -71 -73 -94 4 66 84 62 -5 -80 -121 -86 29 84 123 49 -21 -122 -141 -121 -5 111 152 94 -65 -137 -165
4997 -165 -73 0 126 165 132 -2 -117 -193 -130 -26 141 206 143 -6 -133 -190 -180 -61 103 210 164 75 -107 -238
5021 -238 -221 -86 93 206 203 101 -76 -226 -262 -143 70 228 232 111 -75 -232 -258 -170 45 233 285 143 -43
5044 -43 -227 -315 -201 -12 196 269 214 25 -163 -287 -267 -53 143 284 221 66 -143 -257 -261 -82 114 268 239
5067 239 99 -123 -259 -252 -96 101 230 224 122 -99 -194 -200 -101 75 184 226 88 -78 -189 -230 -93 44 182
5090 182 193 88 -72 -184 -178 -80 97 161 203 42 -103 -195 -191 -89 112 196 189 61 -93 -224 -177 -56 80 241
5114 241 194 33 -122 -219 -225 -67 119 240 258 51 -117 -253 -252 -86 108 238 272 101 -103 -291 -267 -104 68
5137 68 255 300 104 -103 -293 -294 -141 65 272 293 156 -47 -283 -343 -209 79 278 331 216 -40 -278 -339 -213
5160 -213 3 258 314 222 -5 -278 -358 -251 0 245 363 259 16 -275 -371 -273 -28 243 356 271 49 -255
5182 -255 -408 -319 -81 200 383 354 64 -204 -396 -376 -107 176 379 368 130 -163 -420 -402 -161 154 392 387
5204 387 211 -146 -404 -431 -179 131 396 430 218 -117 -362 -450 -244 116 371 435 252 -66 -368 -445 -293 26
5226 26 329 403 296 -15 -351 -460 -341 0 309 446 341 15 -297 -471 -401 -74 286 438 394 117 -272
5247 -272 -478 -435 -111 262 468 437 170 -202 -466 -478 -192 179 444 468 212 -128 -410 -482 -266 82 385 456
5269 456 280 -95 -365 -471 -304 17 359 453 297 -14 -314 -431 -311 -14 263 414 320 41 -271 -404 -342
5290 -342 -32 203 377 310 101 -228 -363 -313 -89 211 332 316 77 -203 -342 -290 -122 170 339 309 69 -194
5312 -194 -320 -303 -82 123 307 300 87 -144 -328 -318 -126 131 316 317 147 -123 -336 -333 -158 133 331 296 167
5335 167 -113 -304 -333 -181 100 295 352 193 -78 -319 -373 -212 46 295 347 221 -10 -260 -389 -242 -5
5356 -5 244 326 247 21 -240 -357 -290 -21 203 322 283 66 -197 -335 -274 -84 160 307 295 65 -172 -342 -299
5379 -299 -116 140 303 297 132 -153 -309 -326 -163 87 313 332 144 -126 -317 -340 -188 105 291 365 192 -50
5401 -50 -276 -383 -225 24 273 375 237 -29 -254 -383 -259 -8 240 367 271 28 -236 -377 -315 -74 225
5422 225 359 307 71 -180 -348 -341 -92 173 353 331 102 -167 -360 -389 -157 152 336 358 187 -120 -333 -369
5444 -369 -193 76 324 332 175 -104 -349 -360 -186 53 298 379 220 -73 -305 -390 -229 47 284 393 237 -48
5466 -48 -315 -389 -289 -5 281 379 267 9 -300 -449 -340 -29 268 418 301 38 -265 -446 -378 -53 253
5487 253 425 357 86 -273 -442 -378 -123 236 430 390 125 -217 -467 -429 -139 208 435 439 166 -196 -449 -482
5509 -482 -228 146 436 481 281 -127 -438 -506 -267 131 425 511 285 -102 -448 -518 -352 64 408 533 360
5530 360 -46 -408 -551 -418 29 422 564 371 1 -415 -605 -410 -41 363 584 441 77 -344 -584 -473
5550 -473 -96 318 561 458 140 -303 -579 -499 -171 243 554 535 206 -239 -520 -521 -238 231 521 534 234 -183
5572 -183 -508 -550 -257 155 496 577 283 -119 -481 -556 -308 112 448 541 322 -88 -479 -573 -345 72 432 577
5594 577 361 -65 -441 -551 -360 41 409 537 390 -36 -390 -550 -400 9 411 547 409 12 -399 -558
5614 -558 -472 -47 370 543 451 77 -354 -588 -456 -90 357 565 477 86 -299 -530 -477 -135 242 559 519 156
5636 156 -258 -531 -520 -203 212 502 540 194 -185 -506 -547 -271 133 472 562 249 -134 -461 -542 -328 68 441
5658 441 496 315 -117 -425 -499 -365 36 388 497 354 -29 -347 -473 -355 -21 282 457 357 19 -280 -429
5679 -429 -352 -84 248 399 311 69 -223 -409 -321 -89 210 366 325 58 -194 -382 -312 -81 218 335 298 76
5701 76 -180 -314 -295 -73 169 298 310 105 -167 -333 -288 -100 128 285 250 106 -140 -282 -321 -132 128 262
5723 262 273 100 -106 -273 -277 -86 131 267 259 112 -87 -269 -295 -159 84 239 274 145 -75 -232 -311 -164 62
5746 62 220 277 185 -42 -225 -270 -204 -2 203 303 183 14 -194 -287 -200 -30 122 217 200 28 -144 -258 -233
5769 -233 -75 111 231 215 87 -91 -200 -227 -112 51 212 187 103 -84 -190 -232 -135 31 141 225 145 -3 -127
5792 -127 -182 -125 14 136 179 154 27 -111 -171 -144 -58 96 165 136 31 -77 -167 -168 -59 40 161 146 67 -65 -152
5817 -152 -155 -54 20 169 180 85 -20 -147 -169 -86 41 107 162 99 -3 -137 -184 -138 -28 91 185 115 20 -121 -187
5842 -187 -143 -15 101 198 190 87 -95 -171 -203 -85 74 168 179 91 -39 -192 -199 -98 49 169 204 157 -31 -154
5866 -154 -207 -136 -25 171 231 161 -1 -177 -248 -159 -32 148 246 195 34 -136 -235 -181 -75 97 225 197 87 -111
5890 -111 -216 -199 -54 103 204 243 132 -91 -216 -242 -83 72 189 220 152 -68 -206 -232 -141 51 215 245 144
5913 144 -35 -198 -260 -158 46 206 264 171 -9 -199 -274 -173 -9 201 259 190 16 -189 -273 -181 -46 166 295
5936 295 236 61 -147 -272 -246 -75 104 257 243 111 -109 -277 -293 -97 71 221 259 132 -48 -212 -244 -139
5958 -139 48 160 236 147 -14 -195 -233 -127 16 129 194 146 -20 -118 -185 -143 -1 109 178 127 9 -107 -155 -157
5982 -157 -27 89 132 146 37 -75 -148 -106 -8 85 130 95 17 -86 -98 -119 2 52 97 86 41 -70 -110 -53 -15 36
6008 36 72 85 26 -60 -91 -44 6 43 87 72 -12 -52 -52 -25 -30 46 70 44 34 -68 -33 -5 -3 37 51 22 25 -43 -50 -29 3 31
6040 31 6 11 -7 -37 -20 -16 40 58 6 -20 -33 -35 -23 6 49 31 -16 -23 -62 -54 11 40 58 40 17 -28 -78 -76 8 27 57 52 58 -35
6074 -35 -84 -51 -7 53 58 66 25 -49 -91 -77 -21 8 99 73 -10 -19 -62 -83 -26 29 62 86 6 -65 -98 -90 17 69 93 92 13 -59
6106 -59 -101 -70 17 52 89 105 47 -79 -121 -91 2 27 105 70 38 -44 -102 -110 -35 45 108 120 32 -37 -74 -77 -33 63 128 52 36
6137 36 -42 -111 -70 2 54 68 60 12 -55 -105 -69 -14 38 96 47 11 -64 -87 -60 4 125 118 80 -15 -93 -98 -66 57 98 130 55
6168 55 -38 -143 -134 -76 29 132 127 51 -55 -137 -165 -97 15 170 233 105 -41 -153 -200 -121 32 164 234 123 -3
6193 -3 -144 -236 -159 -11 133 239 204 20 -163 -224 -202 -31 127 228 232 68 -143 -257 -228 -103 121 211 219 81
6217 81 -77 -210 -226 -100 107 226 241 96 -105 -229 -231 -102 74 231 239 100 -35 -197 -203 -98 87 212 229
6240 229 132 -73 -194 -201 -117 62 212 248 125 -48 -213 -266 -118 55 234 262 141 -47 -203 -269 -158 43 209
6263 209 272 190 -12 -212 -260 -201 6 189 267 162 -22 -206 -281 -202 -20 214 266 230 40 -204 -296 -214 -30 158
6287 158 265 247 59 -113 -274 -280 -84 159 253 269 89 -120 -270 -252 -97 120 285 288 128 -86 -250 -297 -169
6310 -169 72 256 268 187 -75 -249 -307 -179 59 223 285 201 -11 -218 -313 -204 -17 214 293 220 26 -182 -299
6333 -299 -232 7 159 290 257 60 -141 -282 -238 -90 123 300 286 88 -140 -263 -292 -89 105 269 277 109
6355 109 -93 -241 -271 -147 50 234 280 130 -71 -236 -262 -164 48 239 254 170 -3 -193 -303 -218 -18 215
6377 215 289 222 17 -179 -239 -229 -20 135 245 256 70 -146 -251 -258 -81 115 259 241 113 -94 -237 -246 -147 63
6401 63 195 285 125 -64 -212 -265 -157 37 212 266 144 0 -164 -237 -192 -15 174 262 211 33 -153 -226 -184
6424 -184 5 167 257 201 68 -134 -252 -201 -55 134 227 260 58 -125 -237 -223 -30 134 250 226 88 -131
6446 -131 -222 -204 -86 129 249 230 94 -109 -259 -278 -138 99 249 269 135 -88 -236 -283 -162 83 260 282
6468 282 176 -57 -217 -263 -181 31 228 309 205 -37 -188 -296 -229 -5 211 331 235 29 -211 -326 -271 -57
6490 -57 171 312 263 83 -145 -308 -287 -95 143 335 264 119 -99 -275 -329 -110 117 270 279 167 -88 -252
6512 -252 -293 -153 86 237 295 157 -47 -264 -313 -151 51 257 309 207 -39 -247 -291 -166 68 209 272 216
6534 216 -20 -235 -321 -178 23 206 320 222 -10 -207 -296 -213 -21 183 324 245 30 -211 -291 -248 -38 209
6556 209 300 248 49 -175 -301 -269 -83 173 311 275 61 -189 -323 -302 -86 175 330 333 119 -140 -314 -317 -141
6579 -141 111 317 325 159 -112 -299 -333 -163 117 299 338 211 -100 -297 -338 -183 67 289 333 214 -38 -280
6601 -280 -346 -209 38 295 384 243 0 -283 -369 -275 -15 259 352 288 49 -224 -373 -260 -39 235 394 297
6623 297 72 -216 -357 -310 -97 183 353 301 95 -175 -360 -332 -113 188 341 372 102 -122 -343 -325 -158 135
6645 135 330 354 170 -125 -329 -351 -175 136 323 364 227 -81 -309 -363 -233 35 289 384 229 -1 -282 -396
6667 -396 -235 -11 290 357 263 -17 -267 -381 -281 -23 252 369 297 39 -227 -367 -302 -68 191 336 300 98
6689 98 -153 -347 -353 -170 142 345 346 124 -148 -288 -336 -145 103 317 366 174 -77 -299 -370 -194 35 272 363
6712 363 229 -15 -234 -370 -228 -28 205 324 254 30 -192 -322 -249 -60 155 301 248 60 -150 -259 -245
6733 -245 -108 138 250 248 103 -107 -228 -239 -116 67 203 257 105 -53 -184 -238 -126 56 171 228 120 -60
6755 -60 -190 -194 -147 50 178 194 102 -39 -172 -187 -123 17 171 212 107 -31 -147 -171 -124 2 125 194 128 -4
6779 -4 -150 -176 -122 7 104 201 128 21 -111 -172 -122 -7 109 144 156 38 -100 -152 -140 -42 103 147 183 23 -79
6804 -79 -134 -79 -47 51 131 144 25 -30 -102 -100 -36 56 149 124 42 -64 -161 -113 -48 57 146 120 21 -42 -115 -117 -50 54 145
6833 145 115 61 -29 -131 -121 -58 36 101 146 64 -40 -91 -114 -84 23 136 99 53 -7 -99 -135 -90 37 116 142 113 5
6860 5 -128 -131 -89 15 106 141 99 3 -99 -142 -109 -9 78 147 106 35 -68 -128 -88 -2 74 94 133 25 -51 -114 -131 -33
6888 -33 30 115 138 32 -45 -97 -112 -46 23 108 114 85 -26 -102 -133 -43 -1 103 141 85 1 -101 -159 -97 -12 104 121 94
6916 94 47 -55 -133 -90 -10 67 130 101 30 -67 -124 -143 -29 9 98 127 68 -34 -101 -130 -85 0 104 105 62 4 -88 -143 -81
6945 -81 24 73 108 115 -7 -65 -116 -88 -6 70 86 86 13 -23 -102 -103 -38 33 92 103 40 -35 -97 -105 -29 11 100 100 38 -34 -91 -90
6977 -90 -68 13 57 123 81 -6 -89 -100 -82 -7 75 80 88 13 -58 -81 -83 -14 57 133 91 25 -67 -76 -70 1 40 94 105 8 -35 -80 -84
7010 -84 -31 56 78 74 52 -30 -44 -98 -49 18 57 73 36 -11 -75 -60 -27 8 45 75 9 1 -43 -84 -18 17 34 58 52 1 -28 -66
7042 -66 -54 1 57 58 13 -20 -50 -54 -62 12 29 48 41 -23 -56 -44 -20 21 46 46 5 -8 -58 -84 -14 2 48 74 47 9 -52 -17 -55
7075 -55 -10 52 63 34 35 -10 -56 -42 -16 37 74 53 4 -27 -74 -53 -34 1 38 59 14 0 -32 -51 -8 13 42 42 30 11 -34
7106 -34 -53 -49 -20 22 22 53 2 -5 -22 -4 -23 3 13 29 -15 -13 -8 -55 -34 -19 12 15 56 25 23 -9 -34 -22 9 27 38 26 26 10
7140 10 -28 -45 -32 -15 -18 52 24 27 7 -51 -22 -31 5 62 43 37 -13 -38 -67 -50 25 70 90 50 4 -47 -70 -83 1 10 64 72 48
7173 48 -29 -66 -57 -76 16 47 76 45 16 -54 -67 -50 4 59 99 45 5 -32 -72 -81 -15 48 63 74 22 -58 -84 -66 0 40 61
7204 61 78 18 -31 -79 -79 -10 18 80 50 22 -23 -75 -44 -22 37 62 36 20 -16 -38 -51 -18 45 83 47 -9 -49 -91 -58 0 64
7235 64 76 61 18 -64 -85 -32 0 40 82 53 4 -21 -93 -61 -33 49 78 32 23 -56 -86 -48 -54 32 75 77 25 -43 -87 -64 -31 62
7267 62 139 76 36 -24 -85 -63 -27 39 113 101 37 -64 -104 -81 22 60 78 48 27 -63 -96 -87 -8 61 102 130 6 -71 -127
7296 -127 -113 -9 69 141 107 10 -84 -141 -114 -18 68 136 102 50 -97 -151 -135 -49 83 156 144 71 -66 -144 -134 -45 87
7323 87 148 137 61 -69 -179 -166 -109 59 159 175 101 -18 -157 -207 -101 45 152 196 108 -26 -153 -182 -113 6
7347 6 160 199 133 -17 -162 -207 -139 -36 135 194 162 18 -138 -207 -148 -22 94 220 189 32 -103 -220 -188 -70
7371 -70 110 205 190 83 -83 -195 -197 -89 79 212 213 108 -68 -188 -187 -131 60 199 201 127 -31 -179 -223 -138 -2
7396 -2 156 223 156 16 -118 -201 -153 11 117 181 152 32 -143 -218 -145 -34 106 204 171 30 -105 -174 -170 -45 100
7421 100 160 166 63 -70 -153 -160 -68 69 152 176 22 -77 -167 -174 -89 34 150 182 55 -53 -156 -182 -89 50 155 194
7447 194 85 -43 -162 -178 -116 17 149 179 113 -10 -124 -192 -101 5 144 204 121 23 -123 -208 -170 0 107 193
7471 193 143 21 -76 -200 -186 -55 58 171 185 79 -89 -191 -164 -106 44 164 179 96 -58 -146 -166 -122 26 168
7495 168 176 121 0 -132 -175 -134 -4 126 180 141 34 -82 -162 -156 -41 88 143 123 47 -74 -168 -178 -64 76 173
7520 173 151 62 -73 -213 -165 -63 36 168 187 61 -55 -138 -161 -93 33 137 198 87 -12 -136 -177 -127 -9 156
7544 156 185 116 -11 -114 -185 -125 -15 113 169 159 39 -96 -200 -119 -27 83 180 151 48 -89 -168 -130 -57 97
7568 97 188 141 62 -81 -184 -143 -41 78 173 148 73 -98 -158 -159 -84 63 170 179 108 -71 -148 -159 -117 80 177 170 91
7595 91 -47 -160 -167 -101 60 172 183 78 -55 -160 -198 -118 16 169 173 132 -27 -167 -193 -140 21 152 201 161 -15
7620 -15 -157 -232 -175 14 186 209 167 29 -155 -219 -158 -26 115 246 180 28 -123 -227 -178 -62 106 248 201
7643 201 70 -101 -241 -196 -84 103 224 237 104 -95 -205 -242 -114 94 241 215 108 -64 -232 -216 -120 59
7665 59 212 244 134 -69 -212 -243 -163 41 209 242 159 -14 -165 -239 -155 21 191 233 166 7 -192 -238 -171 -10
7689 -10 191 270 159 26 -165 -286 -196 -27 147 237 207 38 -152 -227 -230 -62 106 220 191 67 -117 -244 -224
7712 -224 -90 63 223 210 96 -57 -194 -232 -98 68 187 220 79 -58 -184 -228 -147 45 183 226 127 -26
7734 -26 -158 -214 -144 11 148 199 114 2 -173 -203 -159 30 109 182 145 9 -138 -222 -135 -61 128 186 175 22 -106
7759 -106 -189 -180 -66 105 186 210 56 -89 -165 -165 -78 55 183 198 99 -61 -178 -180 -104 72 153 206 101 -44 -128 -176
7785 -176 -137 -13 159 179 119 1 -109 -200 -107 -11 92 174 123 36 -89 -186 -179 -45 62 136 139 37 -90 -156 -125 -70
7811 -70 34 131 143 67 -31 -121 -148 -84 42 98 122 55 -22 -89 -125 -68 39 109 105 94 -18 -87 -133 -98 -20 73 132 75 -8
7840 -8 -103 -103 -85 -15 85 118 116 19 -58 -90 -132 -37 67 121 77 27 -91 -125 -106 -34 38 109 100 25 -57 -127 -114 -40 25 121 125
7871 125 72 -50 -108 -125 -66 32 98 120 76 -27 -94 -136 -97 7 102 121 82 -15 -108 -121 -108 -20 91 136 114 24 -77
7898 -77 -134 -109 -5 71 134 118 24 -86 -124 -115 -44 68 141 102 45 -53 -134 -134 -67 61 119 141 84 -20 -106 -137 -99 18
7926 18 122 142 91 -50 -102 -154 -110 -16 92 132 84 4 -82 -169 -91 -30 66 109 84 9 -68 -104 -87 8 73 92 94 22 -59
7955 -59 -102 -61 2 74 135 60 -4 -59 -109 -71 -6 67 131 78 9 -50 -128 -93 11 63 80 92 21 -68 -99 -99 -11 53 123 107
7985 107 46 -62 -125 -128 -46 84 119 66 41 -64 -99 -105 -34 62 112 115 58 -67 -116 -105 -56 42 88 85 55 -21 -101 -105 -59 37
8015 37 118 93 63 -16 -104 -122 -74 13 95 104 62 -5 -73 -98 -80 -14 102 64 63 -38 -90 -89 -83 -4 84 113 51 -2 -71 -110 -40
8046 -40 10 75 98 64 -10 -77 -83 -61 3 72 85 73 29 -97 -102 -68 -13 41 75 66 22 -43 -98 -66 -5 55 85 60 1 -65 -93
8077 -93 -86 -41 43 80 77 10 -32 -64 -69 -65 52 69 64 13 -13 -75 -67 -40 30 67 73 22 -31 -74 -84 -53 21 60 58 19 10 -69 -59 -58 -1
8112 -1 70 62 24 4 -47 -105 -44 -25 51 56 40 32 -34 -41 -43 -7 6 38 60 29 -2 -51 -46 -36 -17 7 44 32 1 -12 -51 -49 3 -6 35
8147 35 19 32 15 -14 -44 -40 -19 15 16 34 30 -18 -31 -52 -34 -34 29 2 15 17 -27 -25 -48 -46 -5 44 58 21 -15 -55 -33 -48 -2 37
8181 37 66 29 -4 -19 -35 -66 -33 17 55 62
8191F2
$$ Imaginary data points
##PAGE= N=2
##DATA TABLE= (X++(I..I)), XYDATA
0 0 0 0 0 0 0 0 0 0 0 0 0 -8 0 -8 8 -8 16 -16 17 -24 26 -34 41 -46 57 -64 75 -87 98 -114 130 -147 170 -190
34 -190 214 -241 270 -304 338 -376 420 -467 516 -573 632 -698 771 -850 936 -1030 1135 -1251
52 -1251 1380 -1525 1687 -1868 2076 -2317 2599 -2934 3338 -3842 4483 -5337 6533 -8329 11341
67 11341 -17348 34186 -189085 -781350 -864754 -595388 -41865 450076 688023 536856 138401
78 138401 -303004 -527441 -448117 -112101 266529 490522 432494 147634 -208234 -430070
88 -430070 -413587 -173166 140325 358604 361912 166926 -111807 -309972 -324836 -153417 96187
99 96187 283414 302644 152776 -78173 -255114 -284194 -153533 54261 221090 253958 142851
110 142851 -43023 -192930 -224207 -123491 44284 180321 206547 112583 -43836 -169774
120 -169774 -194600 -107000 38072 155901 179350 99082 -35231 -143669 -164915 -89167 36322
131 36322 137468 155927 83067 -37002 -133758 -151813 -82208 33271 127589 146938 82288
142 82288 -27887 -118874 -139521 -79123 25105 112584 132766 75572 -24802 -109364 -129694
153 -129694 -74780 22400 105542 126957 75677 -17883 -99169 -122211 -74832 14048 92964 116814
165 116814 73464 -10905 -86992 -111848 -72415 6966 80016 105189 69713 -4482 -73533 -98157
177 -98157 -65150 4649 70225 93501 61860 -5415 -68631 -91291 -60524 5038 67233 90115
189 90115 60802 -3416 -65172 -89226 -61844 539 62103 87420 62592 2216 -58632 -85389
201 -85389 -62937 -4856 55386 83413 63561 7808 -51672 -81187 -64141 -10965 47840 78699
213 78699 64654 14034 -43878 -76462 -65487 -17761 39468 73988 66768 22357 -33794 -70336
225 -70336 -67159 -26835 27498 65440 66213 30111 -21904 -60669 -64828 -32875 16725 55935 63239
238 63239 35185 -11802 -51178 -61266 -36905 7463 46771 59323 38465 -3415 -42694 -57551
250 -57551 -40048 -474 38955 56321 42310 5025 -34679 -55035 -45038 -10714 28888 52189
262 52189 46777 16144 -22512 -48191 -47176 -20605 16577 43998 47076 24488 -10846 -39780 -46572
275 -46572 -28129 5212 35156 45735 31430 606 -30044 -43983 -34077 -6058 24556 41459
287 41459 35620 10791 -19404 -38664 -36741 -15040 14354 35673 37476 19173 -9038 -31862 -37134
300 -37134 -22312 4093 27743 35806 24226 -326 -24253 -34561 -25660 -2797 21493 33811
312 33811 27463 6046 -18484 -32880 -29143 -9572 15063 31155 29929 12247 -11998 -29469 -30397
325 -30397 -14385 9632 28290 31271 16861 -6808 -26738 -31880 -19449 3516 24228 31323 20941
338 20941 -825 -21768 -30103 -21248 -484 20404 29476 21587 1245 -19892 -29839 -22733 -2631
351 -2631 19134 30204 24201 4408 -17973 -30270 -25391 -6100 16816 30289 26705 7917 -15445
364 -15445 -30264 -28073 -10038 13576 29599 28943 12002 -11519 -28416 -29153 -13322 9937 27400
377 27400 29175 14220 -8744 -26743 -29429 -15367 7422 25959 29659 16458 -6008 -24977 -29621
390 -29621 -17334 4731 23970 29410 17890 -3765 -23221 -29282 -18468 2924 22646 29404 19199
403 19199 -1935 -21981 -29482 -20051 799 21074 29249 20635 220 -20235 -28973 -21029 -957
416 -957 19613 28996 21662 1901 -18993 -29054 -22497 -3138 17968 28830 23229 4451 -16708
429 -16708 -28183 -23522 -5429 15525 27510 23587 6224 -14631 -27025 -23878 -7152 13490 26289
442 26289 23903 7908 -12401 -25400 -23643 -8296 11642 24791 23601 8831 -10904 -24289 -23679
455 -23679 -9520 9921 23563 23580 10138 -8946 -22718 -23328 -10514 8159 22026 23048 10829
468 10829 -7515 -21414 -22961 -11259 6754 20870 22961 11865 -5838 -20129 -22820 -12510 4826
481 4826 19249 22569 13066 -3747 -18188 -22181 -13468 2670 17089 21635 13805 -1618 -15866
494 -15866 -20918 -14028 579 14508 19964 14027 353 -13104 -18823 -13679 -1010 11853 17604
507 17604 13167 1480 -10680 -16370 -12571 -1749 9585 15037 11673 1760 -8686 -13749 -10607 -1456
521 -1456 8208 12722 9663 1037 -7899 -11929 -8853 -681 7530 11057 7887 130 -7401 -10301 -6839
536 -6839 671 7667 9953 6170 -1341 -7995 -9827 -5695 1854 8246 9639 5198 -2422 -8644 -9663
551 -9663 -4855 3007 9211 9990 4815 -3316 -9645 -10418 -5062 3345 9859 10729 5266 -3291 -9967 -10908
567 -10908 -5490 3116 9975 11164 5876 -2817 -9898 -11311 -6210 2357 9546 11276 6468 -1801 -8993
582 -8993 -10913 -6538 1502 8551 10559 6485 -1224 -8099 -10195 -6345 970 7591 9649 6085 -821
597 -821 -7060 -8976 -5534 995 6768 8347 4917 -1370 -6731 -7981 -4420 1799 6824 7721 4004 -2091
613 -2091 -6908 -7531 -3551 2585 7184 7396 3137 -3148 -7640 -7597 -2949 3602 8224 8030 3067 -3801
629 -3801 -8592 -8407 -3289 3878 8896 8804 3501 -3959 -9269 -9327 -3985 3784 9512 9884 4629 -3262 -9403
646 -9403 -10243 -5270 2647 9064 10345 5723 -2065 -8662 -10276 -6078 1519 8220 10233 6466 -913
661 -913 -7621 -10000 -6697 195 6832 9423 6660 212 -6103 -8728 -6305 -351 5636 8261 6063
676 6063 467 -5268 -7795 -5865 -677 4695 7155 5419 615 -4265 -6381 -4680 -237 4180 5916
691 5916 4032 -262 -4332 -5692 -3583 690 4514 5574 3248 -1061 -4739 -5470 -2885 1532 5140
706 5140 5643 2769 -1916 -5606 -6020 -2863 2065 5894 6338 3089 -2025 -6033 -6564 -3236 2036 6131
722 6131 6722 3380 -2016 -6293 -6988 -3609 1930 6415 7215 3899 -1697 -6320 -7381 -4150 1489 6250
738 6250 7444 4308 -1326 -6192 -7485 -4513 1130 6114 7654 4797 -781 -5945 -7668 -5020 478
753 478 5671 7550 5084 -338 -5478 -7503 -5142 261 5488 7638 5384 -25 -5374 -7720 -5686
768 -5686 -376 5138 7709 5887 713 -4832 -7661 -6105 -1062 4589 7632 6395 1579 -4094 -7413
783 -7413 -6562 -2011 3539 7038 6495 2314 -3076 -6602 -6345 -2453 2756 6328 6231 2642 -2459 -6030
799 -6030 -6177 -2819 2104 5726 6065 2948 -1798 -5436 -5934 -3077 1515 5158 5821 3231 -1189 -4868
815 -4868 -5735 -3369 833 4465 5502 3427 -522 -4100 -5253 -3442 352 3860 5081 3475 -100
830 -100 -3545 -4884 -3545 -211 3169 4654 3505 432 -2774 -4325 -3403 -562 2511 4110 3288 691
846 691 -2285 -3837 -3216 -796 2030 3614 3144 907 -1789 -3417 -3012 -962 1653 3244 3000 1034
862 1034 -1451 -3082 -2989 -1219 1173 2887 2965 1462 -830 -2564 -2801 -1597 490 2169 2548 1549 -268
879 -268 -1850 -2271 -1410 159 1593 2028 1347 -34 -1318 -1809 -1248 -67 1073 1509 1044 -20 -992 -1326
897 -1326 -821 201 1062 1357 852 -125 -1039 -1391 -902 31 930 1297 920 24 -909 -1313 -918 -37 890 1366
917 1366 1164 270 -739 -1384 -1300 -566 443 1252 1359 779 -188 -1019 -1339 -966 -89 802 1249 1063 326 -535
937 -535 -1130 -1161 -649 206 903 1140 784 82 -633 -984 -824 -273 398 772 753 316 -263 -633 -645 -265 264
958 264 622 628 267 -281 -628 -625 -337 149 500 546 292 -146 -445 -430 -143 290 557 450 65 -407 -667 -544
980 -544 -52 496 718 526 -12 -625 -863 -550 155 860 1143 751 -124 -999 -1383 -1011 4 1031 1510 1192
1000 1192 119 -1064 -1653 -1284 -135 1186 1883 1531 210 -1312 -2164 -1821 -397 1317 2355 2093 574
1017 574 -1361 -2577 -2366 -777 1384 2867 2757 1071 -1367 -3100 -3201 -1498 1138 3248 3600 2002
1033 2002 -820 -3201 -3839 -2387 455 3109 4047 2717 -172 -3046 -4201 -3051 -161 2909 4304
1048 4304 3379 486 -2695 -4352 -3562 -809 2552 4333 3721 993 -2400 -4352 -3873 -1134 2294 4430
1064 4430 4054 1408 -2146 -4460 -4213 -1601 2026 4458 4382 1818 -1898 -4479 -4558 -1973 1798 4553
1080 4553 4757 2215 -1622 -4549 -4920 -2497 1380 4463 4963 2683 -1179 -4372 -5028 -2776 1066 4333
1096 4333 5074 2953 -980 -4350 -5216 -3107 837 4291 5304 3281 -684 -4269 -5355 -3345 589
1111 589 4275 5463 3510 -504 -4314 -5639 -3750 334 4276 5744 3928 -203 -4227 -5801 -4112
1126 -4112 47 4198 5938 4248 86 -4208 -6075 -4457 -233 4119 6155 4656 420 -4088 -6227
1141 -6227 -4818 -572 4059 6377 4989 702 -4052 -6518 -5270 -939 3951 6649 5527 1223 -3863
1156 -3863 -6711 -5729 -1445 3736 6771 5934 1679 -3628 -6882 -6161 -1920 3487 6945 6399 2154 -3380
1172 -3380 -7021 -6663 -2480 3181 7031 6854 2772 -2975 -7107 -7124 -3075 2760 7055 7375 3430 -2470
1188 -2470 -7052 -7599 -3820 2119 6895 7704 4113 -1854 -6796 -7868 -4401 1590 6710 8032 4757
1203 4757 -1238 -6545 -8145 -5164 835 6296 8189 5389 -489 -6091 -8198 -5672 131 5865 8283
1218 8283 5981 249 -5602 -8267 -6246 -728 5237 8202 6468 1076 -4904 -8055 -6604 -1389 4566
1233 4566 7938 6735 1692 -4290 -7834 -6908 -2064 3924 7630 6994 2395 -3493 -7343 -6996 -2638 3201
1249 3201 7175 6971 2825 -2918 -7001 -7045 -3087 2575 6714 7010 3305 -2254 -6419 -6903 -3400 2016
1265 2016 6213 6792 3493 -1865 -6066 -6829 -3642 1598 5870 6809 3822 -1306 -5656 -6723 -3954 1107
1281 1107 5438 6659 3998 -882 -5315 -6623 -4154 699 5126 6609 4328 -451 -4891 -6560 -4451
1296 -4451 180 4655 6450 4552 63 -4460 -6372 -4649 -260 4281 6304 4776 496 -4013 -6223
1311 -6223 -4902 -771 3748 6093 4956 1001 -3473 -5922 -5018 -1191 3261 5828 5037 1433 -3038
1326 -3038 -5712 -5148 -1710 2723 5540 5181 1946 -2400 -5355 -5172 -2103 2160 5155 5168 2301 -1919
1342 -1919 -5014 -5229 -2526 1593 4756 5145 2686 -1305 -4482 -5066 -2813 1084 4292 5036 2934 -873
1358 -873 -4145 -5019 -3153 551 3927 5024 3317 -202 -3638 -4927 -3471 -91 3328 4819 3606
1373 3606 348 -3070 -4704 -3715 -637 2773 4559 3808 934 -2474 -4454 -3896 -1218 2137 4221 3968
1389 3968 1479 -1831 -4070 -4013 -1773 1474 3855 4078 2073 -1081 -3626 -4049 -2338 673 3257 3976
1405 3976 2562 -278 -2894 -3833 -2684 -86 2566 3660 2761 382 -2171 -3453 -2807 -677 1828 3198
1421 3198 2786 891 -1524 -2953 -2737 -1032 1254 2773 2709 1186 -1009 -2585 -2709 -1322 734 2342
1437 2342 2601 1424 -540 -2148 -2516 -1466 413 1978 2449 1560 -260 -1866 -2428 -1638 118 1717
1453 1717 2387 1660 71 -1611 -2348 -1741 -173 1494 2321 1821 282 -1435 -2341 -1942 -445 1278 2319
1470 2319 2048 594 -1166 -2238 -2102 -756 1046 2248 2179 863 -964 -2242 -2285 -1057 826 2253
1486 2253 2442 1282 -641 -2197 -2536 -1436 496 2172 2647 1625 -328 -2153 -2772 -1839 120 2087
1502 2087 2870 2102 123 -1947 -2927 -2306 -381 1752 2951 2461 641 -1618 -2957 -2664 -934 1439
1518 1439 2937 2806 1167 -1174 -2907 -2966 -1400 931 2776 3072 1664 -704 -2647 -3088 -1856 458
1534 458 2513 3190 2062 -216 -2361 -3176 -2216 -60 2142 3109 2317 285 -1952 -3015 -2417 -469 1766
1551 1766 2973 2498 571 -1645 -2912 -2557 -766 1482 2860 2610 920 -1273 -2730 -2637 -1039 1130
1567 1130 2610 2629 1142 -1017 -2538 -2673 -1248 883 2506 2674 1376 -706 -2388 -2655 -1436 579
1583 579 2230 2651 1536 -484 -2169 -2647 -1616 351 2127 2673 1757 -184 -2004 -2643 -1851 -5 1825
1600 1825 2609 1913 144 -1662 -2479 -1909 -280 1496 2366 1948 419 -1324 -2279 -1914 -540 1133 2126
1617 2126 1893 607 -983 -1922 -1752 -597 879 1820 1680 578 -846 -1736 -1601 -594 731 1588 1464
1634 1464 537 -715 -1483 -1372 -452 764 1480 1330 376 -781 -1530 -1350 -374 849 1561 1383 425 -784
1652 -784 -1531 -1414 -447 730 1485 1387 497 -685 -1446 -1407 -552 628 1384 1411 618 -501 -1329 -1325 -598 453
1672 453 1211 1249 590 -453 -1193 -1204 -534 451 1168 1192 534 -447 -1139 -1161 -548 387 1106 1127 502 -380 -1067
1693 -1067 -1086 -466 451 1092 1148 497 -394 -1070 -1117 -503 364 1070 1104 536 -391 -1063 -1117 -517 395 1108 1219
1714 1219 644 -347 -1095 -1255 -718 223 1064 1280 769 -169 -1024 -1299 -877 43 942 1328 980 125 -798 -1257
1734 -1257 -1038 -286 650 1206 1118 429 -467 -1069 -1109 -580 254 933 1071 681 -49 -744 -1008 -779 -141 516
1754 516 864 758 306 -296 -679 -705 -378 99 497 602 424 51 -298 -482 -415 -207 112 363 425 328 51
1775 51 -211 -357 -321 -156 83 257 370 295 60 -195 -313 -332 -139 145 327 365 220 -26 -272 -391 -290 -17
1797 -17 262 356 271 3 -280 -415 -288 -4 319 468 344 2 -368 -513 -394 -1 377 623 520 64 -417
1818 -417 -648 -534 -63 483 808 680 206 -458 -864 -793 -289 414 921 948 389 -379 -947 -987 -479 361 998
1839 998 1066 520 -287 -1021 -1158 -666 265 1073 1285 784 -122 -1015 -1362 -925 26 997 1405 994 35 -1004
1859 -1004 -1455 -1130 -136 966 1512 1216 253 -875 -1543 -1328 -378 847 1549 1394 457 -774 -1563 -1478 -544
1878 -544 713 1574 1546 649 -591 -1562 -1632 -799 506 1533 1691 869 -418 -1528 -1694 -935 360 1501
1896 1501 1778 1032 -275 -1477 -1817 -1161 189 1411 1870 1277 -52 -1341 -1869 -1318 4 1356 1904
1913 1904 1398 52 -1310 -1973 -1517 -201 1223 2014 1636 316 -1169 -1978 -1675 -418 1096 1960 1735
1930 1735 486 -1049 -1986 -1816 -601 960 1985 1864 705 -874 -1924 -1903 -780 820 1914 1942 819
1947 819 -773 -1945 -1984 -899 767 1951 2058 990 -642 -1952 -2148 -1098 582 1967 2183 1193 -517
1964 -517 -1950 -2299 -1321 393 1936 2386 1503 -273 -1895 -2420 -1630 106 1772 2449 1718 18 -1704
1981 -1704 -2458 -1804 -125 1626 2460 1892 285 -1522 -2458 -2002 -402 1425 2436 2069 507 -1322 -2379
1998 -2379 -2099 -604 1247 2419 2152 713 -1165 -2377 -2209 -814 1093 2319 2261 916 -965 -2288
2014 -2288 -2277 -1009 871 2267 2338 1106 -816 -2229 -2372 -1187 741 2196 2434 1285 -616 -2193
2030 -2193 -2457 -1368 548 2145 2524 1453 -433 -2093 -2588 -1574 359 2075 2627 1718 -180 -1988
2046 -1988 -2647 -1830 44 1898 2681 1928 54 -1839 -2684 -2039 -206 1693 2700 2183 381 -1588 -2682
2063 -2682 -2249 -599 1445 2607 2297 721 -1271 -2516 -2334 -830 1153 2422 2361 965 -944 -2323
2079 -2323 -2380 -1075 872 2233 2303 1094 -723 -2122 -2271 -1142 656 2078 2273 1182 -550 -1997
2095 -1997 -2249 -1223 503 1934 2267 1274 -433 -1867 -2248 -1316 396 1856 2284 1398 -290 -1776 -2268
2112 -2268 -1468 158 1672 2308 1512 -34 -1628 -2254 -1594 -9 1575 2226 1652 93 -1499 -2244 -1748
2129 -1748 -229 1372 2199 1798 356 -1249 -2149 -1806 -487 1131 2078 1823 552 -1020 -2017 -1851 -639
2146 -639 902 1947 1849 730 -783 -1835 -1794 -763 748 1775 1812 821 -649 -1713 -1840 -903 594
2163 594 1700 1837 968 -481 -1651 -1829 -1032 411 1518 1840 1071 -311 -1549 -1875 -1134 228 1488
2180 1488 1890 1275 -99 -1374 -1900 -1311 -14 1305 1865 1336 119 -1206 -1855 -1435 -231 1119 1874
2197 1874 1558 382 -1003 -1833 -1640 -520 842 1766 1702 655 -702 -1692 -1735 -821 588 1613 1779 919
2215 919 -435 -1538 -1787 -1077 252 1379 1749 1193 -74 -1244 -1749 -1276 -89 1075 1664 1317 237
2232 237 -979 -1612 -1369 -371 805 1550 1413 482 -665 -1435 -1349 -552 610 1385 1359 562 -526 -1343 -1406
2251 -1406 -702 450 1347 1462 779 -353 -1236 -1471 -902 228 1188 1451 962 -125 -1150 -1514 -1008 3
2269 3 1107 1598 1182 104 -1000 -1568 -1256 -265 905 1560 1348 369 -790 -1581 -1420 -488 738 1563 1530
2288 1530 615 -595 -1532 -1615 -818 438 1475 1664 953 -325 -1397 -1689 -1065 171 1295 1718 1180 -29
2306 -29 -1222 -1754 -1301 -89 1152 1722 1373 251 -996 -1702 -1429 -333 958 1663 1458 430 -863
2323 -863 -1645 -1498 -525 764 1631 1556 638 -669 -1569 -1592 -739 587 1504 1626 801 -528 -1501 -1632 -842
2342 -842 418 1466 1675 930 -363 -1416 -1677 -1004 244 1395 1708 1069 -180 -1345 -1712 -1122 129
2359 129 1290 1771 1193 -17 -1210 -1722 -1242 -80 1137 1679 1294 120 -1085 -1682 -1297 -163 1033
2376 1033 1646 1333 232 -986 -1617 -1339 -272 921 1554 1334 285 -909 -1573 -1308 -305 876 1565
2393 1565 1324 325 -865 -1526 -1332 -335 811 1495 1328 332 -811 -1523 -1324 -335 854 1555 1361 372
2411 372 -862 -1613 -1413 -365 922 1641 1448 383 -921 -1721 -1503 -459 902 1776 1603 515 -911
2428 -911 -1803 -1733 -615 838 1795 1803 754 -761 -1834 -1869 -861 651 1837 1969 973 -568 -1766 -2000
2446 -2000 -1080 445 1739 2021 1174 -320 -1645 -2002 -1240 240 1546 1984 1269 -151 -1477 -1953 -1331
2463 -1331 77 1395 1935 1349 -13 -1316 -1883 -1334 -70 1267 1836 1326 55 -1253 -1809 -1347 -94
2480 -94 1214 1823 1364 152 -1184 -1814 -1417 -151 1170 1822 1445 212 -1126 -1789 -1469 -264 1116
2497 1116 1788 1539 369 -994 -1828 -1550 -450 943 1754 1604 496 -883 -1743 -1622 -572 799 1726
2514 1726 1670 688 -695 -1632 -1659 -747 581 1565 1623 784 -479 -1453 -1562 -790 395 1372 1543 837 -358
2533 -358 -1297 -1535 -879 278 1193 1464 903 -155 -1122 -1391 -880 77 991 1299 874 -86 -938 -1268 -840
2552 -840 35 840 1161 795 -12 -775 -1056 -729 21 761 980 662 -83 -698 -911 -584 106 720 916 583
2572 583 -119 -711 -861 -524 193 711 885 509 -207 -781 -907 -493 218 782 923 501 -205 -792 -910 -534
2592 -534 144 771 939 535 -150 -750 -914 -570 137 778 966 623 -71 -755 -920 -636 50 686 907 622
2612 622 -14 -643 -909 -590 27 645 892 669 53 -613 -870 -673 -101 523 872 688 98 -520 -845 -675
2632 -675 -180 436 797 675 209 -380 -756 -679 -275 344 717 702 308 -240 -655 -668 -310 217 574 634 333
2653 333 -144 -525 -591 -335 69 429 513 314 -54 -371 -458 -313 -10 291 356 249 -28 -254 -308 -231 5 198
2675 198 281 185 7 -185 -235 -160 -1 157 187 125 0 -115 -142 -107 28 95 124 88 20 -67 -57 -48 -17 43 30 31 -12
2702 -12 -27 -31 -11 9 -17 -10 -53 -7 26 52 79 42 -51 -96 -86 -64 43 93 161 72 -51 -133 -160 -78 39 176 220 131 -9
2731 -9 -203 -226 -153 5 207 281 218 51 -171 -273 -223 -40 191 308 228 71 -179 -326 -301 -92 155 324 290
2754 290 110 -115 -310 -326 -187 59 300 336 184 -70 -239 -334 -231 1 226 315 243 59 -152 -256 -220 -111
2776 -111 80 206 191 115 -22 -110 -157 -73 16 77 86 57 38 28 -24 -43 -39 -53 -67 -31 4 66 114 96 31 -105 -189 -162 -57
2805 -57 88 237 242 113 -107 -240 -290 -136 125 286 349 211 -38 -299 -419 -291 9 313 440 306 -8 -344
2827 -344 -487 -373 -42 352 553 420 71 -308 -582 -536 -131 280 601 572 205 -268 -584 -603 -259 242 594
2848 594 658 351 -133 -577 -722 -422 89 540 703 489 -11 -527 -705 -523 -46 469 734 564 101 -391
2868 -391 -678 -591 -137 364 649 604 229 -279 -586 -581 -268 232 530 571 263 -199 -501 -553 -265 172 463 506
2890 506 284 -145 -442 -487 -233 115 377 474 262 -100 -368 -448 -221 95 354 427 219 -105 -361 -432 -207 61
2912 61 386 418 181 -89 -358 -421 -269 89 361 421 247 -87 -364 -441 -269 65 344 455 276 -25 -303 -416
2934 -416 -287 -1 312 440 284 25 -278 -417 -366 -54 245 452 367 143 -156 -402 -415 -213 96 348 383
2955 383 208 -41 -288 -378 -283 -52 221 348 259 124 -94 -278 -291 -159 26 176 234 209 40 -113 -223 -221 -120
2978 -120 60 198 239 176 57 -145 -221 -220 -89 81 178 225 181 -11 -178 -280 -225 -67 162 293 273 98 -126
3001 -126 -290 -329 -153 74 249 324 183 -22 -273 -328 -226 30 227 381 287 16 -265 -365 -289 -15 245 416
3023 416 336 40 -268 -394 -325 -52 278 429 362 71 -268 -499 -385 -97 326 495 426 94 -303 -510 -477 -113
3045 -113 283 568 490 118 -322 -611 -547 -132 364 676 616 210 -333 -723 -657 -255 341 749 776 331 -315 -803
3067 -803 -829 -372 307 832 906 475 -236 -833 -959 -562 157 833 1026 626 -121 -823 -1073 -727 50 795 1102
3088 1102 820 46 -763 -1145 -886 -132 699 1161 955 208 -649 -1127 -975 -241 610 1164 1034 318 -574 -1130
3108 -1130 -1074 -398 498 1100 1073 432 -452 -1079 -1081 -489 408 1061 1114 496 -397 -1072 -1137 -566 328 1009 1166 620
3130 620 -291 -1029 -1168 -639 288 1010 1166 664 -243 -1013 -1197 -713 212 1016 1251 749 -152 -988 -1245 -805
3150 -805 148 949 1248 816 -106 -967 -1237 -841 38 923 1271 899 -32 -950 -1288 -914 -14 884 1297 953
3170 953 53 -881 -1335 -992 -100 833 1361 1037 136 -876 -1333 -1073 -181 803 1349 1123 215 -807 -1357
3189 -1357 -1179 -272 779 1391 1210 310 -721 -1388 -1264 -381 665 1370 1284 453 -627 -1368 -1324 -519 592
3208 592 1354 1338 555 -585 -1376 -1426 -646 514 1347 1419 677 -464 -1311 -1446 -733 427 1284 1474 814 -347
3228 -347 -1278 -1470 -855 282 1262 1531 909 -247 -1196 -1484 -935 187 1206 1538 1005 -110 -1197 -1576
3246 -1576 -1054 60 1149 1589 1104 0 -1120 -1614 -1209 -80 1075 1631 1205 128 -1045 -1619 -1329
3263 -1329 -305 970 1633 1398 353 -866 -1621 -1451 -462 782 1569 1496 572 -683 -1562 -1539 -672 582
3281 582 1504 1585 784 -459 -1437 -1624 -893 300 1318 1603 969 -234 -1245 -1589 -1051 88 1119 1535
3299 1535 1106 32 -1017 -1507 -1136 -176 897 1430 1156 261 -796 -1326 -1129 -352 687 1262 1128 357
3317 357 -587 -1204 -1126 -406 528 1118 1102 422 -435 -1057 -1066 -458 403 995 1043 483 -337 -978 -1060 -535 284 911
3339 911 1036 563 -188 -872 -1039 -562 150 829 995 682 -128 -766 -1005 -661 40 724 1002 719 28 -650
3359 -650 -972 -758 -85 569 926 743 164 -483 -891 -788 -258 471 875 799 317 -337 -814 -814 -382 261 750
3380 750 783 401 -226 -682 -795 -433 127 632 790 499 -83 -574 -786 -531 27 543 759 567 64 -445
3400 -445 -720 -591 -112 424 694 615 201 -353 -658 -634 -266 269 619 631 262 -216 -586 -631 -332 145 559
3421 559 621 365 -138 -533 -625 -376 89 505 636 426 -23 -443 -637 -415 11 446 620 446 29 -443 -606
3442 -606 -492 -84 393 625 526 140 -359 -645 -521 -151 365 649 554 178 -363 -676 -594 -194 315 669 639
3463 639 220 -312 -682 -690 -275 254 683 711 308 -262 -698 -748 -374 218 715 824 421 -203 -699 -821 -501
3484 -501 124 742 896 579 -75 -700 -955 -642 29 703 999 766 63 -680 -1049 -823 -182 580 1025 899
3504 899 297 -541 -1032 -955 -359 445 1017 1016 441 -397 -987 -1060 -542 232 908 1088 640 -178 -822 -1026 -670
3525 -670 64 765 1037 702 -40 -720 -995 -766 -47 636 936 722 91 -584 -910 -696 -116 535 851 693
3545 693 121 -497 -847 -710 -144 491 842 683 143 -435 -797 -668 -152 395 779 669 180 -404 -765 -672
3565 -672 -166 398 727 685 195 -350 -700 -672 -202 330 718 628 204 -349 -701 -627 -230 347 698 633 189 -352
3587 -352 -715 -653 -212 316 677 642 240 -309 -663 -647 -223 321 650 678 251 -273 -645 -653 -267 260 666 674 265
3610 265 -277 -657 -650 -255 273 643 649 290 -281 -656 -680 -306 203 652 688 316 -233 -637 -693 -348 184 637
3632 637 695 338 -221 -658 -720 -379 200 634 717 424 -149 -613 -703 -433 121 597 763 428 -117 -597 -727
3653 -727 -500 58 537 720 505 -11 -498 -702 -518 -5 450 666 494 39 -446 -672 -523 -71 371 646
3673 646 540 107 -376 -611 -499 -114 318 603 504 155 -279 -602 -531 -141 268 568 549 212 -249 -519 -508
3694 -508 -238 157 445 487 237 -170 -430 -461 -240 93 373 412 257 -60 -329 -400 -254 23 245 336 218 -5
3716 -5 -250 -273 -190 3 180 237 165 23 -152 -176 -148 -20 100 129 103 -17 -78 -105 -42 42 115 66 8 -91 -73 -40 40
3743 40 92 75 -6 -101 -130 -113 -10 100 172 109 0 -159 -208 -163 -24 111 213 185 34 -142 -230 -164 -30 130 248
3768 248 233 37 -164 -272 -247 -52 133 237 225 97 -132 -278 -244 -81 123 235 232 71 -149 -259 -269 -65
3790 -65 100 234 232 96 -78 -222 -220 -79 117 211 225 69 -134 -241 -224 -73 140 244 209 45 -132 -285 -241
3813 -241 -58 126 281 225 52 -149 -311 -274 -105 157 312 294 101 -173 -323 -333 -188 112 303 345 154 -110
3835 -110 -316 -364 -209 92 280 358 214 -50 -265 -371 -268 -6 224 371 300 52 -222 -334 -263 -70 188
3856 188 336 286 112 -134 -271 -297 -133 46 237 261 147 -38 -213 -249 -179 -14 149 215 145 1 -147 -216 -155
3879 -155 -54 87 139 143 43 -56 -123 -94 -20 28 78 64 7 1 -36 -45 -10 20 46 47 1 -25 -13 15 31 18 4 -41 -32 -32 -16
3910 -16 24 54 50 6 -73 -46 -64 -12 32 92 81 11 -38 -109 -104 -31 29 90 115 46 -3 -59 -96 -61 36 77 94 64 19 -50 -79
3941 -79 -68 0 54 105 78 3 -34 -86 -74 -52 20 58 73 40 -22 -84 -79 -69 -26 65 50 49 17 -23 -49 -39 -46 12 24 22 31 27 1
3974 1 -33 -27 -24 31 -2 18 37 17 -2 -1 -12 -20 -2 -27 -7 17 28 14 -3 -44 -24 -46 -43 -17 8 37 0 -27 -39 -41 -38 -22 21 57
4008 57 56 22 -43 -56 -70 -84 16 63 93 78 -12 -73 -89 -84 -12 34 100 84 25 -66 -101 -129 -39 54 128 156 85 -17 -136 -157
4038 -157 -112 0 124 175 125 28 -120 -199 -173 -52 85 206 219 105 -81 -164 -235 -124 40 162 234 162 14 -136
4062 -136 -199 -163 -15 149 235 222 67 -124 -251 -225 -72 125 230 207 106 -76 -208 -222 -130 49 209 209 115 -72
4086 -72 -232 -231 -136 41 179 203 139 -59 -147 -199 -125 35 187 251 137 -40 -163 -245 -134 47 226 253 167 -50
4110 -50 -216 -267 -148 29 202 286 181 -46 -258 -327 -192 29 224 318 230 -44 -250 -335 -259 -5 251 352 247
4133 247 13 -244 -345 -294 -43 277 402 339 88 -229 -393 -362 -119 236 414 381 148 -215 -424 -427 -181 190
4155 190 461 472 197 -139 -415 -482 -234 112 386 447 239 -72 -375 -481 -309 30 391 503 307 -49 -369
4176 -369 -502 -350 -7 365 523 387 36 -313 -533 -370 -44 334 517 411 112 -285 -510 -453 -125 245
4196 245 508 467 144 -276 -527 -510 -211 207 461 483 218 -179 -495 -509 -255 184 487 514 280 -142 -450 -536
4218 -536 -305 131 448 544 315 -73 -432 -555 -338 71 419 571 378 2 -378 -562 -407 -19 382 561
4238 561 403 60 -352 -565 -438 -63 299 540 462 88 -299 -571 -463 -133 278 504 466 164 -254 -515 -477
4259 -477 -180 241 491 443 218 -175 -469 -505 -230 177 474 489 252 -143 -434 -461 -242 144 442 486 258 -144
4281 -144 -440 -497 -281 98 427 521 273 -81 -435 -518 -306 103 423 539 336 -70 -447 -568 -366 70 416
4302 416 576 391 -31 -383 -569 -397 -2 407 626 452 -16 -414 -622 -477 -48 399 641 554 115 -376
4322 -376 -655 -569 -142 356 653 544 196 -332 -663 -673 -243 269 637 663 271 -253 -630 -692 -351 182 635
4343 635 716 390 -148 -596 -744 -436 92 585 739 480 -21 -547 -705 -525 -8 521 749 565 80 -483
4363 -483 -730 -590 -132 407 689 574 139 -399 -704 -598 -149 364 660 592 180 -339 -680 -599 -214 343 680
4384 680 641 215 -299 -653 -633 -226 292 671 667 276 -279 -628 -702 -324 250 648 687 341 -252 -668 -732 -379
4406 -379 186 654 731 392 -171 -663 -810 -453 141 650 763 453 -109 -673 -833 -548 82 626 864 583
4426 583 -19 -595 -858 -629 -17 581 895 693 99 -530 -835 -702 -137 525 883 777 192 -448 -855 -783
4446 -783 -272 433 867 793 304 -371 -865 -855 -355 344 798 860 415 -280 -762 -890 -458 178 770 880 470
4467 470 -165 -686 -881 -533 97 677 880 583 -55 -657 -860 -617 15 599 874 643 62 -575 -877 -679
4487 -679 -126 520 826 656 154 -425 -812 -696 -212 406 793 701 205 -377 -756 -732 -275 332 732 697 285
4508 285 -276 -684 -702 -332 239 668 689 333 -203 -623 -691 -357 164 595 675 375 -128 -555 -644 -372 116 564
4530 564 662 412 -104 -528 -670 -436 52 517 610 455 -46 -483 -671 -500 17 465 669 501 35 -421 -654
4551 -654 -481 -80 396 620 531 110 -368 -622 -544 -134 323 591 553 183 -291 -577 -545 -223 229 568 550 224
4573 224 -216 -544 -547 -268 147 509 524 279 -134 -443 -540 -316 65 407 528 319 -81 -380 -482 -304 23
4594 23 331 482 338 -33 -325 -466 -333 3 330 429 318 17 -279 -422 -306 -7 282 398 296 40 -270
4615 -270 -446 -360 -79 234 398 336 57 -263 -397 -319 -86 210 407 321 70 -216 -410 -363 -108 173 364 398
4637 398 141 -164 -410 -373 -156 172 371 395 190 -111 -374 -408 -211 88 341 405 253 -54 -325 -427 -291
4658 -291 24 297 381 262 -24 -286 -420 -329 -61 241 418 328 52 -264 -384 -339 -77 198 413 375 135 -200
4680 -200 -379 -353 -136 168 349 405 166 -121 -342 -402 -226 99 319 396 221 -81 -339 -425 -261 29 252 432
4702 432 278 -7 -297 -440 -302 -54 251 381 313 83 -241 -379 -309 -86 214 370 339 128 -164 -349 -334
4723 -334 -113 124 347 355 160 -77 -324 -358 -168 87 313 364 189 -35 -288 -369 -233 16 249 332 206 -10
4745 -10 -258 -360 -257 -40 220 301 263 13 -225 -328 -244 -53 224 309 249 88 -174 -312 -284 -71 156 302
4767 302 294 97 -125 -297 -300 -94 136 304 275 125 -153 -288 -287 -158 79 261 258 143 -86 -265 -269 -154 70 274
4791 274 290 143 -48 -265 -326 -180 79 249 290 178 -33 -214 -288 -189 23 215 277 222 16 -149 -283 -182
4813 -182 -13 184 268 211 12 -141 -264 -218 -58 142 239 212 32 -136 -256 -207 -78 100 202 204 53 -112 -238
4836 -238 -233 -67 66 201 195 104 -82 -217 -193 -103 79 209 200 92 -45 -169 -185 -101 22 156 179 128 -15 -137
4860 -137 -203 -113 -5 130 144 119 21 -122 -160 -134 -28 65 106 89 2 -72 -114 -77 -33 102 104 91 17 -44 -78 -61 -8 57
4888 57 82 26 14 -18 -18 -44 -20 34 68 43 -13 -30 -25 -4 3 44 39 20 -9 -68 -62 -6 28 41 25 -3 -63 -62 -52 -25 33 50 54 27
4922 27 -41 -47 -48 15 66 51 39 -14 -47 -25 -10 -3 43 43 70 -29 -48 -49 -36 18 16 84 26 -23 -62 -74 -50 38 30 52 27 -49 -46 -53 -9
4957 -9 49 33 31 12 -49 -74 -42 9 59 68 71 -13 -37 -63 -73 16 59 78 52 2 -76 -114 -57 13 93 87 85 8 -104 -118 -92 15
4989 15 75 129 93 -32 -135 -175 -112 -23 134 184 132 3 -112 -190 -129 -14 117 177 176 31 -128 -170 -185 -38 103
5014 103 201 201 61 -117 -211 -165 -90 101 248 228 78 -110 -214 -231 -118 86 226 251 142 -85 -226 -263 -149
5037 -149 52 228 269 174 -51 -208 -292 -205 0 222 292 212 -3 -195 -301 -215 -18 170 315 266 59 -123 -276
5060 -276 -228 -86 142 264 245 99 -116 -245 -252 -118 84 217 231 87 -59 -205 -213 -143 64 176 206 106 -58
5083 -58 -187 -225 -101 48 184 207 106 -65 -191 -208 -65 62 170 177 61 -54 -163 -178 -73 74 173 184 54
5106 54 -104 -224 -195 -60 117 215 168 45 -118 -215 -191 -87 93 234 208 71 -124 -244 -270 -115 105 250 253
5129 253 115 -123 -282 -235 -144 77 260 295 121 -71 -252 -269 -159 84 257 304 163 -70 -265 -299 -187 51
5151 51 264 315 211 -71 -266 -350 -212 30 240 340 215 -44 -263 -366 -248 16 279 336 264 6 -270 -364
5173 -364 -264 -15 244 385 309 19 -259 -398 -286 -24 241 400 349 91 -209 -396 -349 -93 213 391 339
5194 339 109 -174 -395 -371 -173 175 412 386 162 -201 -394 -418 -193 112 357 392 200 -112 -348 -419 -213 107
5216 107 362 423 225 -86 -356 -430 -272 67 333 475 290 -66 -346 -455 -308 7 330 467 315 -15 -339
5237 -339 -484 -355 -64 285 479 355 32 -263 -456 -432 -97 241 492 417 149 -209 -475 -464 -182 214 484
5258 484 462 234 -163 -407 -480 -255 119 399 449 258 -126 -384 -441 -239 55 342 447 282 -27 -311 -457
5279 -457 -323 -17 289 412 310 25 -287 -409 -283 -24 242 391 293 72 -215 -389 -321 -42 174 366 308
5300 308 102 -172 -341 -289 -57 191 363 293 102 -151 -312 -295 -105 158 333 300 126 -175 -320 -294 -117 149
5322 149 288 301 84 -161 -315 -354 -146 144 304 331 178 -103 -329 -348 -175 95 328 359 197 -114 -293 -332
5344 -332 -191 62 287 353 228 -17 -269 -363 -245 -15 278 343 270 19 -231 -358 -271 -57 202 370 263 50
5366 50 -218 -361 -297 -100 168 331 270 91 -177 -298 -310 -88 168 355 321 104 -142 -300 -299 -113 151 318
5388 318 316 142 -112 -290 -330 -164 110 331 376 180 -88 -308 -358 -227 42 306 376 235 -34 -267 -366 -273 -19
5411 -19 244 377 264 4 -258 -391 -289 -11 249 367 306 81 -209 -345 -309 -63 190 386 333 116 -166
5432 -166 -355 -326 -124 163 351 339 136 -124 -350 -356 -165 101 333 362 178 -128 -331 -367 -191 75 311 376
5454 376 220 -67 -309 -385 -208 29 306 380 242 -15 -317 -368 -220 16 289 401 294 17 -273 -413 -288
5475 -288 -38 280 423 325 16 -269 -420 -352 -60 238 422 328 81 -280 -435 -379 -114 228 451 392 89 -208
5497 -208 -467 -411 -166 218 456 451 178 -192 -445 -417 -207 182 451 482 234 -156 -440 -489 -215 106 456 500
5519 500 282 -99 -428 -503 -327 49 438 531 356 -54 -439 -546 -363 10 390 558 408 -4 -397 -581 -435
5540 -435 -62 365 574 454 52 -362 -560 -454 -82 344 605 452 129 -286 -561 -461 -141 271 539 512
5560 512 191 -256 -548 -552 -208 236 519 544 225 -198 -505 -535 -271 173 494 562 289 -162 -511 -538 -294 112
5582 112 466 536 317 -108 -453 -539 -307 108 469 538 352 -76 -416 -538 -376 48 416 568 328 -31 -429
5603 -429 -544 -387 28 413 551 384 -1 -412 -576 -450 -23 378 531 433 52 -363 -592 -458 -84 340
5623 340 557 460 109 -334 -547 -478 -138 294 577 507 154 -264 -497 -490 -171 236 533 514 200 -177 -496 -511
5645 -511 -251 168 523 536 269 -117 -486 -539 -304 128 429 498 298 -74 -415 -531 -310 67 369 486 324
5666 324 -25 -337 -510 -325 0 312 451 357 30 -305 -428 -346 -12 287 444 354 69 -232 -400 -344 -80
5687 -80 238 429 303 61 -197 -370 -325 -65 188 348 307 108 -158 -346 -304 -102 155 297 257 88 -135 -333
5709 -333 -268 -77 113 298 300 103 -147 -280 -242 -110 141 312 303 113 -106 -297 -263 -136 102 272 255 127 -115
5732 -115 -278 -297 -168 86 254 301 136 -34 -254 -318 -195 48 234 290 179 -68 -223 -287 -202 18 204 286
5754 286 209 -6 -181 -244 -169 -20 185 261 217 34 -144 -235 -199 -41 122 236 218 90 -100 -231 -223 -79 77
5777 77 227 194 99 -61 -203 -216 -144 7 170 204 137 -24 -171 -190 -158 -3 143 196 153 30 -100 -179 -134 2
5801 2 113 190 168 45 -84 -158 -123 -48 89 156 139 74 -97 -133 -162 -56 19 162 152 76 -46 -148 -191 -99 27 99
5827 99 155 82 -20 -123 -177 -103 -2 122 146 134 14 -124 -170 -133 -19 98 195 185 38 -96 -179 -122 -56 78 205
5852 205 207 87 -86 -180 -202 -85 38 160 200 110 -48 -178 -226 -128 -14 152 214 149 -24 -152 -213 -189 -2 146
5876 146 211 179 32 -125 -222 -190 -14 114 227 220 68 -124 -237 -202 -71 72 212 180 125 -88 -226 -232 -129 68
5900 68 192 208 91 -96 -221 -249 -130 63 232 222 116 -79 -229 -265 -150 30 200 262 141 -13 -190 -251
5922 -251 -137 42 193 278 189 23 -206 -282 -226 -25 174 308 240 40 -144 -265 -223 -64 111 256 257 87 -98
5945 -98 -236 -269 -140 109 239 226 111 -85 -216 -231 -129 48 200 235 135 -21 -195 -237 -176 14 189 228 160
5968 160 23 -123 -169 -125 -27 113 192 123 29 -108 -170 -120 -10 114 157 123 14 -94 -176 -149 -38 75 126 113 29
5993 29 -79 -111 -124 -26 62 73 74 6 -16 -113 -99 -17 51 73 90 -3 -69 -72 -48 -18 81 104 63 1 -39 -105 -70 1 49 38 34
6024 34 -13 -72 -75 -55 -26 32 65 3 -26 -53 -63 -38 9 38 30 12 15 -44 -23 -1 31 24 13 -16 -32 -35 -15 64 33 57 19 0 -16
6057 -16 -53 2 28 43 79 14 -43 -85 -87 -14 26 99 45 0 -18 -76 -45 -8 23 94 51 19 -52 -84 -71 -26 54 100 54 54 -64
6088 -64 -69 -68 -7 44 73 77 19 -55 -94 -18 -25 76 77 62 26 -44 -90 -73 5 63 106 87 -6 -81 -104 -86 -18 59 110 103 28 -67 -105
6121 -105 -71 -38 73 96 71 23 -47 -114 -84 -31 67 126 122 51 -60 -106 -100 13 40 121 76 7 -40 -97 -93 18 58 121 76
6150 76 11 -81 -107 -50 -12 68 95 65 -20 -98 -81 -62 10 117 103 83 14 -87 -131 -60 59 137 158 87 -45 -143 -176 -81
6178 -81 47 188 205 99 -34 -206 -182 -117 38 178 178 142 -22 -135 -212 -198 -32 159 203 176 17 -148 -247 -190
6202 -190 -24 119 246 206 95 -131 -256 -208 -64 102 232 227 78 -101 -244 -211 -74 126 214 201 106 -68 -200
6225 -200 -226 -104 63 219 202 99 -96 -218 -211 -128 52 202 224 101 -68 -210 -239 -120 42 203 255 107 -78
6248 -78 -211 -221 -122 67 229 248 154 -25 -214 -247 -138 1 195 247 176 -25 -207 -253 -152 34 214 245 192 -25
6272 -25 -192 -259 -207 -7 170 268 204 10 -213 -294 -218 -31 157 307 231 51 -166 -295 -254 -63 163 268 271 127
6296 127 -113 -272 -258 -115 128 308 292 136 -107 -283 -279 -155 90 223 270 180 -73 -283 -309 -175 55 240
6318 240 306 187 -12 -249 -328 -226 5 199 280 180 14 -209 -311 -216 -45 165 284 226 62 -159 -268 -264
6340 -264 -45 136 289 289 91 -132 -266 -259 -109 113 284 279 97 -112 -236 -245 -134 50 252 284 147 -70 -255
6363 -255 -310 -163 38 206 267 169 -42 -217 -308 -194 16 189 280 188 10 -173 -290 -194 -28 174 293 244 63
6386 63 -145 -266 -239 -44 135 237 245 127 -105 -269 -259 -137 89 230 235 134 -42 -215 -293 -169 52 217 251
6409 251 172 -23 -216 -248 -199 15 212 255 205 29 -178 -228 -196 0 176 245 198 22 -148 -224 -213 -37 130 246
6433 246 204 43 -138 -234 -220 -69 129 244 215 47 -123 -257 -252 -102 85 217 198 91 -90 -257 -271 -129 113
6456 113 248 260 88 -92 -237 -273 -129 71 219 288 155 -78 -216 -291 -173 63 240 278 226 -27 -207 -301
6478 -301 -208 7 208 285 202 1 -177 -308 -278 -51 163 307 255 77 -169 -333 -282 -91 144 284 263 128
6500 128 -123 -272 -279 -113 129 289 303 122 -80 -278 -288 -167 86 304 292 174 -80 -275 -298 -180 48 226
6522 226 295 153 -27 -257 -303 -195 9 227 293 175 -44 -252 -317 -195 6 209 304 182 1 -213 -309 -178
6544 -178 25 236 321 255 16 -200 -306 -218 -28 193 312 263 52 -207 -325 -272 -54 185 311 241 56 -189
6566 -189 -335 -276 -90 152 315 294 92 -163 -320 -307 -120 130 302 306 140 -152 -306 -316 -150 96 324 325 167
6589 167 -89 -283 -329 -225 70 320 345 197 -38 -297 -350 -220 30 293 356 194 -21 -253 -373 -240 -24
6610 -24 260 354 254 -25 -266 -335 -263 -14 235 364 268 44 -225 -382 -295 -43 227 336 323 100 -222 -318 -322
6633 -322 -108 156 344 353 125 -130 -310 -357 -146 128 325 344 156 -104 -337 -326 -179 79 342 369 172 -99
6655 -99 -308 -379 -219 72 295 356 239 -37 -305 -383 -257 15 289 380 260 -6 -238 -372 -258 18 243 383
6677 383 274 44 -206 -365 -302 -54 201 382 334 84 -186 -352 -326 -125 160 301 325 123 -147 -351 -346 -149
6699 -149 90 311 334 189 -92 -306 -352 -218 54 271 328 218 -36 -268 -333 -225 7 264 347 257 48 -184
6721 -184 -311 -263 -31 200 296 265 82 -164 -302 -277 -95 118 261 228 73 -144 -245 -261 -112 74 241 228
6743 228 100 -52 -212 -221 -97 81 213 242 108 -67 -184 -198 -100 85 168 217 140 -36 -160 -178 -123 6 151
6766 151 205 103 -49 -184 -174 -110 9 132 173 129 6 -139 -198 -130 7 105 191 124 3 -108 -194 -106 2 122
6790 122 141 107 32 -85 -159 -102 -3 101 166 137 20 -73 -144 -143 -45 51 153 120 30 -51 -122 -97 -49 57 141 113 46 -54
6818 -54 -131 -154 -32 39 106 100 31 -64 -113 -103 -23 62 131 115 45 -32 -73 -130 -68 89 99 136 66 -42 -88 -111 -26 28 126
6847 126 108 75 -19 -123 -143 -64 18 134 124 61 -23 -108 -117 -76 19 114 112 66 14 -66 -129 -82 -12 111 128 116 7 -32 -82
6876 -82 -80 -2 60 142 128 33 -51 -95 -111 -43 53 123 128 43 -62 -131 -115 -61 50 85 109 63 -37 -115 -120 -95 7 76 113 60
6906 60 -14 -100 -145 -110 -6 86 131 109 22 -46 -132 -102 5 86 137 142 30 -60 -133 -113 -60 47 146 136 42 -51 -118 -128 -76
6935 -76 37 113 89 88 -29 -84 -144 -103 -3 74 123 78 -2 -89 -105 -94 -17 57 114 82 34 -49 -80 -120 -41 69 110 110 54
6964 54 -32 -89 -73 -55 56 91 100 83 -19 -71 -135 -66 26 72 96 62 -11 -107 -103 -96 -21 41 101 80 -9 -86 -112 -108 -5 83 90
6995 90 76 -4 -51 -89 -65 -20 66 76 99 34 -24 -58 -83 -47 59 80 100 54 -47 -81 -108 -54 26 46 77 46 -54 -66 -63
7024 -63 -36 16 40 45 21 16 -80 -69 -41 -10 58 54 49 9 -52 -75 -48 16 47 61 53 -8 -7 -27 -30 22 44 79 46 24 -24 -53 14 -11
7058 -11 49 66 55 17 -45 -77 -51 -7 22 57 50 -16 -93 -72 -59 -20 39 43 41 -10 -25 -64 -33 9 30 57 66 31 -22 -50 -46 -9 34
7091 34 59 60 48 12 -59 -55 -60 -2 16 65 68 3 -12 -52 -44 1 23 48 36 8 -15 -32 -31 -38 16 23 32 38 8 -14 -12 -5 -8 27 32 21 35
7128 35 6 -9 -12 -11 40 37 38 53 41 6 -37 -47 -32 32 23 17 18 8 -53 -39 -57 -24 13 21 47 36 -22 -60 -52 -47 -16 65 65 47 27 -38
7164 -38 -59 -26 -40 39 75 45 14 -10 -55 -67 -31 37 81 90 49 -10 -63 -79 -39 -5 92 63 38 15 -70 -107 -67 -25 39 80 71
7195 71 14 -37 -90 -72 -23 17 89 62 -10 -43 -71 -68 -18 23 92 48 26 -26 -75 -44 -13 17 52 64 -6 -31 -80 -54 -16 45 76
7226 76 39 0 -51 -86 -33 -12 33 83 27 -3 -56 -79 -95 -24 18 76 40 8 -72 -77 -55 -23 45 92 85 12 -22 -78 -76 0 59 73
7258 73 63 6 -47 -57 -65 0 61 103 81 4 -72 -71 -88 -17 32 71 73 1 -45 -92 -85 -12 49 102 67 -8 -54 -139 -67 -8 53 107
7290 107 116 19 -78 -98 -82 -5 73 98 119 17 -73 -152 -114 -32 68 126 111 11 -57 -131 -113 -57 47 125 132 26 -118 -171
7318 -171 -157 -62 56 152 150 71 -60 -154 -197 -96 63 159 152 52 -60 -177 -197 -96 29 186 208 116 -23 -158 -193
7343 -193 -125 21 160 197 112 -11 -149 -209 -137 25 141 197 140 11 -154 -239 -166 -34 108 167 176 22 -111 -224
7367 -224 -191 -36 119 242 219 64 -96 -209 -208 -81 85 199 208 111 -64 -174 -204 -93 55 164 216 97 -43
7390 -43 -170 -203 -134 -7 142 222 136 -24 -154 -197 -151 -12 110 186 161 -4 -140 -222 -175 -43 114 203 157 68 -75
7415 -75 -182 -151 -42 81 168 177 76 -69 -181 -161 -39 69 199 174 65 -66 -183 -158 -95 41 143 142 75 -58
7439 -58 -144 -200 -96 41 136 158 100 -8 -148 -186 -95 36 133 195 110 -4 -132 -169 -116 3 103 195 138 34 -115
7464 -115 -185 -155 -12 100 182 163 26 -115 -196 -162 -87 69 168 146 53 -77 -169 -175 -107 54 138 174 96 -66 -169 -164
7490 -164 -71 25 149 200 126 11 -156 -159 -131 25 111 193 132 22 -79 -165 -130 -32 118 180 166 65 -78 -164 -158 -43
7516 -43 79 163 190 75 -106 -167 -159 -58 54 185 155 93 -32 -163 -188 -100 16 143 168 102 -33 -134 -152 -117 15
7541 15 135 183 134 31 -120 -169 -113 -5 138 188 132 39 -135 -226 -144 -32 102 167 166 12 -100 -187 -189 -79 68
7566 68 147 143 84 -111 -151 -161 -49 77 169 164 50 -56 -188 -155 -76 60 157 166 79 -85 -158 -166 -75 58 171 160 112
7593 112 -35 -146 -172 -70 46 163 167 77 -47 -188 -184 -131 31 150 188 118 -67 -168 -200 -122 -18 167 211 134
7617 134 -2 -165 -211 -141 27 144 231 168 11 -133 -229 -172 -9 144 242 211 32 -116 -251 -177 -53 117 237
7640 237 215 70 -136 -235 -214 -48 107 216 199 65 -113 -229 -241 -106 89 182 204 116 -71 -216 -230 -116 71
7663 71 189 240 105 -68 -203 -216 -115 64 203 243 136 -31 -194 -270 -148 11 187 241 147 -12 -177 -245 -161
7686 -161 -22 163 214 152 28 -187 -244 -211 -32 150 209 191 56 -144 -260 -219 -65 126 205 211 76 -122 -234
7709 -234 -218 -60 102 219 245 81 -77 -203 -213 -111 75 207 219 93 -78 -222 -217 -130 37 176 186 125 -43
7732 -43 -192 -207 -151 26 136 177 155 -42 -177 -221 -148 5 157 176 167 -17 -130 -197 -175 -23 130 200 161 40 -96
7757 -96 -180 -178 -41 121 183 175 72 -78 -178 -190 -64 105 199 188 96 -71 -177 -203 -104 55 175 171 79 -57 -167
7782 -167 -168 -127 22 156 181 150 -11 -104 -174 -132 2 114 198 149 6 -84 -158 -142 -46 91 144 154 61 -104 -146 -113
7808 -113 -7 72 128 120 64 -78 -127 -139 -68 38 97 143 82 -25 -131 -148 -90 39 96 120 100 -39 -85 -110 -101 32 123
7835 123 127 112 15 -45 -90 -102 -15 93 114 84 15 -91 -91 -88 -39 49 119 105 12 -52 -120 -124 -38 51 124 118 54 -38 -130 -106 -37
7866 -37 47 98 115 58 -57 -112 -117 -50 46 92 112 82 -7 -84 -111 -52 42 123 150 113 -14 -79 -137 -106 37 90 116 68 21
7895 21 -101 -139 -106 -8 66 140 114 26 -97 -176 -128 -38 61 140 151 22 -38 -145 -110 -69 55 136 133 68 -33 -124 -127 -75
7923 -75 17 111 140 105 -34 -82 -118 -89 5 77 151 62 8 -94 -113 -105 -21 71 122 52 -33 -82 -131 -93 -16 78 96 91 -15 -90
7953 -90 -85 -52 6 83 96 106 34 -50 -68 -88 26 61 96 47 -8 -90 -122 -69 -7 67 114 63 -2 -85 -118 -111 -6 57 133 61
7983 61 7 -80 -102 -112 -34 47 133 74 26 -60 -92 -73 -37 61 96 100 40 -50 -79 -103 -14 40 109 121 52 -37 -115 -126 -42 43 86
8014 86 99 18 -50 -95 -141 -69 21 83 98 63 -22 -111 -126 -68 -1 55 85 99 -11 -76 -84 -54 24 99 101 88 -2 -23 -73 -72 47
8045 47 87 106 81 -2 -65 -94 -47 6 67 76 52 -2 -62 -105 -96 13 71 77 67 -18 -42 -108 -67 6 33 87 83 6 -61 -101 -71 5
8077 5 50 88 80 15 -29 -80 -61 -17 34 94 86 62 -28 -55 -66 5 42 82 75 55 -12 -46 -91 -27 19 48 51 62 -3 -24 -80 -25 -21
8110 -21 54 71 34 5 -45 -73 -44 -25 25 84 60 23 -25 -53 -41 -25 45 73 46 22 34 -36 -41 3 -19 28 57 60 27 -7 -55
8141 -55 -36 -32 -20 13 29 6 0 -36 -41 -33 -20 -47 17 36 35 -20 -14 -67 -31 3 19 67 42 22 -9 -36 -58 -7 30 29 54 39 13 4
8175 4 -26 -26 -37 20 52 61 -26 -48 -71 -56 -17 4 27 59 18 -33
8191c3
##END NTUPLES=NMR FID
##END=
