##TITLE=1H_IG-Sibenz2
 200.13MHz, CDCl3,
 8 sc
 
 5.3.2025
##JCAMPDX= 6.0         $$ Bruker NMR JCAMP-DX V2.0
##DATA TYPE= NMR FID
##DATA CLASS= NTUPLES
##ORIGIN= UXNMR, Bruker Analytische Messtechnik GmbH
##OWNER= pz
$$ XWIN-NMR		Version 3.5
$$ Wed Mar  5 14:06:34 2025 Russian Standard Time (UT+4h)  she@DPX200
##.OBSERVE FREQUENCY= 200.1313
##.OBSERVE NUCLEUS= ^1H
##.DELAY= (6, 6)
##.ACQUISITION MODE= SIMULTANEOUS
##.ACQUISITION SCHEME= undefined
##.AVERAGES= 8
##.DIGITISER RES= 18
##SPECTROMETER/DATA SYSTEM= spect
##.PULSE SEQUENCE= zg30
##.SOLVENT NAME= CDCl3
##.SHIFT REFERENCE= (INTERNAL, CDCl3, 0, 14.3821)
##AUDIT TRAIL= $$ (NUMBER, WHEN, WHO, WHERE, WHAT)
$$ ##TITLE= Audit trail, XWIN-NMR		Version 3.5
$$ ##JCAMPDX= 5.01
$$ ##ORIGIN= Bruker BioSpin GmbH
$$ ##OWNER= she
$$ F:/spectra/data/she/nmr/H-C/1/audita.txt
$$ ##AUDIT TRAIL=  $$ (NUMBER, WHEN, WHO, WHERE, WHAT)
(   1,<2025-03-05 14:04:28.46 +0400>,<she>,<DPX200>,
      <created by zg, POWCHK disabled, PULCHK disabled
       configuration hash MD5:
       00 E9 B6 7A A2 85 ED C7 34 08 36 98 17 FE 4E 26
       data hash MD5: 16K
       E9 2A 67 A8 F5 BB AF 3B 06 B7 4C F9 08 93 9C 2A>)
$$ ##END=
$$ 
$$ hash MD5
$$ 68 CA 27 01 2A 65 A5 10 4A EC E7 A3 FE F7 42 70
##$RELAX= 
##$RELAX= 
##$RELAX= 
##$RELAX= 
##$RELAX= 
##$RELAX= 
$$ Bruker specific parameters
$$ --------------------------
##$DU= <F:/spectra>
##$EXPNO= 1
##$NAME= <H-C>
##$PROCNO= 1
##$TYPE= <nmr>
##$USER= <she>
##$AMP= (0..31)
100 100 100 100 100 100 100 100 100 100 100 100 100 100 100 100 100 100 
100 100 100 100 100 100 100 100 100 100 100 100 100 100 
##$AQSEQ= 0
##$AQ_mod= 1
##$AUNM= <au_zg>
##$AUTOPOS= <>
##$BF1= 200.13
##$BF2= 200.13
##$BF3= 200.13
##$BF4= 200.13
##$BF5= 200.13
##$BF6= 200.13
##$BF7= 200.13
##$BF8= 200.13
##$BYTORDA= 1
##$CFDGTYP= 0
##$CFRGTYP= 5
##$CHEMSTR= <none>
##$CNST= (0..31)
1 1 145 1 1 1 1 1 1 1 1 1 1 1 1 1 1 1 1 1 1 1 1 1 1 1 1 1 1 1 1 1 
##$CPDPRG= <>
##$CPDPRG1= <>
##$CPDPRG2= <>
##$CPDPRG3= <>
##$CPDPRG4= <mlev>
##$CPDPRG5= <mlev>
##$CPDPRG6= <mlev>
##$CPDPRG7= <mlev>
##$CPDPRG8= <mlev>
##$CPDPRGB= <>
##$CPDPRGT= <>
##$D= (0..31)
0 0.7 0 0 0 0 0 0 0 0 0 0.03 0 0 0 0 0 0 0 0 0 0 0 0 0 0 0 0 0 0 0 0 
##$DATE= 1741169067
##$DBL= (0..7)
120 120 120 120 120 120 120 120 
##$DBP= (0..7)
150 150 150 150 150 150 150 150 
##$DBP07= 0
##$DBPNAM0= <>
##$DBPNAM1= <>
##$DBPNAM2= <>
##$DBPNAM3= <>
##$DBPNAM4= <>
##$DBPNAM5= <>
##$DBPNAM6= <>
##$DBPNAM7= <>
##$DBPOAL= (0..7)
0.5 0.5 0.5 0.5 0.5 0.5 0.5 0.5 
##$DBPOFFS= (0..7)
0 0 0 0 0 0 0 0 
##$DE= 6
##$DECBNUC= <off>
##$DECIM= 32
##$DECNUC= <off>
##$DECSTAT= 4
##$DIGMOD= 1
##$DIGTYP= 9
##$DL= (0..7)
0 120 120 120 120 120 120 120 
##$DP= (0..7)
150 150 150 150 150 150 150 150 
##$DP07= 0
##$DPNAME0= <>
##$DPNAME1= <>
##$DPNAME2= <>
##$DPNAME3= <>
##$DPNAME4= <>
##$DPNAME5= <>
##$DPNAME6= <>
##$DPNAME7= <>
##$DPOAL= (0..7)
0.5 0.5 0.5 0.5 0.5 0.5 0.5 0.5 
##$DPOFFS= (0..7)
0 0 0 0 0 0 0 0 
##$DQDMODE= 0
##$DR= 18
##$DS= 0
##$DSLIST= <SSSSSSSSSSSSSSS>
$$ [...]
##$SUBNAM0= <"">
##$SUBNAM1= <"">
##$SUBNAM2= <"">
##$SUBNAM3= <"">
##$SUBNAM4= <"">
##$SUBNAM5= <"">
##$SUBNAM6= <"">
##$SUBNAM7= <"">
##$SUBNAM8= <"">
##$SUBNAM9= <"">
##$SW= 18.0517328524113
##$SWIBOX= (0..15)
0 0 2 0 0 0 0 0 0 0 0 0 0 0 0 0 
##$SW_h= 3612.71676300578
##$TD= 16384
##$TD0= 1
##$TE= 0
##$TE2= 300
##$TE3= 300
##$TEG= 300
##$TL= (0..7)
0 120 120 120 120 120 120 120 
##$TP= (0..7)
150 150 150 150 150 150 150 150 
##$TP07= 0
##$TPNAME0= <>
##$TPNAME1= <>
##$TPNAME2= <>
##$TPNAME3= <>
##$TPNAME4= <>
##$TPNAME5= <>
##$TPNAME6= <>
##$TPNAME7= <>
##$TPOAL= (0..7)
0.5 0.5 0.5 0.5 0.5 0.5 0.5 0.5 
##$TPOFFS= (0..7)
0 0 0 0 0 0 0 0 
##$TUNHIN= 0
##$TUNHOUT= 0
##$TUNXOUT= 0
##$USERA1= <user>
##$USERA2= <user>
##$USERA3= <user>
##$USERA4= <user>
##$USERA5= <user>
##$V9= 5
##$VALIST= <valist>
##$VCLIST= <CCCCCCCCCCCCCCC>
##$VD= 0
##$VDLIST= <DDDDDDDDDDDDDDD>
##$VPLIST= <PPPPPPPPPPPPPPP>
##$VTLIST= <TTTTTTTTTTTTTTT>
##$WBST= 1024
##$WBSW= 4
##$XGAIN= (0..3)
0 0 0 0 
##$XL= 0
##$YL= 0
##$YMAX_a= 125277
##$YMIN_a= -113401
##$ZGOPTNS= <>
##$ZL1= 120
##$ZL2= 120
##$ZL3= 120
##$ZL4= 120
##$ABSF1= 10
##$ABSF2= 0
##$ABSG= 5
##$ABSL= 3
##$ALPHA= 0
##$AQORDER= 0
##$ASSFAC= 0
##$ASSFACI= 0
##$ASSFACX= 0
##$ASSWID= 0
##$AUNMP= <proc_1d>
##$AZFE= 0.1
##$AZFW= 0.1
##$BCFW= 1
##$BC_mod= 2
##$BYTORDP= 1
##$COROFFS= 0
##$CY= -3
##$DATMOD= 1
##$DC= 2
##$DFILT= <>
##$DTYPP= 0
##$F1P= 0
##$F2P= 0
##$FCOR= 0.5
##$FTSIZE= 0
##$FT_mod= 4
##$GAMMA= 1
##$GB= 0.15
##$INTBC= 1
##$INTSCL= 1
##$ISEN= 128
##$LB= 0.25
##$LEV0= 0
##$LPBIN= 0
##$MAXI= 10000
##$MC2= 0
##$MEAN= 0
##$ME_mod= 0
##$MI= 1.114404
##$NCOEF= 0
##$NC_proc= 0
##$NLEV= 6
##$NOISF1= 3.799351
##$NOISF2= 2.8
##$NSP= 1
##$NTH_PI= 0
##$NZP= 0
##$OFFSET= 14.38212
##$PC= 1
##$PHC0= -545.1834
##$PHC1= 9.79222
##$PH_mod= 1
##$PKNL= yes
##$PPARMOD= 0
##$PSCAL= 0
##$PSIGN= 0
##$REVERSE= no
##$SF= 200.129724274929
##$SI= 16384
##$SIGF1= 3
##$SIGF2= 2
##$SINO= 400
##$SIOLD= 16384
##$SREGLST= <1H.CDCl3>
##$SSB= 0
##$STSI= 0
##$STSR= 0
##$SW_p= 3205.1282051282
##$SYMM= 0
##$S_DEV= 0
##$TDeff= 0
##$TDoff= 0
##$TI= <>
##$TILT= no
##$TM1= 0
##$TM2= 0
##$TOPLEV= 0
##$USERP1= <user>
##$USERP2= <user>
##$USERP3= <user>
##$USERP4= <user>
##$USERP5= <user>
##$WDW= 1
##$XDIM= 8192
##$YMAX_p= 0
##$YMIN_p= 0
$$ End of Bruker specific parameters
$$ ---------------------------------
##NTUPLES= NMR FID
##VAR_NAME=  TIME,          FID/REAL,        FID/IMAG
##SYMBOL=    X,             R,               I
##VAR_TYPE=  INDEPENDENT,   DEPENDENT,       DEPENDENT
##VAR_FORM=  AFFN,          ASDF,            ASDF
##VAR_DIM=   8192,          8192,            8192
##UNITS=     SECONDS,       ARBITRARY UNITS, ARBITRARY UNITS
##FACTOR=    0.0002768,     1,               1
##FIRST=     0,             0,               0
##LAST=      2.2672688,     0,               0
##MIN=       0,             -113401,         0
##MAX=       2.2672688,     125277,          0
$$ Real data points
##PAGE= N=1
##DATA TABLE= (X++(R..R)), XYDATA
$$ [...]
852A958l07k523j295J265J920N25j472j593P00J664M07r80j273K37J617L22j290
869a18j086K05J672J036j527j795K78J822J694q02k747p92J950K179J89k616k332
886b790J163K776J176j482k965n66K753K209m23k379j995J259K844N81j637k108
902a584l98K210J687q63j627q85Q57J923J18j447p33K10J046O00j117q76M40N71
920A32L73o32j111N60J245J04o28j046j22J700R18r33j403p21J233J995k42j856
938d34j249L84K274J366j605k038l00J500K181p6k449j517P52K066J244j554k281
955a736j58J588J783m0k200j108J190J488N67j060j630K50J446N78n73j120k18
972i53J187O57n33p68k41R97R95q66j229P2R39J002m10j790o03J283J481Q1j723
$$ y = [1958, 1651, -872, -2167, -902, 1018, 1543, 71, -1522, -822, 842, 1249, 269, -1004, -767, 850, 1172, -118, -1204, -999, 673, 1709, 182, -1613, -1335, 487, 2181, 1379, -1368, -2160, -210, 1969, 2158, -458, -2790, -1627, 1149, 2325, 843, -2122, -2688, 65, 2274, 1851, -528, -2523, -1264, 1580, 2161, 524, -1584, -1982, 228, 1915, 1052, -575, -1460, -603, 1320, 1438, -9, -742, -532, 514, 1114, -3, -879, -439, 132, 505, -127, -1238, -678, 567, 671, 43, -1003, -1125, 575, 1493, 560, -843, -1564, -331, 1664, 1422, -434, -1683, -1299, 975, 2341, 736, -1302, -1602, -102, 2079, 2003, -446, -1963, -1211, 855, 2099, 545, -1736, -1894, -306, 1477, 1437, -763, -1871, -681, 807, 1374, 314, -1316, -1066, 380, 958, 385, -735, -953, 234, 891, 358, -410, -651, 346, 1341, 475, -754, -682, 257, 1259, 849, -941, -1544, -261, 1220, 1301, -422]
991d22j435Q47J943R19j135k247l64K085J623n02k006j490J062K324N43j576j774
1008a605M0J878J368o13j633r04R88J688P6j335r48K34J155O89p73r82J23Q54
1026C00M99m94p47Q4O43L62m41q70q9R19N76n33r76l70Q79J195l8j308r67O25
1046g51J566O07j100j519j91J453J435l35j686j038Q19J787P23j182j693k05J586
1063B76J406m69j699r96Q05J546L61j218j218R0J232Q43n58j103k56P53Q59j33
1081E21r62l33O49O99j07q26l59P84Q01k35r18n40P37J221n9j224r36L65J451
1100G29P37j160j566j73J416J514m13j890r45R57J825O33j572j712K81J631J193
1117A485n26j814p06J186J447K24j217j233M17J333N60o15j157k43J030O17m33
$$ y = [-422, -1857, -1010, 933, 1852, 717, -1530, -1894, 191, 1814, 1312, -694, -2184, -1122, 1202, 1745, 169, -1605, -1565, 313, 1681, 1068, -565, -1469, -481, 1207, 1283, -52, -1000, -766, 389, 1078, 305, -677, -554, 300, 799, 305, -442, -358, 285, 647, 206, -664, -753, 166, 742, 209, -767, -1137, -258, 937, 899, -409, -1376, -751, 815, 1422, 322, -1197, -1388, 65, 1500, 1165, -521, -1559, -740, 1047, 1770, 588, -1105, -1310, 276, 1682, 1213, -486, -1482, -677, 869, 1230, 12, -1206, -1116, 116, 959, 401, -702, -958, -205, 654, 521, -441, -774, -125, 574, 467, -359, -718, 66, 867, 632, -286, -826, -89, 1132, 1073, -151, -1087, -722, 729, 1466, 306, -1260, -1433, -17, 1497, 1084, -806, -1751, -794, 1031, 1664, 92, -1620, -1339, 292, 1485, 959, -855, -1561, -375, 1072, 1296, 79, -1154, -737, 596, 1156, 541, -616, -859, 171, 788, 355]
1134C55o72l41N14O97l04o74p4M35N93j54q66k11O19O88P5r49q19O50J134L17
1154A013p29j230r7J381R67m42j342q86Q23J547K67j124j370q0J543J152o19j397
1172f23p36Q01J602K30j247j063J19J223Q76o67j154k77P06R63l2r91m53M71O81
1191D29J90o89n73M24O50Jn76n63L58R00J02q06p01K61J122N85q32j175j07J136
1211A36J179l70j582p38Q83J512M48j385j472K70J557J060o79j704n93J168J407
1228A097Q2j371j163M60J387N97p24j176j81J019Q61k86r03m01N34P40k6o67l81
1247e02L50N80oo23l26M13N85L0p04n37L99Q94K31p74q68R2J033P82n12j202m54
1268a119Q62J232J30j179j066L04J313Q30o80j426m34J004J206P9j213j039L70
$$ y = [355, -317, -658, -144, 553, 249, -425, -499, -64, 529, 375, -491, -702, -83, 605, 680, -269, -1088, -438, 696, 1013, 284, -946, -1043, 338, 1305, 863, -479, -1365, -542, 1005, 1272, 148, -1222, -1302, 241, 1393, 774, -623, -1359, -558, 1044, 1274, 27, -1036, -917, 306, 1182, 515, -639, -916, -210, 753, 721, -270, -723, -252, 429, 619, -70, -643, -219, 431, 432, -144, -707, -349, 551, 653, -153, -854, -593, 529, 1114, 282, -893, -1000, 136, 1315, 945, -637, -1375, -492, 1020, 1468, 83, -1389, -1119, 438, 1498, 819, -885, -1478, -310, 1097, 1179, -192, -1355, -895, 492, 1089, 365, -811, -992, 27, 888, 602, -301, -702, -168, 572, 546, -121, -502, -152, 428, 422, -201, -527, -114, 471, 501, -203, -740, -341, 553, 784, 10, -858, -766, 267, 1049, 537, -665, -1119, -257, 975, 1105, -74, -1140, -836, 477, 1307, 627, -799, -1233, -229, 977, 1056, -157, -1196, -826]
1285h26J237O34n97j204k73R32Q79r2q92o38M53Q84J50n66n60J03O87K75m97m49
1305c60J19N39L15n50o26K21O89L70m92r71p7R88P07l74j134o23Q77J254N8j097
1325a67j104L06J527P66q33j312m07J131J413k08j373q59M80J383N69j013j131
1342h32l4R39R33l41j153l28N57P25J72p89n92M02N77J22m20n35K75O37K2m49
1362a12l84J50P99K47p23n60J17P54O58n24j077j55P69R31L0j174q06N25J092
1381E57N89p49j324j05J070R00j04j197q62O09J175L76o80j086j17J045P69k22
1399F44q68o18N06R15P8o05n76QO97L54m46m33j4M49L86l32n06J22M48K96k86
1420B19p23k3P33M57l14q37l66P26R49o7r45p96L73J236M82q48j147j88J073J088
$$ y = [-826, 411, 1045, 448, -756, -1029, -97, 782, 690, -202, -840, -387, 497, 647, 81, -479, -376, 311, 586, 89, -360, -241, 298, 613, 63, -563, -342, 347, 717, 225, -746, -823, 165, 872, 498, -636, -1259, -382, 872, 930, -167, -1271, -965, 562, 1328, 495, -817, -1224, -93, 1320, 1112, -261, -1120, -640, 743, 1312, 299, -832, -866, 73, 1006, 665, -488, -816, -259, 466, 638, -151, -743, -341, 236, 358, -62, -597, -322, 315, 337, -112, -496, -346, 453, 700, -23, -583, -466, 288, 946, 422, -655, -810, -41, 890, 920, -254, -1060, -535, 557, 1146, 397, -927, -1032, 38, 938, 834, -363, -1225, -616, 559, 935, 255, -831, -948, 97, 866, 644, -224, -842, -336, 579, 657, 52, -524, -516, 181, 535, 89, -344, -358, 91, 477, 145, -361, -239, 209, 505, 219, -504, -527, 206, 663, 349, -488, -854, -128, 821, 754, -191, -987, -614, 622, 1104, 256, -891, -1079, -6, 1082]
1440A082l52j279o62O54J281L83r71j044J05J090Q32m74j124l44O60Q41M2q56
1458a36o06L71P29K09m90n41J47N73K12l98m94R0N64J83m90n22Q4O57M32m28p64
1479f18p4P94P17j98r13n17N62R91K33q78r27Q9J008P17m17j089m62P13J041J28
1499I00q95q51J57R26O01m58r53l06N97P73M2o92n19K74O77L21l72n33K7M74K87
1520D77k42m49p3M10K48k80m14k8M75L89k94n95j10N22O10j32q49m79M60Q40K52
1541G38p71r05J42J002P03l74j075m33Q29J017Q4r38r23K64J081N11n72r95l02
1560i17Q22Q42j43q06n43L80Q45J67o00n33Q0N48L31m00n16P7M23K89k61m86R2
1581c09N34K66k68n79p9O33M56l24o98l41N05Q05j7p88n83K34R25M99n73q81j63
$$ y = [1082, 730, -549, -1211, -557, 724, 1107, 136, -908, -803, 287, 1119, 645, -479, -823, -163, 678, 720, -136, -742, -371, 358, 567, 77, -464, -317, 256, 468, 70, -424, -334, 230, 413, -77, -599, -515, 142, 574, 146, -618, -692, 102, 819, 621, -292, -809, -247, 744, 977, 99, -828, -739, 269, 986, 569, -520, -982, -269, 772, 900, 5, -846, -689, 237, 838, 380, -573, -879, -282, 491, 533, -159, -678, -404, 273, 594, 222, -311, -284, 190, 477, 235, -214, -287, 123, 371, 91, -323, -351, 124, 513, 219, -376, -486, 36, 646, 514, -335, -814, -354, 486, 738, -33, -938, -796, 206, 909, 535, -540, -973, -144, 873, 957, 19, -904, -640, 441, 952, 380, -615, -917, -95, 747, 604, -202, -745, -365, 480, 647, 47, -486, -406, 142, 473, 73, -443, -366, 57, 346, 85, -401, -309, 225, 491, 223, -356, -435, 198, 654, 330, -368, -709, -204, 601, 584, -204, -787, -553, 372, 871, 298, -583, -746]
1602g46P41Q42j21r48n79L58Q51M03o19q36l1O96O53j21p54m11M01O28J58m69
1622I6n81R6N00K35k26m44r5M27K68j89k95m5L36L02j99m23n0L48L95j53n74k56
1644e27M01N94P8o16n66K45P72L95m61q40j96P21P26j45q70o17L96R10L37o21
1664A16q36k2Q25O71k51p95l92M80P41R9o43n53J74N93K82l68m98PM89K99k27
1685A91m00j8L68K70k37m27p5M04L24k34n51j23M43N16m4o31m06L66P21J95n53
1706I9p03L9P23N15l08p96l64N31P95P2o28o01J29P74M51l73o81k19M72N86n2
1727D61n63l99J76N41K21l51l81L0L55K77j44l75m9K62J69j06l26j12L01K15j42
1748F0l20j50L36M17p8m33k55K36N50J83n09n23M6N61N01k82p19k19M50P00J25
$$ y = [-746, -5, 837, 716, -232, -811, -453, 398, 801, 182, -654, -685, 11, 664, 543, -211, -622, -221, 407, 565, 96, -485, -389, 111, 346, 120, -324, -419, 8, 276, 87, -208, -253, 83, 385, 186, -237, -287, 61, 456, 303, -271, -527, -126, 468, 546, -70, -636, -391, 381, 776, 315, -525, -721, 0, 726, 581, -289, -906, -510, 400, 737, 116, -720, -742, 83, 754, 503, -292, -684, -204, 537, 636, -7, -560, -386, 207, 489, 121, -377, -370, 119, 418, 191, -209, -227, 141, 411, 174, -253, -328, 76, 400, 166, -385, -508, -65, 451, 407, -224, -630, -264, 457, 652, 99, -604, -565, 158, 673, 365, -431, -795, -264, 531, 603, -25, -626, -497, 277, 728, 355, -326, -545, -73, 513, 461, -102, -501, -325, 216, 437, 86, -295, -265, 90, 367, 223, -152, -201, 61, 230, 124, -202, -314, -13, 202, 60, -260, -410, -74, 343, 265, -168, -423, -187, 363, 546, 37, -486, -440, 121, 622, 340, -379, -598, -148, 552, 677]
1769F77o74n78K17O74M19m00p65j70N48N36m1o57m41L40N65J64l64m82M6N35K35
1790C84k47l81q3L32K71j79l37n6K76L20j30l93l3L41L33m4n03k50L66M48J7m76
1812b4n07J65O22K58l63o19j42O00N66j44n86m27K80O92J77n10n39l5N36M69k00
1833B69n52k33L31N24J11m21l24J03L61K38k21l75j4K39J73p4k65q3K37J67p6
1854A15k20q6K19K40j14k95j52J76L52Ol97k96J50M25K66k82m90l8M57M63r0n55
1876a46l37L00N37J86m40n52RN46L90j59n61k64L81N05O6m33m02R0M50J96k65
1897I7l88o6L31K58j22l12r0K36K61n6k76q3K12K28m7l04j58K37L13ml44k84K01
1920a60M39J39l16m26KM73L47k30n24k21L27M95L9m82m10J29N19K97k80m66j11
$$ y = [677, 3, -575, -358, 316, 735, 335, -430, -600, -52, 484, 443, -214, -655, -315, 250, 414, 50, -432, -386, 149, 384, 137, -244, -327, 5, 276, 97, -240, -296, -20, 300, 170, -223, -256, 85, 418, 374, -129, -379, -13, 435, 452, -24, -531, -366, 256, 514, 151, -468, -610, -10, 556, 412, -174, -601, -321, 371, 548, 38, -501, -536, 0, 469, 269, -283, -516, -185, 339, 450, 29, -295, -192, 169, 407, 186, -189, -203, 36, 209, 135, -130, -213, 24, 191, 115, -105, -191, 28, 268, 154, -141, -293, -117, 235, 241, -156, -452, -302, 123, 389, 107, -383, -421, 36, 499, 409, -146, -483, -183, 354, 540, 100, -452, -443, 103, 493, 334, -227, -491, -110, 395, 461, 28, -374, -284, 166, 362, 97, -291, -357, -26, 232, 110, -202, -292, -56, 205, 149, -127, -210, 2, 230, 183, -121, -279, -42, 271, 267, -77, -361, -160, 279, 418, 102, -324, -322, 151, 498, 268, -256, -477, -150, 345, 384, -98, -508, -379, 140, 437, 157, -309, -420]
1941d20L76M03k6m14k68J48L78J28k34l15OK79K06j10k36n6J77J69m5k04o1J23
1963DJ41m2k12j09J66J92j1k39j80J55L06R1k55k94L1L66K40j58l98j64K88L98
1985C16K1l96l28J14M51K57k69m21j09L41L95m0m07k80J54L78J53k80l37QK92
2006A3K42r3k94j05K17K22k5k22j31J45J94m6j91j25J23K26pk22j53J36K69R3
2028B66k57k71Q1L30J97j98l85q5L20L35o2l98k53K12M04J33k84l73ML68K69j40
2050B13l64j88K09L31L2k61k54N6K82J56j38k09m2J76J84n9j81o6J11J20k0j46
2072e8n7R7J36kj55p7J10J77Nj73j77M8K37R9j83k66l2K31K56p3k99j58J68L32
2096A86J01k41k95J8L00K40j11l51j38J90K97O1k45k54O9K82J56j20k59n7J72
$$ y = [-420, -44, 359, 333, -81, -349, -201, 177, 305, 71, -244, -238, 41, 247, 137, -99, -155, 22, 191, 146, -58, -119, 4, 145, 103, -109, -218, -52, 140, 129, -110, -290, -135, 171, 262, 7, -287, -256, 110, 350, 192, -206, -370, -82, 316, 337, -59, -387, -273, 178, 435, 166, -255, -364, -23, 372, 332, -75, -355, -201, 177, 330, 50, -287, -279, 13, 255, 162, -132, -237, -20, 202, 177, -45, -176, -31, 163, 117, -74, -199, -76, 150, 143, -79, -232, -96, 173, 266, 9, -262, -181, 149, 346, 148, -237, -322, -2, 333, 271, -127, -380, -168, 236, 369, 85, -288, -284, 84, 353, 213, -151, -339, -130, 201, 233, -28, -282, -226, 56, 212, 74, -135, -177, -1, 183, 124, -57, -123, -12, 108, 88, -58, -115, -18, 118, 116, -39, -116, -6, 171, 176, 3, -174, -126, 111, 210, 27, -239, -271, -40, 216, 143, -156, -314, -146, 186, 287, 46, -249, -231, 69, 309, 198, -153, -291, -101, 196, 257, 12, -242, -173, 109, 265, 145, -114, -171, 1]
2117AJ99n6k05j15Q7J74jj35j01O8J73J9j56q4Q6J75J9j66j64O8K21Q0j74k24
2141b11mK59K16r6k84j18J98L10K2k90k53N6L02J67j67l19q3K42K70ok70j72J20
2164a11K57J13j79k10l8J97J28o1j98p8J13J55k0j22n6Q6J23jj04p2N9J13Rj50
2188d7r4P0J35N9j27j70M8K04J32q6k16o4J56K08j1k16k10O5K50J29j39k57p1
2211b52K16K52j6k40j59P0K56Q9j61k35k3J88J65o5j96q2J14J83M1j46q8O7J30
2234A08M0j16j15M5J11K1j04j16M4J71M8j21j44K0J86J19j06k30n0J57K00k1k46
2257i9j66R2K63J21j73k33j0K36K14o0k56j26J25K35N4j95j92J3K10J27q8j86
2279i4n2J46J37j2j36r9P3J10Mj04q8M6R1J1q8n6N5J09L4r8r2N6J20P0r9j58j7
$$ y = [1, 200, 144, -61, -176, -89, 85, 84, -51, -152, -84, 89, 108, -48, -132, -46, 129, 148, -18, -182, -114, 107, 187, 13, -211, -215, 44, 260, 164, -120, -238, -40, 270, 292, 2, -251, -195, 107, 274, 107, -212, -295, -53, 217, 211, -59, -231, -111, 146, 259, 80, -130, -168, 29, 157, 96, -102, -180, -67, 88, 68, -54, -110, -24, 99, 98, -6, -78, -19, 94, 103, -47, -141, -71, 64, 123, -4, -174, -126, 78, 210, 124, -92, -156, 0, 208, 197, -19, -229, -164, 86, 215, 76, -181, -252, -36, 216, 200, -40, -199, -129, 127, 216, 55, -180, -203, -15, 150, 85, -111, -193, -79, 104, 145, -1, -89, -22, 108, 148, 32, -83, -38, 73, 94, -10, -126, -82, 89, 137, 16, -128, -108, 78, 197, 91, -139, -189, -32, 168, 147, -99, -265, -173, 90, 211, 38, -195, -205, 31, 245, 185, -71, -197, -72, 163, 217, 22, -170, -157, 53, 180, 92, -94, -146, 0, 137, 125, -11, -110, -37, 73, 77, -27, -115, -69, 22, 33, -55, -111, -56, 53, 87, -11, -103, -47, 73, 143, 44, -114, -131]
2306a31J42J39l6j88j10J19J96O6j51j93KJ88J72q8k17j22J15K20L5j75j75L0
2328a62K02J30q1j81o6J36J52Jj55j11N6J31M9r7j03K8J14M2p1r3L1J14M0p4j19
2353h7J5J18Q2q7j66k2J40J38l9j71r8R7K24M1j69j85K6K05J55j14k32q7J69K15
2377A68Pk00j78P6K11J16j21k05l5J56J47l1j64q4Q6J28K4j07r8N4R5K2o5o8J6
2402e0R9K7r0p1K3J13M2q5j08rJ28J11n3j63n3J04J55L6j60j51L9J85J06r3k02
2427a20n7J54J85jj81j68P7K09Q4j15j88l7J65J38k6j53j19P5J61K7j09j13RJ16
2451A3P8o9j02nQ9P9n7j00NR3P0m3j23k6J07J12l9j39q3R4J79J8j48j66L8K04
2477G9J14j26k12n0J66J99l6k15j41R5K23Q0j64j77oJ90J47n4j94o5R6J55L2j34
$$ y = [-131, 11, 150, 114, -74, -184, -65, 131, 197, 46, -147, -145, 43, 215, 127, -90, -212, -97, 123, 158, -17, -192, -162, 40, 170, 89, -92, -158, -22, 130, 131, -24, -135, -79, 52, 101, 4, -99, -71, 43, 85, 14, -79, -48, 66, 106, 32, -87, -72, 46, 128, 41, -125, -147, -7, 131, 92, -79, -177, -80, 144, 185, 16, -169, -143, 62, 217, 103, -129, -216, -47, 168, 175, -25, -203, -127, 84, 200, 79, -126, -161, -5, 142, 111, -53, -137, -51, 77, 101, -6, -104, -50, 45, 67, 2, -66, -50, 49, 76, -14, -85, -62, 51, 93, 8, -100, -109, 19, 130, 77, -86, -139, -35, 120, 156, -4, -155, -116, 69, 175, 82, -120, -177, -23, 162, 161, -20, -188, -111, 98, 182, 67, -121, -158, 7, 145, 119, -34, -153, -78, 83, 110, 1, -112, -103, 13, 91, 22, -80, -85, 4, 83, 26, -74, -69, 24, 94, 51, -72, -98, 9, 121, 82, -57, -140, -46, 133, 151, 3, -163, -125, 79, 193, 67, -145, -195, -29, 170, 134, -81, -222, -127, 96, 176, 12, -165, -171, 19, 166, 112, -82, -147, -51, 104, 136, 2]
2501Bj20M2J42M8o3j16J7J00M5n2j02mQ4M8p2r6k4J01J01m7j43l8J03J47Jj38
2527c4j17O2J69R0j10j92k2J71J52k2j93j22R0K10O7j47j76k1J66J50n3j95j11
2550a88Q6J81L0j21j38J6J48J03o0j22l5Q2J02j6j09n5P2R5k2j03m0P0J17%j21
2575b8p5P9J46J4j35j55L8J65J10j25j95l8J76J97k0k23j25J15K20Q0j90k09N
2598a73K10J52q7k18j11J56J96L5j61j65N5J89P1q2j54k9J10J13o1j08m8P4J06
2621G0j5r6k9P3J01j2j01p7P7J09jj34j18M8J60O9j07j62k0J66J64n0j87j09R6
2646h5K07N3j66j84j3J96J54n4k00j03J26K05O0j57j63J5J60J14p0j80n8R4J36
2669H7mj23q8O1J18M0r5q3M2J05J9r7r5M3J14L8r5j25K8J60J13q6j88m2J65J68
$$ y = [2, -118, -76, 66, 114, 51, -65, -48, 52, 97, 45, -57, -61, 23, 71, -1, -97, -121, -20, 81, 34, -109, -147, -44, 103, 104, -34, -151, -89, 80, 170, 60, -132, -154, 17, 169, 147, -46, -168, -78, 132, 199, 52, -124, -145, 21, 171, 118, -77, -188, -102, 79, 109, -12, -150, -134, 14, 117, 57, -65, -100, -18, 84, 68, -41, -96, -24, 71, 49, -54, -94, -24, 93, 93, -28, -103, -24, 122, 136, 1, -154, -116, 49, 159, 34, -161, -199, -23, 174, 154, -69, -194, -79, 141, 221, 31, -178, -173, 37, 189, 102, -116, -227, -71, 125, 160, -1, -166, -111, 78, 149, 67, -87, -116, -6, 107, 46, -62, -110, -36, 70, 55, -41, -70, 3, 104, 92, -9, -86, -9, 100, 99, -35, -153, -105, 55, 124, 17, -145, -165, 1, 165, 115, -72, -181, -85, 122, 175, 9, -175, -188, 8, 162, 108, -92, -195, -69, 136, 196, 39, -124, -109, 51, 165, 95, -85, -143, -49, 87, 83, -40, -128, -67, 51, 91, -4, -87, -45, 60, 79, -18, -113, -70, 44, 82, -13, -138, -110, 50, 163, 77, -111, -153, 12, 180]
2695A80l8k01j41J02K20O8j74k12KK29J77p6k33j18J64K18L3j96j90K6J98J26
2717A64j10j84m2J44J43oj50p6P9J28J5j13p4L3J01J3r0q0N5J08J1r0r8M8J29
2742E8P4r7j55j0J56J33o8j92q8J09K02L1j56j70K4K00J54r2j93j03J33K12J6
2765A78j75j83M4J84J18q6j84o1J34J54Qj48j09N9J27L7r7j03J2R9N9o4q2QQ8
2790A7O6n7r4J4J07P3o9j38k7J13J35l8j69j11J03J93N9j69j86J7K09J55r6k36
2814a29q9J60K06K0k05j72N0K33J20j15k15k6J51J71k6j77j16J04J40M0j22j10
2836a07L0J25M0p6q6J4R3M7q1q0K2R6O4q4j19pJ25J09n9j52p0J23J57K3j58j59
2862a70N5J90J19j08k18n7J70J86j5j88j50N8J97J11j18j88l7J40J77l4j62j02
$$ y = [180, 142, -59, -200, -98, 122, 190, 16, -196, -194, 35, 212, 136, -97, -215, -51, 167, 200, 4, -186, -160, 38, 164, 54, -130, -172, -28, 115, 109, -41, -117, -38, 90, 105, -8, -82, -49, 52, 65, -25, -105, -50, 58, 69, -21, -119, -71, 58, 132, 35, -120, -130, 26, 159, 91, -101, -189, -80, 122, 153, -3, -173, -149, 51, 205, 113, -80, -183, -50, 162, 178, 3, -180, -136, 48, 166, 80, -104, -165, -31, 123, 131, -17, -126, -67, 60, 97, 0, -103, -91, 8, 67, 3, -79, -71, 17, 83, 26, -68, -54, 53, 126, 57, -81, -108, 5, 140, 102, -67, -178, -75, 118, 177, 8, -178, -161, 48, 203, 107, -129, -218, -58, 148, 168, -37, -209, -159, 74, 194, 79, -136, -162, -11, 160, 134, -43, -159, -55, 85, 125, 3, -107, -77, 48, 88, 12, -74, -60, 33, 80, -1, -81, -59, 37, 101, 17, -102, -109, 16, 125, 66, -86, -156, -33, 124, 147, -11, -170, -115, 75, 194, 86, -132, -189, -19, 167, 152, -36, -186, -128, 69, 180, 62, -126, -163, -23, 154, 120, -42, -144]
2884a44N6J62N0r5j20KJ07P8m2j00k2P7P3m0r9jO4N7k8j06j7Q7J06m3j19q3R0
2911e0J54K3j37j51K3J97J25j14k04n0J68J82j5j99j48Q1K10J00j33k17j8J77
2933DJ68k8k01j01R5J71L0j37j39K4J44O8q3j09qJ01O9l2j04kR6O0o1r2j5Q8Q7
2960I3l9j31m7J09J46oj46j14O1J61Q5j24j86k1J62J41l5j78j35R8J99P0j50j55
2984a42k1J73J45n2j83r0R9J54L5j07j33J8J18R2n9r3l7Q1Q5j9q7m0N4O3k2p1
3010c9m0O8O6j9q3o2Q1J25J1j33j00M5J49O9j10j62k8J55J46l1j87j05R8K08N9
3035A81j61j75j3K10J47q3k08p9J28J74J6j51j36O4J55Q7r7j41j0J13P8m7j11
3058e9l1Q3O4l1r2k6P9Q3k8j03l5R2J02k6j33q4Q1J38M3j24j38L0J71J11p4j83
$$ y = [-144, -88, 74, 124, 29, -91, -89, 18, 96, 54, -46, -68, 9, 82, 42, -57, -58, 6, 63, 35, -71, -88, -1, 105, 62, -57, -140, -50, 104, 127, -10, -161, -138, 59, 184, 70, -134, -184, -16, 166, 151, -48, -196, -115, 95, 195, 62, -155, -173, 4, 172, 144, -57, -158, -63, 108, 138, 1, -138, -114, 30, 98, 15, -94, -102, -1, 68, 36, -68, -70, 26, 86, 25, -67, -82, 6, 93, 54, -77, -124, -15, 131, 125, -21, -135, -74, 87, 172, 48, -138, -159, 3, 144, 109, -69, -204, -106, 93, 163, 13, -142, -163, 10, 155, 103, -80, -170, -71, 83, 118, 11, -122, -104, 14, 106, 47, -46, -83, -2, 83, 64, -23, -63, -9, 54, 32, -39, -79, -11, 55, 36, -47, -109, -28, 97, 108, -25, -125, -80, 69, 138, 28, -134, -162, -7, 139, 108, -79, -184, -86, 122, 181, 20, -155, -168, 42, 189, 106, -102, -181, -53, 121, 137, -14, -150, -86, 69, 156, 59, -82, -92, 21, 99, 52, -59, -90, -7, 57, 26, -66, -92, -13, 70, 42, -61, -96, -4, 98, 72, -61, -145, -64, 74, 117, -7, -145, -115, 56, 167, 93, -90]
3084i0m6J22J76J0j82j47N0J76Q3j09j69l9J35J47mj69r2P0J36M5q6j23KR9P4
3109F9n1p8k7P1O4no7j7L6P4k0p2k4M7P3j4q5p8O4J05L3j07j13K2J53Q1p0j61
3137i7o1J30J59lj77j38O1J95Q7j16j78k8J65J59l2j70j00P2J67M8j26j29jJ27
3161A4R1o4j20k3Q6Q4pj10l3P3P1k0q7m8Q3P4j0j04o1Q6J10J5j12j01N0J48O9
3188A54j12j59j6J45J43m5j91q8Q9J84M8j33j67J7J61J11n7j70o7J04J31K3j26
3211b1j11L3J29P3o4j02j7O0R7j6p8m5M8P7j3o4n1M8O5%q1l6N0P3K0j01p7M7J17
3240F0L9p9j34j3J24J21k9j57r5Q6J78M9j28j64J0J70J20o1j89p8J13J81J3j44
3264gj27L9J54Q6q8j37k9J05J05k5j21m9N2J05nj00n3O2Q5kr8m7P3Q8J0j00r1
$$ y = [-90, -136, -14, 162, 172, -10, -157, -107, 69, 152, 43, -126, -165, -30, 117, 113, -56, -148, -78, 58, 103, 17, -106, -104, -5, 69, 18, -60, -87, -16, 48, 43, -24, -41, -5, 69, 49, -23, -47, 0, 73, 59, -26, -104, -40, 65, 98, -9, -122, -100, 53, 134, 64, -97, -158, -28, 131, 128, -49, -187, -126, 69, 156, 40, -138, -166, -1, 158, 126, -44, -144, -72, 95, 143, 17, -112, -113, 14, 105, 41, -79, -102, -16, 68, 61, -49, -82, -9, 62, 42, -45, -93, -10, 64, 54, -50, -111, -25, 85, 100, -12, -113, -63, 85, 154, 42, -117, -133, 12, 155, 110, -81, -169, -80, 104, 152, 19, -148, -131, 30, 141, 84, -86, -153, -49, 82, 105, -21, -132, -99, 30, 103, 39, -63, -80, -20, 77, 61, -17, -62, -14, 63, 50, -14, -65, -17, 48, 48, -33, -69, -19, 54, 74, -27, -104, -57, 60, 99, 20, -114, -127, -3, 118, 89, -68, -163, -77, 101, 150, 22, -142, -132, 38, 158, 97, -92, -170, -57, 124, 137, -7, -134, -95, 59, 145, 57, -80, -109, -4, 101, 76, -45, -94, -42, 63, 58, -42, -95, -33, 52, 50, -48, -95, -22, 66, 76, -24, -115]
3291a15N6J37K9j04j40J5J60J13o7j76p1J31J71J4j67j42M0J92R2r8j82m5J51
3314fJ47k6j56j06O5J34P0r8j36rJ20R7l7j17m1P4Q6Jq3n1M7P9oo4m5M2Q1qp7
3343b3o0M5J02L1q5j10RJ21R1o0j54n7J15J55Lj57j40N8J73R7r9j85l5J46J54
3368A35rj82j20Q6J74P1j24j55oJ51J09l8j61m7Q3J10Jj07q1N5J08J2q4o1L8J01
3394E9J6r2q3M5J17L7j03j21L1J40R1q3j61l9J44J41j3j85j08R4J79N8j44j76
3418a56jJ84J38o4j87r7J30J77L0j51j46L6J51Q7p2j36m1J03J03lj10o9O5Q0J6
3443F7p9m3K7P8%p2m8M0Q6J3p9q7K0J19O4o9j34k0J24J29l1j59j03P7J80O5j41
3470B4j80J3J67J67p3k00q8J13J89N5j76j59J6J74J10q7j56p4J35J45pj28r5M1
$$ y = [-115, -59, 78, 107, 3, -137, -122, 38, 151, 84, -92, -163, -32, 139, 153, -14, -156, -116, 76, 168, 70, -112, -157, -6, 141, 115, -41, -147, -82, 52, 122, 24, -112, -121, -1, 96, 59, -58, -99, -25, 61, 62, -21, -72, -25, 54, 48, -16, -61, -19, 62, 54, -23, -83, -38, 64, 95, 10, -100, -91, 30, 121, 61, -93, -150, -35, 120, 123, -34, -174, -116, 57, 154, 55, -130, -165, -19, 135, 126, -56, -176, -90, 84, 155, 31, -124, -130, 21, 130, 92, -69, -116, -33, 77, 78, -29, -110, -55, 53, 65, -19, -80, -42, 59, 75, -17, -100, -55, 62, 99, -4, -125, -94, 46, 137, 54, -107, -146, -2, 139, 126, -59, -167, -73, 106, 164, 20, -156, -157, 27, 165, 101, -86, -183, -53, 124, 154, 3, -143, -107, 44, 131, 59, -77, -118, -15, 88, 85, -25, -94, -29, 51, 67, -12, -55, -28, 50, 50, -22, -70, -30, 56, 69, -10, -97, -77, 42, 106, 37, -97, -117, 7, 136, 105, -54, -157, -80, 100, 165, 24, -156, -143, 24, 191, 118, -82, -170, -57, 132, 187, 11, -148, -132, 42, 152, 65, -91, -165, -30, 115, 108, -20, -115, -74]
3494g4J46K5j08q2K7J02K6p5p9L6J07K9o6j08K9J18Q3q2j43k8J38J33m5j71j08
3519a70J02J87M1j54j86M0K09J33j00k08q5J46J92kj83j49M8J96R7r6j76j9J37
3542@J27k3j44q3Q0J21K3j01r1L2J02L7q7n4J5R8K1o4q8K1J05N0q0j16k8J20J17
3569A10m3j53p6J05J69L5j52j54J6J99J25r1k11p0J40K05J2j76j71N0K13J04r0
3592I6k06n6J57J54j6j65j15O9J55M2j06j33K6J34O4p1j07%J03N8o7j04j3J15
3616A4Q2o0j35l3J21J55m2j68j01J14J92M8j83j84M6K10J24j15k32o9J83K12o
3639A73k27j71J08K20J10j58k12l2J86J72n5j92r8R7J74L9j41j13K6J44N6q7j00
3662h1LJ03N3n7j00kJ03N6n6j02k3J18J15m8j55p0R9J65J8j47j65L0K01J05q4
$$ y = [-74, 72, 97, -11, -93, -66, 36, 62, -13, -92, -56, 51, 80, 14, -94, -65, 53, 136, 54, -89, -117, 21, 154, 109, -62, -170, -68, 119, 160, 6, -180, -140, 69, 202, 102, -106, -191, -45, 147, 145, -38, -187, -139, 57, 154, 58, -118, -137, 0, 127, 104, -40, -123, -43, 78, 101, 0, -91, -59, 43, 80, -7, -61, -46, 52, 73, 9, -79, -58, 47, 97, 17, -99, -127, -7, 110, 67, -86, -162, -57, 112, 147, -5, -159, -143, 56, 181, 90, -121, -191, -51, 154, 166, -10, -181, -131, 82, 186, 96, -110, -166, -9, 145, 129, -36, -151, -82, 73, 115, 9, -124, -98, 36, 100, 29, -78, -78, 25, 83, 16, -88, -101, 14, 96, 36, -99, -132, -11, 144, 102, -66, -167, -53, 139, 187, 4, -180, -134, 76, 200, 85, -147, -216, -33, 179, 173, -54, -225, -117, 103, 213, 55, -157, -189, -3, 169, 114, -78, -176, -79, 95, 134, -7, -120, -94, 50, 106, 19, -81, -78, 25, 78, 21, -79, -81, 22, 78, 22, -80, -103, 15, 130, 82, -73, -143, -44, 121, 139, -8, -173, -143, 58, 163, 79]
3687G9k14o0J69J95Rk16j63O9K34J03j48k06m2J75J86m0k02j11J01J86N7j32j61
3710a32J0J65Q4p4j45k2R6J11m8j16k5R2J04l9j19n1J07J27k6j51q3P3J80L2j58
3735hj73L5K20J21j07k35o9K00K14k2k37j72J05K43R9j88k25qK20J81n2k33j12
3758b03J32K08K0j54j38K2J72Q9r1j47k5J29R0m4j19l2Q7J03m1j21m9J06J02l1
3782F5j36p5R8J50J7j48j34M6J83R7j08j92n2J80J81l2j97j45Q4K28Q9j48k19
3805a68j7J99J84m0k30j20J15K05M6j56j81K7J81J10q2j55o0J18J31j8j37p9P9
3828d8J24Rj16q5P4J24J4j20j06N7J54O4j32j59K2J85J22r7k14o8J79K12l8k19
3852f2j43R3K49Q2j77k31j1K17J99p1k59j06J41K25M7j94j80L8K07J16j11j76
$$ y = [79, -135, -195, -26, 169, 178, -38, -201, -132, 102, 205, 57, -149, -191, -16, 170, 130, -72, -183, -82, 104, 161, 29, -132, -122, 43, 127, 53, -92, -114, -18, 93, 45, -71, -96, -4, 100, 61, -58, -109, -2, 125, 99, -52, -135, -62, 118, 150, -8, -181, -146, 74, 195, 88, -147, -216, -16, 198, 176, -61, -233, -128, 115, 214, 26, -199, -207, 13, 194, 142, -91, -203, -71, 137, 157, 3, -135, -113, 59, 148, 57, -90, -115, 14, 104, 60, -59, -91, -4, 99, 58, -63, -112, -6, 96, 65, -71, -146, -48, 102, 119, -29, -163, -117, 66, 163, 55, -137, -189, -9, 172, 140, -57, -202, -118, 110, 199, 51, -168, -185, 14, 198, 158, -72, -192, -77, 128, 174, 18, -163, -136, 45, 155, 73, -82, -142, -24, 107, 89, -48, -127, -48, 76, 85, -31, -116, -42, 82, 96, -24, -130, -73, 81, 145, 13, -146, -124, 61, 183, 86, -128, -196, -17, 195, 157, -62, -205, -112, 137, 219, 42, -189, -200, 17, 216, 145, -114, -220, -79, 146, 193, -1, -181, -143, 64, 180, 69, -107]
3874a07m1J29J54l5j49o6Q3J14J4j20p8N7J23J3j20q3N2J44K7j14j34M2J62J00
3898A67j04j98l2J67J70j9k15j30Q3K21R0j61k06j5K01J77n3k38j07J17K25N3
3920A93j82j92J0K08J50r7k03o8J45J55Nj50j08N5J59L8r9j22L5J20N5q5j29J7
3944i0J41Q1j00j47qJ49J22o9k03n0J41J82qj94j64R3K28J01j66k20j1K19J89
3967B16o1k55j30J48K44M1j97k06L1K30J44j13k13n5J51J84j5j88j10P7J58L5
3989A16j28j29M3J41N8r8j15K6J22P0q0j38J1J31R9o2j60n9J37J61j4j92j24R7
4013h7K04Q6j56k07j0K00J86p3k26j23J16K25N9j83k05L2K01J46p3k16q7J41J90
4036A40Kj69j36N6J55P5r8j46J2J28R4n3j36k0J05J06m5j23n6J07J16k1j41r6
$$ y = [-107, -148, -19, 135, 100, -49, -115, -32, 82, 96, -24, -102, -45, 78, 91, -29, -112, -60, 84, 111, -3, -137, -95, 67, 167, 63, -135, -167, 0, 170, 151, -64, -194, -111, 110, 200, 39, -167, -182, 19, 196, 143, -95, -202, -85, 140, 193, 11, -181, -171, 37, 187, 90, -113, -181, -36, 119, 124, -26, -134, -79, 80, 118, 19, -103, -68, 52, 107, 22, -107, -90, 51, 132, 32, -115, -123, 26, 148, 79, -124, -174, -33, 149, 141, -53, -217, -124, 104, 205, 39, -181, -192, 27, 216, 155, -100, -230, -82, 162, 203, 6, -200, -169, 61, 205, 92, -121, -176, -25, 159, 144, -44, -154, -77, 81, 116, -12, -141, -98, 43, 101, 3, -112, -86, 36, 106, 26, -112, -101, 30, 129, 67, -93, -152, -15, 146, 132, -60, -184, -87, 117, 203, 47, -160, -170, 30, 216, 143, -83, -206, -90, 135, 194, 11, -194, -162, 39, 185, 112, -104, -191, -50, 140, 142, -27, -163, -107, 48, 123, 25, -121, -109, 19, 113, 60, -76, -96, 9, 115, 70, -53, -109, -2, 114, 93, -48, -144]
4060a44J00J62J8j60j44O3J99J05j39k23k8J86J97n0k42j41J28K50O4j75k39L7
4082a76K26J66r8k40r1J75K03Kj89j52Q1J82Q4j27j48j3J55J02p8j42l4J16R0
4105I4l7j32m5J00J14l2j35p2J06J48Pj48j21O3J79P0j23j83j5J73J63o2k07j09
4129b04J33K09N2j71j98J9K07J55q5k23q1J28J99J3j73j53N7J71Q6p9j62k2J25
4152CJ21n1j24n7Q1J04k1r1p3P4J02K1j10q2O0J23L3j13j25M0J45Q7r2j72n2J71
4178BJ63l5j96j21J03K20N9j65j97j1K19J64r0k39q6J50K12Pj87j59O5K04Q7j12
4202E7j66k9J45J29m4j50p2J01J27qj28p5Q0J04Pj03p3N6J26K1j00j24L1J45O7
4227A24q5j63j9J61J32l6j99p9J12J86L9j67j74L6J75J24q2k03o8J39J80J4j58
$$ y = [-144, -44, 118, 136, -24, -168, -105, 94, 199, 60, -163, -191, -5, 192, 142, -100, -241, -113, 137, 201, 26, -213, -176, 50, 216, 118, -122, -213, -38, 165, 167, -22, -174, -93, 89, 173, 46, -102, -115, 40, 142, 64, -78, -112, 4, 94, 57, -75, -120, -20, 94, 62, -73, -145, -39, 109, 116, -32, -153, -90, 89, 159, 36, -147, -162, 11, 174, 112, -95, -204, -71, 138, 190, 19, -179, -160, 47, 202, 117, -106, -187, -59, 140, 153, -20, -173, -116, 55, 141, 62, -100, -122, 3, 124, 73, -51, -108, -27, 77, 56, -35, -108, -34, 68, 89, -21, -103, -43, 80, 113, 0, -125, -85, 60, 147, 55, -117, -169, 2, 165, 130, -66, -187, -84, 136, 195, 30, -167, -178, 41, 205, 115, -124, -210, -60, 152, 159, -28, -187, -122, 82, 169, 57, -109, -138, 7, 136, 92, -58, -130, -29, 98, 90, -38, -113, -33, 71, 78, -25, -98, -42, 84, 105, 5, -119, -88, 57, 124, 39, -124, -143, 18, 150, 114, -85, -164, -52, 134, 173, 6, -168, -132, 43, 167, 85, -118, -186, -47, 133, 147, -11]
4250a1j58N5J76R9j07j59l9J38J22k4j41p5P8J18K4j06p4M8J00K2p8q2K9J00K9
4275H4p8r9OJ16O8o2j40l5J24J47k7j61j02Q6J88M3j52j63RJ91J37p8k11q1J43
4300d7K00J3j68j54M8J89J00j22j74m0J39J49m1j62p8Q9J42K2j19q9M1J22K1p6
4324Eq6K6R0N1p8r7K0J04Q1p6j31j1J14J23l5j60q8R6J63L2j48j51K8J82J07j03
4350E8j64n7J35J84j9j65j26P3J58Q5j19j54k3J37J16k1j40p3P3J24J3q7q9J5
4374f6J05N3o9r6RQ4M5l8r5LQ1P1l4j02l0Q2J03l4j13p6O5J50L3j20j36J6J67
4401E8J02o5j80n9J14J65kj59j36N1J76P8r8j85qJ44J35k2j66p8Q1J40L6j14j13
4426a05K9J19N9q0j06J8R0N7n2q5j5R1O5k9j08l4R8P8k6j13p3Q7J31J8j26j18
$$ y = [-11, -169, -114, 62, 161, 54, -105, -144, -6, 116, 92, -49, -124, -46, 72, 96, -10, -84, -36, 64, 86, 8, -74, -45, 55, 84, 6, -93, -87, 29, 97, 35, -105, -140, -16, 131, 104, -57, -159, -73, 115, 158, 6, -157, -148, 43, 180, 102, -109, -190, -47, 153, 166, -2, -156, -108, 81, 181, 59, -115, -155, -16, 133, 92, -70, -148, -59, 83, 105, -14, -103, -62, 60, 81, 5, -81, -55, 35, 86, 8, -89, -69, 35, 116, 40, -91, -102, 12, 135, 100, -60, -148, -52, 111, 143, -5, -156, -128, 54, 161, 58, -106, -163, -28, 156, 137, -28, -154, -81, 77, 162, 43, -111, -134, 3, 119, 98, -42, -115, -42, 82, 95, 8, -81, -66, 39, 92, 23, -73, -64, 20, 65, 27, -68, -65, 16, 87, 53, -49, -79, 3, 106, 72, -41, -117, -52, 98, 131, 11, -125, -109, 58, 160, 95, -85, -144, -30, 135, 133, -26, -162, -111, 65, 143, 45, -140, -148, -4, 131, 109, -57, -135, -54, 86, 122, 8, -105, -76, 43, 102, 22, -84, -66, 24, 81, 29, -56, -71, 20, 85, 56, -52, -86, 12, 90, 64, -49, -122, -35, 96, 114, -12, -130]
4452a30M6J45P4p7j54m7J32J42l3j47r9O2J59P1j05j36j2J21J22l4j43o8O0J35
4476H4K3r6j02K4R3O2m6q8k5Q2O0k6p8j5M6O8j7r6k8N9P4%r2o5N2J07J8r0j02
4505a14J1J39Q2n9j44l0R8J33rj36j02N9J54O7j01j46qJ23J20m0j40p2O5J36J3
4530I9j01j05J3J18P6o5j13qP4Q0k5r3l0N3P4mq7l4P3P2j5p6o0O2R6K6r8q8L0
4559e6J21N2o8j38k9J18J11j8j42p8N8J38L8j03j24JJ32R9n0j20o7R1J16Nr6q5
4585i4J4J07O7n8q5j7P0N6j5p7l1N7N8pn8m0M0N4mn8m2K7O5K8n3q2J3J10N1n9
4615C7j04k5Q2R3j0j14q1N9J35M7j04j16oJ12R9k3j30o0O6J20K3j01r8QJ21P4
4641A04n9j01l5R1P5qr6n1N8O2J1o4n2L5P7ln8m8L0P4K2n9p3J2P5O2o4r2k5R3
$$ y = [-130, -84, 61, 135, 58, -96, -143, -11, 131, 98, -49, -148, -86, 73, 144, 39, -97, -109, 12, 134, 100, -43, -111, -51, 84, 107, 11, -91, -67, 26, 88, 42, -46, -71, 11, 71, 45, -33, -48, -2, 66, 49, -47, -75, -16, 58, 58, -34, -99, -47, 60, 78, -12, -114, -103, 36, 118, 59, -85, -115, -17, 116, 107, -29, -131, -72, 82, 149, 48, -98, -106, 17, 137, 97, -43, -115, -50, 86, 99, -2, -107, -94, 24, 100, 35, -78, -86, -12, 68, 43, -50, -80, -27, 47, 43, -44, -78, -5, 67, 52, -24, -84, -22, 74, 100, 2, -86, -56, 65, 117, 49, -89, -118, 0, 111, 93, -49, -127, -69, 69, 107, 4, -120, -119, 13, 112, 62, -58, -125, -34, 82, 87, -9, -94, -80, 27, 94, 36, -49, -66, 4, 60, 45, -32, -63, -6, 52, 45, -13, -53, -13, 41, 37, -21, -63, -36, 29, 57, 4, -78, -65, 45, 96, 37, -67, -92, -10, 83, 73, -41, -122, -63, 72, 119, 15, -101, -107, 5, 104, 81, -49, -109, -43, 77, 100, -1, -99, -91, 30, 104, 45, -56, -91, 0, 75, 67, -29, -80, -22, 40, 51, -13, -65, -30, 47, 44, -14, -62, -32, 42, 64, 5, -68, -56, 19, 81, 17, -75, -100, -7]
4671gR4j8j19p0P6J16M4j06j15J5J21Q2m2j31n7Q2J11J5r3r1K4J03N4m6j01j2
4697g1O0Q0j4r0l7K7Q0J1p1l3J9N8L0n3m8K4O0J9m7n6QO2N2n1p5j6O3P8kq9o5
4728h7M8J07L0p3j16mJ12Q2m9j05o5Q4J09K3r9r2K2J07O9o2j02l3R2Q1j6q9n4
4755h0M7P1J9o4n6K1O5M2n1o7RO5L1m8o5J3N6M9m0o5k7P1P8j6q8n3M6J07K7r5
4785Bj04K8J02O9o1j07m3J01R1lq5q1K9J12N1p2r5j4O9P7j7q3m2M2P6K1n3n7J6
4814c1O8K1m3m7pN4J3j9n3LM2M3k0p1JN0O0j3p6n1N1P0L1q7p6J0R8O2l6r6l3P8
4846dR6%p8q9J1R7N5n5j07k7P9R3rr2n5M1Q7L0n4o6oO3M5k8o4j4N1L0on6j6N5
4878GM0no9k4N1M4Ko3n0K8Q8J9o8r5K2J09O1m0j10m0P7J09j4q1r4L0J07M2n1r7
$$ y = [-7, 87, 69, -50, -120, -44, 72, 116, 10, -105, -90, 31, 113, 71, -60, -117, -35, 76, 91, -2, -93, -69, 34, 88, 42, -59, -71, -11, 69, 55, -35, -72, -45, 35, 46, -25, -58, -39, 19, 49, -4, -52, -28, 32, 51, 4, -52, -44, 18, 70, 19, -56, -72, -9, 69, 67, -22, -87, -39, 68, 98, 25, -91, -95, 17, 99, 50, -55, -120, -36, 73, 96, -3, -95, -73, 34, 103, 41, -61, -94, -2, 79, 63, -26, -80, -33, 38, 57, -7, -63, -42, 23, 65, 14, -53, -44, 21, 52, 4, -61, -48, 8, 57, 17, -48, -75, -4, 74, 58, -30, -83, -37, 70, 97, 2, -102, -74, 28, 97, 36, -71, -114, -13, 78, 75, -10, -91, -62, 50, 101, 29, -66, -80, -11, 66, 49, -34, -76, -34, 42, 63, 10, -47, -31, 37, 58, 15, -32, -39, 15, 28, 9, -44, -41, 1, 44, 24, -47, -46, 4, 64, 51, -25, -76, -25, 45, 76, -11, -87, -77, 21, 83, 47, -49, -82, -4, 92, 92, 14, -75, -64, 33, 88, 33, -74, -101, -22, 71, 62, -30, -85, -44, 43, 73, 19, -47, -53, 10, 55, 27, -37, -51, 0, 30, 24, -32, -48, 7, 47, 42, -27, -51, 0, 44, 46, -17, -67, -39, 49, 68, 0, -95, -73, 36, 97, 57, -53, -93, -16, 93, 79, -2, -96, -66, 41, 83, 32, -65]
4908f5k4P7J02k4q0m8N2N8L0o7o9J0N1L6k5n5mL9M4j3m6rM0L1j4n7j1M9L9po6
4939b6l0L9O2L2o7p4K9P0N6l7j02l9Q3P3Kq2q6L3R1N8n5r6k1P4Q8j1r2p0M3Q9
4969C4M0p0o3qP1N9k6o8j9N4N7j8m5l5L0N3j2n1l0L7N2jo0m2K8P1J9n1o6kQ5O5
5001H8n9r4l3Q0Q7mr7p0M9J08M6o5r9j2R1P5j5r5p2O4Q7K4p6p0J4P5L9k6o9k2
5031e1M4M7j2n1k8K8N8j4m6j7K5M4Nm5l0J7O8J2m4o2QP0M9n3p6j2P1P2j8p7n6
5062g4L2P6N5o4r8JO7R4k0j01n6N4P9L4n9q4qQ5N4k4q0l0L8O2Nl9n4K5N3J2l1
5093Dm5J6N3Ml8m6K6N9J9m2n8KP0N2m8p7l1O5Q5j0q1o0L5R4L1o2r5pQ7P7k4r7
5125d2n7N5R8K4p6o4lP3O8m3p6k5N8O3oo2m5M5M5lk8l9J2N7Lm0k7J2N2Pk4n1%
$$ y = [-65, -89, -12, 90, 66, -14, -62, -10, 48, 78, 11, -58, -48, 3, 39, 14, -41, -45, -6, 38, 25, -21, -30, 10, 41, 27, -30, -41, 8, 47, 40, -26, -56, -17, 45, 77, 10, -64, -35, 35, 91, 54, -48, -87, -4, 69, 71, -11, -97, -64, 27, 85, 30, -66, -87, -13, 75, 64, -28, -98, -55, 34, 74, 4, -59, -67, 4, 63, 37, -31, -50, 4, 61, 43, -2, -37, -7, 46, 34, -17, -47, -10, 42, 41, -19, -61, -33, 38, 57, 6, -60, -62, 23, 88, 29, -65, -98, -18, 69, 65, -32, -102, -53, 55, 101, 36, -63, -75, 16, 91, 76, -19, -91, -27, 60, 84, 8, -62, -48, 27, 66, 40, -29, -51, -7, 40, 28, -23, -51, -23, 35, 21, -25, -42, -17, 27, 32, -13, -43, -26, 42, 54, 10, -52, -44, 26, 75, 22, -54, -66, 5, 77, 59, -18, -74, -42, 34, 89, 25, -73, -72, -5, 89, 69, -32, -88, -34, 45, 79, 20, -64, -72, 13, 67, 43, -37, -67, -29, 33, 38, -1, -55, -30, 23, 35, 4, -41, -25, 28, 32, -6, -52, -26, 33, 52, 10, -48, -46, 24, 76, 28, -49, -80, -15, 70, 60, -21, -81, -46, 48, 79, 17, -78, -85, 2, 79, 55, -42, -99, -44, 54, 78, 2, -62, -65, 8, 76, 33, -43, -68, -10, 53, 47, -15, -60, -15, 30, 27, -1, -40, -28, 29, 32, -8, -35, -23, 29, 36, 12, -39, -39]
5158c9N8L5l5o2k1M8P0mp4m5L1Q1L2o6p2j2P8O3j6q7m7N1P6L1p0p3jP7P4l3p0
5189b2m9N0P0Oo7l6ON3L2l7n0LN3L0k7n5J0L7L7k8o6QM9L3k1o0j5L9P0no7m5K3
5222d1Q2K8m7q5j7R3P1l2q7n4O3Q3K1o8q0K1Q2M3l1q7l1O4O5k1n7k9J3N8J3k2
5252A1o2K4M0K2j9m5jL9J0k1k8j0N0L1k6n2JL8M6Jn3l5K4O8Rn6o9J0O5M7k3p0
5284c4k8M1P5Lo1n9J4O2M8k7q1l4O0N5J8o4n5L7N8K0k0n8LM8J8j6m6nK0K9ql5
5316b2l0M7L8kn1j6L3M6no1l7K9N9J6m1p0K2N7M6k3p2l5O1O6J5p5o3QQ4M2n1o9
5348e4j3N1O8j0o7l4L8O4%l2n7J2M0L4l5l4JK1L5j3k5nK6K7k1m1nK6M5j3n1k6
5380d8K4N0%l6n5K0P2K8l7o7j3N6M9Oo8m4J1P2L9n0m3j6N7N6k3n3m0K6N8J4l8
$$ y = [-39, 19, 54, 19, -43, -64, -16, 54, 50, -24, -69, -38, 43, 75, 9, -63, -75, 3, 66, 50, -37, -84, -33, 43, 74, 4, -69, -70, 7, 81, 48, -22, -71, -21, 49, 55, -12, -48, -42, 11, 43, 6, -44, -41, 12, 42, 15, -40, -30, 7, 44, 16, -50, -42, 7, 40, 19, -41, -56, -17, 53, 48, -19, -64, -41, 41, 69, 22, -63, -80, 13, 84, 52, -35, -89, -26, 57, 78, 10, -70, -49, 33, 76, 45, -42, -73, -9, 56, 35, -22, -51, -38, 20, 33, 11, -51, -27, 13, 35, 16, -29, -30, 9, 19, -2, -30, -40, 10, 41, 15, -37, -36, 2, 48, 49, -4, -39, -15, 53, 62, 6, -63, -53, 12, 59, 36, -34, -62, -21, 54, 57, -4, -63, -49, 13, 61, 34, -47, -81, -21, 34, 52, -12, -67, -30, 28, 48, 28, -30, -27, 21, 39, 23, -23, -28, -8, 21, 13, -22, -52, -5, 33, 31, -20, -36, -3, 43, 38, -23, -60, -31, 28, 44, 3, -67, -45, 12, 58, 35, -37, -72, -11, 55, 70, -5, -68, -60, 24, 66, 15, -54, -67, -16, 52, 42, -25, -59, -21, 43, 43, 11, -46, -34, 6, 40, 5, -29, -28, -7, 28, 15, -10, -15, 11, 38, 17, -24, -29, -3, 42, 29, -22, -48, -24, 26, 26, -10, -65, -45, 27, 55, 18, -49, -62, -6, 43, 49, -19, -63, -52, 20, 59, 9, -34, -50, 7, 63, 40, -13, -53, -27, 31, 45, 7]
5411Gm0jL5K7j0m2j0K8K3Ql8k2K4J6Pl5j4K4J9Pk8k7K2L3L0l5m0LN1K9l0m5k7
5444e1L9O3j2n2m2K1O7L0n3o1lN8N8l5m7l6L4M9Kl7l2JN3J9k2l4j2L2K9j1k1j8
5476b4J8J6Ql9lK3K0rk0j4J4L5J2l6l7K4L7J8l6l9j2M4L1ql5m5K8O2J2l3n7%M0
5509eN4j9m5l3K1L9L3m5l1jM0L4k2l4pK3K3j1k0j2NL0Lk3k4K2J7Nk6j1%L2J9k6
5543Em4RL5K4j9m6jL2L5j1l9k3J7L8L2l1n0PM0K6ln5k1K7N1J2m0m5kM4K7j4m5
5576b8j8M3J5Rl7j4J1K9Rk1j9RK6ook7J5J8Lj5j9%L7Qj8k7kK8L4j2m1j7K0L4K4
5611D5l7n3K3L0K3k4m0nL7K4Lk9l4J1L0K2j4k9j3K2K2Jk1k4J4K4J1j5k0PMJ3j2
5644dj3J2J9lj0j2JJ9Qj4j1j8L5J4Lm1j9J9K4K3l1k9JK9J9qm0j5K0M4kk6k6J0
$$ y = [7, -33, -34, 1, 28, 18, -24, -34, -6, 17, 25, -13, -35, -11, 5, 12, -23, -37, -13, 6, 13, -15, -42, -20, 13, 43, 8, -32, -29, 22, 51, 21, -24, -51, -12, 51, 39, -13, -55, -34, 33, 63, 10, -51, -54, 4, 62, 27, -20, -56, -22, 27, 29, -8, -40, -39, 14, 33, 11, -23, -35, -3, 26, 15, -6, -24, -6, 10, 18, -21, -24, -1, 19, 10, -10, -24, -10, 25, 37, 1, -36, -12, 25, 43, 7, -32, -44, 0, 31, 23, -12, -57, -29, 33, 45, 12, -45, -45, -5, 49, 30, -15, -48, -27, 12, 45, 0, -31, -32, 8, 42, 20, -14, -21, 2, 25, 14, -6, -18, -13, 17, 20, -3, -27, -5, 12, 17, -9, -20, -20, 12, 31, 5, -39, -30, 5, 29, 10, -36, -37, -5, 30, 19, -20, -43, -26, 12, 44, 13, -37, -30, 10, 36, 33, -22, -43, -16, 35, 47, 7, -38, -40, 4, 31, 17, -28, -46, -3, 12, 21, -16, -30, -19, 10, 19, -2, -21, -12, 14, 8, 2, -25, -10, 8, 11, -4, -23, -23, 14, 22, 4, -23, -25, 3, 37, 25, -16, -33, -13, 21, 45, 8, -45, -22, 8, 31, 7, -33, -38, -1, 23, 26, -3, -37, -26, 4, 26, 12, -17, -30, -8, 14, 15, -6, -30, -16, 8, 19, 4, -16, -9, -5, 8, -4, -17, -5, 14, 11, 1, -11, -10, 9, 17, 3, -8, -26, 9, 23, 26, -15, -34, -15, 9, 32, 1, -28, -27, 2, 21, 13, -27, -42, -22, 22, 20, -6, -32, -22]
5678b2K7J7j1k5pJ3J9Ol4jMJ9J6j3j8PJ4Oj9jkJ2Qj4j3NJ5Mj8lj3K6MLk8nJ5K2
5716A5jk7rkK2J6kk6rK4J5j1ll2K2J4K2j6k7KJ3J7Mk7j0%K5mj3OoMQJj7M%J2j1
5755gr%KP%%j0J6OOj9lKJ6KorqK4pJ0j0j9OJ9Oj2k1NK7j6J1j9oPJ4omj3MJ8Jj4
5798irLQOj6kOKJ3mrkJ3Ll%j0J2KMj0oKJ2oqqQPPklj6LK6mj1j1lJ0MJ5j4k4NK0
5844ANj1j2JLK3rmmJJ0%lj2NJ0Pk0NJRlmnRj%nj4LPJ1Lj2j1J3QoKll0L0QrllL
5891fLO%j0NJ1J0jl2LJ0Pm%j5J5J4p%j5oJ2LkjnpK0nok3J4J4j0kj3K3%Qok1QK
5934iJ8pj2lJ4OLj9Kj6K0PnpnJ2RMj0rj2J8Qolj6J1J2kprLJ1Rj2j3J4J4rPj6J1
5976Fj0Rkj2MPJ6j0pplK6qqj0KJ5Rj6j8lJ8K0nk3kmJ8J5j6j1nJ3J1qj5LJK3Jj3
$$ y = [-22, 5, 22, 11, -14, -21, -8, 11, 17, -17, -18, -14, 5, 21, 8, -10, -3, 11, 17, -2, -3, -5, 7, 15, 1, -12, -7, 8, 12, -6, -9, -22, 4, 8, 11, -17, -22, -7, 15, 14, -13, -22, -24, -2, 14, 12, -14, -23, 1, 16, 5, 2, -30, -8, 6, 28, 12, -15, -13, 0, 17, 21, -6, -16, -16, 9, 5, -8, -2, -8, -4, 4, 5, -12, -8, -8, 4, -7, -16, -16, -14, -7, -7, -7, -17, -1, 5, 11, -8, -11, -9, 7, 9, 3, -6, -14, 10, 3, 13, 3, -16, -10, 9, 15, 3, -18, -13, 14, -2, 9, -10, -16, -9, 5, -1, -5, -18, -14, 4, 5, -9, -18, -15, -7, -1, -17, -19, -13, -11, 2, -2, -11, -13, 0, 3, 0, 0, -10, 2, 4, 8, -2, -8, -6, 6, 0, -8, -16, -8, -1, 6, 4, 1, -15, -12, 14, 10, -1, -12, -15, -5, -1, 14, 0, -24, -19, 1, 6, -5, -17, -16, -13, 10, 1, -3, -7, -6, 4, 4, 1, -11, -6, 4, 11, -9, -4, -3, 6, 3, -1, -6, 3, 2, 2, -3, -17, -14, -7, 4, 7, -5, -16, -3, 5, -1, 1, -2, -32, -2, 6, -3, -6, -9, -6, -3, 3, 3, -7, -2, 9, 19, 18, -14, -11, -1, 6, 2, 2, -13, 2, 16, 9, 9, -6, -12, 0, 3, 1, 0, -5, -12, 8, 3, -3, -26, -12, 2, -8, -10, -23, 0, 0, 8, 2, -19, -11, -9, 9, 2, -10, -13, 1, 7, 10, -9, -7, -23, -3, 4, -1, -8, -13, -1, 8, 12, 2, -7, -19, -1, 7, 1, -2, -18, -7, 5, 3, -4, -13, -10, 1, 10, -2, -15, -1, 13, 4, 11, -5, 6, -4, 5, 3, -9, -5, 2, 18, 8, 1, -6, -9, 17, 9, 1, -9, -7, 8, 17, 1, -17, -20, -2, 18, 13, -10, -12, -16, 2, 17, 1, -10, -15, -2, 9, 1, -14, -11, -10, 13, 14, 1]
6017Ak2J4K5Lj3j9%J5J1oj5NJ0jKj1nMJ4%j8qRJ6Mk3j4J2K3Nj7k7J1J0K5%l0q
6055a8J6PRk1j7MJ4J6oj1j2J0J9Mj7JnJ6Qj1pj3J6J2jj9kKJ1Rj1j9QJ3KKk7J2
6093fORj2k0KK6MOk8pJ7K4kj9k9J4K4J8j4l4NJ5K6nk8j6J6RJ3ok4lJ1K4j6j6o
6130b2RK4Kl2lRJ8kok2J3K1Nj4k2J2K5Nj9j4pK6K0j2k7j5K6J5Pk6k2J1L2J2k1
6165Fk3j4L0K4qk5j5ML2J3k2l5J4J4K4j7k3JJ3K5j6j4j3J7J6Kj6jj4L9mj5j6J4
6199cJ3J3j6j3k3L2J5nk2k8K0L5Ol5q%L3jkk8j9K4L9j3k2k2J9K9Rl1j7LL5Qpk6
6235hj1K2J4Oj4l0J6J8Mj2j6QJ4Nj4k6J0J7K6k7j4j2L7J1j9k1k1L4K5Pl9j6ML1
6269IJ1j5k7oK1M5j3m0rJ5K5J6k2k4KK6J0rk3j8K6J2kj9j6QK9Kj8j7jK5J9k3j9
$$ y = [1, -21, -7, 18, 21, 8, -11, -11, 4, 15, 9, -6, -1, 9, 8, 10, -1, -6, -2, 12, 12, -6, -14, -5, 11, 15, -8, -22, -10, 13, 18, 1, -26, -15, -5, 20, 20, -10, -18, -2, 5, 14, -7, -24, -20, -6, 10, 4, -7, -19, -9, 10, 14, -3, -2, -7, 9, 17, 6, -1, -14, 2, 14, 13, -6, -8, -6, 5, 14, 3, -16, -8, 5, 7, 9, -18, -6, 0, 9, -3, -23, -21, 5, 9, 15, -13, -20, -3, 21, 19, 0, -29, -15, 9, 27, 13, -21, -16, -1, 25, 20, -8, -24, -8, 1, 14, 8, -16, -19, -8, 16, 0, -16, -22, -13, 11, 13, -19, -22, -13, 5, 3, -3, -25, -12, 9, 14, 0, -22, -10, 15, 20, 1, -13, -20, 6, 26, 14, -13, -28, -2, 13, 20, -6, -28, -17, 15, 27, 6, -17, -31, -1, 23, 15, -10, -25, -21, 11, 24, 2, -33, -19, -5, 19, 2, -21, -20, -7, 18, 2, -12, -25, -8, 8, 10, -6, -7, -21, 18, 14, -1, -17, -3, 10, 23, 7, -6, -29, 3, 18, 13, -9, -37, -17, 18, 24, -11, -19, -19, 14, 13, 11, -17, -36, -12, 27, 14, -8, -30, -11, 18, 27, -4, -21, -18, 17, 25, 18, -8, -19, 3, 17, 23, 9, -21, -5, 13, 17, 5, -11, -3, 11, 16, 2, -24, -14, 3, 29, 2, -12, -24, 13, 24, 5, -16, -37, -3, 22, 29, -10, -26, -22, 9, 20, 5, -22, -28, -7, 38, 25, -15, -24, -9, 16, 32, 10, -14, -12, 14, 24, 15, -8, -26, 0, 12, 10, -9, -25, -17, 12, 14, -4, -21, -22, 3, 22, -1, -20]
6304b0QJ3K0qj6k0K1J8Lk1k0J9L3pk9j6OL0J0j5k7%J6K5Jl4j1%M1Pk1l6%L5K6
6339C1rl5j2J6L2ok4l3J9K0Rj2j0nK1J7j5j2mJ7J2pk3jJ0J9Rk7j4OL3Nk3l3J1
6374a8K0L1j4m0oK3K7nl3k4J8M7Nl8k4LL0K0nl5k3L2L8lk1l4J8J4K6k1k1lK6K
6408A2jl1kK9Qjk8%OJ3kj5j3J8J8rj1j5KK9J2k6k3%K7K6qj2l7K4K8%j7k6j1M0
6444DK4rl1kJ3K4Kk1l4RM3j1kk8%J2K4j0j7j0K6J4mj8j1LRKj6qJ2J6J6l3kjK6
6481A1J7j9k7j5K7L4qk5k4J0K5J5j1l7%K4L5k1j8j8J6L0Pk6k7J1K1J1j0l0kK4
6513@K3nl3NOJ7Jk6OJ4QoqrKL2kj8k6NK9J6j5m0jJ7K0mj9j0J5K2J4k6l5OK4K7
6551B6j4k9j7K3K5mqj8mJ9J5%j9qJ2J6jj2j3NROnj9NK2oj0nnJ5J3j7mlJ0J1j2
$$ y = [-20, -12, 1, 21, 13, -3, -23, -2, 16, 19, -2, -22, -3, 30, 23, -6, -22, -16, 14, 24, 9, -18, -18, -2, 23, 24, -10, -21, -21, 20, 27, 6, -30, -30, 5, 31, 22, -13, -25, -9, 23, 17, -7, -40, -21, -1, 8, -4, -14, -19, 2, 19, 4, -8, -12, 5, 17, 10, -13, -14, -4, 15, 24, -3, -17, -11, 22, 27, 4, -29, -18, 2, 33, 19, -21, -27, -4, 23, 18, -15, -39, -21, 26, 31, -7, -31, -28, 2, 22, 17, -18, -41, -9, 29, 26, 5, -29, -11, 3, 29, 8, -13, -16, 10, 12, 11, -20, -22, 7, 15, 14, -14, -14, -8, 5, 3, -12, -25, -7, 11, 2, -9, -24, -22, 7, 19, -7, -30, -30, -3, 23, 15, 3, -34, -10, 18, 18, 1, -25, -36, 4, 28, 19, -12, -14, -1, 23, 25, 4, -30, -21, 22, 11, 9, -19, -19, -7, 17, 7, -10, -20, 6, 20, 16, -2, -13, -10, -1, 1, -15, -23, -11, 5, 21, -12, -14, -15, 11, 28, 9, -18, -33, -6, 28, 20, -5, -29, -19, 6, 21, 10, -27, -27, -3, 32, 11, -7, -25, -9, 21, 28, 2, -25, -14, 7, 18, 8, -22, -24, 0, 23, 18, -15, -10, -4, 13, 14, -12, -6, 8, 16, 10, 2, -7, -5, 27, 25, 7, -19, -14, 15, 31, 16, -24, -25, -8, 12, 8, -11, -21, -6, 16, 30, 4, -31, -25, -1, 26, 12, -17, -34, -11, 14, 10, 2, -16, -20, -1, 14, 14, -5, -13, -1, 15, 14, 2, -11, -6, 3, 9, 4, -15, -10, 12, 6, -4, -9, -14, 1, 14, -3, -7, -10, 0, 11, -1]
6589aj9%J7K7rj5l3QL3Qj4j5j0QL7mk6k4K5J9Qj1l7J0K2J2j6j4mJ8ONj2j5J7K
6625COj0j2RJ5Mj7k4PK5kpqlJ8J7k6jj2LK0Njk9J3J9J1k1k0qK0K1Mk5j9J5K4k
6663A2pj4lJ5J5j0j7qJ5J5j2rqNJ4J2j4j4J2N%qjLoJ1Kj8jJ0LQqj7MK9jj8rnK4
6704FJ4j4j6lPJ8Ok5rLK4Mpl2oJ2K9j5pj4OK4Oj9okK0Qrj2jRRQj7j%K1j0mj9J6
6746BJ5j0pj8J7Qmqj5%K9%Kl6PJ0K9j4j5j4QJ9Qj5j1JRL1j6k2KMK2kj1j0lJ9Q
6785A9j8oLJ1MoJj8QJ2Kj5j0RJ5Jj6j2P%J1lj7JJ2Opj4KQK0rkk0J0L0Jj3l1J1
6825a3J6K6j4j9j4J1J9lj0k2J9JJ8Jk1n%J8kk0MMK1j7j3LJ4nNonkL1npj7kJ6Q
6864A3nj4lJ8MOj9l0K2K2J5k8j2j3K2K2ok6j4J2K1Orl0J6K3j0Pk6KJ6MKk6mJ7
$$ y = [-1, -20, -20, -3, 24, 15, 0, -33, -25, 8, 16, 2, -13, -23, -15, 22, 18, -8, -32, -7, 12, 20, 9, -28, -18, 4, 16, 0, -14, -18, 0, 6, 11, -1, -16, 1, 3, 9, -1, -13, -4, 11, 15, -2, -26, -19, 6, 4, -3, -11, -14, 4, 21, -5, -6, -18, -15, 5, 10, 9, -20, -7, 12, 23, 2, -18, -26, -6, 15, 19, -6, -25, -10, 14, 12, 5, -9, -12, 3, 18, 8, -9, -17, -2, 13, 1, -8, -16, -11, 3, 15, 1, -13, -1, 4, 4, -4, -5, -2, -8, 3, 5, -13, -14, -4, -1, 7, -1, -18, -14, 15, 14, -4, -13, -18, 6, 20, 6, -10, -13, -6, 12, 18, -7, -16, -13, 11, 15, 8, -24, -30, -18, 11, -4, -11, -25, -19, 5, 11, -8, -14, -16, 4, 12, 3, -9, -10, -1, 8, 16, -1, -2, -2, 19, 9, 5, -14, 2, 17, 7, 0, -18, -1, 7, 3, -5, -20, -20, 9, 9, 11, -25, -18, -8, 21, 7, -8, -22, -14, 5, 13, -2, -13, -12, -3, 28, 12, -10, -8, -4, 18, 16, 5, -5, -8, 11, 19, 1, -5, -2, 9, 13, 7, 8, -10, -2, 10, 12, -3, -13, -4, 11, 12, -4, -16, -9, -9, 2, -1, -18, -17, -5, 1, -6, -20, -18, -10, 10, 1, -1, -21, -11, 19, 20, 7, -24, -13, 3, 29, 15, -4, -18, -7, 12, 9, -1, -23, -4, -3, 15, 16, -5, -10, -10, 8, 6, -14, -10, -6, 15, -2, -15, -12, 2, -3, 2, -4, -9, -11, 20, 15, 8, -9, -11, 5, 13, 8, -6, -9, 9, 13, 19, 0, -30, -8, 14, 29, 1, -11, -24, -2, 20, 14, -12, -26, -14, 7, 13, 4, -26, -10, 13, 3, 10, -16, -14, 2, 6, 8, -18, -22, -5]
6900eNQqpOJ3kpKqJ9j0kj0LQPprj5K1J3Knk3%K1Oj3j2j5K1J4%k1lMJ1J5j0j6p
6942a6J5K3pj3k1K1OJ3k2j3J5MJqjlJ4mJj6N%JMk0%K3MpprQJ6mj0qMJ6Mlk4nK8
6985ENLk0j0NJ7J4j5j3j0K0J1j2oj6RJ9Pk5rKK2J2k2j5J5ORmj9j0NK4mqnRJ2q
7024@qlKK2nj3nMQJ7j4j8LPK1%k2k2J2K1J2k3j8JK1J8ok5j2NK9Qj8l1J3J6Rqj6
7063a8LNJ7j1j0MQOlj2jRJ7j2olRJRj7rkK0J4j2k2j4L6OJk7qJ1K5%j2k2N%K9j2
7104Bj6rJ3K5Ok0qnJ3K2j9k4J3J3Nkj1j1J7OLj6qpJ5Qj2j1J2Rklj0JML%k3QRK1
7145A1%k7j3J6K4Qj8l1%K9K7j2l1oJ5L6j3j3j5KJ0J0jk2j0K6Rmj2rOJ0npkmJ4
7182bJ0k3kLK5j8Oj4QQJ0j3k1LJ5J6Jk7rJ4K8Ok6j7MK6K3l1k8NJ3K4j1j9j0MK5
$$ y = [-5, 0, 8, 0, -7, -1, 12, 10, 3, 5, -3, 16, 6, 4, -6, -3, 5, 12, 5, -4, -19, 2, 15, 17, 12, -11, -11, 10, 16, 3, -9, -24, -3, 11, 11, -10, -13, -9, 2, 17, 7, -9, -16, -1, 22, 15, 2, -19, 2, 8, 21, -1, -14, 1, 5, 6, -2, -3, -6, 8, 4, 5, -11, -6, -6, -5, -1, -21, -21, 2, 6, -1, -8, -17, -9, 7, 3, -7, -15, -11, 5, 9, 6, -18, -23, 5, 10, 13, -7, -17, -12, 5, 19, 4, -9, -19, 1, 12, 0, -6, -22, -13, 6, 13, -12, -21, -19, 3, 15, -7, -22, -7, -1, 8, 4, -15, -25, -20, 4, 0, -8, -13, -4, 8, 0, -8, -11, -9, 13, 8, -5, -10, -6, 2, 19, 5, -13, -10, -3, 18, 18, -4, -26, -14, 7, 19, -4, -22, -21, 0, 18, 12, -13, -25, -20, 9, 17, -1, -32, -19, -3, 6, -2, -18, -15, -10, 7, -4, -14, -10, -2, 4, 1, -11, -12, -3, 14, 2, -4, -7, 2, 3, 12, -5, -14, -16, 4, 18, 6, -16, -30, 6, 12, 13, -14, -22, -11, 14, 14, 2, -20, -15, -15, 14, 2, -14, -23, -10, 15, 21, 1, -7, -12, 1, 23, 4, -20, -7, 6, 11, 9, -2, -13, 4, 10, 13, -3, -11, -18, -3, 5, -7, -18, -6, 3, 1, -2, -12, -11, -7, -4, -4, -27, -19, -10, 11, 11, -16, -29, -13, 11, 19, 1, -30, -30, -1, 26, 14, -17, -23, -8, 28, 15, 2, -13, -11, -1, 9, 8, -14, -24, 2, 11, 7, -5, -14, -8, 2, -3, -10, -12, -16, -2, 8, -15, -17, -14, 11, -7, -1, -15, -7, 1, 11, -2, -23, -20, -5, 11, 12, -15, -24, -10, 18, 24, -2, -19, -15, 11, 34, 3, -25, -20, -7, 17, 6, -13, -23, -19, 6]
7219FPrk8J5jJ2J1k6%LK2j1mj0JJ6Kj1LkJ7pJj7OOQrj4kK1Rrj8j9K6J9%j5k1%
7260b2K6K0k6k7KJ0K0J4k2j8NK3Opk2oK6J4mj6j5RL1rmj8J0NJ1j0j3JJ7Nj4k3
7296b1OK5Kj0k6MK0J0jk6nPK6Rm0%PK5J1j9j9j3K7J9j2j8j9K2OK2k2rrK5Rlj9
7333ik0J7K1J6l2nj1J1J9pj9QKJ4oj2lJ6Nnj5nK1J7j8k1OK3KPj6k7J2K2J8k0j4
7370hj6K1K2Mk9l2K6K5J2j1l3mK8K0j5j7j9RK1kj1j5PJ7J4k1pkQJ7j4j5NPK3m
7406A1j8j8L0Rpj2oJK9oj1k8J3K0K0j9k9nJ9K4rl4nJ9J9K5k9l4LL0J5jk9j7K2
7441hRPj8nQJ3Rj1j7jK2%moj2K3MKk4KJ8LMk5NrK4Kk4j3jJ4K1j5k3KJ4J8Kk7j0
7482b7J5K0Oj2k0j4K9K6j6j6k7K6K3Oj3k8J2J7Rj0j4pJ0K1j2j5lJ2J5j8jj1MJ9
$$ y = [6, 13, 4, -24, -9, -10, 2, 13, -13, -13, -10, 12, 1, -3, -13, -12, 4, 6, -5, -2, -4, 13, 6, 7, -10, -4, 2, 10, 1, -13, -15, 6, 15, 6, -12, -31, -5, 14, 14, -1, -22, -22, 4, 24, -2, -29, -27, -17, 3, 17, -5, -23, -18, 5, 11, 4, -18, -24, 2, 16, 12, -4, -19, -10, 21, 12, 8, -10, 0, 5, 16, 6, -7, -6, 11, 16, 2, -21, -15, 10, 12, 2, -24, -20, 0, 10, 9, -17, -22, -15, 11, 20, -20, -20, -13, 12, 23, 4, -15, -28, -1, 18, 6, -12, -31, -9, -3, 19, -3, -12, -21, 4, 13, 10, -9, -29, -12, 9, 25, -7, -12, -23, -12, 7, 0, -19, -11, -9, 5, -1, -13, -16, 0, 5, 0, -15, -20, 1, 18, 0, -21, -15, 8, 10, 17, 1, -26, -14, 8, 26, 6, -8, -24, -3, 19, 23, -6, -38, -12, 13, 25, 14, -19, -23, 5, 25, 10, -7, -26, -17, 4, 2, -9, -24, -17, 0, 14, -7, -14, -16, -8, 9, -5, -20, -15, -8, 15, 11, -7, -25, 5, 14, 7, -5, -11, -10, 19, 13, 2, -26, -13, 7, 27, 8, -21, -26, -7, 17, 8, -26, -31, -12, 7, 32, 3, -31, -28, 2, 17, 16, -13, -30, -8, 1, 8, -10, -15, -7, 6, 15, 4, -13, -14, 8, 8, 4, -2, -14, 9, 13, 15, -9, -7, 11, 14, 18, -7, -2, -11, 13, 15, -9, -22, -23, -9, 12, -3, -26, -24, -10, 8, 10, -17, -27, -12, 8, 14, 2, -18, -32, -3, 23, 7, -9, -36, -10, 13, 19, 6, -22, -10, 7, 16, 6, -8, -15, -5, 16, 4, -11, -14, -2, 13, -5, -6, -17, -13, 6]
7516FJj6j1J0PRj4j6PK6Rok3j9K7K7ok6k5K5K6J0l1j7j0K2K7j6j5j1J1K8Ml0m
7551a4pJ6J6j3k0JRJ5jj3jNKOrj1J3J2nj3jRJ3J0k6lLJ6J5k1k4KQL0Jl1ojK7J4
7591B3k4j4j8L2K3kk1k4J5J1J2k4k2J3K0J1nj9%KK4kk0JoK4krj3MJ5Qk1jJJ2J7
7628B1rk6nK7J0lk7j4K0J4J3l5j3J1K5Nj3k0jK1J9j5k5oJ7J1K3l1j7LL3K1l2l
7662ak0K2Q%j1j0NK4oj1oJJ2Kmj7J2KKj4rQJ2Ljj7pJ0L3j7ok5K1J7Kj1j7oK2J6
7702A8rj3k0K3RJ7k3k1J3J4Pqj5j4J9J9lj8j0LJ9onjmJJ1jj0jNJ7rj8%J5Ooqj1
7742a8K4K0k1j2nNK5Prl0NJ8Rrj7oML0J1k4k4J0RJ2j0j8j3J3K1Nj0j1KJ1L%k5
7779a8QJ1NJj0KjJ1ppmJ6Omk1lJ3J2Mk0oJ3J2Rk3j8ORK0lk6j3J1K6Nj7j8%J4J3
$$ y = [6, 7, -9, -20, -10, -3, 6, -8, -24, -17, 9, 18, 12, -11, -30, -3, 24, 18, -8, -33, -8, 18, 28, -3, -20, -30, -8, 19, 3, -12, -23, -12, 16, 20, -10, -14, -21, -5, 11, -2, -22, -21, -12, 3, 2, -11, -12, -7, -5, 1, -8, -19, -6, 6, 1, -12, -13, -4, 9, 19, -7, -10, -7, 9, 24, 3, -21, -19, -11, 19, 20, -11, -17, -18, 9, 23, -1, -15, -33, -1, 22, 20, -1, -25, -10, 1, 13, -11, -33, -20, 0, 11, 6, -13, -13, -11, 13, 11, -9, -8, -14, 10, 8, -1, -14, -10, 5, 13, -8, -9, -8, 4, 21, 12, -14, -19, 8, 18, 15, -12, -26, -6, 8, 21, -14, -27, -16, 9, 14, 1, -19, -20, 1, 20, 5, -20, -26, -9, 2, 25, -6, -23, -20, 13, 34, 2, -1, -21, 1, 9, 9, -2, -12, -7, 17, 11, 0, -6, -5, 7, 9, 5, -12, 0, 2, 4, -10, -19, -11, 1, 4, 3, -14, -21, -11, 22, 5, -1, -26, -5, 12, 14, 3, -14, -20, 2, 18, 9, -4, -24, -1, 8, 25, 2, -19, -6, 8, 15, 7, -8, -22, -3, 16, 13, -5, -15, -12, 7, 1, -4, -5, -9, -8, 3, 2, -8, -9, -4, 13, 4, -14, -14, 1, 7, 1, -7, -18, 6, 26, 5, -7, -12, -7, 18, 25, 16, -14, -9, 9, 18, 9, -8, -14, -10, 20, 31, 7, -17, -7, 2, 14, 4, -14, -27, -14, 7, 12, 2, -9, -7, 4, 7, 7, -18, -10, 1, 6, 7, -3, -1, -2, 9, 2, -5, -9, 7, 13, 9, -12, -15, -2, 10, 14, -6, -12, 1, 13, 22, -1, -19, -13, -4, 16, 13, -13, -26, -15, 11, 16, -1, -19, -19, -5, 8]
7819Hjk5JJ6J3Ok0rOJ0R%k4LJ4Mlnj1RROk0NK%Mmj6J1J6rpj2OLJ7j4qjK2KLj8
7863bj4RK7Lrl6LL1Nqj4oJ6K4Ml0j3MQJ8j6qj0K3Kj1r%LRQk4MNJQk0KJ1PJj0q
7906a2J3NRj1j0pK4J0j4j3pRK3%j5j7J5J0K0j1k3k9J0L7jk1j3PJ4Oj1j3LK2LL
7942A5k3KQNPj3nPoJ2opKJ3J4j8j3lK1kj4%j2K7Qj4nk2PK5J1k0k0pK7J4j1j2j9
7981b7PJ9J9k8knK1K0j4rj0J3JPnk0J3J5pj2pJ8Nmj0nJ1J0mnj9MJ5%%k0JLK1q
8021Bj1j0RK1Oj5j1oK2J3rk8qK1K7lj4j4qK0K1j6kk8J7J6kj1mlJ4J8j8j8J0Np
8058dKj7NJ3%Kj2KOMjj7kJ3J9ok2RQRQj8j8MJ9K1j3k1j9K1J9Jj9j8J1J9%nk4O
8098a5J2J4Lk9JPK5qj3Lj2QPkj2lRJ8romMJ7Kl0QJ3JJ1k2pQJ8jk1lNjK7j3k7Q
$$ y = [8, 7, -18, -17, -1, 12, 18, -2, -11, -5, 5, 14, 14, -10, -7, 7, 11, 8, 3, -8, 1, 10, 16, -4, 1, 3, 3, 7, 3, -13, -2, 14, 5, -2, -14, -8, -5, 12, -2, -10, -11, 11, 13, 16, -2, -16, -7, 20, 23, 14, -22, -19, 12, 17, 9, -5, -11, 5, 29, 33, 3, -10, -6, 2, 20, 4, -4, -14, 9, 11, 0, -9, -9, -6, 3, 11, -13, -9, -4, -3, 5, -15, -13, -2, 5, 6, -4, -12, 1, 6, 15, 4, -6, -13, 11, 21, 7, -6, -13, -4, 19, 19, 4, -13, 2, 12, 32, 21, -2, -31, -21, 16, 15, -6, -19, -12, 2, 8, -3, -16, -13, 9, 12, 15, -8, -6, 2, 7, 14, 1, -4, 3, -3, 9, 3, -4, -2, 11, 25, 7, -6, -9, 12, 10, -4, -4, -16, 11, 19, 5, 0, -22, -15, 10, 21, 1, -19, -26, 1, 15, 4, -8, -27, -20, -1, 18, -10, -12, -17, 4, 24, 10, 1, -9, 4, 5, 12, 7, -13, 0, 15, 8, -4, -11, 7, 12, 8, -2, -7, 4, 14, 10, 5, -14, -10, 5, 5, 5, -15, -14, -11, 10, 2, -9, -19, -10, 11, 17, 2, -9, -15, 7, 20, 11, -17, -25, -4, 23, 20, 6, -8, -16, 4, 25, 9, 7, -21, -4, 12, 10, -1, -5, -8, 6, 24, 6, -12, -2, 3, -4, -2, -19, -14, -1, -1, 1, -11, -9, -3, 1, 0, -17, -19, -6, 13, 7, -15, -6, 2, 11, 19, 1, -17, -13, 6, 27, 14, -7, -26, -5, 14, 15, -4, -22, -11, 8, 8, 3, -21, -15, -3, 11, 14, -15, -14, -7, 18, 10, -3, 0, -12, -4, 3, 1, -11, -14, -5, 13, 4, -2, -6, -2, 15, 17, -13, -5, 8, 9, 20, -2, -9, -1, 17, 16, -5, -8, -3, -4, 23, 10, -17, -9]
8140iJK0Kj9j7PJ7J4j4j9mK3Olj1rRQJJk0J5ORpj4mJ8N%j6NQJ1j6j0JLJ9j3j1
8181gj1%J6J5k2j8nL0J3j4
$$ y = [-9, -8, 12, 14, -5, -22, -15, 2, 16, 2, -17, -21, 2, 8, 5, -6, -15, -6, 2, 3, 4, -16, -1, 5, 14, 7, -7, -11, 7, 12, 12, -4, 1, 9, 20, 4, -6, -5, -2, 17, 4, -7, -18, -18, -2, 13, -9, -27, -32, -2, 11, -3]
8191c
$$ Imaginary data points
##PAGE= N=2
##DATA TABLE= (X++(I..I)), XYDATA
0@%%%%%%%%%%%%%%%%%%%%%%%%%%%%%lPqQj2J6j6J6j9K3k4K4l0L8m0M2m7N4o0O4
49C3p2Q1q7R6j06J17j28J38j49J62j75J87j98K03j98J74j06p1N70k348J7777J09377
71A25277p4854j27769l6055K8572J13220M2859q8247p1285J0986Q1610P3272m2869
83C4717o7332k3643P289R2635M5784j20840o1005P5224N4586J7940l3336o9615
95d7596K8716Q0617J1089m1827n2302M594N6353K314k5691k6342n3247K8285Q7144
108E2107k1161o9665j9945J6594P2620M3295p4312p0270K2313O9868M3120n0147
120A4417p2962J343L5833M9365K6558o6729n5988M1970N5269L2209j4133p8181
132c1029k2669P0509M7973k1757o2926l5105M1734M5425l447k6807l8197L579
$$ y = [0, 0, 0, 0, 0, 0, 0, 0, 0, 0, 0, 0, 0, 0, 0, 0, 0, 0, 0, 0, 0, 0, 0, 0, 0, 0, 0, 0, 0, 0, -3, 4, -4, 4, -8, 8, -8, 8, -11, 12, -12, 12, -18, 20, -20, 22, -25, 29, -31, 33, -39, 42, -45, 51, -55, 62, -66, 72, -77, 85, -90, 97, -101, 102, -96, 78, -28, -99, 471, -1877, 15900, 125277, 50423, -77346, -113401, -84829, 28391, 71250, -16997, -88282, -77296, 4314, 77586, 34717, -32615, -56258, -48969, 43666, 89450, -31390, -92395, -17171, 37415, 55355, 22019, -47596, -18880, 61737, 72826, 30999, -21303, -16709, 39644, 41958, 16267, -10075, -63322, -35037, 52107, 30946, -38719, -58664, -42070, 30550, 73845, -467, -70737, -48424, 21444, 64564, 14417, -58545, -57202, -21369, 27996, 54554, -12175, -68163, -26193, 29076, 61285, 47152, -31029, -53698, 16811, 64784, 43027, -19899, -55004, -13270, 32155, 28708, 1901, -36296, -32717]
144c2717N5682J4734k7518j8735j5496J9607M2938j5362m8562j1917K6304L5364
156B4322p076m6321j2213L0670L4896Q172m1276l2390L1635L8670M297k1934m2525
169c1073r536M7550L5033j8900m8356k5619L8208N6027J621m5410m0036J4941
181b5550N9519K0394m1062m1104o106L1469L8117j0108m5414k1542J9838L9279
193A7730J4055l1413l1695Q116L4223K1400k0466l5121Q76K7120J4296j0741k4916
206a6536p622K2398J9313o525j9737r671J6450K5467J82k4737j9093J0506L0515
219B0910Q945k8592k9475M555L1628K0998j7689l5127p831K7652L0463p93l1530
232e886k4583J2123L3919J5749k1704l4335n540K9292K7710o751l1583j7257J7650
$$ y = [-32717, 22965, 37699, 10181, -8554, -24050, -4443, 38495, 23133, -25429, -37346, -11042, 24322, 17246, -29075, -41288, -10618, 24278, 32450, -8826, -41216, -9581, 29089, 33386, 11452, -31073, -40609, 6941, 41974, 23074, -25282, -50901, -12693, 43334, 44955, -455, -40491, -25550, 33969, 54363, 13301, -27803, -33909, -2440, 35677, 25569, -19845, -41387, -21549, 17730, 31785, 372, -31323, -23207, 11016, 32416, 11950, -23171, -22295, 4825, 19121, 8380, -16536, -24158, -1760, 17553, 11028, -8709, -18380, -1930, 23537, 23719, -1018, -20111, -9605, 20910, 29855, 1263, -28212, -23657, 7971, 28969, 11280, -23847, -31678, -4026, 26437, 25644, -5886, -30469, -18346, 15573, 31322, 9618, -24717, -30257, -965, 26745, 19994, -11589, -28846, -11196]
245a1196L0285O894k1985k2362L222K3173J4648j1586k2778o122J5550J6576l129
258A1190j9311r662J2877J6976n53j6379j0744J0605J8304Q00j7415j3833P413
271i732K1028O864j7446j9672J930K2828J7460j1625k6636p554K0425K5257l24
284B2803k7758k0384J1843K8169J1691j9562k8500j737K5607K0965o975k7120
296a0958j4539J6507K5230L823j9828k0060M402K2888J1234j2006j8714l635J6113
309D57J4513n983j5963n646J0460J3827j808j4897o571R397J2984L16j4505j0134
323a3553Q701J5576K809j4078j4997L976J8769R393j1388j9026l919J7641J7862
336A7766m073k0383j2593J0517K1961O403j6869j9421L51J9295J5370p345k0708
$$ y = [-11196, 19089, 25983, 3998, -18364, -15142, 8031, 22679, 11093, -11685, -17807, -2257, 14319, 11190, -8121, -17783, -4906, 12070, 11517, -4862, -15606, -5001, 13303, 14103, -3312, -17145, -9732, 11296, 18160, 714, -18958, -17028, 5800, 23260, 11635, -15001, -22555, -2130, 23127, 22803, -4955, -25339, -13496, 14673, 26364, 6802, -21698, -23435, 2172, 23137, 16162, -10958, -25497, -8990, 16240, 20063, 235, -19825, -15423, 7465, 18699, 6693, -12021, -15656, 457, 14970, 8987, -6976, -12622, -2162, 11665, 9857, -5040, -11611, -2214, 10770, 11086, -3419, -13553, -4852, 10724, 13533, -545, -15542, -11566, 7203, 16596, 5208, -13818, -17737, -96, 17766, 13693, -6690, -19283, -8766, 13195, 19598, 2729, -16692, -16341, 2954, 18324, 10979, -9729]
349i729r034J2559J9035L421j5650j4945L760J6824R432q443j5616m068J1354
362a100J1227k698j2189o698O687J1261J106r295o383M776J0310K431r428q111
376h104M080J0334L408r356j1697J946J3121P457o725j4044l929J3611J4188k475
390A1815j5476j1462P422J8716M996j4644j6505l76J7357J4121p467j7786o776
403a6065J1288J8062K586j5800j2480L687J4567R563r392j6396j716J1418J0346
416I668j973j3128n510R329R596J66q493p170N590Q945j156p179o588J335J0164
431C596K598r266o898K210J0341Q033p336j1801M11J0615J0323l300j5338n674
445a1486Q987J0587L208j0609j3466L683J4002P483l965j3445o544J1087J2543
$$ y = [-9729, -18763, -6204, 12831, 16252, 602, -14343, -10583, 6241, 15673, 7230, -8386, -12454, -1100, 10127, 7429, -4760, -11458, -4771, 6490, 7596, -1699, -8082, -3306, 7004, 9435, 7, -8104, -4024, 6310, 9718, 362, -11335, -9389, 3732, 11189, 4464, -9580, -13509, 102, 14290, 11815, -3661, -15123, -7701, 11015, 16011, 1367, -15138, -15514, 1843, 15964, 8497, -9289, -16065, -4777, 13285, 15871, 71, -12409, -8722, 5845, 15408, 6016, -10380, -12096, -678, 9668, 7695, -5433, -10943, -1614, 7982, 8148, -345, -7515, -1925, 7020, 5864, -1315, -7903, -6568, 3596, 6194, -3072, -9970, -7760, 2581, 10614, 3278, -8523, -8112, 2503, 12826, 9526, -5812, -11486, -2499, 8088, 11296, 687, -12779, -9096, 4906, 12389, 8424, -5021, -11565, -478, 12065]
458A2065l35j1828j1854L755J2857L007o703r642l886R969R324l625o454l369
472f719K412R193K545p324n084J395O431L340o664n067L258M733L645l040p839
487d785K760Q884J241l605o047l658O545O896l008r054p410M445J1794J464q585
502b123q508p21J2684J0392p880j1670j641O654J0592J594j1369q407L121J0482
516C200P181o285j0361n22P501R340N07j1677n314P510N971m23n586o799J854
531c903O546N54m184m342O10N994J939l497l316j166N135N888n026p856N64N665
547c95N389j493q987l161P196P812Q46p292o268L639P862M063l340r852l802Q030
563B47P396j366p805p290L200J0294L117o185p041k09P073N037k510n668l751
$$ y = [12065, 11730, -98, -11952, -8197, 4660, 7667, 964, -8678, -12564, -2595, 6729, 3104, -3350, -6719, -4307, 4886, 7431, 107, -4977, -3582, 2849, 6189, -475, -5542, -2284, 2449, 6094, 3054, -4785, -2025, 6859, 8100, 4495, -1552, -5210, 1335, 8231, 5223, -3831, -11241, -6796, 4998, 6462, -2123, -10631, -11352, 1332, 11724, 3844, -7826, -9467, -2813, 7779, 9373, -1996, -10403, -7282, 3200, 10381, 4096, -6265, -6787, 714, 10054, 10561, -1116, -6430, 1080, 7051, 6628, 1042, -5757, -3903, 2643, 3197, -987, -5329, -4719, 1275, 3214, -283, -3599, -4765, 370, 6258, 1232, -6624, -6060, -395, 4994, 3501, -5486, -8647, -1451, 6361, 7207, -85, -6353, -2714, 5148, 9211, 5871, -3981, -7783, 247, 7643, 6277, -1528, -8818, -5618, 4676, 7793, 1608, -5433, -5642, 1431, 6468, 3958, -1710, -5461]
578e461K127N975Q19m853l578L40M270L657k629m237Q53M159K353k327l773N42
594a763L509J480k129l860p34M003L342j233m010k505K981O022J453n248n773
609d465Q24O803M007m466p834k170N761O502p25o887m847K839P409L414m264o672
625d771j305N776N913j416o816l821L546O278J042m734l737J519M842K533k737
640B112l587M30K935J808j488l592q40K820K037j621l807j025L785L273j623m216
656b599k013L425N254n92n402l229J915N350K683m087n486k34N114N308j062o186
672a841l019L200N839K223n056n750R91M883L104j640n347k206L428L874M84l205
688c8l356J131L477J358j398l102q62L014J608j598j625n47J552K115j087k124
$$ y = [-5461, -3334, 2641, 3460, -1393, -4971, -4631, -361, 3296, 667, -3570, -2717, 1442, 3795, 1468, -2305, -1763, 1746, 3226, 1097, -2763, -3497, 506, 3848, 2615, -1395, -3900, -919, 5103, 6556, 1308, -4465, -3641, 3162, 7169, 2703, -5131, -7301, -1540, 4962, 4237, -2650, -7497, -4658, 2751, 6165, 1901, -4771, -6076, -300, 5613, 4197, -2619, -6440, -2894, 3384, 4426, -308, -4045, -2526, 2316, 4849, 2112, -1475, -1045, 1890, 3698, 2210, -1382, -2222, 598, 2635, 1014, -2793, -3818, -33, 3240, 1617, -2599, -4612, -1187, 4067, 3475, -1927, -5156, -3241, 2109, 4792, 705, -4781, -5015, 99, 5407, 4345, -1841, -4860, -1660, 4179, 6402, 1346, -4404, -3413, 1470, 4574, 2934, -2413, -4619, -1191, 2683, 3167, -38, -3394, -2263, 1214, 2572, 1174, -1928, -2790, 224, 1832, 234, -1391, -1938, -386, 1729, 642, -1482]
704a482J69J758J901n70k983p64K078K287M85l227l294J841L859J310k214m349
720c195q09M428L508j110m254l157K496N028R69l287m186n44M740L592j937m005
736a723k146K308M668N11l673k709N37L377K220k309k991r8J917K183o02k857
752a387m70J888J344k17k110j088K140J796q82k051j326J748L015l94k957j841
768b792J108L579J511l053l286J93L326L181j358m398j554K583L712Q98l592l522
784c464R74L608K233j543l925j224K735K905J21k729k481J081K843J034j344k206
800a382m44J973J460p10j457o94R23J365l03j313l56Q53J104j82j498o13J262
817a2J443j35j771j444J012K287O35j808k269k6K546K109j008k849j426J712L127
$$ y = [-1482, -1313, 445, 2346, 1776, -1207, -1971, 107, 2394, 2879, -348, -3642, -1801, 2058, 3368, 1154, -3195, -4004, 424, 3932, 2822, -1432, -4589, -2093, 2935, 3904, 617, -3569, -4113, 627, 4219, 2282, -1723, -3869, -1561, 3107, 3618, -55, -2764, -2227, 1150, 3370, 1061, -1930, -2028, -111, 2072, 1470, -1387, -1857, 31, 1375, 1158, -952, -2040, 100, 1896, 1014, -1037, -2363, -615, 2400, 2006, -951, -2792, -1684, 1895, 3406, 353, -2933, -2740, 586, 3767, 2409, -1989, -3543, -960, 2752, 3650, 58, -3464, -2490, 1118, 3351, 1808, -2117, -3341, -606, 2299, 2420, -309, -2790, -1709, 1134, 2168, 824, -1382, -1826, 147, 1607, 897, -560, -1254, -331, 1034, 731, -582, -938, -85, 1019, 837, -661, -1274, -12, 1431, 1296, -475, -1919, -907, 1380, 2015, 207, -2062, -2088, 458, 2567, 1559, -1290, -2716, -1004, 2123]
834B123O84k712k752L30K972K243j299l303j183K102K870M96k592k373P76K593
850I75J465j203k633o61K006J662l90j829j204J123J779j05j323q23O48J570P3
867A130j557p12P76J391L88j775j530J012J926P38j379k362J07K648J614r50k573
884a108j408K075K755r8k376k326M29L106J496j740k483q47K008K712l08k436
900e49j467O01K353J171j705j846n5J294J586l12j781m05R27J002L55j102q15
917g48Q55O88j06o45q88N38J195l57j033n95K85J506N86j438j201J90J436J486
935A754q54k149n18J180J900N35k142j844Q06J982J421p68k499p24J800J948K89
952B117k003k024P04K056R87q85k233o48J846J423k93j325j210O91J679J68j075
$$ y = [2123, 2807, 95, -2657, -2327, 645, 2888, 1589, -1714, -2897, -795, 2075, 2571, -21, -2394, -1618, 975, 2440, 1237, -1396, -2057, -51, 1611, 1221, -608, -1812, -689, 1090, 985, -338, -1161, -513, 1057, 1130, -427, -1139, -363, 1028, 1416, -359, -1889, -877, 1049, 1787, 408, -1954, -1847, 801, 2415, 1465, -1108, -2516, -441, 2314, 2216, -160, -2486, -2057, 1049, 2545, 805, -1678, -2525, -517, 2195, 1887, -549, -2016, -1415, 938, 2109, 404, -1442, -1497, -203, 1383, 1071, -710, -1115, -188, 814, 1169, 67, -748, 107, 795, 689, 44, -844, -306, 889, 532, -501, -1096, -811, 695, 1281, -157, -1358, -1168, 268, 1754, 900, -1249, -1767, -587, 1313, 1848, -294, -2138, -1332, 650, 2071, 1303, -1196, -1920, -120, 1828, 2117, 114, -1910, -1206, 850, 1837, 952, -1281, -1929, -83, 1340, 1047, -278, -1488, -797, 882, 1050, -25]
969b5r37Q8J194M65r53o99J80R24P18r34j094O22J182N04p02j518r8J658J037
988A612p21j775q68J405J836Qj664j661M48K422J094j419j983n63J638K048l24
1005A533k177j313Q05J998P76j360j618j19J414J485m18j642n62Q20J113K78j045
1022c2r31M53R67K39o52o34L37P74J67n36o22J91R32K93q45q59N5R65Q08n56j389
1043h75m77J082J381j2j440j152N01J618Q79j007j733l86J359J559l8j604j280
1060a625N76J853R58j053j683k72J364J402k27j542r25O49J293L90r69j088J14
1077g85R61O11m45r82j37Q27N19m01p82j48Q37O05n57q75j02R25R86m10j275m18
1097a046R20J298J81j443j253N59J580Q84j027j892l09J573J492j81j843j309
$$ y = [-25, -962, -874, 320, 785, -168, -867, -687, 237, 955, 21, -1073, -451, 731, 1235, 533, -985, -1083, 575, 1612, 891, -884, -1752, -347, 1489, 1497, -167, -1828, -1380, 1042, 2136, 717, -1266, -1829, -191, 1857, 1533, -644, -1957, -1152, 846, 1622, 262, -1356, -1475, -61, 1424, 1006, -636, -1198, -378, 735, 1013, -32, -963, -510, 457, 696, 44, -590, -253, 521, 688, 152, -470, -279, 653, 946, 101, -758, -703, 262, 1070, 514, -875, -1352, -270, 1111, 1099, -341, -1493, -992, 626, 1505, 498, -1235, -1621, -262, 1297, 1259, -345, -1625, -1049, 804, 1762, 709, -974, -1246, 118, 1520, 1293, -249, -1174, -525, 768, 1158, 189, -899, -785, 176, 787, 342, -640, -777, 50, 569, 168, -614, -762, 75, 680, 123, -752, -854, 71, 1057, 647, -628, -1046, -126, 1172, 1353, -90, -1343, -784, 796, 1680, 653, -1239, -1548, 25, 1517, 1336, -507, -1816]
1113a816R97J822M97j164j689j41J636J173n10j438q14R05J438J21r96r07J89
1130f97J189M97p73o82K2N77N53m22p46J22N58L29l06p70l0Q20M65l33q88m84
1150i99Q76J038k08j021q20L66J468N75r93j229k15J209J348l34j473q89N36J573
1168H08O66j219j396j01J209J293k99j537o94P47J257M47j011j142K01R92O71
1185H92l60j075k32P72N99j15o87m28N91O58k51o31k96M77P56j69r48l98N63R73
1205F91J80j091r23M53J248O96q21j507j70J356J217k52j574j054R17J670M38
1222A474j222j509M9J568J098n75j509p03R54J387N7j152r97K42J189O00o90r30
1240f69q6P62O56k59p23k00N28N00j82o17j49N28M67k25o98k68N93P57j04r10
$$ y = [-1816, -819, 1003, 1500, 336, -1353, -1494, 142, 1315, 805, -633, -1447, -542, 896, 1017, 21, -886, -697, 492, 989, 216, -466, -444, 133, 686, 264, -482, -360, 198, 527, 221, -549, -579, 241, 706, 373, -515, -999, -123, 915, 707, -314, -1134, -768, 700, 1275, 282, -947, -1162, 47, 1395, 1061, -412, -1301, -765, 808, 1474, 255, -1141, -1242, -33, 1260, 961, -576, -1270, -523, 734, 1181, 170, -972, -771, 221, 892, 532, -543, -775, -3, 596, 481, -206, -634, -43, 615, 364, -267, -563, -86, 670, 501, -447, -845, -282, 691, 871, -220, -1143, -690, 558, 1254, 433, -1074, -1244, 112, 1329, 1077, -497, -1551, -634, 1036, 1474, 252, -1257, -1208, 360, 1458, 883, -626, -1329, -375, 1012, 1069, -83, -1080, -838, 351, 951, 261, -669, -755, 7, 663, 404, -319, -519, 9, 509, 327, -290, -439, 89, 556, 331, -367, -635, -42, 715, 611, -299]
1260b99n90M82J024L48q57j083K7J151R12l94j326o45Q34J327L04j085j242J53
1278i59J323Q96m91j336o36Q57J251J31j009j015J55J151O42n67r57l07P00Q20
1296F49j42p70l87L41O77J10o20l48L26N09J24n47m77M36O97N1o25o87K40J066
1316F23L66p49r92j47J085R83m97j297o40P24J436K55j319j125K41J338J017p05
1334E97j508l40J029J249P9j286r20N21J139N42o72j140pR07N74j66q28m56O36
1353e0O17j78n29l59L20O02j51o01j94L22O10N8q14l92M92P06L02p01r33K29J010
1374C66N79m03j149m46R52J035J7r88j041L57J330N50o55j145m56R72J105j46
1392H34j030q18K72J166N09o90q72k13P70Q56k09q19l51K92O99J86o25m33K05
$$ y = [-299, -889, -407, 617, 965, 108, -975, -948, 203, 1115, 721, -605, -1250, -416, 911, 1215, 130, -1112, -959, 364, 1260, 769, -567, -1203, -346, 905, 1036, 27, -988, -833, 318, 960, 393, -564, -871, -171, 649, 507, -263, -650, -309, 368, 478, -142, -490, -164, 345, 469, -78, -555, -119, 578, 629, 4, -683, -443, 623, 989, 240, -752, -899, 186, 1169, 672, -625, -1265, -541, 895, 1150, -169, -1294, -1053, 285, 1302, 597, -911, -1251, -222, 1027, 1106, -180, -1100, -579, 560, 1102, 430, -710, -717, 190, 764, 598, -230, -686, -50, 567, 389, -140, -499, -179, 423, 272, -329, -523, -201, 409, 467, -347, -739, -247, 459, 761, 60, -873, -644, 366, 945, 542, -607, -1053, -101, 934, 951, -37, -1078, -721, 609, 1159, 504, -641, -1097, -125, 980, 834, -196, -1014, -742, 424, 933, 243, -629, -842, -72, 784, 575, -244, -595, -303, 396, 582, -43, -476, -271]
1411b71M35K26l79m69K45N25R3l75n19J58P81K32n91o91l6Q35O94m64j022l62
1431i55P43J109P2j143q52L77J185O96q11j329j90J025J044j56j253p78O00J191
1449E75M18p81j054P1R86O74l24r13l78O00P28r2o49m15L14O25N2m92l34K77N31
1470D19N6n63l83K85N76J30o12o60J77Q24M17n32q61j14Q39Q48j66r83o17N37
1490c83J058L16p89r91l4R77Q21k92j054n33N95R97K57p62q67N1Q12N63l28q22
1510d08l79M84O44N9n48m40K32N82J73l33l62Q7M56J64l78l45J14M41K06m19n16
1531d86J36O15L98l55p52j66P15O85j38r05o55M67J002K77p74r87j7J056Q14l85
1551E45j038n01O62J122J55q97q52J29R84O10n42r13k16O29P67q1p54l64L67N90
$$ y = [-271, 164, 390, 11, -458, -213, 312, 405, 30, -489, -331, 450, 682, 91, -600, -636, 199, 893, 429, -593, -955, -212, 897, 969, -174, -1026, -649, 536, 1232, 421, -908, -1098, -73, 971, 815, -438, -1216, -616, 575, 993, 212, -842, -771, 215, 889, 565, -348, -726, -126, 602, 510, -139, -554, -240, 385, 437, -55, -389, -112, 419, 475, -88, -471, -186, 390, 520, -92, -752, -575, 249, 666, 134, -727, -841, -2, 846, 680, -303, -920, -383, 675, 991, 202, -789, -823, 154, 975, 683, -371, -904, -309, 688, 945, 183, -684, -633, 179, 742, 414, -408, -787, -303, 341, 400, -148, -588, -356, 226, 399, 66, -296, -209, 247, 411, 33, -312, -198, 243, 449, 30, -486, -350, 265, 663, 308, -444, -610, 105, 790, 652, -253, -908, -441, 561, 838, 64, -923, -940, 116, 930, 545, -493, -994, -332, 790, 945, 48, -804, -675, 309, 919, 377, -536, -752, -123, 644, 563, -191, -555, -188, 402]
1571D02J48n22m65K36M63Q5l82m24J74N31R8m08m09J31O71L11n16n89NO46N75
1592G61l14q99l22N51P94J26q33p32K64Q79N85m36r71k37P16P87K6q19p06K97
1612d83Q13L65m35p64j56O41N88r8n71l90K89N89P4l86l99M1M13J77l42k90M7
1633b77L42K01k78l49R1M46K44k86n05n1N30M29j97o63l53M88P31R7o58o44J60
1654e02Q84N13m71q81k70O72Q19o6q77o59L04Q83L75n72p91p1P15O45j77p40l42
1675f09M29O16M3n22m39J58N14J50l59l48J13M37J72l00l39J00M57K07l63m96
1695c79N3N21L19l02o12j85N33O28r1o64m73L33P86K82n84p26o1P08O03k86p74
1716c71l86M07P61J99o05o01J10O27M73k55o44k01L84M91K3m85l61J93L97J69
$$ y = [402, 550, 28, -437, -201, 262, 347, -35, -459, -285, 246, 344, -64, -473, -342, 329, 640, 124, -465, -460, 186, 761, 447, -452, -774, -223, 571, 697, -136, -868, -604, 275, 860, 424, -547, -784, -68, 719, 745, -74, -780, -483, 330, 695, 260, -504, -660, -19, 569, 471, -100, -490, -201, 388, 462, 76, -323, -282, 131, 308, -34, -324, -277, 65, 266, -12, -361, -270, 176, 420, 134, -371, -422, 108, 537, 340, -323, -676, -188, 543, 640, -18, -662, -502, 382, 895, 424, -457, -727, -55, 764, 698, -179, -838, -534, 349, 724, 152, -639, -710, 5, 650, 473, -267, -609, -180, 436, 479, -43, -482, -324, 190, 340, -19, -367, -254, 183, 355, 55, -284, -184, 273, 480, 117, -379, -326, 195, 514, 212, -400, -585, -52, 576, 485, -179, -652, -319, 467, 749, 165, -561, -622, 86, 689, 403, -371, -757, -350, 411, 610, 5, -596, -486, 141, 614, 359, -285, -486, -102, 389, 412, -73, -434, -241, 156, 325]
1736C25k40l30P3L66J24j67k60qL17J37k79k95k9L20L02k57m63p6L70M55j2n76
1758b03l55L03N98K30m84o78L5O41M69j75p29l74N18P07J31n45o34J37P39L74
1778G05l40o61k34M97N41j15n09l69K06N54J29m21k98Q0L76K04k96l38P0K93J52
1799B26k14m00O4M05J94j85m12p8N00M16j93m88k55L32O00K7n59m86J02O44L82
1820F22l99o35j30M78O37m3o48m06K50N70K62m19o01k9M51L90q7n22k26L04L89
1841B08J17k86l26J13L33J08j67k49k6K53J33j65k06MK43J90j73k73J3K44K74
1862C62j06m33j74K81L65M0m22m10J34N06K76k65n48j20M98M91n8n24m18K41N96
1883C12K02l98n33n8N00M44j57m85k46K97M77P9l91l24Q8L58J77k58l26%K74J79
$$ y = [325, 85, -245, -172, 194, 318, 151, -109, -117, 200, 337, 58, -237, -266, 54, 356, 99, -364, -440, -70, 385, 373, -203, -558, -255, 343, 573, 89, -589, -554, 87, 556, 381, -348, -722, -204, 503, 634, 89, -545, -408, 331, 705, 365, -296, -530, -33, 508, 393, -116, -485, -279, 275, 404, -17, -315, -235, 141, 345, 49, -289, -219, 74, 226, 12, -388, -324, 81, 275, 90, -322, -400, 100, 516, 323, -165, -420, -88, 512, 539, -20, -506, -404, 240, 622, 223, -412, -542, -64, 573, 530, -118, -524, -274, 296, 558, 139, -462, -491, -40, 350, 263, -259, -485, -181, 208, 325, 39, -287, -174, 159, 267, 100, -149, -175, 78, 211, 46, -160, -156, 87, 277, 104, -169, -156, 88, 362, 256, -177, -351, -70, 295, 335, -87, -497, -363, 143, 419, 154, -394, -514, -16, 475, 417, -107, -525, -284, 312, 514, 116, -417, -475, 25, 469, 312, -173, -419, -122, 355, 434, 43, -281, -193, 165, 342, 84, -242, -242, 32, 211]
1905B11j51k78LK59J77j24k94m2K93K54j50l68j38K85L82k6m08l04K03N03J89
1926D76l55m63nM77L82j65n39k72L11M97O2m27m21Q3M57K91k02m29j45L10L78
1947C01j7l29k48J11L17J05j99k38J9K22J31r4j88PJ73J15r0j78l8K00J37j17
1969A02k34r8J92K64n0l04k02J67L59J28k92l40J2L69L08j43m50j92K76M13Q1
1990C66l80l73R1M18K95j98m30j32K99L73kl66k81J44L27J22k20k90oK80J68j19
2012H6k18n1J98J77p8k13n0J65J67p9k62n8J83K14j1l03j63J87L35O9k93l03Q1
2035b20L74K19k19l89j25L28L61n0l76k73J71M17J60k71l39l3L11K84j02l36j67
2056b75J50K83N7k44j96M9K00J34j10j74j7J69J15o8j41m6J41R2p2j39m7J63J47
$$ y = [211, 60, -218, -215, 44, 221, 97, -197, -239, 54, 308, 158, -210, -348, -63, 319, 293, -115, -419, -216, 287, 476, 121, -342, -347, 130, 512, 347, -192, -464, -153, 344, 406, -21, -442, -359, 98, 389, 187, -242, -387, -77, 301, 284, -45, -293, -182, 135, 240, 41, -197, -178, 44, 175, 81, -107, -100, 73, 188, 98, -80, -118, 82, 219, 102, -132, -230, -38, 226, 176, -128, -330, -163, 196, 324, 32, -308, -296, 73, 381, 238, -212, -404, -128, 285, 366, -14, -387, -296, 122, 417, 219, -211, -343, -44, 329, 327, -39, -320, -176, 151, 273, 53, -237, -243, 37, 205, 86, -132, -183, 15, 192, 114, -99, -149, 16, 183, 104, -158, -216, -33, 181, 170, -133, -296, -109, 226, 295, 2, -301, -220, 154, 373, 154, -235, -360, -32, 329, 279, -97, -370, -199, 218, 378, 107, -232, -265, 46, 330, 228, -108, -275, -125, 158, 215, -29, -225, -176, 24, 158, 48, -126, -143, 26, 141, 73, -68, -114, 27, 119, 47, -92, -139, 24, 171]
2079A71n5j88q3J49K27K4k31j94O9K52J37k04k96p3K54K61l2l14j95J42L24J44
2101B89k24l06k8K93K36p6l06j63J56K83P0k11k14M8K48J46j03k05m9J60J50n9
2123A35j90p2J07J19m2j54o5J37J55m3j76p6J38K03Jk31j72P9K56J07k08k56j0
2146b58K80K38q2l03j35J96L10N0k54k72L9K84J77j38l01q9J92K41L0k28j75R9
2168i9K33O7j24j76j6J42J10p8j43m8R2J02l5j05j5R9J00l4j24n5J23R9k4j47
2192e6j30R3J94N0j59j70J9K19J84j06k16j10J60K52Ok17k18K3K45J61j22k50
2214a48q8J81K54J9k35j57P0J99J06j41k18j9J51J21l9j86m2J05J39Nj08o8Q6
2237a3J26j9j14o7O7J46j4j50r8Q0J79O7j54j82M1K07J36j05k46q2J73K07j1k41
$$ y = [171, 116, -72, -155, -6, 221, 245, 14, -180, -111, 141, 278, 74, -222, -295, -41, 220, 188, -126, -321, -179, 145, 289, 65, -241, -269, 24, 260, 184, -122, -285, -129, 154, 224, 13, -201, -153, 95, 241, 138, -67, -116, 44, 194, 135, -55, -127, -20, 99, 57, -97, -162, -25, 130, 87, -89, -165, -27, 176, 177, -54, -226, -147, 109, 216, 8, -248, -258, 22, 260, 178, -125, -260, -64, 246, 296, 42, -230, -191, 93, 270, 132, -169, -258, -66, 175, 205, -23, -198, -99, 134, 201, 77, -99, -115, 27, 137, 59, -84, -132, -40, 62, 27, -78, -93, 6, 106, 72, -52, -107, 16, 115, 91, -56, -186, -93, 101, 151, -8, -178, -159, 60, 244, 138, -78, -188, -28, 224, 230, 13, -205, -182, 63, 224, 102, -148, -236, -55, 199, 218, -17, -174, -104, 95, 201, 60, -158, -177, -26, 95, 56, -130, -172, -67, 72, 77, -31, -99, -13, 113, 94, -20, -87, -20, 126, 112, -38, -136, -56, 123, 190, 36, -146, -105, 102, 238, 133, -113, -195, -22, 185, 174, -67]
2261f7k10R8K53J20j46k53k0K24K09m1k18j55J18K21M1j61j80L1J74J20p6j43
2283f1l2J10J25k8j18m6P3P8m1j03m2O6Q2j5j05p6Q1J39K4j28j21M9J65Q3j05
2308E4j89k8J48J52j9j94j28R3K27J02j48k03l0J99J77m5k22j32J17J87N5j46
2330B7j84J2J75J25o1j76m2R7J48j9j35p9O3J05Or6p4O3R8J9r1q2O3J33K6j08
2356A3j32L6J56Q4r5j93l0J56J66l3j95j25J13K20P1j67k11PK11J59r9k18j01
2379b07J48K08Qj72j69O4J80R4r6j65k7J30J17l6j27o2Q8R1Oq8o8O3Q2Nq6n5N9
2406a5R0J1r7q3L4J22N4q9j36pJ32J33n7j82q6J13J85L6j50j74K7J87J38r2k03
2431a09q3J42J89K3j83j48L8J88J07r5j69n5J41J53k8j35q8N1J37L3j07q8K4R2
$$ y = [-67, -277, -179, 74, 194, 48, -205, -225, -1, 208, 167, -51, -206, -88, 133, 174, 13, -167, -136, 38, 158, 82, -61, -93, 17, 142, 114, -4, -50, 23, 101, 60, -43, -85, -19, 63, 48, -57, -133, -52, 87, 111, -17, -138, -89, 76, 159, 54, -135, -163, -15, 137, 118, -76, -204, -111, 116, 218, 70, -133, -163, 36, 213, 168, -54, -186, -69, 118, 173, 27, -157, -145, 30, 155, 94, -82, -124, -27, 121, 102, -33, -112, -49, 56, 62, -34, -108, -45, 53, 72, -19, -101, -38, 95, 121, 13, -119, -83, 73, 157, 62, -131, -161, -5, 161, 128, -67, -192, -79, 141, 212, 45, -166, -159, 52, 211, 112, -106, -207, -59, 149, 157, -15, -184, -120, 60, 154, 58, -107, -134, -4, 113, 77, -50, -112, -24, 67, 73, -15, -83, -20, 62, 67, -19, -74, -15, 75, 86, -11, -94, -60, 62, 116, 27, -109, -116, 16, 149, 92, -90, -176, -63, 122, 158, 8, -166, -139, 48, 186, 94, -109, -192, -50, 139, 162, -21, -169, -131, 57, 164, 69, -100, -155, -14, 139, 111, -24, -112, -61, 76, 109, 2, -86, -62, 30]
2455C0M4o9r1K8R1M8p2j07K4J17O9p6j33k3J21J35m2j76p9R8K03K6j67j67M1J96
2481F9J35j11k28o7J69K00pk11j56P5K10R4j21k09jJ70J29l9j51q2R4J30Pj04
2505er6M6J17K8p4o8L1Q5K3o6o9JJ01N1r4j23MJ18R6n8j49o4J30J60Kj58j37N6
2533a12J84R0r4j99m9J60J91j0j75j48P1K00Q6j07j97k8J55J43k7j86r7N2J60
2556F3L6j09j18J8J28P8o3j16nR6P6m8j11j2Q8Q4n7j09j9J10J11j4j47p1R3J65
2582A47K2j71j54M0J96J07j32k12n7J87K04j7k08j51R8K35P8j50k26j4J85J61
2604A68n5k00j06J12J88L2j46j23M2J54P1q7j12j2R2O3n1r3j8R0P2m0j02j4J03
2629B8J00l6j30o0R5J30Nj61j29M1J81R8j26j78l1J67J88k6k07j37R2K00P4j39
$$ y = [30, 74, 5, -86, -58, 33, 81, 9, -98, -74, 43, 112, 36, -97, -120, 1, 136, 94, -82, -161, -63, 140, 166, -1, -168, -127, 69, 204, 93, -135, -202, -33, 167, 160, -51, -207, -132, 78, 172, 51, -158, -159, 11, 140, 101, -50, -132, -38, 92, 99, -5, -101, -55, 62, 90, 16, -52, -21, 64, 87, 21, -48, -47, 54, 105, 11, -112, -108, 10, 106, 48, -101, -165, -35, 125, 127, -31, -168, -112, 72, 162, 68, -131, -180, -20, 171, 161, -14, -162, -91, 109, 195, 88, -109, -137, 18, 161, 134, -52, -149, -97, 63, 99, -10, -128, -110, 18, 96, 33, -83, -88, 8, 84, 36, -75, -87, 1, 85, 28, -81, -100, 10, 121, 107, -40, -111, -18, 147, 169, -2, -156, -116, 80, 187, 55, -157, -214, -27, 177, 160, -48, -199, -101, 134, 212, 62, -164, -178, 7, 168, 113, -87, -193, -81, 107, 139, -7, -130, -88, 66, 137, 50, -62, -74, 18, 81, 30, -63, -81, 9, 81, 41, -61, -75, 28, 128, 92, -38, -98, -3, 127, 132, -29, -158, -117, 64, 162, 36, -142, -173, -6, 182, 156, -51, -188, -96, 104, 178, 39]
2653C9k08l0J72J81m0j84j06R6J94N7j07j69RJ46R2o1j36o0R0R9lj12n3O1R7%
2679F4r5m7N3J04Jj25r0P0J44K5j26j42L5J84J18r4k03m1J79J91j5k26j67J00
2703a03K32R4j80k08j1K02J78m4k26j12J31K08L6j68j75J5J73J12r6j58m4J23
2725b1J14k3j15n6Q9Q9Jj08l9N5R7j7j11o8Q0J27Oj24j05O9J64P4j17j76k6J57
2751A6J59n2k06j24J12K08O3j60j96J8K00J50o1j92j18J10K05M1j64j70J8J68
2773B5J14p5j55n8J18J33J2j22r5N5J17J2q9p9L4R2J6o5p7L4J14M1q9j01J9J27
2799E8R2q4j73l2J45J58l3k04j29J13K03P3j58k07j1K29J68q1k39j14J54K11N0
2822A89j99j78L3K06J18j02j71n0J43J62l6j42q3Q0J06J4r5q2M9R9J3q4q7O5R6
$$ y = [39, -169, -199, -27, 154, 114, -70, -176, -80, 114, 171, 64, -105, -96, 50, 142, 81, -55, -115, -25, 74, 71, -41, -94, -33, 64, 64, -31, -78, -25, 79, 80, -45, -135, -65, 79, 104, -22, -164, -129, 55, 173, 79, -124, -165, 14, 205, 190, -36, -203, -103, 129, 223, 43, -165, -176, 26, 204, 160, -66, -178, -47, 161, 197, 29, -146, -131, 42, 154, 58, -100, -144, -21, 93, 70, -45, -101, -12, 77, 78, -30, -69, -14, 83, 66, -45, -113, -33, 94, 100, -24, -129, -60, 104, 178, 61, -115, -141, 16, 175, 123, -83, -207, -95, 113, 176, 16, -180, -162, 38, 188, 127, -65, -183, -73, 132, 173, 9, -161, -143, 25, 139, 64, -91, -149, -31, 102, 114, -8, -103, -48, 69, 81, -8, -87, -53, 39, 55, -10, -87, -53, 61, 102, 13, -88, -69, 58, 150, 66, -107, -139, 6, 164, 131, -73, -202, -89, 114, 187, 29, -178, -189, 40, 208, 127, -112, -226, -72, 139, 189, -10, -188, -155, 51, 169, 67, -104, -154, -11, 151, 115, -27, -110, -30, 76, 90, -5, -87, -38, 61, 74, -10, -97, -32, 64]
2847F4K7j00j10N1J36M1r2j45pJ55J20m9j86p9J20J97K0j55j70K7K12J16q8k01
2871i6p5J36J85K7j85j56M7J68J20q7j84m5J29J37j8j34q8N3J14N1p8j10J5J00
2895B6L8m4q3LR7L3n7q6J4R8P5o5j26k5J23J13k2j79q7R8J73N1j54j67K0J94J33
2922A94q4k33q4J68K08Jj93j74M5K21J14j15j99l3J66J47k9j65q3P5J46K6j32
2945a3r9L5J16N2r0p8K9Q5M3p3r5M4J00M8r2j11mJ31R5o2j48o1J19J62J6j68j28
2972a47N2J81J07j20j93m5J58J65l2j71j36O3J96R9j30j81j4J44J44k4j57q9O0
2995g0J36L3r0r6J2J01O3m1q6JO2O8o2o6nO4N0n6q7k0R4Q9l0j29n0R4J33J9j44
3024a3j34N9J64J08j27j95m5J73J72k1j98j34R4K15P5j37j91rJ73J46o3j83q7
$$ y = [64, 91, -9, -119, -68, 68, 109, 17, -128, -135, 20, 140, 91, -95, -174, -54, 143, 163, 8, -162, -135, 77, 193, 105, -96, -171, -35, 150, 177, -8, -164, -117, 51, 171, 84, -100, -145, -16, 121, 103, -31, -119, -66, 48, 99, 21, -89, -74, 26, 64, 20, -63, -60, 37, 70, 13, -73, -59, 39, 114, 49, -77, -102, 21, 134, 112, -67, -154, -56, 117, 168, 14, -153, -133, 61, 194, 110, -123, -207, -39, 169, 170, -23, -197, -152, 69, 183, 68, -131, -164, 2, 149, 120, -45, -128, -53, 93, 119, -13, -112, -77, 39, 91, 1, -77, -48, 37, 80, 7, -88, -44, 56, 104, 12, -99, -103, 28, 123, 61, -87, -148, -29, 133, 149, -19, -147, -95, 86, 193, 73, -120, -165, -7, 158, 126, -45, -181, -118, 78, 177, 47, -134, -148, -4, 140, 116, -41, -130, -70, 66, 99, 9, -87, -75, 26, 89, 48, -38, -37, 25, 93, 31, -35, -40, 24, 74, 18, -69, -89, 5, 94, 64, -65, -115, -21, 112, 131, -13, -147, -88, 76, 184, 57, -138, -183, -10, 162, 141, -57, -191, -97, 118, 193, 56, -135, -144, 29, 175, 112, -71, -158]
3047a58J12J48K4j28j23M7J36O6q3r8PR3M5n8q9NP4M0o2q2J6P9Q6n0j24k3J01
3074AJ21k3j57r6Q8J59M0j20j65J6J77J28o7j72q5J28J80K2j58j53K9J67J01r3
3098F8j57n2J04J35Nj26q1L2J27L4q3p0j8P6N7m2o7j0P1M5j9p4lP8O4m3q2m0R1
3127B0J00l4j13r6Q4J32M2j20j46J8J53J30o3j94p8J17J81J1j67j63M6J89J02
3150A51q6j96l7J46J54j3j43j04O7J53L9j08j24K3R9Q0o8q4j4Q6O7m4q7j7Q3O6
3176H9n2j08j6Q8Q4m9j11p2J05J48Jj37j25O4J62Q7j13j61l4J51J53k6j82j05
3200a59P7J84N3j11j49j7J50J19m7j48o5O8J22L0j04j03J7J06M0m0r3oP5N9k5
3225C3o7k6O3L6j7o7k0P5O3j9r9m1P2J12Mj07r8L2J37P1r6j56j7J36J38l3j67
$$ y = [-158, -46, 102, 126, -2, -125, -78, 58, 124, 41, -57, -50, 43, 88, 30, -59, -54, 20, 60, -2, -84, -68, 11, 97, 47, -77, -100, 1, 122, 99, -58, -154, -66, 93, 133, 13, -152, -136, 41, 169, 102, -70, -155, -27, 153, 175, 17, -136, -107, 60, 161, 68, -89, -141, -37, 98, 103, -23, -104, -72, 55, 89, 6, -64, -82, -6, 51, 9, -58, -68, 3, 48, 29, -45, -48, 30, 94, 51, -31, -71, 20, 120, 86, -27, -123, -39, 93, 135, 15, -131, -113, 40, 170, 107, -87, -165, -48, 133, 144, -23, -186, -140, 49, 151, 65, -131, -168, -22, 132, 119, -24, -128, -61, 92, 131, 23, -101, -78, 21, 101, 33, -51, -65, 21, 88, 44, -43, -60, 23, 89, 37, -71, -87, 1, 85, 36, -75, -147, -42, 106, 107, -30, -155, -91, 71, 158, 45, -116, -150, 1, 154, 128, -54, -159, -82, 102, 155, 44, -105, -122, 28, 147, 100, -48, -113, -45, 77, 107, 3, -100, -83, 23, 63, 23, -70, -76, -1, 58, 33, -34, -60, 3, 39, 22, -45, -65, 10, 73, 54, -45, -86, -14, 98, 102, -5, -103, -71, 66, 137, 41, -115, -132, 4, 142, 109, -58]
3252e8j06Q6J89L5j11j63j8J61J30m9j69q9R4J70K3j34j15K8J43P0p7j06j8R5
3276A1Q0l8j04k1P4P1l4q7l3Q1Q4l3j03m6Q4J17j2j28r5O8J53O3j42j47KJ67J38
3303A70q1j69r7J39J63L0j51j63M5J60J26r9j77m4J25J42Mj36j17M5J34O7q2j08
3327g4j1J07O0l3q2m1O9O7k6o7k5N4O4j6q7l2P4P2oj06n8N3J21N0j18j30J6J35
3355C0J10n4j76p4J14J75K4j65j49M1J79J04q5j81o2J41J75k0j62j28P9J61O9
3378A46j03j42pJ35J01o0j37k2Q8Q1k3r3n4P1Q8j3j04m7P4J01j0j07q8P4J43J4
3404A06j16j38L6J60J12r8j76l7J42J68j7j84j32P6J93P9j20j94k8J81J42m8j69
3427f2r1Q9J59M2j17j38K4J29P4n6j32k5R4P2k1q2l1O4O1np7l5O6P2j3r6n7N9
$$ y = [-58, -164, -78, 111, 146, 35, -128, -146, 15, 145, 96, -73, -162, -68, 102, 125, -9, -124, -96, 47, 117, 40, -66, -84, 11, 91, 53, -51, -72, 2, 73, 39, -48, -81, 0, 84, 51, -52, -98, -14, 103, 91, -37, -132, -64, 89, 152, 10, -137, -135, 32, 170, 89, -80, -177, -38, 125, 155, 4, -159, -114, 46, 172, 73, -104, -148, -23, 119, 123, -13, -130, -85, 49, 116, 34, -74, -85, 22, 82, 49, -33, -74, -5, 62, 36, -31, -56, -2, 62, 46, -41, -73, 1, 73, 67, -39, -97, -44, 77, 127, 9, -121, -105, 30, 140, 86, -90, -164, -50, 125, 149, -16, -165, -124, 55, 159, 74, -107, -169, -28, 147, 127, -35, -163, -84, 77, 146, 43, -99, -106, 29, 130, 70, -67, -89, -1, 80, 57, -36, -90, -19, 69, 56, -48, -95, -21, 80, 70, -37, -125, -51, 92, 106, -10, -148, -112, 48, 160, 62, -114, -151, -9, 159, 142, -42, -174, -98, 95, 174, 54, -140, -168, 13, 155, 107, -62, -153, -64, 95, 137, 20, -118, -94, 35, 109, 53, -79, -104, -10, 62, 41, -41, -72, -8, 53, 48, -29, -64, 2, 74, 61, -35, -92, -33]
3455c3J04J8j07r9L2J38Q6q5j63j9J25J36j0j77j27Q3J79Q6j41j69l1J78J66m4
3479A26j81j19J11J75M9j35j66RJ73R8p0j54n3J20J11pj19o4O8R9Rj08o2N0J00
3504F0lq9q1O1J15M0j13j17M7J43Q8r3j66l1J50J53m3j90j29J21J99N9j59j88
3528a66RK00J54q0k18q8J27J90J8j61j52L1J91Q4q4j60j3J22J09k9j19o0O9R6
3552G0Mr2o0M4Q0J5q3n5N3J02J1q5r6L0J20O2q6j46l3J54J25k9j83j03R7K07N1
3579A74j40j94J3J87J52p9k08j04J30J96N3j69j89M9J93J22q9j83n9J27J46j2
3601A16j42r6N7J39J0j00q2L0J17M4r3q8L1J13M0q8j26K6J36P5p8j73k0J54J63
3626A65m3j90j11J27K25L2j85j89J5K26J41j01k43q9J76K17Mj99j60N8K28Q9j31
$$ y = [-33, 71, 89, -18, -117, -85, 53, 139, 54, -109, -128, -3, 133, 123, -54, -181, -98, 81, 167, 26, -143, -174, 4, 170, 126, -55, -174, -63, 112, 161, 26, -140, -131, 42, 140, 70, -84, -137, -17, 94, 87, -32, -96, -28, 71, 80, -28, -90, -40, 60, 57, -32, -113, -52, 63, 103, -10, -127, -80, 63, 151, 58, -108, -139, 11, 164, 121, -69, -198, -77, 122, 181, 22, -166, -157, 43, 197, 117, -101, -189, -62, 128, 146, -15, -167, -136, 55, 139, 55, -105, -118, 4, 113, 84, -35, -95, -26, 70, 74, -18, -78, -34, 46, 61, -22, -77, -24, 78, 89, 4, -92, -62, 58, 120, 34, -112, -145, 9, 134, 105, -78, -181, -84, 123, 174, 34, -160, -147, 40, 192, 113, -95, -199, -69, 127, 180, 11, -178, -129, 64, 186, 97, -86, -145, -18, 128, 116, -26, -122, -65, 74, 84, -16, -98, -68, 49, 93, 0, -88, -57, 56, 96, 8, -118, -92, 44, 119, 41, -132, -152, 2, 165, 122, -68, -179, -52, 173, 205, 20, -169, -154, 72, 213, 112, -131, -220, -44, 173, 177, -22, -182, -124, 104, 193, 62]
3649F2k01k7J61J32k6j68q5Q8J41K2j09r1N7J12K7q5p3K5R9L4q2j00J5J31N8q1
3675C6j30lJ28J25m7j72q8R7J88K8j72j73L7J90J36q6k23p1J52K26J0j85j84N4
3699a27K23J10j20k17l8J54J64qj82j04Q0J68M2j08j39J9J40O6q7j23lJ14P3p0
3723B7j15j8J29R0n8j52k9J34J46m7j90r8J05K07N3j82j95M9K13J53j01k51q2
3746b12J89K21jk25j82P3K48J02j55k13m4J98J83n3j99j02J00J76L9j43j30M7
3768h3J29O9r1j24QJ20O8p5j14J9J04P8o1j22l9J25J20m5j67o9R4J81L5j68j50
3793a58L5K01J25j10k18p0J76K00j1k14j65P8K29J05j30k17m3J92J83l6k08j21
3815a77R4J87O2j46j50J2J53J02p8j45l0J05J13k6j29n1R8J11l1j30p2J14J31
$$ y = [62, -139, -166, -5, 127, 101, -67, -152, -64, 77, 99, -10, -101, -44, 68, 95, 10, -63, -38, 61, 95, 13, -87, -72, 59, 117, 36, -94, -97, 31, 156, 109, -63, -151, -54, 134, 162, -10, -183, -146, 44, 180, 94, -129, -200, -48, 178, 188, 3, -181, -127, 96, 206, 86, -131, -169, -15, 149, 141, -41, -145, -65, 103, 145, 37, -102, -83, 57, 123, 36, -87, -90, 24, 97, 27, -88, -106, 23, 113, 55, -97, -126, 8, 154, 107, -83, -181, -76, 131, 184, 2, -193, -144, 69, 222, 121, -130, -212, -23, 198, 197, -28, -210, -137, 111, 213, 58, -155, -199, -1, 182, 129, -70, -172, -72, 104, 143, 0, -130, -83, 46, 115, 24, -100, -92, 28, 96, 21, -93, -74, 30, 108, 47, -75, -114, 11, 131, 86, -81, -150, -56, 125, 160, -8, -158, -123, 78, 203, 93, -125, -195, -19, 181, 170, -44, -209, -131, 98, 203, 73, -144, -187, 5, 188, 152, -56, -177, -83, 104, 166, 20, -130, -118, 35, 137, 59, -86, -116, -11, 102, 76, -53, -104, -6, 105, 74, -56, -128, -14, 117]
3838A17j9j44j01P3J87N0j39j83J7K09J35j03k30q1J83K30j9k30j82R3K48J09
3860B20j59k42l2K09J91m9k19j38J22K22O2j78j71M1J66J09r1j57k0J25J21n9
3882G3j20m6R6J11m1j18o8J03J19pj51q3Q9J41N1j55j51L0J88J18j15k01n5J63
3906b9J92J2k23j59Q9K20J16j48k21l3J89K06m5k22j37J07K12O8j53j88jJ77J13
3929A42n4j83o0J18J41kj52p1P1J27J7j12r5N8J38K5j24j14O3J51N7j17j44mJ74
3954E0J44r1k16q2J55K21Jk29j71Q7K31J26j49k53l4K23K13n4k44j58J25K45N6
3977A96j81j88NK21J28r7j87n1J41J50k1j61p7Q7J24Lj06j00O0J28L6j13j13L1
4001h5J59O3j15j40J6J63J15r2j78p2J43J94j3k00j52Q2K19J05j43k18l1J86J99
$$ y = [117, 98, -46, -147, -74, 113, 163, 24, -159, -142, 67, 202, 99, -131, -212, -29, 201, 182, -48, -230, -137, 111, 220, 61, -181, -213, -4, 187, 138, -81, -219, -97, 125, 187, 9, -162, -121, 45, 154, 63, -94, -114, 11, 132, 73, -47, -93, 3, 114, 73, -45, -113, -10, 109, 102, -49, -132, -43, 98, 149, -6, -157, -127, 61, 179, 64, -137, -192, -29, 163, 175, -48, -207, -118, 102, 218, 70, -151, -184, 5, 211, 166, -56, -193, -86, 126, 194, 41, -147, -148, 29, 142, 88, -95, -155, -37, 104, 102, -50, -121, -50, 77, 94, -18, -113, -55, 83, 108, -16, -130, -67, 84, 141, 24, -120, -124, 50, 194, 103, -113, -195, -40, 181, 182, -47, -218, -131, 100, 226, 77, -176, -210, 13, 226, 172, -72, -230, -105, 140, 196, 15, -173, -168, 53, 181, 84, -103, -154, -13, 137, 116, -45, -122, -35, 89, 92, -14, -114, -54, 74, 110, -3, -116, -85, 74, 137, 22, -118, -102, 61, 176, 84, -94, -166, -23, 171, 158, -42, -194, -112, 107, 212, 69, -149, -180, 6, 205]
4024B05m7k25j48J08K32P3j65j96MJ76J61o3j88r4J21J65J5j43j16M5J38N8r3
4047B3j31K2J31N6o3j31PJ31Q0q0j38l6J42J27n0j68r1J22J87L0j79j71M6K33
4071I9J26j40k34n5K06K03m0k48j56J16K63P7j77k17OK11J64q1k16r7J48J92j7
4094A33j57j25O4J67N4j08j26J6J38O1q1j27OJ14Q9p7j29k3J15J20m9j57p5J19
4118c8J64J2j71j35O0J87J01j18k05l3J83J77l6k18j29J08K24O5j50j98LJ76J63
4141A92p9j89j03J16J90Qj43j36L9J44Q7q6j33j1J22R1n4j11k6Q1R5m6j02o0J04
4166a0J17k0j27p7P2J66L2j48j47L1J93J04j10k01n3J65J95k4k27j33R4K34R3
4189B19j77k05j3K14J66p6k30r0J33J87K4j59j55O1J76P8j00j49lJ24R6n0j29
$$ y = [205, 158, -67, -215, -107, 125, 198, 33, -163, -159, 17, 178, 115, -73, -167, -46, 119, 134, -9, -125, -80, 58, 116, 23, -108, -86, 45, 101, 38, -93, -86, 45, 125, 45, -93, -129, 13, 140, 90, -78, -169, -47, 140, 170, -9, -180, -134, 99, 225, 85, -149, -204, 2, 205, 165, -83, -239, -123, 140, 217, 40, -177, -171, 40, 204, 123, -93, -190, -42, 150, 133, -24, -149, -85, 82, 136, 28, -98, -82, 56, 117, 36, -91, -85, 29, 118, 41, -88, -111, 4, 124, 75, -82, -157, -38, 126, 138, -33, -168, -108, 79, 180, 62, -143, -176, 7, 184, 148, -70, -199, -91, 133, 198, 48, -150, -147, 29, 192, 113, -76, -179, -63, 127, 135, -8, -144, -105, 39, 126, 40, -93, -104, 18, 109, 55, -56, -82, -1, 94, 48, -54, -114, -10, 107, 87, -40, -117, -45, 121, 153, 5, -142, -111, 82, 186, 76, -125, -178, -13, 182, 158, -69, -202, -108, 126, 219, 42, -163, -176, 38, 204, 128, -102, -192, -59, 128, 152, -7, -162, -101, 75, 153, 53, -96, -99, 25, 121, 71, -58]
4212e8m2R3R9k7j25k9Q1J19k4j22p3P6J51J3j47j20M6J68P5j11j81j6J64J48l8
4237A20j87j05J03K00N7j65j74MJ80J40p0j91q5J24J74L0j45j45M9J54Q4q5j37
4260g0l6J06J01k7j13o3O9J07kr9n4O2Q7J2r2o9M3J10M0j13j09J5J26J05q2j58
4286a04l8J36J48j5j74j19R4J88O9j56j85nJ95J64q9j87r0J23J90K9j64j57M7
4309a00J71Q9r2j66l8J31J20l6j31p2P6J24Rj05p1N4J06Pj01p9N5J19J9j01j01
4334a13L3J32P4p9j42rJ25J52n1j71j00R0J72M6j49j59K2J67J21p5j80p5J32J51
4358A14K4j52j34M4J59P3q6j52j9J12J13k1j11o8O6J08J6p2q3L1Q4K5o0q2J9R9
4384D7L6o4j06J7J04P7n7j23l6R8J28k7j59p4O7J56N3j25j53MJ67J32o1j85o8
$$ y = [-58, -100, -7, 92, 65, -60, -89, -8, 111, 87, -35, -108, -32, 119, 132, -15, -135, -89, 79, 154, 43, -138, -154, 10, 158, 120, -67, -172, -69, 131, 188, 23, -151, -147, 33, 173, 103, -88, -173, -49, 125, 155, 10, -135, -86, 68, 152, 67, -70, -106, 0, 101, 74, -39, -102, -33, 74, 72, -27, -81, -19, 68, 80, -12, -81, -38, 72, 112, -1, -110, -95, 31, 136, 54, -104, -142, -6, 142, 127, -47, -166, -72, 116, 185, 29, -156, -161, 34, 198, 109, -78, -168, -45, 145, 174, 10, -147, -100, 71, 160, 68, -98, -136, -5, 115, 79, -52, -124, -48, 76, 85, -20, -91, -37, 69, 76, -25, -104, -49, 70, 89, -12, -113, -80, 52, 126, 47, -95, -104, 21, 173, 122, -49, -149, -59, 113, 159, 10, -149, -127, 40, 161, 86, -94, -169, -37, 114, 138, -14, -148, -104, 55, 128, 42, -110, -129, -17, 96, 75, -36, -104, -38, 70, 86, 14, -69, -38, 46, 71, 11, -71, -52, 47, 83, 19, -87, -70, 34, 111, 54, -69, -105, -7, 121, 94, -65, -139, -72, 84, 137, 12, -141, -137, 30, 162, 101, -84, -152]
4409a52J14J81Mj47j51L9J73R0r0j77k1J32J29k8j33p0O4J27K3j08q4K8J08L0
4433H1q1p8K1R0N5p7r5K3J05N0m2j27k2J04J03m0j28p6Q9J42L1j29j22K2J60R2
4459A51q0j64l8J16J39oj46j13M9J46P1q3j27l0J21R6j2j26o7O4R7K4p1r3J5R0
4485B3M5n4p0J0O2N8m1p9rQ2N4l7r7j8O4J03k2j18o3O4J24J8r8j13J4J39R3p6
4513E8j40o3J16J32Mj25j16M2J45Q3q5j41l3J31J11j8j27p8N4J25L8j09r7K9R3
4538B9N4o3r3J1P7N4m6p7rP6N8l5q1l0P3Q9j5j06n2N7J21K8j20r4L0J24P3p3j44
4567h4k3J17J09j0j39j05O6J40L8p6j36rJ24R4l1j10p3O6J10K3q8q0L0P3O0n4
4593C2p8QN5N4l4o1j6N0M1np3m1O1N8qp3l9L9Q1J5o8q5PJ08P5n7j18l8Q5J22m
$$ y = [-152, -38, 143, 147, 0, -151, -112, 61, 151, 61, -116, -137, -5, 124, 96, -37, -107, -43, 84, 107, -1, -85, -57, 51, 81, 0, -78, -57, 33, 88, 11, -84, -61, 44, 94, 52, -75, -97, 7, 110, 70, -58, -134, -45, 97, 128, -1, -123, -101, 59, 151, 71, -93, -131, -15, 124, 118, -28, -141, -92, 54, 125, 42, -85, -115, 6, 102, 90, -36, -103, -39, 58, 82, 11, -82, -67, 23, 68, 14, -56, -46, 16, 74, 33, -46, -55, 27, 81, 44, -53, -71, -7, 96, 74, -44, -107, -43, 81, 99, 1, -112, -98, 41, 134, 58, -82, -145, -29, 103, 107, -18, -134, -92, 53, 136, 51, -90, -123, 8, 119, 101, -26, -104, -50, 75, 113, 4, -93, -64, 29, 83, 20, -73, -62, 15, 69, 23, -54, -63, 13, 71, 36, -45, -75, -2, 87, 72, -34, -86, -29, 92, 120, 0, -94, -64, 60, 133, 60, -84, -107, 10, 119, 109, -30, -135, -69, 71, 109, 33, -103, -112, 12, 106, 75, -35, -108, -42, 68, 91, 3, -77, -47, 26, 86, 32, -46, -38, 17, 71, 37, -24, -40, 10, 51, 46, -27, -68, -7, 51, 43, -30, -69, -30, 51, 66, -2, -87, -80, 28, 103, 46, -72, -110, -25, 97, 93]
4624I3j18r8N0J44O3q9j33j2J10J07k0j36p3P4J13L0j06q8J2J05O5n6r6j5P3P0
4650F9l2p2k0L9P2j4q8k6N4O7Kp6m5N0P3L4r5o8J8J02O0o7j14k0R9J03j6j23o6
4679a00N7J20M0p9j26LJ14Q7m6j26m7O2J17Mq7p8J2J08N1n8p9j1P0N0k1o5l9N9
4707hN3j2m9l0K4O5mm0m0J8P9J0n4o4%Q6N3m9r9j5O7R7j0j00p0M3J14N2q8j16
4737h7rR7Q7j7j26n5N7J15J9p4q8NJ12O4m4j12j6O8P0j5p1m4M5N8K5o5m8L7O0
4766D8J4n8m3J3O7J5n7o9QP7O1o1r4pP3J03k7j01o4N6J10L1q5j09LJ16P9l3j22
4795e6m2P9J04Rr3q2J3J10N6n6j00j6O4N6on3m6L3O2J1m5m1J7N7Pm1m4J6N3J0
4825C6m8n0J0O8L4l3o2qN8P0j1q6n7L6R5L4r1q1RQ9Q2m0q8n2O1J15K1j08q6J9
$$ y = [93, -25, -123, -73, 71, 134, 45, -88, -100, 10, 117, 97, -39, -112, -38, 75, 105, -1, -89, -77, 28, 93, 37, -59, -74, -1, 69, 37, -35, -55, -16, 56, 42, -46, -72, -18, 49, 51, -25, -70, -20, 53, 87, -8, -76, -58, 44, 104, 37, -77, -97, 2, 105, 89, -34, -100, -43, 77, 117, 38, -88, -85, 29, 116, 70, -56, -103, -41, 76, 80, -7, -85, -73, 35, 86, 28, -51, -62, 8, 58, 37, -28, -67, -8, 45, 33, -16, -46, -22, 43, 39, -1, -41, -23, 56, 66, 12, -52, -52, 34, 87, 38, -61, -76, -9, 88, 78, -22, -92, -49, 65, 117, 29, -87, -96, 1, 88, 71, -55, -110, -53, 62, 81, 7, -81, -76, 36, 100, 56, -56, -72, -4, 66, 51, -20, -64, -19, 39, 64, -1, -49, -12, 48, 62, 4, -39, -26, 41, 56, -1, -70, -62, 15, 76, 15, -79, -86, -13, 90, 63, -38, -102, -46, 64, 95, 10, -99, -96, 20, 99, 66, -56, -98, -19, 85, 94, 1, -81, -68, 42, 98, 42, -58, -74, -10, 46, 40, -13, -59, -26, 36, 47, 2, -39, -22, 35, 42, 1, -43, -27, 26, 36, -12, -62, -52, 16, 50, 17, -45, -53, 5, 75, 64, -22, -79, -43, 52, 86, -5, -86, -77, 12, 94, 54, -34, -86, -25, 90, 111, 3, -83, -64]
4855f4Q8P3o0r8k0O0P1Op1o0L7P6J3m0n9oP2K1k9o0lO4M6m9n4J2O5L2j9p5j4N9
4887A4N2oq8n5L5J03K5p4q8lJ08P5m2j06m6P5R6Or7p7K8Q6N5n4j02jO6Q3lq0n6
4918g1M9O2J9m4n6PN6J3k5m0%M6K4j9n9LM9K3j9o2j3M1O6j1p8m2L8P8L4o4p1J1
4950e5Q2O6m7r1l4P2R0Pr8q0K3R3N7l8r7l4Q1P5oq1o7K7Q2K9n1n3j4O5N4l2n5
4981c0j1L8N5k2n0k0L8M4k0n4k4M4O5Kp5n9M0Q6L1p2r6K5R2N3m1j08m3Q4J05O
5011H3j04o9L5J03N7p6q2j7P0Q1k6p0n9M1O8L0n5o5NO3L3k4m0k1L7L6k1m4j0L7
5041dL1mn4j8M9M4rn6m0M8O5J5n8p3K2O7N3m3q8j5N7Q5jp7p1J8R2N2n3r1l3P8
5073a2Q1mq5p1M5P9L1m4p2JN5N1k4n1k8L4M3J0m4l0K3N2Po2k7L0N0J9p4k9K7N8
$$ y = [-64, 24, 97, 37, -61, -81, -21, 50, 56, -15, -75, -38, 38, 51, 11, -48, -54, 18, 39, 10, -50, -53, 11, 57, 8, -46, -34, 31, 63, 44, -31, -45, 14, 66, 60, -28, -83, -48, 55, 80, 6, -82, -85, 23, 98, 56, -50, -96, -21, 75, 81, -16, -93, -65, 21, 76, 22, -80, -81, -15, 68, 65, -15, -71, -22, 40, 59, 15, -41, -34, 22, 35, 10, -30, -30, 16, 40, 21, -38, -35, 14, 37, 18, -44, -57, -16, 50, 39, -39, -81, -43, 35, 69, 5, -66, -55, 27, 93, 46, -45, -79, -7, 83, 90, -8, -88, -65, 28, 85, 47, -50, -84, -3, 72, 66, -15, -82, -55, 27, 56, 5, -48, -62, 3, 57, 25, -30, -41, -3, 52, 30, -20, -40, -2, 42, 22, -32, -56, -12, 53, 55, -20, -79, -39, 47, 78, 6, -90, -65, 27, 80, 39, -69, -112, -28, 77, 83, -21, -90, -55, 48, 105, 29, -53, -70, 0, 81, 55, -15, -74, -33, 35, 65, 10, -55, -50, 13, 46, 22, -18, -39, -2, 34, 13, -31, -41, -4, 27, 23, -31, -49, 0, 44, 35, -21, -61, -13, 52, 67, 9, -64, -42, 25, 78, 35, -53, -68, -11, 74, 73, -4, -75, -57, 35, 87, 34, -57, -90, -12, 69, 65, -20, -91, -46, 33, 64, 20, -52, -51, 4, 55, 31, -20, -48, -14, 29, 39, -5, -35, -12, 40, 47, -15, -42, -12, 38, 57, -17, -46, -19, 39]
5105C9K1o2o0NP7M9l1r2l4P0Q2Pr5p4M4R0M7o4q8j7Q3P3j3r0n6N0R5K2o6p7MP7
5137A6M7l7n7k1M4N8j1n3l4M0L8ql8k4J5M4J5n3k7K5N2J0m1n7J2P0L5l8p2rM4
5168a5P2j0p1n6L8Q9M3n7q6j3O8P1j4p8o4M4P5L3n3o7pO7O7k1q0k6L4N8Nn2m6
5199e2K1M7J6l9l7J0M9J7l2m3J7N5J5k4n2pN7L2k0o9j4N0O6Qq3n6K9R5K5n5r1
5230f5rO7P7rr9n0L9R5J6n4p3J0O9N6m3o2k3M9M6j0n4j9K1M8K1m3k5NN4Nl9l2
5262c1J4L6K1m4l9JN4K2k6m7qM8M2Jo0l9K7P1K6n9p6j0P4O8l1p2m5M5P8K7o4o4
5294f0QO2N0k3n7l5L7N8Om9n3K5O6Qk5l2OK6K2j9m5oL7K5l1l6rM4K9j7m3k1M7
5327eN5Jp4m3L0O6L3n7o3LO8O1k3r0k4N3P7jo2n3KP3M0l6o6k2M7N9nn5m3L8L7
$$ y = [39, 60, -2, -62, -57, 20, 69, 38, -54, -88, -18, 64, 71, -24, -98, -54, 36, 83, 19, -69, -86, -3, 70, 57, -33, -89, -39, 56, 78, 12, -65, -61, 16, 63, 26, -31, -52, -8, 50, 39, -14, -48, -8, 30, 22, -16, -40, -25, 19, 34, -19, -46, -21, 31, 41, 0, -57, -45, 25, 60, 22, -50, -59, -15, 57, 47, -24, -80, -42, 47, 90, 33, -53, -66, 2, 73, 59, -19, -83, -39, 36, 69, 16, -51, -58, 9, 76, 55, -25, -51, -17, 41, 46, -6, -52, -31, 16, 32, -7, -44, -34, 15, 32, 0, -43, -26, 29, 44, 20, -32, -39, 18, 50, 30, -39, -53, -3, 63, 71, -12, -68, -39, 56, 81, 26, -65, -74, -7, 70, 61, -38, -88, -49, 46, 62, 8, -65, -55, 14, 70, 27, -35, -58, -9, 37, 27, -27, -46, -25, 23, 44, 1, -24, -19, 35, 40, 1, -31, -17, 19, 40, -4, -43, -42, 12, 34, 8, -39, -47, 1, 43, 44, -16, -55, -28, 43, 69, 10, -66, -76, -2, 66, 35, -37, -82, -37, 41, 68, 4, -60, -52, 10, 60, 37, -20, -55, -18, 40, 46, -3, -56, -31, 35, 43, 18, -14, -8, 18, 40, 21, -24, -30, 7, 32, 1, -35, -44, 0, 29, 12, -31, -52, -5, 50, 51, -23, -66, -36, 30, 63, 6, -57, -54, 14, 75, 52, -38, -62, -9, 68, 67, 5, -48, -46, 27, 67, 31, -35, -57, -10, 49, 44, -11, -54, -16, 21]
5360B1J9l0m1OL8J6k7l4J2L6Lj3l6OL3L7k2m6k6N6M6j4n8l3M1N1J0m8n5J2O2M1
5392F3j9o7k6L9N4Kn8n7L1N5L7l7o5rM0N1Qm4m6L0N2Mm3j8jL5K5j6m2qL6K0ll8
5426a5mK3K0Ml7k1L3K0Rm0l7J6N5J6n1k8NN1L3k4p3j0L9N6Oo2n7L0N2M7m2o3O
5459d3L6N7j1n3n0M2M7Ol7k4RL4J3j9l0OK9Rll5RJ4K4k1l6MK2K4pm4j0L1K7J2
5493C2l8m2J2M7K9k7m5j4M3M1Pn3m8L1N8J4l6n3mM9L8j6m3j8K0N0Lk1m2jM4J1
5525B8j3l1NJ2J3lk0qJ9PJ1k8j7J4M3j4l2rJ4K8mk1k7J6L4J8j7m3j5L8L7jm0l4
5559d0J3N0K0k0n8qM6M0j2m7j7J6L8Qj8m1jL7J8j4k0oJ1K9k4oj7K1J5Ml3jK1J5
5593A9Rm1rK1L3ok0k6K0K6J0j9l9j4L5L3j5l6k2J5N4Rl3m2J0L1L9j6m3j0NM6j
$$ y = [21, 40, 10, -31, -25, 13, 29, 2, -32, -20, 16, 19, 6, -30, -24, 9, 46, 24, -22, -48, 8, 54, 40, -18, -51, -10, 41, 51, 3, -52, -40, 22, 63, 44, -23, -49, -10, 44, 46, -12, -69, -38, 17, 54, 17, -48, -57, -17, 34, 42, -2, -48, -18, 34, 38, -5, -23, -24, 11, 36, 20, -22, -30, 6, 26, 23, -15, -19, 4, 24, 28, -9, -30, 3, 23, 32, -8, -45, -29, 26, 42, -9, -37, -32, 19, 52, 28, -45, -55, -16, 40, 46, -16, -73, -43, 9, 56, 14, -49, -43, -7, 50, 39, -14, -64, -22, 25, 31, -6, -30, -21, 13, 26, 7, -23, -17, 12, 21, 18, -17, -8, 6, 30, 9, -27, -23, -1, 23, 16, -28, -38, -7, 20, 32, -6, -48, -36, 11, 40, 13, -32, -46, -3, 38, 45, -8, -56, -25, 33, 47, 11, -42, -46, 3, 41, 25, -18, -36, -16, 34, 37, 16, -26, -27, 17, 28, 15, -16, -11, 1, 14, 11, -9, -17, 2, 9, 20, -8, -25, -11, 32, 18, -14, -23, -9, 19, 15, -6, -33, -17, 17, 35, 18, -25, -40, -2, 35, 34, -6, -40, -27, 23, 43, 23, -35, -43, 3, 43, 31, -16, -33, -17, 21, 29, 11, -30, -31, 6, 24, 10, -10, -16, -5, 24, 0, -6, -23, -2, 13, 17, -16, -17, 4, 19, 28, -13, -22, -1, 32, 26, 6, -20, 0, 26, 36, 17, -22, -36, -1, 32, 17, -19, -41, -26, 28, 37, 4, -38, -28, 3, 42, 26, -17, -27, -22, 24, 23]
5626B3j9l1KK9J9ql2JL1J1kk9mJ0J7pj3j2J6Pnj0qJ4J8Kk7k3J5K5Rk2qj2K9J4
5662B0j2k3j8J7L3Qj4l5NK5K1j1l5j5J8K8J2k7k5ML4J9j5k1oJ7K3rk0j3OJ5Kj6
5696hJNR%pqQJ2mj9KjJ3J0j3j8KJ6K3j2k5mJ6K6Lk0l4J1K1J2nk2lRK8Jl1j3jJ9
5736aJ9j4j5nJ4Qnjj2J2%Qj4j0JJ6Klj5PNJ7oj3oJ1J0lj3j%K3j0j3qJ1QK3k3k5
5776b1RJ4J4j1nj4LJ4J7k2j8oJ6J6j7mKQJ4nnj2kJ7J5pkoQNjj0j1J3oMnQrJ3q
5817ConjK0oj5lmJ3K2k1j3OMJ1klk4K0J8j0Jj2OKJ3Kk2KK1qMjk1NRmkp%%RNj0
5861d%nJ4nKnqJ2KrmJ1qQJj0NlMJ5k1OlJ6Pj7j1J0JJ0mnj4NRJ4nk4nK0J1nj7J
5905hJ0jJ1j6j5J0J3rOkpMJ5qm%kK2j4oLjQlj3mJ2MJ5kj8lJ7JMk2%lK5j9Mj6r
$$ y = [23, 4, -27, -25, 4, 23, 15, -17, -16, 15, 26, 24, -5, -9, 1, 18, 11, -2, -14, 2, 9, 4, -6, -14, 0, 18, 20, -7, -30, -15, 10, 19, -3, -11, -23, 6, 20, 8, -15, -33, -16, 17, 25, 11, -24, -19, 6, 27, 16, -19, -34, -16, 12, 24, -3, -28, -24, 10, 29, 14, -7, -13, 4, 27, 18, -2, -15, -9, 6, 8, -8, -7, -2, 7, 7, 0, -8, 0, 12, 8, -11, -9, -10, 3, 13, 0, -18, -16, 0, 23, 11, -14, -18, -2, 24, 27, 7, -27, -16, 5, 17, 12, -10, -13, -4, 24, 25, -6, -19, -20, -1, 18, 4, -11, -16, -2, 6, 1, 0, -12, 0, 0, 8, -6, -16, -15, 1, 3, 0, -15, -8, -3, 14, 8, -5, -11, 0, 10, 7, -6, -7, -7, 16, 6, -7, -15, -4, 4, 27, 4, -21, -12, 2, 16, 5, 0, -14, -11, 3, 20, -2, -20, -26, -10, 6, -11, -15, -13, -5, 9, 4, -1, -13, -15, 2, 17, 10, 8, 2, 10, 15, 14, 4, -7, 6, 0, 4, -1, 7, -2, 11, 3, -3, -8, -9, 11, 5, -10, -13, -17, -4, 18, -3, -16, -10, -6, 5, 3, 0, -24, -4, 14, 4, 5, -7, -1, 1, 14, 16, -6, -4, 17, 9, 13, 12, -9, -4, 5, 1, -1, -8, -8, -8, 1, 6, -4, -4, -9, 5, 0, 2, -3, -11, 1, 3, -6, -10, 1, -7, 1, 2, -8, -3, -6, -2, 13, -8, -2, -5, 11, 18, 1, -10, 0, 1, 11, 7, 2, -12, -7, 2, 16, 11, -13, -18, 2, 13, 8, -9, -8, 2, 1, 12, -4, -19, -9, 4, -5, 1, -1, -8, -4, 11, 3, -1, -1, -3, 19, 5, -1, 2, 1, 9, 6, -7, -11, 1, 5, 20, 18, 0, -3, 14, 15, 19, -3, -3, -6, 19, 0, 4, -12, -21]
5948b1K6%lj0RqPPj1j5MK3J6j4j6kNJ1mpqJ6jRj0pQMRj1loMOmkj5J7L%j9pNK4
5992ILk3mqK6J2mk5j1K0K1Ok9j0MJ8Mj1omQK1Kk8pJ3J6nj6kRlK0j3k0jJ5QJj9
6032a3PmJ4kj1j3J7LJ0qk5J5J9J4k5j8RJ3J8nl5J5LJ9Ok4j6PJ9Rj3j5j0K0K1j7
6068Dj5jKK2%k1j6J1J1J1j2k0KK4Llk2LJ4MJrr%K5J8l8rJ7K7nj4k3pK8K6k0k0
6106a1qJ0K9Ml0j9J0L0J0k3k7LK1J0Ll3oPL8Jj7k4J7NK6j6k9KK3J3nj7j0J7J1
6141A5Nk6j3K0J5Ok8rJJ9J5ol7OL0Lml1k0K4K7Rk8l9K7K5J7j5k0k2M4Rnj8j8J4
6177hK4Kk0j6qL4J1rk6kJ4J6Mj9j7K5J5j2j9JKJ9Mj9j9QK5Nj9j5kK2J4%l4j3J9
6214a3L2kk0k4jL4L8l1l4pL4L2qk4l3J5L4Qk0k5NK2J5j3l2KPJ6J0k1k2J0L0nj8
$$ y = [-21, 5, 5, 2, -8, 1, -7, 0, 7, -4, -19, -15, 8, 24, 10, -6, -8, -3, 8, 4, -3, -11, 5, 4, 13, 3, -4, 4, 8, 17, 6, 3, -3, 1, 7, 3, 1, -14, 3, 6, 6, -13, -20, -15, 9, 12, -11, -15, -23, 3, 15, 11, -14, -25, -5, 16, 22, -7, -17, -13, 5, 9, -2, -8, -12, -4, 17, 19, -9, -16, -3, 13, 8, -8, -10, -1, -4, 16, 3, -17, -18, -3, 5, 6, -13, -6, -10, 4, 2, -9, -22, -5, -2, 8, 0, -25, -10, 9, 23, -2, -20, -11, 2, 20, 15, -20, -5, -2, 17, 23, -1, -17, -10, 9, 18, 5, -10, -20, 0, 21, 4, -11, -12, -10, 12, 12, -9, -25, -14, -3, 8, -4, -24, -22, 2, 5, 2, -20, -17, -3, 1, 2, -7, -16, -16, 9, 27, -11, -20, -3, 24, 19, 5, -18, -25, 3, 29, 9, -11, -19, -9, 20, 24, -6, -25, -15, 15, 25, 2, -25, -22, -1, 9, 12, -21, -27, -20, 18, 19, 2, -22, -5, 0, 26, 10, -19, -17, 6, 19, 14, -3, -13, 4, 15, 20, -6, -19, 1, 16, 22, -6, -15, -14, 5, 20, 14, -23, -17, 13, 16, 12, -19, -39, -15, 12, 21, -7, -46, -19, 6, 23, 8, -12, -34, 10, 19, 14, -4, -22, -8, 16, 18, -2, -18, -26, 8, 19, 10, -16, -18, -4, 12, 16, -3, -20, 5, 20, 8, -11, -10, -8, 11, 15, -4, -23, -15, 10, 15, -4, -19, -21, 1, 15, 15, -19, -32, -13, 19, 17, -3, -27, -28, 6, 44, 13, -21, -28, 6, 38, 30, 6, -27, -12, 22, 30, 10, -15, -10, 12, 27, 14, -18, -16, -9, 7, 17, -4, -26, -16, 14, 9, -9]
6249ij1RK6Mk6j6KK7J9k0k5lJ9M4j5m0nJ7L2Jk7l6J7L8Rk1l2MK0J7J0l9k6J9K1
6284DJ8j8l3MJ8K3nl3%L0Pmk1nK0J4Jk3j2RJ7joqnL2jj3k3NK1J9qm0KNK6J3k7
6323Bl4RK2K2j7l1nJ7L7Ml4j2kK8J8j3k9oL4J8j5l1oJ7J6Oj0k8RL1Ok2j6J1J3
$$ y = [-9, -20, -11, 15, 19, -7, -23, -21, 6, 25, 5, -20, -23, -4, 40, 25, -15, -20, -3, 29, 30, 3, -33, -16, 22, 31, 10, -22, -18, 2, 19, 29, -10, -36, -17, 4, 22, 4, -29, -25, -7, 16, 11, -22, -22, 8, 15, 11, -10, -15, 5, 19, 20, -3, -15, -6, 11, 10, 4, -4, -9, 23, 22, 9, -14, -9, 12, 31, 23, -17, -15, -10, 16, 29, 2, -32, -23, -1, 21, 4, -27, -32, -15, 22, 26, -8, -20, -22, 6, 24, 11, -18, -24, 10, 28, 13, -18, -24, -7, 9, 15, 5, -23, -14, 17, 23, 1, -15, -4, 9]
$$ [...]
8191c
##END NTUPLES=NMR FID
##END=
