##TITLE=1H_IG-MegLut
 CDCl3
 8 sc, 
 3.4.2024
##JCAMPDX= 6.0         $$ Bruker NMR JCAMP-DX V2.0
##DATA TYPE= NMR FID
##DATA CLASS= NTUPLES
##ORIGIN= UXNMR, Bruker Analytische Messtechnik GmbH
##OWNER= root
$$ XWIN-NMR		Version 3.5
$$ Wed Apr  3 13:53:47 2024 Russian Standard Time (UT+4h)  she@DPX200
##.OBSERVE FREQUENCY= 200.1309
##.OBSERVE NUCLEUS= ^1H
##.DELAY= (6, 6)
##.ACQUISITION MODE= SIMULTANEOUS
##.ACQUISITION SCHEME= undefined
##.AVERAGES= 8
##.DIGITISER RES= 18
##SPECTROMETER/DATA SYSTEM= spect
##.PULSE SEQUENCE= zg30
##.SOLVENT NAME= MeOD
##.SHIFT REFERENCE= (INTERNAL, MeOD, 0, 15.7039)
##AUDIT TRAIL= $$ (NUMBER, WHEN, WHO, WHERE, WHAT)
$$ ##TITLE= Audit trail, XWIN-NMR		Version 3.5
$$ ##JCAMPDX= 5.01
$$ ##ORIGIN= Bruker BioSpin GmbH
$$ ##OWNER= she
$$ F:/spectra/data/she/nmr/H-F/1/audita.txt
$$ ##AUDIT TRAIL=  $$ (NUMBER, WHEN, WHO, WHERE, WHAT)
(   1,<2024-04-03 13:52:23.09 +0400>,<she>,<DPX200>,
      <created by zg, POWCHK disabled, PULCHK disabled
       configuration hash MD5:
       00 E9 B6 7A A2 85 ED C7 34 08 36 98 17 FE 4E 26
       data hash MD5: 16K
       34 B8 01 16 55 74 44 D4 68 0F CD FD F2 93 57 F0>)
$$ ##END=
$$ 
$$ hash MD5
$$ D0 6E E0 09 53 3D CF 38 09 A6 5F 6C 96 FA 6C F7
##$RELAX= 
##$RELAX= 
##$RELAX= 
##$RELAX= 
##$RELAX= 
##$RELAX= 
$$ Bruker specific parameters
$$ --------------------------
##$DU= <F:/spectra>
##$EXPNO= 1
##$NAME= <H-F>
##$PROCNO= 1
##$TYPE= <nmr>
##$USER= <she>
##$AMP= (0..31)
100 100 100 100 100 100 100 100 100 100 100 100 100 100 100 100 100 100 
100 100 100 100 100 100 100 100 100 100 100 100 100 100 
##$AQSEQ= 0
##$AQ_mod= 1
##$AUNM= <au_zg>
##$AUTOPOS= <>
##$BF1= 200.13
##$BF2= 200.13
##$BF3= 200.13
##$BF4= 200.13
##$BF5= 200.13
##$BF6= 200.13
##$BF7= 200.13
##$BF8= 200.13
##$BYTORDA= 1
##$CFDGTYP= 0
##$CFRGTYP= 5
##$CHEMSTR= <none>
##$CNST= (0..31)
1 1 145 1 1 1 1 1 1 1 1 1 1 1 1 1 1 1 1 1 1 1 1 1 1 1 1 1 1 1 1 1 
##$CPDPRG= <>
##$CPDPRG1= <>
##$CPDPRG2= <>
##$CPDPRG3= <>
##$CPDPRG4= <mlev>
##$CPDPRG5= <mlev>
##$CPDPRG6= <mlev>
##$CPDPRG7= <mlev>
##$CPDPRG8= <mlev>
##$CPDPRGB= <>
##$CPDPRGT= <>
##$D= (0..31)
0 1.2 0 0 0 0 0 0 0 0.06 0 0.03 0 0 0 0 0.0002 0 0 0 0 0 0 0 0 0 0 0 0 
0 0 0 
##$DATE= 1712137942
##$DBL= (0..7)
120 120 120 120 120 120 120 120 
##$DBP= (0..7)
150 150 150 150 150 150 150 150 
##$DBP07= 0
##$DBPNAM0= <>
##$DBPNAM1= <>
##$DBPNAM2= <>
##$DBPNAM3= <>
##$DBPNAM4= <>
##$DBPNAM5= <>
##$DBPNAM6= <>
##$DBPNAM7= <>
##$DBPOAL= (0..7)
0.5 0.5 0.5 0.5 0.5 0.5 0.5 0.5 
##$DBPOFFS= (0..7)
0 0 0 0 0 0 0 0 
##$DE= 6
##$DECBNUC= <off>
##$DECIM= 32
##$DECNUC= <off>
##$DECSTAT= 4
##$DIGMOD= 1
##$DIGTYP= 9
##$DL= (0..7)
0 120 120 120 120 120 120 120 
##$DP= (0..7)
150 150 150 150 150 150 150 150 
##$DP07= 0
##$DPNAME0= <>
##$DPNAME1= <>
##$DPNAME2= <>
##$DPNAME3= <>
##$DPNAME4= <>
##$DPNAME5= <>
##$DPNAME6= <>
##$DPNAME7= <>
##$DPOAL= (0..7)
0.5 0.5 0.5 0.5 0.5 0.5 0.5 0.5 
##$DPOFFS= (0..7)
0 0 0 0 0 0 0 0 
##$DQDMODE= 0
##$DR= 18
##$DS= 0
##$DSLIST= <SSSSSSSSSSSSSSS>
$$ [...]
##$SUBNAM2= <"">
##$SUBNAM3= <"">
##$SUBNAM4= <"">
##$SUBNAM5= <"">
##$SUBNAM6= <"">
##$SUBNAM7= <"">
##$SUBNAM8= <"">
##$SUBNAM9= <"">
##$SW= 18.0517689322627
##$SWIBOX= (0..15)
0 0 2 0 0 0 0 0 0 0 0 0 0 0 0 0 
##$SW_h= 3612.71676300578
##$TD= 16384
##$TD0= 1
##$TE= 0
##$TE2= 300
##$TE3= 300
##$TEG= 300
##$TL= (0..7)
0 120 120 120 120 120 120 120 
##$TP= (0..7)
150 150 150 150 150 150 150 150 
##$TP07= 0
##$TPNAME0= <>
##$TPNAME1= <>
##$TPNAME2= <>
##$TPNAME3= <>
##$TPNAME4= <>
##$TPNAME5= <>
##$TPNAME6= <>
##$TPNAME7= <>
##$TPOAL= (0..7)
0.5 0.5 0.5 0.5 0.5 0.5 0.5 0.5 
##$TPOFFS= (0..7)
0 0 0 0 0 0 0 0 
##$TUNHIN= 0
##$TUNHOUT= 0
##$TUNXOUT= 0
##$USERA1= <user>
##$USERA2= <user>
##$USERA3= <user>
##$USERA4= <user>
##$USERA5= <user>
##$V9= 5
##$VALIST= <valist>
##$VCLIST= <CCCCCCCCCCCCCCC>
##$VD= 0
##$VDLIST= <DDDDDDDDDDDDDDD>
##$VPLIST= <PPPPPPPPPPPPPPP>
##$VTLIST= <TTTTTTTTTTTTTTT>
##$WBST= 1024
##$WBSW= 4
##$XGAIN= (0..3)
0 0 0 0 
##$XL= 0
##$YL= 0
##$YMAX_a= 76258
##$YMIN_a= -76061
##$ZGOPTNS= <>
##$ZL1= 120
##$ZL2= 120
##$ZL3= 120
##$ZL4= 120
##$ABSF1= 10
##$ABSF2= 0
##$ABSG= 5
##$ABSL= 3
##$ALPHA= 0
##$AQORDER= 0
##$ASSFAC= 0
##$ASSFACI= 0
##$ASSFACX= 0
##$ASSWID= 0
##$AUNMP= <proc_1d>
##$AZFE= 0.1
##$AZFW= 0.1
##$BCFW= 1
##$BC_mod= 2
##$BYTORDP= 1
##$COROFFS= 0
##$CY= 11.3945322036743
##$DATMOD= 1
##$DC= 2
##$DFILT= <>
##$DTYPP= 0
##$F1P= 15.7292609196834
##$F2P= 12.9074282941183
##$FCOR= 0.5
##$FTSIZE= 0
##$FT_mod= 4
##$GAMMA= 1
##$GB= 0.15
##$INTBC= 1
##$INTSCL= 1
##$ISEN= 128
##$LB= 0.24
##$LEV0= 0
##$LPBIN= 0
##$MAXI= 10000
##$MC2= 0
##$MEAN= 0
##$ME_mod= 0
##$MI= 1.114404
##$NCOEF= 0
##$NC_proc= 0
##$NLEV= 6
##$NOISF1= 3.799351
##$NOISF2= 2.8
##$NSP= 1
##$NTH_PI= 0
##$NZP= 0
##$OFFSET= 15.70392
##$PC= 1
##$PHC0= -25380.09
##$PHC1= 12.78731
##$PH_mod= 1
##$PKNL= yes
##$PPARMOD= 0
##$PSCAL= 0
##$PSIGN= 0
##$REVERSE= no
##$SF= 200.130013532006
##$SI= 16384
##$SIGF1= 3
##$SIGF2= 2
##$SINO= 400
##$SIOLD= 16384
##$SREGLST= <1H.CDCl3>
##$SSB= 0
##$STSI= 0
##$STSR= 0
##$SW_p= 3612.71676300578
##$SYMM= 0
##$S_DEV= 0
##$TDeff= 0
##$TDoff= 0
##$TI= <>
##$TILT= no
##$TM1= 0
##$TM2= 0
##$TOPLEV= 0
##$USERP1= <user>
##$USERP2= <user>
##$USERP3= <user>
##$USERP4= <user>
##$USERP5= <user>
##$WDW= 1
##$XDIM= 8192
##$YMAX_p= 0
##$YMIN_p= 0
$$ End of Bruker specific parameters
$$ ---------------------------------
##NTUPLES= NMR FID
##VAR_NAME=  TIME,          FID/REAL,        FID/IMAG
##SYMBOL=    X,             R,               I
##VAR_TYPE=  INDEPENDENT,   DEPENDENT,       DEPENDENT
##VAR_FORM=  AFFN,          ASDF,            ASDF
##VAR_DIM=   8192,          8192,            8192
##UNITS=     SECONDS,       ARBITRARY UNITS, ARBITRARY UNITS
##FACTOR=    0.0002768,     1,               1
##FIRST=     0,             0,               0
##LAST=      2.2672688,     0,               0
##MIN=       0,             -76061,          0
##MAX=       2.2672688,     76258,           0
$$ Real data points
##PAGE= N=1
##DATA TABLE= (X++(R..R)), XYDATA
0@%%%%%%%%%%%%%%%pJ4j4J4j4K1k8K8l5M2m9N6o3P5q2R1j05J19j40J61j80K01
37A05k24K52k80L12l46L83m25M72n22N74o35P02p72Q50r37J033j140J259j393
56g32J544j717J917k153K435k777L204l756M501n564P213j0141J6897o0323j6151
71f5603J30828N602o5045l7154K4964j0399j8874L4561O7130j4734q3310m4027
83g6061N1068O5697J0720l9919l6220q372J9548K2464J1497r8p250k7653l1125
96d5704J5457O7948L2117n9756p3775J5740O8270J7514l1723m114J4325l0950
108a4651m3445L5648Q4123O723q4812n2432M0452N4103L09j7521K314p542l3052
121b9783r173M3503M4415j2920n2697l0144K0770M3594K0283j9439l1819j0081
$$ y = [0, 0, 0, 0, 0, 0, 0, 0, 0, 0, 0, 0, 0, 0, 0, 0, -7, 7, -7, 7, -7, 14, -14, 14, -21, 21, -28, 28, -35, 40, -42, 49, -56, 63, -77, 84, -96, 105, -119, 133, -147, 165, -181, 202, -223, 249, -273, 301, -334, 368, -404, 446, -491, 542, -598, 661, -732, 812, -905, 1012, -1141, 1294, -1483, 1721, -2035, 2466, -3098, 4115, -6026, 10871, -49452, -65603, 65225, 70827, 5782, -31372, -6408, -16807, -35681, -1120, 66010, 51276, -32034, -76061, -24993, 40704, 51424, 11505, -24715, -33087, -13539, 8925, 20422, 20324, 13074, -14579, -45704, -30247, 37701, 69818, 10062, -63713, -47973, 20297, 37811, 6088, 1974, 16299, -14651, -58096, -22448, 61675, 68398, -16414, -68846, -28394, 25709, 26018, 8497, 10811, 3269, -29783, -38956, 4547, 48962, 36042, -16655, -46799, -26029, 17565, 37848, 18409, -13410, -23491]
133b3491J0449R861J0318J8908J538m0158l9798K4120O4817J6886m9644m0470
145c6664J3216K4380J197N730K1619p462m9270k5420M2296N5018l558m6696k6125
158c1739J1001J8318J1011J0310J847k0593k8182j661L1778L1701m002l5799k8108
171c4118R586L2976J8198r944j8282j0756o110K381K2450K6997p013m2326k6150
184d2111K3849M0384Q475k1097j8010o290l200P304K5174J8499j7745l8113j2439
197c5320K6525L1248L715j9160j9109o964N713J5718J6845J982j9541k4385k795
210b5528K4366K6293k59k5340k2156J597J8700J7035N194q464j9268j7043M727
223b0146K7508K2623q543l0207j8684R028K2566J5107l46j3627j9105r930J1796
$$ y = [-23491, -13042, -3181, 7137, 26045, 27583, -12575, -52373, -28253, 36564, 53450, 3806, -36664, -23448, 932, 2129, 7859, 29478, 22016, -27254, -52674, -10378, 44640, 41082, -5614, -31739, -20738, -2420, 8591, 18901, 20748, 155, -28027, -29688, 2090, 33791, 29789, -6010, -34118, -24532, 8444, 26642, 16698, -1584, -12340, -18450, -16069, 6381, 33378, 26365, -15961, -42111, -18262, 22122, 30597, 9500, -8510, -14800, -18000, -10696, 14478, 32977, 15232, -22881, -35320, -8795, 22453, 26168, 7008, -12101, -19065, -13352, 2366, 19211, 21193, 1652, -22733, -25528, -1162, 25131, 24872, -468, -22624, -21027, -2327, 14708, 19902, 11438, -7830, -24873, -20146, 7362, 29985, 21442, -8765, -27449, -18421, 4145, 19252, 18906, 5279, -13826, -23756, -11960]
236a1960K5432J3294j3868k6133j1366J2662K1585J0726p082j7386j3973J018
248a7051J6717J8625K205j8132k1239k902J8226K0925M086j5096j9774p932J0158
261a1184K0125J3366o301k1664j7257M106K1606J8331j515j8590j8374k745J4468
274e628J9152P400j1345k0245j0531R375K0187J1804p235j8607j2789M101J6818
287B457J4620p13j5805j6765k016J5119J8264M354j3654j8943p165J0955J9327
300A0035J0687p856j9660j3865M828J9170J6089j523j7425j7526k168J4926J8569
313A4281N670j2424j9135q360J0058J8799J0189p427j7722j1878M594J6697J3653
326A6995j927j5886j5222l85J4865J6282K739j3193j7019n611J0883J7715Q763
$$ y = [-11960, 13472, 26766, 12898, -13235, -24601, -11939, 9646, 20372, 13290, -4096, -18069, -17051, -334, 18291, 20496, 2364, -18875, -21777, -3551, 17374, 21460, 6364, -13410, -21342, -11184, 8941, 22307, 16006, -5658, -22915, -18809, 2797, 21128, 19613, 1023, -17351, -20096, -5628, 13524, 20924, 9579, -10666, -21197, -11822, 8365, 20169, 12934, -5673, -18462, -14361, 2457, 17077, 16364, 559, -16206, -18222, -3103, 15161, 19515, 5861, -13082, -20247, -9292, 10035, 20722, 12866, -6794, -20659, -15831, 3339, 19428, 17905, 480, -17046, -19214, -4288, 14281, 19951, 7527, -11608, -19968, -9910, 8889, 19078, 11651, -6071, -17949, -13355, 3342, 16995, 15068, -818, -16040, -16425, -1560, 14722, 17461, 4268, -12751, -18362, -7479, 10236, 18999]
339A8999q394j8120j1425N789J7564J3346k660j5866j4902j003J3706J6368M390
352A7792j1880j7298o634J0182J6926P954p707j5500r546M438J4431J2009j547
365A3620j4529j4321L5J4782J5013Q32j3309j4385l191R898J4558P542o726j6433
379f614j1458N519J7842J2629m696j6258j2161J656J2443J2805L287r526j5247
392i779p159Q948J7131Q245q929j6538p691P367J3814P891l413j1233j0792j306
406a3444J1514J5351L188j4292j7152j453J4597J4028J257r000j0938p040K371
419a1013J3545J4236j619j8292j5125M464J7066J0944k887j0373r551l695N661
432f639J2868Q960n613j6043r974O843J6296Q671p019j3873o701M485R038P147
$$ y = [18999, 10605, -7515, -18940, -13151, 4413, 17759, 15099, -767, -15669, -16672, -2966, 13402, 17792, 5912, -11386, -18020, -7838, 9088, 17042, 9335, -6165, -15711, -11273, 3158, 15167, 13620, -909, -15230, -15195, -413, 14600, 15432, 2123, -12262, -15453, -5555, 9003, 16545, 9819, -6614, -18072, -12553, 5289, 17918, 13222, -3036, -15197, -13541, -1098, 11707, 14994, 5468, -9779, -16938, -7990, 9141, 17386, 8457, -8081, -15772, -8405, 5409, 13300, 9887, -1346, -12138, -13444, -1930, 13421, 16609, 2317, -14835, -16288, -1691, 12337, 13594, 4594, -6344, -13384, -11013, 2532, 16768, 15149, -3143, -18268, -13804, 3262, 14206, 11319, 946, -8605, -12300, -6639, 6229, 15189, 9576, -6467, -16441, -9598, 6698, 15369, 8350, -5523, -12224, -7739, 1299, 8446]
446H446K307n885j3382q419R858K0091O003j5667j6909L19J1041P431L181J435
460I850o882j5349n608J5957J9827j148j8817j2528M056J0475P069K773k834r929
474c088r738K076J3868J1727l213j5393j1761M593J5755R086o114j1079m412P32
488f961K221P891J1140k271k0089j3492J3314K2539K121j5551q817K323L94J62
502e076J0926J1269r378k2199m880J8593J6174l730j2683o519p1K804O565P588
516I383L6r879j0836o31J1814J3705O5j5783j3315N467J5002M656n705k684j005
531B90q391n462J3917J9373n132k5136r542J6324J4523l652o094J781l318j1361
545a1880O84J8735J1621j2922j9321j317J3403R683l43n118n942m726M16O599
$$ y = [8446, 10753, 4868, -8514, -16933, -7075, 13016, 19019, 3352, -13557, -13238, -2197, 5234, 8415, 9850, 2968, -12381, -17989, -2032, 17795, 16647, -2170, -14698, -10642, -167, 6902, 9675, 6841, -3088, -12826, -10750, 3118, 14845, 11632, -3761, -15522, -10929, 4826, 13912, 7798, -3281, -7693, -6961, -4740, 3151, 14291, 12020, -8069, -21561, -8247, 14292, 16413, 862, -7955, -5632, -5238, -5076, 5850, 17119, 7741, -14458, -19338, -745, 15429, 11699, -984, -7503, -7574, -4770, 1795, 9383, 9419, -460, -11296, -11927, -113, 13592, 13657, -2126, -15441, -9974, 5028, 9684, 3979, 1295, 290, -8101, -13563, 354, 19727, 14595, -10541, -20083, -3759, 10764, 7112, 1018, 2799, -519, -11880, -11196, 7539, 19160, 6238, -13083, -14400, -997, 8686, 8343, 3225, -2717, -7443, -7027, -428]
559d28Q179K756p141j3294n213J2619J7356o91j7439r707P347P806p74K170O847
574A0393n796j8640l767K1429J7083j0914j9883j608J0479L155j300N317L302
587I250j0936j3110M908J7792P412j0391j3302k338P404Q085K659l013n191m436
601e207k195L113R847P756p052j7087n122J4765J4357l824j1613k593K195k650
615e310N05J1962Q173j2301j8533J486J8355R217p928r016p07M00j120M601R245
630I029O37j1958j0413M203J3366O998n881j0701m243M444O512L153L11k123o546
645c212p109K848J3742Q479r228j5500k143J0909P803j083k340j563o039o051
659a0487N631J4210M294j2303j2827J777J0863O045j638l710l782m136m81O867
$$ y = [-428, 7751, 10507, 3366, -9928, -15141, -2522, 14834, 14143, -3296, -13003, -5656, 2150, 1376, 3546, 10393, 4597, -14043, -17810, 3619, 20702, 9788, -10095, -11703, -1224, 1931, 631, 5948, 9250, -1686, -14796, -9888, 7904, 15316, 4925, -8377, -10715, -3311, 4774, 7433, 4420, -771, -5207, -7402, -4289, 5558, 13314, 6262, -10825, -15947, -1182, 13175, 9351, -2262, -4855, -2660, -5310, -4805, 7157, 15330, 3029, -15504, -14018, 4337, 13554, 5626, -3390, -4097, -3697, -4817, -216, 9029, 9666, -2292, -12705, -8502, 4864, 11862, 5981, -4720, -8963, -4519, 1993, 5146, 5457, 3334, -3212, -10321, -7473, 6269, 14748, 5520, -9980, -12123, -1214, 6589, 5506, 3166, 1603, -4436, -10487, -4856, 9354, 13648, 1345, -11482, -9705, 1158, 7203, 5565, 1855, -1927, -6063, -6544, 323]
673C23Q575k07j0240q998K513J0820O841l506q123m331J020L577M939M454j564
688F093r371p985M173J2505O039o629r770k708L550M608M171K459l485r008m975
703a0333O338J1109L014p707q779j302N141N789K880j306n419o190o23P187Q341
718H140K40q544q105N71P611O539L63m757n978l389K273P478O367j971r241o897
734i300K629Q753N729j740o251n393j029M189O852L537m075q399m097M607Q299
749D311L605l978o968l740K037N926N162j34n989o797q07O390P427J161n956p102
765e452j939M472O757L474k752o849n070J505P013N972p23o585o114k25N466O121
781E071J518m240o331k792L360O629L698k776o672m208K102O324M693j124n861
$$ y = [323, 8898, 8691, -1549, -10547, -8034, 2786, 9627, 6121, -2002, -6333, -5313, -1736, 3203, 7657, 6093, -3278, -11263, -7090, 5415, 11454, 4825, -4945, -7653, -4103, 505, 4676, 7135, 3650, -5358, -10333, -3995, 7114, 10128, 2421, -6358, -7660, -2519, 3270, 6150, 4844, -575, -6765, -7388, -201, 8140, 8380, -164, -8269, -7698, -87, 6452, 6815, 2058, -3920, -7309, -5036, 2442, 8809, 6838, -2403, -9300, -6671, 2082, 7811, 6071, -180, -5573, -6602, -2413, 4439, 7976, 3901, -4498, -8595, -3988, 4311, 7916, 3938, -3030, -6770, -4733, 1193, 6355, 6221, 232, -6565, -7372, -982, 6445, 7606, 1650, -5452, -7391, -2919, 3838, 7312, 4560, -2289, -7359, -5854, 1159, 7131, 6408, -177, -6291, -6516, -1050, 5071, 6589, 2349, -3982, -6774, -3414, 3215, 6913, 4137, -2535, -6743, -4641, 1683, 6376, 5252, -609]
796f09n359o4N431O172J199n044o753k202M430O979L154l469o879m131K233O570
812A658N049r65o101n758k31N512O233J245m848o368k021M043O216K715l029n976
828b626l558J976N856M498j132n944n157N70N749N427J41m992n561j362L912N999
844C796K854l101o623l933K621O720M295j923n924m464N43M780N112J135m137
859A751o034k171M049O406K355l745n852k425K583M956L252r45m678m716j89N181
875b22N812L93n556n722l37M631M897J336k642m799l514J200N925N228j300o815
891a485n023J684N837L998n81l713m141j727K530N578L379k952o745l328L623
906c066O375K499l040m820k424R78L477M057J309l851o319j922N354O894O94n448
$$ y = [-609, -5968, -6032, -601, 5571, 6770, 1726, -5027, -7229, -2799, 4180, 7334, 3865, -3014, -7145, -4912, 1658, 6707, 5742, -359, -6117, -6348, -836, 5397, 6642, 1794, -4574, -6595, -2552, 3664, 6379, 3350, -2626, -6184, -4208, 1648, 6146, 5014, -930, -6087, -5517, 232, 5659, 5800, 808, -4753, -6115, -2203, 3796, 6650, 3549, -3074, -7007, -4386, 2334, 6629, 4706, -1218, -5682, -5139, -359, 4753, 5888, 1751, -4283, -6454, -2405, 4001, 6356, 2611, -3241, -5666, -3083, 1873, 5125, 4180, -498, -5214, -5403, -222, 5590, 5983, 427, -5295, -5632, -1001, 3896, 5232, 2590, -2209, -5723, -4523, 1402, 6630, 5330, -1485, -6508, -4824, 1013, 5011, 4430, 717, -3424, -5151, -2621, 2957, 6336, 3384, -3361, -6689, -3066, 3309, 5808, 2768, -2052, -4476, -3498, -21, 4036, 5345, 1494, -4825, -6747, -1393, 5501, 6195, 747]
922G47m949k88K650L231K777L35m274n839m38O439O002j242o165l862J131L408
938c37K938J281j314m163l650J308N896M329k324o551l480K966N420K145j779
953B685k876k500j535J587N517M016l616q022k559N802O195n2l597k359j374j135
969c823K086N710K637n243p276k45O411M867j107l935k722o16J118L043L165p9
985C991m486m869M13O063N178j858o509l334K636L930J396J74l00l366m795Q78
1001d858P804N056m840p966r24M954L105j80J62m72m022l620L137P239J960n701
1017H34n789M05M392L183J12j745k421k010j07K816M106J143m350n900j92O376
1033H53M991k222n191j525J369L76J075L925J631n684o767K074Q489L294m859
$$ y = [747, -4202, -4490, -1840, 1391, 4168, 4503, 229, -5610, -6048, 391, 6393, 5151, -1014, -4876, -3745, -337, 2601, 3882, 2568, -1595, -5245, -3937, 1959, 6288, 3964, -2587, -6067, -3101, 2319, 4464, 2685, -191, -2691, -4226, -2639, 2878, 6894, 3278, -4744, -7303, -1501, 4694, 4642, 1045, -1314, -2688, -3823, -1737, 3973, 6610, 1367, -5909, -6154, 257, 5124, 4017, 82, -2640, -3256, -2138, 905, 4070, 3991, -495, -5364, -4951, 1112, 6290, 4432, -2077, -5411, -2775, 1155, 2551, 2725, 2425, -941, -5736, -4858, 2946, 8002, 3162, -4804, -5728, -774, 2331, 2151, 2313, 1841, -2181, -5801, -2664, 4575, 6535, 834, -4955, -4550, -158, 3025, 3137, 1392, -1029, -3039, -3146, -330, 3776, 4919, 569, -5331, -5523, 853, 5844, 3622, -1569, -3094, -1725, -1349, -274, 3651, 5282, -402, -7169, -5095, 3394, 6688, 1829]
1048A829m801K08J447K63K041L342r75o030l581L870O413J379m226m466o34K567
1064a354L009J318o24k119k915j555K575N612K125n144o471M56N966L211j824
1079B266j993m99j968k047L126O414N88p145n326L123O048J305k426j646r20j714
1095b814N0L972L775j791n761k857L120N158J670k763l761j241J354K103J893
1110B107J171j361m344k990L101O397J619n032m731P63L074J331N98J157j350
1125A510m670k158M508N887m21n576l307J656K931J428M37l66k442l008L03M304
1141A016L665j356m988k993J959M293K069j430k648j845n51J185L313K752j672
1156B769n364k790L351N237R77l076k788o48K65J332K954J809k603m894j127M088
$$ y = [1829, -2972, -2764, -1317, -1054, 987, 4329, 3354, -2676, -6257, -2387, 4026, 5405, 1179, -3287, -3921, -1354, 1655, 2973, 2349, 230, -2685, -4240, -1665, 3947, 6072, 928, -5543, -5087, 879, 4090, 2266, 273, -226, -2194, -4241, -1115, 5299, 5887, -1258, -6584, -3461, 2587, 3892, 1466, -180, -1100, -2814, -2764, 1208, 4983, 3192, -2569, -5426, -2306, 2852, 4522, 1759, -2002, -3243, -1889, 214, 2107, 3278, 1917, -2427, -5417, -2316, 4081, 5700, 668, -4063, -3300, -226, 1105, 1703, 2860, 1510, -3160, -5318, -810, 5077, 4656, -920, -4227, -2571, 360, 1788, 2225, 1859, -583, -3591, -3288, 1016, 4681, 3325, -1663, -4656, -2697, 1596, 3665, 2235, -413, -2258, -2809, -1624, 1689, 4441, 2769, -2595, -5385, -2034, 3203, 4180, 1104, -1684, -2332, -2067, -735, 2219, 4028, 1425, -3469, -4596, -508]
1172e08M222k49l354k506q9J346K018J836j10k958l250K47L952L466q71m047k749
1189c604R79K882K083K68j354k615k149R21M043K956j738m573k159K040L344J478
1205B802p17j867k212j114J723L667J662k509m071j097K655L295Q19j699k467
1220a130j529L74K426K748L07l026l475j54L326L322j6k769k724n69J554K651
1236A316J832p50l291k753Q26L751K695j017l295k224M99K280K280O25j685k948
1252a859j477J758L501J613j953l403j397J602K786J546o66k309k256k75K358
1267d31L055O54k600l265o34K356K870Q68j489k519j610O21K602K394k30k830
1283a88k682J56K718K553M6k214k384n90J583K510J286j189k857j824J121L096
$$ y = [-508, 3714, 3465, 111, -2395, -2484, -1138, 880, 2716, 2606, -352, -3602, -3355, 597, 4063, 3192, -855, -3604, -2625, 257, 2340, 2608, 1254, -1361, -3510, -2589, 1454, 4410, 2672, -1901, -4060, -2020, 1324, 2802, 2085, 218, -1994, -3108, -1385, 2282, 3944, 1435, -2636, -3733, -1078, 2217, 3036, 1337, -1130, -2659, -2285, 141, 2889, 3196, 170, -3305, -3459, -133, 3189, 3173, 404, -2320, -2889, -1335, 1316, 3148, 2398, -893, -3646, -2820, 931, 3626, 2609, -686, -2910, -2411, -131, 2149, 2774, 1089, -1859, -3336, -1578, 1923, 3536, 1583, -1820, -3217, -1615, 1171, 2717, 2051, -258, -2514, -2789, -431, 2624, 3278, 678, -2587, -3221, -865, 2005, 2873, 1384, -1135, -2745, -2124, 478, 2872, 2642, -188, -2870, -2714, 4, 2557, 2603, 389, -1995, -2585, -1002, 1508, 2794, 1605, -1252, -3076, -1955, 1141]
1299A141J959j046k882j931N58K340K193K60j967k736r92J920L165J266j874l063
1315a689j311J407K625J602o24k285k160q5K273K666L82k350k784m38K179K548
1331A956O08j612k333j118R80K394J819o22k708k255N36K850K266m38k497k129
1347b303l8J795K227R30j261k682j667J184L069J776j243k801j541P93K046J649
1363A933J78j566k291r13J699K819R86j883k713q05J543K237J024q00j956j666
1379b174O7K075K379K69k402k738j72K479K444J39j816j932p77P18K057J940k83
1396B273k838k473P47L091J907r21k196j391K2J188J878J132j112k730j469J531
1412a361K940J200j567k512j030J042J891J254j02j465k023q04J693K926R32k346
$$ y = [1141, 3100, 2054, -828, -2759, -2201, 139, 2332, 2592, 625, -2111, -3103, -1183, 1982, 3248, 1374, -1689, -3000, -1593, 1032, 2634, 2010, -275, -2435, -2520, -247, 2419, 2801, 451, -2333, -2771, -592, 1956, 2564, 952, -1381, -2499, -1519, 875, 2694, 2072, -636, -2891, -2355, 495, 2761, 2323, -174, -2303, -2341, -546, 1681, 2611, 1350, -1332, -2999, -1815, 1254, 3030, 1787, -1014, -2555, -1762, 284, 1933, 2111, 545, -1746, -2659, -960, 1859, 2845, 962, -1751, -2556, -1013, 1224, 2248, 1448, -508, -2174, -2107, -32, 2347, 2616, 214, -2524, -2696, -217, 2227, 2366, 550, -1382, -2159, -1441, 616, 2556, 2273, -565, -3038, -2291, 800, 2707, 1786, -410, -1801, -1779, -591, 1287, 2419, 1307, -1423, -2892, -1361, 1579, 2779, 1212, -1300, -2330, -1288, 603, 1857, 1755, 290, -1733, -2537, -844, 2082, 3014, 668]
1428F68k949k67K167J862K19o89j222j581m61K045K792M0k990k376P86K432J361
1445A837l42j138j343r22N76K166J687q50k692j727J100K700J476j072k152j129
1461a825L91J159J411J015p60k677j833J651L432R96k277k343q2J024Q41J045
1477A168Q48j165k816r68K557K989j80k655j820L87J398J256O40m53j676j599
1493b089K41K283K107l86k736k127Q03K651J408q27j431q59n68J50J897K203o50
1510B070l413j885K025K953L13j551j005l68n28M09K132J466j627l023o16K329
1526c19K243m7j588j384l70N51J252J231R0j510k056l88K129K577n6k662j968
1543b275P33J797P62N8K7j034k077l32K774K628j137l272j134J653J605K47o2
$$ y = [668, -2281, -2548, -381, 1481, 1700, 1011, -211, -1792, -2253, -208, 2584, 2624, -366, -2742, -1956, 476, 1837, 1495, 357, -986, -1908, -1332, 834, 2521, 1671, -1021, -2748, -1648, 1052, 2528, 1456, -696, -1825, -1434, -275, 1136, 2151, 1391, -1286, -3119, -1468, 1964, 2960, 683, -1660, -1742, -718, 123, 1168, 2016, 851, -1965, -2933, -376, 2613, 2433, -222, -2042, -1655, -257, 999, 1639, 1186, -490, -2089, -1848, 435, 2542, 2156, -580, -2707, -1904, 747, 2155, 1328, -103, -962, -1530, -1380, 517, 2720, 2070, -1343, -3228, -1203, 1750, 2063, 512, -493, -861, -1389, -980, 1152, 2618, 991, -2032, -2648, -319, 1924, 1877, 289, -1095, -1465, -914, 338, 1569, 1659, 149, -1907, -2295, -166, 2411, 2355, -307, -2275, -1542, 255, 1017, 1075, 1102, 68, -2009, -2341, 433, 3061, 1924, -1348, -2482, -829, 776, 1023, 961]
1560I61k35j371j467P43K665J366j666k627o68J626J906M96r26j323q26J2J009
1577c25J669Q30j425k661p33K342K562k43k175j201L00M46N79J354P03j827k648
1594b453J63K962J883j226k167o20N73O49Q31Q94l08j901j500Q55K424J259j209
1611A109k207q69J032J579O92k88q00j141q70P09K239J339j542k737n46J958J730
1628A387q8q26o26q14o15J011K223O30k126k325K92K168J385m38j164r12m37L52
1646i23J326J335k68j960j653N73K231J447p96j897r81M65J030R44N61m54j719
1663g39j409Q57K453J138j435k079m18J006J050N90J55p65j556p05J332K082L81
1680A938j704j769l9J341J254K49o32j089q94J00J372J545n4j820j681L28J852
$$ y = [961, 726, -645, -2112, -1369, 1296, 2662, 996, -1631, -2299, -673, 1233, 1729, 803, -520, -1346, -1334, -325, 1344, 2174, 749, -1912, -2645, -303, 2259, 2016, -159, -1360, -1060, -614, -35, 1319, 2022, 195, -2453, -2290, 672, 2555, 1329, -838, -1458, -885, -236, 595, 1489, 1181, -720, -2220, -1365, 1059, 2318, 1109, -1098, -1967, -935, 644, 1336, 1048, 248, -893, -1763, -1054, 1185, 2524, 982, -1755, -2301, -343, 1387, 1299, 473, -153, -967, -1582, -571, 1652, 2282, 156, -2169, -1877, 291, 1676, 1238, 74, -838, -1275, -923, 403, 1738, 1470, -490, -2143, -1570, 661, 2108, 1312, -585, -1566, -1101, -71, 873, 1434, 980, -739, -2148, -1291, 1162, 2300, 865, -1214, -1632, -626, 424, 1014, 1169, 404, -1152, -1857, -525, 1557, 1938, 234, -1535, -1574, -233, 1021, 1270, 638, -451, -1345, -1245, 127, 1672, 1618, -202, -1883, -1555, 297]
1697B97J262l43j178r30l40M13J319J217l96j939j362P95J945R26p36j322p80
1714a152N3Q18J212N72q49j699p68J102J857O07j124j595n32P68J214P89j43j130
1732@j362k53J416J772J40j619j581J0J234J211L43n87j245r64L09J569J307m11
1750A289j701j204M30J426J040j21j016j119l34P51J374P45p39j651q52Q21J631
1767G70P54p02j274p72J77R79J159L30j046j575m27J214J582L28j045j298m57
1784a303N77J139Q42j93j229j179P1J327J312l8j296j254j3J037J137K96o94j181
1802f42p06M54J386J029m57j536j053M62J371R45j58j010j079l17Q34J379O18
1819A520q45j561o68Q35J455O49o08j209p76K40J053J054R0j089j312k02J185
$$ y = [297, 1559, 1216, 38, -892, -1232, -819, 500, 1717, 1321, -618, -1980, -1185, 760, 1686, 950, -372, -1152, -1099, -281, 931, 1503, 654, -1045, -1813, -711, 1146, 1753, 629, -966, -1498, -730, 484, 1273, 1130, 0, -1362, -1615, -199, 1573, 1713, 94, -1487, -1477, -243, 968, 1311, 724, -521, -1485, -1176, 393, 1700, 1289, -412, -1616, -1186, 240, 1280, 1159, 143, -976, -1310, -559, 815, 1560, 821, -830, -1682, -861, 770, 1524, 822, -452, -1224, -1047, -68, 1091, 1421, 375, -1200, -1627, -413, 1169, 1497, 452, -846, -1303, -726, 413, 1255, 1062, -167, -1346, -1275, 52, 1364, 1326, 30, -1224, -1237, -200, 937, 1233, 539, -642, -1348, -894, 492, 1521, 1064, -472, -1525, -1063, 308, 1253, 1095, 85, -994, -1311, -477, 902, 1520, 675, -886, -1554, -719, 736, 1385, 777, -432, -1208, -968, 85, 1139, 1229, 140, -1172, -1374, -189]
1836a89J346J59j066j200k77P44J111O00m12j209r37K52J332J134k03j348j116
1853a279J24J108J026J38p29j053o00M63J309R32m88j490q73N45J270P24k62q71
1871fq79k35P73J224M61q62j390m75Q79J296M88o47j173o44L73J065Q59n8r95
1890E4j168k12J104J389J97j168j245j24Q34R35M42k60j013j030J19J397J169
1907A420l67j379q61K87R06Q07K07o18j108n71O82J318O11o62j286o69N33J218
1925D68P40m00j075p34J08P46R39L87p24j385n15J042J417J97r51r01k05K48O56
1944E8Q59J75j056j274O8J310J007k27r38p58j33N33R25N48m63j119o79L89J115
1963C40Q42k42j185r45K49J135P92j54o82p50m30L95J217Q35p03j532n37R14J092
$$ y = [-189, 1157, 1316, 250, -950, -1227, -483, 628, 1228, 816, -393, -1330, -1078, 254, 1388, 1185, -163, -1279, -1155, -47, 979, 1117, 388, -665, -1265, -802, 507, 1439, 951, -539, -1412, -867, 403, 1127, 865, -6, -885, -1120, -347, 877, 1338, 476, -914, -1389, -510, 786, 1274, 627, -546, -1190, -817, 248, 1107, 1049, 54, -1114, -1326, -222, 1167, 1364, 196, -1049, -1173, -339, 596, 1038, 778, -235, -1265, -1146, 251, 1420, 1053, -326, -1187, -900, 6, 813, 1020, 402, -706, -1277, -595, 723, 1334, 672, -614, -1283, -750, 468, 1208, 808, -267, -1001, -893, -147, 792, 1179, 455, -930, -1445, -403, 1014, 1211, 260, -641, -846, -598, 58, 917, 1092, 36, -1238, -1170, 140, 1147, 920, -18, -776, -909, -376, 549, 1097, 634, -485, -1164, -775, 340, 1182, 940, -245, -1190, -941, 194, 986, 832, 150, -600, -1030, -635, 582, 1417, 714, -818, -1355, -441, 651]
1982F51K39l69n89o94k65Q04J269K13j202j167O4R96Q53J27n70q93m93M06J015
2001C95O75k87r96q67Q6J081J061j14j140q85J52P42O32K99k14r45q95L43J408
2020E31Q10p37j206l35M54N89M95K39n18j081m21Q87J196J86q82r42j85N30Q25
2039D35N03l15q81o60J52Q12Q46J18q87j098j17J027R72m4p06o55k55J54P32Q90
2059A023o2j237r84M55J231N66m14o95m95j52M29Q99N15o28j167m33P33J055L71
2078A010n38r29m58L32Q31N72q3o90q08k20P26J122K46r47j056rP76O40J50j92
2098D75n76p33n7R74R98k07j135p24L19P62N25N1m24p08m27L96R47N53m35j002
2118d28n79M08R59N69l33p88n12M8N06P06L61m82j093m67P76J103K10p19p35j79
$$ y = [651, 890, 521, -68, -762, -1027, -223, 1046, 1259, 57, -1110, -1046, -50, 803, 930, 360, -533, -1026, -620, 395, 1070, 783, -213, -1080, -994, 87, 1148, 1034, -106, -991, -839, -97, 535, 834, 620, -325, -1220, -877, 531, 1341, 604, -602, -937, -483, 106, 601, 840, 322, -759, -1180, -293, 903, 1089, 207, -735, -920, -390, 435, 938, 623, -258, -918, -766, 46, 892, 1010, 123, -975, -1092, -65, 907, 863, 157, -498, -753, -599, 133, 1023, 961, -276, -1260, -805, 426, 992, 578, -117, -612, -764, -335, 564, 1079, 451, -716, -1149, -416, 639, 1010, 472, -457, -915, -583, 248, 820, 737, 47, -761, -981, -255, 867, 1113, 166, -890, -899, -123, 517, 667, 475, -101, -834, -891, 83, 1081, 874, -261, -985, -666, 96, 621, 672, 248, -460, -887, -491, 456, 1009, 574, -428, -1007, -599, 360, 929, 596, -192, -704, -656, -150, 556, 917, 435, -658, -1125, -349, 754, 964, 245, -490, -669]
2138f69K20N04O32J39p73r63k9R76Q70j05q06o79n5M96O99L41l31p88n79K21Q97
2159B18P52j98j013p29K83Q64N50j17m66n80l47K92R53N87n50j091l93O18Q26
2178D59K55l03n42m77n7N76P83J34p20q41j00O86P78J35n54o89k44L48O05M57
2198F89p7o65p58OQ77P96j23q25n92N7M74N13L24k22p57o06K97R43N62m04q29
2219c20m29K40O17M90Mm97o49k05M90Q00L15n44q69l04N33P98K73l80o06m05O4
2240e84N79P05R9p51q33j5P59P01K3n39n83k44K80O69M98k13p65n73J94P72N72
2261G51j64o82n42M1N19N59J71l82o86l66L70Q24M26m27q05l39L29N79L95m1m78
2282E2o07j69N58P66J72o05p06j41M41O17K48k51n83m16J06N99N68k1o39o52K
$$ y = [-669, -449, 55, 687, 826, 53, -910, -939, 37, 907, 802, -4, -683, -738, -242, 457, 798, 467, -321, -900, -679, 218, 970, 772, -241, -970, -687, 177, 727, 610, 144, -436, -783, -491, 462, 1049, 499, -592, -985, -367, 459, 714, 411, -131, -608, -665, -89, 694, 828, 108, -733, -833, -147, 631, 766, 212, -477, -721, -373, 232, 689, 612, -53, -811, -805, 72, 868, 745, -80, -672, -615, -141, 372, 696, 474, -283, -889, -592, 351, 913, 509, -320, -749, -509, 108, 598, 602, 105, -544, -749, -259, 541, 856, 312, -557, -861, -328, 470, 743, 363, -243, -648, -584, -5, 700, 799, 48, -785, -800, -41, 660, 683, 144, -439, -683, -403, 266, 764, 551, -214, -787, -593, 179, 751, 587, -95, -637, -596, -77, 482, 653, 271, -415, -781, -411, 413, 839, 412, -393, -732, -403, 176, 571, 530, 52, -555, -724, -166, 600, 772, 167, -539, -680, -239, 378, 626, 375, -208, -624, -518, 81, 649, 628, -11, -663, -661]
2303f61O32O31J9n04n63j71L18N84M00k05p38n23K48P71M86k29o39m60O0M81N50
2324D87J57m32o84k58M51P35K74m42o67k82L17N67L57j14n27n04k4N62O22N4n83
2345F6o18o7M81N61J79l52n40l34J88O04M72j08o49n39Q1O50N08n7n01m60j00
2366e35K99N30L41k53o85m17L32P05L24k97n15l27O5M09N00J07m59o19j55M96
2386a54O19J76m17o00k51L02N89L21j94n20m06jN02N88R7n74o70m7N76N12N8l18
2408A88m26l06J01N92N38j89p24m49K67N93L28r3l89m54j44M14O01J71m31n86
2428c98j96L22N59L13k40o06l53K25N09L25m6l50m75j64L78P03J41n22n98k8L76
2449a25L44J84m1m02n03J0N98N65j43n90l85O7L68M11J48k93n51k39L23N51K65
$$ y = [-661, -29, 602, 621, 117, -446, -617, -299, 285, 685, 480, -258, -781, -533, 238, 724, 495, -144, -604, -544, -63, 487, 644, 212, -472, -730, -279, 456, 730, 288, -379, -661, -344, 223, 580, 466, -61, -565, -589, -27, 595, 649, 66, -552, -619, -138, 423, 602, 250, -290, -624, -436, 168, 640, 532, -117, -656, -575, 75, 583, 526, 25, -435, -535, -236, 294, 635, 382, -303, -720, -388, 317, 641, 344, -171, -498, -433, -24, 476, 583, 124, -495, -650, -154, 465, 641, 224, -376, -627, -325, 264, 585, 391, -129, -535, -536, -34, 554, 651, 77, -593, -640, -64, 448, 506, 188, -238, -544, -443, 149, 687, 498, -226, -675, -408, 185, 513, 420, 31, -423, -567, -153, 448, 619, 188, -398, -594, -272, 287, 600, 360, -246, -599, -374, 135, 460, 414, 64, -411, -575, -197, 506, 647, 125, -473, -501, -125, 219, 403, 362, -40, -543, -533, 65, 630, 487, -103, -488, -421, -53, 358, 506, 213, -338, -577, -254, 297, 562]
2470E62k22n18l93J33N68M68j66n56l58P8L41L74J96k62n95l28M15O93J69m33
2490A66m65j32J35L28M05P3m93n90K9O01M71n1m22m25j18K82N04K66k82n50k64
2511e32J90M79L66m2n19m91O3N65M07q9l78l05j44J88M60L65k54o42l20L92N19
2532B78J65k23k75l09p0L42N23J12m65n08p3M00M06J92k79m27l36K82L82M09k23
2553C03k92n23J02K97O39qn05m20j03M95K35K21k01m39k75%P31L32l15m36l70
2574e32K37L96K03J52l76n19mK98M78K32m44m69q9J65M81L55l12m58j63K9K99
2595d1M82M4m91m37j1L59M62J11l93m01n7J79K87L25j3m88m77J46N82L31j94l91
2617h6k35k3K48L53K06k56m63k56K46N21L03k68n56k40K70M11J76r2k23k97j67
$$ y = [562, 340, -178, -571, -438, 130, 598, 432, -124, -482, -404, -63, 311, 507, 245, -350, -678, -263, 430, 599, 166, -299, -431, -296, 32, 437, 510, 17, -573, -544, 57, 528, 477, 55, -370, -488, -206, 298, 564, 282, -268, -532, -342, 137, 503, 461, -58, -549, -486, 79, 486, 397, 19, -286, -430, -242, 218, 583, 329, -313, -633, -241, 278, 443, 220, -55, -364, -434, -92, 431, 543, 78, -430, -503, -103, 303, 495, 216, -211, -547, -265, 117, 526, 303, 11, -512, -410, -113, 526, 518, 13, -407, -510, -15, 220, 441, 240, -199, -474, -474, 257, 589, 274, -162, -532, -295, 101, 304, 456, 80, -439, -443, -145, 333, 565, 121, -348, -437, -272, 209, 564, 252, -206, -369, -340, -41, 441, 485, -6, -443, -454, -95, 367, 478, 85, -316, -373, -194, 93, 418, 405, -83, -560, -414, 168, 499, 305, -86, -321, -344, -96, 257, 463, 207, -256, -512, -266, 255, 558, 290, -266, -506, -236, 175, 351, 259, 36, -261, -428]
2638d28K27M89K17l47m72j22K79L24K12o4l48m08k4M66M66j8m52l96l6L24M19
2659C08J42k85m23j68K17L50K53r3m01l16J08M58L06k17m18k06J24K81K83J11
2679D14k74n05k20L67N24J61k76l66j47R6K72K64k8l69l44M1M08L97N8l43m19
2700b89j28K72L62J18k05l29k00R9L88L80l1m43l64P9L98K72n6k80l13j59J80
2721b49M02K40k18m46k14K56M08K36j38l24k54L7L10L37P3l19m16j30L25M34J09
2742D59l20l91j46J71L20K39o4l64l76L5M15L74m2l70l36pK75L24J19k09l57k05
2764d56J63L88K60j53m08k70J34L84K50n8k78k92o8K19L80J70k38m40j43K74L74
2785A92J52j45k71k39J6L08L67N2l43l68l0L10L36P4k39l34j58J68L31K18j27
$$ y = [-428, -201, 288, 505, 158, -314, -436, -157, 167, 379, 315, -33, -441, -465, 1, 467, 449, -3, -399, -435, -111, 308, 450, 165, -258, -426, -209, 141, 394, 301, -100, -416, -308, 150, 456, 239, -179, -385, -261, 20, 303, 414, 140, -365, -585, -218, 306, 467, 191, -175, -322, -226, 46, 310, 282, -87, -431, -390, 18, 415, 473, 130, -289, -417, -145, 217, 335, 130, -199, -399, -300, 88, 468, 437, -6, -370, -291, 107, 379, 323, 43, -270, -429, -249, 153, 393, 175, -271, -485, -229, 179, 415, 277, -47, -301, -264, 46, 383, 456, 137, -279, -409, -84, 350, 459, 139, -252, -398, -227, 93, 332, 268, -96, -472, -437, -22, 352, 310, -60, -396, -403, -128, 196, 315, 106, -251, -456, -293, 95, 355, 202, -206, -476, -342, 42, 292, 234, -44, -336, -404, -185, 195, 365, 127, -313, -456, -182, 192, 344, 199, -72, -311, -295, 13, 380, 432, 89, -279, -309, 1, 337, 411, 172, -162, -320, -152, 179, 397, 270]
2806B70l55l15N3L56L22p3l64k92L7K82K89J05j83l23k08K23M36K31k24m07j94
2827c34J38K85K04m0k90l14o1K86L69J02k74l47o3K75L39J22j68l05k16O6K87
2848F1K66n8l76l13N0L49L20K9k54k64r1K02K98J55j58l85k48J04L65K66j07l03
2870i2j79N8K48K47O8k13l57j83K08L76J41k26k97j01J70K69K10l7k97l44m4L03
2892g2L32K1k73k72l5K43L27J04j96l72j92R8L04K80j2l11k81M4L53K66q6l13
2914d3k45l6J67L05K24j30l70k20J88L44J04j75k53j47N8K64K99M8l04l76p5K56
2936a17L02J04j86k61j17J38K88J37j25l01k01M0K99L21N6l22l43l9K38K57N2
2957B20j25k09j29Q7K97K21j58l95j97J71L30J85m1j86k61j32J76L20J40j99k71
$$ y = [270, -85, -400, -347, 9, 331, 258, -106, -398, -361, -79, 210, 315, 132, -191, -399, -176, 260, 491, 267, -140, -334, -196, 89, 293, 253, -37, -351, -412, -126, 243, 345, 71, -276, -339, -64, 275, 397, 229, -76, -292, -226, 61, 327, 269, -107, -420, -370, -21, 299, 328, 74, -190, -281, -79, 219, 374, 216, -169, -417, -313, 52, 318, 211, -92, -271, -213, 35, 282, 350, 137, -220, -403, -195, 181, 322, 96, -201, -302, -132, 137, 347, 310, 13, -331, -375, -72, 260, 281, 8, -264, -299, -56, 271, 375, 179, -193, -385, -287, 17, 297, 285, -26, -307, -263, 90, 356, 270, -43, -288, -324, -157, 148, 372, 242, -128, -348, -160, 184, 288, 113, -140, -287, -229, 35, 334, 382, 78, -298, -373, -117, 185, 289, 103, -158, -275, -137, 151, 288, 163, -138, -339, -299, 0, 321, 377, 55, -288, -327, -89, 168, 220, 95, -114, -243, -156, 141, 362, 204, -191, -388, -217, 113, 298, 257, 71, -190, -322, -146, 174, 314, 115, -156]
2978a56j14J65K57J30j44l00j66J16L08K19l8k64l02p8K44L67J08k32l17p2J68
2999a01K06J06p3k03k07O5L25K50j45l59j95J13K40K27O1j85l21j68J77L47J74
3020C34j44k80j77Q0K26J89n5k25j71L8J91K09K5k07k96n8K53L25P6k42k62j19
3042b90P9K39K54L7k86l32j9K74K88J5j88k18p6J14K15J27j15k31j38J05K43J75
3064B72r3k82k21J06K98J79l7k06k30j08J79L39J75k03l69j44J66K81J43m0k01
3085Dk27m2K16K71L3k13k17m5J74K03P0j60k17q4J46K05J01p1k25j99N3L01K41
3108C18j02l06j85O0J85J83J13j15l02k21J65L62J57j47k45j45K2J76K34N3k01
3129E9k49m8J55K11Q5j02k09j47J06K63J08j42j81r1L7J60J76L7k48k50L1K86
$$ y = [-156, -270, -105, 152, 282, 138, -162, -328, -212, 96, 315, 277, 13, -289, -367, -123, 244, 352, 120, -197, -269, -101, 105, 211, 138, -65, -272, -207, 118, 368, 223, -136, -331, -218, 22, 249, 310, 125, -196, -364, -187, 160, 334, 190, -90, -267, -187, 39, 228, 173, -52, -223, -185, 6, 215, 240, 33, -263, -321, -68, 257, 333, 91, -171, -290, -211, 28, 282, 319, 33, -299, -318, -44, 244, 259, 71, -147, -223, -109, 106, 233, 118, -113, -251, -146, 97, 272, 179, -103, -324, -218, 80, 259, 222, 16, -214, -322, -143, 196, 371, 168, -201, -345, -179, 102, 245, 205, 4, -223, -265, -49, 222, 255, 42, -175, -220, -46, 157, 227, 67, -150, -234, -88, 117, 218, 147, -78, -277, -224, 77, 318, 216, -90, -275, -215, -30, 153, 266, 151, -151, -372, -207, 155, 312, 165, -80, -225, -203, -27, 207, 260, 59, -190, -238, -83, 128, 213, 111, -98, -245, -139, 124, 232, 90, -91, -182, -145, 15, 191, 228, -20, -270, -239, 47]
3151D7J86n3j76j62q1J05K66J95j68l46j47J52K96J57n6k28k38m0K60K67M7k09
3173G4k36j01J12K65J85r5l00j88J14K35J18k6j21j82r4J41K62Q2j94k27j2J37
3195e1J43O9n9j53j45L9K25J46q4j86j43M4J77J48j0j71j63j7J55J88N8j22k20
3218a32j21J14K80J21j21k45j21N8J95J71L4j94k72o2K17K96O7k06k66p8J21K19
3240G5J59l5k19k53%K59K70J8k48k41k8J69K07J08j05k19j67P5K28J86m9k22j83
3263b15L4J79J64K2j43j75m8J09J84P3p7k10j16R8K06R8q0j62j04L9J29J28L4
3286A67j40j96k9J83J72Oj42j48k2Q3J38J05m7k00j38P2K11J24o9j75j44K9J58
3309bJ66J0j51j74o1J41K02J06j36k35j07J17K27J06p4j84j57J1J70K13N9k04
$$ y = [47, 233, 180, 4, -158, -239, -134, 132, 327, 159, -187, -334, -182, 114, 271, 215, -13, -251, -291, -31, 236, 283, 74, -162, -263, -151, 114, 299, 204, -96, -284, -170, 65, 183, 157, 36, -146, -240, -99, 163, 245, 51, -176, -188, -51, 92, 161, 102, -51, -196, -157, 68, 214, 130, -56, -199, -155, 22, 170, 160, -11, -174, -191, -36, 152, 210, 88, -132, -253, -139, 141, 262, 141, -104, -225, -167, 28, 199, 233, 39, -233, -295, -78, 218, 285, 79, -187, -265, -144, 75, 234, 199, -20, -273, -273, -14, 256, 274, 26, -215, -243, -74, 133, 241, 136, -83, -250, -175, 53, 239, 190, -32, -215, -181, -2, 162, 184, 41, -134, -182, -73, 111, 184, 107, -103, -219, -121, 85, 183, 103, -59, -163, -124, 5, 133, 167, 27, -169, -198, -15, 157, 163, 21, -127, -149, -66, 72, 177, 130, -70, -208, -136, 75, 199, 130, -45, -189, -160, -2, 164, 174, 23, -151, -212, -71, 131, 237, 101, -134, -241, -124, 103, 209, 135, -49, -206, -195, -25, 188, 247, 43]
3331D3k64k9J98K27M7j31j92j13N8K10J83j8k46k27L4K38K00lj88j89m8J25K10
3354A25J10r7k22j53P0K27J83p2k08j83L1J76J63M4j27j76j17J04K30J38j11k38
3376a03j06P8J75J27j8j28j68o1J53K21O1j71k09m3J24J71Q3q3j51j38K4J75J75
3399A88k0j75j71mJ58J74K5j39j60m3R6J45R5o3j55j37N1J83J32p5j52j01L1J19
3423BJ13K2q0j66n8J09J80N9j19j58m4O7J26R5l4j41j21K2J35J38j1j41j28j3
3447a46J36J12J8q3j20m8M4J44Q7n3j52r6P3J42P8l4j20q1j0J03J27K4r8j51m3
3472a47J08J52M5j02j39o4N4J46R7k5j41j38PJ61J44qj52j35j5J12J46L8q1j39
3496g6j02P7J65J10o4j68j17N0J63J09j6j34j22l7J28J51P6j24j81n0R3J77N1
$$ y = [43, -221, -250, -52, 175, 222, 91, -101, -214, -156, 54, 237, 219, -27, -254, -220, 18, 218, 215, 27, -162, -210, -85, 125, 235, 138, -84, -237, -167, 60, 243, 171, -37, -220, -189, -13, 150, 194, 67, -109, -226, -122, 108, 246, 135, -103, -209, -131, 44, 171, 153, 25, -143, -204, -51, 170, 231, 60, -149, -192, -68, 103, 186, 103, -48, -186, -162, 13, 188, 168, -7, -178, -182, -24, 150, 175, 36, -124, -167, -71, 74, 169, 106, -49, -186, -135, 48, 180, 105, -47, -148, -117, 2, 115, 137, 57, -109, -167, -58, 122, 181, 62, -96, -140, -73, 53, 148, 114, -27, -148, -126, 9, 147, 136, -5, -133, -146, -10, 102, 120, 37, -83, -131, -87, 57, 144, 91, -61, -157, -84, 58, 136, 102, -18, -99, -109, -6, 121, 145, 47, -104, -147, -39, 113, 158, 56, -83, -147, -93, 53, 150, 125, -16, -154, -147, 14, 158, 150, -2, -137, -152, -40, 106, 144, 63, -76, -178, -101, 64, 174, 110, -58, -175, -125, 38, 147, 131, -3, -125, -162, -34, 117, 193, 69, -112, -162, -69, 108, 159]
3519A59p4j49r4L1J42J27K3j65j64j2J56J57L3j27j62m2Q1J53R3l8j77j40L9J81
3543C1J60m1j75j34RJ25J46N3q7j71j18R6K06J09q7j94r4M9J35J43j3j28j83m
3567a67J26J65O4j20j93q9J24J97Q1j05j51j08L3J40J70L8j94k06kJ97J75j2j29
3590C4j28p7N7J80J49p5k14j31Q0J78J13k1j35j62j9J49J59K5j09j49p8P9J66
3613G1J31q0k22r4Q9J56P4j2q2j51p4J17K24O5j63j90l2J28J29O2j5j53j52K4
3637a50J77J64k8j63j42k7J25J70O6j37j77o1J15J49O4j7j48j65QK12J64n7j90
3660d8j05K3R9J18O7p7j80j23J36K07P6j09j56o4L0J17J43J2j54j61j3J43J56
3683A37L5j10j63q1J15J56P7q5j39q6L4J03J43J6j47j69pJ73J37j2j07r7n2L2
$$ y = [159, 85, -64, -158, -127, 15, 142, 165, 0, -164, -176, -20, 137, 170, 43, -119, -161, -80, 73, 166, 128, -49, -189, -150, 31, 191, 150, -25, -159, -150, -25, 121, 174, 87, -84, -202, -106, 100, 209, 122, -72, -166, -117, 18, 161, 148, 20, -163, -167, -41, 124, 188, 68, -125, -214, -90, 107, 188, 83, -68, -176, -143, -3, 167, 205, 11, -195, -197, 0, 175, 163, 34, -94, -171, -114, 66, 215, 140, -74, -205, -125, 53, 166, 145, 10, -152, -171, -22, 137, 162, 53, -96, -174, -95, 71, 202, 122, -100, -194, -105, 51, 125, 113, 31, -120, -194, -77, 147, 212, 49, -141, -173, -45, 84, 146, 131, -22, -174, -150, 27, 191, 163, 0, -142, -169, -44, 126, 192, 55, -122, -183, -68, 81, 145, 128, -20, -185, -177, 35, 199, 142, -48, -153, -130, -31, 87, 154, 77, -103, -226, -90, 117, 193, 84, -72, -136, -106, 11, 154, 166, 12, -149, -162, -19, 137, 172, 62, -101, -182, -67, 89, 166, 81, -58, -144, -110, -7, 136, 152, 5, -164, -171, 2, 139, 127, 20, -77, -129, -97]
3707i7J43J20m3j92j07O4J60R3k6j23j09k1J07J37M6r1j51n7O6J52R4o8j39j15
3731a57N7J36R2j1j08j25l5J06J56N4j13j77l6J22J37L7m4j24j11L1J31J45k4
3754A39j59j20K6J26J01K0q7j32n8P7J38O6n6j49p3M7J38R1l7j10j05NR7J20J4
3779A19q8j09o9P0J50O5q3j34n3N3J04Q1j6q4j18k5J13J43K1j15j15k1P2J00N9
3804A20m8j05q2J9J25J04l8j13r3RR4J14Jq0j05m5P1J12P5o5j24q3M5J27Q1l3
3830H3j18p1J3Q3Q9L2q2j24l9R3J27M0q2j12l3M5Q4Q3k0q6j04jJ17Q6nr6r1rO8
3859c0R0M2n8r5n6L6R4P2k0j01q2K2J05O4Nr8o2k1O2R2M7o2j10n7O8J14K8k6p5
3888a2p1PP8R0J5r4j04mQ0R9Kn4p9n8N4R1O2l5r3p8K0R2P7oq1r4J2P6P8J7n5p9
$$ y = [-97, 46, 166, 123, -69, -176, -112, 48, 141, 115, -8, -117, -138, -31, 106, 152, 61, -90, -147, -81, 71, 165, 97, -42, -157, -100, 36, 128, 117, 9, -116, -151, -45, 111, 165, 52, -125, -161, -39, 98, 135, 91, -33, -144, -113, 18, 163, 139, -20, -140, -114, 12, 113, 133, 46, -86, -144, -67, 71, 137, 81, -68, -141, -94, 44, 135, 98, -12, -117, -112, -15, 105, 119, 31, -78, -147, -77, 73, 138, 55, -79, -132, -79, 25, 106, 90, 6, -112, -137, -24, 119, 140, 25, -90, -111, -39, 61, 120, 72, -33, -115, -96, 29, 133, 95, -18, -111, -102, -8, 106, 107, 27, -78, -123, -52, 60, 135, 70, -54, -137, -92, 35, 116, 83, -35, -106, -93, -10, 79, 111, 29, -95, -134, -41, 86, 126, 44, -68, -101, -56, 28, 111, 91, 5, -99, -100, 17, 103, 98, 2, -89, -98, -30, 60, 102, 44, -51, -107, -71, 23, 95, 75, -26, -108, -86, 19, 83, 88, -10, -72, -93, -31, 61, 108, 46, -64, -121, -53, 61, 89, 63, -12, -83, -76, 2, 92, 107, 13, -91, -95, -15, 84, 86, 32, -47, -105, -51, 40, 102, 67, -26, -104, -84, 8, 85, 79, -2, -96, -84, -8, 70, 87, 32, -47]
3920d7n1M2J11N6m7j21m4L7R6N5j7n3q8j8O4J08J7p3r9j1N2Q0L4m1q2m6K0Q3N8
3949G5po8p3k1P7Q9Qp8o5jL1P0M7k3q3p0J8J00O8m0o6n0JN1P7J7n1q7l5O7P2L9
3981H9m3p2n7K9P3N3j4o9o3MO0P2K0o7r0lO2O6K3n0o2k5J0P4O3j5q9o6K1Q6M8
4012F8j4m7n5j6M7O3L7m7p7l4M6O3L5k5p1m2MO3O0Lm3p1j7M8O2L3m4p9k3M6O0
4043C3K7j8n8m4oP3P5k5o2n9QN1M8Ok3n4l2J9Q4M7l9q3l5K2N4N3Jo8n1j0N7M5
4075C6K9l9p8j6K8R1K4m8o2k5J4N4N0J0n0p8j6Q0P0mo7n1PK1M5L8k3o0m2J9O0
4106A7M4rm9m9mM5M8Rm3m7j0K3O5J6j1o1m6J8Q0K0k9l6k9LJ7O2K1l7q1j2O3M6
4138D4Lk7l5k5J4L6M4Km5o5K2M0K6J0m5m8%L2M8Qpn1k5%N8L9qp0l9L2M1L0nl1
$$ y = [-47, -98, -56, 55, 111, 64, -57, -101, -64, 32, 87, 70, 17, -71, -89, -25, 83, 100, 27, -72, -83, -31, 49, 83, 42, -40, -86, -66, 17, 75, 68, 0, -73, -94, -17, 72, 80, 2, -63, -64, -33, 37, 84, 61, -22, -92, -74, 26, 94, 54, -12, -62, -61, -10, 67, 84, 33, -54, -89, -22, 50, 89, 46, -26, -83, -54, 19, 72, 58, -11, -74, -70, -10, 62, 82, 15, -75, -78, -16, 50, 73, 23, -39, -64, -54, 20, 83, 68, -21, -87, -66, 20, 68, 54, 7, -48, -64, -17, 46, 83, 36, -41, -75, -29, 34, 69, 44, -27, -69, -65, -2, 58, 61, 18, -53, -70, -22, 40, 73, 29, -50, -73, -27, 33, 60, 42, -16, -60, -66, 7, 82, 57, -5, -64, -56, -5, 43, 49, 26, -28, -60, -41, 43, 90, 51, -32, -67, -45, 9, 62, 63, -5, -56, -66, -9, 36, 65, 26, -52, -68, -40, 51, 75, 27, -35, -60, -46, 8, 58, 68, 18, -60, -76, 4, 74, 70, 3, -48, -41, -20, 25, 63, 40, -20, -62, -43, 17, 61, 52, 3, -46, -50, -5, 43, 52, 9, -38, -48, -25, 40, 56, 45, -16, -62, -44, 36, 56, 27, -9, -38, -35, -18, 44, 65, 28, -53, -65, -2, 44, 47, 20, -15, -40, -26, 10, 54, 56, 11, -54, -32, 8, 34, 44, -1, -49, -49, -17, 31, 39, 32, -19, -44, -44, 14, 53, 45, -25, -64, -32, 9, 39, 34, 3]
4172Cl0k1K2P2K2n2n2j8M7M0J7j4m4l6QM6M2j0l9m0qL7M9j4k0m4pK4K4K4nl8k6
4205d1kN4M9k3m5k2KK4K6J6j1m6l5M3N8K5m8n4KJ2L7K4On2m1nM4M5Pm2m7mK6L9
4239B1J6k4l8j6QL7L5mm4m5J0M6M0rm4k5MK1L4J9nn3l1K1N5J9j5m8j5%K7M0jl8
4273bm6J0K4N1Rl6l5j1K0M0Nj4l2j9NK8M0Jk8n3RL1L5Oj8l8pQL6K1ol3m2J4M5
4308A8L0j7j9l7j1K3L7Nj2m0k3K6L8J8rl9l4J7L1K4%l3k3lJ9M4Kpn8KK1L3J4l0
4342Gk1j9RL0K8J1n0l6K0K9L3j3k9j9oJ8K4J7k7k8j5J6L1J7j1k4k6OJ8L0Ok3l5
4375c2OK2J7K9l2k3j1J9J5K2nk6l3J0K8L4j5k9k0LK8K0%j0k0l1J2M1K2k0k3k2
4407b4KK9L2%l8k8LK0J2K0j8l6nJ1L7J7j1l3j6J1K3J9Mk7k8KK8L2ol3qj1QK5J9
$$ y = [3, -27, -48, -26, 46, 68, 16, -36, -54, -7, 33, 50, 36, -8, -44, -36, 10, 52, 42, 3, -37, -45, -8, 41, 27, 7, -37, -44, -20, 4, 28, 23, -15, -41, -43, 11, 60, 37, -8, -30, -28, -4, 22, 38, 27, -19, -54, -11, 47, 72, 24, -30, -28, -16, 21, 45, 51, -1, -42, -47, -3, 42, 49, 7, -40, -44, -18, 21, 37, 13, -25, -41, -33, 4, 39, 35, -9, -54, -44, 2, 42, 33, -11, -36, -32, -11, 23, 42, 37, -16, -47, -26, 29, 48, 33, -15, -30, -30, -3, 37, 36, -2, -48, -38, -14, 37, 46, 10, -25, -36, -16, 24, 29, 15, -17, -36, -31, -3, 37, 38, 10, -43, -34, -3, 32, 38, 20, -18, -25, -17, 19, 40, 34, 1, -41, -27, 18, 48, 31, 12, -25, -36, -13, 24, 29, 17, -23, -46, -20, 18, 36, 27, -12, -46, -29, 2, 26, 26, -7, -30, -33, -14, 30, 32, 25, -33, -31, -10, 23, 37, 7, -14, -33, -24, 6, 34, 45, -5, -41, -21, 8, 41, 28, -1, -20, -26, -8, 16, 33, 6, -22, -37, -21, 10, 27, 16, -8, -34, -28, -10, 20, 26, 3, -32, -26, -4, 13, 42, 10, -13, -24, -5, 10, 32, 27, 1, -32, -22, 6, 40, 25, -4, -24, -21, 7, 27, 27, 17, -3, -34, -22, 19, 41, 21, -2, -24, -22, 7, 39, 39, 1, -27, -24, -4, 8, 28, 10, -26, -31, -20, 17, 34, 23, -10, -26, -15, 8, 27, 31, 4, -24, -22, 6, 38, 32, -1, -9, -20, -12, 13, 32]
4442C2j6k7j8J7K1K2j4k6j2qK3K5J0k3l0NMJ8K0%l0j6OJ9K6j4j0j8lJ5K5K0l0
4475A3k5nJ5K2Oj3j1j8oK3J9Jk3k6J7J3J5Oj7k6kJ8J7Qnk4j1NK5K0j2k2k6J6K7
4510A4Qjj1k4JJ8J9Pk5j4j0J9K2p%j4k2JJ7K9nl1j5OJ5J5Nj0j9j4J3K3NQk7j7
4546b1QK9J6j2j3j6jJ1J9Pj0l7j0K5L5lj9mqqJ6K4nk0k4OK4K0pk6j2oJ7J6J4j9
4582Fk2kKJ8K1Ol8j4oM1K1k0Lk0kNK0K7l4k1pJ2K2Kork1JJ4K2J2l1j6nJ3J8Km
4620A0k4rJ8J5Nlj6nj2J6L0kj8k5LK7JOJj0k5RJ6L0k4l2J1mJ4J8qrk5RjK5Lok6
4659a7oPK9Qj4k1oNJ5J0Pj4j1j7J5M4k1j5j8%J6J2J9rk1rJK8Rj0j7nlJ5J0Oj3
4696Ij8j1J3K6Lj8j7j4RK2K1j6j6j0kK1PJ0j0k1qJ4J5J3j6j9M%QK0Kk9k1OJ5K9
$$ y = [32, 16, -11, -29, -12, 9, 31, 17, -9, -21, -29, -6, 19, 29, 6, -24, -19, -15, 3, 23, 23, -7, -23, -17, 2, 28, 14, 4, -14, -17, -2, 23, 43, 13, -12, -17, -2, 20, 26, 13, 2, -16, -22, 1, 20, 21, -2, -28, -11, 2, 17, 23, 6, -20, -22, -4, 13, 21, 16, -8, -19, -14, 11, 31, 19, -3, -29, -13, 14, 22, 21, 10, -14, -13, 5, 24, 31, 6, -8, -18, 1, 23, 16, 16, 2, -20, -19, -2, 27, 22, -9, -24, -18, -3, 12, 17, 7, -12, -26, -13, 10, 15, 23, -4, -21, -13, 16, 32, 20, 7, -9, -10, 1, 20, 27, 17, -20, -30, -5, 30, 27, 8, 4, -4, -12, 4, 28, 23, 3, -21, -15, 9, 29, 22, -4, -16, -22, -5, 11, 25, 6, -16, -18, -16, 2, 23, 29, -9, -23, -29, 12, 33, 13, 16, -4, -6, -1, 19, 46, 12, -9, -16, -4, 18, 20, 14, 5, -16, -15, -1, 21, 33, 2, -14, -19, -6, 12, 14, 10, -14, -23, -5, 10, 15, 12, -4, -9, -21, -5, 25, 23, 5, -20, -17, 10, 11, 17, 18, 8, -17, -8, 8, 38, 14, -18, -7, -11, 3, 21, 13, 4, -21, -12, -13, 12, 15, 9, -17, -23, -16, 13, 21, 7, -14, -20, -15, 0, 10, 17, 3, -8, -25, -10, 34, 13, -2, -20, -20, -4, 8, 27, 18, -3, -12, -11, 17, 26, 16, -1, -6, -9, 6, 16, 22, 9, -9, -20, -7, 19, 22, 4, -13, -27, -18, 4, 25, 9, -7, -17, -19, 2, 9, 19, 9, -12, -20, -6, 9, 22, 6, -13, -9, -9, -1, 19, 21, -8, -29, -23, -8, 21]
4732B1qpk0MKJ6PPj9omJ5Pnmk7jJ6J4Qj9onRL2qqj2qLJ7Okj5j4mK4J6Lk0j1qR
4775eJ6%lj5qOJ0J5j1j3rPJ8J0nj9pKPJ7jj1lj3%L3Qj5j7KkJ7lJ4qj6jkJ8J8j3
4816A8k2JLJ4nJj1j9MJ4J8Nk8pMMK4lj5qj1PJ8J1rj0j7K1kJ5Kj8nLPPNj0j1KK
4857aJ6Pj5rqNMOjqj9LK2J6j1j5Lj5J1J2Nj1j0j1K2J6Nppj9MK1J1k0olOnJ7Jj1
4898AKj9J5J7Kk2Jj2jJ7J4olj7PJ2kLnlj3MRJ1j7j5%OK7Pmj1j2lJ3PJnj5%OJ9
4940A6Mk2j4JJJ2%MnqnJ3MOj4JqJ3%NMj7m%QJ0%Lj9LRJ6%k3pJ1RRqmpqkJ7J7k0
4986AnoL%J2mrlj7L0J2rnj0MKQQkj1j3J2J%Mj0j1J2PMMj6MPpJ3jKrj1J0J2jj4
5030bm%KlJ1Pj9j3RPNKkpJNJ2qj0%NjJ2%Jmj9OJ4J4j4Lj4MqJ5Oj3ppJ6%ORk3K
$$ y = [21, 13, 6, -14, -10, -8, 8, 15, 22, 3, -3, -7, 8, 15, 10, 6, -21, -22, -6, 8, 16, -3, -9, -14, -5, 27, 19, 11, -1, -9, -6, 11, 17, 15, 0, -14, -18, 6, 22, 25, 5, -6, -14, -5, 11, 11, 8, -7, -15, -9, 1, 16, 5, -8, -17, -10, 8, 18, 13, -6, -13, -11, -4, 13, 12, 1, -2, -15, -15, 18, 26, 11, -6, -4, -6, 11, 8, 22, 14, -2, -3, -5, 13, 31, 18, -4, -3, 0, 14, 9, 10, -1, -20, -16, -2, 16, 21, -7, -14, -10, -6, 18, 15, 0, -8, -19, -12, 6, 17, 8, -2, -19, 2, 0, 15, 17, -1, -6, -3, 4, 11, 16, 6, -5, -3, -1, 15, 22, 7, -2, -10, -5, -1, 5, 4, -4, -23, -20, 2, 18, 7, -8, -5, -20, -9, 3, 8, -3, -13, -24, -2, 14, 19, 12, 5, -14, -10, 11, 22, 2, -4, -7, -1, -6, 11, 12, 1, 3, -16, -1, 16, 18, -4, -3, -15, -16, 1, 15, 9, 6, -11, -4, 8, 6, 9, 4, 1, -12, -8, 1, 12, -5, -20, -20, -14, 13, 20, 16, 5, -7, -10, 3, 10, 11, 6, -9, -9, -3, 16, 20, -2, -16, -15, -14, -2, -2, 2, -3, -11, -16, -3, 1, 7, -7, -6, -14, -1, -1, 4, 8, -9, -13, -13, -5, 5, 5, 8, -11, -8, 1, 17, 17, -6, -13, -2, 7, 16, 8, 4, -3, -11, -13, 4, 21, 1, -4, -10, -7, -7, 5, 1, -8, -11, -28, 2, 14, 5, 0, -10, -6, -4, 4, 12, 10, -1, -14, -2, -1, -1, 3, -7, -18, -6, 1, 5, 9, -7, -3, 4, -3, 10, 9, 11, 2, -9, 1, 13, 12, -2, -6, -6, -4, -7, 4, 11, -8, -21, -12, -5, 0, 2, 0, -7, -6, -1, 11, 3, -7, -7, -2, -3, 9, 9, 10, 6, -13, -7, 7, 21, 7, 10, -4, 0, -8, 7, 13, 0, -7, -14, 2, 2, 8, 17, -6, -4]
5076dJ%J0Mpj0pOJ3qOnrjJ0LNj1mRmK1Nj4lj1QJ3plkj3KJ1NqqkNQlPj2kOojRK
5125DnpRLOlqkP%%Omj3kOJ7nj1kkOjNjj6LQj2K9j6kLMjJNqk2PQJ3Lj6K%NOJpN
5176FqJ1k%Oj3qjROJklj5K4lLqlKpQNmj9QmQQlj2j0RJ6OjpmlOkJ1Kr%LNRj0j2
5226aJklJ7njpjNjMKrj0nJ6NLj6jJJ0M%%j3mOLPJrj0PMQLp%JNJjlj2kJ1J4joj5
5277fJ1j2QRj1j3kMQO%lq%P%LqlqJ4RJ0j3okJ3%%jLj4NKNJ1j1oj2K1njLmqmJ0
5324AQnj2pJ8j1JJ7j2ppLJ7Mj4kMQoJ7rkj1OQRlpj4PmJ8jj0pKNNLj4JLpJ1Kj0
5370dj0KJ4P%knj0mNK0nrlKj1K2%okpJ7km%rlQmLOJj3KJRnQj2oJ0LNnmmMoJ1Q
5420A3j4rpJ3MJ2olkNQnkrnMOJJ8j1j1JrJ8%omqpJ8Jpmj1QOkLrJ0qJ2%P%j3Kl
$$ y = [-4, -3, -3, 7, 11, 4, -6, -13, -7, 6, -2, 4, -1, -10, -11, -1, 2, 7, -4, -8, 1, -3, 18, 23, 9, 6, -5, 3, 16, 9, 6, 4, -9, -7, 4, 9, 1, -7, -9, -4, 4, 1, 8, -4, -6, 0, -6, -7, 2, 4, -1, -8, 1, 4, 10, 7, -1, -3, 4, 4, 4, 10, 6, -7, -9, -3, 14, 9, -2, -4, -6, 0, -1, 4, 3, -13, -10, -2, -14, 15, -1, -3, 0, 4, 3, 4, 9, 1, -21, -14, -6, 7, 10, -6, -4, -4, 1, 7, 8, 1, 6, -2, 9, 7, 7, 13, 0, -8, -9, 0, 6, 7, 5, 2, -13, 11, 8, 11, 3, 0, 2, -5, 3, 8, 4, -15, -7, -11, -3, 5, 2, -10, -20, -11, 5, 11, 10, 3, -1, -4, 2, 0, 11, 13, 4, 4, 7, 12, 21, 11, -1, 0, -2, -5, 12, 7, 6, -1, -2, 3, 2, 6, 8, -1, -11, -16, 0, 5, 8, -8, -9, -8, 2, 6, 6, 6, -7, -11, -5, -2, 5, 6, -3, -13, -6, -2, 6, 9, 2, 2, 3, 8, 9, 8, 5, -7, -9, 2, 16, 15, 9, -6, 5, -7, 1, 10, -1, -14, -16, -12, -4, 2, 2, -1, -9, -9, -2, -2, 1, -7, -10, -18, -4, 5, 15, 2, -4, -6, 7, 7, 7, 6, 9, -5, 0, 2, 7, 18, 7, 1, -11, 10, 5, 4, 7, 3, -5, -9, 1, 9, 4, -8, -15, 3, -8, -7, 10, -2, -9, -16, -13, 4, 8, -6, -8, -4, 4, -2, 15, 6, 4, -7, -1, 7, 16, 13, 6, -8, -1, -5, 13, 12, 2, -5, -3, 2, 7, 10, -4, -3, 0, -7, 4, 6, -4, -14, -12, 2, 9, 9, 7, 2, -8, -12, -7, 13, 8, -1, -4, -2, -13, 9, 9, 3, 1, -6, 11, 9, 5, 5, -4, -7, 1, -3, 0, 6, 7, -6, -4, -3, 6, 1, 9, -3, -9, 1, 4, 9, 4, 0, -4, 0, -6, 5, 13, -1, -10, -17, -4, 0, 12, 6, 3, 1, 6, 14, 9, 7, -2, -7, -3, 3, 4, 22, 11, 0, 1, -8, 10, 10, 4, 0, -8, -15, 3, 4, -3, -7, -18, -10, -4, -6, -3, -12, -2, -10, 2, 2, 9, 9, -4, -2, -5]
5468eRLrLj3LPPjLj1PoJ9qlj0j3K4Pp%mj7J2mJ9Lj5%j0Rm%Qj4jQJ1Oj3Kj1J0%
5513AMpOj2j1K2OOk2%Kj3J9J5%j9qJ3NKJ%k6PJ1J5j3j1mOmJ8%rloMLRNj4%pJ2
5557CJ9j5lklQMMmrllmJ3LrnrJ7KlJj8J1LLQrplJ1QrNj1MlRkqOj1MPJ9j2Nj7o
5606a1QKLQmj4QLLMqrmQJ2l%j6NjOJ6rj5KM%J2Jj0j0PKOJ3j9okOOPrjj2J6PnR
5654A6j6qnJ5mJopPJJ9j5J1j6oKPK3j3j1LrK0OkmnLlJ9qlrj3LJ2LjmllJ2nMml
5700ArNJ5Ljj5j3kJ8Qkj1j1QKJ7j0plj1J1J1Prj0%jJ6J9qj3o%QKOLj7nJ5JKoj5
5744gPk1L2MqrkNLQ%j0j4QlJ3Nr%j2J5Pp%Jj1lJ1J1jj6%OmJMkLrNKNpkoOqK4J
5793A6j6rlJ3J2Kj3jj7J6JPj0JKoJ2L%%k5J1J5Olmj2mJ9jkmj4kQOlNj0mkLRJ1
$$ y = [-5, 4, 7, -2, 1, -12, -9, -2, 5, 4, 7, -4, 3, -3, 16, 8, 5, -5, -18, 6, 13, 6, 6, 2, -15, -3, -7, 12, 15, 0, 0, -10, -1, -5, -5, 3, -11, -12, -4, 7, 13, 0, 2, -9, 1, 1, 5, -2, 4, -8, -19, 3, 9, 15, -7, -7, -5, -18, 1, 16, 16, -3, -11, 2, 7, 9, 10, 10, -16, -9, 2, 17, 4, -7, -11, -5, -9, 9, 9, 0, -3, -9, -5, -2, 7, 12, -2, -2, -9, 3, 22, 7, 4, 2, -1, 7, 11, 15, 11, 2, -1, -4, -8, 5, 8, -1, -6, -15, 2, 4, 1, 2, -16, -5, -2, 1, 9, 0, -7, -10, 1, 9, 0, 5, -6, -2, -5, 4, 2, -6, 0, -11, -7, 0, 19, 7, 12, -5, -11, -3, -1, 2, 10, 6, -8, 0, 3, 6, 10, 2, -7, -11, -3, 9, 6, 6, -10, -5, -6, 0, 16, 7, -8, -6, -2, -2, 10, 11, 1, -9, -2, 0, 6, 19, 0, -6, -8, -2, 4, 11, 2, 1, -11, 5, 12, 7, 16, 0, -8, -13, 2, -2, -1, -7, -14, -7, -6, 13, -2, 9, -7, -13, -11, -4, 19, 6, -5, -2, -11, 9, 15, 13, 9, 4, 7, 4, 23, 15, 12, 3, -10, -7, 5, 8, 7, 3, 0, -3, 9, 4, 8, 4, 1, -8, -3, 12, 15, 14, -1, -14, -16, 2, 10, 8, -3, -14, -6, -4, 13, 3, -4, -7, -18, -7, 4, 11, 2, -8, -8, -9, 7, 26, 18, 5, -1, -1, 7, 9, 15, 18, 1, -4, 11, 12, 14, 8, -7, 0, -21, 11, 15, 7, -2, -4, 1, 4, 12, 12, 2, -12, -4, -7, 6, 11, 2, 2, -10, 5, 12, 5, 5, 6, -5, -8, 3, 14, 13, -3, -3, 3, -1, 0, 4, 2, 5, -4, 1, 3, 8, 1, -1, -7, -1, -9, 15, 16, 0, -9, -12, 1, 13, 15, 2, 1, -16, 0, 1, 8, -2, -1, 1, -5, 7, 10, 10, 10, -15, -4, 11, 17, 14, 10, -2, -6, 13, 12, 10, 6, -8, -10, -2, 4, 1, 6, -4, -8, -10, -7, 2, 13]
5837A3nj5pK1QJnj6lJ1MQLnj0RNrlLj9%J8lJ4j1qnKLJ3pj5j%J6J1j0rjnjJ8J7
5881B5j2k1RpJ1KpKj0JNJ5%pj5JPK0nLk0qPJJ6lj9pRJ1nMJj4MOJ2mn%j4J4mJ3
5925A2Jj4j1J8KkOj1Mj6OK3nkk0J3lPjljk1J1NJ3J0k2mjOQKlk1J0%J5Jj0mmOJ9
5968A9Lk0J0j3jmK7j2Ml0J3lJ2Pojj4J4JJ8j5qMj3PJ3j2Lj6J%K1Mj4lnjK2Oj0
6008Hj6LLJ0MLj6NJjPMrmj4KJ6PLk6PJKK3j0pj7JkJ5Rlj4qJJ6J1lk2kmJ2J4mj2
6053fjj0K4KNj3%j7MRJ5kok1NJ0J6Nj3j4LKJ2Lj0j4jJ7lJ1%pj2%J1J7j7nlkOJ
6095ARlnj1J6OQj4pJpJ4Onj2%nK1MKj1oj6KJ1J6j1j0rNJ0QLoj2ORM%nj5jJK2m
6140A0Jlj0%kJ6jj6%MORlj3%j%K0jj2lJj1J0RLk6lJ3KJ1%rrj1NJ7J0j3lj1J1J5
$$ y = [13, 8, -7, -14, 7, 15, 16, 11, -5, -8, 3, 7, 15, 18, 13, 3, 12, 17, 8, 5, 8, -11, -11, 7, 4, 18, 7, -1, -6, -4, -1, 12, 5, -10, -11, -11, 5, 16, 6, -3, -4, -9, -10, 8, 25, 13, -8, 1, -6, 5, 7, 0, 2, -8, -7, -2, 13, 13, 6, -9, -8, -1, 19, 14, 17, -3, -11, -4, -3, 13, 10, -9, -16, -7, 4, -1, 3, 4, -10, -6, 0, 12, 8, 3, 3, -11, 3, -1, 12, 13, -1, -12, 6, 8, 6, 12, 1, 5, -11, -5, 18, 13, 11, -9, 4, 1, 8, 7, 4, 3, -18, -7, -2, 11, 21, -1, -5, -6, 0, 8, 10, 7, -14, -4, -4, 11, 12, 2, -2, -6, 0, 19, 22, 2, 12, -1, -2, -6, 21, 9, 13, -17, -4, -7, 5, 12, 6, 5, -9, 5, 6, 24, 9, 1, 5, -8, -1, 12, 0, 3, -13, -12, -12, 9, 13, -1, -4, -9, -10, 12, 18, 8, -8, -5, -2, 8, 12, 15, -1, 4, 5, 4, 11, 15, 6, 2, -12, -10, 6, 13, 16, -10, -3, -2, 0, 23, 13, 6, -11, -10, -12, 3, 12, 9, -5, -13, -12, 4, 15, 12, -10, -12, -16, -4, 10, 6, -6, -7, -17, 7, 9, 14, 1, 1, -16, -12, -3, 12, 10, 4, -17, -12, -2, 14, 19, 6, -8, -5, -3, 9, 12, 2, -12, -13, 4, 1, 12, 12, 5, -7, -7, 4, 21, 4, -1, -4, -6, 0, 1, 10, 7, 2, -9, 7, 13, 21, 7, 0, 1, -6, 8, 14, 9, -3, -3, -8, 13, 17, 19, 8, 2, -14, -12, -1, 15, 4, -6, -15, -10, 0, 8, 11, 5, -7, -1, 8, 12, 12, 7, -8, -9, -8, 14, 10, 11, 8, -2, -2, -4, 12, 11, -5, -5, -1, 5, 14, 11, -2, -2, -3, -3, 17, 16, 4, 1, 2, -9, 1, 10, 13, -13, -16, -3, -1, 10, 10, 1, -8, -19, -14, 3, 13, 0, -3, -14, -3, 12]
6183A2J2k0jj8J5OJ2lpj3JmJ8Jqj3m%J9J0j0j2koPK1Lk7jj1K3J2Nkk0rQJ5J0j3
6223FpQk2J7J0Nnj8NKJ8jopj1OJ4Rj0j9kR%J7j0j3pMkJ4kQj4j2J7RJ1j6npj1J9
6265AONrqpJ3J8Kj4j8KNJ1Pp%j3qJ8J2qlk0j1K7OJj2jj3NJ1J3jj8Jj3J8J5lnk1
6307a6KJ0K0jrj7KMRJ2j3kj3LOJ0onj4LK2L%mj1%mORpnrQJ2NJ2k8j0PJ5%LJj7
6351gPkK4krj6moK3jjmj7KLJ1J7j7j8KQJ5Pmrqj1K4lPj2j2nJ9%J7j6Kj2JK2jj1
6394Cmj3QJ9NoLk3mJ7KJ4j3j9rJ0LJ8qjrpJ0J7Ok7Mj0J9J2orj4j2J9J2J0kk3k
6434a0jJ5J3Kj7j9PMJ3J2j4olkK1Kj3j2j4OJ3J8j8roOJ1J6mnj8jJ0PjkrmJ2J8
6474A8j3kJ3k9J6M%Mj2j3LKK0Kj0j0%QQkNj3j0j1J5J2Qj5j2oMK6Qj9mj9LK2Lm
$$ y = [12, 24, 4, 3, -15, 0, 6, 18, 15, 8, -5, -4, -8, 10, 11, 3, -10, -14, -14, 5, 15, 5, -7, -9, -15, -8, 13, 16, -11, -12, -23, 0, 12, 17, 15, -5, -14, -6, 9, 19, 6, -1, 7, -15, 2, 12, 17, 12, -6, -1, 1, 19, 18, 12, 5, -6, 0, 14, 23, 13, -6, -8, 1, 1, 18, 8, -5, -12, -8, -10, 4, 2, 10, -4, -16, 1, 10, 21, 5, 0, -7, -18, 1, 7, 12, 3, -5, -12, 1, 19, 21, 7, -11, -9, -4, 7, 14, 7, 7, -6, -14, 4, 16, 8, 5, -15, -26, 1, 7, 8, -4, -5, -18, -13, -2, 11, 10, -8, -7, -20, -2, 13, 10, 5, -16, -14, -4, 16, 15, 6, -11, -9, -5, 4, 16, 3, 1, -12, -9, -3, 7, 1, -4, -18, -15, 7, 10, 10, 6, -5, -5, -9, -3, 6, -1, -6, -15, -7, 5, 10, 22, -6, -16, -9, 6, 6, 9, 10, -7, 0, -2, 22, 20, 11, -5, -9, -15, 8, 7, 6, 2, -15, -13, -10, 1, 18, 1, -17, -15, -7, 8, 15, 11, 2, -6, -17, 7, 4, 11, -1, -13, -18, 1, 1, 18, 2, 4, -8, -7, 15, 14, 3, -1, -14, -6, 13, 18, 12, 15, -8, -12, 5, 7, 21, 8, -11, -20, -10, -7, 11, 3, 2, -7, -14, -4, 13, 19, -8, -4, -14, 5, 17, 11, 2, -12, -24, -5, 7, 17, 15, -8, -10, -11, 4, 17, 19, 2, -17, -10, -6, 7, 19, 5, -1, -4, -6, 15, 17, 4, -8, -22, -16, -3, 15, -3, -12, -18, -12, -1, 15, 11, 6, -12, -13, -3, 4, 3, 1, -8, -12, 0, 18, 5, 3, 16, -13, 3, 7, 7, 11, -1, -14, -11, -9, 11, 13, 3, -7, -7, 1, 9, 7, 12, -1, -11, -22, -7, 5, 13, -2, -14, -20, -16, 10, 18, -1, -5, -24, -21, 1, 4, 0]
6514@rOrK5l%oj6lJ5J0Qoj7Nj1K1Pkl0JnJ7J4rj1okPJ6Nmj4%oK0Knj0j0NNJ7j
6558A1mj2mJ0J0K0k1k1jJJ5Nlmj2OJ7Nqqj4MOJ5plj5j0K0KJ8rj1oPJ0Ooj0pJR
6600BMloj3LQJ6J0qqk0JJ1K0j3OnmjJ0Mj3knLQ%Jj7KNMJ5q%j5ONKJ9j6j8jmJ0
6645eJ5kpj3J3OKNj2pjjJ3Mj3mnJ4J3Oj8lj3nJ2J6pmpj3J8J1Lqk0%J3J6oj7Rj1
6687a3NJ6J0jj3j6jkJ3J4j0j4oJ4QJNj1j6JK1Mlk2nJ4%J4Nmj7lkJ6J6j2j5j5j
6726b5K4K2mj3k0jJ8J3Kk4jj3K6N%nj0j0KJ7JRj6mk%J9Kj2orkK8qMj7j7K0NJ9
6766A7n%k5MJJ7Qj2plPMk%j4rLJ2JJ2j0q%%K0Jk2oRMJ0opj1KJRJ6pqoKPJ9j1n
6812BrLPJ2okmk3J9NKlkj1kOJ8j1r%kMJ9mpoj2K4qLJj4knL3loj5KmJ7nJ7j1qj0
$$ y = [0, -9, -3, -12, 13, 10, 10, 4, -12, -15, 0, 10, 18, 12, -5, 0, -11, 10, 17, 15, -15, -14, -19, -2, 12, 3, -8, -14, -16, -9, 7, 12, 8, -6, -6, -12, 8, 10, 5, -5, -15, -10, -5, 12, 11, 7, -5, -9, 1, 11, 31, 10, -11, -12, -11, 4, 9, 6, 2, -10, -4, 13, 18, 10, 2, -12, -8, -2, 13, 6, 3, -12, -22, -2, 0, 18, 9, -2, -8, -1, 9, 15, 9, -1, -8, -7, 2, 6, 3, -3, -16, -13, -5, 11, 21, 13, 5, -15, -14, -3, 17, 4, 10, 5, 1, 0, 10, 14, 1, -1, -6, -3, 5, 5, 6, -11, -9, -4, 0, 15, 7, 7, -8, -2, 3, 5, 24, 8, -10, -11, -15, -5, 10, 8, 1, -12, 1, 7, 9, 14, 2, -5, -6, -7, 6, 10, -3, -7, -12, 2, 15, 21, 3, 0, -13, -18, -6, 10, 3, -1, -8, -21, -3, 8, 11, 3, -17, -17, -4, 12, 6, -11, -2, -13, -8, 8, 18, 17, 4, -12, -13, -15, -2, 12, 2, -12, -18, -4, 4, 5, 10, -1, -17, -16, 5, 9, 6, -16, -21, -7, -7, 7, 12, 8, -9, -12, -14, 2, 18, 6, -9, -24, -25, -1, 21, 17, 4, -16, -17, 1, 14, 16, -8, -9, -22, 4, 9, 9, 4, -6, -16, -14, 3, 4, 13, -3, -7, -9, -9, 10, 12, 0, -6, -15, -17, 11, 3, 7, -10, -27, -7, -2, 17, 12, 12, -13, -9, -8, 9, 17, 5, -2, -5, 2, 6, 4, 4, -10, -19, -16, -4, -3, 9, -1, -9, -9, -9, 11, 12, -10, -16, -7, -3, 7, 1, -6, -17, -15, -14, -5, 11, 4, -4, -10, -8, -1, 18, 7, 2, -7, -4, 3, 15, 9, 7, 3, -20, -1, 4, 6, 3, 1, -10, -12, -6, 12, 1, -8, -8, -10, -6, 13, 9, 2, -4, -16, 8, 0, 3, 4, -10, -12, -17, 16, 13, 7, -8, -6, -10, 7, 2, 19, 8, 0, -10]
6858a0PJ4kLj6j2KJ4MJ1k8J%J6Jjj2rLNJ0lOj2mJMJ2Lk3KP%K0rkj0%mJ1J7qk1
6901a2%J0KJ9lj2jj8QJ9qOk3j2J4J2J3qj0opK7Qjk1noJ2LJ5j3orJ4PjKj7JqJ8
6942CJ4j1Jj5kJ0NJ0j0j4KJ2Qmj0j1kj5K4Q%j5qJ4LLQj0ooOJ5oKj6jOJ2jKoNj0
6985fKJ8j5knmmK3Mlj6j3J8Mj%Kj8JLJ6J1rj5pJ0J4Oj8jj7J2K0Kpj3JmJ6Q%oj2
7028ekkJ7Nnj6j%J0J4lj5j0mJ8J2qj9RlJJ1J6k2j3kNJ2MPj4j8RJ6RqOmj8J2J0
7069A1J3j9j4kOJ0%%nj0J0NJmj%njRkj1Nj4MK7pMj9MJOQ%lj8mJ4J5%ok0N%J4J0
7114A7j4qklJ6Oj3Qj8JPJ0Mj3koRLJ4j5j9J1qJ6LNonqMRMrNj2PRQnj3%lJ3%nj2
7160a0kjJ6mJ2j5q%PLPjKj6LOQj5J0pKKMR%j7j0J4MJ5j4j1lJ1J2r%j5MnNJ2np
$$ y = [-10, -3, 11, 9, 12, -4, -16, -14, 0, 4, 15, -13, -12, -12, 4, 5, 4, -8, -17, -14, -9, 1, -2, 4, -8, -12, -11, -7, 5, 8, -15, -13, -6, -6, 14, 5, 3, -7, -7, -11, 0, 17, 9, -12, -12, -2, 0, 19, 16, 4, 3, -15, -7, 12, 4, 10, -13, -25, -11, 1, 14, 6, -4, -10, -17, 10, 18, 17, -4, -9, -15, -3, 0, 15, 2, -4, -13, 1, 8, 7, 9, -8, -7, -15, 3, 17, 6, 7, -8, -10, 0, 5, 15, 5, -9, -7, 5, 13, 9, -1, -12, -14, -29, -5, 3, 3, -12, -20, -6, -3, 0, 8, -2, -8, -14, -8, 7, 1, 3, -13, -14, -8, 4, 3, 5, -1, 4, -6, -4, 14, -1, -3, -8, -12, -16, 7, 11, 8, -8, -21, -3, 1, 0, 0, 2, -16, -15, -12, 4, 15, 6, -9, -16, -6, 8, 14, -4, -5, -22, -10, 10, 12, 5, -8, -7, -11, 5, 13, 13, 7, -5, -7, -9, 8, 13, 8, -8, -9, -9, 1, 15, 12, -3, -13, -17, 1, 13, 5, -14, -5, -8, -7, 4, 20, -2, -15, -17, -12, 0, 4, 11, -3, -21, -12, 4, 13, 5, 11, 7, -11, 1, 11, 24, 5, -9, -11, -5, 5, 5, 5, 0, -10, 0, 5, 6, 2, 1, 1, -4, -5, 4, 2, -9, -4, -18, -14, 13, 6, 10, -9, -5, -4, 2, 10, 10, 7, -11, -15, -1, 14, 14, 8, -12, -7, -7, 7, 17, 3, -5, -7, -10, 6, 12, -1, 7, -11, -10, -3, 7, 11, -2, -4, -10, -1, 2, 16, 1, -18, -7, -15, 1, 4, 9, 3, -2, -10, -6, 3, 7, -2, 3, -9, -2, 7, 15, 10, -3, -3, -6, 7, 7, 2, -10, -12, -13, 3, -1, 11, -4, -12, -12, -5, -2, 5, 4, 6, -10, -7, -1, 7, -8, 2, -5, -3, -1, 3, 12, 12, -5, -15, -1, 3, 18, 4, -7, -10, 1, 13, 4, 4, -11, -7, -12, -7, 5, 0, -7]
7204gOKpJ5Mj4pqJ5J0J4nk1%nQQQj6rJJ3OJ6k2j2rPK0Mlj2%qJ4J3jj6KKoK2j4
7247Hjkj3%J0J3qpnnJ1J4j0kojoJ6Rlnj5LRK1rj4j2lJ5QnLj8jJ4%OrkqMKJ3ml
7293Bj2OLOKpnJ%NmRj9%QJ0J0j0mKoMJ1Pmk4KPM%J2k3mKK3rpn%mRMNj1MLoOlj
7343ajjLPJoj2pNJ1QJ1k4rJ1OOJ0j6j1rJ6Nj%qqJ0PNKj6jlkJ4Oj1knNJ8mlnj9
7389a8K8J1j3%%j8OMJ3klpj2J7PmNj5oRJ3J3j7lk4PRJ5jpk2JJ7OMqj7jOJ7Nj0
7431EplnRQJ0j3joMNJ0j0o%qJ6lKmj5%K2KRj5k1lK3OJj0j4kLOJ0Nj3j0J0QLMj0
7476Bj8PONnJ3j9J4NKoNoqj0K0lOpj3JjJ1KjkmKOkNj6j2J3J4q%Jj2J7lNRk5Qj4
7522a6K0LMJj4%pJ4KNj1kKMKKj2NK%MOqj4PnMJ0Jj4LmJ2RpJk7MJ1J3qJj1oJ0J1
$$ y = [-7, -1, 1, -6, 9, 13, -1, -8, -16, -1, 9, 23, 18, -3, -3, -8, 0, 8, 16, 0, -9, -8, 5, 11, 27, 5, -7, -16, -9, 11, 15, 12, 0, 0, -8, 6, 19, 18, 2, 4, 6, 0, 22, 8, 7, 5, -8, -8, 2, 15, 7, 0, -5, -10, 1, 15, 5, 3, -3, -4, -10, 6, 15, 12, 7, -8, -5, 4, 25, 16, 2, -10, -13, 2, 10, 5, 8, -10, -11, 3, 3, 9, 0, -2, -10, -6, -4, 9, 5, 2, -10, -4, -1, 5, 7, 0, -5, -4, -4, 1, -3, 6, -13, -13, -5, 5, 15, 5, 1, 3, -3, 1, 12, 19, 15, -9, -7, 0, 4, 4, 16, -7, -11, -9, 14, 5, -2, -7, -7, -11, -2, 2, 7, -4, 0, 3, -3, 3, 0, -1, -2, -3, 0, 7, 8, 2, -10, -17, -12, -1, 7, 18, -6, -15, -4, 2, 8, 18, 2, -9, -18, -2, 3, 2, 2, -6, -14, -4, 3, 8, 10, -6, -7, -10, -12, 2, 8, -3, -5, -10, -5, 13, 9, 6, 1, -18, 10, 21, 8, 8, 8, -10, -4, 0, 13, 11, 8, 1, -11, 6, 13, 9, 14, -1, -7, 2, 15, 28, 11, 8, -16, -9, 0, 15, 14, 7, -15, -14, 3, 9, 13, 5, -12, -13, -7, 10, 15, 5, -2, -5, -10, -1, 7, 17, 4, 3, -3, 1, 6, 16, 6, 0, 0, -8, 8, 5, 7, 3, -12, -12, 10, 12, 21, 6, -15, -18, 5, 11, 12, 2, -12, -14, -11, -5, 5, 10, -3, -13, -3, 5, 8, 12, 2, -16, -9, -3, 2, -3, 10, -9, 5, 10, 12, 6, 11, 5, -3, -13, 7, 4, 10, 3, -10, -9, -10, 1, 3, 2, 0, -4, -2, 4, 2, 7, -9, -21, -8, 6, -2, -2, -1, -13, 4, 1, 6, 15, -10, -2, -16, 4, 7, 11, 12, -2, -2, -9, 5, 7, 12, 1, -1, 1, 5, 7, 9, -3, 2, 4, 4, 8, 14, 6, -8, -1, -6, -2, 8, 9, -5, -2, -6, 6, 15, 8, 9, -18, -14, -3, 10, 2, 3, -8, -14, -4, 7]
7568GPj0JrJ0jJ4rnj6RRkLkQk5OJ3kJj1onJ2J9orlJoJ1Jl%jJ0j4J7lj4joJ1PL
7614A1rorOJ9%j0j0kmJ8j0J0%j1jMJ0jNj8J1pJPlmrKPLJ1pj2JOJ2Mjj6K%%Qlr
7660dJmJ6lpkj0nJ6lQjm%OJ1j5KpKmJ2nOj8mJ0QP%j4rROJ1pQj3LqQJ1j0orLJ1
7707COj4ojQj0J2Nlj2L%J2LKj6j1J6J1%kj1pJ7pJPnj7RLJ2Pj1j5JPKK0rpj1%J4
7751Fnklmj0J5KNj1lmJ0kPJ2k1J2nNkK%j1NmJ9Nj2ooPLJ2j4Mj2NPKKj3mNkJ3M
7797A3j1j1pJ0J5kLqj4LJ2JMmkqONPjmoMMoJ4j8JoJQOoj3RPmPkj5JkNRKj0qKJ4
7846EJ1j2lj1kJ5J0nj6J0qKRJOnj2PJ5jnjj3LPNLqj0oJJ5kjj7KnJ2J4jj0j0JJ0
7890@QRj2j8RlJ8Jpj5OrJ2J2%kj1j2J5J6lk0kJ%QKPj1m%jJ2Jk2J0lNjJ0Lj5lJ
$$ y = [7, 14, 4, 5, -4, 6, 5, 19, 10, 5, -11, -2, 7, 5, 8, 6, 14, -11, -5, 8, 6, 7, -4, -10, -15, -3, 16, 10, 1, -2, -1, -7, 4, 5, 2, 2, 1, 11, -3, 14, 11, -3, -4, -10, 1, 8, 11, 2, -4, -13, -7, 12, 12, 2, -8, -10, -14, 4, -6, 4, 4, -7, -8, -4, 6, 5, 10, -8, 3, -4, -3, 4, 1, -3, -12, -10, -3, 0, 11, 4, -8, -7, -1, 11, 15, 14, -2, 0, 0, 0, 8, 5, -4, -3, -7, 9, 6, -1, -3, -13, -18, -2, -5, 3, 2, -2, -2, 4, 15, 0, 2, -5, -3, -7, 5, 0, 6, -12, -16, -6, 2, 9, 9, -5, -14, -5, 1, 12, 5, 13, 0, 3, -5, 3, 14, 4, -2, -11, -8, 3, 9, -5, -11, -12, -4, -14, -2, 3, 0, -12, -9, -9, 3, 6, 8, -8, -19, -3, 8, 8, 6, -5, -12, 5, -2, -1, 6, 1, -16, -7, -4, 8, 15, 4, -11, -10, -3, -1, 19, 10, 3, -8, -8, 6, 1, -1, -4, -8, -18, -3, -1, 4, -7, -10, -14, -4, -6, 1, 13, -8, 4, -1, 4, 2, 4, 4, -7, -2, -6, 13, 18, 6, 0, -6, 1, 4, 16, 2, 6, -6, -1, 6, 8, 10, -3, -7, -2, -4, 9, 13, 2, -9, -16, -6, 9, 7, 10, 2, -12, -9, 3, 4, 8, 4, 2, -6, 0, 5, 12, 11, 7, 1, 5, 9, 3, 17, -1, 0, -6, -5, 3, 9, 3, -10, -1, 6, 2, 9, 7, -8, -7, -9, -4, 5, 7, -3, -11, -9, 5, 16, 4, 1, -10, -12, 3, 13, 8, -8, 2, -6, -4, 5, 6, 12, 7, -5, 2, 17, 16, 11, 10, -3, 0, 7, 12, 15, 7, -3, -9, -8, 7, 5, 4, -13, -11, -16, -4, 10, 9, -1, -11, -10, 0, 8, 17, 5, -13, -4, -7, 11, 12, 5, -10, -4, -13, -1, 11, 11, 9, -2, -14, 1, 17, 14, -6, -8, -7, -7, 1, 3, 10, -1, -5, -5, -6, 6, 7, -15, -5, -8, -3, -4, 6, 9, -6, -9, -8]
7934hJ9Mnj7ljRJ5Kqj2OmJ5Kj0Qj7KOKlmLj0PJ2lkj0jLROlj6KLQJ4lj2j9QK1m
7980A1JqnJjONLj0%PpOMj6Jj3J1J7qkj0kJ8Nj0Ljj0MNrQqlMMMoOj9J6jLPnj0N
8028AlNjkkJ0rJ5pokMqNLJ%onJnL1j6j2KkQQj1RpoJ6LknqjR%J2j6lmLJ0Rk1Pj
8078AqJ7Jnkk%nJ0jLpj6J2NKlj3MnJ6OKrj2NNlJ2j0lmQQOmj8kJ4oJRj4mjJ5jJ
8126EMppjPKlllOKKNj1%pLJ2Opn%nJ9j4KmmKJ4mlKJqRlJ4nrjrMKJj0MkKJ3mqm
8179hJ4OlkOj9LKjMMo
$$ y = [-8, 11, 15, 10, -7, -10, -11, -2, 13, 15, 7, -5, 1, -3, 12, 14, 4, 12, -5, -3, 3, 5, 2, -2, 1, -9, -2, 10, 7, 5, -5, -6, -3, 6, 12, 9, -7, -5, -2, 6, 20, 17, 5, -14, -6, 15, 11, 12, 4, -1, 0, -1, 5, 10, 13, 3, 3, 10, 3, 9, 13, -3, -2, -15, -4, 13, 5, 3, -7, -9, 9, 14, 4, 7, 6, -4, 0, 5, -4, 4, -4, -7, -3, 1, 5, -1, 5, -14, 2, 1, 4, 11, 6, -4, 1, -2, 3, 2, 0, -2, 8, -1, 14, 7, 1, -1, 3, -5, 0, 3, 4, 4, -2, -7, -6, -11, 20, 4, -8, -6, -8, 0, 8, -3, 6, -1, -7, 9, 12, 10, 5, -3, -4, 5, 5, 17, 1, -2, -6, -3, 7, 16, -5, 2, 1, -7, 10, 11, 6, 4, 2, 2, -3, 7, 6, 9, 2, -14, -2, 3, 5, 2, -11, -7, -12, 4, 10, 12, 3, -9, -4, 1, -2, 10, 0, -3, -7, 1, 9, 15, 11, -7, -9, 5, -1, 0, 9, -5, -9, -10, 5, 4, 5, 9, 2, -5, -6, 1, 3, 0, -3, -6, 0, 2, 4, 9, -2, -2, -9, -6, 6, 12, 5, 0, 0, -5, 14, 0, 2, -2, -6, -4, 10, 6, 3, 5, 6, -2, 7, 4, 18, 13, 4, 3, -6, -2, 0, 1, -9, -5, -7, -5, 8, 4, -4, -8, 6, 12, 9, 7, 13, -6, -3, -1, -2, 2, 6, 0]
8191@
$$ Imaginary data points
##PAGE= N=2
##DATA TABLE= (X++(I..I)), XYDATA
0@%%%%%%%%%%%%%%%%%%%%%%%%Mj1J4j4J4j4J4j8K5k8K8l2L9m2M6n3O0o7P4q2Q9
45D6r9J12j24J35j47J61j79K00k19K39k64K92l24L61m03M49n02N69o48P42q62
66d65J008j162J131J663P4083j1029r6893k0819M7336J7209k0974J9777L6377
79D7242k9599p5016o949P6452N8843k6570o4471l1596J8607L8882K6320j974j9164
92A1007k1243k0364q385L2569N8784Q664p2185o2183L4848P5744Q166m5936j2349
105a2863J8130j7308k8860L6365O6340j5000q6860l0405O4845N6078k0195l9461
117i194l010M483j3593M940M0941K3474l5515n4053p186M4461M4579Q09l8019
130C117l4610R85K5049J8041N884L714j1047l6504k2283L6864N8800r03o0000
$$ y = [0, 0, 0, 0, 0, 0, 0, 0, 0, 0, 0, 0, 0, 0, 0, 0, 0, 0, 0, 0, 0, 0, 0, 0, 0, 4, -7, 7, -7, 7, -7, 7, -11, 14, -14, 14, -18, 21, -21, 25, -28, 32, -35, 39, -43, 46, -53, 59, -65, 70, -77, 84, -95, 105, -114, 125, -139, 153, -171, 190, -213, 236, -266, 303, -345, 397, -465, 543, -619, 512, 2175, 76258, 65229, -31664, -52483, -5147, 12062, -8912, 10865, 47242, 17643, -57373, -64322, 12130, 70973, 44403, -20068, -51664, -33057, 5825, 32145, 30171, 11007, -10236, -30600, -38985, -6416, 52368, 61032, -11153, -73336, -38488, 37256, 45422, -514, -12863, 5267, -12041, -40901, -4536, 61804, 46804, -40056, -70461, -5616, 50462, 30267, -9194, -12204, -7721, -21314, -16374, 24567, 48041, 12526, -41527, -48713, -4252, 40327, 41136, 3117, -31493, -30508, -5459, 12582, 18466, 22180, 11133, -25371, -47654, -10790, 48010, 47107, -12893]
143a2893l3622K8720L3612k781p218R583q863l6729p765M8257M0973k5304n4297
156b8327j2154L2042K6840J868p033j0239j9046j3376J5483L5604J7115k3358
168A5419m0674j4637K6728L7625Q559k3312k4261n700N711J0926J9561J4264j7451
181A2758l9256j1913L4636L6635n783l1684j5513O282Q508Q675J4783L910k3965
194a927k8980M995L5874K3280j3942k9826j4129P973J7550J5537N291j1672k3606
207a3582j4854J2033L0350J7918j4374l1390j5380J3774K4752J2335n608j5552
219D22j6301o182J3606K5494J0789j9024k8780o323K0657K2526L661j3003j6464
232h922r867L913J8341J8666j511k3474k1783L103K3935J9890j741j8855j8603
$$ y = [-12893, -46515, -17795, 15817, 13036, 5818, 15401, 6538, -30191, -37956, 10301, 51274, 25970, -28327, -40481, -8439, 18401, 20269, 13236, 2997, -16049, -29425, -13942, 21662, 38777, 15419, -25255, -39892, -13164, 24461, 33020, 9708, -14553, -20253, -14542, -3616, 15945, 30209, 12758, -26498, -38411, -3775, 32860, 27077, -4607, -20120, -13838, -5330, 3345, 18128, 22038, -1927, -30907, -25912, 9962, 33242, 19300, -10526, -24655, -16682, 868, 16405, 21696, 10024, -13582, -28436, -16403, 13947, 31865, 17491, -13899, -29279, -15505, 9247, 21582, 15974, 422, -15879, -22061, -8455, 17039, 27828, 8804, -19976, -26299, -5642, 16884, 20545, 7542, -8922, -18789, -14876, 3465, 22131, 20620, -2854, -24637, -21534, 2401, 22291, 20550, 1695, -16908]
245a6908m271J2904K0465J1229r595k3380j5310Q387K3900J5969o492k0950j5667
258a9719K230J6773J7005L087j4289j9724o609J3835K1156P725j2893k0293q789
271b0505R819J8865J1585n698j8514j5309K341J8780J8039J44j7892j9035l091
284b0471J5008J9343P041j1315j9808j0953Q000J9961J3700n180j8932j5105K166
297a6545J6844J6140J183j4748j7370m107J3156J8218O277j1492j8388q366R299
310i899J8340J0867o639j8370j3578L960J8177J5770j213j7038j7279k085J4796
323d191J8374N768j2039j9086r051R231J8985J1463o266j7815j3147L066J6004
336A296J4470Q7j4293j5613k577J2836J6119M462j1066j6025o450Q800J6000R008
$$ y = [-16908, -21179, -8275, 12190, 23419, 13824, -9556, -24866, -16479, 7421, 23390, 16898, -4052, -19719, -17489, -716, 16289, 19376, 5087, -14637, -21246, -7411, 13745, 21470, 8577, -11716, -20505, -10686, 8179, 19764, 14066, -4448, -19757, -17416, 1364, 19403, 19547, 1655, -17380, -20471, -5463, 13880, 20921, 9606, -10202, -21155, -13155, 6806, 20506, 15326, -3606, -18711, -16545, 299, 16439, 17622, 2874, -14496, -18603, -5447, 12771, 19048, 7556, -10832, -19198, -9899, 8441, 19308, 12669, -5701, -19279, -15319, 2858, 18628, 17415, 377, -16902, -18987, -4191, 14183, 19951, 7912, -11174, -20225, -10994, 7991, 19454, 13188, -4627, -17774, -14708, 1296, 15766, 15853, 1560, -14053, -16630, -3794, 12325, 16787, 5721, -10304, -16754, -7954, 8046, 17054]
350A7054o414j6476j1632M438J6780J3414k529j5782j4379m30J3356J5486M539
363A7425j0727j7131q288Q977J8231J0181p528j7184j0571M630J4250J1558j94
376A3629j1963j4121l369J1859J6260M278j2109j5777m101J0112J3733N833o103
389H161j3136r851K872J4721J3404j774j6151j4550J379J5150J3742N48j1346
402C169j3019n108O840J4608J0577n012j7877j2789O364J8148J0255o029j2967
415b840q189J65P620J1896O617q428j7609p112J2434J7457L412j1412j2351l683
429a2023M956R848R198K14j1955j4233j302J4407J5685Q48j4348j4351p68J1135
443b689J1004L124m392r326j0169j165J3893J6651j425j9454j3491P293J4959
$$ y = [17054, 10640, -5836, -17468, -13030, 3750, 17164, 14635, -1147, -15526, -15956, -2600, 12886, 17425, 6698, -10433, -18721, -9744, 8487, 18668, 11140, -6044, -16615, -11985, 2265, 13823, 13629, 1666, -12455, -15824, -3965, 12295, 16573, 4464, -11313, -15414, -5302, 8431, 14264, 8161, -4975, -14826, -11954, 2767, 16171, 14397, -1754, -16304, -14925, 225, 13967, 14515, 3169, -9850, -14958, -8118, 6490, 17067, 12055, -5822, -18611, -12247, 5901, 16156, 10127, -2840, -11029, -10864, -3244, 8652, 15269, 6841, -10768, -17880, -5446, 12011, 15423, 4011, -8340, -12023, -7067, 2781, 11979, 12193, 238, -13995, -15297, -890, 14795, 15643, 1295, -13056, -13824, -2689, 8315, 11439, 7047, -2279, -12448, -13613, 280, 16931, 15506, -3948, -17439, -10146, 4813]
456D813N115l295l757o260q851J502J6880J3007r757k0867o003J2942J3514K198
470A1181n281p367p753k504Q674J4014M626j1150j6366m977J2079J6775L706j2189
484C468j2816j137O231N517N800M845o695j7657o303J7828J9633n029j9861o670
498a2846Q569N387m1N489M609j1428j6991L509K2159J1083j2569j6647k477P486
512d708P096N013J907n659j1074n841O636J4074Q385p256j7437q401J1261J6370
526A0366J489j0244n232N20l446j245J2746J3088j0267k3514k661K1478J3059
539A6137r829j1154J714J256n527L331J5437M330j7691j6377O870J8608O976p556
553F525r697m797J77N173Q020M752l303j0140r570J701J5227J3103o824j9166
$$ y = [4813, 9928, 6633, 2876, -3384, -12235, -10733, 6147, 19154, 9397, -11470, -17473, -4531, 8983, 11181, 5900, -1467, -9220, -11724, -3050, 10964, 15590, 4440, -11926, -16903, -4824, 11951, 15657, 3468, -9348, -10485, -4254, 1263, 7063, 11908, 5213, -12444, -18747, -919, 18714, 13685, -6176, -12846, -4277, 1110, 1069, 6558, 11167, -261, -17252, -13743, 8416, 19499, 6930, -9717, -12194, -4708, 2388, 7401, 9308, 3649, -7425, -13266, -6630, 7444, 15829, 8573, -8864, -17265, -6004, 10366, 11855, 1611, -3621, -3101, -6547, -7792, 4954, 18042, 7775, -15739, -18400, 3078, 16137, 6308, -4846, -3132, -1876, -7403, -4072, 11365, 15695, -1996, -18373, -11503, 7105, 14081, 6525, -3172, -7969, -7792, -2619, 5401, 10153, 6850, -3290, -12860, -11159, 4068, 17171, 10347, -8819]
567h819o233J2090R887k607k240L067n182j3269J682K1133J0692j6985j9559M548
581a1795J6243L560n710l4P71q717p232R835J6658N98j6215j2134M202J2360P332
596I722j897p068o092j843K325N785P577K117j0141j4105P65J7211J1184q920
610F620j3826m88O535N51P0P611L196j3068j3562P750J9565M058j4220j0508L188
625f528N769J482K975M443l819j2038n294R879J3806J749j1161j0941o7Q580P294
640F129O24l445m231m906k621N919J1862L181j2385j3170L208J3914N864n806
654D137n747j053j929j488O746J0294j597j4519q908Q092J3432K844p159o636
668c491k210K42L374P106M659n066j1282n105P456J1820L251p722r091j683M674
$$ y = [-8819, -15052, -2962, 6925, 4318, 2078, 5145, -37, -13306, -11624, 9509, 20201, 3216, -16343, -11795, 4448, 8008, 2298, 2264, 3035, -5682, -12914, -3079, 13579, 14177, -2038, -14172, -9970, 2390, 9722, 7825, 757, -5335, -7178, -4853, 932, 8509, 10626, 485, -13620, -12855, 4356, 15540, 6620, -7206, -7694, -1159, -608, -538, 7073, 10269, -2799, -16361, -8611, 10954, 15012, 792, -9716, -6528, -759, 723, 3698, 8141, 4322, -7716, -13010, -3131, 10675, 12424, 1263, -9678, -9745, -1165, 6129, 6753, 3308, -923, -5829, -8450, -2531, 9331, 12512, 127, -13043, -9835, 4079, 9943, 4137, -1610, -2663, -4592, -6080, 666, 10960, 9363, -5156, -14064, -5972, 7460, 10304, 3145, -3491, -5701, -5459, -2085, 5021, 9680, 4614, -6668, -11773, -4317, 7503, 10754, 3032, -6059, -7742, -3068]
683c068N169L182O91m076q004l584P401J1145J177j0190q655J850P394M437L47
698E216j889m816n962J77R001Q603k506j1012o902L753Q633M930j208n041n810
713d833k922L518Q447N436m108j0048n373M746R168M195l512o566m233L83M773
728i29O293K322n268q555k629O574Q585J622o011o875j980L466N961M318j158
743E736o858o771N72Q040P400p19p592o765j67N703O444K291l793p093m352K919
759e005P854N227k612p650n156J815O495N176l00n268n853j294M743O702K287
774G161m544p046k796L949O779L445k761o400m531J345O216N693j11o049o466
789f116q69N537O729J825m492o715k985L286O632M105k167o572m937J271O317
$$ y = [-3068, 2101, 5283, 5974, 1898, -6106, -9690, -2289, 8856, 10033, -157, -8812, -6962, 432, 4869, 5216, 3327, -1489, -7451, -7274, 1727, 10330, 7824, -3188, -10090, -6337, 2296, 7226, 6018, 977, -4833, -7755, -4237, 4210, 9646, 5538, -4510, -9883, -5137, 4031, 8226, 4714, -1852, -6085, -5702, -929, 5364, 7686, 2418, -6137, -8766, -2192, 6393, 8015, 2004, -4871, -6851, -3385, 2576, 6894, 5736, -1122, -7893, -7321, 719, 8119, 7400, -192, -6957, -7124, -1421, 5023, 7314, 3521, -3572, -7924, -5005, 2849, 8076, 5464, -2186, -7342, -5527, 968, 6144, 5844, 576, -5277, -6571, -1828, 4874, 7161, 2617, -4429, -7225, -3276, 3503, 6948, 4187, -2213, -6744, -5399, 817, 6510, 6399, 350, -6116, -6985, -1448, 5281, 7106, 2614, -4101, -7086, -3800, 2832, 6937, 4770, -1802, -6739, -5468, 849]
804H49N429m56n770n703m67N120N981J451m388o316k459L659O551L430k892o674
820b655m300K089O508M934j030n938n468k77N110O040J645m333o575k747L742
835c255O674L302k945o162l732J738N469M454l82n089n387n39N120N907Q78m883
851A168n762j282L901N410K398k533n610l928J634O228M940j301o294n067P48
866e350N339M866N83l784n227k488K770O122L789k594o644l887K592N911L350
881E348j506m298l713n56L425N291K080m100o596j885M844O113J230l852m737
896b912j991J595M382M190o0n404n920J8O289N910m41n615m818j10L487M104K176
913D880j368m905m582J017O600N108k279o735l411K477M280K279O7j854m043l092
$$ y = [849, 6278, 5822, 52, -5651, -6118, -998, 4983, 6434, 2046, -4270, -6729, -3070, 3481, 6911, 4019, -2655, -6955, -4866, 1642, 6576, 5546, -392, -5860, -6137, -1027, 5013, 6658, 2325, -4250, -6997, -3255, 3419, 6721, 3776, -2386, -6118, -4380, 1089, 5543, 5161, 72, -5315, -5854, -734, 5173, 6051, 1168, -4594, -5876, -1975, 3435, 5833, 3300, -2310, -6238, -4604, 1624, 6564, 5263, -1031, -6098, -5350, -11, 4855, 5438, 1654, -3573, -6061, -3291, 2831, 6620, 4026, -2618, -6505, -3913, 1998, 5348, 3842, -456, -4169, -4725, -1300, 3991, 6071, 1971, -4625, -6510, -1666, 4447, 5677, 1825, -2912, -4903, -3308, 1074, 5264, 5204, -200, -6120, -6102, 187, 6097, 5656, 41, -4777, -4887, -1400, 2704, 4880, 3512, -1393, -5975, -4958, 1642, 6750, 4471, -2264, -5675, -3198, 1082, 3361, 3428, 1574, -2469, -5561]
929e561K442O753L259m457o840j487M276M572J237j531l134l409r10L746N706
944D662J536n002o490q92N425N490J02l937l447j012P59K789M202J244n122o650
960f343M54P410M886k874n362j634J148J062K266L483k81o152n136L090P700K880
976F597m275n366j334J958K885K621R63k363m811k634L108O482K833m399o748
991d483j336M782M371o3j857j409k341k283K569O812K126o787o960J974O973K450
1007D538k578k006p36k149j028M311N701j116p343m342L437O038K036k281l311
1022h29k087k59J798L308K465j248n066m093K314O879L146m366n650j38L236J383
1038G93L01J830r2n236m237M304Q086N94p198m566K533L657O92M36J045k269n073
$$ y = [-5561, -3119, 3634, 6893, 2436, -4404, -5891, -1615, 2957, 4194, 2663, -471, -3880, -4790, -1044, 4662, 6198, 1196, -5294, -6186, -761, 4729, 4831, 894, -2553, -3565, -2806, -17, 4185, 5429, 307, -6343, -5889, 1521, 6407, 3533, -1829, -3463, -2315, -1253, 1013, 4496, 4215, -1937, -7073, -3983, 3717, 6597, 2322, -3044, -4378, -2420, 465, 3086, 4049, 1686, -3125, -5759, -2651, 3831, 6664, 2265, -4483, -5819, -1037, 3334, 3271, 1414, 5, -2336, -4619, -2050, 4762, 6888, 101, -6859, -4885, 2088, 4538, 1960, -46, -782, -2931, -3959, 352, 6053, 4937, -2406, -6748, -3311, 2727, 4763, 2482, -829, -2916, -3175, -1377, 1931, 4396, 3148, -1918, -6011, -3697, 3182, 6328, 1962, -3688, -3826, -590, 793, 1094, 2924, 2832, -2404, -6641, -2337, 5749, 6343, -855, -5421, -2888, 769, 1461, 1897, 2942, 673, -4400]
1055d400r25N828N613j452o175l701J764M239K658l95k286k554j572N18L499M143
1071D802l48n970m819K819O695J812l895l020K90K3m15K955M232j715p261k982
1087f797N668O297q16m772k193N27L75J268L324J598l658n455n07N167M790n54
1103D262m504l501M57K874K374P08n91k214l237p96M190N128p40o113l573K918
1119b358M290O51j274m66j392k908K5N120M122k934o385j677M016L887K66j524
1135A459j640k023j252K032M379J827l350n084j117L842M348M21l036k955o26
1150b775J095J993K343P88k895m459n37M749M353j210m561k275J265J962J452
1165A288J360j73l374l521J134N172K997k460m520j615J804K579J673L05j596
$$ y = [-4400, -5325, 503, 6116, 4664, -1511, -5212, -3448, 791, 3449, 3054, 768, -1786, -3358, -2840, 659, 4802, 4454, -1516, -6335, -3516, 3179, 4991, 1096, -1924, -1634, -1611, -2026, 929, 5161, 3446, -3815, -6797, -1129, 5168, 4352, -420, -2613, -2086, -1711, -443, 2881, 4479, 821, -4634, -5141, 26, 4816, 4262, -242, -3743, -3286, -412, 1962, 2670, 2079, -135, -3372, -4168, 22, 5150, 4410, -1703, -5276, -2358, 1932, 2583, 1309, 843, -549, -3457, -3432, 1688, 5810, 2876, -3509, -5186, -1170, 2717, 2983, 1459, -181, -2204, -3456, -1424, 2955, 4782, 1432, -3652, -4769, -927, 3421, 3842, 806, -2149, -2775, -1680, 313, 2656, 3444, 549, -3910, -4447, 302, 4655, 3445, -1116, -3391, -2126, -164, 1288, 2648, 2475, -899, -4420, -3286, 1886, 4883, 2423, -2097, -3712, -1908, 671, 2344, 2649, 1053]
1180A053l079j780J951M262J958k638m340j305K592L292R20j352k086j760m02
1195b714K108L431R64l234m095j86L705L191l24k446k184q57P63K589K634l32
1211C013l733l296Q81M006K760r20l027k270j02J794K622J486j290l452k241J515
1227b254L895K088j705l418j678J120K465J910J14k042k870r75K409L651Q97k780
1243H27l469o65K298K835J080j169k605k133L19K987K961j49l267l072J82K915
1259a25K700K08k008k477j103J152K776K020r15l214k274J018L131K021p65k495
1275c50j959l2J884K430Q62j782l000j261J868L189J341j666k950j485J040K550
1291F79J965k33k385k593l83K445L006N94k364k957o95J903K595J113j121k456
$$ y = [1053, -2026, -3806, -1855, 2407, 4365, 1727, -2613, -3918, -1326, 1966, 2886, 1534, -552, -2312, -2714, -606, 2825, 3789, 555, -3540, -3726, -21, 3170, 2846, 400, -1784, -2641, -1878, 711, 3345, 3013, -720, -4016, -3135, 871, 3631, 2711, -316, -2586, -2688, -894, 1728, 3214, 1924, -1528, -3769, -2254, 1641, 3729, 2024, -1394, -3072, -1952, 513, 2423, 2537, 495, -2375, -3350, -941, 2710, 3607, 827, -2642, -3307, -1009, 1826, 2906, 1737, -868, -3001, -2682, 305, 3266, 3117, -150, -3222, -3040, -125, 2575, 2783, 775, -1702, -2805, -1653, 1123, 3143, 2228, -986, -3260, -2242, 889, 2910, 2145, -350, -2309, -2341, -457, 1973, 2835, 1053, -1947, -3208, -1340, 1849, 3190, 1524, -1426, -2911, -1871, 679, 2644, 2411, 26, -2567, -2950, -505, 2501, 3095, 731, -2226, -2921, -1018, 1577, 2690, 1569, -887]
1307h87j805N30K660K344l75k826k426L28K556K267N5j969k301p75J465K657J479
1324B977j271l030j836J220L040J836r24k614j896K49K064K285N50j832k764j038
1340b984J841L007J116j767k760j104J276K282J388m86k036k034j50K247K624
1355B460K50k489k622j17K150K182M83j268k068j421N91K495K181n18k849k252
1371b812N52K579J981j52j844j953o36J216K291J409j018k761j775J185K905J577
1387B744j211k417j250N69J602J663N55j461k691j066K122L131O09k334k482l67
1403b284J398J761J177k19j970k274j37K581K643j24k613k315J35K012J884L10
1419A965j128j730j185L96K176K084m35k907k138J100K830J271j037j581r47l91
$$ y = [-887, -2692, -2162, 498, 2842, 2467, -359, -2785, -2457, 99, 2366, 2421, 452, -1849, -2624, -1159, 1498, 2977, 1706, -1324, -3160, -1940, 1100, 2936, 2012, -602, -2498, -2249, -185, 2100, 2650, 818, -1946, -2984, -1143, 1864, 2980, 1213, -1547, -2651, -1375, 907, 2295, 1809, -227, -2261, -2411, -164, 2460, 2710, 221, -2401, -2518, -368, 1814, 2297, 1029, -1039, -2460, -1869, 626, 2807, 2289, -560, -2812, -2260, 319, 2300, 2148, 304, -1649, -2285, -1069, 1222, 2631, 1613, -1148, -2923, -1738, 1167, 2744, 1533, -884, -2134, -1565, 37, 1700, 2255, 794, -1897, -2963, -841, 2290, 2899, 565, -1917, -2284, -886, 875, 2052, 1833, -137, -2411, -2548, 33, 2676, 2552, -61, -2376, -2241, -229, 1655, 1965, 837, -893, -2078, -1682, 494, 2578, 2143, -764, -2902, -1802, 1028, 2299, 1262, -319, -1266, -1657]
1435a657O69K116J643j328l269j296K182K856M64j610j692p81K09J389J917N47
1451B359j853k623n50K165K625L58k072k162k30J369J454P17j21j352k058m87
1467b461K426K829l74l144j887J153J964P40Kk68j449j908L61L092K161j601l250
1484a614j083J644K038P60m09j208j530o75J249K332J083j519k795j063J923K713
1500A846M67j821j693j85M80P35J430R73j517l031n59K999K663q72k538r54N57
1517a020M95P54J454L08k260k483O46L062J744j251k274r92N45J251J163M51p43
1534H50j725j217O69K385J671j182k875j141J755K119J80r09n99p44r75N83K644
1551A489J468k224l227j6K729J688o15j065o19q21m46J421K333K57k519k327M87
$$ y = [-1657, -988, 1128, 2771, 1443, -1826, -3122, -940, 1916, 2380, 770, -922, -1703, -1494, -105, 1812, 2359, 506, -2117, -2667, -502, 2123, 2481, 409, -1753, -1983, -614, 840, 1557, 1436, 84, -1974, -2461, -35, 2794, 2420, -724, -2611, -1458, 506, 1246, 1248, 980, -469, -2377, -2016, 1076, 3237, 1636, -1614, -2697, -1053, 985, 1745, 1336, 128, -1402, -2077, -828, 1504, 2587, 1068, -1727, -2790, -867, 1846, 2313, 492, -1201, -1386, -906, -171, 1259, 2232, 715, -2316, -2875, 124, 2787, 1915, -623, -1577, -1020, -525, 229, 1683, 1991, -269, -2752, -2106, 956, 2700, 1449, -825, -1817, -1272, -21, 1142, 1593, 850, -875, -2092, -1423, 962, 2633, 1451, -1424, -2565, -810, 1309, 1489, 580, -19, -763, -1738, -1155, 1489, 2957, 733, -2494, -2510, 219, 1907, 1292, 227, -392, -1213, -1659, -238, 2095, 2352, -167, -2494, -2007]
1568b007K412J639m84j630j223r6P88J214R93j70j803j927M04K744J824j355k612
1585a289o19J289J069L28L99j89j836j654J240L105R10k335k355J70J545J000
1601G78L22L3q91j672n87J663K284K60k042k045L7J788J499l9j019r91n75J5J141
1620d1J726K72k104k202N42K560J324j064j515m86K4K27J172J482m14k482j596
1637b575J387K601P41j436j600m82M02R03J177N26j010j967p91J425K235N84j634
1654D86j922k42J281J225L59k78q91j299m40J493K098J06k183j801N32J771R71
1671A266j88o56r69r19K02J750J562o16k206j291R03J849Q87n39j170r35k00P64
1689e06J404Q33q39j923r42J161J992N83j169j430m06M59Q72R63L60j053j752
$$ y = [-2007, 405, 2044, 1560, -70, -1293, -1389, -601, 613, 1606, 1436, -367, -2294, -1890, 854, 2678, 1323, -1289, -1908, -619, 450, 778, 1177, 988, -848, -2502, -1262, 1843, 2753, 418, -1937, -1767, -222, 778, 1100, 1133, 242, -1430, -2017, -354, 1930, 2190, 148, -1897, -1860, -72, 1427, 1388, 369, -622, -1197, -1182, -41, 1685, 1957, -147, -2349, -1807, 753, 2077, 1013, -502, -988, -964, -737, 435, 1917, 1503, -979, -2575, -1188, 1413, 2154, 718, -882, -1364, -962, -59, 1118, 1644, 634, -1333, -2124, -699, 1536, 2120, 486, -1436, -1678, -397, 828, 1187, 909, 18, -1281, -1721, -228, 1870, 1976, -207, -2008, -1476, 295, 1266, 1078, 422, -547, -1466, -1264, 486, 2048, 1432, -774, -2065, -1162, 687, 1574, 1035, -135, -1070, -1270, -506, 898, 1731, 892, -1031, -1973, -812, 1180, 1763, 594, -836, -1242, -783, 89, 1052, 1412, 359, -1393]
1706a393m64J592J869P7j556j380q2Q66J101O93k49j333j342J12J686J548k46
1723A499j724j372K50J376J122J13q18j191p18N21J611J123p08j881j002Q86J608
1740F95P23n05j103r37j61R93J469M77j204j744m25J264J578L97r25j323o40M29
1758i42J217J066m2j294j422j00J444J485L2j313j234j35Q18J082N96l86j290
1775d18j075L72J576J120m89j502r40L42J129R57R9q56j248n03Q26J489O98q44
1793G33j561p26P44J409P71m42j142r50k6J001J289L56j074j508l96J101J424
1810A003L49q40j172n56M03J131R53j39j302j201J24J380J212j12j231j115q5
1827a198Q97J140M52o30j323q04N76J501R09n69j458q68M15J169Q99m4r16j101
$$ y = [-1393, -1857, -265, 1604, 1681, 125, -1255, -1337, -471, 630, 1323, 1074, -259, -1601, -1489, 197, 1745, 1499, -225, -1597, -1347, 29, 1151, 1264, 446, -745, -1463, -942, 669, 1792, 1084, -797, -1799, -913, 695, 1418, 913, -190, -1127, -1288, -295, 1174, 1651, 447, -1297, -1722, -458, 1120, 1517, 592, -731, -1371, -942, 275, 1341, 1299, 5, -1417, -1517, -73, 1412, 1444, 131, -1103, -1238, -420, 662, 1258, 872, -418, -1493, -1121, 455, 1575, 1086, -416, -1356, -1014, 115, 1072, 1171, 315, -933, -1436, -610, 879, 1577, 733, -828, -1554, -810, 599, 1370, 928, -214, -1164, -1190, -189, 1100, 1456, 382, -1126, -1522, -421, 1003, 1352, 512, -660, -1216, -813, 318, 1271, 1132, -170, -1371, -1247, 133, 1345, 1233, 2, -1113, -1198, -301, 839, 1291, 661, -662, -1466, -890, 611, 1520, 951, -507, -1375, -960, 209, 1108, 1064, 148, -953]
1845i53l40Q42J342N26q52j414n54Q10J290N38n34j052p13J09R37J092J96j084
1863A86j364j93J192J271J38r18j041l91M36J062Q64k11j286j117K35J327J081
1880A271j64j150j023m9R00J047L14o54j100o38M53J317Q89n09j450q25N71J205
1898D05O51k27p62q88l73P42J397N57j035j502l10R56J120L60m44r34q12P8J084
1917F3J109j8j160j119l6J015J145J68r10j069k42O51Q97M98k36r93r75J50J384
1936C22J067m64j333o77L97P38N95K99l95j164p53O94J506N56q67j190l98M49
1954f18Q47O97Kq81j010j15Q71J079K71p80j166m33P99J187L48o92q88l80J63
1973f99P32R22J77j121j286J13J376R65l45q84n87j87K85R44Q37m06j423q14P01
$$ y = [-953, -1293, -451, 891, 1417, 565, -849, -1403, -593, 697, 1235, 701, -351, -1064, -955, -18, 1074, 1270, 186, -1178, -1371, -179, 1092, 1230, 312, -729, -1120, -684, 378, 1242, 1031, -255, -1372, -1137, 190, 1271, 1107, -43, -1066, -1115, -215, 832, 1146, 492, -608, -1246, -793, 524, 1413, 904, -546, -1371, -800, 405, 1056, 829, 67, -821, -1194, -452, 945, 1502, 467, -1035, -1345, -389, 731, 1091, 647, -287, -1099, -1021, 63, 1172, 1154, -6, -1125, -1161, -146, 999, 1167, 257, -812, -1054, -403, 494, 992, 756, -237, -1212, -1062, 322, 1389, 925, -408, -1085, -688, 50, 645, 944, 549, -615, -1368, -674, 832, 1388, 521, -669, -1067, -618, 229, 926, 928, 47, -963, -1078, -207, 872, 1143, 363, -803, -1236, -437, 750, 1098, 406, -482, -862, -699, 33, 955, 1132, 11, -1275, -1162, 214, 1179, 834, -50, -637, -824, -539, 405, 1242, 836, -587, -1401, -700]
1992g00J295N34m61q81o77K5P88R24J58p58j011l31O11J138N51o68j235m66P12
2011d52R51L26k55n80p28l02P79J303K12j229j147J71R67O43Q5k89p00p29J07
2030h67J165R26l78j201p25L44Q75O69Lo66q42k19N94Q82M19m30j000o74M37J196
2050E08O29n75j005l87K76N26O23L52n45j195m78R74J280R9r27q03j28L44O35
2069B03O39J8r38r72J04J084Q70j37r30p83rP32P84J65n34p55m07K81R09P25l01
2090G48j172p16N02J061M34l53n66m79k53L95J002N49p09j238l14Q17R22J82m14
2109C98o23m98J7O88Q21Q6q00r21j02Q00Q99J35p19q07j49M82O35L75j30p11p99
2130i23N9J038R05l20j057n77K91N97M89K20l03q53o00M53J135N29n99r95l98
$$ y = [-700, 595, 1129, 668, -213, -890, -865, -77, 847, 1005, 247, -764, -1095, -484, 654, 1205, 537, -698, -1164, -452, 499, 825, 570, -10, -738, -1040, -261, 1042, 1254, 25, -1122, -951, 16, 659, 744, 455, -245, -974, -867, 298, 1224, 846, -355, -1080, -736, 139, 808, 811, 145, -697, -916, -322, 560, 979, 549, -451, -1125, -688, 508, 1137, 562, -443, -830, -554, -28, 595, 947, 402, -793, -1271, -297, 983, 1082, 155, -648, -776, -432, 203, 842, 860, -78, -1050, -946, 138, 1008, 871, -59, -842, -851, -119, 665, 830, 296, -459, -866, -585, 324, 1049, 748, -424, -1140, -638, 423, 857, 504, -62, -541, -794, -399, 603, 1152, 443, -795, -1109, -292, 630, 812, 398, -225, -723, -706, -18, 803, 889, 89, -832, -934, -134, 765, 900, 181, -626, -775, -293, 342, 717, 587, -124, -923, -864, 174, 1079, 759, -298, -875, -584, 13, 502, 722, 419, -434, -1034, -581, 554, 1083, 484, -511, -909]
2149i09M00P39N10q3o29o90j47N93Q64L06o28j013l07P02R28J72n41o29k93J10
2169e45N59P31J06q60r54J00R91P09j76o78n38j20L38O89M80k87q94n64L32R12
2189C31N37k94p92n15J36O20N42Q1m19o80l76M07R08M51n40r28k86M79O46K99
2209F07j17m81o13j76O29Q83J26p70q28n1O33O74J79l77o32m22K01P16N97j13
2229F65p84o99J20Q00O60j18o75n40l8L98N92L66k99q30n11L96R19M26m23p35
2249c10l79J78N31N57J00n46p47j90N76Q10K14n31p67k48M07O63L53k22n92n05
2269f48J4O16O90M3o93p05J8O25N63N6l69n35l21K09O86N13k46p86m90K46O85
2290A71M56j07n39n09j10M43O44K55l93p26l69L73P74L78l34o79l77J69N38M85
$$ y = [-909, -509, 230, 740, 657, 28, -662, -809, -216, 648, 954, 326, -687, -994, -292, 636, 808, 267, -362, -655, -545, 14, 745, 851, -9, -963, -863, 128, 837, 661, -17, -555, -675, -337, 352, 832, 545, -349, -913, -581, 331, 868, 574, -218, -733, -597, 23, 565, 646, 227, -453, -829, -422, 486, 937, 397, -531, -817, -338, 308, 607, 490, 9, -604, -780, -151, 732, 858, 88, -740, -791, -158, 516, 695, 318, -314, -736, -535, 181, 778, 665, -119, -818, -698, 102, 762, 644, -31, -571, -609, -211, 381, 747, 448, -382, -893, -497, 422, 848, 425, -310, -689, -511, 20, 577, 677, 131, -616, -806, -230, 580, 794, 263, -504, -752, -345, 318, 671, 449, -143, -648, -634, -18, 672, 715, 22, -683, -665, -40, 523, 579, 210, -325, -646, -437, 249, 762, 516, -270, -760, -514, 171, 627, 520, -19, -528, -638, -195, 449, 704, 311, -415, -784, -411, 363, 741, 407, -272, -649, -480, 58, 543]
2310E43N9m89o65j82N59P56J45n59o58j43L94N51K98k11n80m81J11O72N77j07
2330E90o90n53Q2N90N11M2m35n55k40L34O54L63k96p02m13K72O66M00j62n44m30
2351e16mM32N47J64m17o43k49M18O81K53l97n90k50K39M63L86j7m80n95o8O14
2372b9O32J6n84n27n8L74M73K64k06n80m31J87O54M55j55o10m58O2N17N22J9m54
2394H3n00j52L22N43L33k40o77m24L21P12L37l01n22l05K1L53N38K12m73p23j56
2415f98N78O17P9m00m61k52J71N26M37j43n96m51J27N20M48Mm57n30p0M57N27
2436D33O6l41m19k53J58M95M13n4p22m47K83N73K78j13k77l80k39K68O60L13m30
2457B65o86j71L72M66K33j34m30m18L1N07M64k2m64m42q2L55N53J96m19n91j23
$$ y = [543, 602, 113, -552, -734, -175, 581, 726, 167, -491, -634, -240, 311, 609, 398, -182, -663, -552, 120, 697, 590, -100, -653, -571, 19, 530, 572, 137, -418, -658, -324, 330, 693, 397, -305, -718, -446, 220, 620, 458, -86, -516, -520, -88, 459, 623, 206, -437, -686, -268, 413, 666, 269, -321, -571, -332, 131, 517, 500, 20, -575, -643, -29, 603, 619, 35, -492, -550, -176, 297, 561, 355, -225, -656, -469, 185, 640, 485, -125, -583, -521, -4, 518, 537, 83, -417, -569, -247, 296, 629, 389, -288, -712, -391, 321, 658, 357, -165, -470, -449, -96, 442, 654, 181, -542, -698, -120, 497, 576, 176, -285, -537, -366, 160, 597, 454, -142, -593, -466, 54, 502, 506, 49, -481, -551, -94, 433, 499, 158, -261, -514, -356, 139, 552, 498, -224, -671, -388, 185, 463, 350, 73, -307, -546, -278, 382, 695, 265, -421, -592, -220, 246, 479, 345, -85, -503, -472, 35, 499, 477, 13, -429, -511, -156, 397, 593, 174, -417, -540]
2478e40L70M37J78j19m05m46lO02N83j50o53l90J56L71L21J66k16n49l57L17O63
2499C36K90l46n43k33J63M08L92k6m53m67jM28M38J10l36n00k37L34O08K01l73
2520A93m69j57J59L28L48Q8m61n65j4O06M60n7m67k85j16K04L51M00k19n02m29
2541f04K86M70L58j77l54m22L7L19N14Ol07m58j43K31M45L99l50m22m85M25M22
2562A90K57j12l95k37k31M44N39N0l31o79J5M56K96K00k38m34k06K1N27M56k62
2583C26m49k84l8M76M52j08l61l39j48L47M52Q4k03l53l78J07O61L68l88m64j27
2604c67R4K26L71J65l82n32p9M21M21R0k58l83k29J62M48L29j92m66k69J36L26
2625C2K88M9k87m30j21L40M48J08k79l72k21J39M58L95j67o06l86K69N21K74j51
$$ y = [-540, -170, 267, 445, 326, -79, -525, -528, 74, 657, 507, -146, -536, -380, -9, 312, 478, 262, -287, -644, -327, 336, 626, 280, -263, -496, -333, 75, 467, 441, -12, -479, -480, -52, 386, 496, 160, -340, -577, -243, 365, 566, 193, -276, -433, -274, 54, 402, 490, 29, -536, -550, 56, 516, 459, -8, -293, -409, -205, 146, 546, 327, -175, -604, -318, 152, 510, 333, -21, -443, -406, -87, 427, 433, 126, -332, -475, -244, 201, 600, 250, -172, -657, -232, 190, 447, 335, -60, -297, -528, -84, 455, 505, 174, -505, -490, -34, 262, 462, 224, -210, -416, -395, 132, 588, 326, -123, -407, -445, 31, 483, 375, 14, -325, -473, -126, 326, 410, 207, -146, -524, -417, 244, 612, 224, -240, -367, -273, -47, 324, 489, 107, -425, -504, -83, 338, 428, 170, -213, -442, -280, 168, 497, 305, -161, -430, -294, 32, 320, 369, 82, -348, -469, -129, 319, 427, 148, -224, -445, -306, 152, 547, 380, -226, -612, -343, 178, 452, 301]
2646C01l33k86r1K91M52J63l77m85j13L23M14J89k10m44k69J74M22L18p5l74l95
2667d05q8L82N34J33m17m98r2K78L16J90n5k91l67NM41L78j48m70k77J23L42L05
2689C19J01k49m11k43J93M41K38j70l77k36J44M06K98r3l76l12m6K31L44J43k33
2710A12m41j66L28M71J51k49l29j76P0K79L22j3l88m34mL90L81Pl33l39n7K37
2732a81L60K10j33l77k77J41M22L38j15m25l05R0L32K68M7k44l44j91K39M51K01
2753E07k78m47j92K27L58K06j07l17l06J0L20L53O4l26l84r4L31L81R7k60l11
2774a68j41J29K99K61k6l59l44O1L98L12n6l13k61m7J88L19J95j80m10k39J87
2795a95L81J99j50l57k67N7K96K96J9k83l46j07K52M00J71k32l93j36K42L33J78
$$ y = [301, -32, -318, -409, -118, 334, 497, 120, -365, -478, -155, 259, 448, 238, -206, -475, -301, 121, 439, 364, -10, -405, -493, -111, 423, 556, 139, -359, -451, -173, 143, 333, 278, -13, -380, -375, 66, 444, 296, -174, -451, -328, 14, 319, 420, 171, -240, -483, -290, 151, 389, 219, -158, -394, -250, 156, 454, 361, -15, -327, -373, -142, 202, 345, 112, -329, -495, -167, 304, 455, 206, -123, -299, -229, 50, 372, 359, -29, -463, -467, -77, 304, 311, -22, -361, -418, -181, 179, 389, 256, -121, -398, -257, 165, 503, 388, -37, -342, -252, 80, 348, 395, 151, -193, -384, -145, 306, 507, 229, -218, -410, -183, 175, 381, 274, -43, -349, -339, -19, 334, 398, 72, -312, -406, -75, 306, 403, 143, -168, -309, -180, 119, 380, 354, -5, -349, -288, 110, 422, 366, 53, -208, -255, -67, 252, 447, 267, -143, -382, -195, 186, 385, 235, -122, -389, -332, -36, 260, 279, -4, -350, -457, -205, 195, 366, 134, -259, -395, -153, 180, 358]
2816C58q6k74k60mL08L68pl87l83mL09K82L7k02k98j57J59L77K72j20l82k52J19
2839b27L74K34q1l20k85n9K40K95J27k19l56j37K46M02J84j72l39k05Q9K66K34
2860B91m0k85l08m1K97L65J00k70l27n8K30K44J16j35k97k64L7L40L43j9l56k61
2882b98Q5K70K09L2k00l05k08J57L84K35j39l51j73J26L06K08q5l30k77kK80L17
2904B41J09j87l37j50K06L67J01k61l35j13J79K67K21K1k67l62o1L24L16k2l06
2925d9k11MK02K48J49j54l57k53J39L67K47r3k67j99J2K39K19qk49k66k1K16L05
2948B20J79j74l70k46J43L58J91j02k38j51jJ62K47P6k77l47k5L32L09K7k10k43
2970a40j59N3K61K65nk97k52N0K59K00m3k27k37jK57K89N4k27k99j56J23L36K71
$$ y = [358, 272, -2, -262, -266, 42, 410, 403, 16, -367, -371, -62, 220, 257, 55, -243, -400, -241, 136, 408, 288, -94, -346, -227, 147, 381, 300, -20, -305, -364, -124, 171, 298, 79, -277, -414, -168, 234, 418, 246, -93, -298, -209, 57, 291, 251, -34, -342, -383, -86, 279, 379, 109, -218, -276, -46, 198, 314, 179, -118, -382, -345, -5, 338, 319, -37, -298, -213, 57, 266, 298, 98, -207, -415, -258, 126, 361, 222, -129, -302, -176, 130, 338, 253, -77, -354, -356, -76, 241, 350, 163, -174, -324, -118, 249, 350, 89, -246, -359, -180, 87, 308, 329, 62, -300, -361, -37, 279, 257, -49, -260, -256, -54, 194, 343, 189, -168, -421, -282, 85, 332, 239, -28, -227, -215, 24, 243, 235, -14, -280, -301, -85, 220, 399, 225, -145, -391, -248, 110, 301, 199, -39, -190, -191, -29, 218, 294, 17, -330, -355, -23, 286, 313, 103, -140, -299, -246, 15, 280, 275, -22, -274, -224, 35, 235, 192, -35, -272, -273, -16, 273, 327, 100, -199, -355, -232, 104, 375]
2993C75p3l51k81P8K87J99l2j67j99q3J73K98R7k78l31l2K65K55R9j37k50k39
3015c27J9L07K97Mk79k68k4K02K33Q0j67k24q4J50K15R3j06k30j88Q4L42K20j01
3038B48l39k16N5K24K22J12j43l14k27J52L49J97j40k60j64O6J87J92rj90k04
3059b02j7K09K14L5k22k46o3K46K78O3j94k63j16Q4K46K65ol23l26L8K95K68P
3082B70j87k17j21P8K64J86r8k64j56R9K13J44n8j96j74N1K17J54k5j79j98o0
3104b57J86K88J10k53l08m8K04K26J02n7j97k51n4K83L26J5k84k61j4J69K03J24
3126B52q5k40j85P3K45J50l7j91j65l7K08K15Mk18j88L0J41J49P6q9k42j56J49
3149a41L30J07k09k15q0P5J57K12L4k51l15MK90K65Ok02k28j19J29K85J76j23
$$ y = [375, 302, -49, -330, -252, 35, 234, 202, 35, -164, -247, -74, 224, 321, 43, -288, -320, -55, 200, 299, 162, -88, -327, -308, -1, 296, 300, 21, -247, -271, -69, 164, 244, 77, -147, -231, -81, 134, 227, 121, -109, -297, -213, 129, 349, 248, -91, -307, -252, -28, 194, 306, 163, -151, -378, -226, 123, 320, 180, -80, -244, -178, 9, 201, 192, 2, -202, -219, -10, 204, 239, 17, -229, -292, -46, 232, 295, 101, -162, -278, -194, 52, 317, 311, -12, -338, -300, -5, 263, 270, 83, -134, -255, -177, 87, 273, 175, -89, -245, -146, 67, 211, 153, -43, -217, -166, 51, 205, 180, 1, -197, -257, -71, 217, 327, 74, -234, -282, -78, 148, 250, 193, -4, -255, -309, -26, 300, 315, 31, -230, -244, -75, 128, 252, 167, -73, -258, -185, 60, 210, 173, -18, -183, -220, -12, 203, 207, -11, -199, -169, -28, 121, 197, 108, -134, -290, -141, 189, 296, 87, -128, -208, -133, 24, 236, 270, 19, -296, -292, -2, 263, 269, 67, -161, -280, -151, 134, 310, 187]
3171A87k72j85N3K27K12L8k06k99m5K38K48K8j66j45j14L4J92K09l2k63j95J05
3193a51K12J22m5j23j33o2J22K21M3j63j82n2J44J81O1j08j89j11J06J86J26o0
3215A45j91j70J2K16K11nk21k20qJ85J96Q7j16k29j69P5K94K10r2k79k01M6K41
3238A7J93L3j62k47j23J47K88J67j50k95j51J20K40J53m8j79j97l1J78K19Q4j77
3260G9k42q8J58K24P9j03j84j10N2J71J49j9j62j81j4J73J87J6j65j56j0J06J36
3283I6N2n6j49j22O1K06J23r7j89q6O0J36J11%j26j81k8J58J88K8j41j84m6J22
3307f4J74Q4r1j87j18O0J90J56k3k03j95J8K10K05j2j70j72m4J11J91J24p8k47
3330h1j93R9K75J51p9k22j47J0J62J97P4j54k57j05J62K65J12j48k28j12O6J91
$$ y = [187, -85, -270, -217, 10, 222, 260, 54, -245, -290, -52, 196, 224, 58, -87, -201, -167, 25, 234, 202, -61, -256, -151, 61, 183, 138, 15, -118, -180, -58, 163, 206, 43, -139, -191, -47, 134, 195, 87, -102, -213, -107, 79, 205, 145, -46, -216, -204, 12, 223, 218, -3, -223, -231, -46, 150, 237, 121, -108, -277, -202, 92, 302, 210, -69, -270, -224, 17, 210, 243, 81, -166, -289, -142, 146, 313, 163, -132, -283, -163, 77, 230, 182, 3, -194, -225, -47, 172, 256, 79, -163, -251, -93, 131, 210, 107, -77, -187, -135, 36, 185, 166, 4, -177, -191, -18, 169, 185, 20, -136, -146, -40, 96, 148, 92, -57, -179, -118, 88, 211, 114, -75, -161, -101, 35, 146, 146, 20, -161, -189, -31, 157, 185, 44, -140, -186, -64, 110, 194, 103, -84, -202, -142, 48, 204, 181, -22, -217, -199, 11, 216, 204, 34, -138, -182, -71, 120, 244, 166, -81, -274, -175, 100, 251, 172, -50, -197, -187, -25, 172, 246, 92, -165, -270, -108, 157, 269, 121, -107, -219, -153, 38]
3352C8J72l1j69k10l5J95K15O6j68k24q6J52K07P4p4j70j39QJ82J98Rk00k16J
3376b05J88J83K6j30j54j05O7J79J78o1k22j73M7K25J30k6j43j34m9J12J85R0
3398B08j14j87j02J06J70J05p0j77j10N4J49J18oj20j47n0J42J82M7j42j84l3
3420a61J14J42L9n4j23j20L4J58J38l4j82j06L0J29J11Qj10j20m1Q5J48O6p6j59
3444h4o8O9J60O6n7j23q9K4J14J17Kr9j48k3J22J40J4j10j18m0P4J18P6m4j35
3469d2j07K2J62J03k6j51r5JJ21J19K2r4j36o1Q8J72Q0r9j61q5Q2J58P8m0j37
3494b6j20OJ40J51K3j46j67k3J29J51M8j02j43q7O8J45J19m0j74j33M1J70J29
3517A59k7j42j41jR8J42Q0r8j72j01R0K00J01p4j81j05M6J52J27%j28j59m8J21
$$ y = [38, 210, 179, 10, -200, -235, -40, 175, 241, 73, -151, -237, -85, 122, 196, 122, -48, -187, -179, 3, 201, 210, 10, -206, -205, -17, 166, 192, 62, -92, -197, -130, 49, 227, 166, -56, -229, -182, 43, 173, 147, 4, -130, -179, -67, 118, 208, 94, -93, -195, -89, 81, 186, 116, -61, -171, -117, 32, 150, 144, 24, -123, -173, -31, 151, 198, 56, -128, -161, -47, 95, 134, 80, -43, -163, -129, 29, 167, 133, -49, -155, -125, 4, 115, 123, 13, -107, -148, -63, 85, 151, 75, -84, -152, -83, 77, 143, 86, -37, -126, -102, 12, 129, 131, 32, -116, -139, -17, 123, 137, 27, -91, -131, -57, 61, 137, 93, -42, -149, -127, 35, 138, 112, -39, -134, -133, -12, 107, 129, 35, -101, -162, -74, 98, 178, 79, -82, -167, -85, 73, 151, 111, -26, -146, -140, 0, 151, 174, 28, -139, -162, -33, 118, 166, 64, -79, -166, -98, 47, 166, 126, -48, -181, -140, 30, 159, 132, -10, -151, -152, -54, 88, 168, 70, -102, -203, -113, 87, 188, 114, -67, -172, -126, 26, 153, 153, 25, -134, -182, -61]
3541f1J94Q0j43j89p0J09J58P5k6j46j57PJ76J63J0j79j63j0J36J59M1r2j72q4
3565a84O9J78J26n1j69j67M3J75J79k7j80j58MJ14J55Q8q4k01j30J00K27J00r9
3588A08j74q7K7J22J48L6j51j94l5J57J83L3j15j69p5Q0J77J00n1j74j13L5J34
3611BJ48J9j36k01k4J91J47J4j17j06p8J8J47J70l2k13j58Q2J83R4k4r0j40p3
3635a77J02J92Q3j28j87p3Q7J58J16l3j89j41K7J88J27j4j20j30p8J12K04Q5j30
3658H1k12m0J16J26O6k4j22j55pJ78J86j7j90j34K5J10J14N7p4j74j03Q7J81R7
3682A72o0j63j06J5J62J47k2j62j21kR9J22P4o0j68j17R3J92R2r9j54n3K7R6J08
3707A12M0j09j63m5J24J65L1j06j31n1N0J29R8l2j40j25J6J43J27qj26j24k0J11
$$ y = [-61, 133, 213, 70, -119, -189, -80, 78, 153, 127, -19, -176, -169, 7, 170, 180, 1, -162, -172, -36, 123, 164, 72, -100, -184, -115, 63, 189, 138, -31, -198, -155, 20, 199, 172, -8, -166, -162, -48, 107, 195, 111, -90, -220, -120, 107, 207, 108, -66, -153, -126, -4, 144, 180, 29, -165, -200, -43, 140, 173, 58, -111, -186, -106, 71, 171, 120, -54, -167, -132, 2, 150, 169, 33, -168, -192, -1, 146, 160, 43, -63, -141, -123, 24, 194, 162, -51, -209, -127, 56, 150, 126, 36, -104, -177, -75, 117, 200, 72, -115, -188, -101, 57, 173, 140, -49, -190, -163, 25, 152, 138, 18, -112, -190, -78, 126, 211, 81, -131, -171, -55, 71, 137, 113, -9, -164, -171, 7, 193, 176, -14, -148, -123, -13, 101, 158, 84, -90, -193, -106, 75, 172, 112, -51, -157, -142, 20, 167, 145, -17, -138, -140, -41, 81, 155, 95, -73, -190, -97, 95, 187, 88, -66, -119, -92, 4, 112, 152, 43, -120, -165, -41, 124, 155, 49, -82, -133, -83, 46, 144, 112, -28, -153, -137, 6, 133, 125, -1, -125, -145, -34]
3731c4J48K6q4j38o6N7J35J27m1j65j43M9J65J14l2j09j04k4Q1J25P4r3j52o6
3755a50R6J45N2p2j22o9L1J02R8Pj10j42lJ25J24J7j03j17m5Q4J11P3m9j11r1
3780a19J0J23J24oj43j18J3J19J05Lp1r9o4M7J27Q6n1j39r5P1J17O8j8p1j19j7
3806a17Q1J12M5p9j43m3Q7J24N1n7j08o8L3R5R4or2j21j2J00J28J9r4j22k1P5
3832c9J05N2m5j06r1K2J21J05k3j22r6K1J00O3L0o8j07n3P4J12O1p3j08n6N9Q6
3858B4O7j7q9q6KR3Q3J5o9j00l6Q7Q6N5p7q2m6M1P4N9Nr2r4j1R7J14rr6q9%N7
3889c4Q4M8k7j04p5L1J14O3l9q7n7OP3Q7Lp6q7j7O7R3L2l7j13n8O7R1M9l4q0n8
3919g5JQ2Q0K0j03r5qQ5R3Lp4n6m9L3Q7P1l1r9o8K3P9P9rp7o3rN2Q1L5n4p7m5
$$ y = [-34, 114, 140, 56, -82, -148, -91, 44, 171, 130, -35, -178, -129, 36, 150, 118, 9, -95, -119, -38, 87, 161, 68, -84, -150, -54, 91, 143, 71, -51, -120, -89, 13, 111, 118, 8, -134, -137, -12, 112, 129, 26, -91, -136, -52, 59, 132, 83, -28, -119, -109, 14, 138, 132, -11, -129, -116, 3, 108, 111, 40, -59, -123, -76, 51, 137, 86, -53, -148, -77, 40, 108, 90, 19, -100, -117, -36, 76, 121, 42, -101, -144, -57, 67, 118, 61, -47, -115, -82, 13, 107, 101, 9, -112, -124, -24, 104, 123, 29, -93, -114, -39, 66, 118, 73, -33, -124, -102, 19, 124, 101, -21, -117, -96, 4, 67, 97, 29, -78, -131, -57, 55, 116, 43, -65, -121, -62, 24, 91, 74, -15, -101, -99, -6, 77, 92, 23, -77, -113, -26, 60, 115, 38, -44, -90, -49, 25, 84, 89, -3, -97, -108, -11, 103, 94, -2, -91, -91, -34, 50, 98, 71, -33, -108, -77, 37, 100, 61, -26, -83, -77, -4, 83, 86, 10, -77, -94, -27, 66, 98, 61, -52, -110, -43, 48, 97, 63, -17, -75, -74, 8, 88, 108, 5, -90, -98, -13, 80, 83, 9, -47, -96, -63, 24, 95, 64, -35, -103, -80, -1, 78, 69, -8, -71, -80, -28, 53, 88, 34, -43, -88]
3951h8L5Q6N9m5q1m9K8O8N0J2o2p7k6O9Q4K0p0p3k6N1O8L3lp1q8J4Q9O9Mq5p3
3982g8KO0P1J5m8p2l7M4P4M5k1q7n9K9R1N4m7n0m7kM9O1L1n6q7k1N9Q4J1m4p5
4013e1j6J6P1L8Jp1o9MO6P4no9n5kM2N6K5l4n1m7K2P3O0j7p7n8J3P4L3kl1m3m2
4046g2M9O4M1m1q0m2M7O0K1j6n3m0lN4O3J4n7q1nM4P7Ql0n5l2J2P3M8k5o3m0K
4078e8O0O3no7o9J3O0L9K0l0m6n6K7P7M9l9q1k3L7L4K1J6n0n6mN5N8J4n7n5nK5
4110c3N0L3l2m8l0K0M1M2rl3n9KN3N1Nn5n0RK3K7L7Po8m8QQ3L2l2n1k2jL1L7K2
4144D2k9o9k1M3N7K4l3m6k4J3M4M0qm6k1pL1N3J1k6p8j3N0N3Ml9l4j5NN1M3%p8
4177b3m7K5N4L3l0j8l7j7L1N5K0l3m8k4K4M5M1k9m0l0QM5J9mk4l2j3L4M9L3m0
$$ y = [-88, -53, 33, 92, 47, -34, -83, -55, 13, 63, 75, 13, -64, -90, -21, 63, 83, 13, -60, -86, -35, 33, 66, 63, -8, -96, -82, 7, 76, 80, -5, -78, -76, -16, 55, 70, 22, -50, -87, -43, 31, 76, 55, -32, -91, -62, 29, 83, 36, -14, -61, -63, -14, 47, 78, 22, -65, -86, -27, 57, 68, 24, -51, -67, -51, 20, 58, 59, -12, -81, -77, -11, 63, 58, -11, -66, -68, -26, 30, 55, 21, -30, -77, -55, 18, 78, 61, -16, -74, -61, 13, 46, 44, 13, -30, -72, -23, 41, 82, 41, -39, -81, -34, 26, 47, 31, -22, -62, -65, -11, 52, 66, 9, -72, -77, -33, 44, 52, 22, -33, -65, -53, 20, 68, 43, -20, -60, -58, 2, 65, 60, -7, -76, -63, -3, 36, 56, 26, -20, -76, -49, 28, 77, 38, -43, -66, -29, 5, 26, 42, -8, -64, -68, -13, 45, 59, 2, -53, -58, -33, 17, 50, 18, -30, -60, -40, 1, 43, 34, 1, -58, -56, -3, 48, 53, -2, -52, -43, -20, 7, 44, 51, -17, -65, -57, 26, 58, 26, -25, -47, -48, -17, 20, 42, 13, -56, -77, -34, 23, 47, 14, -32, -56, -43, 1, 41, 33, -13, -34, -41, -10, 43, 54, 28, -50, -63, -13, 40, 44, 5, -29, -44, -39, 12, 55, 55, -23, -70, -45, 9, 42, 12, -6, -43, -60, -29, 26, 46, 13, -35, -59, -35, 10, 51, 22, -18, -48, -40, 5, 24, 20, -4, -36, -49, -15, 34, 67, 27]
4208B7o2j0L2K5K1pk8m1jM5M2km9l8NL6K6Rk6l4k5K1M9J9j5n0k3PM9K8Mn2l7J7
4242c8L8M4ql0l0k7K3N8K4l6l9k2J8L4K7lk7m6nL8M7jm0l9rL5L5Mj4m2l0J4N7
4275A0K4j6m3k2OL7L9Jm2k0kJ3L9Pqm3l0M1K8L2k7k3k9PK5K1J3l7k7j7K8M5Nk8
4309Gl4rJ3L3P%k9l9J3L3M5j2l8j8j1K9L1J4l2l2qJ0L8L4j9m0k1LM6K2rl4k0j0
4343c7J8L4J3k2m1j4K5M4Kj9k0j9J0J2K5J2k9m8J5L5K3Nk6j5k4K6L1J1j1l2j4
4374c0J1K7J7Nl3k9KL3K7ll3j7j3K3K4J2j3l0k7K9K6J2mk5j5rL3K3Kk0l2nK3K9
$$ y = [27, -35, -45, -13, 12, 33, 26, -2, -43, -44, 1, 43, 41, -8, -46, -41, -5, 21, 30, 4, -30, -55, -34, 15, 34, 19, -31, -54, -47, 2, 30, 34, -18, -55, -38, 0, 44, 36, 6, -24, -51, -28, 30, 54, 18, -21, -43, -25, 9, 36, 33, 6, -40, -45, -7, 40, 39, -1, -40, -49, -14, 21, 25, 11, -31, -61, -47, 10, 34, 18, -25, -47, -41, -4, 35, 36, -6, -26, -28, -15, 24, 31, 23, -20, -50, -9, 19, 51, 24, 1, -28, -21, 4, 25, 38, 1, -26, -43, -15, 30, 35, 7, -27, -36, -23, 10, 17, 17, -12, -51, -38, -5, 40, 28, -10, -28, -39, -10, 21, 35, 3, -29, -37, -27, 11, 45, 26, -14, -35, -32, 14, 36, 27, -7, -27, -37, -19, 15, 28, 6, -35, -49, -24, 20, 22, 3, -17, -36, -26, -14, 11, 23, -6, -54, -39, -4, 19, 24, -2, -17, -41, -15, 16, 27, 16, -16, -30, -19, 8, 25, 30, -3, -32, -30, 3, 30, 27, -6, -23, -36, -13, 11, 23, 10, -20, -47, -18, 8, 20, 16, -9, -24, -33, 0, 23, 25, 5, -27, -32, -9, 20]
$$ [...]
8191c
##END NTUPLES=NMR FID
##END=
