##TITLE=1H_IG-MeOct
 CDCl3
 8 sc, 
 2.4.2024
##JCAMPDX= 6.0         $$ Bruker NMR JCAMP-DX V2.0
##DATA TYPE= NMR FID
##DATA CLASS= NTUPLES
##ORIGIN= UXNMR, Bruker Analytische Messtechnik GmbH
##OWNER= root
$$ XWIN-NMR		Version 3.5
$$ Tue Apr  2 15:32:42 2024 Russian Standard Time (UT+4h)  she@DPX200
##.OBSERVE FREQUENCY= 200.1309
##.OBSERVE NUCLEUS= ^1H
##.DELAY= (6, 6)
##.ACQUISITION MODE= SIMULTANEOUS
##.ACQUISITION SCHEME= undefined
##.AVERAGES= 8
##.DIGITISER RES= 18
##SPECTROMETER/DATA SYSTEM= spect
##.PULSE SEQUENCE= zg30
##.SOLVENT NAME= MeOD
##.SHIFT REFERENCE= (INTERNAL, MeOD, 0, 15.7039)
##AUDIT TRAIL= $$ (NUMBER, WHEN, WHO, WHERE, WHAT)
$$ ##TITLE= Audit trail, XWIN-NMR		Version 3.5
$$ ##JCAMPDX= 5.01
$$ ##ORIGIN= Bruker BioSpin GmbH
$$ ##OWNER= she
$$ F:/spectra/data/she/nmr/H-F/1/audita.txt
$$ ##AUDIT TRAIL=  $$ (NUMBER, WHEN, WHO, WHERE, WHAT)
(   1,<2024-04-02 15:30:59.10 +0400>,<she>,<DPX200>,
      <created by zg, POWCHK disabled, PULCHK disabled
       configuration hash MD5:
       00 E9 B6 7A A2 85 ED C7 34 08 36 98 17 FE 4E 26
       data hash MD5: 16K
       6F E8 B0 80 FA 4C 98 6B B1 60 2D 80 15 8F 8E 78>)
$$ ##END=
$$ 
$$ hash MD5
$$ E0 91 3E E5 F6 E7 8A 13 6C 33 C7 ED BE 76 87 0A
##$RELAX= 
##$RELAX= 
##$RELAX= 
##$RELAX= 
##$RELAX= 
##$RELAX= 
$$ Bruker specific parameters
$$ --------------------------
##$DU= <F:/spectra>
##$EXPNO= 1
##$NAME= <H-F>
##$PROCNO= 1
##$TYPE= <nmr>
##$USER= <she>
##$AMP= (0..31)
100 100 100 100 100 100 100 100 100 100 100 100 100 100 100 100 100 100 
100 100 100 100 100 100 100 100 100 100 100 100 100 100 
##$AQSEQ= 0
##$AQ_mod= 1
##$AUNM= <au_zg>
##$AUTOPOS= <>
##$BF1= 200.13
##$BF2= 200.13
##$BF3= 200.13
##$BF4= 200.13
##$BF5= 200.13
##$BF6= 200.13
##$BF7= 200.13
##$BF8= 200.13
##$BYTORDA= 1
##$CFDGTYP= 0
##$CFRGTYP= 5
##$CHEMSTR= <none>
##$CNST= (0..31)
1 1 145 1 1 1 1 1 1 1 1 1 1 1 1 1 1 1 1 1 1 1 1 1 1 1 1 1 1 1 1 1 
##$CPDPRG= <>
##$CPDPRG1= <>
##$CPDPRG2= <>
##$CPDPRG3= <>
##$CPDPRG4= <mlev>
##$CPDPRG5= <mlev>
##$CPDPRG6= <mlev>
##$CPDPRG7= <mlev>
##$CPDPRG8= <mlev>
##$CPDPRGB= <>
##$CPDPRGT= <>
##$D= (0..31)
0 1.2 0 0 0 0 0 0 0 0.06 0 0.03 0 0 0 0 0.0002 0 0 0 0 0 0 0 0 0 0 0 0 
0 0 0 
##$DATE= 1712057458
##$DBL= (0..7)
120 120 120 120 120 120 120 120 
##$DBP= (0..7)
150 150 150 150 150 150 150 150 
##$DBP07= 0
##$DBPNAM0= <>
##$DBPNAM1= <>
##$DBPNAM2= <>
##$DBPNAM3= <>
##$DBPNAM4= <>
##$DBPNAM5= <>
##$DBPNAM6= <>
##$DBPNAM7= <>
##$DBPOAL= (0..7)
0.5 0.5 0.5 0.5 0.5 0.5 0.5 0.5 
##$DBPOFFS= (0..7)
0 0 0 0 0 0 0 0 
##$DE= 6
##$DECBNUC= <off>
##$DECIM= 32
##$DECNUC= <off>
##$DECSTAT= 4
##$DIGMOD= 1
##$DIGTYP= 9
##$DL= (0..7)
0 120 120 120 120 120 120 120 
##$DP= (0..7)
150 150 150 150 150 150 150 150 
##$DP07= 0
##$DPNAME0= <>
##$DPNAME1= <>
##$DPNAME2= <>
##$DPNAME3= <>
##$DPNAME4= <>
##$DPNAME5= <>
##$DPNAME6= <>
##$DPNAME7= <>
##$DPOAL= (0..7)
0.5 0.5 0.5 0.5 0.5 0.5 0.5 0.5 
##$DPOFFS= (0..7)
0 0 0 0 0 0 0 0 
##$DQDMODE= 0
##$DR= 18
##$DS= 0
##$DSLIST= <SSSSSSSSSSSSSSS>
$$ [...]
##$SUBNAM2= <"">
##$SUBNAM3= <"">
##$SUBNAM4= <"">
##$SUBNAM5= <"">
##$SUBNAM6= <"">
##$SUBNAM7= <"">
##$SUBNAM8= <"">
##$SUBNAM9= <"">
##$SW= 18.0517689322627
##$SWIBOX= (0..15)
0 0 2 0 0 0 0 0 0 0 0 0 0 0 0 0 
##$SW_h= 3612.71676300578
##$TD= 16384
##$TD0= 1
##$TE= 0
##$TE2= 300
##$TE3= 300
##$TEG= 300
##$TL= (0..7)
0 120 120 120 120 120 120 120 
##$TP= (0..7)
150 150 150 150 150 150 150 150 
##$TP07= 0
##$TPNAME0= <>
##$TPNAME1= <>
##$TPNAME2= <>
##$TPNAME3= <>
##$TPNAME4= <>
##$TPNAME5= <>
##$TPNAME6= <>
##$TPNAME7= <>
##$TPOAL= (0..7)
0.5 0.5 0.5 0.5 0.5 0.5 0.5 0.5 
##$TPOFFS= (0..7)
0 0 0 0 0 0 0 0 
##$TUNHIN= 0
##$TUNHOUT= 0
##$TUNXOUT= 0
##$USERA1= <user>
##$USERA2= <user>
##$USERA3= <user>
##$USERA4= <user>
##$USERA5= <user>
##$V9= 5
##$VALIST= <valist>
##$VCLIST= <CCCCCCCCCCCCCCC>
##$VD= 0
##$VDLIST= <DDDDDDDDDDDDDDD>
##$VPLIST= <PPPPPPPPPPPPPPP>
##$VTLIST= <TTTTTTTTTTTTTTT>
##$WBST= 1024
##$WBSW= 4
##$XGAIN= (0..3)
0 0 0 0 
##$XL= 0
##$YL= 0
##$YMAX_a= 372181
##$YMIN_a= -553703
##$ZGOPTNS= <>
##$ZL1= 120
##$ZL2= 120
##$ZL3= 120
##$ZL4= 120
##$ABSF1= 10
##$ABSF2= 0
##$ABSG= 5
##$ABSL= 3
##$ALPHA= 0
##$AQORDER= 0
##$ASSFAC= 0
##$ASSFACI= 0
##$ASSFACX= 0
##$ASSWID= 0
##$AUNMP= <proc_1d>
##$AZFE= 0.1
##$AZFW= 0.1
##$BCFW= 1
##$BC_mod= 2
##$BYTORDP= 1
##$COROFFS= 0
##$CY= 11.3945322036743
##$DATMOD= 1
##$DC= 2
##$DFILT= <>
##$DTYPP= 0
##$F1P= 15.7292609196834
##$F2P= 12.9074282941183
##$FCOR= 0.5
##$FTSIZE= 0
##$FT_mod= 4
##$GAMMA= 1
##$GB= 0.15
##$INTBC= 1
##$INTSCL= 1
##$ISEN= 128
##$LB= 0.24
##$LEV0= 0
##$LPBIN= 0
##$MAXI= 10000
##$MC2= 0
##$MEAN= 0
##$ME_mod= 0
##$MI= 1.114404
##$NCOEF= 0
##$NC_proc= 0
##$NLEV= 6
##$NOISF1= 3.799351
##$NOISF2= 2.8
##$NSP= 1
##$NTH_PI= 0
##$NZP= 0
##$OFFSET= 15.70392
##$PC= 1
##$PHC0= -25209.94
##$PHC1= 11.58731
##$PH_mod= 1
##$PKNL= yes
##$PPARMOD= 0
##$PSCAL= 0
##$PSIGN= 0
##$REVERSE= no
##$SF= 200.130013532006
##$SI= 16384
##$SIGF1= 3
##$SIGF2= 2
##$SINO= 400
##$SIOLD= 16384
##$SREGLST= <1H.CDCl3>
##$SSB= 0
##$STSI= 0
##$STSR= 0
##$SW_p= 3612.71676300578
##$SYMM= 0
##$S_DEV= 0
##$TDeff= 0
##$TDoff= 0
##$TI= <>
##$TILT= no
##$TM1= 0
##$TM2= 0
##$TOPLEV= 0
##$USERP1= <user>
##$USERP2= <user>
##$USERP3= <user>
##$USERP4= <user>
##$USERP5= <user>
##$WDW= 1
##$XDIM= 8192
##$YMAX_p= 0
##$YMIN_p= 0
$$ End of Bruker specific parameters
$$ ---------------------------------
##NTUPLES= NMR FID
##VAR_NAME=  TIME,          FID/REAL,        FID/IMAG
##SYMBOL=    X,             R,               I
##VAR_TYPE=  INDEPENDENT,   DEPENDENT,       DEPENDENT
##VAR_FORM=  AFFN,          ASDF,            ASDF
##VAR_DIM=   8192,          8192,            8192
##UNITS=     SECONDS,       ARBITRARY UNITS, ARBITRARY UNITS
##FACTOR=    0.0002768,     1,               1
##FIRST=     0,             0,               0
##LAST=      2.2672688,     0,               0
##MIN=       0,             -553703,         0
##MAX=       2.2672688,     372181,          0
$$ Real data points
##PAGE= N=1
##DATA TABLE= (X++(R..R)), XYDATA
0 0 0 0 0 0 0 0 0 7 -7 7 -7 7 -14 21 -21 28 -35 42 -49 63 -70 84 -105 123 -140 168 -195 223 -258 295 -335
31 -335 384 -439 496 -559 630 -707 792 -885 988 -1099 1221 -1356 1499 -1658 1833 -2023
47 -2023 2229 -2457 2708 -2982 3284 -3620 3996 -4415 4886 -5425 6044 -6764 7607 -8624
61 -8624 9870 -11439 13484 -16268 20302 -26691 38348 -66374 271755 74310 -510578 93674
73 93674 143457 -116204 128553 152111 -318745 -116845 243480 113366 -10495 -67267 -264929
84 -264929 42254 372181 -32451 -308676 57157 94656 -76741 142582 132343 -283441
94 -283441 -190579 248199 221643 -114424 -199873 -24887 134144 80853 -19307 -24272 -97542
105 -97542 -111895 157104 223875 -124947 -236847 27232 153920 95428 -30260 -172050 -60789
116 -60789 141293 53601 -7396 45217 -163865 -163906 289867 218350 -309222 -170563 206840
127 206840 33737 -39176 125009 -96445 -217387 130688 198071 -53246 -89311 -88151 -43450
138 -43450 208210 126490 -231338 -110587 145773 5401 -2985 129727 -118078 -224656 155802
149 155802 237090 -96892 -164287 -10545 45589 88751 56296 -86861 -97628 4013 68408
160 68408 109171 6135 -183254 -83058 170789 119550 -80927 -97839 -27972 32408 89296
171 89296 45696 -64412 -101821 -30948 114694 136536 -84605 -182676 33989 137583 9472
182 9472 -22974 -24688 -98506 5295 159311 36708 -127524 -77778 25431 94269 83099
193 83099 -77505 -134319 33511 96993 15480 7902 -44317 -120915 38184 178650 -2093
204 -2093 -150674 -40726 56128 63318 51239 -46865 -111099 -3307 93519 61896 -13117 -95896
216 -95896 -79999 85236 131420 -34584 -112714 -28293 35458 66061 55295 -56269 -110373
227 -110373 2675 102111 63767 -40792 -104734 -35784 94096 82798 -35731 -74842 -38690
238 -38690 19072 88467 51745 -85414 -97035 32553 93307 39701 -43311 -88058 -23475 83973
250 83973 70536 -28747 -73212 -46345 31750 97873 28811 -96366 -74311 42145 78479 32517
262 32517 -39731 -84929 -20873 84372 69515 -32280 -80087 -40374 47324 90727 10018 -88986
274 -88986 -59466 36815 74310 35862 -46220 -86470 -8021 86921 58604 -37360 -76878 -32605
286 -32605 52984 82653 -177 -84630 -52706 37783 75998 29970 -57337 -80390 6500 84315
298 84315 47755 -40495 -75605 -26156 60995 77657 -12027 -85127 -43827 45101 75251 19530
310 19530 -63710 -71412 16131 82193 41438 -45942 -75728 -15355 67793 66767 -22062 -79292
322 -79292 -35250 46420 71214 12000 -66160 -63001 22911 77468 32599 -48700 -69079 -6652
334 -6652 65213 56398 -23853 -73034 -31266 47814 68778 4284 -67153 -52979 28000 71047
346 71047 26733 -47696 -65287 -3257 66299 53559 -29006 -74501 -24711 54567 63825 -5079
358 -5079 -65784 -46137 28711 69811 25985 -53271 -67954 5678 73043 44949 -39274 -69992
370 -69992 -14115 54725 56295 -7620 -63508 -44915 32495 74091 18853 -63935 -60324 21754
382 21754 68779 28544 -38789 -57819 -12444 50159 56894 -10077 -70357 -39461 46427 70224
394 70224 -56 -65045 -41997 26196 54894 24300 -31428 -59292 -15853 59483 60018 -26467
406 -26467 -76517 -19931 56121 52015 -10368 -50129 -34698 14797 54532 35228 -38504 -71590
418 -71590 -2171 74861 43314 -43506 -59713 -3771 41265 39783 2485 -44233 -47920 14917
430 14917 70220 30259 -59030 -65145 21983 68304 17935 -37100 -37515 -12663 24952 54402 12567
443 12567 -66343 -53598 43732 74745 -646 -63200 -36435 25213 45572 19139 -19601 -45694
455 -45694 -27663 41313 71009 -10173 -86608 -27992 66177 49199 -21862 -39665 -21631 2325
467 2325 40041 43169 -24803 -73471 -13736 72882 51128 -43781 -64295 3550 44114 24415
479 24415 -546 -24286 -42928 -3236 64099 42663 -53062 -70681 19445 71244 15131 -42534
491 -42534 -28505 -822 11497 36929 26945 -48135 -65597 30690 81860 2653 -66449 -31238
503 -31238 27107 36241 13879 -13375 -34306 -26767 23348 63278 10980 -77156 -46916 62464
515 62464 61498 -28480 -43201 -4374 179 17976 46290 -4895 -72172 -25565 65749 54650 -32920
528 -32920 -63811 -5759 45887 27101 -9345 -18807 -27311 -14943 45102 55075 -36654 -79766 9036
541 9036 75264 18969 -44266 -28704 3199 11857 26922 24234 -31694 -60518 11891 77435 18817
554 18817 -65174 -40174 31050 38620 6138 -13118 -25152 -23191 15690 51982 16058 -59271
566 -59271 -50855 43575 66705 -16536 -52806 -5081 14138 7810 29324 9218 -55889 -36014
578 -36014 52896 56118 -24542 -57170 -10721 37654 31286 -7069 -23985 -18347 -7696 26305 46940
591 46940 -13700 -71997 -10187 69641 29953 -41534 -32017 3621 12429 23180 19969 -25335 -49445
604 -49445 3196 60368 28250 -47808 -49400 18754 46352 9866 -19646 -22062 -16853 10761 43855
617 43855 17613 -47846 -46585 29046 59520 -103 -47891 -20302 17273 19843 16922 1876 -37152
630 -37152 -32218 34190 53891 -11628 -54552 -16151 33578 31906 -2859 -25933 -21082 352 25337
643 25337 30985 -9020 -51479 -17631 50057 38003 -28208 -39165 -1118 19120 21391 12413 -21025
656 -21025 -38643 1237 46194 26161 -31452 -43990 3827 41408 20601 -18767 -27575 -11707
668 -11707 12895 33352 14939 -34891 -40473 16437 48774 9995 -35433 -28597 7290 27685
680 27685 20051 -7420 -32189 -21084 23336 41955 693 -43427 -25279 25018 36226 3203
692 3203 -26486 -25088 1309 28975 25933 -12791 -40281 -13616 34255 34851 -11659 -38456 -14504
705 -14504 21758 29163 5964 -24343 -29767 2752 36306 22690 -22817 -37476 -2679 32909
717 32909 25051 -11557 -31438 -14410 18388 30655 6663 -28108 -28973 9166 36195 15257 -23985
730 -23985 -30495 -263 28112 22979 -9236 -31276 -15315 20790 31572 2191 -30635 -24560 12734
743 12734 33180 11680 -23323 -29220 156 29617 23032 -13001 -33290 -11405 24727 29651 -2144
756 -2144 -31210 -21483 15252 33102 9453 -25852 -28597 4389 31621 19206 -16619 -31292 -7638
769 -7638 25295 27473 -4759 -31841 -18502 18347 31222 4824 -26643 -24615 7288 29526 15400
782 15400 -17181 -29007 -5500 25986 25486 -8539 -31586 -13180 20466 26929 1574 -24731 -21888
795 -21888 8186 29267 13682 -19370 -28316 -1703 27751 21929 -12300 -29465 -9159 19847
807 19847 24428 1385 -25108 -22298 10752 30741 10051 -22249 -25565 1636 26636 18830 -12801
820 -12801 -27611 -8366 19664 24868 226 -27471 -20313 15040 29278 5508 -21718 -22250 2246
833 2246 25958 18280 -14337 -28321 -5927 22468 23528 -4334 -28443 -15726 17604 26205 2903
846 2903 -21426 -21997 4055 28773 15774 -19710 -27047 -220 23292 19467 -6853 -27023 -12981
859 -12981 18598 25201 1220 -23103 -20834 8614 29215 9869 -21310 -21429 1829 19739 18231
872 18231 -5876 -27464 -12093 20928 23958 -2812 -23329 -16205 10598 24712 6755 -17818
884 -17818 -19351 -825 20236 20457 -9509 -29987 -6670 23978 18881 -5910 -19941 -13764 9136
897 9136 23899 8205 -18553 -22491 1193 26322 18058 -17573 -27500 1349 21425 13216 -2862
910 -2862 -18021 -17857 10191 29143 5669 -25259 -20693 8726 26054 10044 -18657 -20079 1959
923 1959 15422 14943 1161 -23246 -20108 18936 30621 -4754 -26746 -10551 10993 18091 7800
936 7800 -12838 -19221 -2579 17663 20084 -4679 -29962 -11498 26820 20975 -12407 -18038 -5242
949 -5242 3799 16011 13879 -13996 -25855 376 25866 16407 -14941 -26235 -194 22587 10439
962 10439 -6748 -9905 -12748 -733 25590 15424 -24734 -25369 11692 25126 5451 -14434 -15805
975 -15805 -817 12799 12737 2359 -15714 -21346 8899 33187 2819 -31172 -12354 16164 13621
988 13621 3165 -5456 -16204 -8541 15675 21381 -2491 -26756 -15068 22319 26059 -10617 -23163
1001 -23163 -1597 7276 7849 13326 -4622 -27605 -5918 28266 17850 -15744 -23949 -1778 20349
1014 20349 13424 -8433 -12164 -6032 -1560 15746 19630 -16354 -31821 8178 30909 2988 -17727
1027 -17727 -10155 -427 8366 13450 2203 -14693 -16082 4656 26060 9992 -26451 -19840 17171
1040 17171 18663 -3281 -6405 -7149 -10435 8327 23299 371 -25711 -13808 17315 23314 -3754
1053 -3754 -22676 -6941 10903 8312 6023 50 -19433 -13417 22039 23885 -13102 -25516 -1628
1066 -1628 17369 12893 -3753 -13305 -7959 2147 12245 14914 -7493 -28232 -2489 30444 11275
1079 11275 -20151 -13300 3192 6858 10806 4951 -14452 -16391 5910 21624 9084 -18527 -21533
1092 -21533 9079 23482 1156 -13262 -6494 -3767 3953 18605 5055 -23374 -15296 16262 20916
1105 20916 -2054 -18158 -10180 8195 13143 4135 -4823 -12421 -9730 12596 22189 -5115 -25246
1118 -25246 -5330 17277 12126 -3052 -10974 -9408 1787 13100 10603 -6706 -19761 -5654 20598
1131 20598 16115 -12772 -18247 729 10459 8851 3335 -10403 -15599 3298 20031 8593 -14465
1144 -14465 -18086 2643 19594 8632 -11620 -12730 -1760 7393 13291 4396 -16909 -16039 10725
1157 10725 20833 1136 -16293 -11690 4726 14387 7370 -7578 -13578 -5044 10874 16278 -1190
1170 -1190 -19713 -9501 13635 15111 -1465 -12133 -9564 2397 13475 9022 -7992 -15800 -3269
1183 -3269 14537 13739 -6130 -17131 -4595 11359 11544 299 -10777 -11580 2771 15957 7928
1196 7928 -11361 -15218 466 14838 10238 -6811 -14517 -4407 9915 12609 1035 -13136 -11915
1209 -11915 5895 16600 5079 -12294 -13187 1661 13879 9325 -6529 -14355 -4720 10764 13465
1222 13465 -767 -14782 -9881 7897 15008 3202 -11893 -12367 2208 14280 8445 -8061 -14292
1235 -14292 -2832 12012 12239 -2998 -14788 -7609 9177 14050 1559 -12624 -11222 4354 14471
1248 14471 6263 -9343 -13045 -1051 12338 10876 -4572 -14582 -5837 10037 12912 -111 -12733
1261 -12733 -9531 5280 13207 4969 -8956 -12345 -758 12622 10222 -5766 -13957 -4102 9997
1274 9997 11348 -492 -11769 -8952 5187 13084 4841 -9563 -12395 581 13435 8795 -7194
1287 -7194 -13074 -2739 9821 10838 -817 -12552 -8983 6757 14007 3062 -11599 -11413 2960
1300 2960 13419 6862 -7872 -12356 -2245 10513 11259 -2367 -13988 -7280 9096 13116 679
1313 679 -11550 -9567 3749 12658 6046 -8080 -12227 -1344 11560 10244 -4544 -13595 -4697 9395
1327 9395 10821 -200 -10513 -9014 3894 12934 5060 -9576 -11442 942 11577 7975 -5421
1340 -5421 -12066 -3535 9019 10323 -441 -11071 -8645 5664 13250 2979 -10453 -9531 2157
1353 2157 10409 7183 -4868 -12146 -3894 9981 10888 -2121 -12131 -6933 6861 11650 1776 -9418
1367 -9418 -9027 1316 10668 8020 -5988 -13351 -2347 11754 9390 -4115 -11068 -5008 6358 10682
1381 10682 2300 -9529 -10109 2490 12984 6514 -9260 -12185 1306 11348 6479 -4137 -9640
1394 -9640 -5364 6461 12006 1264 -12271 -9174 6131 12696 2605 -9842 -8824 2048 8908
1407 8908 6297 -2685 -10660 -6180 8907 12770 -2255 -13110 -5147 7305 8937 1465 -6581 -8141
1421 -8141 -490 9220 8566 -4213 -13046 -3634 11633 9562 -5141 -9964 -2694 4365 7419 4205
1435 4205 -6463 -11216 363 12888 7321 -8521 -11970 838 10725 5663 -3933 -7024 -4900 2681
1449 2681 11133 5145 -11400 -11759 5959 13455 2047 -8960 -7663 884 7476 6444 -1392 -9142
1463 -9142 -7335 6001 13833 806 -14555 -7058 9111 8791 -622 -4807 -6219 -2867 7775 10243
1477 10243 -3370 -13430 -4121 10983 10171 -4359 -10967 -2373 5898 5628 2622 -3522 -9918 -2594
1491 -2594 12345 9259 -8753 -12521 1618 10387 4620 -3821 -6119 -3802 1771 8509 5839 -8131
1505 -8131 -12534 3253 14092 2993 -9716 -6670 1692 5432 5364 314 -7608 -7467 3997 12287
1519 12287 3212 -12172 -9202 7516 10451 -820 -5591 -3956 -2831 4336 10502 -213 -13411
1532 -13411 -5909 10137 10315 -2890 -10306 -4150 5515 6787 1627 -3574 -7538 -3838 9221 11166
1546 11166 -6030 -14286 108 11396 4905 -3975 -5705 -3833 1742 8088 5158 -6583 -10993 787
1560 787 12620 5701 -9048 -8698 2358 6386 3703 47 -5784 -7194 2723 11198 3343 -10131
1574 -10131 -8856 4883 10323 1258 -6577 -4710 -516 3586 7274 1465 -10167 -7434 7890 10843
1588 10843 -1822 -9532 -4232 4218 6714 2476 -3928 -6775 -2570 6654 9289 -2357 -12339 -3428
1602 -3428 9945 7121 -3466 -6325 -3553 1314 7098 5293 -5409 -9967 -398 10210 6734 -5960
1616 -5960 -9679 -289 7466 5019 -1086 -5593 -5941 1866 9862 4095 -8604 -8766 3213 9558 3284
1631 3284 -5784 -6858 -429 5583 5878 -157 -7747 -6416 5138 10313 227 -9372 -5212 4014 6776
1646 6776 2679 -4045 -7011 -1597 6654 6946 -1924 -8988 -4206 6641 8178 -1213 -7437 -4046 2444
1661 2444 6220 4084 -4054 -8381 -1098 8180 6256 -3646 -8297 -2475 5935 6674 -498 -6561 -5118
1676 -5118 2141 7762 3916 -6000 -8240 891 8334 4673 -4165 -7515 -1969 5989 6721 -798 -7343
1691 -7343 -5065 3719 8412 2185 -7297 -6891 2395 7774 3651 -4194 -7355 -1665 6691 6601 -2050 -7791
1707 -7791 -3857 4620 7608 1070 -7186 -5937 2707 7278 3128 -4445 -7025 -975 6824 5846 -2608
1722 -2608 -7317 -3045 4811 7018 428 -6931 -5224 3034 7071 2582 -4730 -6556 -269 6775 5152
1737 5152 -2937 -7216 -2622 5325 6708 -541 -7028 -4393 3276 6642 2344 -4968 -6691 235 7176
1752 7176 4822 -3596 -7255 -1969 5768 6360 -1073 -6842 -4050 3314 6864 2365 -5564 -6850 1224
1767 1224 7743 3909 -4335 -6750 -1154 5766 5790 -1393 -6954 -3880 3991 7133 1233 -6626 -5894 2650
1783 2650 7210 2575 -4526 -6077 -580 5941 5393 -2244 -7117 -2863 5031 6590 -216 -6607 -4347
1798 -4347 3088 6207 2196 -4239 -6048 -315 6490 4868 -3169 -6734 -1840 4922 5646 -440 -5974
1813 -5974 -4105 2615 6116 2403 -4569 -6312 364 6716 3960 -3480 -5977 -1575 4491 5600 -304
1828 -304 -6249 -4204 3339 6619 1601 -5488 -5603 1549 6396 3173 -3425 -5886 -1611 5225 5889 -1494
1844 -1494 -7068 -3154 4419 6080 469 -5615 -4849 1880 6181 3006 -3782 -6356 -922 6420 5196
1859 5196 -2965 -6487 -1748 4246 5202 493 -5332 -4860 2198 6598 2469 -4725 -5896 542 6234
1874 6234 3572 -3180 -5210 -1567 3562 5331 485 -6129 -4607 3547 6437 845 -5025 -4534 1113
1889 1113 5179 3068 -2502 -5244 -2145 4297 6059 -793 -6966 -3042 4436 5046 257 -3894 -4255
1904 -4255 250 5375 3982 -2920 -6386 -1579 5681 5428 -2374 -6318 -1720 3579 4123 1231 -3614
1919 -3614 -5556 389 7022 3585 -4918 -6114 532 5718 3527 -2505 -4882 -1821 2842 5038 1559
1934 1559 -5440 -5729 2963 7426 947 -5572 -3933 1386 4270 3013 -1569 -5064 -2636 3782 6123
1949 6123 -151 -6958 -3664 4661 5252 -623 -3680 -2955 -336 3970 4470 -1968 -6532 -1802 5449 5123
1965 5123 -2000 -5862 -1673 3631 3475 622 -2356 -4454 -1042 5958 4734 -4301 -6537 715 5454
1980 5454 2810 -1968 -4008 -2058 2087 4441 1875 -4092 -5782 1260 7349 2222 -5671 -4343 1676
1995 1676 3696 2404 -549 -4313 -3520 3053 6286 658 -6301 -4381 3685 5970 68 -4241 -2798
2010 -2798 130 3022 4166 -610 -6390 -2903 5388 5582 -1905 -5776 -1973 3352 3899 425 -2818
2025 -2818 -3587 -809 4578 4774 -2918 -6866 -159 5985 2914 -2551 -3558 -1526 1728 4006 1791
2040 1791 -3572 -4936 719 6110 2868 -4564 -4883 1296 4148 1887 -859 -3164 -3154 1755 5684 1377
2056 1377 -5394 -4444 2583 5484 1028 -3815 -3306 236 2953 3352 -43 -4973 -3567 3949 5949 -832
2072 -832 -5590 -2466 2818 3997 1034 -2813 -3780 -507 4037 4116 -1768 -6090 -1631 5276 4170 -2214
2088 -2214 -4330 -1476 1888 3652 1788 -3259 -4820 479 5482 2895 -3510 -4904 99 4354 2838
2103 2838 -1450 -3562 -2183 1703 4520 1617 -4311 -4486 1822 5257 1417 -3444 -3476 62 3151 3015
2119 3015 -588 -4167 -2730 2781 4899 198 -4653 -3068 2171 4132 1152 -2760 -3449 -361 3497
2134 3497 3444 -1231 -4821 -1950 3760 4321 -817 -4282 -2241 1946 3761 1561 -2772 -4193 -32 4541
2150 4541 3117 -2405 -4616 -960 3703 3642 -851 -4105 -2400 2056 4102 1308 -3434 -4156 747 4814
2166 4814 2319 -2998 -4016 -333 3438 3234 -830 -4180 -2211 2718 4121 409 -3754 -3257 1417
2181 1417 4376 1627 -3062 -3599 109 3449 2811 -1225 -4085 -1772 2995 3781 -212 -3710 -2671 1586
2197 1586 3969 1401 -2890 -3502 205 3500 2666 -1432 -3930 -1543 2963 3683 -277 -3753 -2534 1790
2213 1790 3831 1174 -2876 -3423 182 3680 2635 -1835 -4067 -1113 3308 3443 -728 -3893 -2189
2228 -2189 2231 3721 731 -3131 -3289 663 4043 2276 -2597 -4031 -232 3597 2839 -1215 -3731
2243 -3731 -1769 2468 3666 326 -3445 -3005 1261 4135 1608 -2983 -3554 327 3363 2426 -1257 -3589
2259 -3589 -1671 2596 3667 -114 -3684 -2498 1715 3680 1024 -2779 -3043 323 3173 2383 -1345
2274 -1345 -3656 -1289 2994 3320 -695 -3512 -1860 1848 3241 871 -2591 -3022 309 3475 2297
2289 2297 -1939 -3686 -642 3095 2822 -840 -3316 -1867 1786 3418 875 -2935 -3176 760 3811
2304 3811 1860 -2440 -3423 -226 3063 2685 -779 -3451 -1918 2279 3712 275 -3447 -2665 1480 3604
2320 3604 1271 -2538 -3119 22 3115 2533 -1299 -3706 -1321 2880 3208 -639 -3364 -1847 1644 3159
2336 3159 966 -2530 -3031 324 3410 2115 -1903 -3413 -498 2821 2534 -619 -2925 -1886 1518
2351 1518 3283 969 -2726 -2949 736 3414 1650 -2017 -2934 -428 2395 2551 -317 -3166 -2124 1931
2367 1931 3486 374 -3089 -2449 1026 3058 1415 -1841 -2936 -566 2700 2799 -838 -3621 -1482 2662
2383 2662 3109 -356 -2876 -1912 1022 2975 1516 -2136 -3307 -71 3392 2391 -1779 -3457 -624
2398 -624 2660 2425 -355 -2609 -2140 1091 3422 1275 -2860 -3125 825 3372 1498 -1945 -2746 -398
2414 -398 2204 2364 -120 -2876 -2214 1765 3575 333 -3174 -2090 1266 2532 1096 -1391 -2553 -759
2430 -759 2355 2676 -638 -3347 -1552 2394 2914 -390 -2600 -1550 744 2292 1643 -1378 -3227 -566
2446 -566 3139 2558 -1438 -3218 -773 2250 2310 -92 -2128 -2081 428 3102 1901 -2359 -3438 424
2462 424 3371 1623 -1720 -2560 -687 1835 2446 164 -2657 -2404 1281 3562 834 -3130 -2514 1312
2478 1312 2706 944 -1263 -2309 -946 2115 2847 -422 -3316 -1651 2289 2988 -220 -2701 -1551
2493 -1551 978 2113 1291 -1084 -2860 -868 2844 2620 -1357 -3179 -698 2130 2085 -112 -1985 -1767
2509 -1767 388 2479 1761 -1713 -3206 -38 3191 1729 -1643 -2296 -508 1460 2104 466 -2224 -2263
2525 -2263 890 3149 1136 -2471 -2633 727 2734 1134 -1267 -2062 -950 1528 2673 148 -3082
2540 -3082 -2043 1842 2995 227 -2494 -1927 706 2289 1371 -1058 -2622 -1032 2363 2800 -769 -3200
2556 -3200 -1125 2123 2357 -16 -2057 -1795 497 2436 1532 -1512 -2914 -328 2872 2012 -1500 -2525
2572 -2525 -504 1596 1878 245 -2044 -1991 808 2727 1038 -1998 -2426 314 2546 1403 -1319 -2007
2588 -2007 -581 1373 2133 349 -2400 -2024 1328 2764 503 -2065 -1944 321 2183 1478 -1039 -2339
2604 -2339 -892 1749 2426 -136 -2706 -1610 1564 2459 319 -1958 -1888 320 2287 1555 -1251 -2622
2620 -2622 -595 2350 2174 -897 -2578 -964 1649 2157 210 -2044 -1896 719 2543 1128 -1722 -2377
2636 -2377 -38 2405 1734 -1170 -2399 -636 1595 1972 119 -2141 -1837 1020 2569 668 -1879 -1998
2652 -1998 192 2162 1534 -1101 -2250 -554 1658 1957 -68 -2141 -1633 1172 2402 427 -1848 -1779
2668 -1779 308 2008 1352 -1123 -2245 -536 1784 1862 -330 -2190 -1336 1321 2274 304 -1899 -1737
2684 -1737 475 2176 1253 -1288 -2238 -397 1999 1962 -617 -2406 -1041 1602 2156 193 -1947 -1764
2700 -1764 620 2379 1082 -1591 -2240 -109 2175 1752 -981 -2417 -689 1719 1903 -68 -1966 -1646
2716 -1646 905 2429 695 -1889 -1923 353 2097 1313 -1141 -2130 -386 1706 1723 -223 -1961 -1389 1164
2733 1164 2260 309 -1888 -1562 527 1881 1107 -1078 -2023 -437 1674 1723 -356 -2104 -1251 1330
2749 1330 2063 172 -1766 -1501 398 1898 1240 -1141 -2189 -338 1915 1722 -601 -2164 -930 1400
2765 1400 1979 99 -1709 -1529 530 2178 1099 -1581 -2129 121 2066 1396 -883 -2060 -713 1519
2781 1519 1852 -64 -1949 -1523 929 2301 594 -1846 -1744 466 1880 1144 -952 -2037 -581 1725
2797 1725 1777 -390 -2026 -1163 1180 2090 238 -1756 -1455 462 1755 1141 -964 -2099 -367 1875
2813 1875 1541 -673 -1851 -835 1114 1776 205 -1627 -1439 464 1860 1026 -1215 -1951 -61 1882
2829 1882 1246 -705 -1676 -807 1098 1839 236 -1805 -1534 740 2046 741 -1464 -1755 104 1723
2845 1723 1262 -608 -1912 -912 1430 1998 -125 -2068 -1234 1022 1935 525 -1511 -1653 194 1794
2861 1794 1281 -880 -2110 -588 1821 1749 -656 -1906 -781 1051 1686 408 -1554 -1623 474 1974
2877 1974 902 -1273 -1874 -67 1756 1233 -728 -1617 -715 938 1685 315 -1700 -1528 747 1961
2893 1961 594 -1331 -1501 30 1491 1247 -427 -1685 -887 1180 1890 75 -1857 -1249 903 1665
2909 1665 495 -1134 -1515 -125 1546 1378 -654 -1953 -704 1535 1705 -391 -1838 -887 887 1498
2925 1498 546 -1169 -1734 42 1985 1197 -1176 -1886 -184 1607 1391 -477 -1620 -853 877 1706 517
2942 517 -1540 -1750 558 2132 683 -1397 -1535 53 1369 1207 -394 -1698 -991 1103 1862 83
2958 83 -1833 -1245 891 1692 363 -1145 -1286 -106 1358 1309 -540 -1818 -630 1388 1596 -306 -1606
2975 -1606 -828 784 1344 491 -920 -1458 -134 1630 1300 -889 -1837 -304 1430 1260 -286 -1396 -1005
2992 -1005 636 1589 640 -1304 -1679 192 1889 1009 -1161 -1624 -120 1300 1224 -156 -1539 -1122 898
3009 898 1876 323 -1699 -1382 699 1745 592 -1135 -1390 -89 1308 1275 -396 -1807 -819 1347 1672
3026 1672 -224 -1658 -933 795 1424 457 -1041 -1391 -52 1495 1230 -741 -1797 -392 1465 1233
3042 1233 -367 -1354 -840 564 1464 566 -1173 -1479 173 1588 975 -907 -1566 -245 1240 1105 -213
3059 -213 -1255 -971 606 1646 480 -1399 -1395 469 1574 697 -894 -1360 -254 1198 1242 -256 -1520
3076 -1520 -899 970 1647 124 -1508 -1139 585 1463 611 -965 -1456 -156 1419 1258 -530 -1713 -666
3093 -666 1300 1500 -196 -1492 -945 621 1471 613 -1144 -1479 126 1572 970 -801 -1532 -390 1287
3110 1287 1283 -341 -1360 -749 675 1385 459 -1217 -1331 370 1499 621 -869 -1269 -264 1114 1129 -315
3128 -315 -1368 -710 740 1350 272 -1237 -1219 443 1425 603 -837 -1243 -214 1152 1180 -294 -1442
3145 -1442 -739 931 1426 116 -1313 -1104 495 1427 630 -923 -1368 -92 1330 1089 -529 -1511 -623
3162 -623 1084 1394 -114 -1449 -885 677 1337 486 -1041 -1330 113 1478 856 -836 -1397 -300 1144
3179 1144 1219 -296 -1426 -690 838 1298 296 -1109 -1224 298 1509 663 -894 -1249 -110 1107 1053
3196 1053 -300 -1375 -699 834 1298 136 -1166 -1075 422 1359 513 -897 -1154 -103 1056 1003 -342
3213 -342 -1324 -615 933 1280 13 -1222 -905 497 1235 450 -854 -1140 -96 1211 987 -538 -1419
3230 -1419 -452 1050 1171 -127 -1247 -832 613 1280 436 -971 -1265 63 1441 864 -789 -1361 -222
3247 -222 1117 1090 -221 -1325 -779 723 1332 227 -1175 -1120 387 1394 551 -924 -1163 -65 1036
3264 1036 966 -329 -1306 -619 887 1208 -26 -1136 -838 514 1175 426 -811 -1023 -37 1053 903 -407
3282 -407 -1284 -418 965 1041 -97 -1058 -743 441 1152 472 -840 -1158 -28 1198 853 -554 -1266 -318
3300 -318 943 1030 -48 -1119 -842 523 1279 396 -1015 -1137 231 1269 691 -704 -1129 -209 941
3317 941 1029 -125 -1249 -753 803 1284 117 -1104 -945 369 1195 522 -793 -1127 -123 1033 974 -376
3335 -376 -1340 -516 960 1070 -130 -1074 -755 417 1147 520 -819 -1127 10 1176 814 -554 -1185 -251
3353 -251 925 932 -83 -988 -754 416 1147 371 -916 -995 180 1082 608 -578 -1002 -272 765 892 -62
3372 -62 -1065 -754 601 1170 190 -968 -843 208 1019 618 -557 -1074 -270 920 1023 -192 -1206 -623
3390 -623 787 1140 37 -1013 -798 237 1078 643 -697 -1196 -81 1124 893 -515 -1212 -364 854
3407 854 950 -56 -957 -791 355 1175 447 -935 -1044 215 1089 577 -584 -993 -205 763 866 -78 -1013
3426 -1013 -720 577 1156 148 -971 -776 275 909 482 -483 -959 -277 805 901 -185 -1047 -583 654
3444 654 1052 60 -871 -695 185 879 609 -501 -1107 -253 971 846 -358 -1057 -427 662 887 66 -827
3463 -827 -800 200 1048 576 -771 -1087 6 1045 664 -466 -978 -345 699 912 33 -960 -806 442
3481 442 1140 328 -935 -918 271 990 543 -479 -931 -316 815 952 -161 -1084 -574 646 1003 112
3499 112 -902 -723 263 866 473 -507 -983 -250 874 806 -356 -981 -364 654 792 61 -733 -645 216
3518 216 900 482 -597 -910 -37 902 659 -358 -857 -324 572 805 112 -806 -756 285 1004 413 -742
3537 -742 -930 77 889 569 -366 -898 -397 628 969 10 -988 -703 487 1032 224 -813 -805 156 934
3556 934 546 -443 -929 -275 810 886 -225 -1010 -438 636 896 61 -758 -683 210 907 455 -552 -925
3575 -925 -65 845 674 -357 -906 -314 602 785 36 -783 -625 300 901 369 -631 -820 30 856 529
3594 529 -377 -807 -305 556 799 56 -827 -613 378 861 303 -617 -787 48 809 536 -379 -780 -304 573
3614 573 805 -27 -882 -557 488 866 158 -702 -725 111 853 544 -465 -860 -175 756 740 -210 -936 -444
3634 -444 579 854 95 -773 -704 224 879 437 -595 -904 -26 853 640 -384 -852 -298 623 777 -32
3653 -32 -807 -602 368 814 290 -607 -728 97 784 497 -399 -758 -222 527 670 -25 -769 -529 400 773
3673 773 160 -602 -646 71 737 454 -383 -750 -211 574 696 -60 -786 -516 432 820 160 -638 -614 115 774
3694 774 528 -409 -809 -136 713 709 -193 -848 -413 497 753 58 -696 -616 225 832 395 -549 -817 -16 765
3715 765 536 -348 -789 -271 531 727 -18 -721 -559 349 811 203 -630 -653 95 709 440 -355 -729 -180
3735 -180 625 642 -75 -723 -470 414 772 111 -607 -535 114 632 410 -343 -736 -156 592 592 -150 -701 -397
3756 -397 402 654 107 -575 -528 97 669 437 -394 -734 -73 651 530 -220 -677 -330 406 670 76 -605
3776 -605 -568 167 748 358 -582 -721 40 683 483 -262 -723 -288 532 715 -43 -750 -519 344 753 172
3796 172 -598 -619 134 644 417 -322 -716 -201 624 619 -182 -691 -311 416 624 87 -545 -495 158 640 339
3817 339 -380 -675 -90 638 454 -231 -610 -246 321 572 120 -560 -533 183 676 311 -420 -654 -4 600
3837 600 440 -219 -574 -306 358 653 110 -669 -515 249 677 259 -445 -615 -7 586 430 -214 -642 -287
3857 -287 502 686 -43 -690 -384 352 607 177 -483 -552 72 640 389 -350 -676 -174 593 564 -225 -645 -301
3878 -301 380 588 111 -536 -578 167 704 314 -454 -621 -46 541 448 -228 -583 -233 381 569 99 -547 -476
3899 -476 244 614 168 -429 -497 13 507 401 -217 -567 -252 376 558 32 -583 -395 277 535 151 -377
3919 -377 -510 -61 484 434 -207 -627 -209 454 562 -66 -581 -351 294 563 183 -427 -554 45 661 411
3939 411 -384 -611 -112 562 501 -165 -567 -324 356 576 100 -518 -508 171 631 264 -473 -525 4 482 418
3960 418 -190 -573 -229 403 540 -6 -559 -385 289 564 119 -416 -410 37 446 385 -195 -575 -160 452 497
3981 497 -63 -504 -329 282 490 165 -395 -450 -30 497 394 -244 -557 -141 445 416 -62 -499 -333 262 561
4002 561 170 -407 -480 58 529 315 -330 -536 -82 437 422 -84 -525 -348 325 545 71 -518 -456 173 577
4023 577 215 -394 -494 20 469 410 -178 -586 -242 428 503 -46 -499 -338 247 503 168 -415 -458 36 465
4044 465 355 -231 -542 -124 443 396 -82 -448 -257 215 467 116 -374 -395 30 432 287 -235 -486 -72 402
4065 402 355 -53 -384 -278 207 472 118 -403 -409 86 459 264 -288 -489 -67 393 382 -83 -447 -313 298
4086 298 513 45 -478 -374 141 482 234 -307 -481 -24 449 352 -147 -538 -210 384 479 -62 -443 -323 240
4107 240 462 186 -353 -412 62 449 276 -200 -473 -97 429 375 -136 -425 -199 215 423 84 -405 -391 113
4128 113 427 231 -236 -445 -109 370 326 -123 -390 -220 190 429 116 -386 -332 151 418 206 -214 -383 -73
4149 -73 354 337 -74 -385 -239 226 432 21 -369 -324 125 413 171 -255 -411 -62 409 312 -122 -468 -210
4170 -210 290 411 -48 -442 -278 176 444 172 -341 -445 65 452 237 -218 -435 -149 382 386 -117 -405 -195
4191 -195 228 391 115 -326 -358 142 417 138 -263 -349 -53 308 265 -152 -384 -203 204 312 58 -321 -300
4212 -300 154 345 127 -219 -309 -72 290 303 -132 -374 -173 237 342 28 -341 -289 132 379 166 -242 -371
4233 -371 -52 359 297 -164 -405 -145 265 342 2 -367 -282 159 366 159 -278 -375 10 415 234 -245 -369
4254 -369 -117 286 344 -40 -397 -205 229 386 77 -324 -323 98 394 185 -268 -326 -28 285 268 -94 -383 -147
4276 -147 308 311 9 -301 -228 159 360 118 -246 -272 -23 299 254 -163 -355 -117 239 264 -44 -270 -234 106
4298 106 315 110 -219 -263 -37 323 222 -125 -371 -77 207 300 0 -268 -283 198 333 193 -271 -315 17
4319 17 323 254 -231 -287 -66 258 345 -59 -314 -241 212 401 12 -284 -269 36 357 178 -266 -286 -57 258
4341 258 313 -124 -394 -119 235 305 10 -286 -229 128 318 102 -191 -284 -1 285 242 -180 -341 -70 260 200
4363 200 -32 -214 -209 79 300 134 -203 -317 12 280 194 -194 -291 -86 236 244 -26 -296 -177 136 286 42
4385 42 -218 -206 50 252 186 -145 -253 -82 221 240 17 -282 -131 201 295 1 -261 -182 78 291 156 -173
4407 -173 -325 -46 329 288 -120 -343 -138 209 281 23 -218 -170 86 276 85 -241 -271 74 309 206 -147
4428 -147 -275 -89 201 213 -39 -230 -157 161 321 53 -254 -246 3 226 124 -121 -212 -36 232 239 -23 -232
4450 -232 -178 141 242 36 -229 -227 -7 189 149 -94 -224 -42 231 238 -5 -229 -112 167 217 29 -241 -234 -15
4473 -15 187 124 -198 -336 -40 230 205 -147 -285 -147 147 282 10 -237 -180 89 300 154 -175 -207 42 298
4495 298 183 -88 -224 -46 228 243 29 -224 -125 165 302 79 -204 -142 52 226 135 -82 -164 -12 188 218
4517 218 -30 -235 -106 137 189 13 -186 -178 21 214 119 -136 -224 -57 179 176 -63 -233 -103 119 216 65 -150
4540 -150 -161 88 261 173 -97 -209 -31 207 182 -70 -260 -147 90 177 -4 -229 -197 63 264 133 -157 -155
4562 -155 60 251 195 -76 -234 -92 172 185 -51 -277 -169 122 274 58 -180 -151 75 261 126 -134 -213
4583 -213 -76 163 128 -103 -230 -111 171 201 54 -187 -119 41 196 80 -159 -203 -31 190 152 -61 -133 -14
4605 -14 126 178 28 -172 -183 2 140 113 -109 -151 6 179 147 -88 -245 -131 74 170 37 -157 -119 106 203
4628 203 94 -183 -252 -32 184 159 -51 -157 -44 190 194 -37 -257 -157 120 221 80 -126 -171 29 193 90
4650 90 -154 -202 -31 204 228 -36 -198 -121 96 154 -14 -120 -96 70 203 59 -163 -200 -47 166 141 -36 -165
4673 -165 -55 107 119 -18 -158 -98 92 190 75 -151 -169 -30 149 149 -27 -131 -52 95 146 -17 -174 -105 57
4696 57 198 103 -118 -175 -43 152 150 -32 -148 -63 128 138 -31 -184 -122 101 190 53 -202 -217 -14 186 148 -99
4720 -99 -240 -54 110 130 -40 -155 -63 124 152 -29 -208 -141 97 240 102 -146 -203 -18 161 114 -32 -113 -75
4743 -75 87 117 -29 -131 -65 114 151 -16 -163 -159 20 151 99 -67 -182 -57 96 145 5 -129 -113 28 116
4766 116 69 -93 -85 9 123 105 -85 -171 -11 163 154 -55 -169 -122 108 208 82 -147 -214 -29 155 126 -33 -177
4790 -177 -68 104 112 -33 -129 -56 92 133 -41 -163 -122 97 147 26 -154 -194 13 191 128 -60 -193 -105 131
4813 131 164 20 -162 -115 60 121 41 -77 -86 24 112 62 -76 -91 -31 102 78 -80 -94 -38 91 125 14 -124 -130
4838 -130 23 158 86 -82 -171 -49 113 156 -4 -109 -132 55 149 80 -109 -112 -9 113 84 -21 -111 -30 102 123
4862 123 -15 -126 -35 80 151 21 -143 -109 83 153 35 -153 -141 -11 189 133 -86 -200 -52 120 171 -27
4884 -27 -190 -136 105 168 57 -85 -158 14 155 117 -63 -128 -46 78 105 -7 -81 -85 38 70 46 -67 -103 25 81
4909 81 38 -60 -73 1 97 56 -57 -95 -21 77 127 -11 -133 -107 62 117 56 -111 -131 -33 110 146 -40 -170 -81 118
4935 118 166 34 -152 -155 12 164 73 -69 -186 -26 153 142 -11 -146 -67 79 153 11 -105 -117 20 86 90 -77
4959 -77 -128 -19 127 67 -80 -96 -23 82 112 -36 -116 -43 65 78 11 -92 -40 76 109 24 -83 -89 38 84 80 -47
4985 -47 -93 -1 97 89 -20 -117 -75 97 96 41 -82 -90 1 112 85 -7 -145 -61 106 128 5 -112 -101 35 142 64 -77
5012 -77 -157 -46 137 147 -33 -159 -102 63 155 21 -140 -119 37 139 63 -91 -147 -18 153 111 -54 -108 -75 89
5036 89 118 -27 -129 -95 9 114 42 -98 -106 12 116 57 -74 -64 -30 73 63 -28 -84 -40 33 93 -31 -74 -60 58
5062 58 58 -3 -40 -54 -5 69 30 -40 -102 -10 103 52 11 -82 -49 23 104 -3 -81 -91 35 72 52 -66 -111 -44 92 71
5090 71 -55 -99 -88 80 109 4 -122 -81 18 150 58 -112 -121 -11 121 124 -48 -118 -55 86 146 19 -153 -119 53
5115 53 147 85 -101 -147 -8 134 71 -72 -141 -43 112 93 -25 -149 -82 51 131 51 -91 -129 24 115 57 -34 -118
5140 -118 -40 94 114 -16 -81 -108 21 130 43 -51 -89 -12 87 61 -17 -90 -55 45 106 24 -113 -71 -16 68 64 -44 -103
5167 -103 -33 77 52 -25 -115 -73 56 104 26 -98 -103 27 111 20 -88 -91 -16 101 71 -36 -111 -27 50 60 -15 -72 -61
5194 -61 59 84 23 -54 -84 17 86 -10 -63 -85 -3 86 41 -9 -68 -13 43 41 -28 -69 -38 22 48 -16 -72 -48 5 73 43 -45
5224 -45 -65 -30 60 73 21 -47 -28 27 46 1 -69 -47 38 59 31 -72 -59 -32 52 65 -59 -94 -48 87 51 -12 -81 -68 24
5253 24 59 5 -84 -80 -11 63 31 -62 -94 -41 74 71 -27 -110 -52 45 98 5 -74 -94 49 82 18 -92 -67 30 95 61 -50
5282 -50 -101 -22 69 75 4 -94 -39 39 81 18 -43 -82 -17 60 39 -51 -70 -20 44 79 -2 -49 -74 50 81 21 -83 -68 14 94
5312 94 41 -43 -84 -35 79 73 -22 -69 -58 41 111 38 -70 -88 19 117 103 -38 -135 8 73 86 14 -122 -90 77 129
5339 129 15 -76 -109 40 139 41 -73 -104 -42 85 96 -33 -109 -36 81 103 -12 -92 -82 65 117 34 -56 -96 -17 95
5365 95 32 -45 -116 -16 73 73 -3 -79 -77 16 78 56 -99 -81 -2 46 39 -33 -47 -24 41 85 -4 -73 -96 45 81 38 -25 -98
5395 -98 -3 76 61 -45 -82 -39 72 124 -4 -104 -81 30 99 22 -77 -103 -34 89 85 -74 -116 -47 73 78 -19 -122 -71
5422 -71 47 90 27 -104 -101 15 121 33 -54 -102 -6 92 75 -36 -88 -25 80 78 14 -68 -74 17 73 35 -64 -60 -10 46 30
5451 30 -18 -70 -46 34 53 -7 -74 -57 19 74 9 -71 -87 -18 66 55 -21 -77 -33 17 68 -14 -76 -71 6 76 36 -50 -92 -40 73
5482 73 54 4 -102 -30 42 91 19 -94 -81 50 76 47 -80 -91 -6 98 37 -73 -81 -20 74 84 -5 -86 -39 35 91 1
5510 1 -82 -77 10 88 46 -59 -90 -8 62 38 -10 -82 -39 61 85 4 -57 -64 34 67 10 -62 -57 -19 18 36 -18 -69 -35 23 72
5541 72 24 -63 -59 -24 61 52 -23 -63 21 65 55 5 -60 -55 65 75 16 -92 -44 45 95 32 -43 -46 -4 71 56 -30 -81 -25 46
5572 46 78 -7 -60 -44 9 72 13 -70 -74 26 42 54 -66 -58 10 56 42 -41 -52 -51 30 60 26 -41 -33 7 49 40 -35 -17 -2 28
5604 28 45 -8 -70 -31 33 42 -8 -38 -36 15 55 44 -43 -31 -15 54 48 18 -39 -64 45 83 8 -56 -18 -9 54 43 -36 -76 -35 61
5636 61 16 -22 -53 -22 54 60 24 -62 -32 33 56 -11 -77 -26 27 74 46 -29 -73 4 65 25 -11 -71 -12 50 75 10 -43 -28 2
5667 2 33 14 -38 -55 -5 21 47 -2 -28 -37 39 10 12 -22 -26 25 62 12 -40 -26 -4 23 21 -10 -7 10 15 41 14 -32 -38 1 34 26 -26
5702 -26 -33 -14 21 12 -2 -64 -3 50 22 -16 -57 -27 43 52 19 -41 -49 -15 18 53 -35 -70 -23 36 44 16 -42 -34 31 49 15 -48 -35
5735 -35 26 41 26 -26 -50 15 34 14 -22 -33 -28 28 29 -11 -3 -29 23 27 14 -21 -24 4 13 3 -55 -21 -3 35 41 -22 -24 -14 23 22 23
5770 23 3 -31 -19 36 33 -10 -15 -37 -6 40 10 -11 -19 38 28 5 -7 -39 -3 28 17 -4 -28 -35 30 39 -7 -58 -44 32 27 32 -19 -49
5804 -49 1 68 46 -24 -36 8 48 53 -17 -18 25 33 55 16 -32 -33 16 24 -3 -15 -27 14 30 18 -22 -15 2 29 47 -4 -37 9 -9
5837 -9 21 12 -20 -15 -5 -2 18 0 -9 -14 20 9 -17 -13 -28 21 18 17 -24 -21 9 37 32 -23 -42 -7 37 36 4 -43 -24 -8 1 -13 -29 -12 10
5874 10 38 22 -40 -61 -4 26 5 -34 -13 -5 7 32 7 -60 -23 18 25 29 -52 -33 18 40 18 2 -10 0 26 22 -37 -27 0 48
5906 48 41 13 -32 -15 8 32 -15 -19 -33 -4 40 23 12 -15 3 -24 20 -2 -16 -38 0 28 16 -16 -48 -1 4 25 -15 -13 -33 -10
5938 -10 9 6 -5 -16 31 20 9 -23 -17 -8 -9 49 19 -33 -11 37 16 -7 -32 -8 31 26 0 -31 -25 -12 20 -1 -43 -30 -8 44 36 -23
5972 -23 -19 -9 33 21 13 -18 0 5 -1 12 -1 -13 25 38 5 13 -26 17 3 18 -11 3 -24 13 29 18 10 20 5 24 0 13 -26
6005 -26 -20 13 21 14 -20 -28 5 13 5 -34 -40 -9 32 20 3 -32 3 45 24 -8 -35 -11 15 -9 10 -42 3 28 18 21 -16 -30 4 32
6039 32 1 -27 -24 2 -2 11 -15 -1 -15 12 22 0 -35 -45 8 40 -18 -17 6 -7 19 23 2 -26 14 35 16 -13 -34 -5 32 28 -27
6072 -27 8 -14 -13 15 20 -6 -33 4 9 0 19 -8 3 9 8 31 2 -4 -21 16 16 -10 -25 -23 35 7 25 -17 0 7 9 21 -8 -10 7 45
6108 45 23 -23 -33 9 -1 14 -1 -24 5 21 28 -26 -40 -26 -3 16 8 -29 -25 9 32 -1 -12 -10 4 -18 18 -19 -10 -14 27 1 -6 -26
6142 -26 -36 5 40 21 -3 0 3 55 34 13 -9 6 31 9 22 25 -17 14 26 14 -11 -6 12 8 35 -12 -26 13 -29 11 20 -5 -12 0
6176 0 27 21 13 -30 -9 10 18 27 -12 10 10 26 32 11 -2 29 27 16 -30 -22 11 27 25 -21 -8 9 20 19 14 3 -6 4 10 9 -20 -16 -1 23
6214 23 -1 -11 -26 15 31 24 -29 -9 -12 38 -4 -3 -15 -9 -15 29 18 -27 10 18 45 34 -20 -1 -9 -6 19 5 -4 4 -1 24 -16 -27 -16 25
6250 25 25 8 -9 -12 -11 32 17 3 -34 -24 18 23 -4 -32 -19 0 11 26 -7 -29 -9 35 19 -16 -28 -2 25 38 10 -23 -24 -8 18
6283 18 -6 -30 -2 12 50 22 -11 0 15 13 19 15 -52 9 30 11 -22 -35 -6 3 17 21 1 -15 -7 14 44 0 11 9 13 10 -2 -6 20
6318 20 -1 15 37 21 -13 -31 26 14 14 -17 -35 10 23 -8 -30 -38 3 28 28 3 -30 21 0 16 4 -14 -1 0 37 16 -28 -20 20
6351 20 32 9 -22 -24 -3 9 18 -4 -21 8 27 8 8 1 14 13 26 -5 -25 -17 17 16 8 5 -33 -2 47 -5 -40 -35 8 0 16 -9 -10 -8 1
6388 1 12 19 -14 -15 0 18 -15 -23 2 -23 33 23 2 -17 21 -5 16 31 -8 -22 19 37 43 -2 -21 -16 6 18 -8 -9 -16 16 27 17
6422 17 -11 -34 -31 34 5 -1 -14 -15 52 29 -15 -28 0 17 24 -16 -11 -15 26 21 10 23 1 6 25 -9 -20 -35 -5 30 25 1 -9 7 -18
6457 -18 -8 -6 -28 -37 28 -5 14 -15 -12 22 -11 -2 -1 -14 -9 24 -19 18 -24 12 14 16 18 0 -6 10 14 4 -1 -6 11 14 36 25 -18 -10 26 28
6495 28 18 -33 -17 18 26 16 -8 -29 -14 25 -8 -11 -25 -34 14 32 -22 -51 -38 3 38 35 -15 -21 8 31 11 -17 -25 0 42 26 -8
6528 -8 -1 5 34 50 -4 -33 -1 0 0 9 16 -40 5 8 1 -12 -1 -6 3 -8 -16 -20 3 16 12 21 -8 27 -2 16 -3 18 -13 -24 18 34 33 12
6566 12 21 -3 11 13 1 -31 -12 18 -4 -1 -36 -37 -20 45 17 1 -68 31 24 11 -15 -40 3 8 8 -16 -43 -12 6 11 -11 -19 -31 3 12
6601 12 16 -19 -9 25 16 14 -22 -11 7 32 -8 -14 -27 16 1 16 -11 -5 5 26 36 5 -25 -35 -9 3 25 -7 -22 -4 -20 15 2
6634 2 1 -2 24 5 17 -17 -38 -7 15 3 -1 -18 9 20 -14 6 -19 -11 14 16 13 8 2 -10 55 33 11 -8 -11 19 13 18 -25 -29 6 14 -1
6671 -1 -33 -17 -8 -9 17 -36 -9 -30 3 1 -12 -32 -21 22 -2 -18 3 -5 4 4 11 -15 -40 5 38 -10 27 -10 18 -9 12 9 -14 4 37
6706 37 13 1 -7 0 7 -27 -2 -19 -30 -1 -20 25 1 -45 -1 17 2 -6 -16 -39 20 16 11 -3 -12 -23 22 36 18 -48 -20 29 10 5
6740 5 -10 -2 28 34 8 -35 -12 -12 5 18 -16 -9 -16 7 -6 -16 -30 -6 -9 32 -33 -22 6 1 12 6 -20 2 19 49 10 8 -16 -3 16
6775 16 4 0 -17 1 -21 -4 -2 -32 -23 -17 20 23 -19 -21 -13 29 28 -1 -42 -22 -3 14 -1 -2 -17 6 -29 12 -29 -31 -10 -6 -3 -18 -33 -4
6811 -4 -23 26 26 -21 -12 -14 0 24 -13 -26 -18 10 18 12 14 -2 18 18 25 -32 -48 15 2 -12 -2 -17 15 25 -7 -46 -28 -37 -2 23 0 -18
6847 -18 -22 -14 0 1 2 -14 -14 31 1 20 -18 -6 0 14 1 31 2 21 19 4 -20 -33 10 23 18 4 5 -11 29 37 5 -13 -24 32 2
6882 2 7 -25 -13 -1 15 14 -26 -15 -14 15 4 -5 -6 9 4 19 25 3 5 6 30 49 -27 -6 -6 39 54 4 -38 -15 -18 -27 -57 6 -4 9 10
6919 10 -30 -8 -30 21 4 -4 -31 -6 -11 -2 18 -12 -17 -16 7 15 17 5 5 -5 47 12 -21 -19 -7 3 19 -18 -8 -3 6 17 2 -20 -33 14
6955 14 35 25 -20 -28 -27 -4 12 -9 -44 -17 -7 26 15 -26 4 -22 10 15 1 -9 2 25 -20 -14 -23 11 22 16 3 -4 -41 10 21 -12
6989 -12 14 -15 28 27 3 20 -2 -21 11 20 -7 -28 4 10 18 -17 -33 -5 19 -18 -5 -60 -32 -2 21 -15 25 11 -10 15 9 -10 -3
7022 -3 7 2 32 31 -4 -2 24 32 -13 -1 -28 -20 -4 39 -31 -9 -6 -21 36 -4 -9 -33 -14 0 24 -18 -12 17 7 -9 -22 -33 -32 7 18
7057 18 -12 -23 -22 38 18 10 -14 2 17 26 33 25 -19 -2 23 22 -1 -3 -20 10 26 -6 10 -20 -4 10 2 -42 -6 19 10 -25 9 4 -15
7092 -15 2 9 -6 -3 10 14 11 -16 6 2 -1 25 -5 -26 -15 0 -14 16 12 4 -12 8 -1 19 -11 -35 -5 34 18 14 -21 -33 -1 21 0
7127 0 -26 -28 14 19 6 -15 -35 2 13 4 -3 -17 -12 16 3 -19 -4 13 30 -31 20 10 -2 14 -16 19 -35 -10 -2 29 41 0 8 -19
7161 -19 15 7 2 -4 -15 -1 0 28 -13 -4 -25 19 20 -18 -26 -15 -4 20 -12 -13 -19 -5 0 20 14 -7 -11 -5 -2 12 -10 -2 6 8 31 -6 -25 31 32
7200 32 22 23 -28 -15 19 -7 1 -14 -20 18 18 -27 -39 -21 18 4 -6 -25 -21 19 -23 -7 -22 -15 -2 -5 31 8 -12 -23 41 31 -1 9
7234 9 -7 10 -15 18 -21 -5 8 24 13 -4 -37 -11 19 25 -9 -28 -22 12 11 -11 -30 -36 -12 -12 1 -26 -12 -12 3 18 3 -2 -9 -13 14
7269 14 13 -15 -31 -8 10 -2 8 -20 12 6 36 -8 6 -14 31 22 -4 -28 21 19 20 -16 -16 -36 17 22 18 -13 -31 -11 -1 -10 -51 18 -9
7304 -9 16 30 -12 -17 -19 7 6 5 -3 -6 24 18 7 -32 2 18 25 25 4 1 1 9 16 18 17 -4 -6 7 -7 19 -8 -9 0 -11 -6 -41 -35 -2 17 -1 -6
7345 -6 0 20 18 19 -4 -27 -15 7 19 3 -4 -2 11 4 30 -37 -16 2 39 -2 -10 -30 4 23 11 21 -24 -13 -4 20 11 -18 4 2 11 -9
7381 -9 -9 -25 8 30 23 -6 -22 -2 26 -36 -12 -10 -14 -7 13 9 -24 -33 3 16 8 22 -16 7 29 33 19 -18 -25 38 3 27 18 -13 -17 10 -9
7418 -9 -17 -28 -28 13 24 -1 -31 -19 5 39 7 -33 -35 7 11 8 -22 1 -13 1 12 -15 -12 9 21 46 -15 -6 6 1 39 10 -7 13 3
7453 3 3 36 -25 15 -9 27 14 -10 -24 2 9 9 10 -19 16 6 1 19 -12 -30 -8 40 16 -26 -6 13 42 3 -18 -33 -15 17 4
7486 4 26 22 -23 -11 3 19 -6 -23 -6 17 42 10 -9 -38 2 -1 33 24 -1 -4 11 8 -20 5 -11 -12 34 -27 2 -18 -14 32 1 -7 -13
7521 -13 4 12 23 7 -22 -19 7 22 3 -6 -10 26 3 -13 9 5 -11 24 7 -1 -2 0 7 3 -15 -27 1 23 0 16 3 -56 3 23 16 -26
7557 -26 -32 29 -9 14 30 -5 8 4 19 -25 -3 4 22 -1 45 -15 -9 2 -22 21 -10 -8 -13 -12 9 -12 -1 -26 6 -7 25 -8 -31 13
7591 13 -6 18 12 -38 -18 14 -3 8 -25 -28 24 23 7 -12 -18 36 36 15 4 -5 40 11 14 13 2 -9 -1 29 -7 -32 -23 8 13 12 -7 -10 -15
7628 -15 33 15 -3 -12 -15 31 26 -12 -21 18 13 9 1 -20 -12 8 -2 8 -3 10 -13 -26 8 -5 -15 -18 7 53 10 25 -11 -17 23 33 17
7663 17 -37 10 6 22 4 -6 11 1 -5 5 -14 -27 11 8 -16 -22 -52 17 4 5 -22 -9 -1 -11 30 28 7 -23 9 7 51 -14 24 21 8
7698 8 22 -6 -8 -25 13 5 7 -34 15 -1 3 15 -9 4 14 10 2 22 -13 4 8 13 7 -10 11 -13 3 -9 -14 -8 -15 5 26 5 13 7 14 14 -12
7737 -12 -1 8 15 10 1 -18 -12 27 24 15 -17 4 -3 -14 12 -6 -4 -50 15 18 -5 -58 -25 -16 8 14 -28 -11 12 8 -10 10 -5 -4 26 2 1 -3
7775 -3 -15 19 5 16 -9 -15 14 19 3 15 -32 16 18 6 -2 -19 -26 15 -15 21 12 0 14 -1 11 4 -26 -16 -14 24 -9 -7 7 19 29
7810 29 -3 3 5 16 10 -4 -22 -4 -16 10 1 9 29 5 19 18 7 1 13 -10 0 5 19 -39 18 11 8 6 -30 -15 -23 5 -26 -17 -5 -26 5
7847 5 -7 2 -10 19 7 -21 10 -40 11 30 37 30 -6 10 8 -4 20 -36 17 3 3 -4 25 -4 -1 -17 7 0 -13 -12 25 19 -3 -6 -32 17
7883 17 0 26 -17 -3 -5 13 2 -21 -26 -7 24 -3 -1 -22 2 1 16 10 -19 23 -5 7 -12 10 23 12 18 46 -26 -16 17 -4 -1 14
7917 14 1 -5 -2 -3 -28 -4 -51 4 -5 -7 -8 -16 -2 -14 -3 -13 -30 -19 22 17 -10 -18 -14 -18 26 -20 16 1 -8 13 19 16 12 19 -16 -14 1 11 10
7956 10 24 18 -1 -16 -2 11 12 8 7 -10 -25 -3 28 -30 -36 -17 21 -6 21 -4 -7 -10 -8 7 0 -7 -26 -4 17 2 -14 28 8 14 12 -32
7992 -32 17 -2 -27 8 2 15 15 -10 24 14 -11 -16 27 12 -5 -32 4 1 16 13 -14 -32 18 -29 22 -15 -12 9 -4 22 2 0 -21 20
8026 20 16 -1 -15 25 -2 5 5 -10 -15 -20 -2 33 24 -15 9 13 13 14 10 0 1 -15 4 15 -8 -12 7 2 9 4 -8 -27 6 25 -5 -12 8 7 25
8065 25 -7 14 -14 -8 1 11 15 -11 -19 23 12 -3 4 -12 19 -14 -15 -10 -41 -14 -15 -5 -5 -14 -28 -2 10 -18 6 2 -25 19 -25 -14 -26 -20
8101 -20 19 0 -28 -20 5 -5 1 20 -14 -37 10 29 2 -11 7 4 17 -16 7 -1 -19 -4 11 3 -2 -12 -15 2 -32 -16 -3 -45 -8 -43
8135 -43 -21 -10 -17 7 -13 -4 -27 15 2 11 -3 -17 8 -41 6 -8 8 11 12 -19 1 -3 -15 3 9 2 20 8 -2 -1 28 15 -13 2 -4
8170 -4 9 1 -5 -21 7 1 12 4 -27 -10 -3 1 1 -8 0 9 9 -10 -29 1 26
8191B6
$$ Imaginary data points
##PAGE= N=2
##DATA TABLE= (X++(I..I)), XYDATA
0 0 0 0 0 0 0 0 0 0 0 0 0 0 0 0 0 0 0 0 0 0 0 -3 4 -3 3 -3 3 -4 4 -3 2 -2 2 -1 1 -1 -1 1 -2 4 -5 7 -7 11 -12 14 -18 19 -22 27 -27 28 -33
53 -33 34 -33 33 -27 20 -5 -16 56 -114 209 -370 649 -1173 2260 -4929 13896 -93160 -553703 15854
72 15854 333129 -109559 1658 140863 -247933 -134490 310942 116514 -141656 -92269
82 -92269 -137397 52295 342730 -32711 -361725 44040 213771 -65137 28326 100465 -233592
93 -233592 -163510 284771 211708 -187832 -216780 38792 173069 66319 -81051 -66617 -42580
104 -42580 -39590 138193 177477 -151323 -244175 82334 204667 35039 -92725 -144113 -24309
115 -24309 171828 71281 -83891 -12039 -78746 -107950 237032 202722 -315270 -207824 271138
126 271138 110030 -125342 48383 -38497 -184179 128015 221439 -104325 -151423 -14416
136 -14416 21065 156517 95371 -234249 -131743 200165 66372 -76470 63341 -64673
146 -64673 -185510 149733 242497 -136518 -209659 44412 106875 57604 10995 -99157 -86067
157 -86067 53246 90821 52992 -34462 -155250 -47507 188480 108120 -132755 -115866 24206
168 24206 68668 67932 7272 -88014 -78292 22524 114238 87327 -103789 -170100 60216 171563
180 171563 -9564 -85468 -21253 -41309 19105 139746 14316 -154786 -59058 81771 89983
191 89983 32399 -90123 -119007 57636 126460 -8130 -49942 -33902 -67909 45641 159492
202 159492 -22783 -175311 -20311 108845 56110 29 -60169 -89943 24841 112220 33815
213 33815 -58362 -83533 -35401 96607 113729 -63398 -130936 2361 79145 52302 11582
224 11582 -67556 -89862 33394 114253 31287 -76243 -89727 1268 106202 65117 -69533
235 -69533 -86143 -2211 51157 68925 17051 -94173 -79642 63849 101830 3961 -72599 -69135
247 -69135 9788 93392 51661 -61207 -77925 -8949 56969 77587 -1616 -104459 -55513 74385
259 74385 82265 -4647 -63663 -64102 9990 91852 48575 -63509 -80611 -4346 68293 70704 -19897
272 -19897 -97077 -37787 67740 72251 -310 -65033 -66219 20725 93788 35938 -66950 -72815
284 -72815 2500 69991 62504 -28441 -90303 -28223 66153 69349 -4093 -71815 -59693 34384
296 34384 88879 22167 -67448 -66578 7604 73563 55966 -39523 -87882 -17262 70006 64166 -13621
309 -13621 -75046 -49269 43145 82995 13667 -69008 -63049 16436 77470 44622 -48246 -78815
321 -78815 -7202 67887 57710 -18392 -74185 -40554 48055 75789 5323 -67983 -55078 22376
333 22376 72483 34129 -48202 -70115 -4096 65105 53906 -23464 -73402 -31098 51218 67036
345 67036 -592 -64140 -49736 24168 71141 30575 -51354 -68839 2412 69580 48010 -31907
357 -31907 -70044 -22270 51277 62776 -1669 -66499 -50485 31832 75769 21151 -60273 -62212
369 -62212 12997 67298 38353 -33842 -65155 -19986 52000 63819 -7578 -74022 -42638 45623
381 45623 69571 4364 -57826 -47165 14234 58920 37419 -32920 -68330 -15292 62674 58742
393 58742 -24413 -72436 -23282 48792 53016 -654 -47383 -45370 9165 64071 39989 -46323
405 -46323 -72862 3081 70539 39258 -35056 -55863 -14047 35779 48859 10119 -50753 -56660
417 -56660 19956 78015 24560 -62584 -55607 20238 54807 24890 -21145 -46485 -26631 33098
429 33098 63065 7343 -68724 -50673 42436 71319 -799 -56456 -31466 12819 35114 36104
441 36104 -8222 -64929 -34337 58791 67778 -23251 -73103 -20301 46488 45441 -2185 -36498
453 -36498 -35778 -2747 47583 51676 -27980 -83155 -9530 80627 42037 -45503 -48472 -1685 23519
466 23519 34960 20914 -36412 -61576 6999 77264 34178 -61173 -61853 23455 58083 13219
478 13219 -23988 -28317 -22821 13213 57324 22929 -62344 -59334 37915 74942 -651 -59873 -25365
491 -25365 21430 23703 21195 6255 -46194 -47760 42551 77534 -14746 -77977 -18957 48501 37335
504 37335 -5337 -28067 -27784 -5817 32585 46774 -8095 -73853 -30423 73062 57931 -46744
516 -46744 -56398 10584 23677 14406 24262 -14455 -62862 -9155 73131 41692 -51485 -62426 12819
529 12819 58114 19765 -28871 -26772 -10272 4168 39353 35619 -44064 -70549 24145 81325
541 81325 6150 -62402 -27045 23556 23430 14298 4714 -32835 -43750 24196 72312 3396 -74861
554 -74861 -31745 49891 42729 -11288 -28222 -18848 -4747 24065 39702 -1526 -58640 -34494
566 -34494 53842 62191 -30400 -63544 3968 35496 9161 8335 -1451 -45953 -22466 58137 47784
579 47784 -41016 -59485 6259 49548 23936 -22782 -31309 -7226 10340 25020 27795 -22179
591 -22179 -62335 2310 74574 21694 -57942 -33635 22528 24678 12338 3103 -27632 -36150 16617
604 16617 57798 12598 -56885 -41285 34353 51146 -3324 -35397 -18813 1345 19171 32568
616 32568 2091 -49112 -33241 40692 55918 -14642 -56742 -12188 34141 23069 611 -10992
628 -10992 -29581 -16988 38712 45187 -24586 -57134 -2700 46270 26426 -18382 -31845 -10966
640 -10966 14898 25999 15590 -19381 -43584 -4128 53632 29540 -41149 -41515 13336 31363
652 31363 13271 -3824 -24004 -27205 13042 45265 12620 -41239 -37138 18347 45634 9900
664 9900 -31943 -26759 3485 22701 24593 355 -36888 -29065 27664 47350 -3220 -44651 -21264
677 -21264 22308 30833 7455 -19530 -28722 -6856 30205 33348 -12482 -45488 -13952 36231 33147
690 33147 -11114 -33847 -15865 15146 29728 13113 -22916 -35344 -17 39858 25900 -24293
702 -24293 -39252 -1954 32327 24019 -8369 -29283 -19352 14977 35584 10385 -31862 -32236 10634
715 10634 37646 15149 -23744 -30793 -1866 27042 24509 -6547 -31870 -19090 20162 35037
727 35037 3321 -32254 -24676 12631 31749 12799 -20156 -29409 -3148 28284 25271 -10041 -33475
740 -33475 -14387 23362 31133 -504 -30490 -22127 12592 31748 12279 -23081 -30429 819 31217
753 31217 22076 -14544 -32879 -10492 24998 29446 -3129 -31782 -20512 16270 32560 8119
765 8119 -25986 -27290 4888 30639 19042 -16162 -31947 -7402 27010 26853 -7153 -31150 -15992
778 -15992 18219 29287 4427 -25306 -24068 6322 29581 16605 -18612 -30756 -2631 27932
790 27932 21686 -10102 -27975 -12774 17831 27694 2911 -26285 -22522 9573 30165 12819 -21437
803 -21437 -27758 1663 26720 18303 -9931 -26821 -12758 19442 28604 -430 -28539 -19217 12735
816 12735 28154 9375 -21336 -25302 2346 25592 17824 -10608 -28251 -11082 22829 26734 -5082
829 -5082 -27479 -15049 12887 26076 8699 -21823 -25130 4657 27410 15881 -14335 -27926
841 -27926 -6135 24859 22726 -7908 -25737 -13416 13776 27319 6265 -26126 -23085 10412
853 10412 27065 10649 -16258 -25226 -3415 24706 20555 -9507 -26046 -11838 16994 26969 848
866 848 -27174 -17019 12437 22386 8966 -13865 -24689 -3201 26138 19357 -12683 -25343 -7347
879 -7347 18143 22302 -1893 -23165 -14246 9361 21381 11248 -16113 -27078 1470 28887 13784
892 13784 -15933 -21047 -4529 15818 20549 -740 -23120 -16267 10853 26042 8983 -23305 -24519
905 -24519 9885 26463 6791 -13119 -17148 -7940 15595 25266 -2726 -29122 -13930 18005 24931
918 24931 1093 -23916 -16731 10920 19551 7014 -8143 -20634 -11094 22572 26939 -12601 -30483
931 -30483 -3378 19894 15771 -1281 -17028 -14940 6010 20191 11736 -12130 -26419 -3579 30129
944 30129 17592 -20567 -21124 3319 11947 11984 5156 -16690 -21109 8182 27463 8241 -21471 -22787
958 -22787 7245 26171 6361 -15812 -11691 -3216 5545 20570 8103 -26973 -21439 19351 26708
971 26708 -2867 -20766 -11997 6947 16133 7694 -6247 -15507 -12045 13354 28803 -3212 -34041
984 -34041 -8332 24872 14217 -6330 -10630 -11101 -1248 17718 15501 -10310 -25343 -6482 25669
997 25669 21951 -17008 -26535 4096 16505 5777 3134 -7344 -21853 0 29872 12235 -23231
1010 -23231 -21954 6923 23470 8986 -15112 -14546 1052 6498 11889 10678 -17296 -27076 13076
1023 13076 33134 -2513 -25531 -7546 8591 10459 8062 -3977 -15703 -9195 10766 22010
1035 22010 2703 -27585 -16046 22793 20832 -10284 -13613 -2801 -1968 9132 17920 -4949 -25947
1048 -25947 -6972 22627 19562 -10634 -24490 -2463 17940 8954 -2561 -5128 -13735 -6607 22249
1061 22249 19417 -18774 -26048 5845 22463 8229 -10820 -14726 -2794 8942 11258 6237 -10815
1074 -10815 -22582 2819 30984 7469 -26558 -13307 11979 11105 4720 -1290 -14171 -11096 11483
1087 11483 20011 1348 -21100 -16265 14242 24073 -3673 -19739 -4737 5034 6188 12028 -6
1100 -6 -22578 -10433 21139 18986 -9537 -20615 -4850 13861 13120 -1847 -10175 -9099 -2103 13675
1114 13675 16819 -9556 -25098 -156 22503 9557 -10456 -12619 -3891 7158 12583 4388 -11055
1127 -11055 -16011 774 21335 11581 -17630 -18494 6850 15426 4738 -3870 -10818 -10138 7794 19061
1141 19061 2484 -18366 -14035 8989 20092 3576 -16582 -11798 5236 11227 8239 -1906 -16297
1154 -16297 -10686 14919 19583 -5092 -19710 -7054 10997 14223 1656 -12083 -11541 1547 13286
1167 13286 11288 -6596 -19263 -4479 17756 13243 -7863 -14700 -4651 7853 12695 3564 -11732
1180 -11732 -13258 2759 16271 9084 -10947 -16516 685 15359 8868 -5873 -12170 -6456 7476
1193 7476 14870 2599 -14779 -12390 6299 16058 5333 -11608 -13483 1193 13242 9234 -4899
1206 -4899 -13987 -6933 10327 15301 -462 -15493 -9829 7465 14649 4270 -10983 -12800 1051
1219 1051 13650 9798 -6197 -15158 -4894 12197 13409 -2487 -14476 -8395 7545 14366 3395
1232 3395 -12070 -12316 2808 14140 8092 -8125 -14600 -2546 12903 11702 -4083 -14348 -6909
1245 -6909 9142 13902 1072 -12839 -10403 4505 13755 6496 -9104 -13696 -671 13291 10135
1258 10135 -5401 -13797 -5149 9714 12345 -155 -11989 -9381 4392 13410 5877 -9892 -13101
1271 -13101 808 12907 8377 -5637 -12540 -4597 9176 11915 -242 -12223 -9212 5489 13893
1284 13893 4457 -11019 -11822 2391 12405 7376 -5762 -12640 -4347 10441 12357 -2062 -13757
1297 -13757 -7762 7765 13369 2119 -11536 -10463 3027 12399 7219 -7036 -13600 -2675 12393
1310 12393 10997 -4477 -13267 -5568 8252 12062 1306 -11204 -9838 3693 12837 6275 -8579
1323 -8579 -12799 -123 12397 8444 -5104 -11527 -4786 7797 11826 597 -12156 -8933 5636
1336 5636 12362 3809 -9144 -10888 934 11392 7473 -5157 -11549 -4392 9023 11790 -1388
1349 -1388 -12745 -6779 6817 10855 2759 -8250 -10416 617 11968 7937 -6468 -12345 -2611
1362 -2611 10212 10091 -2692 -11424 -5912 5848 10677 3508 -9015 -11466 1947 13455 6299 -8503
1376 -8503 -11077 -582 9397 8518 -2236 -10997 -6618 6552 12343 2162 -11830 -10054 5629 12664
1390 12664 2925 -8310 -8816 -621 8865 9359 -2899 -13009 -5507 9837 11685 -1823 -12058 -6373
1404 -6373 6310 9696 2306 -6428 -9223 -1755 10559 10034 -6005 -13819 -1693 10872 7750 -2966
1418 -2966 -8507 -5330 3462 9540 4695 -7277 -11449 367 13134 7155 -8785 -10526 1082 7794
1432 7794 5697 -174 -7705 -8206 3872 12844 3567 -11378 -10255 4811 12127 2817 -7888 -7118
1446 -7118 -540 5500 8567 1053 -12117 -8903 9277 13393 -1920 -11856 -5383 5147 8429 3167
1460 3167 -5014 -8516 -2925 8266 11145 -2805 -15028 -4259 12470 8628 -4949 -7459 -3318
1473 -3318 1218 7788 6872 -6207 -12528 -267 12853 7574 -7975 -11385 764 9073 4600 -1800
1487 -1800 -5199 -6686 780 11946 6140 -11185 -11498 5375 12172 1892 -7441 -6069 -117 4606
1501 4606 6704 1873 -9004 -9626 6087 14047 -36 -12570 -5384 5850 6673 2217 -2983 -7262
1515 -7262 -3933 6445 10353 -552 -12892 -6609 10324 10626 -4119 -8700 -2005 1609 4764 7083
1529 7083 -2709 -12695 -2779 12495 8559 -6762 -10955 -960 8418 6168 -2055 -5899 -4998 149 9011
1544 9011 7774 -8149 -13477 3186 13568 2748 -8051 -5936 -169 4260 6619 1616 -7997 -8420
1558 -8420 4060 12485 2658 -11424 -7741 5895 8272 1044 -3479 -5335 -3785 4819 9779 124
1572 124 -11342 -6406 7844 10224 -1698 -9068 -3545 3272 4731 4135 -1399 -9409 -4620 9637
1586 9637 9644 -5127 -10798 -1471 7252 6116 -785 -5947 -5103 992 7345 6201 -4910 -11459 -578
1601 -578 11842 5744 -7005 -7328 -246 4267 5918 1993 -6908 -8069 2796 10713 3728 -8538
1615 -8538 -8847 2831 9232 3032 -4625 -5883 -2629 4205 8500 1059 -9878 -6764 6278 9725
1629 9725 165 -8128 -5575 2800 6893 3504 -3242 -7346 -3216 6990 8905 -2607 -10477 -2995
1643 -2995 7105 6545 -624 -5892 -5349 1380 7479 4503 -4706 -8513 -1222 8324 6650 -4139 -8419
1658 -8419 -1645 5324 5655 859 -5630 -6690 1685 8929 3923 -6337 -7765 555 7671 5031 -3436
1673 -3436 -7166 -2502 4784 6906 909 -7418 -6519 3681 8869 2061 -6694 -6593 1123 7248 4709
1688 4709 -3679 -7639 -2269 6002 7259 -831 -8440 -4861 5189 7912 725 -6430 -5931 1402 7608
1703 7608 4478 -4718 -7753 -955 6696 6200 -1920 -7971 -3788 5291 7130 248 -6337 -5500 1862
1718 1862 7470 3659 -5121 -7128 -236 6500 5396 -2343 -7498 -3071 5383 6643 -220 -6304 -4891
1733 -4891 2443 7207 2939 -5227 -6652 208 6760 5031 -3116 -7412 -2102 5563 5998 -500 -6306
1748 -6306 -4892 2855 7467 2420 -5814 -6509 815 6988 4516 -3687 -7148 -1642 5501 5892 -497
1763 -497 -6706 -4975 3699 7841 1508 -6465 -5740 1715 6805 3811 -3882 -6865 -1277 5931 5905 -1510
1779 -1510 -7389 -3828 5001 7040 -42 -6339 -4687 2129 6511 3198 -4463 -6734 -335 6522 5079
1794 5079 -2786 -7099 -2258 5235 5727 -477 -5693 -4466 2152 6797 2780 -5144 -6245 700 6261
1809 6261 4104 -2791 -6292 -1999 4689 5551 -144 -5808 -4694 2672 6993 1940 -5511 -5378 999
1824 999 5669 3871 -2622 -6418 -2074 5203 5829 -931 -6495 -3907 3754 6486 912 -5325 -4909 1076
1840 1076 6049 4018 -3640 -6949 -891 6167 4999 -2063 -6286 -2896 4075 5971 584 -5410 -5039
1855 -5039 1593 6863 3268 -4990 -6294 659 5756 3773 -2004 -5686 -2912 4113 6193 129 -6064
1870 -6064 -4495 2814 6544 1705 -5029 -4774 904 4793 3764 -1670 -6190 -2676 5237 5890 -1432
1885 -1432 -6103 -2936 3245 5287 1072 -4220 -4515 229 5143 4361 -2743 -6970 -1248 6091 4433
1900 4433 -2194 -4840 -2480 2281 5252 1970 -4520 -5509 796 6463 3749 -4239 -6313 271 5352
1915 5352 3235 -1299 -4291 -3638 2248 6730 1627 -6373 -5161 2827 6295 1704 -4382 -4652 309
1930 309 4251 3721 -779 -5632 -3808 4517 7042 -1003 -6922 -2666 3680 4489 997 -3214 -4393 -447
1946 -447 4833 4626 -2125 -6908 -1886 6165 4853 -2730 -4861 -1409 1869 3851 2488 -3335 -5859
1961 -5859 160 6362 3657 -3912 -5900 51 5076 2914 -1635 -3293 -2735 835 5602 2998 -5456
1976 -5456 -5934 2641 6390 1236 -3882 -3758 -97 3450 3554 -237 -4638 -3989 2903 6913 528 -6862
1992 -6862 -3589 3824 4349 506 -2386 -3754 -1542 4045 5169 -1376 -6664 -2645 5271 5549 -1814
2007 -1814 -5470 -1684 2396 3301 2190 -2051 -5641 -1103 6303 4480 -3814 -6029 -149 4849 3296
2022 3296 -1547 -3702 -2211 1157 4386 2877 -4067 -6161 1440 6844 1648 -4507 -3536 427 2925
2037 2925 3100 -68 -4147 -3518 2392 5847 1191 -5617 -4162 3026 4868 432 -2705 -2833 -1175 2802
2053 2802 4706 -325 -5913 -3045 4241 5277 -760 -4965 -2461 2189 3455 1677 -1727 -4514 -1801
2068 -1801 4796 5017 -2522 -6136 -892 4475 3562 -898 -3716 -2616 1351 4268 2405 -3166 -5380
2083 -5380 94 6078 3156 -3939 -4590 349 3409 2861 -97 -3796 -3512 2039 5491 1233 -4778 -4188
2099 -4188 1860 5003 1519 -3122 -3519 -419 2928 3634 -145 -4747 -3213 3290 5227 -150 -4604
2114 -4604 -2688 1864 3647 1647 -2091 -3884 -1107 3790 4050 -1381 -5074 -1780 3663 3897 -550
2129 -550 -3731 -2554 1295 3774 2027 -2599 -4424 -414 4579 3359 -2432 -4625 -793 3380 3273
2144 3273 -199 -3552 -3066 1521 4705 1693 -3705 -4132 761 4505 2544 -2411 -4218 -873 3360
2159 3360 3494 -399 -4081 -2937 2231 4816 843 -4173 -3457 1407 4040 1949 -2343 -4016 -722
2174 -722 3719 3406 -1264 -4241 -1963 2771 4102 186 -3967 -2831 1715 3836 1470 -2495 -3694
2189 -3694 -299 3820 2986 -1710 -4044 -1352 2863 3585 -105 -3740 -2661 1640 3775 1316 -2660
2204 -2660 -3582 -62 3727 2799 -1751 -4013 -1233 3017 3441 -334 -3661 -2499 1708 3875 1313 -2962
2220 -2962 -3607 427 3977 2466 -2141 -3958 -772 3301 3182 -808 -3710 -2148 2057 3903 876
2235 876 -3563 -3400 1245 4080 1655 -2605 -3572 -307 3346 2927 -1183 -3839 -1771 2558 3817 231
2251 231 -3802 -2772 1786 3729 1142 -2472 -3245 -226 3373 2860 -1468 -3950 -1277 2904 3300 -343
2267 -343 -3485 -2219 1641 3344 1129 -2466 -3231 45 3577 2482 -1952 -3688 -637 2883 2800 -480
2283 -480 -3150 -2102 1590 3481 1075 -2900 -3207 698 3672 1895 -2106 -3341 -547 2783 2871 -519
2299 -519 -3454 -2161 2011 3746 603 -3362 -2923 1152 3460 1578 -2082 -3329 -622 3132 3020 -1110
2315 -1110 -3841 -1567 2672 3390 -74 -3287 -2377 1391 3408 1352 -2414 -3347 14 3542 2419 -1881
2331 -1881 -3529 -725 2682 2717 -372 -3085 -2170 1514 3467 917 -2891 -2988 754 3362 1663 -1847
2347 -1847 -2974 -650 2464 2798 -324 -3249 -2045 1910 3431 514 -2893 -2529 870 2927 1630
2362 1630 -1479 -3100 -979 2732 2993 -851 -3527 -1528 2206 2952 189 -2669 -2376 692 3033 1747
2378 1747 -1939 -3447 -386 3379 2456 -1596 -3234 -862 2102 2673 253 -2780 -2561 1130 3597 1337
2394 1337 -2754 -3142 587 3308 1736 -1618 -2757 -950 1994 3003 114 -3374 -2346 1967 3434
2409 3434 400 -2871 -2356 800 2681 1516 -1315 -2835 -1109 2467 3092 -750 -3618 -1338 2381
2424 2381 2571 -64 -2157 -2014 401 2701 1830 -1620 -3216 -479 3085 2435 -1443 -2984 -666 1806
2440 1806 2092 473 -2004 -2584 471 3397 1647 -2418 -3056 295 2937 1708 -1260 -2447 -1066 1417
2456 1417 2779 721 -2919 -2826 1509 3626 653 -2702 -2264 533 2399 1740 -951 -2751 -1336 2150
2472 2150 3181 -246 -3560 -1817 2323 2801 -162 -2189 -1808 217 2389 1992 -1412 -3304 -614 2972
2488 2972 2458 -1276 -3055 -761 1979 2043 193 -1778 -2223 162 3077 1872 -2242 -3059 336 2799
2504 2799 1534 -1160 -2217 -951 1309 2306 659 -2277 -2629 863 3387 960 -2570 -2220 576 2031
2520 2031 1454 -543 -2339 -1471 1728 2890 123 -2984 -2006 1684 2889 279 -2144 -1765 188 1999
2536 1999 1930 -749 -3130 -1150 2609 2701 -876 -2959 -1208 1717 2302 359 -1859 -2178 41 2665
2552 2665 2046 -1711 -3199 -182 2817 1905 -1081 -2381 -954 1391 2307 553 -2114 -2372 651 3063
2568 3063 1257 -2285 -2400 508 2224 1299 -726 -2144 -1208 1545 2495 65 -2527 -1837 1219 2659
2584 2659 590 -2086 -1877 364 1824 1455 -566 -2455 -1251 2019 2554 -452 -2558 -1296 1267 2240
2600 2240 653 -1694 -2054 95 2241 1785 -1023 -2764 -773 2324 2211 -678 -2412 -1196 1230 2258
2616 2258 646 -1908 -2249 363 2644 1500 -1699 -2566 -72 2312 1699 -771 -2268 -1162 1481 2407
2632 2407 219 -2273 -1862 888 2585 951 -1916 -2217 304 2191 1433 -807 -2248 -1040 1717 2351
2648 2351 -222 -2385 -1445 1088 2239 735 -1775 -2040 266 2143 1341 -926 -2204 -865 1794 2160
2664 2160 -412 -2312 -1199 1152 2068 590 -1708 -1951 317 2184 1306 -1141 -2237 -569 1914 1948
2680 1948 -564 -2238 -1106 1256 2084 393 -1847 -1875 472 2288 1243 -1411 -2346 -244 2167 1715
2696 1715 -749 -2227 -1032 1407 2211 211 -2106 -1768 803 2361 990 -1690 -2269 123 2255 1395
2712 1395 -985 -2123 -871 1528 2155 -128 -2315 -1444 1184 2149 503 -1749 -1878 409 2043 1154
2728 1154 -1043 -1983 -624 1673 1960 -447 -2228 -1025 1302 1857 326 -1569 -1717 338 2010 1181
2744 1181 -1129 -2087 -486 1826 1776 -605 -2126 -918 1153 1831 433 -1665 -1835 422 2177 1106
2760 1106 -1381 -2106 -215 1895 1557 -684 -1990 -886 1222 2030 323 -1986 -1681 943 2231 723
2776 723 -1569 -1873 105 1938 1411 -883 -2043 -752 1536 1999 -184 -2241 -1286 1237 1944 375
2792 375 -1542 -1731 184 1993 1277 -1167 -2042 -443 1703 1802 -504 -2091 -941 1194 1735 394 -1425
2809 -1425 -1739 353 2159 1028 -1365 -1821 -93 1582 1417 -496 -1886 -882 1147 1752 287 -1665
2825 -1665 -1623 609 2049 695 -1390 -1601 -93 1489 1431 -485 -1972 -911 1376 1910 12 -1862
2841 -1862 -1373 862 1912 630 -1259 -1722 -113 1799 1563 -850 -2183 -609 1661 1729 -251 -1868
2857 -1868 -1175 912 1886 571 -1446 -1822 163 2095 1227 -1327 -1960 -105 1600 1346 -369 -1772
2873 -1772 -1089 1084 1893 234 -1707 -1482 630 1923 720 -1350 -1560 16 1401 1281 -343 -1813
2889 -1813 -982 1348 1856 -80 -1780 -1146 713 1616 636 -1069 -1528 -217 1552 1472 -601 -2010 -665
2906 -665 1505 1616 -220 -1523 -1099 554 1664 788 -1233 -1798 -25 1863 1298 -1025 -1901 -331 1445
2923 1445 1295 -172 -1455 -1249 693 1975 616 -1708 -1681 539 1874 856 -1105 -1652 -213 1400
2939 1400 1391 -235 -1779 -1190 1160 2082 76 -1854 -1227 778 1595 652 -978 -1612 -295 1537 1503 -565
2957 -565 -1983 -723 1450 1555 -273 -1532 -941 556 1416 738 -1032 -1693 -82 1748 1184 -901 -1701
2974 -1701 -314 1303 1231 -170 -1254 -998 446 1645 758 -1365 -1651 340 1746 820 -896 -1430 -373
2991 -373 1125 1393 -24 -1585 -1248 785 1892 426 -1676 -1436 565 1594 709 -817 -1509 -532 1333
3008 1333 1597 -333 -1920 -901 1270 1686 -32 -1572 -1083 581 1490 757 -944 -1659 -223 1682
3024 1682 1315 -832 -1784 -384 1301 1288 -172 -1352 -998 546 1529 684 -1199 -1606 186 1727 914
3041 914 -973 -1404 -262 1029 1239 1 -1449 -1152 752 1652 452 -1351 -1364 327 1502 731 -814
3058 -814 -1305 -402 1031 1383 -72 -1639 -985 999 1571 119 -1326 -1146 355 1374 797 -804 -1511
3075 -1511 -368 1335 1340 -453 -1707 -686 1128 1431 37 -1332 -1108 452 1529 748 -1020 -1611 -67
3092 -67 1573 1168 -814 -1618 -398 1148 1286 -26 -1410 -1148 676 1652 466 -1260 -1350 217 1520
3109 1520 900 -834 -1433 -216 1118 1139 -108 -1408 -965 863 1530 153 -1269 -1030 321 1291 788
3126 788 -776 -1366 -218 1171 1088 -289 -1411 -788 879 1414 100 -1243 -1017 349 1305 763 -823
3143 -823 -1406 -181 1324 1157 -431 -1508 -651 1015 1349 89 -1258 -1069 461 1468 675 -1018 -1404
3160 -1404 -52 1389 1107 -656 -1540 -456 1123 1214 -115 -1314 -1006 614 1531 388 -1261 -1254 243
3177 243 1368 821 -781 -1410 -237 1203 1071 -267 -1335 -836 775 1470 214 -1301 -1021 449 1285
3194 1285 651 -778 -1300 -211 1181 1051 -369 -1352 -667 857 1283 41 -1216 -909 405 1191 573
3211 573 -784 -1273 -149 1179 1000 -483 -1332 -514 936 1177 -23 -1116 -883 432 1282 590 -919
3228 -919 -1272 50 1303 893 -617 -1329 -382 1038 1144 -80 -1264 -979 571 1461 399 -1220 -1237
3245 -1237 297 1329 715 -723 -1295 -260 1110 1162 -280 -1350 -753 844 1369 110 -1242 -942 457
3262 457 1193 549 -732 -1224 -160 1191 966 -486 -1263 -448 907 1107 -46 -1106 -784 423 1149
3279 1149 496 -796 -1180 -5 1218 793 -569 -1152 -374 810 1049 -32 -1082 -899 446 1265 484
3296 484 -941 -1178 174 1191 740 -532 -1174 -439 866 1161 -75 -1241 -849 661 1312 261 -1041
3313 -1041 -971 266 1111 698 -583 -1237 -303 1094 1079 -359 -1281 -563 805 1128 101 -1036 -869 334
3331 334 1166 621 -780 -1282 -68 1218 857 -580 -1186 -339 822 1032 -2 -1100 -870 483 1231
3348 1231 417 -947 -1063 163 1106 635 -548 -1009 -363 769 1039 -50 -1112 -720 573 1142 237
3365 237 -902 -863 194 951 647 -423 -1063 -382 890 1063 -241 -1187 -574 637 1001 212 -853 -911
3383 -911 152 1070 681 -620 -1190 -245 1083 971 -424 -1123 -441 669 1048 209 -950 -976 333 1309
3401 1309 544 -873 -1121 51 1092 694 -476 -1040 -404 738 1026 31 -1124 -802 609 1138 192
3418 192 -904 -872 178 944 579 -439 -1009 -360 819 995 -206 -1137 -514 702 909 88 -748 -799 89
3437 89 972 632 -561 -1067 -213 932 912 -302 -1029 -437 583 865 223 -745 -918 139 1120 579 -714
3456 -714 -1028 -28 913 713 -311 -948 -481 568 978 183 -956 -891 434 1149 316 -820 -901 85 885
3475 885 644 -360 -1029 -441 769 1032 -55 -1116 -684 660 1011 155 -812 -793 91 974 671 -510
3493 -510 -1076 -231 958 879 -288 -1047 -397 639 836 162 -737 -790 151 1019 572 -664 -964 -6 872
3512 872 636 -297 -867 -386 510 835 136 -796 -761 286 985 383 -692 -793 4 753 598 -237 -871 -441
3532 -441 613 920 74 -961 -719 427 981 307 -690 -818 -20 832 698 -377 -1070 -374 791 910
3550 910 -128 -1001 -590 533 944 210 -736 -801 103 922 594 -565 -1003 -133 892 730 -282 -890 -404
3569 -404 542 870 143 -783 -744 272 944 389 -643 -821 4 805 571 -330 -852 -366 563 792 26 -814
3589 -814 -671 329 929 270 -649 -742 38 715 593 -291 -852 -349 663 803 -54 -814 -578 373 865 243
3609 243 -612 -691 45 745 569 -328 -897 -292 719 753 -153 -828 -546 380 846 219 -709 -739 127 873 531
3630 531 -526 -912 -160 793 715 -245 -866 -412 577 870 83 -794 -679 271 947 345 -641 -803 36 774
3650 774 563 -312 -836 -315 615 778 -65 -792 -545 359 789 231 -654 -666 124 706 465 -294 -766 -250
3670 -250 614 680 -134 -766 -430 356 722 196 -572 -670 66 722 473 -349 -760 -265 642 723 -166 -765 -428
3691 -428 393 765 215 -650 -720 140 832 437 -490 -821 -108 732 638 -252 -794 -354 477 777 109 -744 -655
3712 -655 284 816 305 -622 -735 32 737 494 -329 -764 -295 590 733 -54 -808 -470 425 736 171 -566
3732 -566 -645 85 718 446 -350 -714 -189 619 664 -161 -730 -341 371 657 129 -551 -630 92 709 402 -420
3753 -420 -719 -108 607 556 -173 -660 -322 381 639 165 -571 -647 149 730 355 -448 -674 -64 607 563 -179
3774 -179 -711 -346 447 740 107 -722 -569 339 759 244 -528 -660 -7 686 529 -313 -793 -243 573 677
3794 677 -109 -744 -460 390 663 141 -541 -597 53 714 425 -435 -704 -94 605 515 -175 -617 -312 381 635
3815 635 126 -536 -547 149 699 290 -473 -572 -12 526 444 -155 -630 -339 392 607 62 -564 -523 216 678
3836 678 239 -447 -557 -79 488 539 -173 -723 -339 485 624 -13 -605 -478 262 633 239 -431 -586 -48
3856 -48 616 524 -299 -737 -181 568 537 -84 -590 -398 298 669 166 -538 -594 107 682 393 -416 -656 -36
3877 -36 562 475 -157 -599 -370 408 684 70 -626 -475 220 633 251 -461 -557 17 506 411 -149 -617 -308
3898 -308 398 582 -70 -559 -340 231 516 224 -381 -515 -14 501 437 -190 -611 -228 465 512 -59 -469 -326
3919 -326 169 524 250 -410 -583 -16 596 381 -288 -619 -164 477 503 -103 -559 -402 250 653 200 -555
3939 -555 -558 165 611 306 -355 -589 -95 509 451 -117 -589 -316 398 647 55 -601 -402 237 526 204 -375
3960 -375 -535 -40 504 411 -213 -606 -230 418 492 -85 -537 -307 205 462 207 -352 -515 29 549 358 -235
3981 -235 -538 -148 429 470 -70 -456 -310 184 538 214 -411 -526 73 546 300 -252 -488 -128 397 437 -77
4002 -77 -536 -360 228 531 143 -443 -458 141 497 244 -280 -501 -125 465 454 -100 -571 -240 361 539 41
4023 41 -520 -366 183 526 185 -345 -511 -26 533 403 -269 -542 -170 416 468 -39 -538 -328 239 479 183
4044 183 -345 -490 52 527 290 -304 -439 -77 368 399 -41 -458 -287 215 461 154 -360 -404 68 474 223
4065 223 -243 -392 -120 298 392 -26 -478 -274 281 444 91 -403 -411 134 482 237 -268 -468 -102 433 449
4086 449 -162 -584 -255 349 463 67 -438 -383 155 491 172 -319 -456 -55 501 397 -245 -506 -135 340
4106 340 428 -22 -464 -308 236 504 117 -360 -406 65 489 277 -282 -439 -56 338 349 -57 -436 -258 262
4127 262 420 38 -383 -362 76 429 215 -260 -383 -33 301 343 -47 -440 -243 288 422 25 -307 -315 73
4148 73 436 203 -231 -377 -65 382 351 -73 -432 -193 300 382 30 -317 -297 90 442 201 -300 -414 -52
4169 -52 408 316 -179 -475 -117 320 358 11 -442 -322 215 480 99 -358 -381 57 450 259 -274 -448 -48
4190 -48 340 309 -50 -378 -221 261 439 9 -374 -262 90 344 203 -239 -363 -53 364 313 -98 -378 -228
4211 -228 240 339 -33 -279 -257 75 345 179 -234 -345 9 352 293 -120 -380 -150 258 321 -21 -322 -287 102
4233 102 421 184 -272 -382 15 345 259 -165 -411 -123 285 356 24 -372 -289 160 425 95 -361 -338 79
4254 79 325 226 -177 -416 -116 305 319 -97 -388 -222 239 375 19 -323 -232 111 324 148 -214 -359 -43
4275 -43 325 261 -149 -355 -151 245 301 -26 -279 -237 120 302 149 -257 -311 -15 332 177 -118 -317 -109 218
4297 218 298 -23 -277 -268 95 270 179 -306 -296 1 321 178 -116 -325 -129 233 315 12 -394 -205 101 378
4319 378 67 -267 -290 25 356 184 -110 -348 -127 361 279 -98 -335 -201 259 338 15 -284 -291 86 360 116
4341 116 -203 -331 -85 331 281 -179 -326 -62 216 277 52 -314 -275 165 327 81 -222 -213 37 265 181 -101
4363 -101 -291 -125 255 266 -35 -305 -161 157 287 80 -208 -244 9 231 189 -64 -271 -142 204 323 2
4384 2 -307 -196 134 297 90 -226 -258 -2 313 239 -134 -347 -137 273 317 -42 -287 -181 135 306 98 -208
4406 -208 -270 44 268 127 -186 -250 23 289 185 -155 -295 -121 235 308 28 -319 -250 110 318 67 -199
4427 -199 -189 71 281 128 -156 -284 -122 184 259 15 -267 -105 194 252 26 -210 -239 -18 210 142 -108 -208
4449 -208 -44 248 248 -14 -227 -142 99 165 22 -206 -220 16 209 156 -126 -248 -32 255 254 -14 -210 -112 185
4472 185 280 72 -222 -259 69 282 96 -222 -282 -39 216 178 -119 -309 -162 135 245 -26 -293 -214 90 264
4494 264 40 -216 -252 -3 236 136 -138 -258 -97 185 203 -87 -278 -171 122 175 36 -218 -218 4 162 94
4516 94 -149 -252 -99 160 146 -73 -250 -100 133 175 38 -148 -180 57 250 147 -110 -143 0 236 200 -32
4538 -32 -173 -87 143 235 76 -185 -202 21 190 64 -196 -274 -76 157 174 -86 -225 -89 178 271 61 -187
4560 -187 -150 93 241 59 -163 -250 -27 183 150 -122 -233 -46 232 239 -13 -184 -78 161 202 10 -220 -201
4582 -201 -3 187 101 -159 -214 42 221 197 -56 -172 -109 94 129 -29 -197 -131 82 211 81 -65 -135 2
4604 2 163 132 -94 -223 -117 109 181 59 -98 -141 87 169 75 -162 -222 -57 188 189 -43 -193 -64 149 166 -78
4628 -78 -219 -179 58 239 108 -144 -167 14 197 119 -156 -240 -56 210 187 -16 -212 -121 85 161 36 -177 -160
4651 -160 82 249 129 -120 -197 -42 108 163 -89 -133 -40 130 149 -25 -195 -166 90 236 79 -97 -142 -43 120
4674 120 80 -53 -145 -33 158 199 -16 -194 -162 57 178 111 -67 -153 -15 91 99 -102 -168 -29 153 186 -8
4697 -8 -186 -155 37 194 120 -85 -191 -33 135 95 -101 -156 -29 156 156 -44 -214 -172 106 220 70 -171 -177 9
4721 9 181 96 -97 -142 12 156 80 -96 -186 -59 167 198 -17 -221 -142 85 179 110 -84 -160 -72 117 99 -33
4745 -33 -125 -39 92 118 -81 -170 -73 101 160 35 -126 -170 12 181 102 -38 -136 -92 98 111 -32 -109 -66 58 83
4770 83 42 -107 -128 33 185 117 -116 -133 -21 149 182 16 -167 -150 35 174 91 -124 -139 3 140 102 -73
4793 -73 -115 -42 105 61 -81 -169 -61 113 143 -37 -175 -110 108 214 19 -130 -187 -11 186 156 -31 -174 -52
4816 -52 110 161 16 -101 -79 58 119 38 -54 -105 20 134 46 -94 -145 16 100 93 -45 -139 -88 91 157 1 -163
4841 -163 -122 22 156 80 -65 -167 -48 80 114 33 -123 -115 32 162 50 -81 -111 -7 108 77 -64 -126 -30
4864 -30 102 98 -36 -148 -42 139 120 -26 -173 -93 100 195 65 -162 -151 36 174 112 -97 -183 -49 150 134
4887 134 -5 -171 -95 27 137 69 -116 -140 -5 113 75 -19 -114 0 55 89 22 -92 -65 73 101 9 -97 -52
4911 -52 30 94 30 -60 -91 0 98 48 -62 -125 -72 120 106 -15 -108 -94 51 130 75 -74 -168 -25 137 114 -38 -174
4937 -174 -98 104 174 52 -115 -114 21 184 102 -91 -131 -14 140 109 -12 -117 -90 78 108 15 -117 -94 36 141
4961 141 52 -74 -104 13 84 32 -88 -101 -27 76 85 -51 -76 -24 73 95 3 -102 -49 53 88 17 -74 -84 8 123
4987 123 83 -60 -95 -36 111 115 -8 -124 -88 27 93 31 -78 -125 -30 139 116 -65 -158 -60 66 142 10 -136 -129
5012 -129 -2 183 86 -99 -174 -30 143 125 -52 -139 -78 79 144 14 -129 -104 16 152 64 -91 -140 -9 109
5035 109 97 -36 -97 -66 69 96 1 -114 -63 53 72 24 -73 -67 40 117 15 -63 -81 -25 60 65 -51 -71 -37 54 70
5062 70 3 -58 -21 42 77 28 -52 -75 31 74 28 -31 -78 -34 84 61 -16 -94 -43 61 96 22 -98 -99 32 114 52 -100
5090 -100 -89 -42 105 116 -51 -144 -80 94 111 39 -124 -104 42 166 52 -95 -153 -21 107 87 -48 -149 -37
5113 -37 123 149 17 -134 -93 38 152 60 -118 -141 -5 121 63 -81 -134 -50 103 117 3 -123 -77 57 116 39
5137 39 -109 -105 -20 123 80 -46 -86 -63 56 95 23 -90 -100 41 106 43 -50 -110 -14 66 84 5 -90 -13 41 129 21
5164 21 -113 -75 24 124 45 -64 -83 -23 75 102 -49 -82 -44 67 93 -14 -95 -70 32 83 29 -54 -72 3 103 75
5190 75 -43 -72 -26 87 68 -33 -59 -35 48 99 8 -46 -61 40 59 3 -56 -56 16 69 35 -58 -84 -10 71 36 -11 -62 -16
5219 -16 55 58 33 -35 -40 3 61 36 -31 -53 -2 50 50 11 -64 -7 31 48 11 -42 -58 20 105 26 -31 -79 -11 83 45 -38 -86 -64
5251 -64 71 71 4 -61 -59 14 113 23 -98 -55 23 96 33 -68 -123 -17 108 68 -44 -93 -44 106 99 -32 -89 -46 47 87
5279 87 36 -74 -80 9 104 38 -59 -59 -22 67 72 -7 -56 -19 37 80 38 -107 -80 13 81 37 -26 -96 -23 58 69 -1 -53 -59 49
5310 49 94 29 -76 -98 9 77 66 -37 -84 -43 108 77 10 -78 -71 58 125 28 -92 -90 52 123 85 -55 -115 -19 102
5337 102 86 -36 -117 -63 39 95 28 -98 -62 48 87 46 -67 -99 -15 114 95 -40 -71 -34 77 94 -7 -82 -93
5362 -93 39 95 40 -68 -74 16 100 82 -60 -80 -25 51 101 3 -58 -78 19 104 31 -58 -88 -26 58 46 -25 -93 -69 27 104
5391 104 19 -73 -67 7 101 62 -65 -78 9 116 110 -48 -98 -48 83 122 20 -105 -86 68 114 44 -72 -99 14 118
5417 118 72 -73 -125 -32 73 86 -37 -125 -38 60 69 17 -92 -89 49 93 31 -56 -87 6 90 69 -3 -77 -53 82 85 19
5445 19 -62 -58 33 72 7 -36 -74 -8 73 89 -8 -82 -43 54 84 16 -60 -66 21 47 42 -58 -91 -33 44 69 -12 -69 -73 48 56 7
5477 7 -83 -79 19 93 48 -49 -84 7 88 81 -35 -101 -54 21 111 4 -88 -38 40 82 13 -66 -76 33 70 29 -29 -89 -17 102
5507 102 56 -27 -80 -33 68 61 7 -80 -59 50 69 21 -47 -28 -18 62 44 -48 -69 -30 62 68 48 -40 -39 15 65 46 -36 -57
5537 -57 0 40 52 -9 -56 -25 68 50 24 -37 -55 6 47 36 -42 -85 -40 89 66 -19 -72 -54 5 80 6 -52 -22 26 99 58
5567 58 -36 -59 2 96 75 -32 -88 -6 58 85 -13 -95 -38 63 76 22 -57 -62 38 75 35 -43 -50 -25 37 62 -12 -71 -39 20
5597 20 47 7 -32 -48 25 47 31 -25 -58 -7 37 60 -19 -27 -24 19 59 19 -33 -35 0 68 22 -11 -52 -7 23 33 -21 -37 -40 31
5629 31 66 8 -38 -55 0 47 14 -42 -64 -30 61 43 -22 -58 -28 39 67 10 -36 -46 53 64 -9 -36 -48 25 47 46 -32 -54 12
5660 12 56 75 -5 -51 -21 64 59 13 -20 -40 2 41 -5 -37 -36 -9 38 31 -3 -48 -15 48 27 -1 -38 -52 15 36 31 -1 -26 26
5692 26 40 45 7 -27 -1 26 62 9 -25 -55 4 49 28 -28 -19 14 56 37 -30 -63 -5 49 33 4 -39 -38 11 45 13 -51 -74 -23
5724 -23 37 55 -4 -42 -15 40 41 1 -36 -38 68 44 8 -44 -41 8 57 40 -18 -37 26 68 49 -29 -40 -13 32 7 -16 -11 -6 7
5756 7 63 20 -34 -48 -29 33 14 -44 -32 -22 19 56 -2 -13 -23 1 37 17 -51 -4 6 9 19 -7 4 -21 28 31 13 -18 -53 28
5788 28 28 26 -28 -57 30 54 -7 -35 -32 -5 -3 29 -40 -50 -36 -9 -1 7 -55 -33 34 50 36 -23 -38 24 21 17 -1 -9 -5 39 67 3 -35
5823 -35 -45 38 33 31 -17 -5 14 13 6 -23 -52 6 17 26 14 -18 -22 11 -3 31 -29 1 -6 -4 36 0 -12 0 2 34 -6 -29 -13 14 23
5858 23 45 -1 -32 -10 26 -1 -37 -17 -12 27 11 9 -27 -16 3 11 7 -48 -37 15 32 -3 -43 -38 20 21 40 1 -24 -19 3 17 -10 -35
5892 -35 -24 -10 48 12 -30 -8 1 24 24 10 -22 8 21 -2 20 -33 24 42 50 -18 -25 -18 16 34 -11 -14 -13 -5 -23 5 -6 -28 -25 3 40
5927 40 -15 -45 -6 -4 19 24 -7 -22 -16 8 12 5 -16 -19 17 29 3 -15 -15 23 36 11 -11 -31 -2 17 36 -16 -21 -2 44 25 -9 -32
5961 -32 -37 24 21 20 -20 -13 -6 31 9 -26 -9 1 17 29 -10 -19 -20 29 -5 -12 -34 23 38 29 -10 -10 -10 16 42 0 14 -8 -18 56 0 -20
5997 -20 14 -9 6 24 23 -13 -16 9 17 -5 -29 -31 -18 2 37 -8 -31 -3 20 9 33 -18 -8 -30 30 52 -12 -18 -1 22 6 17 -12
6030 -12 -20 10 23 10 -16 -24 39 43 4 -27 -18 3 27 28 -7 -14 -15 30 -2 -18 -35 18 14 27 0 -20 -12 48 40 -22 -2 -28 -17 -7 -13 4
6066 4 -18 -8 1 17 8 -5 -11 31 21 10 -1 16 -10 2 25 -32 -11 -7 17 7 -4 -10 -19 -27 13 14 -39 -32 -17 3 -2 -19 -40 -38 -8 10
6102 10 1 -29 -32 -5 11 -11 -21 -22 -10 8 47 19 1 -27 45 21 -25 -40 -12 46 24 -11 -31 7 22 29 14 -24 -66 -6 35 -5
6134 -5 -42 -53 9 42 1 -8 -36 -2 0 27 4 -23 -7 4 34 -12 -19 -27 10 23 8 2 -57 13 23 8 6 9 -9 -12 10 4 -4 -2 24 17 29
6171 29 -12 17 32 7 29 -46 -9 -6 -2 1 25 -14 -24 3 30 27 -3 -32 -35 15 30 20 -18 -1 -12 43 27 -7 15 6 18 12 -13 -31
6205 -31 6 -6 32 0 -47 -29 8 -5 -17 -43 -1 2 13 1 -53 -16 -6 -1 18 1 -21 27 -3 18 -19 -5 -7 29 -2 27 -8 -20
6237 -20 18 20 14 -8 -6 -23 3 19 1 4 -18 7 -2 6 0 -14 3 12 21 -9 -16 -18 32 35 7 1 -33 0 7 -15 -14 -6 -9 52 25 -9 -34 31 16
6276 16 27 -19 -11 7 24 28 -11 -4 -1 8 17 10 -1 10 20 11 7 -6 -21 1 15 14 -31 -11 -19 19 15 -5 10 -17 -1 17 18 2 -5 15 2
6313 2 0 -18 7 15 3 16 32 9 -16 -3 35 2 21 -11 4 19 37 -7 3 -23 29 9 5 -9 -14 1 21 3 -18 -26 -22 19 27 -10
6347 -10 -38 -21 10 9 -20 -47 -16 16 6 4 -13 -4 16 12 0 3 2 -8 46 23 -38 -24 11 30 21 5 14 5 9 5 0 18 19 24 27 0 -33 0
6385 0 -2 -2 -17 -6 -10 -27 -4 10 -1 -3 -5 -28 30 0 -9 -6 -29 30 26 -1 -9 7 -1 6 -23 -2 -29 7 26 32 11 -34 -13 21 32 -12 -15
6422 -15 -58 8 18 -7 -38 -30 -20 16 11 -31 -32 9 22 -3 -16 -32 7 3 7 -11 -26 -6 22 30 32 6 -19 -17 16 1 -16 -9 -4 11 5 23
6458 23 -29 -4 29 8 -35 -6 4 9 -13 5 -22 -39 -28 3 5 11 -7 -5 -3 -19 -5 9 -13 -28 19 -3 -10 -5 19 16 15 6 -38 -33 10 17
6494 17 -7 -23 0 -14 6 0 -11 -38 7 10 8 -4 -39 -8 3 -4 -6 -57 7 3 23 6 -36 -38 1 24 26 -41 -30 -14 19 3 0 -37 -2
6529 -2 27 21 -5 -22 -4 6 32 -1 -1 -2 25 33 31 -10 -13 0 -6 -29 -21 -5 5 -4 23 -39 -20 -60 -10 -4 14 -21 -11 -28 -18 -4 -15 3
6565 3 -15 17 22 13 -4 0 -12 2 16 4 -33 -1 11 30 11 5 -6 46 4 11 -20 -15 -17 34 43 -40 -4 -12 -2 10 -9 -35 -15 16 18 -35
6601 -35 -50 -7 16 22 -32 -27 -6 7 56 11 -2 -8 7 6 20 0 7 24 3 3 -9 0 -1 14 -22 -15 28 7 22 17 22 -16 -28 11 17 -15
6637 -15 -5 -14 11 -14 20 -16 -19 19 -25 18 8 1 -6 -29 7 -9 7 -15 -4 15 36 25 -16 16 44 28 23 -27 -18 -37 6 6 14 -35
6671 -35 -10 -1 15 -16 -9 -22 -12 17 20 -2 8 14 -3 -11 -6 -36 17 21 -5 -18 3 -4 12 55 8 5 -18 11 0 1 -4 -33 -7 36 22 -16
6707 -16 -7 -10 13 15 -12 -16 -12 -7 7 2 -27 -13 -13 17 -13 2 -19 -33 -10 16 -6 -18 -26 -11 -1 15 9 -15 18 21 24 -12 -27 6 9 20 37
6744 37 -6 2 12 3 10 2 -30 0 6 17 -32 -16 -17 16 9 -26 -24 -32 -11 -7 8 -6 -11 -34 4 14 -23 0 21 10 13 24 -41 16 7 39 6
6781 6 5 7 19 5 -12 15 -4 -9 6 14 -10 -11 -2 0 16 35 11 -23 -21 13 9 7 -1 16 25 9 -20 -15 -24 -2 9 9 -5 -32 16 34 22 0
6819 0 -17 14 31 28 -17 -7 22 35 2 -27 -1 3 9 7 -2 -30 16 8 32 26 -25 -6 -10 34 23 -3 -18 -7 11 -2 19 -12 -14 -18 31 8
6855 8 -30 0 -12 8 -10 -19 -24 -13 5 12 26 -12 -1 25 32 -3 19 -14 12 8 11 2 2 -7 15 23 -27 -26 -21 14 -8 1 -17 -6 1 37 14 20
6893 20 0 24 24 -3 10 -37 -15 -9 41 18 -20 -10 44 19 7 -27 3 -4 7 18 -9 -27 -7 22 17 3 -42 3 12 8 9 -22 -12 15
6927 15 37 -17 3 -2 -3 22 -25 -21 -15 12 12 9 2 -10 22 -11 10 12 -6 -2 -8 30 14 13 -3 25 24 13 -12 4 -19 4 22 -27 -18 -30 16
6964 16 3 19 0 -33 -2 -1 0 -26 -2 -5 10 24 1 -22 -5 8 3 -5 -13 -27 -3 10 30 16 -6 -8 -2 20 -9 3 -11 22 16 16 8 -9
7000 -9 -3 7 29 -24 -10 -11 -2 30 -21 -11 -1 8 -10 -34 -44 -34 -12 -16 0 -20 -28 -8 9 3 14 -12 1 8 12 16 -2 -15 11 8 2 -21 -7
7037 -7 -13 -8 -4 -10 -26 13 -3 15 -17 -17 -17 -11 -17 -11 -22 -20 -21 -1 11 5 -36 -10 -8 9 -8 -30 -18 36 -5 -31 -11 -32 -23 15 2 -23 -9 -19
7075 -19 12 -1 -8 -24 -17 30 32 -1 -6 -24 -3 30 1 -17 -3 -20 30 -21 -33 -36 2 -22 34 -19 4 -11 28 14 -21 -4 -6 12 -19
7108 -19 10 -27 14 -21 6 55 -12 -10 21 -8 3 10 -42 3 35 -3 23 6 8 -12 8 18 1 -25 -2 7 9 -12 -19 -12 10 11 -25 -43
7142 -43 -19 6 10 3 -2 -40 4 7 12 8 18 -15 31 35 -15 -17 -35 -5 1 38 -18 -15 2 29 9 1 -30 -6 -2 -7 -1 -30 -10 -9 17 7 -22 -31
7180 -31 -24 -9 11 -7 -38 -32 25 19 1 -46 -10 4 -5 7 0 -21 -7 3 8 -1 -12 3 1 9 -2 15 0 15 14 3 9 -26 20 24 -3 8
7216 8 -35 -25 15 8 -55 -2 -39 0 28 11 12 -6 -19 3 -1 7 -2 -4 46 22 -3 -15 -7 5 14 11 -22 -12 13 17 -16 -28 0 -6 10 17 10
7253 10 -34 -24 0 19 8 6 -5 -37 12 13 -32 -16 -22 7 12 9 6 -13 -3 26 -1 2 -12 13 0 -12 -32 -5 -9 39 -14 -26 -41 11
7287 11 26 27 -10 -56 -27 3 27 -12 -4 -22 32 10 19 19 10 -49 6 32 -27 -18 16 41 6 -18 -38 -17 19 46 5 -28 24 27 30 -21
7321 -21 -26 4 26 5 16 22 12 9 49 24 12 -24 -2 5 34 13 6 -2 11 26 4 16 -22 -16 -29 40 50 2 -29 -7 -17 -19 -9 -4 -11
7356 -11 32 33 4 -32 -19 11 -1 3 -36 -13 13 33 11 5 -36 0 9 -10 11 -20 3 -5 29 -12 -23 10 -12 12 -3 -18 -1 -17 -11
7389 -11 3 -39 -19 -27 10 -11 -17 11 -32 23 27 1 0 -1 -12 12 38 13 12 -26 16 7 -15 23 -24 26 31 26 4 -3 -10 26 15 -22 -6 -30
7425 -30 9 24 10 -1 17 9 19 -9 -29 -13 -32 -4 14 -2 -10 -21 19 21 -6 3 -5 12 -1 2 -4 -28 11 10 24 -4 -14 -33 -3 0 15
7460 15 -16 -6 18 24 7 -10 -20 12 23 -15 4 -5 -16 -9 -15 -32 -29 -4 12 -10 -24 -15 -5 -5 9 -4 1 -12 -16 26 25 8 2 -9 10 22
7496 22 -3 -25 -5 23 -3 -47 -10 -13 18 16 16 -20 -26 -10 -2 -11 4 -7 -16 13 15 5 -21 -21 -11 7 10 2 -22 -6 11 1 -9 -11 -23 -1
7532 -1 -12 6 -24 -4 3 27 -2 -9 -24 -19 19 4 -12 -28 -5 9 19 -29 -18 -4 -14 -5 -14 -31 -4 -16 14 -12 -6 -41 14 16 9 16 -7
7567 -7 -8 -10 15 1 3 3 31 14 26 -6 15 -8 22 26 3 5 27 33 8 11 5 13 5 0 -16 -4 8 -25 27 -8 -4 -13 -25 -2 36 -4 5 4 -3
7606 -3 13 -20 -21 -5 -8 15 4 2 -23 20 29 20 5 15 -1 4 1 -19 -2 -28 0 22 2 -10 7 -1 6 1 -16 -20 8 9 -3 1 -8 -1 2 8 -23
7645 -23 -26 -19 -17 -1 7 3 -13 -35 13 13 9 6 -4 14 11 -18 -24 -21 -29 5 12 -8 6 -38 16 9 -22 -17 -43 -26 -6 -7 9 -9 0 17 -20 5 10
7684 10 -14 0 3 -29 -8 -4 22 44 12 -18 -15 28 15 -1 8 -16 14 12 1 14 -15 17 25 -9 24 -15 -12 13 13 -16 -10 -6 6 -2 -2 -4 -2
7721 -2 -20 -4 0 6 -34 -1 -13 23 -3 -16 -19 11 16 -7 -10 -31 -16 4 14 -15 -3 -9 20 9 3 -27 11 2 7 28 -12 0 0 -16 18 -16
7757 -16 -21 -23 2 -3 -2 -20 -34 -17 -16 8 20 -2 -45 21 13 8 -1 -8 15 14 5 -18 4 -11 24 13 3 -18 0 14 -5 -14 4 1 -16 18 -1
7794 -1 -27 -2 2 17 5 -28 12 -10 -17 16 1 -33 -15 -1 -7 -10 18 -13 2 5 5 -9 -40 -6 43 16 9 4 -11 -12 9 -19 -14 -22 -8 22
7830 22 4 -11 -12 -8 -40 6 -8 8 18 6 6 21 -7 -4 -21 -3 1 -5 -6 21 22 3 -3 -5 6 12 0 -8 9 25 1 35 -1 -17 -24 2 23
7867 23 10 13 5 27 15 7 21 -18 5 11 8 3 -17 -16 14 0 -7 -5 -2 8 8 -7 5 -9 -17 12 25 9 -31 -18 -4 -13 4 -2 -22 9 41
7904 41 -12 -14 3 -46 7 12 -24 3 16 -8 9 4 -8 -18 -6 11 -6 -7 -4 -5 11 28 -14 -33 -11 -15 -30 -17 -13 -20 1 3 6 10 -22 6
7940 6 -7 15 -4 -26 8 15 22 -12 -16 24 -9 0 16 -3 -3 4 20 34 0 -28 2 18 39 19 -11 5 -19 -2 16 -32 -7 -14 14 -8
7974 -8 -23 -10 -7 -20 -14 4 -9 -27 9 -1 -18 -4 -27 -27 20 -18 -18 -6 -8 6 20 24 20 -4 13 -12 -15 -13 -11 17 4 7 3 -18 25 6 33
8011 33 -14 -10 -8 7 3 -20 6 -7 -12 1 0 -5 26 11 5 -5 -14 -25 -19 16 1 -27 -13 -22 8 -6 3 20 -15 -22 -6 1 -19 13 9 -1 -11
8048 -11 -15 -15 -3 34 20 22 -19 -33 -14 -17 7 4 -29 18 -12 -9 -29 24 -22 38 12 -9 -1 16 -19 3 17 -6 -2 16 -30 16 16 -23 -10
8083 -10 2 15 -9 15 23 12 16 -3 -25 -26 16 -19 -16 5 -9 10 -9 14 -6 13 2 32 -4 18 -25 -6 -4 8 12 -8 9 -8 8
8116 8 12 12 15 4 10 28 -26 -5 -4 -2 0 10 9 -19 20 4 13 -3 -16 -14 -13 -9 -6 8 -11 -2 14 -18 -35 16 -9 -10 0 13 -11 -15 1 -8 -35
8155 -35 -14 18 -10 -2 10 -9 -29 -17 -2 5 -4 -20 10 -9 14 4 -42 9 22 -2 -18 7 -23 -2 -2 7 0 -4 -7 -11 20 -12 5 -9 -12
8190a2o
8191a8
##END NTUPLES=NMR FID
##END=
