##TITLE=1H_IG-G392
 200.13MHz, CDCl3,
 8 sc
 
 28.10.2025
##JCAMPDX= 6.0         $$ Bruker NMR JCAMP-DX V2.0
##DATA TYPE= NMR FID
##DATA CLASS= NTUPLES
##ORIGIN= UXNMR, Bruker Analytische Messtechnik GmbH
##OWNER= pz
$$ XWIN-NMR		Version 3.5
$$ Tue Oct 28 14:06:05 2025 Russian Standard Time (UT+4h)  she@DPX200
##.OBSERVE FREQUENCY= 200.1313
##.OBSERVE NUCLEUS= ^1H
##.DELAY= (6, 6)
##.ACQUISITION MODE= SIMULTANEOUS
##.ACQUISITION SCHEME= undefined
##.AVERAGES= 8
##.DIGITISER RES= 18
##SPECTROMETER/DATA SYSTEM= spect
##.PULSE SEQUENCE= zg30
##.SOLVENT NAME= CDCl3
##.SHIFT REFERENCE= (INTERNAL, CDCl3, 0, 14.3821)
##AUDIT TRAIL= $$ (NUMBER, WHEN, WHO, WHERE, WHAT)
$$ ##TITLE= Audit trail, XWIN-NMR		Version 3.5
$$ ##JCAMPDX= 5.01
$$ ##ORIGIN= Bruker BioSpin GmbH
$$ ##OWNER= she
$$ F:/spectra/data/she/nmr/H-C/1/audita.txt
$$ ##AUDIT TRAIL=  $$ (NUMBER, WHEN, WHO, WHERE, WHAT)
(   1,<2025-10-28 14:04:12.39 +0400>,<she>,<DPX200>,
      <created by zg, POWCHK disabled, PULCHK disabled
       configuration hash MD5:
       00 E9 B6 7A A2 85 ED C7 34 08 36 98 17 FE 4E 26
       data hash MD5: 16K
       42 1F DF CA 0B F8 04 BF 49 54 82 95 87 88 6F 80>)
$$ ##END=
$$ 
$$ hash MD5
$$ 4C 59 A0 AE BE E1 20 08 32 61 80 C6 C1 67 CC 49
##$RELAX= 
##$RELAX= 
##$RELAX= 
##$RELAX= 
##$RELAX= 
##$RELAX= 
$$ Bruker specific parameters
$$ --------------------------
##$DU= <F:/spectra>
##$EXPNO= 1
##$NAME= <H-C>
##$PROCNO= 1
##$TYPE= <nmr>
##$USER= <she>
##$AMP= (0..31)
100 100 100 100 100 100 100 100 100 100 100 100 100 100 100 100 100 100 
100 100 100 100 100 100 100 100 100 100 100 100 100 100 
##$AQSEQ= 0
##$AQ_mod= 1
##$AUNM= <au_zg>
##$AUTOPOS= <>
##$BF1= 200.13
##$BF2= 200.13
##$BF3= 200.13
##$BF4= 200.13
##$BF5= 200.13
##$BF6= 200.13
##$BF7= 200.13
##$BF8= 200.13
##$BYTORDA= 1
##$CFDGTYP= 0
##$CFRGTYP= 5
##$CHEMSTR= <none>
##$CNST= (0..31)
1 1 145 1 1 1 1 1 1 1 1 1 1 1 1 1 1 1 1 1 1 1 1 1 1 1 1 1 1 1 1 1 
##$CPDPRG= <>
##$CPDPRG1= <>
##$CPDPRG2= <>
##$CPDPRG3= <>
##$CPDPRG4= <mlev>
##$CPDPRG5= <mlev>
##$CPDPRG6= <mlev>
##$CPDPRG7= <mlev>
##$CPDPRG8= <mlev>
##$CPDPRGB= <>
##$CPDPRGT= <>
##$D= (0..31)
0 0.7 0 0 0 0 0 0 0 0 0 0.03 0 0 0 0 0 0 0 0 0 0 0 0 0 0 0 0 0 0 0 0 
##$DATE= 1761645851
##$DBL= (0..7)
120 120 120 120 120 120 120 120 
##$DBP= (0..7)
150 150 150 150 150 150 150 150 
##$DBP07= 0
##$DBPNAM0= <>
##$DBPNAM1= <>
##$DBPNAM2= <>
##$DBPNAM3= <>
##$DBPNAM4= <>
##$DBPNAM5= <>
##$DBPNAM6= <>
##$DBPNAM7= <>
##$DBPOAL= (0..7)
0.5 0.5 0.5 0.5 0.5 0.5 0.5 0.5 
##$DBPOFFS= (0..7)
0 0 0 0 0 0 0 0 
##$DE= 6
##$DECBNUC= <off>
##$DECIM= 32
##$DECNUC= <off>
##$DECSTAT= 4
##$DIGMOD= 1
##$DIGTYP= 9
##$DL= (0..7)
0 120 120 120 120 120 120 120 
##$DP= (0..7)
150 150 150 150 150 150 150 150 
##$DP07= 0
##$DPNAME0= <>
##$DPNAME1= <>
##$DPNAME2= <>
##$DPNAME3= <>
##$DPNAME4= <>
##$DPNAME5= <>
##$DPNAME6= <>
##$DPNAME7= <>
##$DPOAL= (0..7)
0.5 0.5 0.5 0.5 0.5 0.5 0.5 0.5 
##$DPOFFS= (0..7)
0 0 0 0 0 0 0 0 
##$DQDMODE= 0
##$DR= 18
##$DS= 0
##$DSLIST= <SSSSSSSSSSSSSSS>
$$ [...]
##$SUBNAM0= <"">
##$SUBNAM1= <"">
##$SUBNAM2= <"">
##$SUBNAM3= <"">
##$SUBNAM4= <"">
##$SUBNAM5= <"">
##$SUBNAM6= <"">
##$SUBNAM7= <"">
##$SUBNAM8= <"">
##$SUBNAM9= <"">
##$SW= 18.0517328524113
##$SWIBOX= (0..15)
0 0 2 0 0 0 0 0 0 0 0 0 0 0 0 0 
##$SW_h= 3612.71676300578
##$TD= 16384
##$TD0= 1
##$TE= 0
##$TE2= 300
##$TE3= 300
##$TEG= 300
##$TL= (0..7)
0 120 120 120 120 120 120 120 
##$TP= (0..7)
150 150 150 150 150 150 150 150 
##$TP07= 0
##$TPNAME0= <>
##$TPNAME1= <>
##$TPNAME2= <>
##$TPNAME3= <>
##$TPNAME4= <>
##$TPNAME5= <>
##$TPNAME6= <>
##$TPNAME7= <>
##$TPOAL= (0..7)
0.5 0.5 0.5 0.5 0.5 0.5 0.5 0.5 
##$TPOFFS= (0..7)
0 0 0 0 0 0 0 0 
##$TUNHIN= 0
##$TUNHOUT= 0
##$TUNXOUT= 0
##$USERA1= <user>
##$USERA2= <user>
##$USERA3= <user>
##$USERA4= <user>
##$USERA5= <user>
##$V9= 5
##$VALIST= <valist>
##$VCLIST= <CCCCCCCCCCCCCCC>
##$VD= 0
##$VDLIST= <DDDDDDDDDDDDDDD>
##$VPLIST= <PPPPPPPPPPPPPPP>
##$VTLIST= <TTTTTTTTTTTTTTT>
##$WBST= 1024
##$WBSW= 4
##$XGAIN= (0..3)
0 0 0 0 
##$XL= 0
##$YL= 0
##$YMAX_a= 11201
##$YMIN_a= -15355
##$ZGOPTNS= <>
##$ZL1= 120
##$ZL2= 120
##$ZL3= 120
##$ZL4= 120
##$ABSF1= 10
##$ABSF2= 0
##$ABSG= 5
##$ABSL= 3
##$ALPHA= 0
##$AQORDER= 0
##$ASSFAC= 0
##$ASSFACI= 0
##$ASSFACX= 0
##$ASSWID= 0
##$AUNMP= <proc_1d>
##$AZFE= 0.1
##$AZFW= 0.1
##$BCFW= 1
##$BC_mod= 2
##$BYTORDP= 1
##$COROFFS= 0
##$CY= -3
##$DATMOD= 1
##$DC= 2
##$DFILT= <>
##$DTYPP= 0
##$F1P= 0
##$F2P= 0
##$FCOR= 0.5
##$FTSIZE= 0
##$FT_mod= 4
##$GAMMA= 1
##$GB= 0.15
##$INTBC= 1
##$INTSCL= 1
##$ISEN= 128
##$LB= 0.25
##$LEV0= 0
##$LPBIN= 0
##$MAXI= 10000
##$MC2= 0
##$MEAN= 0
##$ME_mod= 0
##$MI= 1.114404
##$NCOEF= 0
##$NC_proc= 0
##$NLEV= 6
##$NOISF1= 3.799351
##$NOISF2= 2.8
##$NSP= 1
##$NTH_PI= 0
##$NZP= 0
##$OFFSET= 14.38212
##$PC= 1
##$PHC0= -2629.35
##$PHC1= 7.59236
##$PH_mod= 1
##$PKNL= yes
##$PPARMOD= 0
##$PSCAL= 0
##$PSIGN= 0
##$REVERSE= no
##$SF= 200.129724274929
##$SI= 16384
##$SIGF1= 3
##$SIGF2= 2
##$SINO= 400
##$SIOLD= 16384
##$SREGLST= <1H.CDCl3>
##$SSB= 0
##$STSI= 0
##$STSR= 0
##$SW_p= 3205.1282051282
##$SYMM= 0
##$S_DEV= 0
##$TDeff= 0
##$TDoff= 0
##$TI= <>
##$TILT= no
##$TM1= 0
##$TM2= 0
##$TOPLEV= 0
##$USERP1= <user>
##$USERP2= <user>
##$USERP3= <user>
##$USERP4= <user>
##$USERP5= <user>
##$WDW= 1
##$XDIM= 8192
##$YMAX_p= 0
##$YMIN_p= 0
$$ End of Bruker specific parameters
$$ ---------------------------------
##NTUPLES= NMR FID
##VAR_NAME=  TIME,          FID/REAL,        FID/IMAG
##SYMBOL=    X,             R,               I
##VAR_TYPE=  INDEPENDENT,   DEPENDENT,       DEPENDENT
##VAR_FORM=  AFFN,          ASDF,            ASDF
##VAR_DIM=   8192,          8192,            8192
##UNITS=     SECONDS,       ARBITRARY UNITS, ARBITRARY UNITS
##FACTOR=    0.0002768,     1,               1
##FIRST=     0,             0,               0
##LAST=      2.2672688,     0,               0
##MIN=       0,             -15355,          0
##MAX=       2.2672688,     11201,           0
$$ Real data points
##PAGE= N=1
##DATA TABLE= (X++(R..R)), XYDATA
0@%%%%%%%%%%%%%%%%%%%%%%%%%%%%%%%%JkNj0J2j3J4j4J4j5J7j8J9k3K8l0L1l2
$$ 0 0 0 0 0 0 0 0 0 0 0 0 0 0 0 0 0 0 0 0 0 0 0 0 0 0 0 0 0 0 0 0 0 1 -1 4 -6 6 -7 7 -7 7 -8 9 -9 10 -13 15 -15 16 -16
50a6L7m3M5n0N8o2O7p5Q5r8J12j28J49j78K15k72L69n52J007l883o999J3156Q257
$$ -16 21 -22 23 -27 31 -31 36 -39 46 -52 60 -68 81 -97 118 -154 215 -337 670 -3213 -10212 2944 11201
73A1201k875N99J808p366p698p64P75K448N172O09m915k594K49o51J552J851J51
$$ 11201 8326 8925 10733 3367 -4331 -5095 -4320 -1872 3300 3909 -1006 -3600 -3351 -4002 -2450 -599 -448
90d48n9r56k610J287N984K894j866j731j806k321L92K643L398L045j183o129n569
$$ -448 -507 -1463 -4073 -2786 3198 6092 4226 2495 689 -1632 -1240 1403 4801 7846 6663 534 -5035
107e035j599o76J243K252J48k42J782N94J690O394M279l062n293k127k616r23
$$ -5035 -6634 -7310 -6067 -3815 -3667 -3909 -2127 -1533 157 6551 10830 7768 2475 348 -2268 -3191
123c191L141K987k73o95k664m592p30M288K644j201j44p33k251j20K496K260K281
$$ -3191 -50 2937 2664 1969 -695 -5287 -6017 -1729 915 -286 -430 -1163 -3414 -3534 -1038 1222 3503
140C503K04l299k740J724L720K523J448l01l350n122m150j358J682K863M75j330
$$ 3503 3707 408 -2332 -608 3112 5635 7083 6782 3432 -1690 -5840 -7198 -5516 -2653 -2178 -3508
156c508m12J474K387K502K322J075j450m001l183J063L221K450M12j174k901k843
$$ -3508 -3920 -2446 -59 2443 4765 5840 4390 389 -2794 -1731 1490 3940 4352 3178 277 -2566
172b566j280O7J814K942M30l374j944P89J464J456J551L85j352j672k60J367M223
$$ -2566 -3846 -3779 -1965 977 1407 -1967 -3911 -3122 -1658 -202 1349 1734 382 -1290 -1550 -183 4040
189D040L982l52l846l444k741j606p35J709J419k71j665p88J283L635K857M74
$$ 4040 8022 7670 3824 380 -2361 -3967 -4702 -2993 -1574 -1845 -3510 -4298 -3015 620 3477 3951
205C951j726j361j564j220J289L586K398n51l067k926j013M01J353N83J38p64
$$ 3951 2225 864 -700 -1920 -631 2955 5353 4802 1735 -1191 -2204 -1803 -450 133 271 -493
221d93k198k305Q04L518K330l11j384j000l34Q23K556K457J757p01l434l805r21
$$ -493 -2691 -4996 -4192 -674 1656 1345 -39 -1039 -1373 -550 2006 4463 6220 5519 2085 -1720 -2641
238b641J370Q98k62o70p41j806m36J680K746K368O1k396k056K50J759J503J701
$$ -2641 -1271 -373 -635 -1305 -2046 -3852 -4288 -2608 138 2506 2567 171 -1885 -1635 124 1627 3328
255C328J132j204l028k078K12J703J732j55k120k279p50r5P52K095K273o67k261
$$ 3328 4460 3256 228 -1850 -1638 65 1797 1642 -478 -2757 -3507 -3602 -2850 -755 1518 851 -1410
272a410j235J201K610K277R54n99j600j999j187j93J646K034j367k640j828n4
$$ -1410 -2645 -1444 1166 3443 4397 3798 2198 199 -988 -1181 465 2499 1132 -1508 -3336 -3390
288c390M87J360J681P97o95j642j368O71K888K622N19j113j053j272j017Q16J382
$$ -3390 -2903 -1543 138 935 240 -1402 -2770 -2099 789 3411 3930 2817 1764 492 -525 291 1673
305A673N28j054k723k239l02J779J922Q35R0n78j372j271J248K826J807k27j235
$$ 1673 2201 1147 -1576 -3815 -4117 -2338 -416 419 509 -69 -1441 -2712 -1464 1362 3169 2942 1707
322A707j476o28Q47J154N75K92j029l056k101K96K048J392K34m16j385r90J3J573
$$ 1707 231 -397 450 1604 2179 2471 1442 -1614 -3715 -3419 -1371 21 255 -161 -1546 -2536 -2523 -950
340i50J922K153K42k023j304M92J149M32j06k31j872k418j161M87K075K068N55
$$ -950 972 3125 3367 1344 40 532 1681 2113 2007 1776 -96 -2514 -3675 -3188 -1113 955 1510
357A510j875r62n28L82O04J791J040k92j591q53O46J688J665J33j503j829j506
$$ 1510 -365 -1327 -1855 -1473 -869 922 1962 1670 79 -774 -128 1560 3225 3358 1855 26 -1480
374a480j149K03J696J528o86j935j301J6Q88K164J565P78j11q13j006K75J505
$$ -1480 -2629 -2426 -730 798 112 -1823 -3124 -3108 -2220 -56 1509 2287 2176 1363 357 632 2137
391B137Q97j090k115j458r46L28J232J813R01m87j913k045J48J155J419K73Q6
$$ 2137 3034 1944 -171 -1629 -2575 -2247 -1015 798 1699 1212 -701 -2746 -2598 -1443 -24 249 335
408C35j45l62j12J170J844N27l99j889k085l43Q04M44N00K44q58k074j411O45
$$ 335 190 -172 -284 886 2730 3257 2858 969 -1116 -1459 -655 -211 289 533 -325 -2399 -3810 -3165
426c165J701K126O03j8n40O8K47N88N33K68j088k294j762P44J524J262Q41k10
$$ -3165 -1464 662 1265 1247 707 775 1022 1610 2143 2411 1323 -971 -2733 -1989 -465 797 1638 1428
444A428j043j455j484k5J302J214K2n95n12N34J372R61J214J59j161j719j328
$$ 1428 385 -1070 -2554 -2579 -1277 -63 -41 -636 -1148 -614 758 1719 2933 3092 1931 212 -1116
461a116J93J472Q14l33j160j577r51l57O70J523J409K80n91n38M93J197N52l10
$$ -1116 -923 549 1363 1030 -130 -1707 -2658 -3015 -2345 -822 587 867 276 -262 231 1428 1980 1670
479A670o30r31j072p96Q14J701J259k29j117j509p86k09J80R51M82r5p93n07J025
$$ 1670 1040 109 -963 -1759 -945 756 2015 1786 669 -840 -1626 -1835 -1655 -704 -222 -317 -1110 -1617 -592
498e92J488J230J70m64q54q98j85O46P37K21o39j800j512n30R89J103M99R13j76
$$ -592 896 2126 2296 1832 978 80 -105 541 1278 1499 860 -940 -2452 -2982 -1993 -890 -391 522 346
517C46m72m93R51Q54N87l36j331r79pP12P40J102M47m75j868j462j65O25N26K76
$$ 346 -126 -619 332 1186 1773 1437 106 -873 -880 -168 572 1674 2121 1646 -222 -1684 -1849 -1224 -698 -422
537d22j44o25J79k6O03J376R68l01r13n36j1P96O37J14n16j000j289j243l8J221
$$ -422 -566 -1191 -1012 -1038 -435 941 1909 1608 695 159 148 944 1581 1695 1179 179 -1110 -2353 -2391 -1170
557a170Q18M98l47r5o0K45L24O40J28n63r98o12P37R90J096M09n24r04j141q18
$$ -1170 -352 146 -201 -296 -356 -111 213 853 981 418 -580 -1192 -455 535 1631 2040 1516 612 -529 -1347
577a347o5R92J89j21q64l30r5J056R03L01L61p1p25l46Q26R95J08r0j110j087
$$ -1347 -1412 -420 -231 -352 -1216 -1546 -1641 -585 318 619 980 909 184 -162 664 1659 1767 1677 567 -520
597e20p52j62L17O04P05q5o62o30L46J011L24Q0l35m73l39p9P00J343N92k5j184
$$ -520 -1272 -1434 -1117 -513 192 107 -555 -1185 -839 172 496 576 241 -232 -571 -650 50 1393 1985 1960 776
618G76q68m59K02O4K10k9m51p86m28L82J010R29J43j41n34n8M10L27R42O0n04
$$ 776 -92 -551 -349 -285 -75 -104 -555 -1341 -1769 -1387 -377 552 695 554 20 -38 372 699 1641 1701 1197
639A197j167p71l70M87N31J10j61j10m03l43o1J046N11l38m14m80J51K95J224
$$ 1197 30 -741 -1111 -624 -93 17 -144 -254 -657 -1000 -1061 -15 496 158 -256 -736 -585 -290 934
658I34O93r3m20p65r64K47N16M78n40k87o43m41q7O22N72N50j3n55k74L49P39
$$ 934 1627 1534 1114 349 -615 -368 148 626 86 -201 -844 -1285 -1372 -750 -178 372 359 -196 -470 -121 618
679F18N71J73n1n91p08n82J57P30K07k8o61o96J24N9K70K88M11m64n22k62N52
$$ 618 1189 1362 1311 720 12 -570 -413 317 524 496 -165 -861 -737 -678 -408 -120 291 -173 -695 -957 -405
700d05J046M81Q8j16o00l56l01M0N43L14n14r00k74o1L23N74J96j36q1j72k41
$$ -405 641 1122 1210 1094 494 138 -163 -123 420 734 220 -680 -954 -1015 -692 -118 78 -58 -139 -311 -552
721e52K81N08J050J1n90o50j50J09J08N70j57j74q44m74K22L13M80J60m57k68
$$ -552 -271 237 1287 1298 708 58 -92 17 125 695 538 364 -480 -954 -732 -419 61 221 -236 -504
741e04j58j38O32N02Q72l57l83m85j89O12p9J71k04l85m48l18j7Q46L25n6o14
$$ -504 -662 -800 -168 334 1206 849 466 -19 -208 404 325 496 292 -93 -541 -859 -876 -30 295 239 -375
762c75l32Q0K1O41N46J11k21l12k31K95M54J87k77k71l05m47m13L70L11J25N6
$$ -375 -707 -627 -606 35 581 692 471 159 -72 223 677 864 587 316 11 -436 -849 -479 -168 -43 13
783A3m46l52j2N37L22K90L75j81m69r2K39J34L28j46l95n30Mj58M25K06J7j56
$$ 13 -433 -785 -797 -260 62 352 727 546 77 -15 224 358 686 540 145 -385 -381 -539 -114 92 109 -47
805d7o65j29K29K99K12M51j70r7j24J35J84K96M63m19n41l32l67P1L64L80j22
$$ -47 -712 -841 -612 -313 -101 350 180 83 -41 94 278 574 1037 618 77 -255 -622 -551 -187 193 71
826G1k08m58l02K15L98O34k0j17j62j51K01lM95J96m13n25J36k65L67k1K11j68
$$ 71 -137 -595 -897 -682 -284 350 330 213 51 -100 101 98 593 789 376 -149 -13 -278 89 68 279 111
848A11k57o28q0L34K16M38L02m17j50J36K48M29M9J87l22p93j55N8K45L31j47
$$ 111 -146 -774 -854 -520 -304 134 436 19 -131 5 253 682 731 918 596 -197 -352 -294 -49 282 135
869A35l33k99k51L05J5N37K85j7m89j32M0J36O23j54n3n7l33j99M04J99J73q4
$$ 135 -198 -497 -748 -443 -428 109 394 377 -112 -244 -204 -68 555 401 348 291 -42 -241 163 362 535 451
891D51l62n67k1k41J60L72L02p2LQJ98N6L87j36k48k36k32l7K46J29L43l53m18
$$ 451 89 -478 -499 -740 -580 -208 94 22 25 33 231 287 674 538 290 54 -178 -215 31 160 503 150 -268
914b68m12PJ14M20L02j29p4m3j40L40J31J25j7k91Oj52K01J61K22l7m04l80k29
$$ -268 -680 -673 -559 -139 163 34 -40 -83 -223 117 248 373 356 65 71 -81 120 281 503 466 62 -318 -547
937e47p3J95L3M69k20K41k14R5o7P31j37l30N1k67j35K86K86j15j9m13l62J14
$$ -547 -620 -425 -392 77 -143 98 -116 -21 -88 643 506 176 227 -40 -175 111 397 282 263 -150 -512 -398
959c98Q8L39QO7k18l32L06o7N4K57J91l76J65M4J01K6R8J07k20k29l41j18n2K35
$$ -398 -310 29 37 104 -114 -446 -140 -207 -153 104 295 -81 84 128 229 255 353 460 240 11 -330 -448 -500 -265
983b65J44J71k89j42j24M91M15p0J17k19k44Qq1L95r1J55l95k38j86m0L51k7L70
$$ -265 -121 50 -239 -381 -505 -14 401 331 448 229 -15 -7 -88 307 216 371 -24 -262 -448 -488 -137 -164 206
1006B06k20k39k59P8K67L77j09K32l94L01k69J67L73J19k10k14l54j41j58R1M59
$$ 206 -14 -253 -512 -434 -167 210 101 333 -61 240 -29 138 511 630 420 206 -148 -289 -447 -356 103
1027A03p1k08j06j84K55J57J18K2J67k22r4M8K68Q4R3j14k83l24q9K35J07J01
$$ 103 32 -176 -282 -466 -211 -54 64 86 253 31 -63 -15 253 337 430 316 33 -291 -380 -145 -38 63
1049F3j5K7l04m46L41J82J44Q8k51N7m9J41J79J68J06j17k70j04q9J3jL21m0k29
$$ 63 48 75 -229 -675 -334 -152 -8 80 -171 -114 -163 -22 157 325 431 314 44 -60 -149 -136 -137 184 144 -85
1073h5m4k43N5K55K29j34j13k10J56K14K03Q8j02k0n82qM9J96K72m2l21p4oj21
$$ -85 -129 -372 -317 -62 167 33 -80 -290 -134 80 283 371 269 249 -333 -341 -292 -96 176 134 -187 -261 -267 -388
1097c88K47L3Q0J02k59N7L7J59K30J87k61o3j99l6L6P4J75l9k51j60j04K85J28
$$ -388 -141 -108 -28 74 -185 -128 -91 68 298 485 224 161 -38 -74 -38 36 211 172 -79 -239 -343 -58 70
1120G0pj77O2j34j57L66J33K1Q1N0l62k79L22J04J24o6k76l77K34m7K65J7K13
$$ 70 63 -114 -52 -186 -343 23 156 177 258 308 -54 -333 -11 93 217 151 -125 -502 -268 -315 -50 -33 180
1143A80l15o6J6K39k3J28J97j28N6j20j62J1J55nj9j33l23l4J03j2J62K36o5k36
$$ 180 -135 -201 -185 54 31 159 356 228 284 164 2 13 168 163 144 11 -312 -346 -243 -255 -93 143 78 -158
1167a58o9K12m9K07J28k86l1L5q0K41J74l47J44j4k53q6J8J10J12j88K69j17j29
$$ -158 -227 -15 -64 143 271 -15 -46 -11 -91 150 324 -23 121 107 -146 -232 -214 -104 8 -180 89 -28 -157
1190a57J96k21M10L2l8j16j17N6p7J36j5K46m13j45K8R2K25m3p3n9o6k6P3K90
$$ -157 39 -182 228 260 222 106 -11 45 -32 104 89 335 -78 -223 -195 -103 122 79 6 -53 -119 -145 -72 218
1214B18m5K44k93J17l26R3L05M6k76j75P0k46J10J71J63N1j64l08J0q3L22K06
$$ 218 173 417 124 241 -85 8 313 359 83 -92 -22 -268 -158 13 176 227 63 -245 -235 -318 4 210
1236B10M2k20N0j0p1J67j3j4M3k11k06J81o6k5K19p8j03J5j41n0K46J90J02j64
$$ 210 252 32 82 72 1 168 155 141 184 -27 -233 -52 -118 -143 76 -2 -105 -90 -231 -281 -35 155 257 93
1260I3N6k36L01o6M2Q5k68J74n94K23j5L87k98L3p3o3j4J97k6J73j10M8J31m45
$$ 93 149 -87 214 148 190 275 7 181 -413 -190 -205 182 -116 -83 -156 -219 -233 -36 -62 111 1 49 180 -265
1284b65M11j9Rj4n8J8p7rM6Nj9j77lL1j58K84K2j6q1J71p5j07J04l2j36L30m0
$$ -265 146 127 136 122 64 82 5 -4 42 47 28 -149 -152 -121 -279 5 27 11 -70 101 26 -81 23 -9 -145 185 145
1311A45j55k5l1j93K96J30k59k5j18m8N4K51J26p3m1q7j15J36J74P9k07k4O1r
$$ 145 -10 -35 -66 -259 37 167 -92 -117 -235 -283 -229 22 148 75 34 -53 -168 -32 142 221 14 -10 51 42
1335D2M8J4Q3k42j10J41j79rK28j42M28l04k55K87p6r7J18O1j40O0N2n2O1j42
$$ 42 90 104 187 -55 -165 -24 -203 -212 16 -126 302 -2 -257 30 -46 -143 -25 36 -104 -44 8 -44 17 -125
1359a25K02J16k44nj00K5J37k11J24L6m8j1P2J85p4P5j47K14j88j17K5R7r9k00
$$ -125 77 193 -51 -56 -156 -131 6 -205 -81 -45 -93 -104 -32 153 79 154 7 221 33 -84 -59 38 -61 -261
1383b61J26j47O6K07K72k17J92k70J56k38J64K0q5K6J22j86K05R5k46L3pJ80l02
$$ -261 -135 -282 -216 -9 263 46 238 -32 124 -114 50 70 -15 11 133 -53 152 247 1 34 27 207 -95
1406i5j08P3J4K29L5k39j24K66j56J45j48M41l24k05J15m9P4q2J29j94J54j74
$$ -95 -203 -130 -116 113 148 -91 -215 51 -105 40 -108 333 9 -196 -81 -130 -56 -138 -9 -203 -49 -223
1428b23K5K23j40J00l7J14j17J41j15N0N4l28K17j13K49j72J64n2m4j9Q3j70q4
$$ -223 -198 25 -115 -15 -52 62 -55 86 -29 21 75 -253 -36 -149 100 -72 92 40 -4 -23 60 -110 -194
1451a94J87q1L5O2J61j98j88K95k59K53O8k17J70j04Q7P3m1k66J11l3J27j68O
$$ -194 -7 -88 -53 9 170 -28 -216 79 -180 73 141 -76 94 -10 77 150 109 -157 -46 -79 48 -120 -114
1474a14L11l58K28O7o7m9m3J52j08J08k20K40k23J97M3k00O9L0k88J05O4J02n9
$$ -114 197 -161 67 134 67 18 -25 127 19 127 -93 147 -76 121 164 -36 33 63 -225 -120 -56 46 -13
1497a3r2Q4j83J28K17J3r8J31m6j74N8J3J94l45K10k20J8m0K39p4K38m59J27J25
$$ -13 -105 -21 -204 -76 141 154 56 187 141 -33 25 38 232 -113 97 -123 -105 -145 94 20 258 -201 -74 51
1521E1o6l7j03J47K8n0j31L72k48K17r2R7k10j8Q9P8k01L1n3K29k77o2m8K81L5
$$ 51 -15 -52 -155 -8 20 -30 -161 211 -37 180 88 185 -25 -43 46 124 -77 -46 -99 130 -147 -209 -257 24 59
1546E9ln3K10j07J5j32N2Nk15J86j08K09p4J18j10o5j9N9k58L41m12J83J37j01
$$ 59 56 3 213 106 121 -11 41 46 -169 17 -91 118 44 162 52 -13 -32 27 -231 110 -302 -119 18 -83
1570h3oJ38m8K62k20L1R7j56o9o8J43k26L59j05J1j79NL0N3n5J80k18n3Q7J72
$$ -83 -89 49 1 263 43 74 171 15 -54 -122 21 -205 154 49 60 -119 -114 -84 -31 -86 94 -124 -177 -90 82
1595H2P6r0p7O4l1o7O7J08n0j0J76k51p2J82k35J05n2j4j33J47J17N0r0J08LP3
$$ 82 158 68 -9 55 24 -43 24 132 82 72 248 -3 -75 107 -128 -23 -75 -89 -222 -75 42 92 2 110 113 186
1621A86k6j42q1J66L1j81N4o3J26j72K49j17n7m0P1O8q1K27l27LL91j30j73j10
$$ 186 160 18 -63 103 134 -47 7 -56 70 -102 147 30 -27 -67 4 72 -9 218 -109 -106 285 155 -18 -128
1645a28M8O0q3J18Q5n8k33K17J69j40J9j34J04k45J42L03k92K83j25K6j03K6j98
$$ -128 -80 -20 -103 15 100 42 -191 26 195 55 74 -60 44 -201 -59 244 -48 235 110 136 33 59 -139
1668a39K46j92q8K17J0j3j60K78k39J17j02L5j23K13O5k00J58j80Q4j08K93l02
$$ -139 107 -85 -173 44 54 41 -119 159 -80 37 -65 -30 -153 60 125 -75 83 -97 -13 -121 172 -130
1690a30K29j60j27K1J12K51r7j44j16Q6J10J05j89j31K78l05J03k7M4k9K8K57
$$ -130 99 -61 -188 -167 -55 196 99 -45 -161 -75 35 140 -49 -180 98 -207 -104 -131 -87 -116 -88 169
1712A69k01K19j12J7l8R0k3P9j4j15J1k00K58j13j09Q5Q2q9r1J48K0j17Q0q3R8
$$ 169 -32 187 75 92 54 144 121 200 186 71 82 -118 140 27 -82 3 85 -4 -95 53 73 -44 36 -47 51
1737E1%n8kJ01j66J3k2J05r1L1O4j10P1L2m2j20J07Q2q6k58J45J74j98N7J62j57
$$ 51 51 -7 -9 92 -74 -61 -83 22 -69 -38 26 -84 -13 19 -23 -143 -36 46 -40 -298 -153 21 -177 -120 42 -115
1763a15l3qK44J1j00j19M2q4J49j2j41J38J50k52p4K39P6l61L07P1k39K3k6J22
$$ -115 -148 -156 88 99 -1 -120 -78 -162 -13 -25 -166 -28 122 -130 -204 35 111 -250 57 128 -111 -88 -114 8
1787HJ27k9N0Pk24j04R4J20m3j3K42k62J67j32K2n1j71K39j24K06j14m6j3K1j50
$$ 8 135 106 156 163 -61 -165 -71 49 6 -7 235 -27 140 8 30 -21 -192 47 -77 129 15 -31 -44 -23 -173
1812a73R9l9J20J5j56K41j96J62r1o1M4q4K64oj41qk1L9q2k8R7j13N9R8J37m05
$$ -173 -74 -113 7 22 -134 107 -89 73 -18 -79 -35 -119 145 139 -2 -10 -31 8 -74 -102 -5 -118 -59 39 176 -229
1838b29L82k35J34j18J17k64K62k51K74k5R1k68QJ27j92K23k1j38KK15j64J12
$$ -229 153 -82 52 -66 51 -213 49 -202 72 47 138 -130 -122 5 -187 36 15 -123 -121 94 -70 42
1860D2j45K09n7P0l24J10mJ43m1j3j54L52j6k34J9Q4n4l7J0n5P8J81k30M7K7J3
$$ 42 -103 106 49 119 -205 -95 -99 44 3 -10 -164 188 172 -62 -43 41 -13 -50 -40 -95 -17 164 -66 -19 8 21
1886B1o3j86K29m1O7J58j70j19J91j35l9O9J01p4j83M1K9J14L3n5N2j20JJ07k22
$$ 21 -42 -228 1 -40 27 185 15 -104 87 -48 -87 -18 83 9 -174 -133 -104 10 43 -12 40 -80 -79 28 -194
1911a94M00l7j07j03M3k1J19J11r4O0j45j58J69mL8p0K12l14J14j80K43r1Q9J09
$$ -194 206 169 62 -41 2 -19 100 211 117 177 32 -126 43 39 77 7 219 -95 19 -161 82 -9 80 189
1935A89j40J52j82n0j30K13q9R0j66J35O5m6o2j00K86k07J96l19J51r9K0L6k21
$$ 189 49 201 19 -31 -161 52 -37 53 -113 22 87 41 -21 -121 165 -42 154 -165 -14 -113 -93 -57 -278
1958b78J95J46R1m57M53R6k81j6K2P2N5j54J91pQ4k81J66j5k60J94k62J40J62
$$ -278 -83 63 154 -303 150 246 -35 -51 -29 43 98 -56 135 128 212 -69 97 82 -178 16 -246 -106 56
1981E6k40J46p2j32K71o4J52L4k88J76jL4L5j36OK6qn9jK6j69J74j63M19k06J00
$$ 56 -184 -38 -110 -242 29 -35 117 151 -137 39 38 72 107 -29 -23 3 -5 -64 -65 -39 -208 -34 -197 222 16 116
2007A16J2j27j63M7P1q6J30J1P9k28J12L29m15J6J93l2j20o2K94j31j41K30j64
$$ 116 128 1 -162 -115 -44 -130 0 11 90 -138 -26 303 -112 -96 97 65 -55 -117 177 46 -95 135 -29
2030b9J0j03J89j96J80J40j01pj81K0J58j22j33K73q9K01j00p1Q0mj87q0J37n0
$$ -29 -19 -122 67 -129 51 191 90 83 -98 -78 80 -42 -175 98 9 210 110 39 119 115 -72 -152 -15 -65
2054f5K4J65q9k80K94o6j44M1J65m5j6M2j86l4L43j40n5L4r5M88l38j80J21K6
$$ -65 -41 124 35 -245 49 -17 -161 -120 45 0 -16 26 -160 -194 149 9 -46 -12 -107 381 43 -137 -16 10
2078A0J85j96J1M5Q1j96m3p1K54p3m4J16j88K72Q0k55j04J25j74J88L25m73qj
$$ 10 195 -1 10 55 136 -60 -103 -174 80 7 -37 79 -109 163 243 -12 -116 9 -165 23 348 -125 -133 -134
2102a34K01J07k40J20J7j1J32m02J77J95k52J53R3k66J39k44J90J12j33J41j8
$$ -134 67 174 -66 54 71 60 192 -210 -33 162 -90 63 156 -110 29 -215 -25 87 -46 95 77
2123G7j74p2J73rJ34j77M6n0m9k0j4M1Q8R5j96m1J46j93K70J7q6k27J00J64k53
$$ 77 -97 -169 4 -5 129 -48 -2 -52 -101 -121 -135 -94 -6 89 -107 -148 -2 -195 75 92 6 -221 -121 43 -210
2148b10J85QO0r8K0J14j85q8K36r0N7Q6q6o4J30p8M4J38j77J72q6k6k1N2k50J57
$$ -210 -25 -17 43 -55 -35 79 -106 -194 42 -48 9 95 9 -55 75 -3 41 179 2 174 88 62 41 93 -157 0
2174@j75J74j56m4L38J9k21M8J46k37K00K0l7j28K42j92o0mq6K41j24J53r4j0
$$ 0 -175 -1 -157 -201 137 156 -65 -17 129 -108 92 112 75 -53 189 -3 -63 -67 -153 88 -36 117 23 13
2198A3N4r3j8j42L16J9n9l78M57K9j32Q5o8q0o3J72l65L37k01J75n2N2Jj83K23
$$ 13 67 -26 -44 -186 130 149 90 -288 169 198 66 151 83 3 -60 112 -253 84 -117 58 6 58 59 -124 99
2223I9k03J7J74o4j45M6MK37n0j73m7J81rk3k5o2J8N2N6L9j29J68j60j48K23O9
$$ 99 -104 -87 87 23 -122 -76 -72 165 115 -58 -105 76 67 44 19 -43 -25 27 83 122 -7 161 1 -147 76 145
2249A45k64J29J06%q3j45QK8K03j56J47j38k5J79j5O6j18k5O9k58j3L47k93J15
$$ 145 -119 10 116 116 33 -112 -104 -76 127 -29 118 -20 -45 134 119 185 67 42 111 -147 -160 187 -106 9
2273Im2k8l1J16k7k0L53l51PJ02l67K44N6P8J9j97J22j0j82J80r1N8J6N3k16l5
$$ 9 -33 -61 -92 24 -3 -23 330 -21 -14 88 -279 -35 21 99 118 -79 43 33 -149 31 -60 -2 14 67 -149 -184
2299a84P2J7K97l8l18J55r5O8K08j98J12r1j52O9o6L09j02J42k02r0M3J16r5K07
$$ -184 -112 -95 202 164 -154 1 -94 -26 182 -16 96 5 -147 -78 -144 165 63 205 3 -87 -44 72 -23 184
2323A84k29K73m2k97K76l30K48L9p8j7j45N3m4J0Q8r0L35j63k0N4j05K2J6j00
$$ 184 -45 228 186 -111 165 -165 83 122 44 27 -118 -65 -109 -99 -11 -101 234 71 51 105 0 22 38 -62
2347f2J35j01J18J9j96J95j67O9k97L13j1m0R8o6L4m5M0J0L6L5l49K67n9Ql5J33
$$ -62 73 -28 90 109 -87 108 -59 10 -287 26 15 -25 73 7 41 -4 36 46 82 117 -232 35 -24 -16 -51 82
2373H2L0j19O1j53j14J32J92l0oL3j87k26L87jJ2lk10P4J34j21J68j27o3o0L19
$$ 82 112 -7 54 -99 -213 -81 111 81 75 108 -79 -305 82 81 93 90 -120 -46 88 -33 135 8 -55 -115 204
2398B04k58n9K35k82L53j69J99o5k91P4j93K54k5P3j79K04J54o9k1l0j20J13j07
$$ 204 -54 -113 122 -160 193 24 223 158 -133 -59 -252 2 -23 50 -129 75 229 160 139 109 -11 102 -5
2421eJP7m2J8j73J10M5j24P5J79j49q4j66K45L9O7k58J86pJ36j12L0k26J90j51
$$ -5 -4 73 31 49 -124 -14 31 -93 -18 161 12 -72 -238 7 46 113 -145 41 34 170 58 88 -138 52 -99
2446i9J4J24q6p6J59J22j07k63K55o8J06j32J36J13j24Rl5n0j54Q5q0L3L5K20
$$ -99 -85 39 -47 -123 36 158 51 -212 43 -25 81 -51 85 198 74 83 48 -2 -156 -71 -151 -118 -83 137
2470A37k78k72L99n6Oj2J26j7m1j42J1m0K31Pj41O9R0J23l68M00k97N7N4j99J18
$$ 137 -141 -413 -14 -70 -64 -76 50 33 -8 -150 -139 -179 52 59 -82 -13 77 200 -168 232 -65 -8 46 -153 -35
2495c5j60J74n0O8o2k2K11k14OJ03j47M7J06o6J8P9j85K21P3k59J55j42P8j6P1
$$ -35 -195 -21 -71 -3 -65 -87 124 -90 -84 19 -128 -81 25 -41 -23 56 -129 92 165 -94 61 -81 -3 -19 52
2520E2o7kn3N0L9J36j72J03j55r0K37j75J89Lk86K32m11K48m7K95p9j15Q8J15
$$ 52 -15 -17 -70 -20 19 155 -17 86 -69 -159 78 -97 92 95 -191 41 -370 -122 -169 126 47 -68 20 135
2544A35j79j3m0L1J47j66n1K40l27K18j55J79J7k76J50j13K60j63JP8K56l91J42
$$ 135 -44 -57 -97 -66 81 -85 -136 104 -223 -5 -160 19 36 -240 -90 -203 57 -106 -105 -27 229 -162 -20
2567b0M9r5J07j18M7J1Ln6K20J36j5k07l2k04k5K77k69J36m1P5j44K64q3p4L8
$$ -20 29 -66 41 -77 -30 -19 -16 -72 148 284 269 62 30 -174 -199 78 -191 -55 -96 -21 -165 99 16 -58 -20
2592b0j26M0P0Q5j64K47j83j42K36K1K0j88m1L39r1p0j46J63j29r4N20k35j34
$$ -20 -146 -106 -36 49 -115 132 -51 -193 43 64 84 -104 -145 194 103 33 -113 50 -79 -173 347 112 -22
2615b2j20K12N2l04J77L1j20j56K15J91j82p5K38p8j74K26k97O4M4J60N5L7p5
$$ -22 -142 70 122 -182 -5 26 -94 -250 -35 156 -26 -101 137 59 -115 111 -186 -122 -78 82 137 174 99
2638I9Nj86J34j28J15J32j81J4j37P2P2J1O6Qk76K6K10j21K4O2k3O0j82K12Pm7
$$ 99 104 -82 52 -76 39 171 -10 4 -133 -61 11 22 88 96 -180 -154 56 -65 -41 21 -2 58 -124 88 95 48
2664D8j00L8jL2K87m14K01j55n8P6J29j12j02o1L32j21P7Jn1o1P7j91ML77k27
$$ 48 -52 -14 -15 17 304 -110 91 -64 -122 -46 83 -29 -131 -192 140 19 96 97 46 -15 62 -129 -125 252 25
2689B5M1j33m8j0J72J09j61k0J47j27L3P8j49p2J46L6o0j69K31L6j59J08ro0j0
$$ 25 66 -67 -115 -125 47 156 -5 -25 122 -5 28 106 -43 -115 31 67 7 -162 69 105 -54 54 45 -15 -25
2714b5R6P2k60J10J1P2r8l8P8O4l5O9j74P2K61l19n9L8o5K7J21j1nJ44j52j16
$$ -25 71 143 -117 -7 4 76 -22 -60 18 82 47 116 -58 14 275 -44 -103 -65 -130 -103 18 7 2 146 -6 -122
2740a22L7J52J11m08J24K04M2n2j36J61j21j9nQ9j73K30r6J56j77j44l8J33K8
$$ -122 -85 67 178 -230 -106 98 140 88 -48 113 -8 -27 -32 57 -116 114 18 174 -3 -147 -185 -52 -24
2763b4K4L3o9P9m5M0K0j17K25j77K07k35J35k18J42M3k7l4j62J96J38j9j48P7
$$ -24 0 33 -36 43 -2 38 58 -59 166 -11 196 -39 96 -122 20 63 36 2 -160 36 174 155 7 84
2787H4j36o1k1K72k8j9ml30K35j5K19j51K9j29J26n2%M6j45p9J73J5l8N9k47L01
$$ 84 -52 -113 -134 138 110 91 87 -243 -8 -23 196 45 74 -55 71 19 19 65 -80 -159 14 29 -9 50 -197 104
2813A04j24j34j65M00k48l7J87oK8K8j33k9K0K02j91J76k52R4K81m91J92L5k3
$$ 104 -20 -154 -319 81 -167 -204 -17 -23 5 33 -100 -129 -109 93 -98 78 -174 -80 201 -290 -98 -63 -86
2836h6q6J63j31J72J06k36q2NK0K4N4J26p7R1m1l22M53p8j04L27n87K05L5K04
$$ -86 -172 -9 -140 32 138 -98 -180 -175 -155 -131 -77 49 -28 63 22 -300 153 75 -29 298 -289 -84 -49 155
2860A55j92L4n9j24L19j45M9K7j10P6n4n0J57N2O6p5k4j52Lp0K64m1qj24K01j25
$$ 155 -37 -3 -62 -186 133 -12 37 64 -46 30 -24 -74 83 135 201 126 102 -50 -47 -117 147 106 98 -26 175 50
2886E0j3q3P8j89K45j1Lk23J08l7J84P8m6j99p4kq1O2K35M0p7j23K72j72l0Q3
$$ 50 37 -46 32 -157 88 77 80 -143 -35 -72 112 190 144 -55 -129 -131 -212 -150 85 125 48 -75 197 25 -5 78
2912G8Q1j80M7j54Q1k8K90l50jJ21K31n22L18j73J89n5l6NM2k70J48J61l4J35
$$ 78 159 -21 26 -128 -47 -75 215 -135 -136 -15 216 -306 12 -161 28 -27 -63 -58 -16 -286 -138 23 -11 124
2936A24n5p6r4J41K04k83l6M2M2k7J91l3j18K6J4j19K06o6q1J06k14q4K12O8M
$$ 124 69 -7 -101 40 244 -39 -75 -33 9 -18 173 140 22 48 62 -57 149 83 2 108 -106 -190 22 90 94
2961I4J9p0k46K23J08k79J43k53K12K22l48K79l3n4m2ll0O1Jk81J83M6p0K47j05
$$ 94 113 43 -203 20 128 -151 -8 -261 -49 173 -175 104 71 17 -25 -28 -58 3 4 -277 -94 -48 -118 129 24
2986B4P1j13J10j35j9L9O9k9k7j65J66k3Q0k09J64L01l76q2K39r3j19P6J01p1
$$ 24 95 -18 92 -43 -62 -23 46 17 -10 -175 -9 -32 48 -161 3 304 -72 -154 85 -8 -127 -51 50 -21
3010b1j47J24O3k2j8L1M3q6M5J30l76L20K6l9p7O8K8l68L25o2P1K09k32k12K74
$$ -21 -168 -44 19 -3 -21 10 53 -33 12 142 -234 86 112 73 -4 64 92 -276 49 -13 58 267 35 -177 97
3035I7k04K33j57Q9j43Q4k6J30N6k70K73r0j50j74J98M9P3l1n6O7P9r5q3J16j76
$$ 97 -107 126 -31 58 -85 -1 -27 103 159 -111 162 72 -78 -252 -54 -5 68 37 -19 48 127 32 -51 65 -111
3060a11J52o0O0j74K28j76N9Q7r0Q2k68J74KM1Mj8j42J04p3L51k71L2K69m26J08
$$ -111 41 -19 41 -133 95 -81 -22 65 -25 57 -211 -37 -35 6 10 -8 -150 -46 -119 232 -39 -7 262 -164 -56
3085e6J69j4k21K75j67k13pL06k77J37R1O7J10j81N6k2J5j0r0P5Jl7L1l6j37K20
$$ -56 113 99 -122 153 -14 -227 -234 72 -205 -68 23 90 200 19 75 53 68 58 -32 43 44 7 38 2 -135 85
3111H5m0J42l6l08P3J42j11%N5j07J96k8M5Oj05Q1o2r5J65j73q4J36l8k7J25j16
$$ 85 45 187 151 -157 -84 58 -53 -53 2 -105 91 63 108 114 9 90 28 -67 98 -75 -159 -23 -61 -88 37 -79
3137g9O8j08O3M6j15k5j0J14J27j17j50J84j03P4P3K8l80J84K06q1J08k75j04
$$ -79 -11 -119 -56 -10 -125 -150 -160 -46 81 -36 -186 -2 -105 -31 42 70 -310 -126 80 -1 107 -168 -272
3160b72L35N4r2j6P0j36M6j00J69J0J65j27k00J27o1J3R2j2j42J35r0K7M7Q3j35
$$ -272 63 117 25 9 79 -57 -11 -111 58 68 233 106 -94 33 -28 -15 77 65 -77 58 -32 -5 42 125 -10
3185a0j81J49O3pq1O1J17m01L70k26K69J04l87K24K2j57R5O1j56K10j34j60J93
$$ -10 -191 -42 21 14 -67 -6 111 -290 80 -146 123 227 -160 64 86 -71 24 85 -71 139 5 -155 38
3208C8K2o1N9q7Q9Q4j03O1L7j66k13L61j86J70n6o1N9r0RN5r3J45l6J43k33pJ29
$$ 38 60 -1 58 -29 60 144 41 102 139 -27 -240 121 -65 105 49 -12 47 -43 -34 21 -72 73 37 180 -53 -60 69
3235F9kjj22J36j49n8P4m2J2OM2J05j54J69j05J67j40j06M2J30j0j04l5j90L07
$$ 69 67 66 -56 80 -69 -127 -53 -95 -83 -77 -35 70 -84 85 -20 147 7 -99 -57 73 63 -41 -76 -266 41
3260D1n1J14k2L9J7l73J96Q5j34K3K52l5l49M68k11j5p5%K6N7K2k22oP7O0n0l0
$$ 41 -10 104 82 121 138 -235 -39 46 -88 -65 187 152 -197 271 60 45 -30 -30 -4 53 75 -147 -153 -76 -16 -66 -96
3287i6L9KJ02j30J11k70K39K0j18OJ21J6n7R8R1m2l68M54P6j56k08R2J10j9k18
$$ -96 -57 -55 47 -83 28 -242 -3 17 -101 -95 26 42 -15 83 174 132 -236 218 294 138 -70 22 132 113 -105
3312a05J26r6k0qm6k3R7q2L0J36n0m4J06kJ0J86m13J29J21j29J11k38J12L1J45
$$ -105 21 -75 -95 -103 -149 -172 -75 -157 -127 9 -41 -85 21 19 29 215 -198 -69 52 -77 34 -204 -92 -61 84
3337H4k72J53L7m7P4J38J47l98K01j05k9J14m0qK08j91P7k27q5J19m7J49j21r7
$$ 84 -188 -35 2 -45 29 167 314 -84 117 12 -17 97 57 49 257 66 143 -84 -169 -50 -97 52 -69 -166
3361a66K79j47K11k34l2J77pk10J26k7L1j1r1J81k66J87K21l19J55o5J18k41K34
$$ -166 113 -34 177 -57 -89 88 81 -129 -3 -30 1 -10 -101 80 -186 1 222 -97 58 -7 111 -130 104
3384A04k55K17j30J25J32k9l47O9K76j24k0O0L2k66L00j11k6m1J93k76J76K4j61
$$ 104 -151 66 -64 61 193 164 -183 -114 162 38 18 78 110 -156 144 33 7 -34 159 -117 59 83 -78
3407g8L73k21j48q5q8K79J72j21j02KO1j12J73k79L16j63J6j26J39j29k1k3J26
$$ -78 295 74 -74 -159 -247 32 204 83 -19 -17 44 -68 105 -174 142 -21 -5 -131 8 -121 -142 -165 -39
3430c9Ln3k0Q2J8J04p7q4R4j52J37J00j88J40o6j2O0r7l1J83l7j78j24K22K29
$$ -39 -36 -89 -109 -27 -9 95 18 -66 28 -124 13 113 -75 65 -1 -13 47 -50 -81 102 65 -113 -237 -15 214
3455B14k10J15J5p6j11J72j74m5L91k17Nj53K52q3k39R4n5L27m20J96P8j69P6
$$ 214 4 119 134 58 -53 119 -55 -100 291 74 79 -74 178 95 -144 -50 -105 222 -198 -2 76 -93 -17
3478a7q9j5J15k3jQ9j23L54k94n5K01j34p6o7k4R3k5M1O9n3mj62Q2L10l07J54
$$ -17 -106 -121 -6 -29 -30 59 -64 290 -4 -59 142 8 -68 -135 -159 -66 -91 -50 19 -34 -38 -200 -118 192 -115 39
3504C9k56L37O8k99Q6M1Nj1m7K8K6O0k33K18j55J24q4n8J33m3N2j98L29%k40L2
$$ 39 -217 120 188 -111 -25 16 21 10 -37 -9 17 77 -156 62 -93 31 -53 -111 22 -21 31 -167 162 162 -78 -46
3530d6M9k0Ok53L47q6nJ08n4JP5k72J02J3o6j26L31N4o2Q5l12K88K6j51q0m4J08
$$ -46 3 -17 -11 -264 83 -3 -8 100 46 47 122 -150 -48 -35 -101 -227 104 158 96 181 -131 157 183 32 -48 -92 16
3557A6q6m1J66lj12m3J46J97k14J7J55k06K40l2j92M3p3J01J40j71Q7p0J71k57
$$ 16 -70 -111 55 52 -60 -103 43 240 26 43 198 -8 232 200 8 51 -22 79 219 48 135 65 236 -21
3581b1k2J4J46j58j04K7K05KR3mk99l4J08K43j65q0om4j03K87l1r7J60j83q9R6
$$ -21 -43 -29 117 -41 -145 -118 87 89 182 178 -121 -155 -47 196 31 -49 -55 -99 -202 85 54 -43 117 -66 -155 -59
3607e9L19l68K22nL5j04j00M5Jj11J00m3J38L0k71Q7K9Q8M5O0k6j04j03J46nM9
$$ -59 260 -108 114 109 144 40 -60 -15 -14 -125 -25 -68 70 100 -171 -84 -55 33 78 138 112 8 -95 51 46 95
3633I5K1k68J44R3J12k2k42j1L2P5k1J3j19k1M05j90j48K38k23j69J27J91k09
$$ 95 116 -152 -8 85 197 175 -67 -78 -46 29 8 21 -98 -119 286 96 -52 186 -37 -206 -79 112 -97
3656i7N9Q0m2J0j88J4J37P7n6j3Q8j9n1L0L4j90J61j16J22j0p7J21j2q3K18j05
$$ -97 -38 42 0 10 -178 -164 -27 50 -6 -19 69 50 -1 29 63 -127 34 -82 40 30 -47 74 62 -21 197 92
3682I2k85J46Rp8K60k21j79p3L58j8K74l52M9j98K84o7Jk7J82q9K6k0J07j21j16
$$ 92 -193 -47 -38 -116 144 -77 -256 -329 29 11 285 -67 -18 -216 68 1 2 -25 157 68 94 74 181 60 -56
3707e6Q5J08n0j00j55n1R7L05l90K21j60J08q9N8J2N8O6n7P4J6m9oj33j2J62j24
$$ -56 29 137 87 -13 -168 -219 -122 183 -207 14 -146 -38 -127 -69 -57 1 67 10 84 100 51 45 -88 -100 62 -62
3733f2j33J74J23rk93K19r3P3kK45k84K74l19O6q5J60J82m52M51k56J7j57K13
$$ -62 -195 -21 102 93 -200 19 -74 -1 -3 242 -42 232 -87 -21 -106 54 236 -216 235 -21 -4 -161 52
3756E2j3j11k0NK00o0p2n7Q0n1J15M1k16M8J01N4p3j43J75j39J86j25j21J24K5
$$ 52 39 -72 -92 -87 113 53 -19 -76 4 -47 68 109 -107 -59 42 96 23 -120 55 -84 102 -23 -144 -20 5
3781Em8k9K09p8j33K25j58J03J34l78J97j27J44j21J91l19J58J37j89J35K1j00
$$ 5 -43 -72 137 59 -74 151 -7 96 230 -148 49 -78 66 -55 136 -183 -25 112 -77 58 79 -21
3803b1j00l5o4K74p7J1Q4j49j71K56k8o3K31k68K16k34J14J10L1J22l18J40j72
$$ -21 -121 -156 -220 54 -23 -12 72 -77 -248 8 -20 -83 148 -120 96 -138 -24 86 117 239 -79 61 -111
3826a11m5J6K61j70N0No1J40k0k16P4K38k24L1N6J7J07j51m2R7j93R4k0K94o7
$$ -111 -156 -140 121 -49 1 6 -55 85 65 -151 -77 161 -63 -32 24 41 148 -3 -45 52 -141 -47 -67 227 160
3851A60j65j47J81J28l93K41m4j3J5J1j26J70j89J17L4L7k58L21J09l54J39L3
$$ 160 -5 -152 29 157 -236 5 -39 -52 -37 -26 -152 18 -171 -54 -20 17 -241 80 189 -165 -26 7
3873Gp6J23O9k78J64J17j99K10n6M5j40k7J54J02k05M0k61J16K8p1R5J1j17K82
$$ 7 -69 54 123 -155 9 126 -73 137 81 126 -14 -41 113 215 10 50 -211 -95 -67 -138 -43 -32 -149 133
3897A33p0k51K68j71K37j66J01k4K4k63K9J34J16l44L14j45K34J0j45j35J17q3
$$ 133 63 -188 80 -91 146 -20 81 57 81 -182 -153 -19 97 -247 67 -78 156 166 21 -114 3 -80
3919h0J39j10L53m04J34k44L98k02N7J14l57J12k8J9J76j82R6P9n0o5M6r5J15
$$ -80 59 -51 302 -102 32 -212 186 -16 41 155 -202 -90 -118 -99 77 -105 -9 70 20 -45 1 -94 21
3942B1r4P6K95k46l73M11p6N8r1j02K20k66%o8K16n0n4q2L28m24O1J96R2j35K45
$$ 21 -73 3 298 52 -321 90 14 72 -19 -121 99 -167 -167 -235 -19 -69 -123 -205 123 -301 -240 -44 48 -87 158
3967A58o9m3j78R0Q6p5J97j15j16M5K7J06k03j3p9M58j97q8J00l2R4p4k42K99
$$ 158 89 46 -132 -42 44 -31 166 51 -65 -20 7 113 -90 -103 -182 276 79 -9 91 59 153 79 -163 136
3991A36j2k0n9R6k67J72K13j80k03O2M6l6J28n7RP3o6O5j47k48L34j01J35J19
$$ 136 124 104 45 141 -126 46 259 79 -124 -62 -16 -52 76 19 28 101 35 100 -47 -295 39 -62 73 192
4015A92k79M45k40O1k40j65J45K53k91J77N7j59P1J16j42L9Pk4j52j03L23m14
$$ 192 -87 358 118 179 -61 -226 -81 172 -119 58 115 -44 27 143 1 40 47 23 -129 -232 91 -323
4037c23N78k10j32J42k74J40N5q0l3J76O4j61K09O5m03O6J45K3j68M4J03O5j52
$$ -323 255 45 -87 55 -219 -79 -24 -104 -137 39 103 -58 151 216 -187 -121 24 47 -121 -77 26 91 -61
4060f1oJ26k2n3L0K5j11J99k03O9j61J11O0p0P7J8K07l12N7p2J33K58j98J3Q8
$$ -61 -67 59 37 -16 14 39 -72 127 -76 -7 -168 -57 3 -67 10 28 235 -77 -20 -92 41 299 101 114 202
4085B02l19J09j07P5O6q9J41j45q7m9P8R4J39j52pJ65q2J6j33l5K6M5j52J42M2
$$ 202 -117 -8 -115 -40 26 -63 78 -67 -154 -203 -125 -31 108 -44 -51 114 32 48 -85 -120 -94 -49 -201 -59 -17
4110a7l5R0k19J0J28r7P5J89j17j65P7J71or4Pk9j25R6J54j57O0J48j25k01J47
$$ -17 -52 38 -181 -171 -43 -140 -65 124 7 -158 -81 90 84 -10 -3 -32 -157 -61 93 -64 -4 144 19 -182 -35
4135c5j3p6K4K74k27r7L59m09K64l7J48k66K06j38O4P6j82J39pj37J2l0k3O7R8
$$ -35 -48 -124 -100 174 -53 -150 209 -200 64 27 175 -91 115 -23 41 117 -65 74 67 -70 -58 -88 -111 -44 54
4160E4q2n6l6J86K7j50J46q0o3J71n5q8J5K8r8N6k7m9R6J15q3K0l72L43J0j26
$$ 54 -28 -84 -120 66 93 -57 89 9 -54 117 62 -26 -11 17 -81 -25 -52 -101 -5 110 27 47 -325 18 28 -98
4186i8p7L8K07k4P0l8n9q7p1K24j66J88k11j27K49j06P5k09K35J43r5j8J00j35
$$ -98 -175 -137 70 46 116 78 19 -68 -139 85 -81 107 -104 -231 18 -88 -13 -222 13 156 61 43 143 8
4210HJ3N2k1j23J7K05n0k85K91j47j35J17O8o1N7q0L2o9k2K42o0n5J08j70J16
$$ 8 21 73 52 -71 -54 151 101 -184 107 -40 -175 -58 10 -51 6 -74 -42 -111 -133 109 49 -6 102 -68 48
4235D8K0n6J18Ok94J92j2n0Qj4q8J69J95k55Q3k20R5j55K63Pj33L5L30j97l1M0
$$ 48 68 12 130 136 -158 34 22 -28 -20 -34 -122 47 242 -13 70 -150 -55 -210 53 60 -73 -38 292 95 64 104
4261A04k34K03n8K16O9m16j29J96%R5j77J27j80P3J56k9JRL9o8L0K31k95K8O2
$$ 104 -130 73 15 231 300 -116 -245 -49 -49 46 -131 -4 -184 -111 45 16 17 26 65 -3 27 258 -37 -9 53
4286E3m2k24L26Q7m5k37J18j85L64l03o2M08j50o0R3j38R4q7J02l7J38k86J87
$$ 53 11 -213 113 200 155 -82 36 -149 215 -88 -150 258 108 48 141 3 97 10 112 75 213 -73 114
4309A14j99J16k6O7k3j28O5j89L94k78M8K06l47J8O8P7L0O8j77J41J44j91PN2
$$ 114 -85 31 5 72 49 -79 -14 -203 191 -87 -39 167 -180 -162 -94 -17 13 81 -96 45 189 -2 5 57
4333E7n3QJ06j79o9J6K73k35J46j40K7lJ37l19L00M7r3kk60K53N0J44J22k75j33
$$ 57 4 12 118 -61 -130 -114 159 -76 70 -70 -43 -46 91 -228 72 119 26 24 -236 17 67 211 333 58 -75
4358g5J78j51Kk5o8O5r8K16Rk66L15J5L3j64J08R3j53k13L45k53J71j1K6n5k28
$$ -75 103 -48 -46 -71 -139 -74 -172 44 53 -213 102 117 150 -14 94 187 34 -179 166 -87 84 73 99 44 -184
4383a84K05J12k54m4L21o1k23J24Q8j52JO9M1R0k98l7J66l0rJ67K49l41P7k10
$$ -184 21 133 -121 -165 156 95 -128 -4 84 -68 -67 2 43 133 -165 -202 -36 -66 -75 92 341 0 77 -133
4407a33L64k89K78j23j57K29j32Om9M7J41%o4j46PJ17j84k9LJ46r6J74j31K8r8
$$ -133 231 -58 220 97 -60 169 37 43 -6 41 182 182 118 -28 -21 96 -88 -117 -114 32 -64 110 -21 7 -91
4432i1Q9R8PJ2Q2l05J76n1j83K24m0k00J41J1j2J4K9P0j7J4p3j90M51k14j05J
$$ -91 -2 96 103 115 197 -108 68 17 -166 58 18 -182 -41 -30 -42 -28 1 71 54 68 -5 -195 256 42 -63 -62
4458f2J6K3j40j09M27K5j68R1p2Knr6m3J0N2%J51j30j78J71J44j78J74J1lM1Q1
$$ -62 -46 -23 -163 -272 155 180 12 103 31 33 28 -68 -111 -101 -49 -49 102 -28 -206 -35 109 -69 105 116 113 154 235
4485B35k23l4j22O3J61K27j87j17k0j6N8j31M9K32j55K5%j32J51L04k33q9K0m1
$$ 235 12 -22 -144 -81 80 307 120 3 -17 -33 25 -106 -57 175 20 45 45 -87 64 368 135 46 66 25
4509B5M7j22k6J95j40M4R8k5l6r6o2K79k02j4J40P7l00J20j2r9O7m0O0L7K33l22
$$ 25 72 -50 -76 119 -21 23 121 96 60 -36 -98 181 -21 -35 105 182 -118 2 -10 -109 -42 -82 -22 15 248 -74
4535g4K0p7J60K23l08O8M9J40j7l8k36L24j47n9j18J23r9j11J14J75O4j54j53
$$ -74 -54 -131 29 252 -56 12 61 201 184 146 -90 234 87 28 -90 33 -66 -177 -63 112 176 22 -131
4558a31pR0K08m77K45J43r8n7L7J87k21N6j96K26k91J35J75j64L97m04J47L53
$$ -131 -138 -48 160 -317 -72 71 -27 -84 -47 140 -81 -25 -221 5 -286 -151 24 -140 257 -147 0 353
4580C53j67J07k15k24L04l2k6j06k8J24j27L13j08k08l0Q8L2l5j68P4O8j23K01
$$ 353 186 293 78 -146 158 126 100 -6 -34 90 -37 276 168 -40 -70 18 50 15 -153 -79 -11 -134 67
4603F7m4L8K9j70p4R7J34J5j91R3K4j1l9j26M13l32J09nR1j82l3J3K59k83J28
$$ 67 23 61 90 -80 -154 -57 77 92 -99 -6 18 7 -32 -158 255 -77 32 27 118 -64 -97 -84 175 -108 20
4628B0P0m8k86K75o0l39N11k41jK66l88J52K94q1k20N2m8J68k32j0Q2o0K37j03
$$ 20 90 42 -244 31 -29 -368 143 -98 -99 167 -221 -69 225 144 -76 -24 -72 96 -136 -146 -64 -124 113 10
4652A0M8l09J92P6jp1Q6j58K59m8j26J99k12l9O7k1l1N3o2J00o7J04m2m7J26j46
$$ 10 58 -251 -59 17 16 -55 31 -127 132 84 -42 157 -55 -94 -27 -48 -79 -26 -88 12 -55 49 7 -40 86 -60
4678f0n3L21l32J42k6m9k5j1K00J0j5m0k28J94l55K44Q0j12J73nj77K20j59j43
$$ -60 -113 208 -124 18 -8 -57 -82 -93 107 117 102 62 -166 28 -327 -83 -3 -115 58 53 -124 96 -63 -206
4702b06K9L52k80R7J65n5k14J56l5k70K24J4J59k8L2O4l54J8jL23k9o2j44L7q1
$$ -206 -177 175 -105 -8 157 102 -112 44 9 -261 -37 -23 136 108 140 204 -150 -132 -133 190 161 99 -45 -8 -89
4727h9L01k93K11j29Q2q3k36K42l1J5p4J72j32O8L5lj58J07k4K8p0R3m4J69Qj66
$$ -89 212 -81 130 1 83 0 -236 6 -25 -10 -84 88 -44 24 59 56 -102 5 -19 9 -61 32 -12 157 165 -1
4753aL6K7k05j7R0p2J78Q6k88J97o5R5j94J94k7j19J52k5p3M1j03qM4p5K06j80
$$ -1 35 62 -143 -160 -70 -142 36 122 -166 31 -34 61 -133 61 34 -85 67 42 -31 10 -93 -101 -57 -132 74 -106
4779a06k2N9K74k04j28l1K82p8k93K87j3j15J4K66j40q0m5j1J84j49J27n1L1J02
$$ -106 -128 -69 205 1 -127 -158 124 46 -247 40 27 -88 -74 192 52 -28 -73 -84 100 -49 78 27 58 160
4803A60j51j17L42k80p7K07q6ol7Q4j07L5J8j53K73j21Lj20L51J13k77Nn5j62
$$ 160 9 -108 234 -46 -123 84 -2 -8 -45 39 -68 -33 -15 -168 105 -16 -13 -133 218 331 54 59 4 -158
4827a58j07K05O6k3L9j43K24k2j46j64L59k41J50j89Q2JN8k07J94q3K99o3l77
$$ -158 -265 -60 6 -17 22 -121 103 81 -65 -229 130 -111 39 -150 -68 -67 -9 -216 -22 -105 194 131 -246
4850b46J78Q6J02k87R8J96k54K18K6r7K1J93k3m30K17J18j67J6lj37K75l22O1
$$ -246 -68 18 120 -167 -69 127 -127 91 117 20 41 234 211 -219 -2 116 -51 -35 -38 -175 100 -222 -161
4873a61k6L58n3l54K18m7p1J25J98l37L02j49k03K09j7k38Q5OK76j86J84o7q2
$$ -161 -187 171 118 -236 -18 -65 -136 -11 187 -150 152 3 -200 9 -8 -246 -161 -155 121 -65 119 52 -30
4896c0j0J90j80J16Jk36J22J8j21K61K3j78J49j67p4K20k10J07j0OJ12j28K3K3
$$ -30 -40 150 -30 86 87 -149 -27 -9 -130 131 154 -24 125 -42 -116 104 -106 1 -9 -3 109 -19 4 27
4920B7k1l5J54k30J35MJ0j11J48K01k09j58o0J29n0K01j12o7P7lJ1j26R5M3Jj38
$$ 27 6 -29 125 -105 30 34 44 -67 81 282 73 -85 -145 -16 -66 135 23 -44 33 30 41 -85 10 53 54 -84
4946h4j67L34j33O0n1j79J45p9J99m1J05k92N4J92k61L8J41pJ98Qj93n6J0J7K3
$$ -84 -251 83 -50 10 -41 -220 -75 -154 45 4 109 -183 -129 63 -198 -160 -19 -26 172 180 -13 -69 -59 -42 -19
4971a9n0Q2Oj26J63j86J90l5l9Q1j64R2m2K5j17J97k53Q4J10L9j46K30j46k6Q6
$$ -19 -69 13 19 -107 56 -130 60 25 -14 67 -97 -5 -47 -22 -139 58 -195 -111 -1 38 -108 122 -24 -50 36
4996C6O7N2k72J91J12j59o4J74j4k26J75j52K2p5P5J08J59j64m1J1k2k3O9J9J65
$$ 36 103 155 -117 74 186 27 -37 137 123 -103 72 -80 -58 -133 -58 50 209 45 4 15 -7 -30 39 58 223
5021B23l21J45k16K67k45L54j94j67K38m7J30k15j16L61k66O2j0k47L96k37M21
$$ 223 -98 47 -169 98 -147 207 13 -154 84 37 167 -48 -164 197 -69 -7 -17 -264 132 -105 316
5042C16l05J4P0j47lO6j59K02l1L8l6%m2q7k0K6K55k05q9K38Qj48M2L1rj31L03
$$ 316 11 25 95 -52 -55 11 -148 54 23 61 25 25 -17 -104 -124 -98 157 -48 -137 101 109 -39 3 34 25 -106 197
5069A97j67j76J0J80j76P2p2ML8r4O1K5M2p4P3J80j47R1j92P9K8k8J70j65N1k82
$$ 197 30 -146 -136 44 -132 -60 -132 -128 -90 -184 -123 -98 -56 -130 -57 123 -24 67 -125 -46 -18 -46 124 -41 10 -272
5095b72K68K7L0K3O6j28J10j13J48j77N3M2J%r8r9Q4K0K2K07j86j02n9O1N6j27
$$ -272 -4 23 53 76 142 14 124 11 159 -18 35 77 78 78 -20 -119 -35 -15 7 214 28 -74 -133 -72 -16 -143
5121a43J06j06J30k09J74J43r7q0kQ5P0j61J76k03O8J69jj42N1j30J39J6R5M1
$$ -143 -37 -143 -13 -222 -48 95 -2 -82 -84 1 71 -90 86 -117 -49 120 119 -23 28 -102 37 53 148 189
5145A89j78j1j81L5J95o8L7J66k5J6j5j45Ln9K19j38j85L05l46L49j58J41p2r
$$ 189 11 0 -181 -146 49 -19 18 184 159 175 160 15 18 -41 178 40 -145 160 -186 163 5 146 74 65
5169F5j31k5M5J48J18j36j5o3J1q6km7R5p1K68k27k8J09k12K28j07M3r9J14J07
$$ 65 -66 -91 -46 102 220 84 69 6 17 -69 -71 -118 -23 -94 174 -53 -81 28 -184 44 -63 -20 -119 -5 102
5194A02p8n2J10j36N8J73Rl72K73n1m3j12J62n2j29P2Mm9o4K89j95K47j82O6N6
$$ 102 24 -28 82 -54 4 177 186 -186 87 36 -7 -119 43 -9 -138 -66 -62 -111 -175 114 -81 166 -16 50 106
5219A06j42O0J5k6K1N8n2mj9k4j46N4j8j11J80J33Pj72N3L8Rq7R2n9P1Q6o5J31
$$ 106 -36 24 39 13 34 92 40 36 17 -7 -153 -99 -117 -228 -48 85 92 -80 -27 11 20 -67 25 -34 37 123 58 189
5247A89l70J21J3j72K88p2l0J11j36n2R0J70o1n8J85k02L1j05L1J74k85J00J1
$$ 189 -181 -60 -47 -219 69 -3 -33 78 -58 -110 -20 150 89 31 216 14 45 -60 -29 145 -140 -40 -29
5270b9J09l4k44L18k1Q5l79K68Nj31O3J25q1R0j03k6K06l6k07J23j05J5Q6n7p4
$$ -29 80 46 -198 120 99 184 -195 73 78 -53 10 135 54 144 41 15 221 185 -22 101 -4 11 97 40 -34
5295c4J34j15K4P8Q4r7k31N6Q9j62J48L1Q1%k02K19j22J30j03N2l9k41J44J49
$$ -34 100 -15 9 87 171 74 -157 -101 -12 -174 -26 5 86 86 -116 103 -19 111 8 60 21 -220 -76 73
5319G3M3M3J1N3l94L29l33L48j3l05M6Q5K7l4M0J04j36q8J27qK1J69k26J15j20
$$ 73 116 159 170 223 -171 158 -175 173 160 -145 -99 -14 13 -21 19 123 -13 -101 26 18 39 208 -18 97 -23
5344b3J8J25j23j58J00j3J72k21J68N0j66q4K50l07J65L5J28p7j7J91r8j55J63
$$ -23 -5 120 -3 -161 -61 -74 98 -123 45 95 -71 -155 95 -212 -47 -12 116 39 22 213 115 -40 123
5367A23j0k61K28k1l9P2l2Oq9j78L04k44K43J31j70lk47l6J97o7R6L8l22L00n9
$$ 123 113 -148 80 59 20 92 60 66 -23 -201 103 -141 102 233 63 60 -187 -223 -26 -93 3 41 -281 19 -40
5392d0J47O2j81j05K2J00j96K69Rk22PN6J92k2j15p3p9J72J8jj75l7J93j38J11
$$ -40 107 169 -12 -117 -95 5 -191 78 87 -135 -128 -72 120 98 -17 -90 -169 3 21 20 -155 -192 1 -137 -26
5417b6j1NK44k51mN0l5o1J5n1K62l63J99n9K24l00J09K0J40o7J7l9k09j9K32J27
$$ -26 -37 -32 212 -39 -43 7 -28 -89 -74 -125 137 -226 -27 -86 138 -162 -53 -33 107 40 57 18 -191 -210 22 149
5443A49n1j63J11j27M5K8k2N7p8L5p2j8K19j24J21k46L32l15R1N0J59j53n1O6
$$ 149 98 -65 46 -81 -36 -8 -30 27 -51 -16 -88 -106 113 -11 110 -136 196 -119 -28 22 181 28 -23 43
5467D3j25j06J59K97k45m8N7N1j05m5Q1j63J86m3P4o1l5L7m0k1K4J47r5j36K07
$$ 43 -82 -188 -29 268 23 -25 32 83 -22 -67 14 -149 37 -6 68 7 -28 9 -31 -52 -28 119 24 -112 95
5492I5j80P6Mj09N0J3n6K08j35m8P1J42R0j21J39q4mk74mJ38q9k3J00o2k8rL2
$$ 95 -85 -9 -5 -114 -64 -51 -107 101 -34 -82 -11 131 221 100 239 155 151 -123 -127 11 -78 -101 -1 -63 -91 -100 -68
5519f8J7J29q2M7j21J38j73n0J64m0k17K05mM8n0L0J61l16K33n0j36K09k74K51
$$ -68 -51 78 -4 43 -78 60 -113 -163 1 -39 -256 -51 -55 -7 -57 -27 134 -182 51 1 -135 74 -200 51
5543E1l16K17jJ61k12q2K87j54k4k4R8j24R6K8m5Q4r4M9P2M4k83J83n0j15J82
$$ 51 -265 -48 -49 112 -100 -182 105 -49 -73 -97 1 -123 -27 1 -44 40 -54 -5 67 111 -172 11 -39 -154 28
5568B8j82J50LM2j09K77l23jN7J88K9l93K38P6P4l37J64J14j46j2j65L05k13l4
$$ 28 -154 -4 -1 41 -68 209 -114 -115 -58 130 159 -234 4 80 154 -183 -19 95 -51 -63 -228 77 -136 -170
5592a70K88r0P4l2k3j49K74j78l2J43k0m7K1l97L58J22k0l69K63q1N0j47K67j70
$$ -170 118 28 102 70 47 -102 172 -6 -38 105 85 38 59 -338 20 142 122 -247 16 -65 -15 -162 105 -65
5616f5L5J00l6p9j64Q2O2k5K52j62m4J30k67J02r2K82kj64K6J43Jj33J39p6q3
$$ -65 -30 70 34 -45 -209 -127 -65 -90 162 0 -44 86 -181 -79 -171 111 109 -55 -29 114 115 -18 121 45 -38
5641c8r8K82N3po4l98K71n5J12k65K09J1j79K47j60J96k06L8J20R9k97K78j41
$$ -38 -136 146 199 192 128 -270 1 -54 58 -207 2 13 -166 81 -79 117 -89 -51 69 168 -129 149 8
5664Hm1Q2l1k1P3K6j21j18K92k80L9k8J56m4m3j22K69k35J88j38L5k3J83pj3r8
$$ 8 -33 49 18 -3 70 96 -25 -143 149 -131 -92 -120 36 -8 -51 -173 96 -139 49 -89 -54 -77 106 99 86 -12
5690a2j62J09J80m3j57n3r5L26j40j15J55M4L4j76J80Q4k0j60J10j34Q9oJ07j24
$$ -12 -174 -65 115 72 -85 -138 -233 93 -47 -162 -7 37 71 -105 75 159 139 -21 89 -45 44 38 145 21
5714B1n4N4j63M8L37p4j00qj57K39k27J46o2R5j53K45j72M1k25rJ37j9l5J15j27
$$ 21 -33 21 -142 -94 243 169 69 61 -96 143 -84 62 0 95 -58 187 15 56 -169 -178 -41 -60 -95 20 -107
5739a07J09kP0r6K01k68j00O9N9J80n5p9J74j12J32j44k31J47K55j68p4N6J08
$$ -107 2 0 70 -26 175 -93 -193 -124 -65 115 60 -19 155 43 175 31 -200 -53 202 34 -40 16 124
5762A24j69R5J7j04N9K2K28k40l0K7N7K8k22J33q3k9k9J61L5p9J24nj09J02j81
$$ 124 -45 50 67 -37 22 44 272 32 2 29 86 114 -108 25 -58 -87 -116 45 80 1 125 120 11 113 -68
5787f8L0O%J02j10J34j82j81K17k5J4R8L0J58l04N1J1l4PJ43k28J46pJ25k79J4
$$ -68 -38 -32 -32 70 -40 94 -88 -269 -52 -77 -63 35 65 223 -81 -30 -19 -53 -46 97 -131 15 8 133 -146 -132
5813a32K93j98Q3n9Q1j9Q5m2q5j18P7j07P0J09J50j37o0J42k16L0J3k1m1Q3J07
$$ -132 161 -37 46 -13 68 49 134 92 7 -111 -34 -141 -71 38 188 51 -9 133 -83 -53 -40 -61 -102 -19 88
5838H8j36K68j67j89J55l4J19RJ40l26J22j43j3N4J24K8o0Oj77K27j67J18j40
$$ 88 -48 220 53 -136 19 -15 104 113 253 -73 49 -94 -107 -53 71 99 39 45 -132 95 -72 46 -94
5861i4P1j47N8R3J44j25j02j16K36J43j56P6K8kj30n8J7M6J53N1j73j85P8Q4R2
$$ -94 -23 -170 -112 -19 125 0 -102 -218 18 161 5 81 109 107 -23 -81 -64 -18 135 186 13 -172 -94 -10 82
5886H2M0n1j31J5J07pj12K4M6k8j66L20j9j15Om4p9K7J20j50k7J87m4j8j74L25
$$ 82 122 71 -60 -45 62 55 -57 -33 13 -15 -181 139 120 5 11 -33 -112 -85 35 -115 -142 45 1 -17 -191 134
5912A34l80M20Kl81J95j31J26j87L05j11J98j26j52J01j08K51j44J07j37Mm7m2
$$ 134 -246 174 176 -205 -10 -141 -15 -202 103 -8 190 64 -88 13 -95 156 12 119 -18 -14 -61 -103
5934a03p9Q1N3Rj32L52Qj17oJ11j10j28j7J8K48k46r0L13J67k12L2k18j99L85
$$ -103 -182 -101 -48 -39 -171 181 189 72 66 177 67 -61 -78 -60 188 -58 -148 165 332 120 152 -66 -265 120
5958A20j63O1q2Q1lj26j03K95L4m3K1Q2j89j33K06j00j7k2O6j64L71j46O1J11
$$ 120 -43 18 -64 17 14 -112 -215 80 114 71 92 174 -15 -148 58 -42 -59 -81 -15 -179 192 46 107 218
5982B18k78Jj32J51K45q5j42oQ1J92j34j48Q2l8J20k75K29k18j06J93M3k0J8P9
$$ 218 -60 -59 -191 -40 205 120 -22 -28 53 245 111 -37 45 7 127 -148 81 -137 -243 -50 -7 -27 -9 70
6006G0K01l11o1K48q7m8O4M3q3j87K94k11J31p3l1j1j16R4K14l31J89J15j32l7
$$ 70 271 -40 -101 147 60 12 76 119 36 -151 143 -68 63 -10 -41 -52 -168 -74 140 -191 -2 113 -19 -56
6030e6l2l7L71j80k74K07j21J87l5P7l20L13j87M7Mj44R6J59J49l17J44L0J1j95
$$ -56 -88 -125 246 66 -208 -1 -122 65 30 107 -213 100 -87 -40 -36 -180 -84 75 224 -93 51 81 92 -103
6054a03J28pR1Om4L9J78l23k5K52k71m2Q4K3k14J2K24k51K69O6j37K0P6j90K40
$$ -103 25 18 109 115 71 110 288 -35 -60 192 -79 -121 -37 -14 -228 -216 8 -243 26 92 -45 -25 51 -139 101
6079A01j02l16K45l1j0M3%J45j10J08J93j41k3k69J68m0NRJ10k23J2K13j41p6
$$ 101 -1 -317 -72 -103 -113 -70 -70 75 -35 73 266 125 102 -167 1 -39 -34 -25 85 -138 -126 87 -54 -130
6103a30K87k79L14Jk66j36P2o9K11M6n7n5J30k5J34k34J39l7l9J82j11l3m2r2
$$ -130 157 -122 192 193 -73 -209 -137 -206 5 51 -6 -61 69 44 178 -56 83 46 7 189 78 45 3 -89
6127h9L4P2J3l9K8o7o5J05j13JK57j76J65q4J0l7J20m0j34J48o2q9j20K79o7J26
$$ -89 -55 17 30 -9 19 -48 -113 -8 -121 -120 137 -39 126 42 52 15 135 95 -39 109 47 -42 -162 117 50 176
6153A76q8o9J86k47L7L9o8P2J05j36j39J29j48J82Q1j65j03K48K3o4k47K28L6
$$ 176 88 19 205 -42 -5 34 -34 38 143 7 -132 -3 -151 31 112 -53 -156 92 115 51 -196 32 68
6176F8K6M2o2K8j36J55k35J48J67l6j52p1K03k00r8J32M4j64o8K56KJ48k8j08
$$ 68 94 136 74 102 -34 121 -114 34 201 165 13 -58 145 -55 -153 -21 23 -141 -209 47 49 197 169 61
6200F1j11m0J67j69K22j62J38k85L13k4m2P8j18N9j35l0K21j90J3J50j71KJ01
$$ 61 -50 -90 77 -92 130 -32 106 -179 134 110 68 146 28 87 -48 -78 143 -47 -34 116 -55 -53 48
6223D8L7l11M91k47kL4N7q6n1J95k51J89j91J8N1NK9l5L7Rl8j47J75K6j00NJ14
$$ 48 85 -226 265 18 16 50 107 21 -30 165 -86 103 -88 -70 -19 -14 15 -20 17 26 -12 -159 16 42 -58 -53 61
6250F1L8k6j27N2O6m3Q8l2O1j85J16O6j90JJ0K29k8k76%l0J66k08J76K7r9J87
$$ 61 99 73 -54 -2 64 21 109 77 138 -47 69 135 -55 -54 -44 185 157 -119 -119 -149 17 -191 -15 12 -87 100
6276A00q3N5j50rP1J10K2q7k2m1J43k16L0pL7K6J2j6O8P6r3j47pK94k93L22j31
$$ 100 17 72 -78 -87 -16 94 116 29 7 -34 109 -107 -77 -84 -47 -21 -9 -25 43 119 26 -121 -128 166 -127 195 64
6303F4Pl4j57L06l9o8M8K9j22p1Q3J58l17J6k4l8K97pj64r2J80n3j99J22j22K21
$$ 64 71 37 -120 186 147 79 127 156 34 -37 46 204 -113 -97 -121 -159 138 131 -33 -125 55 2 -197 -75 -197 24
6329B4K76l57m7J78j26Nm9N5P3J6q6M0q0K54l6m7P2j77K14j52p6J91j61j09J90
$$ 24 300 -57 -104 74 -52 -47 -96 -41 32 48 -38 2 -78 176 140 93 165 -12 202 50 -26 165 4 -105 85
6354H5k24K31p6n6m7R8r0k1K0Q5p4n8J04P9K0j23l7NJ08p8R5R0k1%j27o4K30o0
$$ 85 -139 92 16 -40 -87 11 -79 -100 -80 5 -69 -127 -23 56 76 -47 -84 -79 29 -49 46 136 115 115 -12 -76 154 94
6382I4n1n3j00lK62r0k6J14M6k82p6J65J02q4J54j94j27m6K98j67m9K41j61j04
$$ 94 43 -10 -110 -113 149 59 33 147 193 -89 -165 0 102 18 172 -22 -149 -195 103 -64 -113 128 -33 -137
6406a37N4j00J32j53K77j51J1P2n6J46k10K27j2k55K39m7l17M36k11K3P0j89N8
$$ -137 -83 -183 -51 -204 73 -78 -67 5 -51 95 -115 112 100 -155 84 37 -280 156 -55 -32 38 -151 -93
6429i3m7J16J41l77K37J02j20N1K44j84O5O1r7j24J8j59Q0J20k5k02K29r9K45
$$ -93 -140 -24 117 -260 -23 79 -41 10 254 70 135 196 99 -25 -7 -166 -86 34 9 -193 36 -63 182
6452A82l4J01m43J07J91q9j80K38j32K4j2n9J83N7r1o1j10J70M4r1O0l75L42j25
$$ 182 148 249 -194 -87 104 15 -165 73 -59 -35 -47 -106 77 134 43 -18 -128 42 86 -5 55 -320 22 -103
6476a03n7K8O1O7Q4j17K66k00n0j20k5O2q6J09NM8R0K4j02K6j84J87q3O8o7j45
$$ -103 -160 -132 -71 -4 80 -37 229 29 -21 -141 -166 -104 -190 -81 -76 -28 62 86 -16 10 -174 13 -70 -2 -69 -214
6502b14L85j2k44J03q3Q7n0J06L4k10K77j43J2k32K75L3r7j53L4P8n2J84j95K56
$$ -214 171 159 -85 18 -65 22 -28 78 112 -98 179 36 48 -184 91 124 27 -126 -92 -14 -66 118 -77 179
6526A79j54R9q6j57O3J45j0m1oP1q2J3q7P1J7R6j34J29r4j22j13J05M0L6q2J55
$$ 179 25 124 38 -119 -56 89 79 38 32 103 21 34 -53 18 35 131 -3 126 32 -90 -203 -98 -58 -22 -104 51
6552E1Q3q8j11J09K59l37K0J42j82K1k54K87j39J43J32j83J20j72J98p3L6j13
$$ 51 134 46 -65 44 303 -34 -14 128 -54 -33 -287 0 -139 4 136 -47 73 -99 99 26 62 -51
6574e1j0P6J56o9k78J49P4q2On0j29K8J92N8j37jJ11j21J70j06N1p2k20K22J04
$$ -51 -61 15 171 102 -176 -27 47 -35 -29 -79 -208 -180 12 70 -67 -68 43 -78 92 -14 37 -35 -255 -33 71
6599G1k8NP6p5N9j13o6R7J22m0k26l7J26K2j8K4j22K06j67k0J76m5j4J39l85P3
$$ 71 43 48 124 49 108 -5 -71 26 148 108 -118 -155 -29 -7 -25 -1 -123 83 -84 -104 72 27 13 152 -233 -160
6625a60M69n04L78k00Q8k61L79j46k5m7r7J40m4J0N5j48K6J70qok06J93r1J73
$$ -160 309 -195 183 -17 71 -190 189 43 18 -29 -126 14 -30 -20 35 -113 -87 83 75 69 -137 56 -35 138
6649A38k16J41K4k04L09j41L3mJ0kp2j8J26j62j96K94j07J05k77L08m2j04r1K08
$$ 138 -78 63 87 -117 192 51 84 80 90 88 16 -2 124 -38 -234 60 -47 58 -219 89 47 -57 -148 60
6673F0P9m51P9Q8J93P4q6k06O2K10j02o7l5K73k66j54K49J92j64JJ17j82Q3n9
$$ 60 139 -312 -233 -145 48 122 36 -170 -108 102 0 -67 -102 171 -95 -249 0 192 28 29 146 -36 47 -12
6697a2J16J33k71O9k3j57J32K11k45J12j03n6J36l12L25M6r6p0Q5j67K46j04J36
$$ -12 104 237 -34 35 12 -145 -13 198 -47 65 -38 -94 42 -270 55 101 5 -65 20 -147 99 -5 131
6720A31j0j90J59n3j55K58j57K23k69oj56K75j89o4Q1K8L17j89J5n4O3k3k07J93
$$ 131 121 -69 90 37 -118 140 -17 206 -63 -69 -225 50 -139 -203 -122 -94 223 34 49 -5 58 35 -172 21
6744B1o9K7J2Ko7J87P8l88K05j57J52P8jo0q0J8oL6l8P9j52p8J5N12l40J60j4
$$ 21 -48 -21 -9 -7 -74 113 191 -197 8 -149 3 81 80 20 -60 -42 -48 -12 -50 29 -123 -201 -186 326 -14 146 132
6771A32j20q3J20O4j70k24K14J00q4o3K91l09J7K03k24L40k13k47L32j62j00J83
$$ 132 12 -71 49 113 -57 -281 -67 33 -51 -114 177 -132 -115 88 -136 204 -9 -256 76 -86 -186 -3
6793cQ9j69L8q9Q0L03k58N6j39K43j06j1K6j53k2L33r7j25K4Q6k64K86l86M15
$$ -3 86 -83 -45 -134 -54 249 -9 47 -92 151 45 34 60 -93 -115 218 121 -4 20 106 -158 128 -258 157
6817A57R2k87O0J5j32K39k13P3j51K91l15K16k30L25j14j98L6K49k2P3j93J16
$$ 157 249 -38 22 37 -95 144 -69 4 -147 144 -171 45 -185 140 26 -172 -136 113 91 164 -29 87
6839H7k78J07M7o1P9N5K52j20m02J72r9K60m8j41L0j2J08j51J81k72K9J44j06
$$ 87 -191 -84 -37 -98 -19 36 288 168 -234 -62 -161 99 51 -90 -60 -72 36 -115 66 -206 -177 -33 -139
6862a39K17N7p6j37K51r8k70K72l95L90j17K7P7M1n1J45k55j43J42J23J50j75
$$ -139 78 135 59 -78 173 75 -195 77 -318 72 -45 -18 59 100 49 194 -61 -204 -62 61 211 36
6884C6J85j89L2n8lk0J74k03jJ01n5P0r8j12l6J02O0l4P0J9j35K44o9k7n2J70
$$ 36 221 32 64 6 3 -17 157 -46 -47 54 -1 69 -29 -141 -177 -75 -15 -49 21 40 -95 149 80 53 1 171
6910A71l30J36J20k34K74o6j68R8k2Q1j96K33k42J33j57Q2K30l83J62M7p4JK49
$$ 171 -159 -23 97 -137 137 71 -97 1 -21 60 -136 97 -145 -12 -169 -87 143 -240 -78 -31 -105 -104 145
6933A45q7j07L43m19n9J62p9k2j8O0J12j30L5r5J75L0j91J87Mo3Q4m3k60l2J44
$$ 145 58 -49 294 -125 -184 -22 -101 -123 -141 -81 31 -99 -64 -159 16 46 -145 42 46 -17 67 24 -236 -268 -124
6958a24j0K56l1j64J36j03K88l45J12m5N3j38O0j81L74l63J77R1k16J14K29j62
$$ -124 -134 122 91 -73 63 -40 248 -97 15 -30 23 -115 -55 -236 138 -225 -48 43 -173 -59 170 8
6980HN5q4j35Q8J33nq9r0K4o9P8P5O4o9l3M8K1Q7k26J39j56J41k8Q0q3O1j7k72
$$ 8 63 -21 -156 -68 65 60 -29 -119 -95 -164 -86 -11 53 -16 -49 -1 20 107 -119 20 -136 5 -23 57 -26 35 18 -254
7008b54Q3R1P7M2rK8j83K00P7L2p7r3J07j27K35k85J99k68O9J39q3j26J88J43
$$ -254 -171 -80 -3 39 30 58 -125 75 152 184 107 14 121 -6 229 -56 143 -125 -56 83 0 -126 62 205
7032B05k82K0L7j3o9J30k64L01L3j01m7r7R9q2J85j50q7K22q1J56k54J47j33J44
$$ 205 -77 -57 -20 -33 -102 28 -236 65 98 -3 -50 -147 -48 -130 55 -95 -182 40 -41 115 -139 8 -125 19
7056A9J07o4J88j87J04n03K92J75k39m2J25k1R2L4p4j56K73k27K38q1j41Q1m5
$$ 19 126 62 250 63 167 -336 -44 131 -108 -150 -25 -46 46 80 6 -150 123 -104 134 53 -88 -7 -52
7079e2Q3q7J1Q8j1j28P8m8P3l5N8J22l26K87j79L15o0m77L87M1j45o0K8J10j1
$$ -52 31 -56 -45 43 32 -96 -18 -66 7 -28 30 152 -174 113 -66 249 189 -288 99 140 -5 -65 -37 73 62
7104F2k64K8K33LK6j73K58P0j93k2j50J39M2R3j77R8O7J7o3J8k03K9J5q6P9P0
$$ 62 -202 -174 59 62 88 -85 173 243 50 28 -122 17 59 152 -25 73 140 157 94 112 -91 -62 -47 -133 -54 16
7130A6Q1j31J86l3j81pp9j0J97J4p2j5k6L03m34Q4R6J08J5j92J05R3l36J81o8
$$ 16 97 -34 152 119 -62 -69 -148 -158 39 53 -19 -34 -60 243 -191 -107 -11 97 112 -80 25 118 -218 -37 -105
7155a05L70l54J66j09L2J4j59L17j13r6j30J91M2oO4l2q1j18mQ2N9%P3j62J59
$$ -105 265 -89 77 -32 0 14 -145 172 59 -37 -167 24 66 60 124 92 11 -107 -111 -29 30 30 103 -59 100
7180A00K3l23K31J62k40Q9PMr3j24J50N0j31N9r9J7q0J80M9K7p1K25k69j67J42
$$ 100 123 -200 31 193 -47 42 49 53 -40 -164 -14 36 -95 -36 -135 -118 -198 -18 31 58 -13 212 -57 -224 -82
7205h2J51N4l46K53NJ47j32K1p2j21J30p4O1NJ45j37R4n9k52M44l65J68j51L9
$$ -82 69 123 -223 30 35 182 50 71 -1 -122 8 -66 -5 0 145 8 102 43 -209 235 -130 38 -113 -74
7229g4R2L0K4p7j9j8k6J50J60k92O8j39K39j27K15m04J56O6O9j62J42k25L41k57
$$ -74 18 48 72 -5 -24 -42 -68 82 242 -50 18 -121 118 -9 206 -198 -42 24 93 -69 73 -152 189 -68
7253f8J99j04Q2j10n9J39j4j28jK23j11J76j94Lm0Q7m3P6l03J45J11K13k19j92
$$ -68 131 27 109 -1 -60 79 65 -63 -64 159 48 224 30 33 -7 80 37 113 -190 -45 66 279 60 -132
7277a32O7r0J74j4j30K05R0l05M1p1n2L18K6j93J90j02j38M5o7j29L33k97J73
$$ -132 -65 -155 19 5 -125 80 170 -135 -94 -165 -217 101 127 -66 124 22 -116 -71 -138 -267 66 -231 -58
7300e8J48k22J18n4J89Rj5l4q2j21Q7K56k02J14p3j51n6J69j75O5kR3n6M9L0j72
$$ -58 90 -132 -14 -68 121 130 115 81 -1 -122 -35 221 19 133 60 -91 -147 22 -153 -88 -90 3 -53 -4 26 -146
7326a46J63n6j9J63r7Or3M5R5j54J14pn7j14J66N6k75K07k9PP2l4k2rm4K4J96
$$ -146 17 -39 -58 105 8 14 -79 -34 61 -93 21 14 -43 -157 9 65 -210 -3 -32 -25 47 13 -9 -18 -62 -38 158
7353A58j12N4j7j60O2j39O7J64k82J72lR9j19J71q5j8J19j60j04J28Nq7J32l05
$$ 158 46 100 83 -77 -15 -154 -87 77 -205 -33 -36 63 -56 115 30 12 131 -29 -133 -5 0 -87 45 -260
7377b60K97j50l6J46lN8j49k7J45l24L01K5m7J65k98K69j1k90O1n6J94J34j65
$$ -260 37 -113 -149 -3 -6 52 -97 -124 21 -303 -2 23 -24 141 -157 112 101 -189 -128 -184 10 144 -21
7400b1J03j98M0R5P8R9k7j06J85l29J94J5j37r6L05Qj62j21J28j43N3J29k09J37
$$ -21 82 -116 -76 19 97 196 169 63 248 -81 113 128 -9 -105 200 208 46 -75 53 -90 -37 92 -117 20
7424B0lJ4r9R7o6Q1NJ12k35P5K26j80l7rK7k16J71N6r3J87N4j40l2nJ85k11L9
$$ 20 17 31 -68 29 -37 44 49 161 -74 1 227 47 10 1 28 -188 -17 39 -54 133 187 47 15 10 195 -16 23
7451B3M2l5n3J51L2j47L4k67J37J52N0m0k56L80r3r0q6Oj48P8O5K41j9j36J19
$$ 23 65 30 -23 128 160 13 47 -220 -83 69 119 79 -177 203 110 20 -66 -60 -208 -130 -65 176 157 21 140
7476A40j66OJ55j96K3l1r2J42O2pM2k23M06k77K37j19q6r5J97k21J0J31J32l16
$$ 140 -26 -20 135 -61 -38 -69 -161 -19 43 36 78 -145 261 -16 221 102 16 -79 118 -103 -93 38 170 -146
7500a46pL36j98Rj33N7K02j1j3k78P1L10l8l09L4L23k30O8Lk53K27J42k83J94
$$ -146 -153 183 -15 -6 -139 -82 120 109 96 -182 -111 199 161 -148 -114 209 -21 47 50 -203 24 166 -117 77
7524G7j62Q3N5j25j11j4J6M9J05J16j72J70P5j63j07L94m22M1J51k9N2k2j68J79
$$ 77 -85 -2 53 -72 -183 -197 -181 -132 -27 89 -83 87 162 -1 -108 286 -136 -95 56 27 79 57 -111 68
7548F8K2J9j86jR9j34R6j37J9L17j46j11K59k26L5J01m7J44j01j02J25j10O1n1
$$ 68 90 109 -77 -78 21 -113 -17 -154 -135 182 36 -75 184 -42 -7 94 47 191 90 -12 113 3 64 13
7572A3%K2k48K61j35J11K3j87J02%l7PJ44k7j36O8pJ93k97J56j04K43Plj69j6
$$ 13 13 35 -213 48 -87 24 47 -140 -38 -38 -75 -68 76 49 -87 -19 -26 167 -130 26 -78 165 172 169 0 -16
7598a6o6rL53l99J72JP1j48j79J03L5q8P7L5L21k29p8J63j1j12O9j21J01j31j5
$$ -16 -82 -91 262 -137 35 36 107 -41 -220 -117 -82 -170 -93 -58 263 34 -44 119 108 -4 65 -56 45 -86 -101
7623a01O6M9m4n6J70q4o1J95o5r3Q9j40J06J24j59j7J8Mj25K01L9j15K5%K8j02
$$ -101 -35 14 -30 -86 84 0 -61 134 69 -24 65 -75 31 155 -4 -21 -3 1 -124 77 116 1 26 26 54 -48
7649d8j3M9k1J72J9l68K61j97J25K7r5J93j82M5Nj30L59r4j7j28j01O3l9P8jQ9
$$ -48 -61 -12 -33 139 158 -210 51 -146 -21 6 -89 104 -78 -33 -28 -158 201 107 90 -38 -139 -76 -115 -37 -38 51
7675E1j3K49l84Q1q6P6K80l63K68m9o7q8M4O0l3P1p3K59m32J54KJ51k55J96p6
$$ 51 38 287 -97 -16 -102 -26 254 -109 159 110 43 -45 -1 59 26 97 24 283 -149 5 7 158 -97 99 23
7700B3J76k99L9J72j21q1M2N6j13j40L87j83P2J66k22j39J62L11l92M9L7qOo3
$$ 23 199 -100 -61 111 -10 -91 -49 7 -106 -246 141 -42 30 196 -26 -165 -3 308 -84 -35 2 -6 0 -63
7724f3K95k38K35r4j73L1O3N6p2L4j73K44j58J21oj46%J5p1K73j6l61L7M5J38
$$ -63 232 -6 229 135 -38 -7 56 112 40 74 -99 145 -13 108 102 -44 -44 -29 -100 173 157 -204 -167 -122 16
7749A6m1J61j91J32j71K8K31r2k5j35k43M39j64J33N8k15Qp8L56j84Q0Mq9O1j87
$$ 16 -25 136 -55 77 -94 -66 165 73 48 -87 -330 109 -55 78 136 -79 -71 -149 207 23 103 107 18 79 -108
7774a08k6J85r0j27J28m7J50J30n1l08K51n3n2R4Nj41j75L03J01k76R3j58l5K09
$$ -108 -134 51 -39 -166 -38 -85 65 195 144 -164 87 34 -18 76 81 -60 -235 68 169 -107 -14 -172 -207 2
7798Bj45P5J04j54J78N3j50K6JP0j51K16j57o7L0J69j4j96K04k27Qk3m3J06p6
$$ 2 -143 -68 36 -118 60 113 -37 -11 -10 60 -91 125 -32 -99 -69 100 86 -110 94 -133 -125 -148 -191 -85 -161
7823a61K56j45k58L06P4p1K7K7k82K54J26l57L22rj2r9j95M49j69l08J28K01j61
$$ -161 95 -50 -308 -2 72 1 28 55 -227 27 153 -204 118 109 97 -2 -197 252 83 -225 -97 104 -57
7846e7P1m0M8L9K1l05J77K21j20o2N3k54Q3K18NP7k28n4P8k34J78J79j80J55j36
$$ -57 14 -26 22 61 82 -223 -46 175 55 -7 46 -208 -125 93 98 175 -53 -107 -29 -263 -85 94 -86 69 -67
7871f7NK20m51J93K92n1q0O0k36R2J86j96K8J10j33Q1o7L0o4j0O6N1l1j11R0P0
$$ -67 -62 158 -293 -100 192 141 61 121 -115 -23 163 -33 -5 105 -28 53 -14 16 -48 -58 8 59 28 -83 7 77
7897G7P9j39K6j17R9j03K55j84J04k25K96j35j54R4m6n8O0R0K4Nj55q7L18j76
$$ 77 156 17 43 -74 25 -78 177 -7 97 -128 168 33 -121 -27 -73 -131 -71 19 43 48 -107 -194 124 -52
7921e2q8J43Q1o5o3J39k00J67n3kR0P3k32q8J06j90Q9J97k9k8j74L7J36J99j70
$$ -52 -140 3 84 19 -44 95 -105 62 9 7 97 170 -62 -150 -44 -234 -145 52 23 -5 -179 -142 -6 193 23
7946B3l7O4l2j32P0l5J94k25J95k8j11J95r3j54O4K27j00J6j94O6N9j82J30J20
$$ 23 -14 50 18 -114 -44 -79 115 -110 85 57 -54 141 48 -106 -42 185 85 101 -93 -27 32 -150 -20 100
7970A00k97R0J17O8J38k63O9n5M5O5qm0Q7l6j03J23o0n0Nl8J0n9J40j4p9J07n6
$$ 100 -197 -107 10 78 216 -47 22 -33 12 77 69 29 116 80 -23 100 40 -10 -5 -43 -33 -92 48 34 -45 62 6
7997FO0j85P8k1R2N9J4k7L9P4r0j19J43j99J23J62l81P2%P4j5J96j21rko4J50
$$ 6 66 -119 -41 -62 30 89 103 76 115 189 99 -20 123 -76 47 209 -172 -100 -100 -26 -41 155 34 25 23 -41 109
8024A09l1k80L90j93Q3J42n7k53O1j49P8P8j07K03j67K86l01P8m7P4j09J91n6
$$ 109 78 -202 188 -5 78 220 163 -90 -29 -178 -100 -22 -129 74 -93 193 -108 -30 -77 -3 -112 79 23
8047B3K26k67J64k35K52k60M3L6N4J3j66P8j1K56k76K15k92J38J58j75L1J85k04
$$ 23 249 -18 146 -89 163 -97 -54 -18 36 49 -117 -39 -50 206 -70 145 -147 -9 149 -26 5 190 -14
8070a4Mq1L01j02j77J47q7j97L53j05k2j03J21k95K37J70j02K21k27L6l1k00K86
$$ -14 -10 -91 210 108 -69 78 -9 -206 147 42 20 -83 38 -257 -20 150 48 269 42 78 47 -153 133
8093A33k50J14J45O2j48j46L01k87J23o0J29l40L11j61J91p1R0k53J75J12k39
$$ 133 -117 -3 142 204 56 -90 211 -76 47 -13 116 -224 87 -74 117 46 136 -117 58 170 -69
8114f9J70n3k97J9K83K08l69j13L28j52J54n5l3n4K39j65j22m%L2jj43K13P8j11
$$ -69 101 48 -249 -230 53 261 -108 -221 107 -45 109 54 21 -33 206 41 -81 -85 -85 -53 -54 -197 16 94 -17
8139a7k9J32m6j46K69j69J65j38K05j98O1O5l22J18q6L3l2Q6J67j80N4o3m7K30
$$ -17 -46 86 40 -106 163 -6 159 21 226 28 89 154 -168 -50 -136 -103 -135 -49 118 -62 -8 -71 -118 112
8163A12k7rJ15l37P1J5pR6m2J14m44L76j65J33J81r3j55J08j97N8M9J05j27P9
$$ 112 85 76 191 -146 -75 -60 -67 29 -13 101 -343 33 -132 1 182 89 -66 42 -155 -97 -48 57 -70 9
8187Ik71L86j32J61
$$ 9 -262 124 -8 153
8191A53
$$ Imaginary data points
##PAGE= N=2
##DATA TABLE= (X++(I..I)), XYDATA
0@%%%%%%%%%%%%%%%%%%%%%%Lj1J6j6J6j6J6j8K5l1L2l4M0m7N2o0O7p2Q1r0J00
$$ 0 0 0 0 0 0 0 0 0 0 0 0 0 0 0 0 0 0 0 0 0 0 0 3 -8 8 -8 8 -8 8 -10 15 -16 16 -18 22 -25 27 -33 34 -38 43 -47 53
43E3j13J25j37J51j66J82k01K22k45K69k96L29l65M04m48N00n61O35p24Q32r73
$$ 53 -60 65 -72 79 -87 95 -106 116 -129 140 -156 173 -192 212 -236 264 -297 338 -386 446 -527
64e27J162j431J843k573M262j8091J232J5898n160L332N169j010m699L963J633
$$ -527 635 -796 1047 -1526 2736 -15355 -14123 1775 -3385 -53 5116 4106 -593 3370 5003
79E003q3k70k156o095l5L543K640R48J093l221l678k927k304J595O199K716k679
$$ 5003 4920 4650 2494 -3601 -3636 -93 2547 3495 4588 1367 -2311 -5238 -7542 -5947 252 2968 289
96B89j874n28j088Q64K763K315J486n70k680k25L746K852j77k579n392n780k454
$$ 289 -1585 -2113 -3201 -2337 426 2741 4227 3657 977 752 4498 7350 7173 4594 -798 -6578 -9032
113i032n26J508N842M938j787l027J819J511N12K349J254k401k437j115j621J620
$$ -9032 -9558 -8050 -2208 2730 943 -2084 -265 1246 1758 4107 5361 2960 523 -592 -2213 -593
129e93N357O29l960k797j914j740J006L501J943K16j718m001k795K617L754J924
$$ -593 4764 5393 1433 -1364 -3278 -5018 -4012 -511 1432 1648 -70 -4071 -6866 -4249 -495 1429
145A429Q98Q00n82k23J105K045J616r28m919n669l102M14K197K975J919R08p86
$$ 1429 2327 3127 2545 2322 3427 5472 7088 6160 1241 -4428 -7530 -7116 -4919 -1944 -25 883 97
162I7k361j202K397L536J179j290j321j079Q9J437J352J190L07k510n250j828
$$ 97 -2264 -3466 -1069 2467 3646 2356 1035 -44 45 1482 2834 4024 4331 1821 -3429 -5257
178e257K496K838J389m8q66k802k597o70J807L129K846k31j858M14K632J702J096
$$ -5257 -2761 77 1466 1418 552 -2250 -4847 -5517 -3710 -581 2265 2034 176 590 3222 4924 6020
195F020Pj715m116m667j681J531L058K402n67j801r61j65K52J443K933J074k147
$$ 6020 6027 4312 196 -4471 -6152 -4621 -1563 839 272 -1529 -2490 -2655 -2403 -960 1973 3047 900
212I00k170j77K034K577J489k68k131k113k101j277J720L275Q90k693k990j274
$$ 900 -1270 -1447 587 3164 4653 4385 2254 141 -1960 -3237 -1517 1758 2648 -45 -3035 -4309
228d309j30J217J878J716R56o15j210k26K712L191P73k070k292k157j948l73J738
$$ -4309 -4439 -3222 -1344 372 1328 713 -497 -723 1989 5180 5953 3883 1591 -566 -2514 -2887 -1149
245a149K206K81j348l041j310J237K509J142L15O9j037j791K69K573K895Q47j064
$$ -1149 1057 1338 -10 -3051 -4361 -3124 -615 527 842 911 -126 -1917 -1648 925 3820 4667 3603
262C603k835j926L2J155Q50Q16j20k264l738p39J926K385J519k86p34p60L9Q29
$$ 3603 768 -1158 -1126 29 879 1695 1575 -689 -4427 -5166 -3240 -855 664 378 -356 -1116 -1077 -248
280b48K136K160Q62k226k980j131P82J299Q37R3q91k198j856n23J244K560J281
$$ -248 1888 4048 4910 2684 -296 -1427 -645 654 1491 1584 693 -1505 -3361 -3884 -2640 -80 1201
297A201j232j858l32N21J475K049K043L59j862k186j107O46J876O50j276j711
$$ 1201 -31 -1889 -2221 -1700 -225 1824 3867 4226 2364 178 -929 -283 1593 2243 967 -744
313g44j339j242o5J826K440K99j430j966o05J036K034J864P89j5j026j705j045
$$ -744 -2083 -3325 -3390 -1564 876 1175 -255 -2221 -2826 -1790 244 2108 2897 2882 1856 151 -894
330h94J575J916Q9j603j847j428o57O10J062J290J38j178k227m31K120K671J521
$$ -894 681 2597 2686 1083 -764 -2192 -2849 -2239 -1177 113 251 -927 -3154 -3585 -1465 1206 2727
347B727M39l80j173j704k05R37J205J55j473k138j100Q67J323P94P02m39j730
$$ 2727 3166 2786 1613 -91 -296 641 1846 2001 528 -1610 -2710 -1843 -520 274 976 537 -1193
364a193j829m81J669K329J621m6j133n23q8O53N92J386j7j868k316r82O10J098
$$ -1193 -3022 -3503 -1834 495 2116 2070 937 414 326 979 1571 2957 2940 1072 -1244 -2226 -1616 -518
382e18L42L4j262j445k12L16J958K875J277n94j788q63j34L42O51N32k02j560
$$ -518 -176 -142 -1404 -2849 -3061 -2745 -787 2088 3365 2771 983 120 -14 328 979 1511 1309 -251
400b51p53l67R24J881L13j503j685j037q98M86J866J757R71n80j099r36J231J472
$$ -251 -1004 -1371 -447 1434 1747 244 -1441 -2478 -3376 -2890 -1024 733 1704 1124 25 -911 320 1792
418A792R23n01m03j085j239q81J124O69l36j056j910r98R65J731J642J644Q13
$$ 1792 2715 2214 1811 726 -513 -1394 -270 399 63 -993 -2903 -3901 -2936 -1205 437 2081 2894
435B894j035j802o01M55Q63L26j40o67p23j13O74J072Q98l80j673k426j079P26
$$ 2894 1859 57 -544 -89 774 1100 960 293 -430 -543 131 1203 2101 1721 48 -2378 -3457 -2731
453b731R33J239J080P1m42q10L73J133J222O92q16j320n04J02%J97M43q22j729
$$ -2731 -1798 -559 521 592 150 -660 -287 846 2068 2760 1944 624 120 222 222 419 862 40 -1689
472a689j702m5J210J981J484M67p11o20o78m48Q10J041J44o97q55k60R18J037
$$ -1689 -3391 -3436 -2226 -245 1239 1706 995 375 -303 -751 59 1100 1244 547 -308 -568 350 1387
490A387M52k79p33j519j729p81J158J583P91l59o74o02M45N53J296J162L50p04
$$ 1387 1839 1560 827 -692 -2421 -3202 -2044 -461 330 -29 -703 -1305 -860 -307 989 2151 2501 1797
508A797j212m30L61P29k50j104q96j082o98L45J797J600N35p19r89r39L30M55
$$ 1797 585 155 516 1245 995 -109 -1005 -2087 -2785 -2440 -643 957 1492 773 -216 -1155 -825 -370
526c70L59N46K80k05p91L81R36J013o9j165j271j122m79L71O28P79O78j002r89
$$ -370 -11 535 815 610 -181 200 1136 2149 2080 915 -356 -1478 -1957 -1586 -958 -179 499 -503 -1492
545a492o4O74J155P95M50j5n90l40j49N22N92o45r86j370q07N95N72J188O89M2
$$ -1492 -1556 -882 273 1068 1518 1503 913 573 424 946 1538 893 -93 -1463 -2270 -1675 -1103 85 774 816
565H16p64j018n37M76J203L64j70l34J22K44L80N47P71j62j329j365p39J07O11
$$ 816 52 -966 -1503 -1027 176 540 370 36 158 402 782 1329 2100 1938 609 -756 -1495 -1388 -777
584g77R78m75m43k78p18j08J182J343M00K2o14j56K23K92K65J08p23j039q22l75
$$ -777 201 -274 -717 -995 -1713 -1821 -639 704 1104 1126 512 356 579 871 1136 1244 521 -518 -1340 -1715
604a715R89P91L75o6n62o82n56L80M20P58O14m61n55o2M59R75N06j03m85p62j086
$$ -1715 -726 65 440 374 -188 -870 -1426 -1046 -626 132 746 285 -270 -332 127 1102 1608 1505 1020 258 -828
625h28n2L56P86L6o19q66l31L28J67P45P33M80m46o57J15O77M56K28n48n90m71
$$ -828 -880 -524 262 298 -321 -1187 -1518 -1190 -1023 -278 455 935 489 -168 -53 624 1080 1308 760 170 -301
646c01l29J31M29P20O1n35r69l46k19O94N48K35P7k77l51M29N61Q34K00q26n34
$$ -301 -630 -499 -70 650 711 176 -793 -1139 -1358 -664 -116 119 196 -81 -432 -3 558 1392 1592 766 232
667B32k81k3M2L99J65m05p04o26j20K06Q54N69L8l17j75J19J43M15N79j21o53
$$ 232 -49 -72 -30 369 534 129 -575 -1201 -1321 -1115 -261 308 346 29 -146 -27 116 531 1110 989 336
688C36k83m30L10L83K00P1l82m52q24k80O98N15J80k13j98l32M40N92K43N41K73
$$ 336 53 -377 -67 316 516 587 205 -247 -1071 -1351 -653 -138 42 -171 -369 -701 -261 331 574 1115 1388
709A388n34q56j60K07M22J68l93o39l12k86J68K54M83K70r6p04j9L15M69O96o5
$$ 1388 854 -2 -162 45 467 635 242 -397 -709 -995 -827 -573 -90 180 84 -620 -639 -324 145 841 776
730G76K89p48m29J4L29N22k1k23p03n01j62J42K67M45L60r30k44N8N64L54N95
$$ 776 1065 317 -112 -98 231 753 732 509 -194 -695 -857 -715 -448 -3 357 -573 -817 -759 -195 159 754
751G54J05k64o01j7L4M21J65K41o93l01p21O7K88L85R8j48j94l61j64Q52O50Q5
$$ 754 859 595 -6 -23 11 432 597 838 145 -156 -877 -810 -522 -137 -39 -187 -381 -742 -906 -54 596 681
773F81J80m98k16M5l4L91J87k9n26o02l72L64J63J49j7r9k57m59M55L37P66l0
$$ 681 861 363 147 192 158 549 736 707 181 -421 -793 -429 -266 -117 -134 -233 -490 -949 -494 -157 609 579
795E79P4n93J00k15K18J20L85j13m60l07j92K84R2K77k58n84j71j14N02M30M22
$$ 579 653 60 160 -55 163 283 668 555 95 -212 -404 -120 -28 249 -9 -593 -764 -878 -376 54 476
816D76L63l83j58k41J26K61J73o5l60k30l04n4N8M05q9l9m27l37O8J96P35K26
$$ 476 839 456 298 57 183 444 617 552 192 -38 -342 -396 -338 67 -22 -61 -488 -825 -757 -561 174 400
838D00K08o14jj40K65K53K56j38m96K47m09O2M37qk67m09l52l03K59M87M20L72
$$ 400 608 -6 -7 -147 118 371 627 489 -7 240 -169 -107 330 322 55 -354 -706 -1009 -750 -263 157 529
860E29k20Oj89M5J61J92K71m13l33k33j34K29j3K48M0n13j47k21L01M97M1P6l03
$$ 529 309 315 126 171 332 524 795 382 49 -184 -318 -89 -102 146 186 -327 -474 -695 -394 103 144 220 -83
883h3L1k92J05M37L32J71n77O2j62p3K64Qk45r4n63j47M2N27K58L10j5m74j33
$$ -83 -52 -344 -239 198 530 701 124 186 24 -49 215 223 -22 -116 -679 -826 -784 -257 1 311 296 -178 -311
906c11L13n2L18M51k15l54k74K1j0M63l01Q3j98m24k63K45L76M17j36k14k51j12
$$ -311 2 -50 268 719 504 150 -124 -103 -113 350 49 132 -66 -490 -753 -508 -132 285 149 -65 -316 -428
928d28M3L44K40K19N4o3k56l4M36K2j84l42k05n07J23mL21K45lJ0p9k44lM71J69
$$ -428 -385 -41 199 418 472 409 153 119 555 577 393 51 -154 -661 -538 -542 -221 24 21 31 -48 -292 -295 176 345
953C45qj70J6l14K54J72q1J30p7p28J67K46j84J76J09J60k58o43J43K10M08L93
$$ 345 337 167 183 -131 123 295 214 344 267 -461 -294 -48 -232 -56 53 213 -45 -688 -545 -335 73 466
975D66o0l5l30J40k7K86K10n23l61j31O4j31J05L06K03j14k11k53J43K50J32K71
$$ 466 406 371 41 181 154 440 650 127 -234 -365 -301 -432 -327 -21 182 68 -143 -396 -253 -3 129 400
997D00q3l42J24o6L4K92j3k91j93m7j65L13N5J3r5n9l54Q5j26K59L35J05j39J54
$$ 400 317 -25 99 33 67 359 346 55 -138 -185 -350 -37 18 31 -64 -123 -477 -392 -518 -259 76 181 42 196
1021A96K3j78J63L51l87j21k32J50j64p3K67O9j66n7q3P9p6L20K8q1J7l7O8J08
$$ 196 219 41 204 555 168 47 -185 -35 -199 -272 -5 64 -102 -159 -242 -163 -239 81 109 28 45 8 76 184
1045A84qR9o3j24l20n5Q6J74R8J90l86k1k18n7K79J73J35O7q1l7pN8K16J62l79
$$ 184 176 275 212 88 -232 -287 -201 -27 71 261 -125 -146 -364 -421 -142 31 166 233 152 115 108 166 382 544 165
1070A65j03j66k6J39P3p7Qq4m15mM04n9J38J19l1l1j61J83K1K68j3j00l27j34
$$ 165 62 -104 -130 9 82 5 13 -71 -486 -490 -86 -145 -7 112 81 50 -111 72 93 361 348 248 -79 -213
1094b13M40j53j47J75M1m88Q1L3k1R0K14m1mN6k5j39K41J33J08k49j40K9M4J07
$$ -213 227 74 -73 102 143 -345 -264 -231 -252 -162 52 11 7 63 38 -101 140 273 381 132 -8 21 65 172
1118A72q7Ql36J27kk85K53L04m6j85J31j46L0L10j86J74kj29k3k12K06K08k66
$$ 172 85 93 -243 -116 -118 -403 -150 154 108 -77 54 -92 -62 248 62 236 234 105 82 -130 76 284 18
1141A8J36k40j63l3O6M8L35p3o2j13j27L32J03J91j08r8r5l12L10n6J33K2k21
$$ 18 154 -86 -249 -282 -216 -168 167 94 32 -81 -208 124 227 418 310 212 117 -195 115 59 192 214 -7
1164gj73k18L01k1P2O3K14l80j44LK33J52K90k60K01r9q6LQ7M6k01r8r5ol6J38
$$ -7 -180 -398 -97 -118 -46 17 231 -149 -293 -290 -57 95 385 125 326 227 141 144 231 277 76 -22 -117 -123 -159 -21
1190b1k32J34Q7J03l92R8M8M50k46K63k03k82J43J43J12k44m1R7kk07J22j81L95
$$ -21 -253 -119 -32 71 -321 -223 -175 275 29 292 89 -193 -50 93 205 -39 -80 17 15 -192 -70 -251 144
1213A44l44R7k99J97j12L69j04J91p2j09M2j54J80k3J40K7j79j16J35N2l1J32
$$ 144 -200 -103 -402 -205 -317 52 -52 139 67 -42 0 -154 26 3 143 170 -9 -125 10 62 31 163
1235A63p2k38j46n1K69P8J78R4r8k13l3J94R4J4P5l77n1r8oK23O7L9l41n0K43
$$ 163 91 -147 -293 -344 -75 3 181 275 177 -36 -69 125 219 233 308 -69 -120 -218 -224 -1 66 105 -236 -286 -43
1260d3JK86j49J0K9r8j55R3K95k37J07J93l75J4J4k10J86K11j68o9K2j10PQ6L0
$$ -43 -42 244 95 105 134 36 -119 -26 269 32 139 332 -43 -29 -15 -225 -39 172 4 -65 -43 -153 -146 -60 -30
1285c0Q5J08r6l3q0J42j4Q2Lo1j27j48K53K4m32J13N5j25m8J60K89K0n3K3r6j26
$$ -30 55 163 67 34 -46 96 82 164 167 106 -21 -169 84 108 -324 -211 -156 -281 -329 -169 120 140 87 110 14 -112
1311a12M9Q5K45q7n3j70n3J42J07n5K8j29k91J63J13R8k55K71j35m4RM5j2L1Q5
$$ -112 -63 22 267 180 127 -43 -96 46 153 98 126 -3 -294 -131 -18 80 -175 96 -39 -83 -74 -29 -41 -10 75
1336G5l7J17m9k98L48j17p6J34p4k13N2j66L12R1N4j27OJ0j92J27K68j4m4l0j10
$$ 75 38 155 106 -192 156 39 -37 97 23 -190 -138 -304 8 99 153 26 32 42 -150 -23 245 231 187 157 47
1361D7m8R6Q4k0j71j48%n8jK33p9J80k25o5mL28N9j13Nj99NJ18K25j69l02J29
$$ 47 -1 95 179 159 -12 -160 -160 -218 -219 14 -65 115 -110 -175 -179 149 208 95 100 -99 -94 24 249 80 -222 -93
1387i3J86j12k33OJ19L04j05L7j91k4J0L25l11P1O0J61k01qQ9j44L91k22J2k47
$$ -93 93 -19 -252 -246 -127 177 72 109 -82 -106 -96 229 -82 -11 49 210 9 1 90 -54 337 115 127 -120
1411a20O0l6RJ49n6p1Q7O4l40P2N84m10j0J24m4q2K5J36M5k64L8Jk52J16K66m5
$$ -120 -60 -96 -87 62 6 -65 22 86 -254 -182 402 -8 -18 106 62 -20 5 141 186 -78 -40 -39 -291 -175 91 46
1437D6j19J4lj51K25J18O8r7J73l74N1J3j4QJ66j74j93L01Q8j31q5J52r9Q1k56
$$ 46 -73 -59 -62 -213 12 130 198 101 274 -100 -49 -36 -50 -42 124 -50 -243 58 146 15 -70 82 -17 64 -192
1462a92J03j1J12J15P9k46N2q2L5K19j44j48K33k97L4J66rL0k28p3K50j08j5k
$$ -192 -89 -100 12 127 206 -40 12 -70 -35 184 40 -108 125 -172 -138 28 19 49 -179 -252 -2 -110 -125 -127
1486a27L35k63J33O2j61J24k12P5J82j1j79r8k6K44l81L77k96N43l08k1K23j80
$$ -127 208 -55 78 140 -21 103 -109 -34 148 137 -42 -140 -166 78 -303 74 -222 321 13 -8 215 35
1508C5j9j39K3N0q1J47o2l5NM1j25K26M2K1k24O4p3J26k64K27J03k30M34l07k
$$ 35 16 -123 -100 -50 -131 16 -46 -81 -76 -35 -160 66 108 129 -95 -31 -104 22 -242 -15 88 -142 292 -15 -17
1533a7j27J05J12o9J45q3r3J48j33J16k36N7qK16j70R1j52l3K53O7k88n4K91j57
$$ -17 -144 -39 73 4 149 66 -27 121 -12 104 -132 -75 -83 133 -37 54 -98 -131 122 189 -99 -153 138 -19
1557a9J85l27L05N9k03j07J29Q8j60K9m2o9N5J2J47J7j00RJ5O2J6Q6k65N1rj12
$$ -19 166 -161 144 203 0 -107 22 110 -50 -21 -63 -132 -77 -65 82 99 -1 8 23 85 101 187 -78 -27 -36 -148
1583a48J28O6j40J81N9J0k86O5Q9j31J07J51q8r1k9l2RJ25l1K5l6K2l3R8J5n4
$$ -148 -20 46 -94 87 146 156 -130 -65 24 -107 0 151 63 -28 -57 -89 -80 45 14 39 3 25 -8 90 105 51
1609E1J3p8j26j13M0J18R0j09Q2P9Q0l2mr2P6J9j8J32k90K81k68Q2o3K14k25l2
$$ 51 64 -14 -140 -253 -213 -95 -5 -114 -32 47 127 95 91 -1 75 94 76 208 -82 199 -69 13 -50 164 -61 -93
1635i3OPM3Q6j13K02m3j08r5J20Q9j92o1j25L05j30K30k45J87q0j96J68J92l7
$$ -93 -87 -80 -37 49 -64 138 95 -13 -108 12 101 -91 -152 -277 28 -102 128 -117 70 -10 -206 -38 154 117
1659A17j35k28qL33n1J01k02J53o0k39L45j41P3j44j71J91J12J41j98L2p7mr2
$$ 117 -18 -246 -254 79 28 129 -73 80 20 -219 126 -15 58 -86 -257 -66 46 187 -11 21 -56 -60 -152
1682a52N2P1K17Ql15K17j76PQ6J82l02L4J69j33M9LL2O6m2l7K30l61J11K7j71
$$ -152 -100 -29 188 196 -119 98 -78 -71 15 197 -105 -71 98 -35 14 17 49 115 73 36 266 -95 16 43 -128
1707a28K35l07J75Nq6l3l6l2K60j80M9L7o5m1K7L4J5J84j6j19j0J8J88j79p4K56
$$ -128 107 -200 -25 -20 -106 -139 -175 -207 53 -127 -78 -41 -106 -147 -120 -86 -71 113 97 -22 -32 -14 174 -5 -79 177
1733A77j39l5j22m9kJ94k3K49k06M5o0j01J94j16K8o5J88k42j64J02J09L3o8J80
$$ 177 38 3 -119 -168 -170 24 1 250 44 89 29 -72 122 6 34 -31 157 -85 -249 -147 -38 -5 -73 107
1757A07j51o6J24O4r6j0M3K2P1J04r7j74K36l08J59J45j98J84j96l3J25o7J04
$$ 107 -44 -110 14 78 -18 -28 15 37 108 212 115 -59 177 -131 28 173 -25 159 -37 -70 55 -12 92
1780I2J27l07M0Mk2K01j43K8j52K09Q5l35J29J19K8k76O9n3J44p1J39K0l8j19
$$ 92 219 -88 -48 -44 -66 135 -8 20 -132 77 162 -173 -44 75 103 -173 -104 -157 -13 -84 55 75 37 -82
1804h2p4J32k36L20m6n9J82qM8j77N3L4L0j85J79j72j0M3j64J84m0PLL00m18p9
$$ -82 -156 -24 -260 60 14 -45 137 129 177 0 53 87 117 -68 111 -61 -71 -28 -192 -8 -48 -41 -38 262 -156 -235
1830b35K93m8J84k83j8J71p0J23j26LP1J1j28K11o8k53J85m4J4j62P8K5O2k05
$$ -235 58 10 194 -89 -107 64 -6 117 -9 -6 65 76 -52 159 91 -162 23 -21 -7 -169 -91 -66 -4 -209
1854b09Q9M4K54k06P3OJ23k03p1j06K82J03k73q8P5J38K10j5l99J45lr4kp0M44
$$ -209 -120 -76 178 -28 45 51 174 -29 -100 -206 76 179 -94 -182 -107 31 241 226 -173 -28 -31 -125 -127 -197 247
1879B47M7l62J39n8N6j03J18O1k13Q8J25N2k50o7m8J47O7j19K15k47j10L86j11
$$ 247 294 -68 71 13 69 -34 84 145 -68 20 145 197 -53 -120 -168 -21 46 -73 142 -105 -215 171 60
1902F0n0j45J47m1j06K23Pj31R3m5J55k1J53l85l4J01o2L8j3Q9k0l0J80J8j45
$$ 60 10 -135 12 -29 -135 88 95 -36 57 12 167 146 299 -86 -120 -19 -81 -43 -56 33 13 -17 163 181 36
1927C6q8M4J49j35R1k9rJ20k29j39K57j44M8R5j28Q5j46K06j46P3N6j87p2K35
$$ 36 -52 -8 141 6 97 68 59 179 -50 -189 68 -76 -28 67 -61 24 -122 84 -62 11 67 -120 -192 43
1951D3J07k91K04m43M18j01j40J0Q0J38M6j33P4j01K9j00k4K26J08q4J59j37o8
$$ 43 150 -141 63 -380 38 -63 -203 -193 -113 25 71 -62 12 -89 -60 -160 -184 42 150 66 225 88 20
1974B0j6N7O6k86J39Q8l3Rl6j48O4l1%K83j02r6K04k63R7m4J06kO7j6k58K83k64
$$ 20 4 61 127 -159 -20 68 35 44 8 -140 -76 -107 -107 176 74 -22 182 -81 16 -28 78 76 143 127 -131 152 -112
2001a12K96j74qJ1K0k09k4J11K24P0k71o7J40K6lj41O5nK1j9o0J72j12L3r1P5
$$ -112 184 10 2 13 33 -176 -200 -89 135 205 -66 -133 7 33 30 -111 -46 -51 -30 -49 -109 63 -49 -16 -107 -32
2027c2j21L09p3k30K5O5K8J42N5j69P1p1J79o0l4J0m3Oj36m5m2K27p4L9j10K46
$$ -32 -153 156 83 -147 -122 -57 -29 113 168 -1 70 -1 178 118 84 94 51 57 -79 -124 -166 61 -13 26 -84 162
2053A62k70Q3O4k39K44jK0o7Q1m4J26m29L81N6r9j51R9M6o6j10M1N6j06J54j67
$$ 162 -108 -25 39 -200 44 43 63 -4 77 33 159 -270 111 167 68 -83 16 62 -4 -114 -73 -17 -123 31 -136
2078a36j05M7L39q6j22K42o9j27l3J95l64J51J6m6P6J7L9p5kr7K48k02J33j89
$$ -136 -241 -194 145 59 -63 179 110 -17 -50 145 -219 -68 -52 -98 -22 -5 34 -41 -43 -140 108 -94 39 -150
2102a50J13p5p1L10q1j54N2N5Q9k5P6k01R1j13J48j80Q8l9L9J92k95P1K46j08
$$ -150 -37 -112 -183 127 46 -108 -56 -1 88 63 139 -62 29 -84 64 -116 -28 -67 -28 164 -131 -60 186 78
2126G8m8J27K6m45M22j90J91K4m20K08J41j78O6j28J28m0q6J91J00J9m07K69j59
$$ 78 30 157 183 -262 160 -30 161 185 -235 -27 114 -64 2 -126 2 -38 -124 67 167 186 -221 48 -111
2149a11P1q7J05q2LL44Qk73R0j58J63j77J90j40q3J17P2l03K10M3J27l1k47N5
$$ -111 -40 -127 -22 -104 -101 243 251 -22 68 -90 73 -104 86 -54 -137 -20 52 -251 -41 2 129 98 -149 -94
2173i4Q2j46J60K18n21K42K0q9J71n5j1j26k5K25j65j0J96o5J68o5j53k9J84p2
$$ -94 -12 -158 2 220 -301 -59 -39 -128 43 -12 -23 -149 -174 51 -114 -124 72 7 175 110 -43 -72 112 40
2197D0r4k6K79k45k05M11n5k25P0O5p5l5r5K57J01r2J1j44K4j0L5J88k20J93R
$$ 40 -54 -80 199 -46 -251 160 105 -120 -50 15 -60 -95 -190 67 168 76 87 -57 -33 -43 -8 180 -40 153 162
2222A62l08J22l1L8j68K40k5n0o8J86j35k7L5N8J62k58N2J6LM4j6o4J8k02J92
$$ 162 -146 -24 -55 -17 -185 55 30 -20 -88 98 -37 -64 -29 29 191 -67 -15 1 4 48 32 -32 -14 -216 -24
2247b4J3J14m4j61q3j47K13J09M8M1p2M4k55M5J35j60K50MR9l02P7k5J84Q5j69
$$ -24 -11 103 59 -102 -185 -332 -119 -10 38 79 7 51 -204 -159 -24 -184 66 70 169 -133 -56 -81 103 188 19
2272A9j34O3l7J44N0l05J00J12J10l5o3J0m0K11l01o0K90r9P9j36J4K1k90L35
$$ 19 -115 -52 -89 55 105 -200 -100 12 122 87 24 34 -6 205 -96 -156 134 35 114 -22 -8 13 -277 58
2296E8mk1O7p3N4q7j1q1K05j44r5M09k50j36O3j91K60j66L46k47j78K50RJ7j23
$$ 58 54 33 100 27 81 -6 -17 -98 107 -37 -132 277 27 -109 -46 -237 23 -143 203 -44 -222 28 37 54 -69
2321f9O0L7L3Q9j88J12k01j0K03O7J86k99J10l10K39j45J45J85l04J41k03K91
$$ -69 -9 28 61 150 -38 74 -127 -137 66 133 319 20 130 -180 59 -86 59 244 -60 81 -122 169
2343A69k10j41J14o5P1Q9M8j42K18P9j58K7m9J38k04m7K43Lk94J11J25l77J09
$$ 169 -41 -182 -68 -133 -62 27 75 -67 151 230 72 99 50 188 -16 -63 180 183 -111 0 125 -252 -143
2366a43J31J4p0K04j43J51j42n9j5K65j52O0r2J99j11l08L26j75J05j36K13l81
$$ -143 -12 2 -68 136 -7 144 2 -57 -72 193 41 101 9 208 97 -211 115 -60 45 -91 122 -259
2388b59J87K41p0j47j22L73j31L48m14O4k08J20N6n7P0r5j16p4K16j57K62j73
$$ -259 -72 169 99 -48 -170 203 72 420 6 70 -138 -18 38 -19 51 -44 -160 -234 -18 -175 87 -86
2410h6J9R4j16J25r3l2jK01k5o5NL18k69j01P6M3k01pJ74k96j3J18L7J33K0R3
$$ -86 -67 27 -89 36 -57 -89 -90 111 86 21 26 344 75 -26 50 93 -108 -115 59 -237 -250 -132 -95 38 58 151
2436A51j29j96K77NK00l89P5O1R0j20j8j7k32K17j9J59j61j11L60j71J93j63j87
$$ 151 22 -174 103 108 308 -81 -6 55 145 25 7 -10 -242 -25 -44 115 -46 -157 203 32 225 62 -125
2459a25J58k15o4J14K71j09M2k37J59K30k12r8N3n3p9Q8N5J30j43J36P5k29J77
$$ -125 33 -182 -246 -132 139 30 72 -165 -6 224 12 -86 -33 -86 -165 -77 -22 108 -35 101 176 -53 124
2482A24qm8k25J5J38J55j8r4n0j66J16J86R5l08K07n4j03o1J09P8o6J39k22k72
$$ 124 116 68 -157 -142 -4 151 133 39 -11 -177 -61 125 220 -88 119 65 -38 -99 10 88 22 161 -61 -333
2506c33L88P3l36P4J53R0j18K64j75L6j60k2K41j71K1l3m5J43r4k4l8k5Q4J60
$$ -333 55 128 -208 -134 19 109 -9 255 80 116 -44 -66 175 4 25 -8 -53 90 -4 -28 -66 -91 -7 153
2530A53j33N3k2j07O6l5O7n5r1M8J01k75K04j49K87j50L2Q7J19l08J74K2j05J49
$$ 153 20 73 51 -56 10 -25 42 -13 -104 -56 45 -230 -26 -175 112 -38 -6 81 200 -108 66 88 -17 132
2554A32m9j61K39o5L3j56O6K0no4N7o1J34r1q7j9J77K0j11P7j88J60j69K65q7
$$ 132 83 -78 161 96 129 -27 39 59 54 -10 47 -14 120 29 -58 -77 100 120 9 86 -102 58 -111 154 67
2579F7k9j03J70j11J0j87K29Nj17O6k01K03N5O2l81R8K43J23k51kJ71%o3j30L6
$$ 67 38 -65 105 -6 4 -183 46 51 -66 0 -201 2 57 119 -262 -164 79 202 -49 -51 120 120 57 -73 -37
2604c7j2M2K95n94K62Q0q6J69k06Q2o0P6J41nj32J68r9P6j65o1K96j15j60p1J87
$$ -37 -49 -7 288 -306 -44 36 -50 119 -87 -5 -65 11 152 147 15 183 84 160 -5 -66 230 115 -45 -116 71
2629G1j32l7J73j58J27j20J94j46k7j6PR5j61J09R2m2NM8j2j98R1K1N0j15O5O9
$$ 71 -61 -98 75 -83 44 -76 118 -28 -55 -71 -64 31 -130 -21 71 29 34 82 70 -128 -37 -16 34 -81 -16 53
2655E3O0LJ7o4k49M08l6r1j08Qj6J03mo7j69L05k96J42j50lL17m7j03j42p4J67
$$ 53 113 116 133 69 -180 228 192 101 -7 1 -15 88 84 17 -152 153 -143 -1 -151 -154 163 116 13 -129 -203 -36
2681c6R7N5j93P4L4k79L44r0k4N2K3N2k02P9n6m8J27o1N5O1j89P9%J50j28M2r8
$$ -36 61 116 -77 -3 31 -248 96 6 -18 34 57 109 -93 -14 -70 -118 9 -52 3 64 -125 -46 -46 104 -24 18 -80
2708h0R8o8K6n7K10j97J8L5J11j37J41j67P8K50l93O5p4R6J68m2m7k39K92j51
$$ -80 18 -50 -24 -81 129 -68 -50 -15 96 -41 100 -67 11 261 -132 -67 -141 -45 123 81 34 -205 87 -64
2732f4R6j76J78n6n1l5n9J67k00K14j28K48j8j31K5L3L8o2L4k6J09r8M4p0r2M8
$$ -64 32 -144 34 -22 -73 -108 -167 0 -200 14 -114 134 116 -15 10 43 81 19 53 27 136 38 82 12 -80 -32
2758c2Rj78j0P8N8K58j84K7N2n0o1l2R4L2k76M36j71J7K41k74P8N7j19r2j17K05
$$ -32 -23 -201 -211 -133 -75 183 -1 26 78 28 -33 -65 29 61 -215 221 50 67 308 34 112 169 50 -42 -159 46
2784D6j54L15j02q3k2p4m4L8J54j24K9J41k71K41J0p9Pk74M8Q5K85j42j31K08
$$ 46 -108 207 105 22 0 -74 -118 -80 74 -50 -21 120 -151 90 100 21 28 -246 -198 -113 172 30 -101 107
2808A07q4j27J38lJ55k84R8J29k05M9o2m8P7r4K12j55j11K53j0P1k92L01L0j20
$$ 107 23 -104 34 31 186 -98 0 129 -76 -27 -89 -137 -60 -154 58 -97 -208 45 35 106 -186 115 145 25
2832B5Op0n0J78k03N1Q0p2j08j0J56O7qN7r4R2j31O5j62pP0J31k07j13J90K11
$$ 25 31 -39 -89 89 -114 -63 17 -55 -163 -173 -17 50 42 99 5 97 -34 31 -131 -138 -68 63 -144 -257 -67 144
2858A44n8k78K44j1l9J41l26pJ18L2Q1j35l8K47n5M4m26K27J83J2n4k12K32J60
$$ 144 86 -192 52 41 2 143 -183 -190 -72 -40 41 -94 -132 115 60 104 -322 -95 88 100 46 -166 66 226
2882B26l97K77k28k6K47j21O8j75J3L0J53j81J41J22k27qj1O9j68M5J17J90j00
$$ 226 -171 106 -122 -148 99 -22 46 -129 -116 -86 67 -114 27 149 -78 -86 -97 -28 -196 -151 -34 156 56
2905E6P9j09M3r0O1J8j8q9P6j0k46J91K02j64L4o4j0J85j21j47J23l3J43j5j02
$$ 56 135 26 69 -21 40 58 40 -49 27 17 -229 -38 164 0 34 -30 -40 145 24 -123 0 -33 110 95 -7
2930gR2j38J52Ok9j68J00O7r0j7Q4J18k24j6j42K15J53k55O5N2N1n8J48k24l1
$$ -7 85 -53 99 105 76 -92 8 75 -15 -32 52 170 -54 -70 -212 3 156 -99 -34 18 69 11 159 -65 -96
2955i6K18j42K24j55J51k29J45J5j41o0J07l0M4R6K0j09j92K45o7P9l1r5J51m05
$$ -96 122 -20 204 49 200 -29 116 131 -10 -70 37 7 51 147 167 58 -134 111 44 123 92 -3 148 -257
2979b57L98j62pL4K9j92J42k1J32m9j35K72k21N7k18K75o9J65k39J61j32J80q0
$$ -257 141 -21 -28 6 35 -157 -15 -36 96 47 -88 184 -37 20 -198 77 8 173 -66 95 -37 143 63
3002F3q5J3M0o7J06k23O8J01j23J63j55J0J59l5P5j95J53k07R1M4Q7J6qM8j73
$$ 63 -22 -9 31 -36 70 -153 -85 16 -107 56 -99 -89 70 35 110 -85 68 -139 -48 -4 83 99 91 139 -34
3027c4j4p8K47l63N63k71j26J30r6p0Q0J55j19J64p8k37K93J0l4l00J13J74j95
$$ -34 -48 -126 121 -242 321 50 -76 54 -42 -112 -32 123 4 168 90 -147 146 156 122 -178 -65 109 -86
3050h6n9%J68q0j77K51J59j88J5N8j2j45J11p8J16M2j67J56j6k99L80k96J23J44
$$ -86 -145 -145 23 -57 -234 17 176 -12 3 61 49 -96 15 -63 53 95 -72 84 68 -231 149 -147 -24 120
3074A20KK3Pj96R8k44K27J66nq4l91K31m1J41rP2l11K18j12J60o3m7K2L2j13J67
$$ 120 122 145 152 -44 54 -190 37 203 198 114 -277 -46 -87 54 45 117 -194 24 -88 72 9 -38 -16 16 -97 70
3100G0j55km7J56K6l04K89o7M8Q3q0%nL8Q6m7N7k50K23j22J8j28K52j79J5nK17
$$ 70 -85 -87 -134 22 48 -256 33 -34 14 97 17 17 12 50 136 89 146 -104 119 -3 15 -113 139 -40 -25 -30 187
3127A87k34J71j05ol5l4j21K81j73K1l1l2O8J35j61J76k6j58L02k28j64M1K20
$$ 187 -47 124 19 13 -22 -56 -177 104 -69 -48 -79 -111 -43 92 -69 107 81 -77 225 -3 -167 -126 94
3150I4j37L6L4L8j44K56p6j51R2l5l3K14k22K8M4jO9M5n2l0ol46L32M7j91R4r0
$$ 94 -43 -7 27 65 -79 177 101 -50 42 7 -26 188 -34 -6 38 37 106 151 99 69 63 -283 49 96 -95 -1 -91
3177i1M4J90J11j82k00J19J43p0j49K6j01J38J18J9k9j52J26q2p4K35k9l26K91
$$ -91 -47 143 254 72 -128 -9 134 64 -85 -59 -160 -22 96 115 86 -66 60 -22 -96 139 110 -216 75
3200G5j84R6k30K21K38l56J36J60j01j04Q4j93K63l6J4L9k36P7R9L8kk5K8K4n1
$$ 75 -109 -13 -243 -22 216 -140 -4 156 55 -49 35 -158 105 69 83 122 -114 -37 62 100 98 73 101 125 74
3225G4N2o9j61J78k12L20j16j03J32k72K21o2N3j95KL94k2mn8K0j89P4j40mR4
$$ 74 126 57 -104 74 -138 182 66 -37 95 -177 44 -18 35 -160 -158 236 214 210 152 172 -17 57 -83 -87 7
3250Gq0j21K64L8K01k89k03K15n3K57l22K31j77j7R1J6l22J18K24J6j27j44K33
$$ 7 -73 -194 70 108 309 20 -183 32 -21 236 -86 145 -32 -49 42 58 -264 -146 78 94 -33 -177 56
3273E6j48K58k20J27l5O1j01j2J71q1k6j90K84L5m44K31m0J79j11LK7l4N0O3J87
$$ 56 -92 166 -54 73 38 99 -2 -14 157 76 50 -140 144 179 -265 -34 -74 105 -6 -3 24 -10 40 103 290
3298B90l49J63j91R1K41r2n9P9j57k44K36j51N8j05J84J8o9O8K3K14m29K27j33
$$ 290 -59 104 -87 4 245 153 94 173 16 -228 8 -143 -85 -190 -6 12 -57 11 34 248 -181 46 -87
3321h7K8K95k64L21l37J5J35N2j99J18p0R1rm3N4k39J31J23N7m3j13M9r6qJ18
$$ -87 -59 236 -28 293 -44 -29 106 158 -41 77 7 98 89 46 100 -139 -8 115 172 129 16 65 -31 -39 79
3346G9O7r9j37J12N0j35qJ26Ln8q8m0K75j77J11L9J9j62M8j98J40J62j93J52j92
$$ 79 146 47 -90 22 72 -63 -71 55 58 0 -88 -128 147 -30 81 120 139 -23 25 -173 -33 129 -64 88 -104
3371a04l8K27m9J87l25M2M8n4J33l3J0R8l26K80j73J39k08J45MN4MK24r2k51P4
$$ -104 -142 85 36 223 -102 -60 -12 -66 67 34 44 142 -184 96 -77 62 -146 -1 3 57 61 285 193 -58 16
3396A6j88L32j06l2L9n9J26Mr9J26j41K6k19J79j33Q0L3K67l55Q3J48r3l8J12
$$ 16 -172 160 54 22 61 2 128 132 33 159 18 44 -175 4 -129 -49 -16 251 -104 -21 127 34 -4 108
3420A08j1K9j19k23K86l1m5no3K43k82J59l9j50L8M4Q6j5Jj42K78k21k8L33l92
$$ 108 97 126 7 -216 70 39 -6 -11 -74 169 -113 46 7 -143 -105 -61 25 10 11 -131 147 -74 -102 231 -161
3445a61J54j02K49k31J97J04n6j68l2k2J67j14K70j20j34o1O4k6j7J29M5j45K1
$$ -161 -7 -109 140 -91 106 210 154 -14 -46 -68 99 -15 255 135 1 -60 4 -22 -39 90 135 -10 11
3468A1o0O3J44k88K11o4n3l1L2L39k88k4Q1j53K72r4r9P8j16N8J02j75O9j49K20
$$ 11 -49 14 158 -130 81 17 -36 -67 -35 304 16 -8 73 -80 192 98 -1 77 -39 19 121 -54 15 -134 86
3493H6j39K73k27J8M5j79P6n7K57Q5k59q2J76o7Q6j1J37k76K46j29j96K25k36
$$ 86 -53 220 -7 11 56 -123 -47 -104 153 238 -21 -103 73 6 92 81 218 -58 188 59 -137 88 -148
3516a48J66o6k9K78j70kl0K6mj15R0r5K27q6p6J86j77K10J3k30k02K91j26O8j23
$$ -148 18 -48 -77 201 31 29 -1 25 21 -94 -4 -99 128 42 -34 152 -25 185 198 -32 -234 57 -69 -1 -124
3541a24J08j14J44L63n11J35J48J15m24j34K49N8K1Qk03J9L4j53K75j8j2kQ6n2
$$ -124 -16 -130 14 377 -134 1 149 264 -160 -294 -45 13 34 42 -161 -142 -108 -261 14 -4 -16 -18 68 16
3565A6lN5r6J10J63j21r1j01J23k09L00k21J48N3j38J67j80j1J82l8j1k22J99
$$ 16 13 68 -28 82 245 124 33 -68 55 -154 146 -75 73 126 -12 155 -25 -36 146 108 97 -125 74
3588G4j11k96M29k86J6J33J11l7L60l84j4L4J48j54j19J59j17j16l5K58j44on8
$$ 74 -37 -333 96 -190 -174 -41 70 33 393 9 -5 29 177 23 -96 63 -54 -170 -205 53 -91 -97 -155
3611a55R1L3J57m3r4R7J6j23lj5K61k27p4R9p8J65j21Q7j5j2j3qr7k0M7J8K15
$$ -155 -64 -31 126 83 -11 86 102 -21 -24 -39 222 -5 -79 20 -58 107 -14 73 58 46 33 25 -72 -92 -45 -27 188
3638A88k22j13K49Rk12n1K1K39l0J6q3j32P5K7j59J18J45q6J11k17K57j60J53
$$ 188 -34 -147 102 111 -101 -152 -131 108 78 94 11 -121 -46 -19 -178 -60 85 -1 110 -107 150 -10 143
3661A43J16m16K42Q9m8k19O5m3j07L39l42L60k64J42j10M2j5j04J82k08K33Kj44
$$ 143 259 -157 85 174 126 -93 -28 -71 -178 161 -181 179 -85 57 -53 -11 -26 -130 52 -156 77 79 -65
3684f5J41j18P8K19l07J02J8j56R7l1n9J62j07j96K78r2J33j23l3m2j87L11J3
$$ -65 76 -42 36 255 -52 50 68 -88 9 -22 -81 81 -26 -222 56 -36 97 -26 -59 -101 -288 23 36
3707C6k30J79N9n1J25q0l8J1k07K65r5r1O9k35L70o8k16K04J31j33K02m17Q0j2
$$ 36 -194 -15 44 -7 118 38 0 11 -196 69 -26 -117 -48 -283 87 19 -197 7 138 5 207 -210 -130 -142
3731a42K2J57k3M5J2j79P6l5K2J58j72m1J96n9p3J33%k82L41j53K6k87P4L8K23
$$ -142 -120 37 14 59 71 -108 -32 -67 -45 113 -59 -100 96 37 -36 97 97 -185 156 3 29 -258 -184 -146 77
3756G7j39m1K00k33P8j0J86j50L3j9K67j88k70K18J16j19P7j8p1P2r8k2k8n2K72
$$ 77 -62 -103 97 -136 -58 -68 118 -32 1 -18 249 61 -209 9 125 6 83 65 -6 66 -32 -54 -82 -134 138
3781A38k32J36J12k38J18j9j11J03R6r1Q2K3M3l05K34n3O0j4k15K35j78J14L57
$$ 138 -94 42 154 -84 34 15 -96 7 103 12 94 117 160 -145 89 36 96 82 -133 102 -76 38 395
3804C95m42R3oJ3O3m96L74O7r5K13j45jj48Q0K26k65j37L15k70J09J47r0o5j13
$$ 395 -47 46 40 53 116 -380 -6 61 -34 179 34 33 -115 -35 191 -74 -211 104 -166 -57 90 0 -65 -178
3828a78L09j69J9K7j2J73k62J86l9j58j1J62m2J99k91J44J93l40J28R8nj66j8
$$ -178 131 -38 -19 8 -4 169 -93 93 54 -104 -115 47 5 204 -87 57 250 -90 38 136 131 -35 -53
3851e3K39q9J04l21J33j07j03J64lP4jr8k8J1q6L73l17M4r9K36J2k89J42j06J31
$$ -53 186 97 201 -120 13 -94 -197 -33 -36 38 37 -61 -89 -78 -164 209 -108 -64 -163 73 85 -204 -62 -168 -37
3876c7N2o9N7r7R3j65J62j12M4L11k92J66j30m8r4J23L8LJ61k42L5J75J87k06
$$ -37 15 -54 3 -94 -1 -166 -4 -116 -72 239 -53 113 -17 -65 -159 -36 2 5 166 -76 -41 134 321 115
3900A15k38M1P5J96l71N9J20j53M4K78k62J06J67j44n9K6j35K55j61K01P7j67
$$ 115 -123 -82 -7 189 -182 -123 -3 -156 -112 166 -96 10 177 33 -26 0 -135 120 -41 160 237 70
3922G0o1n4J22q3p0K03k28O2j0l1OJ74k0N4m5O6q3n3p2J98r9O8k09m1L15j11M1
$$ 70 9 -45 77 -6 -76 127 -101 -39 -49 -80 -74 100 80 134 89 155 72 19 -53 145 46 114 -95 -136 179 68 109
3949A09j79o3O9O1O2j12r1J03L9L9Oj05K3N8p0K16j95J28k1k03K72j10k01J42
$$ 109 -70 -133 -64 -3 59 -53 -144 -41 -2 37 43 -62 -39 19 -51 165 -30 98 77 -126 146 36 -165 -23
3973b3n5J3K70l40K16j0j92J96k15K20j27o2L3Q5r4qK49M2l0k5j92Q2j67J65j23
$$ -23 -78 -65 205 -135 81 71 -121 75 -140 80 -47 -109 -76 9 -85 -93 156 198 168 143 -49 33 -134 31 -92
3998i2R4j52J19m9J59r5O7l3L4J2l5Rk28K21k7r0l4K69j96M9M0K2k18K14R2j03
$$ -92 2 -150 -31 -80 79 -16 51 18 52 64 29 38 -190 31 4 -86 -120 149 -47 2 42 64 -154 60 152 49
4024D9J77l33k5L53n0q3q9k80L74k37L91k97j85M24j14L8j16Lq7J42k6n3Q0k82
$$ 49 226 -107 -132 221 171 88 -1 -281 93 -144 247 -50 -235 189 75 113 -3 0 -87 55 29 -24 56 -226
4048b26J01P5j43R2Q5R2j68K84k09L32l97J70k05K23o3k0N7k9j16N9K31j32q9
$$ -226 -125 -50 -193 -101 -16 76 -92 192 -17 315 -82 88 -117 106 43 23 80 51 -65 -6 225 93 4
4071Dr5l4r1J92j77R3n1k2J45j5j02J93j66K13j25j3K94j79j30J11J04j01R6r2
$$ 4 -91 -125 -216 -24 -201 -108 -159 -181 -36 -51 -153 40 -126 87 -38 -51 243 64 -66 45 149 48 144 52
4095E2L8m3N2j88J77N6k83L07j30J24p7j19j6K63j47j02J08Jk6j59J36o0n7J41
$$ 52 90 47 99 -89 88 144 -139 168 38 162 85 -34 -50 213 66 -36 72 73 47 -112 24 -36 -93 48
4119D8j92o2M88j41j28j21K8J43o7J28m6j94K06q7O9j28K39q7l45N71l26m4Qo9
$$ 48 -144 -206 282 141 13 -108 -80 63 -4 124 78 -116 90 3 72 -56 183 96 -249 322 -4 -48 -40 -109
4143a09J0j0Q5J30n0j54R2P3P2l7j50O5j27J46m0jK4k12M2J49J3p6J73l63J94
$$ -109 -99 -109 -24 106 56 -98 -6 67 139 102 -48 17 -110 36 -4 -5 19 -193 -151 -2 11 -65 108 -255 -61
4168f1P1O2O0k07L2J15L6P1j36K4KQ5M2j56Q3j18p7J1Q2k0m3N6R0j44OJ1PQ5l7
$$ -61 10 72 132 -75 -43 72 108 179 43 67 69 154 196 40 123 5 -72 -61 21 1 -42 14 104 -40 -34 -23 -16 69 32
4197C2L7K6j52p4JJ21j18J20j32J19j51J22n5m3O1K71k27K26l12J00P6j92J68
$$ 32 69 95 -57 -131 -130 -9 -127 -7 -139 -20 -171 -49 -104 -147 -86 185 -42 184 -128 -28 48 -144 24
4220B4j38L30j38j44K25m1j98L1J87j84qJ27r8J18r2q5L17k37j53J95%l0K2Q1
$$ 24 -114 216 78 -66 159 118 -80 -49 138 -46 -54 73 -25 93 1 -84 233 -4 -157 38 38 8 30 111
4244A11m2n8k4L5pon6J7R1j0L7j59Q1R0j04N3J5j96K07k6q6O6o6p0J83k44oL02
$$ 111 69 11 -13 22 15 9 -47 -30 61 51 88 -71 10 100 -4 49 64 -132 75 49 -37 29 -37 -107 76 -168 -174 128
4272A28k50o6J19lK44l10K30Q2k24K70Qj51k03L59l13K10%k35j08M44q8j95j45
$$ 128 -122 -188 -69 -72 172 -138 92 174 -50 220 228 77 -126 233 -80 130 130 -105 -213 231 143 -52 -197
4295a97P7o2J61m8K8J32n8L6j21J78J4M5j95l9JK63j58q9J91j92j60M42j91j89
$$ -197 -120 -182 -21 -69 -41 91 33 69 -52 126 140 185 -10 -49 -48 215 57 -32 159 -33 -193 249 58 -131
4319a31o9J28J97k41J93M9n5j31K1J31QN0M4j17j15K27k01J96k32Q4l8p0J80M2
$$ -131 -200 -72 125 -116 77 126 71 -60 -39 92 100 150 194 77 -38 189 -12 184 -48 36 -2 -72 108 150
4343A50j87%J67j01q2q7L11j84j2j25J72J34j46J45k05q6K06k1o9J51j79M1j43
$$ 150 -37 -37 130 29 -53 -140 171 -13 -25 -150 22 156 10 155 -50 -136 70 49 -20 131 -48 -7 -150
4366a50J34l2n7N3K29o4j92J71p2M8J66m62J36O6R0M5J13l02Q2R2j3j21K80k92
$$ -150 -16 -48 -105 -52 177 113 -79 92 20 68 234 -228 -92 -26 64 109 222 -80 2 94 81 -40 240 -52
4390e2J6L8k1J34j12m2P3j85R6J71l3Pj74Q9J80k65L36k51R7l06Q1K19R3p2Kr6
$$ -52 -36 2 -19 115 3 -39 34 -151 -55 116 83 90 -84 5 185 -80 256 5 102 -204 -123 96 189 117 119 23
4416B3r8J84j06L4j52r9L70o5j28j2m3j2rJ2k17N41k51QJ00n5J10j16R1m0l5K14
$$ 23 -75 109 3 37 -115 -214 156 91 -37 -49 -92 -104 -113 -101 -318 223 -28 -20 80 25 135 19 110 70 35 249
4442B49j80M4R5m33J65J62j4k07O6j3J17n7J00j22n4O0o5P0K17P1k59j26J18j90
$$ 249 69 113 208 -225 -60 102 88 -119 -53 -66 51 -6 94 -28 -82 -22 -87 -17 200 271 12 -114 4 -186
4466a86J92q4jL7%j9Q8k3J04r8L3k9R4k19P4J71j51k87M91j48N6l12K58J13k05
$$ -186 6 -78 -79 -42 -42 -61 27 4 108 10 43 14 108 -111 -37 134 -17 -304 187 39 95 -217 41 154 -51
4491e1J53p3l8k01K70j39J78p5K55l19J09k91J18J07K7J85k15K67m01J27J2j70
$$ -51 102 29 -9 -210 60 -79 99 24 279 -40 69 -222 -104 3 30 215 0 267 -134 -7 5 -165
4513a65J49k06Q9K71j91O1n3R4o0j06J87k14j22M07k43O0K74m02J47O1N7J34k83
$$ -165 -16 -222 -133 138 -53 8 -45 49 -11 -117 70 -144 -266 141 -102 -42 232 -170 -23 38 95 229 -54
4536e4PL44l58J70k09J8M1n1J10J50k51O0J17jk15K82j04j57O6n6K71l30o8J29
$$ -54 -47 297 -61 109 -100 -82 -41 -92 18 168 -83 -23 94 93 -122 160 56 -101 -35 -91 180 -150 -218 -89
4560h9N3K5j4n8J47j41K7q9K23j19J37J7k64K68J03k83q2Q4j8P2J5j19J2KJ17
$$ -89 -36 -11 -25 -83 64 -77 -50 -139 84 -35 102 119 -145 123 226 -57 -139 -55 -73 -1 14 -105 -93 -91 26
4585B6ol20L75k49L03j85J30J10m1p3M9l0j99M0m6M5R1j30J24K0mk0J22k11P1
$$ 26 20 -300 75 -174 129 -56 74 184 143 70 119 89 -110 -70 -116 -71 20 -110 14 34 30 10 132 -79 -8
4610hK3j90K55MK2k23L63k86J9l2K11k76K0J22o2J4Mm9J01p7L8R8l35K54nK15
$$ -8 15 -175 80 84 106 -117 246 -40 -21 -53 158 -118 -98 24 -38 -24 -20 -69 32 -45 -7 91 -244 10 5 220
4636B20r5q5nn5JJ13K75l35j17J20M6j07R8k83K27q8j56J59NM2J23k7k43J61N5
$$ 220 125 40 35 -20 -19 94 369 34 -83 37 83 -24 74 -209 18 -70 -226 -67 -62 -20 103 76 -167 -6 49
4661D9j33J19J54q0k15J16j84P8P7K4L3k4J2L5j58J85k91P4J04Q4J4j20R8j57
$$ 49 -84 35 189 109 -106 10 -174 -96 -19 5 38 14 26 61 -97 88 -203 -129 -25 59 73 -47 51 -106
4685a06K25k60J53o9L0Q7P1L8j31P9j25J67l28K51o2l8J81l6j05n0J3r9mn0mQ3
$$ -106 119 -141 12 -57 -27 60 131 169 38 117 -8 159 -169 82 20 -18 163 127 22 -28 -15 -114 -118 -168 -172 -89
4711h9J13k51K57O4M7Rp2j10M5J13j73J43j24o4J66k10K86k59K64j21J18j71P1
$$ -89 24 -227 30 94 141 150 78 -32 13 126 -47 96 -28 -92 74 -136 150 -109 155 34 152 -19 52
4734E2j06K68l35Q0pj4L6J6Oo6J75Q7k44j03J11K1j63K63l9j30Q6J99j23k9n4
$$ 52 -54 214 -121 -41 -48 -62 -26 -10 -4 -70 105 192 -52 -155 -44 -23 -186 77 38 -92 -6 193 70 41 -13
4759a3K72k39J71k10J33m5O4j55J73j18j58J66r0J00o7J6o4P8j0j47K49j50j5
$$ -13 259 20 191 -19 114 69 133 -22 151 33 -125 41 -49 51 -16 0 -64 14 4 -143 106 -44 -59
4782e9O0j00J43j69K04j74K0n5L54l22r3J62R2j1nK00k18P4J8k59Q2J4Q7j58P8
$$ -59 1 -99 44 -125 79 -95 -75 -130 224 -98 -191 -29 63 52 47 247 29 103 121 -138 -56 -42 45 -113 -35
4807c5J36j47j30K91J04n0j25k11J12o1K99o9%k64K05op4K06j63J36k36Ml7L76
$$ -35 101 -46 -176 115 219 169 44 -167 -55 -116 183 114 114 -150 55 49 -25 181 18 154 -82 -78 -115 261
4831B61k76j16KJ0J62j29J46k03M1J99O1j26l8o5p8N3p2K66P5l23K65p3j28N4
$$ 261 -15 -131 -129 -119 43 -86 60 -143 -102 97 158 32 -6 -71 -149 -96 -168 98 173 -150 115 42 -86 -32
$$ [...]
8191c4
##END NTUPLES=NMR FID
##END=
