##TITLE=1H_IG-CPD-SiO2
 CDCl3
 8 sc, 
 12.12.2022
##JCAMPDX= 6.0         $$ Bruker NMR JCAMP-DX V2.0
##DATA TYPE= NMR FID
##DATA CLASS= NTUPLES
##ORIGIN= UXNMR, Bruker Analytische Messtechnik GmbH
##OWNER= root
$$ XWIN-NMR		Version 3.5
$$ Mon Dec 12 14:12:05 2022 Russian Standard Time (UT+4h)  she@DPX200
##.OBSERVE FREQUENCY= 200.13135
##.OBSERVE NUCLEUS= ^1H
##.DELAY= (6, 6)
##.ACQUISITION MODE= SIMULTANEOUS
##.ACQUISITION SCHEME= undefined
##.AVERAGES= 8
##.DIGITISER RES= 18
##SPECTROMETER/DATA SYSTEM= spect
##.PULSE SEQUENCE= zg30
##.SOLVENT NAME= CDCl3
##.SHIFT REFERENCE= (INTERNAL, CDCl3, 0, 15.7039)
##AUDIT TRAIL= $$ (NUMBER, WHEN, WHO, WHERE, WHAT)
$$ ##TITLE= Audit trail, XWIN-NMR		Version 3.5
$$ ##JCAMPDX= 5.01
$$ ##ORIGIN= Bruker BioSpin GmbH
$$ ##OWNER= she
$$ F:/spectra/data/she/nmr/H-F/1/audita.txt
$$ ##AUDIT TRAIL=  $$ (NUMBER, WHEN, WHO, WHERE, WHAT)
(   1,<2022-12-12 14:10:39.56 +0400>,<she>,<DPX200>,
      <created by zg, POWCHK disabled, PULCHK disabled
       configuration hash MD5:
       00 E9 B6 7A A2 85 ED C7 34 08 36 98 17 FE 4E 26
       data hash MD5: 16K
       BA C1 D6 65 9D CD AB 4B 48 68 32 B3 A5 80 A8 40>)
$$ ##END=
$$ 
$$ hash MD5
$$ F0 24 31 B8 4E 2F 9D 99 81 95 19 01 FD 43 2E FE
##$RELAX= 
##$RELAX= 
##$RELAX= 
##$RELAX= 
##$RELAX= 
##$RELAX= 
$$ Bruker specific parameters
$$ --------------------------
##$DU= <F:/spectra>
##$EXPNO= 1
##$NAME= <H-F>
##$PROCNO= 1
##$TYPE= <nmr>
##$USER= <she>
##$AMP= (0..31)
100 100 100 100 100 100 100 100 100 100 100 100 100 100 100 100 100 100 
100 100 100 100 100 100 100 100 100 100 100 100 100 100 
##$AQSEQ= 0
##$AQ_mod= 1
##$AUNM= <au_zg>
##$AUTOPOS= <>
##$BF1= 200.13
##$BF2= 200.13
##$BF3= 200.13
##$BF4= 200.13
##$BF5= 200.13
##$BF6= 200.13
##$BF7= 200.13
##$BF8= 200.13
##$BYTORDA= 1
##$CFDGTYP= 0
##$CFRGTYP= 5
##$CHEMSTR= <none>
##$CNST= (0..31)
1 1 145 1 1 1 1 1 1 1 1 1 1 1 1 1 1 1 1 1 1 1 1 1 1 1 1 1 1 1 1 1 
##$CPDPRG= <>
##$CPDPRG1= <>
##$CPDPRG2= <>
##$CPDPRG3= <>
##$CPDPRG4= <mlev>
##$CPDPRG5= <mlev>
##$CPDPRG6= <mlev>
##$CPDPRG7= <mlev>
##$CPDPRG8= <mlev>
##$CPDPRGB= <>
##$CPDPRGT= <>
##$D= (0..31)
0 1.2 0 0 0 0 0 0 0 0.06 0 0.03 0 0 0 0 0.0002 0 0 0 0 0 0 0 0 0 0 0 0 
0 0 0 
##$DATE= 1670839839
##$DBL= (0..7)
120 120 120 120 120 120 120 120 
##$DBP= (0..7)
150 150 150 150 150 150 150 150 
##$DBP07= 0
##$DBPNAM0= <>
##$DBPNAM1= <>
##$DBPNAM2= <>
##$DBPNAM3= <>
##$DBPNAM4= <>
##$DBPNAM5= <>
##$DBPNAM6= <>
##$DBPNAM7= <>
##$DBPOAL= (0..7)
0.5 0.5 0.5 0.5 0.5 0.5 0.5 0.5 
##$DBPOFFS= (0..7)
0 0 0 0 0 0 0 0 
##$DE= 6
##$DECBNUC= <off>
##$DECIM= 32
##$DECNUC= <off>
##$DECSTAT= 4
##$DIGMOD= 1
##$DIGTYP= 9
##$DL= (0..7)
0 120 120 120 120 120 120 120 
##$DP= (0..7)
150 150 150 150 150 150 150 150 
##$DP07= 0
##$DPNAME0= <>
##$DPNAME1= <>
##$DPNAME2= <>
##$DPNAME3= <>
##$DPNAME4= <>
##$DPNAME5= <>
##$DPNAME6= <>
##$DPNAME7= <>
##$DPOAL= (0..7)
0.5 0.5 0.5 0.5 0.5 0.5 0.5 0.5 
##$DPOFFS= (0..7)
0 0 0 0 0 0 0 0 
##$DQDMODE= 0
##$DR= 18
##$DS= 0
##$DSLIST= <SSSSSSSSSSSSSSS>
$$ [...]
##$SUBNAM2= <"">
##$SUBNAM3= <"">
##$SUBNAM4= <"">
##$SUBNAM5= <"">
##$SUBNAM6= <"">
##$SUBNAM7= <"">
##$SUBNAM8= <"">
##$SUBNAM9= <"">
##$SW= 18.05172834244
##$SWIBOX= (0..15)
0 0 2 0 0 0 0 0 0 0 0 0 0 0 0 0 
##$SW_h= 3612.71676300578
##$TD= 16384
##$TD0= 1
##$TE= 0
##$TE2= 300
##$TE3= 300
##$TEG= 300
##$TL= (0..7)
0 120 120 120 120 120 120 120 
##$TP= (0..7)
150 150 150 150 150 150 150 150 
##$TP07= 0
##$TPNAME0= <>
##$TPNAME1= <>
##$TPNAME2= <>
##$TPNAME3= <>
##$TPNAME4= <>
##$TPNAME5= <>
##$TPNAME6= <>
##$TPNAME7= <>
##$TPOAL= (0..7)
0.5 0.5 0.5 0.5 0.5 0.5 0.5 0.5 
##$TPOFFS= (0..7)
0 0 0 0 0 0 0 0 
##$TUNHIN= 0
##$TUNHOUT= 0
##$TUNXOUT= 0
##$USERA1= <user>
##$USERA2= <user>
##$USERA3= <user>
##$USERA4= <user>
##$USERA5= <user>
##$V9= 5
##$VALIST= <valist>
##$VCLIST= <CCCCCCCCCCCCCCC>
##$VD= 0
##$VDLIST= <DDDDDDDDDDDDDDD>
##$VPLIST= <PPPPPPPPPPPPPPP>
##$VTLIST= <TTTTTTTTTTTTTTT>
##$WBST= 1024
##$WBSW= 4
##$XGAIN= (0..3)
0 0 0 0 
##$XL= 0
##$YL= 0
##$YMAX_a= 499963
##$YMIN_a= -369063
##$ZGOPTNS= <>
##$ZL1= 120
##$ZL2= 120
##$ZL3= 120
##$ZL4= 120
##$ABSF1= 10
##$ABSF2= 0
##$ABSG= 5
##$ABSL= 3
##$ALPHA= 0
##$AQORDER= 0
##$ASSFAC= 0
##$ASSFACI= 0
##$ASSFACX= 0
##$ASSWID= 0
##$AUNMP= <proc_1d>
##$AZFE= 0.1
##$AZFW= 0.1
##$BCFW= 1
##$BC_mod= 2
##$BYTORDP= 1
##$COROFFS= 0
##$CY= 11.3945322036743
##$DATMOD= 1
##$DC= 2
##$DFILT= <>
##$DTYPP= 0
##$F1P= 2.36226072786647
##$F2P= -0.459571619588291
##$FCOR= 0.5
##$FTSIZE= 0
##$FT_mod= 4
##$GAMMA= 1
##$GB= 0.15
##$INTBC= 1
##$INTSCL= 1
##$ISEN= 128
##$LB= 0.24
##$LEV0= 0
##$LPBIN= 0
##$MAXI= 10000
##$MC2= 0
##$MEAN= 0
##$ME_mod= 0
##$MI= 1.114404
##$NCOEF= 0
##$NC_proc= 0
##$NLEV= 6
##$NOISF1= 3.799351
##$NOISF2= 2.8
##$NSP= 1
##$NTH_PI= 0
##$NZP= 0
##$OFFSET= 15.70392
##$PC= 1
##$PHC0= -19031.2
##$PHC1= 17.20072
##$PH_mod= 1
##$PKNL= yes
##$PPARMOD= 0
##$PSCAL= 0
##$PSIGN= 0
##$REVERSE= no
##$SF= 200.130013532006
##$SI= 16384
##$SIGF1= 3
##$SIGF2= 2
##$SINO= 400
##$SIOLD= 16384
##$SREGLST= <1H.CDCl3>
##$SSB= 0
##$STSI= 0
##$STSR= 0
##$SW_p= 3612.71676300578
##$SYMM= 0
##$S_DEV= 0
##$TDeff= 0
##$TDoff= 0
##$TI= <>
##$TILT= no
##$TM1= 0
##$TM2= 0
##$TOPLEV= 0
##$USERP1= <user>
##$USERP2= <user>
##$USERP3= <user>
##$USERP4= <user>
##$USERP5= <user>
##$WDW= 1
##$XDIM= 8192
##$YMAX_p= 0
##$YMIN_p= 0
$$ End of Bruker specific parameters
$$ ---------------------------------
##NTUPLES= NMR FID
##VAR_NAME=  TIME,          FID/REAL,        FID/IMAG
##SYMBOL=    X,             R,               I
##VAR_TYPE=  INDEPENDENT,   DEPENDENT,       DEPENDENT
##VAR_FORM=  AFFN,          ASDF,            ASDF
##VAR_DIM=   8192,          8192,            8192
##UNITS=     SECONDS,       ARBITRARY UNITS, ARBITRARY UNITS
##FACTOR=    0.0002768,     1,               1
##FIRST=     0,             0,               0
##LAST=      2.2672688,     0,               0
##MIN=       0,             -369063,         0
##MAX=       2.2672688,     499963,          0
$$ Real data points
##PAGE= N=1
##DATA TABLE= (X++(R..R)), XYDATA
0@%%%%%%%%%%qJ6j6J6j6K4l2L5m3N4o5P6r0J07j25J44j65J91k22K55k91L31l76
$$ 0 0 0 0 0 0 0 0 0 0 0 -8 8 -8 8 -8 16 -16 19 -24 30 -35 41 -49 58 -67 77 -88 103 -119 136 -155 176 -200
33b00M24m78N37o02O77p55Q39r33J037j151J273j404J550j713J889k079K288k521
$$ -200 224 -254 283 -319 358 -397 442 -491 546 -605 668 -736 814 -899 990 -1089 1199 -1322
51a322K779l064L380l739M144m603N135n756O496p389Q488r890J1741j4293J8051
$$ -1322 1457 -1607 1773 -1966 2178 -2425 2710 -3046 3450 -3939 4549 -5341 6400 -7893 10158
66A0158k4123L5468o3310K46420K95350p47435P2075N56885k54678l98350K32927
$$ 10158 -13965 21503 -41807 204613 499963 -247472 -175397 381488 126810 -271540 -38613
77c8613J49706j82148r8817J72558J14387j73396o7230K85492k8867l42848J54599
$$ -38613 111093 -71055 -169872 2686 117073 -56323 -123553 161939 133072 -209776 -55177
88e5177L27771k96518k40018L95517J27992m40838J1017M16040j71078l91787
$$ -55177 272594 -23924 -263942 131575 259567 -181271 -170254 245786 74708 -317079
98c17079K50487K92504k85844j83104L25355J69919k79846j08522L01039K1597
$$ -317079 -66592 225912 -59932 -243036 82319 252238 -27608 -136130 164909 186506
108A86506l64344N1835K96522k33704j97382L54735N7723l37244J28395L07001
$$ 186506 -177838 -126003 170519 -63185 -260567 94168 151891 -185353 -56958 250043
118B50043j86241k37572J75772J82897j95855j98551K26128J77045k87229q6419
$$ 250043 63802 -173770 2002 184899 -10956 -209507 16621 193666 -93563 -179982
128a79982L39305m0088l28177J54894K49140k38056j53732K88550R3678k75673
$$ -179982 159323 119235 -208942 -54048 195092 -42964 -196696 91854 185532 -90141
138i0141o531K71335p4049k63623J09155J76509j84389j24748K20638R2437k11366
$$ -90141 -96672 174663 100614 -163009 -53854 122655 -61734 -186482 34156 126593 -84773
149h4773p616K70023m1009k90683J19559K44814k47971j87635K93167O1603k78151
$$ -84773 -92389 177634 136625 -154058 -34499 210315 -37656 -225291 67876 129479 -148672
160a48672O2446K31447j09063j56413J23281J19279j33702j21557J63378J19760
$$ -148672 -86226 145221 36158 -120255 3026 122305 -11397 -132954 30424 150184
170A50184k08599o7778K57952j7205k71130R9898K08828j98458j38579K49785
$$ 150184 -58415 -126193 131759 114554 -156576 -56678 152150 -46308 -184887 64898
180F4898N5132k44387O1239K47140j21678j99669J57060J29713j90968j09601
$$ 64898 120030 -124357 -63118 184022 62344 -137325 19735 149448 -41520 -151121
190a51121J72895P8335j77109m2149K17594O710k25284Q4978K04604j85594j40541
$$ -151121 21774 100109 -77000 -119149 98445 105155 -120129 -35151 169453 -16141 -156682
201a56682K35227K9944k35376O4753J94610j07809j39355J18621J03418j34738
$$ -156682 78545 108489 -126887 -62134 132476 24667 -114688 3933 107351 -27387
211b7387r9285J59152Q1708j94613k1570K38350m1249k28535J13443J76342j80141
$$ -27387 -126672 32480 114188 -80425 -101995 136355 95106 -133429 -19986 156356 -23785
222b3785j27705J89362N3735j86720J4651J84710n2247j49460J05654J20517j53216
$$ -23785 -151490 37872 91607 -95113 -80462 104248 52001 -97459 8195 128712 -24504
233b4504r5059J77173M1456k08350J2791K22457o7689j99718J31647J57921j73516
$$ -24504 -119563 57610 99066 -109284 -96493 125964 58275 -141443 -9796 148125 -25391
244b5391j01310J79111L8950j65488O352J51069k6437j35100N4798J28370j03522
$$ -25391 -126701 52410 91360 -74128 -67776 83293 56856 -78244 -23446 104924 1402
255A402j22223J49038P2113j95983L642K16559p4685j80750J44856J30986j79467
$$ 1402 -120821 28217 100330 -95653 -92011 124548 49863 -130887 13969 144955 -34512
266c4512q1763J75571K7310j74311N109J66420l0977j47108P2037J31796j06480
$$ -34512 -116275 59296 86606 -87705 -82596 83824 52847 -94261 -22224 109572 3092
277C092j01682J32289N1628j55196p98J59616m9525j41407J02515J14931j41176
$$ 3092 -98590 33699 85327 -69869 -70667 88949 39424 -101983 532 115463 -25713
288b5713p9896J58691L1735j70925Q269J70988m0832j54321Q3284J39239j19073
$$ -25713 -105609 53082 84817 -86108 -77839 93149 52317 -102004 -18720 120519 1446
299A446j10767J44542N7022j68077k757J64610n0863j34102J02336J01397j27248
$$ 1446 -109321 35221 92243 -75834 -78591 86019 35156 -98946 3390 104787 -22461
310b2461o1135J36483J8681j45468J1096J42365m3057j30770Q1860J16895j11848
$$ -22461 -83596 52887 71568 -73900 -62804 79561 36504 -94266 -12406 104489 -7359
321g359q7522J34328M4142j51919k561J50625m0289j32486Q5111J10130j14597
$$ -7359 -94881 39447 83589 -68330 -70891 79734 39445 -93041 -7930 102200 -12397
332a2397p4517J32064K8332j45495J0109J40103m9650j22821R1472J05193j18247
$$ -12397 -86914 45150 73482 -72013 -61904 78199 28549 -94272 -2800 102393 -15854
343a5854p1701J38422K8166j51873R951J41780n0094j20149Q4812R7868j02659
$$ -15854 -87555 50867 79033 -72840 -62889 78891 28797 -91352 -6540 91328 -11331
354a1331o6926J18344L3978j34972k617J38783m0226j30918Q8072J10451j21233
$$ -11331 -78257 40087 74065 -60907 -63524 75259 35033 -95885 -7813 102638 -18595
365a8595o7686J40236J7225j43794K1550J25257n5312j03041Q1993Q6759r6365
$$ -18595 -86281 53955 71180 -72614 -51064 74193 18881 -84160 -2167 84592 -11773
376a1773o2571J14769L4905j34074n878J37052l7310j29867Q2054J09742j12793
$$ -11773 -74344 40425 75330 -58744 -64622 72430 35120 -94747 -12693 97049 -15744
387a5744o6780J34821J9141j39421K1688J20726n9080r8036Q2785P6984r2987
$$ -15744 -82524 52297 71438 -67983 -46295 74431 15351 -82685 100 77084 -15903
398a5903n1973J06935K9008j22142k895J26807l8752j22884Q2764J03682j13993
$$ -15903 -67876 39059 68067 -54075 -56970 69837 31085 -91799 -9035 94647 -19346
409a9346o2735J35410J9486j39880J6491J24516n2652j07324P9374Q6831r5257
$$ -19346 -82081 53329 72815 -67065 -50574 73942 21290 -86034 -6660 80171 -15086
420a5086n4561J12363K3853j20028O679J13759m3982j05429P4671Q7575r8053
$$ -15086 -69647 42716 66569 -53459 -46780 66979 22997 -82432 -7761 79814 -18239
431a8239n5223J19303K0975j25718J4247J14762n0507r9824P5013Q0138r0245
$$ -18239 -73462 45841 66816 -58902 -44655 70107 19600 -80224 -5211 74927 -15318
442a5318n3828J08502K8885j20651K212J19755m4842j09916Q0394Q2816j01936
$$ -15318 -69146 39356 68241 -52410 -50198 69557 24715 -85201 -4807 78009 -23927
453b3927m2243J13745R311j09390J7082R7434m2894r1274O2385Q0122q3068n8628
$$ -23927 -66170 47575 56886 -52504 -35422 62012 19118 -72156 -9771 70351 -12717 -71345
465g1345J08135L2766j22222L547J21656m8105j10462Q3676Q0338j07139l6980
$$ -71345 36790 69556 -52666 -49119 72537 24432 -86030 -2354 77984 -29155 -66135
476f6135J17835m86j06466K9961Q5552m9187p2760N5480O3901o7146n5229R2595
$$ -66135 51700 51214 -55252 -25291 60261 11074 -61686 -6206 57695 -9451 -64680 27915
488B7915M0306j15720l457J25303m8075j13260Q9419P4494j10992k7547J11742
$$ 27915 68221 -47499 -50956 74347 26272 -86988 2431 76925 -34067 -61614 50128
499E0128n909r5448K6954P9614m2030p3559N4255O5002p3411m8052R7083K4782
$$ 50128 44219 -51229 -24275 55339 13309 -60250 -5995 59007 -14404 -62456 34627 59409
511E9409j08620J0550J07943m9552r6547P8244O8227r9529l3867J09059L190j01558
$$ 59409 -49211 -38661 69282 19730 -76817 1427 69654 -29875 -63742 45317 48507 -53051
523e3051K6010Q9630m7521p8259O2113O3413q0631m5731R9607J9651j09074J7796
$$ -53051 -27041 62589 15068 -63191 -1078 62335 -18296 -64027 35580 55231 -53843 -36047
535c6047J04296n4978q4302P8357N4230q7494k6746Q9405R034q7860R839Q9272
$$ -36047 68249 13271 -71031 7326 61556 -25938 -52684 36721 45755 -42105 -32266 57006
547E7006l5371q8689O2473P0745q9933m0399J05516O758j01438K7445R0456n1747
$$ 57006 21635 -67054 -4581 66164 -23769 -64168 41348 48106 -53332 -25887 64569 12822
559A2822p5175O7710N4338q3565l3030R2731P496r3407J9941Q8013m1843p6527
$$ 12822 -62353 5357 59695 -23870 -56900 35831 43327 -50080 -30139 57874 16031 -60496
571f0496N9969O1966p7018m3257R3865J7729j03759J6327J00334n2335q2876P6981
$$ -60496 -527 61439 -15579 -58836 35029 52758 -51001 -34674 65660 13325 -69551 7430
583G430N2304q9736k1722R1790j038q5107K2260P9721m0604p1660N7799N5757
$$ 7430 59734 -30002 -51724 40066 39028 -46079 -23819 55902 15298 -56362 1437 57194
595E7194p7013l7663Q9190J4583r4624J3036R4798m0913q3051O9837N9870r1118
$$ 57194 -19819 -57482 31708 46291 -48333 -35297 59501 18588 -64463 5374 65244 -25874
607b5874k7393R6772o572q7057L0808O8982m4096n5568N1036M8388o2521m0113
$$ -25874 -53267 43505 36933 -50124 -19316 49666 5570 -49998 1038 49426 -13095 -53208
619e3208Q1700K2091r6098J2395R6774n1030p8491P7604M5792q8293j6500Q3670
$$ -53208 28492 50583 -45515 -33120 63654 12624 -65867 11737 57529 -30764 -47264 36406
631C6406m485p5156K0484P1906l5068o7526N4866N6978p5493l6617Q8808P118
$$ 36406 31921 -43235 -22751 49155 14087 -53439 1427 58405 -17088 -53705 35103 42221
643D2221r2162K3008Q3888m9011o7329O7103M5623p6020k1390P8323L48p4596
$$ 42221 -49941 -26933 56955 7944 -59385 7718 53341 -22679 -44069 34254 34602 -39994
655c9994J7733O9715l4014o4965N0601N3980p1096l4265Q7740M478r1111K9660
$$ -39994 -22261 47454 13440 -51525 -924 53056 -18040 -52305 35435 39913 -51198 -21538
667b1538P9339n4414n5662O5077L1656o6132j6260O5597N555o9939Q536P5207
$$ -21538 57801 3387 -52275 12802 44458 -21674 -37934 27663 33218 -36721 -28185 47022
679D7022l1083p1338N8289N3083p9465k4127Q7017n204q0817K8361O7887m4599
$$ 47022 15939 -55399 2890 55973 -23492 -47619 39398 34194 -46623 -18262 49625 5026
691E026n4148N6847L9056o8165k1538P5791P55p5918K1650O8787m1432n6192N6940
$$ 5026 -49122 7725 46781 -21384 -42922 32869 33624 -42294 -20644 48143 6711 -49481 7459
704G459M0085o8841k1716P5915M37p5922K2865O8876m3532n5324N8631L7857o8335
$$ 7459 47544 -21297 -43013 32902 33339 -42583 -19718 49158 5626 -49698 8933 46790 -21545
717b1545j9895P2746O69p2744K0587O7794m0756n5484N7019L7582o6490j8098
$$ -21545 -41440 31306 31975 -40769 -20182 47612 6856 -48628 8391 45973 -20517 -38615
729c8615O8769j303o7613J9480O3632l8067n4883N6312L9120o9698j6215P4556
$$ -38615 30154 28851 -38762 -19282 44350 6283 -48600 7712 46832 -22866 -39081 35475
741C5475p502o9463K6988N9360m0184m9207M9665L8403o1001k5068P1899M835
$$ 35475 27973 -41490 -14502 44858 4674 -44533 5132 43535 -17466 -42534 29365 34200
753C4200p6730K1487P1577m4792n4217O0393L1539o6164j1330O3880o070o0787
$$ 34200 -42530 -21043 50534 5742 -48475 11918 43457 -22707 -34037 29843 23773 -37014
765c7014K0176N6574l4781m8834N1238L6883o4260j8074P2049l542p1800K4202
$$ -37014 -16838 39736 4955 -43879 7359 44242 -20018 -38092 33957 30415 -41385 -17183
777a7183O3138m2463m9716N4671L2375o1672j4582O3850j839o1332J8177N7219
$$ -17183 45955 3492 -46224 8447 40822 -20850 -35432 28418 26579 -34753 -16576 40643
789D0643l3161m9110M8535L5609o2598j6977O8835p404o6985K9931N6088m5698
$$ 40643 7482 -41628 6907 42516 -20082 -37059 31776 24372 -42613 -12682 43406 -2292
801b292l9734N5584K6096n9339j3558O2830K74o6768J5478O4797l6153n5318N4344
$$ -2292 -42026 13558 39654 -19685 -33243 29587 29861 -36907 -21429 43368 7215 -48103 6241
814F241L6637o4397j2710O5589q277n8321K4887M8739l6823l8952M6455K7292
$$ 6241 42878 -21519 -34229 31360 23083 -35238 -10351 38388 1565 -37387 9068 36360
826C6360n5920j3465O1689m896o2724K4345N7216m1104m4847N5012L0391o2288
$$ 36360 -19560 -33025 28664 23768 -38956 -14611 42605 1501 -43346 11666 42057 -20231
838b0231j3553O4517l941o3096J8753N5400l3234m4966M4868L1928n2469j4773
$$ -20231 -33784 30733 26792 -36304 -17551 37849 4615 -40351 4517 36445 -16024 -30797
850c0797N8188l322n7921K2513N1129m0491l9206N2469K2695n8827n961N9617
$$ -30797 27391 24069 -33852 -11339 39790 -701 -39907 12562 35257 -23570 -29531 30086
862C0086r273n7033K3432N2596l6985m4371N0714L2227o0819j4942O4689m527
$$ 30086 20813 -36220 -12788 39808 2823 -41548 9166 41393 -19426 -34368 30321 25794
874B5794o2112K1006N2339l4614m0148M4338K7168n0234j1189N4732n459n4361
$$ 25794 -36318 -15312 37027 2413 -37735 6603 33771 -16463 -27652 27080 21621 -32740
886c2740K2715M7527l9032l6827M9701K2310n5519o845N7551p636n5433K2524
$$ -32740 -10025 37502 -1530 -38357 11344 33654 -21865 -28710 28841 21205 -34228 -11704
898a1704N0041l6709m0486M8275K6985n5583j1163N7731m637n5442J8897M8923
$$ -11704 38337 1628 -38858 9417 36402 -19181 -30344 27387 22750 -32692 -13795 35128
910C5128l2292l9498M3855K6547n1720r378N5762q356n3526K4808M5574l9095
$$ 35128 2836 -36662 7193 33740 -17980 -27358 28404 20048 -33478 -8670 36904 -2191
922b191l5305M8416K2169n4170p039N6639p885n3560K2981M6156l5933l6047M4896
$$ -2191 -37496 10920 33089 -21081 -28120 28519 20634 -32926 -9945 36211 278 -35769 9127
935I127K3452n1056r978N4625m325n4200K0041M8642l5247l7643M6473K2068n1756
$$ 9127 32579 -18477 -28455 26170 21845 -32355 -12314 36328 1081 -36562 9911 31979 -19777
948a9777n186N2061r385m8325K1919M2444l3791l5103M3747K3466n1200q016N4262
$$ -19777 -24963 27098 17713 -30612 -8693 33751 -40 -35143 8604 32070 -19130 -27146 27116
961B7116q073n0348K3285M2161l5461l2115M3636J9959m9896o661N3427p717n1780
$$ 27116 19043 -31305 -8020 34141 -1320 -33435 10201 30160 -19736 -26397 27030 19313 -32467
974c2467K2980M5296l6062l4578M4781K0897m9872o568N1683p754m9551K2609
$$ -32467 -9487 35809 -253 -34831 9950 30847 -19025 -25593 26090 18336 -31215 -8606
986h606M3353l6228l2749M5377J8264m9640l286M9180r532m4946K1407L9457l2367
$$ -8606 34747 -1481 -34230 11147 29411 -20229 -23515 25665 16133 -28813 -7406 32051 -316
999c16l2196M1977K0674m9815o368N2874q776m9517K3258M2258l4404l2131M2085
$$ -316 -32512 9465 30139 -19676 -26044 26830 18054 -31463 -8205 34053 -351 -32482 9603
1012I603J9336m7340n525M8723q977m5133K2834L7931l3471k8402M0571J7367
$$ 9603 28939 -18401 -23926 24797 15820 -29313 -6479 31452 -2019 -30421 10150 27517
1024B7517m5759n688M8848p671m7935K3167M1994l7063l0365M5707J5108m8824
$$ 27517 -18242 -23930 24918 17247 -30688 -7521 34473 -2590 -32955 12752 27860 -20964
1036b0964j275M7130r594m3247J9735L9470k9860l2854M0158K0781m8510m821
$$ -20964 -22239 24891 15297 -27950 -8215 31255 1395 -31459 8699 29480 -19030 -23851
1048b3851M9984j2291m4285K6579L4754l5273k3935M0169J3430m3601l220M5203
$$ -23851 26133 13842 -30443 -3864 30890 -4383 -28318 11851 25281 -18320 -21540 23663
1060B3663q343m3815K1126L8908l2614k9873M1310J7524m6948l967M8050j0208
$$ 23663 15320 -28495 -7369 31539 -1075 -30948 10362 27886 -19062 -23029 25021 14813
1072A4813m4127K3982L6218l3944k4810L9484J2326m1904j513M1620q992m0303
$$ 14813 -29314 -5332 30886 -3058 -27868 11616 23942 -17962 -19475 22145 13153 -27150
1084b7150K0860L6987l2920k8298M3349J4381m8595J156M6292j4752l9515K4143
$$ -27150 -6290 30697 -2223 -30521 12828 27209 -21386 -20230 26062 11310 -28205 -4062
1096d062L2293l0220k5369L6382J7354m3082o020M6753r161m4437K4594L5795
$$ -4062 28231 -1989 -27358 9024 26378 -16704 -22724 24029 14868 -29569 -4975 30820
1108C0820l5271k3073M0208J0356m1378P8M0405j0028l8331K0707L4036l0654
$$ 30820 -4451 -27524 12684 23040 -18338 -18260 22145 12117 -26214 -5507 28529 -2125
1120b125k5375L8549J3445m2731j090M2136j0903l8605K1691L2999l0419k4036
$$ -2125 -27500 11049 24494 -18237 -19327 22809 11906 -26699 -5008 27991 -2428 -26464
1132b6464L7632J3002m1718j241M1429j0625l8671K1175L3388l0474k5102L8810
$$ -26464 11168 24170 -17548 -18789 22640 12015 -26656 -5481 27907 -2567 -27669 11141
1144A1141J3999m3789n60M3369j2870l7699K3178K9160k9312k0570L3259J2655
$$ 11141 25140 -18649 -19209 24160 11290 -26409 -3231 25929 -3383 -23953 9306 21961
1156B1961l7287m207M0300p647l9767K1807L3744l3237k1501L9581Q211l9966
$$ 21961 -15326 -19533 20767 13120 -26647 -4840 28904 -4333 -25834 13747 21958 -18008
1168a8008K115L6326j0531l3833J7838L1366k6424k5598L6327J6074m2197k223
$$ -18008 -15893 20433 9902 -23931 -6093 25273 -1151 -26749 9578 25652 -16545 -18768
1180a8768M2065j2038l6770K2349K7921k8969j9072L2502J0504l4669j368L5686
$$ -18768 23297 11259 -25511 -3162 24759 -4210 -23282 9220 19724 -14945 -16313 19373
1192A9373q638l4203J9481L0292k8661k2423L5976J1599m0481K95L9666j3397
$$ 19373 10735 -23468 -3987 26305 -2356 -24779 11197 22796 -17685 -17390 22276 8879
1204H879l5544K3562K7978k9280j8045L3085J0355l4231k660L5411o633l6703
$$ 8879 -26665 -3103 24875 -4405 -22450 10635 20990 -13241 -15901 19510 12877 -23826
1216b3826J6665L2458k8508k2977L7018R546l8588M641L5310j3797k9057J9289
$$ -23826 -7161 25297 -3211 -26188 10830 20376 -18212 -13571 21739 7942 -21115 -1826
1228a826K3891k3704j9782K9286J3365l6293l791L9258r782l6525K2438K8197
$$ -1826 22065 -1639 -21421 7865 21230 -15063 -18854 20404 10622 -25903 -3465 24732
1240B4732k9956j6174L4022O902l3595P47L1963q718l1309J5496K7032k4459k0731
$$ 24732 -5224 -21398 12624 19526 -14069 -13322 18641 9923 -21386 -5890 21142 -3317 -24048
1253b4048L2473J2328l5773j65L6775j0801l2919K0601K5469k8753j7498L2169
$$ -24048 8425 20753 -15020 -15185 21590 10789 -22130 -1529 23940 -4813 -22311 9858
1265I858P945l3391O23L2405q677k9938J7394K6912k5287j9908L2909J0327l6286
$$ 9858 17803 -15588 -14965 17440 8763 -21175 -3781 23131 -2156 -22064 10845 21172 -15114
1278a5114J415L4114j3314k9738J9887K2125k4242j5912K7942J1283l0005k560
$$ -15114 -13699 20415 7101 -22637 -2750 19375 -4867 -20779 7163 18446 -11559 -14119
1290a4119L3844p352l3739J8233K7032k8726j8065L2244O488l1911L304L0191
$$ -14119 19725 12373 -21366 -3133 23899 -4827 -22892 9352 15840 -16071 -12767 17424
1302A7424r519k6648J6277K3852k2778j8456K9231R686l3893P28L3499j2003l0032
$$ 17424 7905 -18743 -2466 21386 -1392 -19848 9383 19069 -14824 -14096 19403 7400 -22632
1315b2632J9926K2764k5646j4499K9697P516l0212J578L0910r432k9141J6582
$$ -22632 -2706 20058 -5588 -20087 9610 17126 -13086 -11508 19402 9970 -19171 -2589
1327b589K3347k5249j7573K9907Q451l2179K336L2433j0615k7064J8993K0729
$$ -2589 20758 -4491 -22064 7843 16294 -15885 -13549 18884 8269 -18795 198 20927
1339B0927k4368j4320K6613O794k9135l07K9875p926k8820J7487K4290k5871j5400
$$ 20927 -3441 -17761 8852 15646 -13489 -13796 16079 8153 -20667 -3180 21110 -4761 -20161
1352b0161L1414N245l1039N023K7919j1894k3765J5839J9041k1204j6323K5706
$$ -20161 11253 16498 -14541 -9518 18401 6507 -17258 -1419 17622 -3582 -19905 5801
1364E801J0308k9901l55L2833r342k8721J9867K1499k6629j3441K7792L848k8324
$$ 5801 16109 -13792 -14147 18686 9344 -19377 490 21989 -4640 -18081 9711 13559 -14765
1377a4765K938K6991r116k4172J6362K1138k2297j4957K7291O840k9713K174K8978
$$ -14765 -11827 15164 6048 -18124 -1762 19376 -2921 -17878 9413 16253 -13460 -11286 17692
1390A7692j0953k5646J7902J9563k3636j3164K6304N774k7089K008K7615q190
$$ 17692 6739 -18907 -1005 18558 -5078 -18242 8062 13836 -13253 -11245 16370 8180
1402H180k4852J5688K0979k2801j5428K6704N593k9244L491K7380j1016k1788
$$ 8180 -16672 -984 19995 -2806 -18234 8470 14063 -15181 -11690 15690 4674 -17114
1414a7114J7432J7103k0265j1812K2671O282k5791l86K7080q138k5779J7132K0580
$$ -17114 318 17421 -2844 -14656 8015 14297 -11494 -11880 15200 7062 -18717 -1585 18995
1427A8995k4173j2241K7440L152k7061M874K4920j0517k1194J5882J7319k0815
$$ 18995 -5178 -17419 10021 13173 -13888 -9014 15906 5389 -15805 77 17396 -3419
1439c419j2694K3905N252k6396K171K5836r264k2005J6427J7884k0811j1718K3839
$$ -3419 -16113 7792 13044 -13352 -11181 14655 5391 -16614 -187 17697 -3114 -14832 9007
1452I007M259k5880K589K4557j0122k1316J6587J6663k0683j0297K3591L593k4706
$$ 9007 13266 -12614 -10025 14532 4410 -16906 -319 16344 -4339 -14636 8955 12548 -12158
1465a2158L337K3675j0183k0569J6213J5779k0439j0118K2526L750k3833K221
$$ -12158 -8821 14854 4671 -15898 315 16094 -4345 -14463 8063 11813 -12020 -9799
1477i799K3640q526k1419J5773J7675k1383j0714K4671K137k5297N091K2236j1261
$$ -9799 13841 5315 -16104 -331 17344 -4039 -14753 9918 12055 -13242 -8151 14085 2824
1490B824j8306J5838J4443j8828r321K1929L505k3697L186K2835j0435j9818J6224
$$ 2824 -15482 356 14799 -4029 -13350 8579 12084 -11613 -8427 14408 3973 -15845 379
1503C79J4928k0030r186K2457L070k3561L291K2964j0172k0048J6644J5100k0827
$$ 379 15307 -4723 -13909 8548 11618 -11943 -8652 14312 4140 -15908 736 15836 -4991
1516d991q339K2699J360k2595M315K0680r722j8143J4796J4588j8758r078K1841
$$ -4991 -13330 9369 10729 -11866 -7551 13129 3407 -14736 60 14648 -4110 -13188 8653
1529H653K724k2791L744K1336j0171j8601J5458J4332j9692q516K2722J735k3253
$$ 8653 11377 -11414 -7670 13666 3495 -15106 352 14684 -5008 -13524 9198 10933 -12320
1542a2320N393K1182j1673j7241J5976J2628j8693p809K0607K830k1859K842K1598
$$ -12320 -6927 14255 2582 -14659 1317 13945 -4748 -12557 8050 10880 -10979 -8137 13461
1555A3461r390j9233J5532J4486j9705q045K1726J629k1736M264K0183r981j7580
$$ 13461 4071 -15162 370 14856 -4849 -12894 8832 10461 -11275 -7011 13172 3191 -14389
1568a4389J5036J3287j9008p290K1041J044k0712M646J8819r387j6402J3373J3350
$$ -14389 647 13934 -5074 -12364 8677 9721 -10991 -6345 12474 3087 -13315 58 13408
1581A3408j7220r056K0559L212k1948L711K0626j0136j7007J4740J2228j7547
$$ 13408 -3812 -12868 7691 10903 -11045 -7334 13292 3156 -13851 889 13117 -4430
1593d430p241J9330K196k0172L336J9670r407j7205J4762J2541j8331o706J9777
$$ -4430 -11671 7659 9855 -10317 -6981 12689 3282 -13923 839 13380 -4951 -11657 8120
1606H120J049j9391M035J8004q723j5825J3008J2360j6746p545J9153J936j9533
$$ 8120 9169 -10222 -6187 11817 3094 -12731 277 12637 -4109 -11654 7499 9435 -10098
1619a0098L790J8289r033j5712J3523J1708j7039o546J9053P12j8871M820J6912
$$ -10098 -6308 11981 2948 -12764 759 12467 -4572 -11118 7935 8647 -10224 -5404 11508
1632A1508r137j4180J2224J1269j4917q067J7710L596j9663K652J9258r426j5860
$$ 11508 2371 -11809 415 11684 -3233 -11300 6410 10006 -9657 -7005 12253 2827 -13033
1645a3033J4699J0110j7207m093J7168n17j6070M090J5143p563j4113J1711J1437
$$ -13033 1666 11776 -5431 -9524 7644 7127 -8943 -4853 10290 2727 -11386 325 11762
1658A1762j5825o854J8460R04j8559N022J6563r615j3518J2903R884j5251o143
$$ 11762 -4063 -10917 7543 8447 -10112 -5090 11473 1858 -11660 1243 11127 -4124 -10267
1671a0267J6928J790j7503L102J6672p880j4302J1989J0738j5272o186J7400Q77
$$ -10267 6661 8451 -9052 -5950 10722 2842 -11460 529 11267 -4005 -10191 7209 8086
1684H086j7740M660J6186r401j3015J2649Q950j4517m981J5388J167j5792L138
$$ 8086 -9654 -4994 11192 1791 -11224 1425 10375 -4142 -9123 6265 7432 -8360 -5222
1697e222J5572p969j3673J2582R733j5775m785J6618J15j5767L408J4625o372
$$ -5222 10350 2381 -11292 1290 11023 -4752 -9537 7081 7196 -8571 -5163 9462 3090
1710C090j3435R835J1681j4027q044J7648K075j8785M731J6793j0307j2422J3332
$$ 3090 -10345 -510 11171 -2856 -10900 6748 8823 -9962 -5231 11562 1255 -11167 2165
1723B165P633j4234l616J4133K34j3937L380J3421p446j1831J1474Q864j4594
$$ 2165 9798 -4436 -8052 6081 6315 -7622 -4242 9179 1733 -10098 1376 10240 -4354
1736d354m922J6116N07j6212L644J5147p287j3029J0519J0098j2958o385J4521
$$ -4354 -9276 6840 7347 -8865 -5221 9926 2639 -10390 129 10227 -2731 -9116 5405
1749E405K137j5355K395J4992p148j3096J1547R390j4436m148J5214j239j3872
$$ 5405 7542 -7813 -5418 9574 2426 -10670 877 10267 -4169 -8317 6897 5658 -8214
1762h214N410J1353q058r083R919P320j2055n250J4809J680j6705L295J6087q413
$$ -8214 -2804 8549 491 -8592 1327 8647 -3408 -8658 6151 7831 -8874 -5579 10508 2095
1776B095j2646J1739P875j2623l321J2012L44j1525J786J1403m661j1278Q626
$$ 2095 -10551 1188 9063 -3560 -6881 5131 5475 -6050 -4264 7139 2478 -8800 -174
1789a74R634j2613n522J5331J20j5373N234J2860r622r342J2246N530j3448j938
$$ -174 9460 -3153 -8675 6656 6776 -8597 -3363 9497 -125 -9467 2779 8309 -5139 -7077
1803g077J3860j000j3386L746J2155o549j0469R055P855j0930m340J2173M15j2019
$$ -7077 6783 5783 -7603 -3857 8298 1749 -8720 335 8190 -2740 -7080 5093 5508 -6511
1817f511L608J0491p286q596R809O460j1703l622J3432L59j4211M127J3305r323
$$ -6511 -2903 7588 302 -8294 1515 7975 -3728 -7350 6082 6441 -7770 -3643 9662 339
1831C39j0632J2961N888j4309p28J3647k795j1511M877R786o351r156P977P663
$$ 339 -10293 2668 8556 -5753 -6481 7166 4371 -7140 -2263 7523 1172 -7984 -7 7656
1845G656j0438m464J2912j96j3100N596J1052r962p742J1756L916j2116p38J2216
$$ 7656 -2782 -7246 5666 5470 -7630 -2034 9018 -944 -8686 3070 6986 -5130 -5868 6348
1859F348j367j1842L865J1290o967j0212R723P182j2284l139J3861p52j3329M927
$$ 6348 4981 -6861 -2996 8294 1327 -8885 838 8020 -4264 -7403 6458 5706 -7623 -2696
1873b696J1555q269r123J0142N474j1575j923J2406j336j1820N334J0605r125
$$ -2696 8859 590 -8533 1609 7083 -4492 -6415 5991 4655 -7165 -1831 8774 -351
1886c51q340J1741M342j3380k53J3154k776j0947N062R009o255q023P189O775
$$ -351 -8691 3050 7392 -5988 -6241 6913 4137 -6810 -1748 7261 1006 -7017 172 6947
1900F947r659n103J2581J927j3951L716J3324r083j0113J2119M875j3351l18J2349
$$ 6947 -2712 -7815 4766 6693 -7258 -3542 9782 699 -9414 2705 7580 -5771 -6089 6260
1914F260k756j0214N551Q888p587p474R263M934j1374k066J2164j180j1250M824
$$ 6260 3504 -6710 -1159 7729 142 -7332 1931 6865 -4509 -6575 5589 4409 -6841 -2017
1928b017R988p266p932Q642N153j0246k735J1068j9j0903L706J0634o840q945
$$ -2017 7971 705 -7227 1415 6568 -3678 -6413 4655 4636 -6267 -2561 8073 1233 -7712
1942g712R370N671j1811k196J2299j606j1087N480R540p739o952Q958L954j0326
$$ -7712 1658 7329 -4482 -6678 5621 4015 -7072 -1592 7948 209 -6743 2215 6169 -4157
1956d157j740J0736j002j0529M727R867p659p241R718L405j0756l86R757j992
$$ -4157 -5897 4839 3837 -6692 -1965 7902 243 -6998 2720 6125 -4631 -5017 4740 2748
1970B748q290L892P838m980p106O915N643r805l507J1414l68j1478M870J0184
$$ 2748 -5542 -1650 6188 1208 -5898 1017 6660 -3145 -6652 4762 4394 -7084 -2214 7970
1984G970p768o956R548L297j0453o06R909k396q989N421P878p316n545R081K659
$$ 7970 202 -6754 2794 6091 -4362 -4968 4941 2545 -6444 -1023 6855 -461 -6006 3075 5734
1999E734j0128k97R532k324q560M668P524n957n622P472L643q987j777R452j013
$$ 5734 -4394 -4691 4841 2517 -6043 -1375 6149 192 -5430 2042 5685 -3302 -5079 4373 3360
2014C360r763M183R434o920p134R622L770j1056j75J0173l592q432O168O339p054
$$ 3360 -6403 -2220 7214 294 -6840 2782 6552 -4504 -4679 5494 1902 -6530 -362 5977 -1077
2029a077l974P904K397q809r95R224j758r321M719Q287p091n419Q961K383r532
$$ -1077 -5051 2853 5250 -3559 -4554 4670 2912 -6409 -1690 6597 -494 -5913 3048 5431 -4101
2044d101K18Q857k841q283M828P509o513n639Q367L493r435q44R113k279q438
$$ -4101 -3883 4974 2133 -6150 -1322 6187 -326 -5965 2402 5895 -3540 -4384 4729 2450 -5988
2059e988M803P018o641m762Q521K528r527J7R352k984q710N301P048o909m580
$$ -5988 -1185 5833 -808 -5570 2951 5479 -4048 -4031 5321 2337 -6373 -1072 5976 -933 -5513
2074e513Q304K334q869J96Q647l061q106N251O612o761m539P981K679q301p46
$$ -5513 2791 5125 -3744 -3548 5099 2038 -6068 -817 5795 -966 -5505 2476 5155 -3146 -3892
2089c892Q158j666p981L969O875o273m661Q304K101q895O13Q439l092p668M742
$$ -3892 4266 2600 -5381 -1412 5463 -810 -5471 2833 4934 -3961 -3348 5091 1999 -5669 -927
2104i27O328o213m566P817K465q547L47Q451l372p510N452N625o793l618P643
$$ -927 5401 -812 -5378 2439 4904 -3643 -3296 5155 1783 -5727 -275 5350 -1443 -5061 2582
2119B582J885p792J20P583k352o978M276N499o048l453P244J526p620N57P630
$$ 2582 4467 -3325 -3205 4378 2026 -4952 -676 4823 -1225 -4678 2566 4092 -3528 -2971 4659
2134D659k620p340M456O149o341m160P725J765p932R97P348l349o362N044M799
$$ 4659 2039 -5301 -845 5304 -1037 -5197 2528 4293 -3639 -2642 4706 1357 -5005 39 4838
2149D838o478l065P536J113p762J277P256l406o118M897M374n957k723O705J125
$$ 4838 -1640 -4705 2831 3944 -3818 -2541 4715 1309 -4809 88 4462 -1495 -4218 2487 3612
2164C612p070Q14P174k887o678M790N173o382l235P257J132p351J198P105l446
$$ 3612 -3458 -2644 4530 1643 -5035 -245 4928 -1454 -4689 2568 3700 -3651 -2453 4652 1206
2179A206o170N396M419o995k207P588m4p164K054O357l396n433M473M395n869
$$ 1206 -4964 432 4851 -2144 -4351 3237 3193 -3971 -1917 4440 1044 -4389 84 4479 -1390
2194a390l032P046J065p669J595P343l977n959N599L932o389k151O537O33o573
$$ -1390 -4422 2624 3689 -3980 -2385 4958 981 -4978 621 4553 -1836 -3987 2550 3183 -3390
2209c390J137O484k983n881M873M471o556k549P456K82p469K038O866l906n627
$$ -3390 -2253 4231 1248 -4633 240 4711 -1845 -4394 3062 3344 -4125 -2087 4779 873 -4754
2224d754N378L930o492k082O899J05o729J741O275l272n459M798M204o161k561
$$ -4754 624 4554 -1938 -4020 2879 2984 -3745 -2004 4271 999 -4460 338 4542 -1619 -4180
2239d180P006M18p092J813O467l602n205M822L864n834k528O608Q02p109J435
$$ -4180 2826 3244 -3848 -2035 4432 830 -4375 447 4311 -1523 -4051 2557 3359 -3750 -2315
2254b315O961l770n613N611L511o554j378O374l46n955J678N619k783n203M326
$$ -2315 4646 876 -4737 874 4385 -2169 -3547 2827 2481 -3474 -1796 3823 1040 -4163 163
2269A63M342n952k738O986M48p165J906O350l622m992M902L489n749j937O099
$$ 163 4505 -1447 -4185 2801 3249 -3916 -2010 4340 718 -4274 628 4117 -1632 -3569 2530
2284B530K86o262J522N972l243m997M800L531n891j889O347o5o251J926N616l418
$$ 2530 2816 -3446 -1924 4048 805 -4192 608 4139 -1752 -3641 2706 2641 -3610 -1684 3932 514
2300E14m442M602L166n350j940N870L47o264J458O212l509n156N393L320o381
$$ 514 -3928 674 3840 -1510 -3450 2420 2767 -3497 -2039 4173 664 -4492 901 4221 -2160
2315b160j078O209q91n434K129M572k803l967L658L471m881k408O078L56o630
$$ -2160 -3238 2971 2080 -3354 -1225 3347 544 -3423 235 3706 -1175 -3583 2495 2851 -3779
2330c779K151N930m231m153N479K111n639n14N348p71n176J823M940k995m367
$$ -3779 -1628 4302 71 -4082 1397 3508 -2131 -2645 2703 1932 -3244 -1421 3519 524 -3843
2345c843M496L196n653j443O153o04n961K357N079l741l737M742K332n224r19
$$ -3843 653 3849 -1804 -3247 2906 2302 -3659 -1302 3777 36 -3701 1041 3373 -1851 -2770
2360b770N380m53n345J786N018l309m098M815K660n821p46O011j317n412K853
$$ -2770 2610 2157 -3188 -1402 3616 307 -3791 1024 3684 -2137 -2883 3128 1811 -3601 -748
2375g48M204l713l087M291K304m832j379N445On900J908N502m064l990N515J931
$$ -748 3456 -257 -3344 947 3251 -1581 -2960 2485 2491 -3409 -1501 4001 -63 -4053 1462 3393
2391C393n771K9N232j443m481K305L906l158l430M247K641n284j125N838q96n573
$$ 3393 -2378 -2349 2883 1440 -3041 -736 3170 12 -3418 829 3470 -1814 -2939 2899 2003 -3570
2407c570K786M482m096l104M807J680m949l40M960r53m865K257M445l655l565
$$ -3570 -784 3698 -398 -3502 1305 2985 -1964 -2304 2656 1703 -3162 -905 3540 -115 -3680
2422c680M816K170n514l27N666j585n065L029L923l926k659M348J504m508m74
$$ -3680 1136 3306 -2208 -2535 3131 1546 -3519 -490 3433 -493 -3152 1196 2700 -1808 -2282
2437b282M751n86m995K052M640l698l516N086J604n617M95N156k053m106K924
$$ -2282 2469 1883 -3112 -1060 3580 -118 -3634 1452 3056 -2561 -2066 3090 1037 -3069 -145
2452a45L096l340k500L942J810m765o71N421r94n365K926M231m399k537N044Q25
$$ -145 2951 -389 -2889 1053 2863 -1902 -2573 2848 1854 -3511 -585 3646 -753 -3290 1754 2579
2468B579m900M88M448j376l984K238L448l240k755M247J537m981J86M984j774
$$ 2579 -2321 -1833 2615 1239 -2745 -507 2941 -299 -3054 1193 2730 -2251 -2065 2919 1145
2483A145m365L208L324m181k110M571Q81m622J67M506j235m173K410L646l580
$$ 1145 -3220 -12 3312 -869 -2979 1592 2473 -2149 -1982 2524 1289 -2884 -474 3172 -408
2498d08k665M610J106n056O48M820k353l818L387K661l870j637L976Q30m199M4
$$ -408 -3073 1537 2643 -2413 -1765 3055 702 -3116 271 2932 -938 -2575 1401 2231 -1968 -1924
2514a924M464j202m433K726L764m087k346M758N02m623R71L953j944l184K686
$$ -1924 2540 1338 -3095 -369 3395 -692 -3038 1720 2222 -2401 -1430 2523 579 -2605 81
2529H1K582l331j849M115P40m786P12M893k413m159L658K952m300j579M440L61
$$ 81 2663 -668 -2517 1598 2338 -2448 -1736 3157 744 -3415 243 3195 -1105 -2684 1756 2117
2545B117m282O45L955j541l512K488K860l362j910M075N45m443R25M211k416l346
$$ 2117 -2165 -1520 2435 894 -2618 -130 2730 -632 -2542 1533 2078 -2365 -1440 2771 355 -2991
2561b991L612K194m144r24M319k56m268J171M047k114l789L190L126m184j853
$$ -2991 621 2815 -1329 -2253 2066 1810 -2458 -1287 2760 646 -3143 47 3173 -1011 -2864
2576b864M820K49m683J293L867k417k791K976J806l232r87L501J36l872J002L915
$$ -2864 1956 2205 -2478 -1185 2682 265 -2526 450 2256 -976 -1963 1538 1674 -2198 -1196 2719
2592B719k439l326L749K244m490p58M627n94m362J609L757k460l192L205K430
$$ 2719 280 -3046 703 2947 -1543 -2301 2326 1732 -2630 -1021 2736 276 -2916 289 2719
2607B719l760j321M147P9m082J217L567k436k758L318J681l840m49M045p35l896
$$ 2719 -1041 -2362 1785 1864 -2218 -1001 2566 130 -2628 690 2371 -1469 -1918 2127 1392 -2504
2623b504J805L426k702k787L467K013m028j008M443k96m409J592L772k813k766
$$ -2504 -699 2727 25 -2762 705 2718 -1310 -2318 2125 1829 -2580 -988 2784 -29 -2795
2638b795L505J575l676m02L689n55l489J431L194k531k639L491J638m156k32M333
$$ -2795 710 2285 -1391 -1793 1896 1341 -2148 -717 2477 -54 -2693 798 2436 -1720 -1952 2381
2654B381j108l873K136L222k883k510L414J712l877o95M144n24l979J743L292
$$ 2381 1273 -2600 -464 2758 -125 -2635 779 2491 -1386 -2081 2063 1539 -2440 -697 2595
2669B595k775k338L393J230l646o6L703r82l450K005K906k994k174L644J148l992
$$ 2595 -180 -2518 875 2105 -1541 -1607 2096 1114 -2336 -331 2575 -419 -2593 1051 2199 -1793
2685a793k4M074r37l870K032L313k990k482L658J318l957n5L810j058l335J994
$$ -1793 -1817 2257 1320 -2550 -518 2795 -195 -2677 981 2299 -1658 -1713 2097 1039 -2296 -302
2701c02K664k756j945L411R69l838K42L911j412l502K481K712l224j848L575R34
$$ -302 2362 -394 -2339 1072 2041 -1797 -1555 2356 944 -2558 -77 2635 -589 -2437 1138 2072
2717B072l805M8L865j037l583K134K985l146j988L663P82l863L65L740j405l290
$$ 2072 -1733 -1685 2180 1143 -2440 -306 2679 -467 -2455 1208 1990 -1873 -1508 2232 827 -2463
2733b463K367K685l227j799L809O35l986N74L751j583l194K369K525k956j822
$$ -2463 -96 2589 -638 -2437 1372 2007 -1979 -1405 2346 763 -2431 -62 2463 -493 -2315
2748b315L471Q50l815K76L865j518l346K611K525l383j480L705M08l871O15L759
$$ -2315 1156 2006 -1809 -1533 2332 814 -2532 79 2604 -779 -2259 1446 1854 -2017 -1402 2357
2764B357j633l305K630K611l413j619L855M27l942O52L711j669l158K548K438
$$ 2357 724 -2581 49 2660 -753 -2372 1483 1910 -2032 -1380 2331 662 -2496 52 2490
2779B490l229j521L632M03l723O88L511j620l077K567K428l325j561L914L92m209
$$ 2490 -739 -2260 1372 1775 -1948 -1260 2251 631 -2446 121 2549 -776 -2337 1577 1969 -2240
2795b240R47L894k114l116L011K171l465j215L582L50l723N48L665j646l291K771
$$ -2240 -1293 2601 487 -2629 382 2553 -912 -2127 1455 1805 -1918 -1370 2295 649 -2642 129
2811A29K472l586j248L909o8l769J094L383j940k835K719K231l354j406L890K62
$$ 129 2601 -985 -2233 1676 1608 -2161 -1067 2316 376 -2459 260 2491 -863 -2269 1621 1883
2827A883m119R94L823k180l103L181K079l673r70L836j32l794J152L380k017k870
$$ 1883 -2236 -1242 2581 401 -2702 479 2558 -1115 -2085 1751 1619 -2175 -1023 2357 340 -2530
2843b530K864K124l430j258L893J26m061J076L806k307k996L218J961l684q11
$$ -2530 334 2458 -972 -2230 1663 1789 -2272 -1196 2610 303 -2693 525 2486 -1198 -2009
2858b009L747k29l591J095L369k020k969L054K224l924r84M293m92m103J740L386
$$ -2009 1738 1509 -2082 -987 2382 362 -2607 447 2671 -1253 -2237 2056 1564 -2539 -799 2587
2874B587k590k523L120J765l431r99L781P7m044J110L824k406l078L452J944l986
$$ 2587 -3 -2526 594 2359 -1072 -2071 1710 1787 -2257 -1147 2677 271 -2807 645 2589 -1397
2890a397n88L994n83l696J535L157k380k571L157J774l724p74M096m15m081J647
$$ -1397 -1985 2009 1426 -2270 -735 2422 42 -2529 628 2402 -1322 -2096 2000 1585 -2496 -849
2906h49L600k763k814L633J693l977m72L988o42l685J506L246k333k748L151K009
$$ -849 2751 -12 -2826 807 2500 -1477 -1949 2039 1397 -2288 -782 2464 131 -2617 534 2543
2922B543l838q25M269o57m131K076L345l132k230L586J187l689k50L696n30l738
$$ 2543 -1295 -2120 2149 1492 -2639 -563 2782 -350 -2580 1006 2193 -1496 -1746 1950 1420 -2318
2938b318J414L608k597k975L653J838m320k37M280j124l775K125K949k777k205
$$ -2318 -904 2704 107 -2868 785 2623 -1697 -1934 2346 1222 -2553 -428 2521 -256 -2461
2953b461L254J504l759n23M123o39m099J941L498l102k445L848J171m095Q3L936
$$ -2461 793 2297 -1462 -1985 2138 1499 -2600 -659 2839 -263 -2708 1140 2311 -1784 -1701 2235
2969B235j080l516J904K938k656k331L320J515l868m54M242q69m071K229L361
$$ 2235 1155 -2361 -457 2481 -175 -2506 814 2329 -1539 -1993 2249 1380 -2691 -462 2899
2984B899l444k184M028Q93m082L08L746j114l407J880L071k780k545L715J542
$$ 2899 -545 -2729 1299 2192 -1890 -1582 2164 1050 -2357 -477 2594 -186 -2731 984 2526
2999B526m349p5M412j448l782K610K767l231j807L431J009l589j65L774q34l819
$$ 2526 -1823 -1898 2514 1066 -2716 -106 2661 -570 -2377 1054 2063 -1526 -1691 2083 1249 -2570
3015b570K071L438l374k414M164R96m375M51M127j632l479K456K767l060k029
$$ -2570 -499 2939 -435 -2849 1315 2311 -2064 -1613 2514 882 -2597 -141 2626 -434 -2463
3030b463L500J182l942p4M159j186l913K409L203l471k075M028P66m164N48L845
$$ -2463 1037 2219 -1723 -1797 2362 1176 -2737 -328 2875 -596 -2671 1357 2123 -2041 -1493 2352
3046B352j458l364K261K756k936k155L673J201m275J15M465j573l942K892K841
$$ 2352 894 -2470 -209 2547 -389 -2544 1129 2330 -1945 -1830 2635 1062 -2880 12 2853
3061B853l722j582L938M42l865M05L781j212l590K201L174l319k307M183R54m515
$$ 2853 -869 -2451 1487 1929 -1936 -1531 2250 1038 -2552 -351 2823 -496 -2803 1380 2334 -2181
3077b181N63M217j873l347K716K493l283j680L619Q59l976J66M140j399l791K659
$$ -2181 -1618 2599 726 -2621 95 2588 -695 -2375 1244 2103 -1873 -1707 2433 1034 -2757 -98
3093i8L016l669j882M204N25m240O96L949j768l322K620K645l326j860L833Q73
$$ -98 2918 -751 -2633 1571 2096 -2144 -1448 2501 733 -2589 31 2676 -650 -2510 1323 2196
3109B196m207L02M286j681l784K934K886l856j578M113K63m004Q27L655j637l201
$$ 2196 -2011 -1709 2577 896 -2888 46 2932 -924 -2502 1611 1874 -2130 -1303 2352 715 -2486
3125b486K410K797l312k000M085P10m512P76M301k154l454L148K426l670j362
$$ -2486 -76 2721 -591 -2591 1494 2204 -2308 -1532 2769 615 -2839 309 2735 -935 -2297
3140b297L827M25l981N09L986j603l691K833K944l863j687M346K50m351J029L918
$$ -2297 1530 1955 -2026 -1517 2469 866 -2825 8 2952 -911 -2598 1748 1998 -2353 -1324 2594
3156B594k095l175K894K429l488j524L904M86m190O86M060j878l570L040K745
$$ 2594 499 -2676 218 2647 -841 -2365 1539 2025 -2165 -1479 2581 703 -2867 173 2918
3171B918l919j523M358J54m367J118L879k109l228K901K534l524j673M092N49
$$ 2918 -1001 -2524 1834 1988 -2379 -1261 2618 509 -2719 182 2716 -808 -2481 1611 2160
3186B160m458P61M306k170l595L347K460l930j213M098O1m010Q78L800j855l455
$$ 2160 -2298 -1537 2769 599 -2996 351 2811 -1119 -2332 1766 1827 -2183 -1305 2495 640 -2815
3202b815K896K790l842j643M471K31m552J180M048k342l298L210K402l757j379
$$ -2815 81 2871 -971 -2614 1857 2088 -2464 -1284 2764 422 -2876 334 2736 -1021 -2400
3217b400M187K38m330R24M125k171l506L199K597l922j443M349J53m377J101M001
$$ -2400 1787 2025 -2305 -1381 2744 573 -2933 266 2863 -1059 -2502 1847 2000 -2377 -1276 2725
3233B725k279l345L193K454l819j336M197J94m310R91M101k243l547L361K521
$$ 2725 446 -2899 294 2748 -1071 -2407 1790 1984 -2326 -1335 2766 523 -3024 337 2858
3248B858m111j186M402n5m310J225L884k250l343L135K540l854j469M419J86m525
$$ 2858 -1253 -2439 1963 1908 -2402 -1177 2707 457 -2886 249 2789 -1065 -2534 1885 2071 -2454
3264b454J205M081k446l303L320K287l827j248M180J50m262J072M006k279l463
$$ -2454 -1249 2832 386 -2917 403 2690 -1137 -2385 1795 1945 -2317 -1245 2761 482 -2981
3279b981L350K393m029j135M353o0m308J277L912k367l305L299K369m058j198
$$ -2981 369 2762 -1267 -2402 1951 1891 -2417 -1140 2772 405 -2900 399 2768 -1290 -2488
3294b488M460p1m336J257L970k348l339L268K410m006j243M389k1m380J386L947
$$ -2488 1972 1901 -2435 -1178 2792 444 -2895 373 2783 -1223 -2466 1923 1902 -2478 -1092 2855
3310B855k521l212L370K169l939j121M316n0m326J393L951k570l252L511K159
$$ 2855 334 -2878 492 2661 -1278 -2399 1917 1867 -2459 -1066 2885 315 -2937 574 2733
3325B733m162r53M412k47m268J389L978k556l262L508K188m188r65M447l21m284
$$ 2733 -1429 -2382 2030 1783 -2485 -1096 2882 326 -2936 572 2760 -1428 -2393 2054 1733 -2551
3341b551J551L844k588l159L494K172m163j025M546l49m398J725L840k827k972
$$ -2551 -1000 2844 256 -2903 591 2763 -1400 -2425 2121 1772 -2626 -901 2939 112 -2860
3356b860L594J918m135q48M412l35m395J643M020k879l163L822J957m409o74M492
$$ -2860 734 2652 -1483 -2331 2081 1746 -2649 -1006 3014 135 -3028 794 2751 -1658 -2332 2160
3372B160n73m224J713L808k726l092L642K126m326r32M603m55m450J786L949k933
$$ 2160 1587 -2637 -924 2884 158 -2934 708 2834 -1492 -2424 2179 1724 -2726 -940 3009 76
3388G6l018L793J846m341n94M481o53m302J896L790k899l037L780K016m445q13
$$ 76 -2942 851 2697 -1644 -2238 2243 1590 -2712 -816 2974 75 -2962 818 2834 -1611 -2424
3404b424M738o25m593K060L954l218k878L975J715m357n88M393n57m259J686L945
$$ -2424 2314 1689 -2904 -844 3110 -108 -2986 989 2704 -1653 -2241 2152 1595 -2664 -978 2967
3420B967k852l182L970J958m645m67M725j069m264K251L567l104k727L794J816
$$ 2967 115 -3067 903 2861 -1784 -2251 2474 1405 -2859 -608 2959 -145 -2872 922 2738
3435B738m345p34M671o34m634K111M012l332k932M203J669m641l12M557r67m226
$$ 2738 -1607 -2341 2330 1696 -2938 -827 3185 -147 -3079 1124 2793 -1848 -2160 2397 1430 -2796
3451b796K077L623l009k793L816J820m410o12M656q03m516K194L914l390k841
$$ -2796 -719 2904 -105 -2898 918 2738 -1672 -2284 2372 1569 -2947 -753 3161 -229 -3070
3466c070M210J554m517l00M454q57m159J870L759k907l064L981J954m724n19M990
$$ -3070 1140 2694 -1823 -2123 2331 1474 -2685 -815 2944 37 -3027 954 2908 -1816 -2335 2655
3482B655j189m542K541L606l460k473L957J475m217n20M458o68m460J973M049
$$ 2655 1466 -3076 -535 3071 -389 -2862 1095 2570 -1647 -2167 2291 1623 -2837 -864 3185
3497C185l330l065M310J668m663j91M572j138m145K176L506l051k726L900J701
$$ 3185 -145 -3210 1100 2768 -1895 -2086 2486 1348 -2797 -621 2885 -166 -2892 1008 2709
3512B709m486m72M841j051m660K500L918l648k788M429J411m693mM540j183m158
$$ 2709 -1777 -2249 2592 1541 -3119 -619 3299 -349 -3137 1292 2703 -1990 -1994 2546 1363 -2795
3528b795K159L544l078k823L965J821m635m53M923j122m602K598L627l652k408
$$ -2795 -636 2908 -170 -2993 972 2793 -1842 -2295 2628 1506 -3096 -498 3129 -523 -2931
3543b931M235J161m336j31M361q52m360K091L931l368l059M492J692n048K1M933
$$ -2931 1304 2465 -1871 -2002 2359 1507 -2853 -762 3169 -199 -3258 1234 2926 -2122 -2101 2832
3559B832j597m204K625L317l444k401L978J530m427m15M751r61m623K454L877
$$ 2832 1235 -2969 -344 2973 -471 -2872 1106 2636 -1791 -2206 2545 1584 -3039 -585 3292
3574C292l766k652M465J278m703J58M472j332m013K352L380l194k703L991J679
$$ 3292 -474 -3126 1339 2617 -2086 -1928 2544 1212 -2801 -449 2931 -263 -2966 1025 2704
3589B704m545l80M878j190m673K767L750l961k434M560J013m622L43M399j339
$$ 2704 -1841 -2221 2657 1467 -3206 -439 3311 -650 -3084 1476 2489 -2133 -1790 2609 1270
3604A270m038K244L564l290k836M243J564m850N7M894j619m231K859L158l594
$$ 1270 -2768 -524 3040 -250 -3086 1157 2721 -2129 -2072 2822 1203 -3028 -169 2989 -605
3619f05k084L940J091m225r5M467j082m425K488L792l843k626M794R88m982N71
$$ -605 -2689 1251 2342 -1883 -1978 2489 1407 -3018 -530 3262 -581 -3207 1587 2575 -2407 -1836
3635a836M674j777l987K765L128l581k238M142J209m582O2M695j412m260K799
$$ -1836 2838 1061 -2926 -161 2967 -614 -2852 1290 2499 -2083 -2021 2674 1262 -2998 -199
3650a99L394l938k181M488P80m599N44M298j601l782K598L190l453k486M247J401
$$ -199 3195 -743 -2924 1564 2344 -2255 -1711 2587 986 -2796 -198 2992 -461 -2947 1300 2701
3666B701m949J27N056j806m424L247L343m224j962M527O37m508M75M355j476m085
$$ 2701 -2248 -2121 2935 1129 -3295 -48 3295 -929 -2891 1636 2273 -2235 -1760 2595 1119 -2966
3682b966K723L515l882k445M639R06m954O98M611k019l773K949L031l655k110
$$ -2966 -243 3272 -610 -3055 1584 2490 -2464 -1766 2845 826 -2947 2 3033 -622 -2732
3697b732M131J047m605J58M810j645m459L126L571m280k168M899N97m973Q50M572
$$ -2732 1399 2446 -2159 -2001 2809 1164 -3295 -169 3402 -878 -3046 1853 2450 -2523 -1673 2899
3713B899k040l893L023L112l793k166M381R83m835L48M824j818m264L229L314
$$ 2899 859 -3034 -11 3101 -692 -2858 1523 2506 -2329 -1981 2843 1025 -3239 -10 3304
3728C304m201j934M679M74m714P21M353j804l920K851L357l805k353M683J005
$$ 3304 -897 -2831 1848 2322 -2392 -1671 2682 878 -3042 -191 3166 -639 -2992 1691 2696
3743B696n171O36M848k185m096L353L042m051j884M436Q11m678L25M710j686m343
$$ 2696 -2475 -1839 3009 824 -3272 81 3123 -928 -2812 1624 2435 -2243 -1918 2792 1106 -3237
3759c237L052L525m220k148M904N95m976Q63M487k096l848L071L023l754j983
$$ -3237 -185 3340 -880 -3028 1876 2471 -2505 -1642 2845 749 -3099 -28 2995 -759 -2742
3774b742M338R10m688L64M646j757m341L086L432m150k133M860O89m961P60M659
$$ -2742 1596 2506 -2182 -1818 2828 1071 -3270 -184 3248 -902 -3035 1825 2514 -2447 -1687 2972
3790B972k069m037L064L160l924k120M609Q47m919O66M727k139m090L340L002
$$ 2972 903 -3134 -70 3090 -834 -2954 1655 2502 -2417 -1751 2976 837 -3253 87 3089
3805C089m112j683M469N23m517O50M322j822m007K981L236m077k089M881O65m967
$$ 3089 -1023 -2706 1763 2286 -2231 -1581 2741 919 -3088 -107 3129 -948 -3037 1844 2509 -2458
3821b458Q57M658k201m027L229K964m031j905M628O66m813Q00M702k217m051L333
$$ -2458 -1601 3057 856 -3171 58 3022 -1009 -2914 1714 2380 -2433 -1633 3069 852 -3199 134
3837A34K982m245j717M662M23m669R20M414k145l822L187K835m007j778M548O03
$$ 134 3116 -1129 -2846 1816 2239 -2430 -1510 2904 759 -3063 124 2959 -1048 -2826 1722 2325
3853B325m673P35M649k092m150L274L061m284j805M816M21m828J067M551k289
$$ 2325 -2348 -1613 3036 944 -3206 68 3129 -1155 -2960 1856 2277 -2551 -1484 3067 778
3868G78l908L338K947m269j857M800M40m866J096M527k322l723L264K723m022
$$ 778 -3130 208 3155 -1114 -2971 1829 2269 -2597 -1501 3026 704 -3019 245 2968 -1054
3883a054j720M493N10m699Q71M580k158l999L390K933m353j685M738L31m815J159
$$ -1054 -2774 1719 2229 -2470 -1599 2981 823 -3176 214 3147 -1206 -2891 1847 2178 -2637 -1478
3899a478M580k361l877L535K822m452j649M742K56m746J163M459k271l717L300
$$ -1478 3102 741 -3136 399 3221 -1231 -2880 1862 2118 -2628 -1465 2994 723 -2994 306
3914C06K782m180j683M625K82m782J179M466k400l675L479K676m301j506M574
$$ 306 3088 -1092 -2775 1850 2132 -2650 -1471 2995 595 -3080 399 3075 -1226 -2732 1842
3929A842K65m729J139M522k383l782L544K736m355j607M697K04m731J118M517
$$ 1842 2107 -2622 -1483 3039 656 -3126 418 3154 -1201 -2808 1889 2093 -2638 -1520 2997
3944B997k315l737L488K698m278j518M598P7m599J130M329k253l676L394K805
$$ 2997 682 -3055 433 3131 -1147 -2665 1933 2010 -2589 -1459 2870 617 -3059 335 3140
3959C140m289j601M729Q2m760J357M316k542l427L441K493m082j458M434K55m697
$$ 3140 -1149 -2750 1979 2061 -2699 -1342 2974 432 -2995 446 2939 -1143 -2601 1833 2088 -2609
3975b609J116M505k454l705L659K618m395j299M609j26m563J258M244k369l504
$$ -2609 -1493 3012 558 -3147 512 3130 -1265 -2564 2045 1919 -2644 -1386 2858 489 -3015
3990c015L435K682m224j510M674Mm725J375M271k646l395L705K304m274j078M488
$$ -3015 420 3102 -1122 -2632 2042 2046 -2679 -1304 2967 321 -3074 631 2935 -1339 -2417 2071
4006B071k03m463J354M052k365l487L477K636m282j479M786l7m884J527M349k833
$$ 2071 1868 -2595 -1241 2811 446 -3041 436 3072 -1210 -2689 2097 2060 -2824 -1297 3052 219
4022B19l345L806K216m195j062M376j13m437J202M184k439l574L658K595m461
$$ 219 -3126 680 2896 -1299 -2361 2015 1902 -2535 -1333 2851 412 -3162 496 3091 -1370
4037a370j120M717l49m555J575L956k571l242L412K463m081j397M577Q1m825J350
$$ -1370 -2490 2227 1878 -2677 -1102 2854 283 -2959 453 2916 -1165 -2562 2015 2096 -2729 -1379
4053a379M461k772l561L876K398m433j017M586k69m463J331M045k452l377L415
$$ -1379 3082 310 -3251 625 3023 -1410 -2427 2159 1890 -2573 -1242 2803 351 -3026 389
4068C89K564m132j342M634n2m759J477M245k783l369L785K178m241r22M399k05
$$ 389 2953 -1179 -2521 2113 2061 -2698 -1221 3024 241 -3128 657 2835 -1406 -2328 2071 1866
4084A866m399J286M114k444l583L584K660m448j249M876l21m702J678L980k748
$$ 1866 -2533 -1247 2867 423 -3160 424 3084 -1364 -2613 2263 1942 -2760 -1082 2898 150
4099A50l121L474K259l973j252M451J07m645J224M343k711l526L875K239m400
$$ 150 -2971 503 2762 -1211 -2463 1988 2095 -2550 -1326 3017 306 -3220 655 2894 -1506
4114a506q50M539m02m234J404L771k378l268L295K535m101j405M683%m800J546
$$ -1506 -2356 2183 1781 -2453 -1049 2722 344 -2924 371 2906 -1195 -2600 2083 2083 -2717 -1171
4130a171M240k923l293L873K033m235p97M340k87m145J241L828k281l438L286
$$ -1171 3069 146 -3147 726 2759 -1476 -2273 2067 1780 -2365 -1124 2704 423 -3015 271
4145B71K617m140j369M785j71m675J727L979k971l032L663J900l949q85M173l4
$$ 271 2888 -1252 -2621 2164 1993 -2682 -955 3024 53 -2979 684 2584 -1365 -2250 1923 1889
4161A889m272J139M174k457l657L707K447m503q97M775n85m377J731L679k617
$$ 1889 -2383 -1244 2930 473 -3184 523 2970 -1533 -2430 2345 1760 -2617 -886 2793 176
4176A76k997L214K234l833j254M435N8m597J379M243k843l329L821K020m368o20
$$ 176 -2821 393 2627 -1206 -2460 1975 2033 -2564 -1185 3058 215 -3114 707 2727 -1641 -2261
4192b261M443n38m125J608L619k515l064L325K235m095j166M684k00m633J626
$$ -2261 2182 1644 -2481 -873 2746 231 -2833 492 2727 -1368 -2534 2150 1950 -2683 -1057
4207a057M150k972l144L754J940m174p69M281k63m110J327L842k459l356L516
$$ -1057 3093 121 -3023 731 2671 -1503 -2272 2009 1746 -2364 -1037 2805 346 -3010 506
4222E06K320m351r67M656m52m340J808L681k760k888L362K032l900j134M344l
$$ 506 2826 -1525 -2492 2164 1712 -2628 -820 2861 101 -2787 575 2607 -1293 -2427 1917 1914
4238A914m447J425M189k839l320L830J987m337o22M346o03l947J544L606k420
$$ 1914 -2533 -1108 3081 242 -3078 752 2739 -1598 -2220 2126 1523 -2424 -880 2726 306
4253C06l114L245K282m040j200M552j60m547J703M017k890l072L688J770m079
$$ 306 -2808 437 2719 -1321 -2521 2031 1871 -2676 -973 3044 154 -2918 770 2540 -1539
4268a539o14M111m08l937J433L654k349l178L344K259m240j000M668m75m487J924
$$ -1539 -2153 1958 1550 -2387 -954 2700 351 -2827 517 2776 -1464 -2464 2204 1729 -2758 -834
4284h34L785k946k754L511J710l829q61M032m5m125J252L987k495l379L664K137
$$ -834 2951 5 -2749 762 2472 -1357 -2218 1814 1769 -2356 -1104 2883 388 -2991 673 2810
4300B810m412o45M427p49l967J840L362k581k650L208J901l870r94M265k32m338
$$ 2810 -1602 -2247 2180 1431 -2536 -696 2666 85 -2565 643 2544 -1326 -2320 1945 1713 -2625
4316b625J600L940k747l082L727J847m207o42M233n44l942J582L534k415k943
$$ -2625 -1025 2915 168 -2914 813 2660 -1547 -2189 2044 1500 -2442 -860 2674 259 -2684
4331b684L224K104l933j037M262k49m269J686L769k830k773L582J644l963n66
$$ -2684 540 2644 -1289 -2326 1936 1687 -2582 -896 2873 43 -2730 852 2496 -1467 -2033
4346b033L977m73l889J451L657k439l073L445K109m169q04M358o06m097J771L479
$$ -2033 1944 1471 -2418 -967 2690 251 -2822 623 2732 -1437 -2241 2117 1511 -2586 -815 2664
4362B664k588k662L239J857l778q79M068k97m118J577L704k679k872L596J742
$$ 2664 76 -2586 653 2510 -1268 -2147 1921 1624 -2494 -917 2787 108 -2764 832 2574
4377B574m083n04M069o51l820J601L420k511k726L293J910l913q06M161m52m103
$$ 2574 -1509 -2013 2056 1405 -2415 -814 2606 95 -2631 662 2572 -1341 -2147 2014 1562 -2541
4393b541J689L604k769k721L563J685l974n28M017o10l854J589L455k466k824
$$ -2541 -852 2752 -17 -2738 825 2510 -1464 -1992 2025 1415 -2439 -850 2605 139 -2685
4408b685L357J925l955p83M251o07m043J806L381k752k500L432J523l730n56L894
$$ -2685 672 2597 -1358 -2141 2110 1503 -2540 -734 2647 -105 -2605 827 2350 -1380 -1936 1958
4424A958m71l879J561L475k625k752L527J710l947n51M091o69l859J623L419k578
$$ 1958 1487 -2392 -831 2644 19 -2733 794 2504 -1443 -1994 2097 1428 -2431 -808 2611 33
4440C3k704L359J805l867o64M042n30l892J605L367k567k597L328J695l779n92
$$ 33 -2671 688 2493 -1374 -2038 2004 1474 -2418 -813 2554 -13 -2610 718 2413 -1366 -1958
4456a958L997n73l865J658L341k670k604L432J646l830n25M033o46l839J677L319
$$ -1958 2039 1466 -2399 -741 2600 -70 -2674 758 2404 -1426 -1951 2082 1436 -2403 -726 2593
4472B593k667k559L344J633l724n58L912n21l795J587L326k632k623L435J596
$$ 2593 -74 -2633 711 2344 -1380 -1938 1974 1453 -2342 -755 2571 -61 -2684 751 2347
4487B347l861l87L965p22l664J670L127k544k455L180J667l692n79M003o06l833
$$ 2347 -1514 -1901 2064 1342 -2322 -652 2475 -69 -2524 656 2323 -1369 -1948 2055 1449 -2384
4503b384J709L331k772k480L396J495l789l68L916o73l678J656L195k612k497
$$ -2384 -675 2656 -116 -2596 800 2295 -1494 -1862 2054 1381 -2297 -641 2554 -58 -2555
4518b555L268J569l732m77L869n24l735J600L273k602k560L370J483l749l13L820
$$ -2555 713 2282 -1450 -1927 1942 1418 -2317 -717 2556 -46 -2606 764 2247 -1502 -1815 2005
4534B005p72l475J758K912k535k298L125J466l571n11L857n38l744J677L297k721
$$ 2005 1233 -2242 -484 2428 -107 -2405 720 2186 -1385 -1896 1961 1423 -2321 -644 2653 -68
4550f8k512L387J446l793l05L860p81l473J736K933k514k311L023J506l458o06
$$ -68 -2580 807 2253 -1540 -1845 2015 1234 -2239 -503 2430 -84 -2395 628 2134 -1324 -1930
4566a930L760m25l717J639L294k722k471L499J279l860o1L734r35l243J705K816
$$ -1930 1830 1405 -2312 -673 2621 -101 -2572 927 2206 -1654 -1715 2019 1084 -2159 -454 2362
4582B362k351k287K879J634l555o84L960o21l740J866L183k871k224L385J127
$$ 2362 11 -2276 603 2237 -1318 -2002 1958 1337 -2403 -537 2646 -225 -2449 936 2063
4597B063l611q8L476p03l215J540K897k307k403L006J569l663m83L926p52l647
$$ 2063 -1548 -1636 1840 1137 -2078 -538 2359 52 -2351 655 2224 -1439 -1922 2004 1252 -2395
4613b395J922L057k852k076L356R76l565k8L449p36l252J583K989k420k422L147
$$ -2395 -473 2584 -268 -2344 1012 1988 -1577 -1605 1844 1108 -2144 -561 2428 8 -2414 733
4629G33J571l746m53L890p73l553J892K884k660k011L100J134l442k42L525p36
$$ 733 2304 -1442 -1895 1995 1222 -2331 -439 2445 -215 -2226 874 2008 -1434 -1676 1849 1113
4645A113l337J757K911k610k155L243J128l560j91L604q15l336J760K918k574
$$ 1113 -2224 -467 2444 -166 -2321 922 2050 -1510 -1701 1903 1088 -2248 -488 2430 -144
4660a44k211L259J268l694j79L646r05l304J830K775k529k003L023J213l404l35
$$ -144 -2355 904 2172 -1522 -1701 1945 1040 -2264 -434 2341 -188 -2191 832 2045 -1359 -1694
4676a694L544o87l452J740L050k714k184L409J082l684L5L549j107l099J912K537
$$ -1694 1850 1163 -2289 -549 2501 -213 -2397 1012 2094 -1590 -1555 1994 887 -2212 -300 2237
4692B237k445j932K916J263l311n05L595n60l635J815L102k865k073L562Q21l664
$$ 2237 -208 -2140 776 2039 -1272 -1777 1818 1258 -2377 -562 2540 -325 -2398 1164 1985 -1679
4708a679L22L281j124k898J758K475k192k072K804J492l459m94L781q19l606K074
$$ -1679 -1357 1924 800 -2098 -340 2135 -57 -2129 675 2167 -1292 -1786 1995 1176 -2430 -356
4724c56K844k952j702L321O34l296K04L056q58k917J508K718k283k258L143J400
$$ -356 2488 -464 -2166 1155 1789 -1507 -1303 1753 895 -2022 -514 2204 -79 -2337 806 2206
4740B206l733k19L871j084l479K159K653k834j652L125P91l153l6L107p21l039
$$ 2206 -1527 -1746 2125 1041 -2438 -279 2374 -460 -2112 1013 1804 -1349 -1385 1722 1001 -2038
4756b038J527K764k427k139L239J215l710L2L588j194l086K041K372k601j624
$$ -2038 -511 2253 -174 -2313 926 2141 -1569 -1537 2051 857 -2229 -188 2184 -417 -2041
4771b041K949R70l213j93L399q00l315J813K831k736j928L279R07l409R5L277
$$ -2041 908 1878 -1335 -1528 1871 1071 -2244 -431 2400 -336 -2264 1015 1922 -1487 -1392 1885
4787A885r80l002J701K551k403j930L035J125l417p6L515j104l118J935K527k626
$$ 1885 905 -2097 -396 2155 -248 -2178 857 1982 -1435 -1511 2004 900 -2218 -283 2244 -382
4803c82j702L027Q89l203m7L253q23l119J665K676k527j946L177J017l451Q6L422
$$ -382 -2084 943 1832 -1371 -1418 1835 1012 -2107 -442 2234 -293 -2239 938 1955 -1496 -1410 2012
4820B012j187k970J903K291k413j615K780R95l067k33L247o39l237J660K810k702
$$ 2012 825 -2145 -242 2049 -364 -1979 801 1796 -1271 -1504 1743 1104 -2133 -473 2337 -365
4836c65j898L319P47l370L32L144j164k708J745K219k246j797K819J163l284k31
$$ -365 -2263 1056 1803 -1567 -1235 1909 745 -1963 -218 2001 -245 -2042 777 1940 -1344 -1575
4852a575L535r14l309K002K519k743j628L133O87l142J94K984q76k813J600K423
$$ -1575 1960 1046 -2263 -261 2258 -485 -2113 1020 1707 -1435 -1241 1743 867 -1946 -346 2077
4868B077k329j864K931J024l286O0L293j054k954J930K301k598j459K852P05l023
$$ 2077 -252 -2116 815 1839 -1447 -1387 1906 852 -2102 -172 2129 -469 -1928 924 1629 -1394
4884a394J31L028q88k845J683K451k473j788L066Q39l319J98L197j079k791J810
$$ -1394 -1263 1765 877 -1968 -285 2166 -307 -2095 971 1810 -1509 -1311 1886 807 -1984 -174
4900a74K206k335j687K772R76l138n9L260r11l023J922K383k674j487K984N62
$$ -174 2032 -303 -1990 782 1758 -1380 -1439 1821 910 -2113 -191 2192 -482 -1969 1015 1577
4916A577l012K57K872r12k663J587K359k322j794K922R14l293J31L322j204k814
$$ 1577 -1435 -1178 1694 782 -1881 -294 2065 -257 -2051 871 1785 -1508 -1377 1945 741 -2073
4932b073K026K109k539j347K760O24k854M3K829p13k755J551K402k317j784K975
$$ -2073 -47 2062 -477 -1824 936 1560 -1294 -1251 1578 865 -1890 -339 2063 -254 -2038 937
4948I37P68l234K32L175j303k588K011J956k420j268K585O98k823o1K957p14k875
$$ 937 1705 -1529 -1297 1878 575 -2013 -2 1954 -466 -1734 851 1549 -1274 -1335 1622 908 -1967
4965a967J615K560k569j699L117O21l252M11K956j225k458J825J968k231j402
$$ -1967 -352 2208 -361 -2060 1057 1678 -1574 -1163 1793 568 -1890 -65 1903 -328 -1730
4980a730K566P56k848r9K972q20k763J725K266k391j534K936N40l050L39K823
$$ -1730 836 1592 -1256 -1355 1617 797 -1966 -241 2025 -366 -1900 1036 1576 -1474 -1135 1688
4996A688j132k458J798J967k239j333K586O51k828LK930q51k751J709K298k374
$$ 1688 556 -1902 -104 1863 -376 -1709 877 1528 -1300 -1297 1633 782 -1969 -260 2038 -336
5012c36j547K847O40l019K56K869j132k469J759J996k229j326K606O20k813R4
$$ -336 -1883 964 1604 -1415 -1159 1710 578 -1891 -132 1864 -365 -1691 915 1535 -1278 -1184
5028a184K785q99k613J656K183k311j452K796O36l024K77K909j233k443J856J870
$$ -1184 1601 702 -1911 -255 1928 -383 -1835 961 1597 -1427 -1150 1759 526 -1917 -61 1809
5044A809k243j209K504O01k634j9K689p13k627J512K250k261j481K824N87k980
$$ 1809 -434 -1643 861 1462 -1172 -1191 1498 785 -1842 -330 1920 -341 -1822 1002 1589 -1391
5060a391L53K735j188k357J809J772k149j190K461O38k674K1K727p79k652J575
$$ -1391 -1038 1697 509 -1848 -39 1733 -416 -1606 855 1493 -1181 -1160 1567 788 -1864 -289
5076b89K223k297j550K879O49l019L37K776j169k375J751J790k100j201K378O85
$$ -289 1934 -363 -1913 966 1615 -1404 -1067 1709 540 -1835 -84 1706 -394 -1595 783 1468
5092A468k599m4K649o80k613J487K218k255j432K759N46k832L60K614j143k233
$$ 1468 -1131 -1175 1474 794 -1819 -332 1886 -369 -1801 958 1504 -1328 -968 1646 503 -1730
5108a730J674J713k037j214K391O51k576NK643p80k537J522K126k188j482K682
$$ -1730 -56 1657 -380 -1594 797 1448 -1128 -1123 1520 740 -1797 -275 1851 -337 -1819 863
5124H63O51k836K79K667j101k287J705J676k005j149K249O86k476l3K553o60k511
$$ 863 1514 -1322 -1043 1624 523 -1764 -59 1617 -388 -1537 712 1398 -1078 -1111 1442 782 -1729
5141a729J459K145k251j379K699N26k806L73K586j134k138J575J646j889j179
$$ -1729 -270 1875 -376 -1755 944 1470 -1336 -963 1623 489 -1649 -74 1572 -317 -1496
5156a496K175O99k409r7K578o77k490J443K039k113j388K623N15k660L43K400
$$ -1496 679 1378 -1031 -1128 1450 773 -1717 -274 1765 -348 -1736 887 1402 -1258 -915 1485
5172A485r94k026J419J620j800j158K135P19k432j06K605p21k488J534J984k198
$$ 1485 491 -1535 -116 1504 -296 -1454 681 1400 -1032 -1138 1467 746 -1742 -208 1776 -422
5188d22j203K537M03k513L12K309q74k100J395J741j815j327K263P36k574K9K573
$$ -422 -1625 912 1315 -1198 -886 1423 549 -1551 -156 1585 -230 -1557 706 1442 -1132 -1103 1470
5205A470q10k349J561J764k019j145K302M91k362J62K315q32k085J382J712j872
$$ 1470 660 -1689 -128 1636 -383 -1528 774 1265 -1097 -935 1380 548 -1537 -155 1557 -315
5221c15j208K283N59k432J72K359q22k151J409J757j939j172K267N63k374O4K409
$$ -315 -1523 760 1319 -1113 -941 1418 596 -1555 -146 1611 -328 -1500 767 1330 -1044 -980 1429
5238A429q07k205J427J752j951j146K280M80k331J52K267p58k081J243J778j773
$$ 1429 622 -1583 -156 1596 -355 -1501 779 1259 -1072 -920 1347 589 -1492 -249 1529 -244
5254b44j332K271O65k474J32K440r03k142J492J563j838r99K071M96k182M9K224
$$ -244 -1576 695 1360 -1114 -982 1458 555 -1587 -95 1468 -370 -1369 702 1198 -984 -935 1289
5271A289o00k184J201J893j847j320K322N64k428K27K269q90j941J335J495j645
$$ 1289 689 -1495 -294 1599 -248 -1568 754 1318 -1110 -883 1386 496 -1445 -110 1385 -260
5287b60j094J943O52k177o1K271n96k185J272J827j933j217K328M64k345K78K187
$$ -260 -1354 589 1241 -936 -997 1274 678 -1507 -235 1592 -341 -1558 770 1234 -1111 -833 1354
5304A354q66j870J263J503j624j200K001P66k288p0K393o97k211J429J666j907
$$ 1354 488 -1382 -119 1384 -240 -1440 561 1327 -961 -1031 1362 665 -1546 -117 1549 -358
5320c58j032K087M19k067J75J937o02j858J083J632j633j190K034O02k267J51
$$ -358 -1390 697 1116 -951 -776 1161 559 -1299 -216 1416 -217 -1407 627 1229 -1038 -887
5336h87K221q71j862J325J446j662j039J882N54j998m8K176n45k087J178J759
$$ -887 1334 463 -1399 -74 1372 -290 -1329 553 1107 -891 -939 1237 692 -1395 -217 1542
5352A542j815j159K110M78k217K23K123p51j849J184J472j510j176J871O89k146
$$ 1542 -273 -1432 678 1156 -1061 -838 1285 534 -1315 -131 1341 -169 -1345 526 1215 -931
5368i31n0K234n94k093J307J626j837r86K014L38k014K05J874n71j704R68J535
$$ -931 -981 1253 659 -1434 -127 1499 -338 -1324 690 1028 -986 -781 1093 522 -1182 -214 1321
5385A321j430j299J899P74k252j1K303p54j974J415J402j723q61J801L96j842
$$ 1321 -109 -1408 491 1265 -987 -998 1305 551 -1423 -8 1394 -329 -1190 611 1007 -835
5401h35pJ874l98j830R17J688j544j293K024N83k187J76K102q22j798J331J339
$$ -835 -842 1032 634 -1196 -279 1409 -135 -1428 596 1179 -1008 -832 1270 448 -1350 -19 1320
5418A320j621r19J765M99j927k1K038m90k010J117J733j668j215K008N12k107
$$ 1320 -301 -1220 545 1044 -883 -904 1134 644 -1366 -249 1484 -184 -1399 609 1121 -986
5434i86J51J978o99j626J110J281j375r80J655N32j880oJ962n81j805J172J433
$$ -986 -835 1143 444 -1182 -72 1209 -166 -1146 509 1041 -839 -845 1117 536 -1269 -97 1336
5451A336j610r26J832L64j915J14J881n38j750J023J518j510j078J817N17j998
$$ 1336 -274 -1200 632 996 -919 -805 1076 538 -1212 -189 1329 -181 -1259 558 1075 -923
5467i23Q9J922o24j648J078J346j438r39J683M50j868K4J975o30j799J248J415
$$ -923 -834 1088 464 -1184 -106 1240 -198 -1137 546 996 -872 -848 1127 497 -1302 -54 1361
5484A361j616r20J829L16j880J95J758o23j512R73J311j327j000J623N71j895
$$ 1361 -255 -1175 654 970 -910 -715 1043 420 -1092 -119 1192 -135 -1135 488 1059 -836
5500h36l2J963o34j726J231J307j605p41J727K21j729J87J555n01j463Q99J370
$$ -836 -868 1095 461 -1265 -34 1273 -332 -1073 654 875 -854 -667 888 387 -1076 -177 1193
5517A193j299j068J698N54j966O1J944p43j618J285J163j503o79J574K83j660
$$ 1193 -106 -1174 524 1078 -888 -827 1117 374 -1244 41 1204 -299 -978 596 879 -781
5533g81M7J700n15j626J003J446j461r93J792M50j984J67J816p10j531J141J175
$$ -781 -734 966 451 -1175 -172 1274 -187 -1180 612 1062 -922 -755 1061 351 -1180 -39 1136
5550A136j353p60J509L44j604JJ619m72j531R43J350j379q94J707L58j832J95
$$ 1136 -217 -977 532 876 -728 -727 892 420 -1111 -168 1182 -197 -1091 616 974 -858 -663
5567f63J666o84j431J056J166j290q02J526M29j725J5J715n32j597J031J292j384
$$ -663 1003 319 -1112 -56 1110 -180 -982 544 973 -752 -737 978 446 -1151 -120 1172 -212
5584b12q32J640L50j757J17J653o00j477J027J179j312q03J612L15j668R9J636
$$ -212 -1044 596 946 -811 -694 959 359 -1118 -91 1088 -224 -1027 585 900 -768 -669 967
5601I67o00j496J045J165j292q13J588L81j695J07J627o24j444J006J136j260
$$ 967 367 -1129 -84 1081 -211 -1024 564 945 -750 -643 984 360 -1084 -78 1058 -202
5617b02p66J522L50j599R1J510n52j380Q66J171j161q42J506L92j623O8J610n98
$$ -202 -968 554 904 -695 -604 906 354 -1026 -160 1011 -150 -992 514 906 -717 -649 961 363
5635C63j460J035J105j293p28J514L03j556J12J514n32j442R49J171j259q50J601
$$ 363 -1097 -62 1043 -250 -978 536 839 -717 -605 909 377 -1065 -116 1055 -204 -1054 547
5652E47L77j659J46J578o27j401R82J072j247o98J434L23j474R3J452n33j340
$$ 547 924 -735 -589 989 362 -1039 -57 1015 -232 -930 504 827 -647 -554 898 365 -975
5669i75Q91J072j233p23J447L02j500J70J461n99j319R38J006j205o49J439K48
$$ -975 -84 988 -245 -968 479 781 -719 -549 912 313 -1006 -68 938 -267 -916 523 771
5686G71j479J72J429n43j311Q79J092j236p36J483L10j567J81J512o12j314R33
$$ 771 -708 -536 893 350 -961 -82 1010 -226 -962 521 831 -736 -555 957 345 -969 -36
5703c6J020j278o40J423K94j476J65J413n55j291Q97J044j255o62J417K70j471
$$ -36 984 -294 -934 489 783 -693 -528 885 330 -961 -64 980 -275 -937 480 750 -721
5720g21K00J418n85j269R59R26j243n61J355K20j349J13J371m71j241Q27R74j144
$$ -721 -521 897 312 -957 2 928 -315 -876 479 699 -650 -537 834 363 -878 -51 923 -221
5738b21p18J411K62j415J70J373n91j129Q80Q62j123o01J274K69j377J22J409
$$ -221 -939 472 734 -681 -511 862 271 -858 22 884 -239 -840 434 703 -674 -552 857
5755H57n31j238R02R56j196o33J369K13j401J83J360n54j176Q62R13j106o56J315
$$ 857 326 -912 -10 946 -250 -883 486 699 -702 -519 841 287 -889 -27 886 -220 -876 439
5773D39K74j403J50J353n10j162Q67Q76j115n47J199K38j292J65J221m55j103
$$ 439 713 -690 -540 813 303 -859 8 884 -231 -778 421 659 -633 -468 753 298 -805
5790h05P46R42j038o50J244K40j376J91J273n62j049Q74P95j071n13J170K39j286
$$ -805 -59 883 -155 -805 439 679 -697 -506 767 205 -844 30 825 -246 -759 411 650 -636
5808f36R1J282m22j193Q20R88j170n74J309J34j310K18J211n38r90P81Q07r96
$$ -636 -545 737 315 -878 -58 930 -240 -814 495 629 -681 -463 748 210 -780 1 808 -188
5826a88n71J173K27j274J41J270n31j106Q91Q24j134m38J193P0j190K00J109m43
$$ -188 -759 414 641 -633 -492 778 247 -859 32 856 -278 -716 477 547 -643 -443 666 223
5844B23r65O67Q57r26o05J122K79j273J09J252n20j023Q47P27j039l95J091J30
$$ 223 -742 -75 782 -144 -749 373 652 -621 -512 740 220 -803 44 771 -268 -663 428 558
5862E58j145J73J064m09j021P59Q63j035n71J259J51j300K57J169o03r40P82P42
$$ 558 -587 -414 650 241 -780 -21 842 -193 -764 495 646 -654 -397 772 169 -771 11 753
5880G53r58m85J091K18j166R1J135m35j050P97P90j050m08J111R5j114K28J000
$$ 753 -205 -690 401 619 -547 -456 679 244 -806 -9 781 -269 -677 434 529 -585 -357 643
5898F43m77q63O69P38r10m93J083K17j181J23J142m92r48P86P10j005l49J021
$$ 643 166 -697 -28 710 -200 -693 390 607 -574 -451 691 199 -749 37 747 -258 -607 414
5916D14J19j067J95R70m15q91O34Q08r81n04J152J61j193K17J085n68q56P68O00
$$ 414 533 -534 -339 631 216 -675 -41 767 -214 -718 434 595 -598 -381 704 136 -720 48 648
5935F48q96l44R28J89j015P4J070m24r96P48P49r83m11J144K4j076K69R08m51
$$ 648 -248 -592 336 525 -490 -416 654 230 -766 -18 731 -252 -663 481 505 -571 -302 606 155
5954A55q02O33O40p57m93R67J85j034J19J027m29r25P29O74r44l24R83N5r67K14
$$ 155 -647 -14 626 -131 -624 343 528 -506 -387 640 211 -714 15 689 -255 -579 404 459 -508 -294
5974b94Q52m03q04O05O89q19m63J017J56j116K34J015n27q64Q01N70r08k99R56
$$ -294 558 155 -649 -44 645 -174 -637 380 536 -580 -346 669 142 -722 79 649 -259 -558 398
5993C98N3r38J42R38l85q55O17P10q80m39J055R3j056K58Q63m65o83O12N21p29
$$ 398 451 -487 -345 593 208 -647 -30 680 -200 -639 416 509 -547 -289 574 109 -574 38 559 -170
6013a70l87Q42J90r12J02R07m19p90O44O03q57k86R23J0r08K13Q50m19p08N84
$$ -170 -557 285 475 -437 -335 572 153 -637 7 610 -247 -533 390 400 -508 -295 555 136 -572 12
6033A2N71p55l68Q78J60r94J44R61m57p86P16M97q30k17Q54Qq20J41Q35l82p45
$$ 12 583 -172 -540 338 498 -496 -352 609 152 -634 82 579 -251 -468 386 394 -426 -285 550 168 -577
6054e77N70N76p48m01R30Q3r29K17Q40m82o80O56M46p07k76P65J09q01Q5Q37l47
$$ -577 -7 569 -179 -580 350 433 -496 -279 561 79 -601 55 501 -206 -482 283 392 -409 -324 513 166
6075A66p53O12N65p95l07Q57N3q25K07P44l94o48N20N53p30l23Q06J12q62J56
$$ 166 -587 25 590 -205 -512 345 398 -427 -220 524 130 -518 2 555 -175 -498 308 420 -442 -286
6095b86Q27m07p03O23M92p86k53Q66m1p78J79P63l90o34N70M88p39l14Q04J46
$$ -286 541 134 -569 54 546 -240 -493 373 332 -446 -267 496 106 -528 42 530 -209 -523 281 427
6115D27r28K45Q05m38o37O30L88o88k20O85Q3p26J30O75k89o65N50N09p14k75
$$ 427 -501 -256 549 111 -526 104 492 -196 -416 269 352 -374 -244 431 142 -523 27 536 -178 -453
6135d53P91Qp64K03O99m00n70N67M06o62k59P15R0p78J52P58m04o38N96M33p05
$$ -453 338 346 -418 -215 484 84 -486 81 487 -175 -434 281 371 -407 -255 503 99 -539 57 490 -215
6156b15k33P70mp54J96P10l54n78N12M42o69k24O92N1p61K12O77m00n54N76L78
$$ -215 -448 322 318 -436 -240 470 116 -462 50 492 -177 -401 291 342 -419 -207 470 70 -484 92 470
6177D70o73k01O98Jo90J90O11l05n29M80M32o73k16P03K1p26K11O17l67n19N13
$$ 470 -203 -404 294 295 -395 -205 406 101 -428 52 484 -189 -405 298 319 -407 -196 421 54 -465 48
6198D8L73o01k25O41N0o70J78O23l38n49N48L78o69j48O94o0o72J98O48l99n13
$$ 48 421 -180 -405 236 286 -384 -206 417 79 -470 78 456 -213 -361 333 273 -399 -201 447 48 -465
6219d65N60L42o35j90O81oo75J76O35l92m72M77L84n91j91O29k2n94J74N21l22
$$ -465 95 437 -198 -388 293 287 -388 -212 423 31 -441 36 420 -171 -362 267 245 -349 -175 346 24
6240B4m29M43L20n15j67N92l0n71J71N04l33m36M93L34n89j14N67qo01J80N45
$$ 24 -405 38 358 -157 -324 268 238 -333 -162 342 9 -427 66 400 -189 -303 264 256 -345 -165 380
6261C80l35m82M99L46n96j45O15n1o04K33M99l37m51M83L07n42j30N99p4n88K28
$$ 380 45 -437 62 408 -188 -333 282 231 -373 -140 359 22 -429 54 361 -181 -311 288 214 -374 -146
6282a46N27l82l90M61K66n17j19N77m0n59J75N02l06m44M65K68m96j27M98K8n25
$$ -146 381 -1 -391 70 336 -181 -300 277 237 -322 -147 355 49 -395 70 338 -158 -285 213 241 -284
6303b84J41M66k74l94L78K91m92j11N17l9n10K08M27k94l86M41K23n12o5M97k6
$$ -284 -143 323 49 -345 33 324 -168 -279 238 199 -311 -103 324 30 -356 85 308 -204 -269 228 202
6324B02n07J90M28l13l81M34K73m91j17N30n2n12K15M55l28l57M00K21m18j32
$$ 202 -305 -115 313 0 -381 53 326 -165 -282 248 196 -316 -101 354 26 -331 69 290 -128 -260
6344b60M80k1m92J91M35l13l45M11J77m18r7M84o6m20J85L41k59l26L64K28m21
$$ -260 220 199 -293 -102 333 20 -325 86 263 -155 -252 232 166 -254 -69 272 13 -313 51 279 -142
6365a42j31N01n1m84K04M10l07l21L90J98m44o2M54m8m40J89L79k66l28L69K23
$$ -142 -273 228 177 -307 -103 307 0 -321 69 267 -177 -239 215 167 -273 -84 295 29 -299 70 293
6386B93m58q6M91p0m42K13L41k87k81L75J31l88n3M13m8l93J56L74k71l06L36
$$ 293 -165 -251 240 170 -272 -59 282 -5 -286 89 220 -168 -221 192 144 -249 -93 281 10 -296 40
6407D0J97m27j1M39j27l63K13K76k59k17K82J67l48r0L82L4m28J86L49k90k71
$$ 40 237 -190 -201 238 111 -252 -39 237 -22 -239 43 210 -138 -228 154 188 -240 -54 295 5 -266
6428b66L67J15l95K6L36o6l43J94K71k14k80L13J75l78p0M20r9m01K60L00k98
$$ -266 101 216 -179 -153 183 117 -226 -32 239 25 -255 58 233 -145 -215 205 106 -295 -35 265 -33
6449c3k39L63P9l28l5L59p5l07J50L12k49k40L08J48l55k5L62j12k96K08K07k00
$$ -33 -272 91 170 -158 -193 166 91 -216 -66 246 -3 -243 65 213 -142 -167 195 83 -213 -5 202 2
6471Bj82K75O6k80o3L21nl33J62K79k54k22L41O0l45O0K98j46k51J90K27k38j70
$$ 2 -180 95 161 -119 -182 139 134 -199 -37 242 -12 -234 107 167 -178 -118 180 34 -217 -27 200 -38 -208
6494b08K73J24l48j9L28m7l22K13K49k94j22K83Nk35K1K59q0k21J16K27j86k09
$$ -208 65 189 -159 -178 150 103 -219 -6 243 -51 -173 110 115 -120 -99 160 80 -141 -25 202 16 -193
6516a93K86Q1l07K0K82j13k53J80J99k22j09K50K1k05l8K14m6k18R9K30j87j43
$$ -193 93 174 -133 -113 169 56 -197 -17 182 -40 -149 101 122 -83 -121 93 47 -171 -72 158 -29 -172
6538a72K28Q2k87O6K51j59j99K16J04j68q3J93N6k31NK24l0k69J66J93k49j02
$$ -172 56 138 -149 -83 168 9 -190 26 130 -38 -121 72 128 -103 -98 126 96 -173 -7 186 -63 -165
6560a65K85Pk76R9J65j06j26R1J49j31j23J79O3k11RK33q6k21J40J67k21l1J74
$$ -165 120 127 -149 -50 115 9 -117 -26 123 -8 -131 48 111 -100 -91 142 56 -165 -25 142 -79 -110 64
6583F4Qj42K0J29o4j41Q5J48j18r7J93L7k20K9K14j38j41J62R1j73k8J57Pj59
$$ 64 72 -70 -50 79 15 -126 -41 107 -11 -108 85 122 -98 -69 145 7 -134 28 119 -54 -82 75 82 -77
6607g7J7J67n3j92J24J49j79r0K21j1j98Q9J24j14r9J38P6j49j6J18L0j76O6J79
$$ -77 -60 107 54 -138 -14 135 -44 -134 87 76 -122 -33 91 -23 -122 16 92 -57 -73 45 75 -101 -35 144
6631A44j38j73J86R3k07NK01m4j58P0J10r0j10J20Q7j56k5J69Kj67O7J51j39j02
$$ 144 6 -167 19 112 -95 -90 111 67 -91 -21 89 -1 -111 9 96 -60 -85 84 86 -81 -14 137 -2 -104
6655a04J52J2j49K4J36n5r5M0J37q8j16J07R7j53m6K11n8j86J25J40j67o9J60
$$ -104 48 60 -89 -65 71 16 -79 -39 98 10 -106 1 98 -55 -101 110 52 -134 -9 131 -36 -105 55
6678E5Rj18K8J34j6j74P8R3q4r3J33N5k02O6J52p6j46J12P4j33KJ01j9j00O1P5
$$ 55 64 -54 -26 108 92 -82 -4 89 5 -88 45 100 -102 -36 116 40 -106 6 80 -53 -51 50 31 -69 -8 67
6704F7m3j29J00J16j75oJ19J1j69N3J54q7r6J08M9j20oJ12J9j61L1J40p0r9J01
$$ 67 24 -105 -5 111 -64 -70 49 60 -109 -56 98 11 -85 23 72 -48 -54 58 77 -84 -53 87 17 -82 19
6729A9Q9j61mJ36n4j16Q4R3j10o9J11O6j55JJ40jj75Q6J16j46p1J56J4j42M5J18
$$ 19 108 -53 -57 79 25 -91 -7 86 -24 -93 18 84 -71 -70 70 69 -106 -20 96 -50 -121 35 49 -93 -48 70
6755G0l5r9N2R7q1q5J46J3j41J3J33m8j29J07P5j32pJ12Rj41L1J05o9q7Q1R6j26
$$ 70 35 -64 -12 85 4 -81 65 78 -63 -50 83 35 -94 13 88 -44 -51 61 70 -71 -40 65 -4 -91 -10 86 -40
6782d0p9J77J2j70M1J60p5j71J44P1j15m3J47J9j57N1J20p9j29J28Q8j73j5J28
$$ -40 -119 58 70 -100 -59 101 26 -145 -1 70 -45 -88 59 78 -79 -28 92 13 -116 12 100 -73 -88 40
6806D0Oj34O9J52j24j05J32P3j63QJ30n6j13Q5J13j03j13J50M5j62k9J79n1j33
$$ 40 46 -88 -19 133 9 -96 36 109 -54 -46 84 28 -85 0 113 10 -103 47 92 -70 -99 80 29 -104
6830a04P0J52j21j30J69J6j31NJ59n0j48J04J24j21j01J59L7j64j4J97n1j80J42
$$ -104 -34 118 -3 -133 36 52 -79 -74 85 35 -113 -9 115 -6 -107 52 89 -75 -89 108 57 -123 19
6853A9J37j80r8J98J7j74J2J84p3j68J14J35j51q6J59M4j43pJ70p0j72J28J18
$$ 19 156 -24 -122 76 93 -81 -69 115 42 -126 -12 123 -28 -114 45 89 -54 -61 109 39 -133 -5 113
6876A13j81q3K35rk02O9J71j09j26J23J29j63q2J84L5k22M5K51j32k08J60J57
$$ 113 -68 -151 84 75 -127 -58 113 4 -122 1 130 -33 -115 69 104 -118 -73 178 46 -162 -2 155
6898A55k05r7K42Qk34M9K11j08j74J52J62k19q3K38Mk40Q5K14j38j96J85J15j78
$$ 155 -50 -147 95 103 -131 -82 129 21 -153 -1 161 -58 -141 97 101 -139 -54 160 22 -174 11 126 -52
6921e2j00K73k2k62J00K03j43j84J96J11k09m4K67m9k21M5K70j71j73K19J11k52
$$ -52 -152 121 99 -163 -63 140 -3 -187 9 120 -89 -133 134 85 -136 -91 179 8 -165 54 165 -87
6943h7o1K63Kk73J14K26j98j72K25J02k26p1K81l6k47P2K39j16k35K24J51k92
$$ -87 -148 115 117 -156 -42 184 -14 -186 39 141 -85 -156 125 89 -158 -86 153 37 -198 26 177 -115
6965a15n7L39r6k54J19K32j96j55K37P5k40j6K43pk40M3K66j58k47K94J34l12
$$ -115 -172 167 71 -183 -64 168 -28 -183 54 129 -111 -127 116 109 -131 -88 178 20 -227 67 201 -111
6987a11k7K89o3k72J53K11j95j79K39J29k63n1K70l3k84J20K88k38k09L08J11
$$ -111 -138 151 88 -184 -31 180 -15 -194 45 174 -89 -140 130 97 -187 -67 221 -17 -226 82 193
7008A93l65K1L53j25k80J55K52k07k06K83J08l06m9L62r5l18J68L05l01j66L16
$$ 193 -172 -151 202 77 -203 -48 204 -3 -209 74 182 -124 -173 189 94 -224 -56 249 -52 -218 98
7029I8O7l13QL64j36k90J68K47k56j73K92J25l58k0L89j77k66K06K28k89j16K80
$$ 98 165 -148 -140 224 88 -202 -34 213 -43 -216 76 201 -157 -177 212 35 -231 -25 203 -86 -202 78
7051G8R6l31lL37j06k99K03K83k89k14L59Q1l71L8L47j19l25K25K29k67j87L42
$$ 78 174 -157 -160 177 71 -228 -25 258 -31 -245 114 195 -176 -138 209 90 -235 -10 219 -48 -235 107
7073A07J07l70J2L72j28l62K75K75l63j69L64O8l82N5L36j09l12J82K90k75k30
$$ 107 214 -156 -144 228 100 -262 13 288 -75 -244 120 188 -194 -139 197 88 -224 -42 248 -27 -257
7094b57L50J06m10K5M21j61l56L09K04l30j15L51J7l23M0L46j37l36K60K50l09
$$ -257 93 199 -211 -186 235 74 -282 27 231 -99 -214 137 154 -169 -129 217 80 -256 4 254 -55
7115e5k20M37M7m37Q7M30k24l36K86K50l28j79L52R1m19L5M14j57l48K09L17l44
$$ -55 -275 162 209 -228 -141 289 65 -271 15 265 -63 -242 110 201 -218 -183 231 74 -274 -65 252 -92
7137i2j84M20L6m30J03L80j80l47K86K55l36j59L85Q7m21M9L99j42m30L38K85
$$ -92 -276 144 180 -250 -147 233 53 -294 -8 247 -89 -248 137 224 -197 -148 251 109 -321 17 302
7158C02m17j37M32J1m06O6L69j51l58K58L29l79j99M44P1n21J13M62k53l64L35
$$ 302 -115 -252 180 191 -215 -149 220 69 -289 -31 298 -81 -280 164 235 -286 -173 289 36 -328 7
7179GK70l87j43M09L8m15N5M43j73m32L13L52m34k19N36J3m95J14M20k18l68L52
$$ 7 277 -110 -253 156 194 -221 -166 277 104 -328 -15 337 -97 -316 220 233 -262 -148 272 54 -314 38
7201C8K60l93k16N00N0m76L6M95k00m46L64K98m37j78N00J0m88J33M21k41l46
$$ 38 298 -95 -311 189 239 -237 -201 294 94 -352 12 310 -127 -305 195 205 -283 -150 271 30 -316
7222c16L08L02m06j97M81Q6n43P1N44k86l91L99K66m75j27M95Lm67R8M72k28m36
$$ -316 -8 294 -112 -309 172 258 -285 -214 330 44 -347 52 318 -157 -284 211 214 -253 -155 317 89 -347
7244c47L49L63m71k13N31M9n28R8N13k95m05L81K92m48j80M99M2n12J10N02k60
$$ -347 2 365 -106 -319 212 261 -267 -169 344 49 -356 25 317 -131 -311 188 230 -282 -172 330 70
7265G0m50L91L55n21j75N24M3n45J50M76k73l87L87L07m78j82N14O3n64J08N46
$$ 70 -380 11 366 -155 -330 194 237 -308 -158 318 45 -342 45 352 -126 -308 206 269 -295 -187 359
7286C59l00m44M25L08m90j55N26j9n08J28N23k87m28L76L21n01j70N71J1n83J75
$$ 359 59 -385 40 348 -142 -297 229 210 -298 -170 353 66 -362 14 335 -166 -336 235 246 -337 -162
7307a62N17l02m32M23L00m97j57N38K7n56J15N34k69m56M18L47n63j71O03j9n69
$$ -162 355 53 -379 44 344 -153 -310 228 255 -301 -186 348 79 -377 41 388 -175 -346 257 238 -331
7328c31J95M92l14l92L92L17m94j95N57N0n98J37N26k59n15M70L37n51j62N98
$$ -331 -136 356 42 -350 42 359 -135 -330 227 277 -321 -184 342 83 -432 38 375 -176 -338 260
7348B60m4n54J73N39l49m11M26L38n33k18O43J6o40J99N64l69m55M85L06n60j27
$$ 260 216 -338 -165 374 25 -386 40 378 -155 -373 270 286 -354 -155 409 40 -415 70 376 -184 -311
7369c11N87k2n54J32N26l02m66M31L81n47j93O08k5n93J75N83l68m52M83L03n60
$$ -311 276 254 -300 -168 358 56 -410 21 402 -145 -338 270 245 -348 -173 410 42 -410 73 376 -184
7390a84j57N95Mo11K06N43l11n02M49L39n23j99O18J8o37J76N85l61m68M99L43
$$ -184 -341 254 258 -353 -147 396 85 -417 32 371 -152 -351 267 285 -352 -176 409 48 -420 79 422
7411D22n99j40O21m2o20K07N74l54n01M99L59n85k01O43j4o37K00O02l88n20N44
$$ 422 -177 -317 304 262 -358 -151 423 69 -432 67 426 -159 -360 283 269 -368 -168 434 46 -474 70
7432G0L31n91j92O69l0o36K00N85l55m69M89L36n73k07O38L7o55J81O02l69n20
$$ 70 401 -190 -382 287 257 -379 -179 406 51 -418 71 407 -166 -373 265 302 -353 -172 430 61 -459
7453d59N29L61o12j79O58po69K25N91l95m87N01L64o28j83P11l6o88J81O57l86
$$ -459 70 431 -181 -360 298 291 -378 -153 438 43 -444 57 421 -207 -390 321 285 -403 -222 435 49
7474D9n01N50L42o65j44O83k8o85K10O38m11m87N05L93o40k01P07jp16K24O20
$$ 49 -452 98 440 -225 -369 314 286 -399 -189 449 38 -449 56 449 -191 -392 315 314 -402 -178 442
7495D42l80n10N34L66o55j92P00np21K56O47m60m72N36L57o73j91P19qo94J85
$$ 442 62 -448 86 452 -203 -395 305 300 -421 -165 482 22 -450 86 443 -230 -421 298 290 -404 -219
7516b19O66l87n47N69L53o51j71P27o6p07K83N94m06m88N34L47o42k03P55rp60
$$ -219 447 60 -487 82 435 -216 -387 340 274 -433 -150 444 38 -450 84 431 -211 -414 341 332 -428
7537d28K24O88m44n26O20L39p16j54P25k4p17K37O13l95n28N93L33o65j56P07
$$ -428 -204 484 40 -486 134 473 -243 -397 328 304 -413 -176 437 42 -486 107 440 -225 -381 326
7557C26pp79K62O81m67n17O27L44p33j30P23m5p39K87O62m68n18O03L72p30j71
$$ 326 319 -460 -198 483 16 -501 126 470 -263 -393 330 285 -454 -167 495 27 -491 112 484 -246 -417
7578d17Q16r9p89L51O31m84m70N85L27o81j38O84j9p41K48O92m89n38O50L68p57
$$ -417 399 300 -489 -138 493 9 -461 124 451 -230 -368 316 297 -444 -196 496 7 -531 119 487 -270
7599b70j52Q01j22p47L20O32m48n21N76L87o96j99Q00o1p66K81P39n63m97O37
$$ -270 -422 379 257 -490 -170 462 14 -507 69 456 -240 -439 361 300 -466 -185 554 -9 -506 131
7619A31L71p54j48P63o6p23K55O49m38n68O36M04p80j62Q09m2q19L33O74n46m99
$$ 131 502 -252 -400 363 297 -426 -171 478 40 -528 108 512 -268 -430 379 337 -482 -149 525 -21 -520
7640e20O26L54p52j40P85p1p66K69P29m78o06O76L90p72j78Q47r6p92L62O40n11
$$ -520 106 460 -292 -432 353 282 -484 -215 514 36 -570 106 496 -276 -454 393 297 -495 -133 507 -4
7661dm96O45L37p12k00Q05m4q13K84P42n06n90O91L60p93j05Q08j26p47L07O51
$$ -4 -500 145 482 -230 -430 375 331 -482 -198 544 38 -552 139 499 -294 -399 409 283 -464 -157 494
7682D94m85n25O40L57p74j63Q23n8q34L47P13n72n37P23L51q07j19Q30r4p84K65
$$ 494 9 -516 124 481 -293 -456 367 309 -525 -178 535 -37 -574 149 500 -307 -426 404 310 -474 -209
7703b09P29m84n70O69L89q15j53Q68j22q26L89O59n29n39O66L60p66j43P99o4
$$ -209 520 36 -534 135 524 -291 -444 424 302 -524 -135 524 -5 -544 122 482 -284 -427 372 308
7723C08p89K96P24n49n61P13L64q27j15Q32j40p74L84O65n28n43O73L60p65j55
$$ 308 -481 -185 539 -10 -571 142 506 -321 -436 396 256 -518 -134 531 3 -540 133 493 -272 -427
7743d27Q52j08q44L49P72n82n83P83K75p93q2Q45j68p81L42O69m98n80O99M13
$$ -427 425 317 -527 -178 594 12 -571 212 487 -306 -388 457 289 -492 -150 519 21 -559 140 553
7763E53q63j30Q88j52q48M26P04o32n09P25K99p61j15Q03j07p86L25P51n48n97
$$ 553 -310 -440 448 296 -552 -126 578 -54 -563 162 461 -300 -415 388 281 -505 -180 571 23 -574
7783e74P55L55q72j21R33k19p89M15O57n67m87O81L40q07j17Q66j07q64L76P40
$$ -574 181 536 -336 -457 476 257 -532 -117 540 -27 -514 167 507 -300 -417 449 342 -522 -146 594
7803E94n90o05Q04L11q59q0Q79j76q23M20O41n26n74P53L56q37j49Q92j22q72
$$ 594 4 -601 203 514 -345 -425 454 278 -545 -125 516 -10 -584 169 525 -312 -461 431 309 -563
7823e63M05P49o41n04P56K93q27o1Q36j66p79L59P01n38n81P21L86q86j01R10
$$ -563 -158 591 -50 -554 202 495 -332 -393 443 277 -502 -143 558 20 -561 160 546 -340 -441 469
7843D69j78q49M28P15o31n27P61L25q32j27Q77j12q66L68P96o42o20Q49L48r18
$$ 469 291 -558 -130 585 -46 -573 188 513 -319 -446 431 319 -547 -179 617 -25 -645 204 552 -366
7863c66n7Q68j75q14M03O71n69n21P36L47q24j40R13j55q96M45P48o55n16P81
$$ -366 -423 445 270 -544 -141 530 -39 -560 176 523 -301 -441 472 317 -579 -134 614 -41 -557 224
7883B24L21q76q9Q95j99q25M09P23o05n57P52L70q80j27R49j87q68M36P23o20
$$ 224 545 -331 -420 475 276 -549 -140 583 -22 -579 173 543 -337 -464 485 298 -570 -134 589 -31
7903c1n34P60K95q39q8Q79j54q19L71P64o35n85Q05L37r11k2Q92j91q66M66P00
$$ -31 -565 195 490 -349 -437 442 288 -531 -160 604 -31 -616 189 526 -385 -407 485 294 -572 -106 594
7924E94o21n62P62L67q66j24R38j73q72M05P72o30n99P96L36r06m2R11k16q51
$$ 594 -27 -589 173 540 -326 -450 488 315 -557 -152 620 -10 -609 187 523 -383 -425 486 270 -581
7944e81M41P08n92n56P46L95r21j18R45j58q85M37P65o58n62Q07L50r17q8R22
$$ -581 -140 568 -24 -580 166 561 -360 -478 467 309 -576 -139 626 -32 -594 213 563 -354 -442 480
7964D80j91q67M15P93o28o34Q36L34r06q5R74k14q69M26P36o44n52Q00L48r03
$$ 480 289 -578 -163 630 2 -632 204 538 -368 -453 521 307 -562 -136 600 -44 -596 204 552 -351
7984c51j17R46j66q98M48P48o58n73P94L31q92m9R17j75r07M64P46o51n47Q12
$$ -351 -468 478 312 -586 -138 610 -48 -621 173 504 -388 -437 480 305 -602 -138 608 -43 -590 222
8004B22L34r00q6R02j67q71M22P67o39n71P96L42r36o7R42j80q68M29P47o64n59
$$ 222 556 -344 -430 472 305 -566 -144 623 -16 -587 209 551 -385 -452 490 310 -558 -129 618 -46 -605
8025f05Q22L44r52p2R80k18r06M55P57o50n61Q19L53r45m6R24j74r24M57P71o87
$$ -605 217 561 -391 -463 517 299 -607 -152 605 -45 -606 213 566 -379 -425 499 325 -599 -142 629 -58
8046e8n52Q28L28r34k9R09j99q58M20P79o50o04Q25L23r25l2R30k14q83M79P49
$$ -58 -610 218 546 -388 -417 492 293 -565 -145 634 -16 -620 205 528 -397 -429 501 287 -596 -117 632
8067F32o81n73Q21L43r43o0R78k32q71M70P52p03n51Q45L25r41n8R76k16q90M54
$$ 632 -49 -622 199 542 -401 -461 517 285 -586 -116 636 -67 -618 227 552 -389 -447 529 313 -577 -123
8088a23P62o88n35Q14L43r69k7R51k11r05M89P41p00n39Q68K70r29n1R50k35q81
$$ -123 639 -49 -584 230 573 -396 -423 528 317 -588 -99 642 -58 -597 271 541 -388 -439 511 276 -605
8109f05M67P68o91n67Q76L07r38n3R58k56q77M61P65o73n38P91L43r08p2R61j97
$$ -605 -138 630 -61 -628 248 555 -383 -436 522 266 -611 -150 615 -58 -596 195 538 -370 -442 519 322
8130C22r15M53P70o79n90R05K94r60%R13k29q41M36P71o77n90Q54L33r67n3R94
$$ 322 -593 -140 630 -49 -639 266 560 -400 -400 513 284 -557 -121 650 -27 -617 237 570 -397 -450 544
8151E44k45r33N27P35o90n81Q57L23r53k5R42k22q74M59P81o94n82Q49L21r43
$$ 544 299 -634 -107 628 -62 -643 214 537 -416 -441 501 279 -595 -136 645 -49 -631 218 539 -404
8171d04o1R95k24r08M90P54p00n53Q18L36r25l9R17j91r03M31Q36p05o05Q98
$$ -404 -465 530 306 -602 -112 642 -58 -611 207 543 -382 -421 496 305 -598 -167 669 -36 -641 257
8191B57
$$ Imaginary data points
##PAGE= N=2
##DATA TABLE= (X++(I..I)), XYDATA
0@%%%%%%%%kMj0J6j7K5l2M0n2O2p6R2j12J37j62J90k25K65l08L56m11M75n46O24
$$ 0 0 0 0 0 0 0 0 0 -2 2 -8 8 -9 16 -16 24 -28 34 -42 50 -62 75 -87 103 -122 143 -165 191 -220 255 -291 333
32C33p10Q05r11J027j154J296j453J621j807K012k235K478k741L031l348L695
$$ 333 -377 428 -483 544 -610 686 -767 854 -953 1059 -1176 1302 -1439 1592 -1756 1939
48A939m075M488m943N446o002O616p301Q075q950R944j1087J2423j4010J5925
$$ 1939 -2136 2352 -2591 2855 -3147 3469 -3832 4243 -4707 5237 -5850 6573 -7437 8488
62H488j8291K1303k5291L0845l9162N3150q2490K46949l54574k09990P09800k40723
$$ 8488 -9803 11500 -13791 17054 -22108 31042 -51448 195501 -159073 -369063 340737 100014
74A00014m56441K34337K88925k17188q0921J66879J25372j71118q9178K15538
$$ 100014 -356427 -122090 166835 -50353 -131274 35605 160977 -10141 -99319 116219
84A16219L0407l33559R2760L37515k23724k95891L55423J80648m25241o7487M34622
$$ 116219 146626 -186933 -94173 243342 19618 -276273 79150 259798 -165443 -232930 201692
95B01692r6796m03462K22662L56761k66112k24466L12163J72160l09487j50751
$$ 201692 104896 -298566 -75904 280857 14745 -209721 102442 274602 -34885 -185636
105a85636K71888N8828l44332O712L43992j32614k45218L16682J39749l53332
$$ -185636 86252 145080 -199252 -192540 151452 18838 -226380 90302 230051 -123281
115a23281M1571L22899j76919k78500J78768K00024j83512j87436K08902J97774
$$ -123281 -81710 241189 64270 -214230 -35462 164562 -18950 -206386 2516 200290
125B00290k53037j38250L19292K5253l42522J02066K95865j99265j97612K70486
$$ 200290 -52747 -190997 128295 153548 -188974 -86908 208957 9692 -187920 82566
135H2566J21918k87853n5960K67595m1776k76496R1117K25380j42234j40241K15006
$$ 82566 204484 -83369 -139329 128266 86490 -190006 -98889 126491 -15743 -155984 59022
146E9022J15538k11352n1200K34662k2206k93271O8534K69349j87103k21043K83605
$$ 59022 174560 -36792 -87992 146670 124464 -168807 -100273 169076 -18027 -239070 44535
157D4535J33129k88546R404K60655r3384j93223J17740J30799j27541j17970J45463
$$ 44535 177664 -110882 -101478 159177 65793 -127430 -9690 121109 -6432 -124402 21061
168B1061J24347j85214j01226K33568K5318k73903N7416K46575j48947j71186
$$ 21061 145408 -39806 -141032 92536 117854 -156049 -98633 147942 -1005 -172191
178a72191K34986J03197k48145M513K46458j00591k32836J37028J59600j79162
$$ -172191 62795 165992 -82153 -77640 168818 68227 -164609 -27581 132019 -47143
188d7143j15910J86288R8083j66923n7452J98356K8865k26431L2405K17962j39856
$$ -47143 -163053 23235 121318 -45605 -103057 95299 124164 -102267 -69862 148100 8244
199H244j80130K17307Q7671k41083K3158K18918r2620j66518J14595J17127j24843
$$ 8244 -171886 45421 133092 -107991 -84833 134085 41465 -125053 -10458 106669 -18174
210a8174r8875J46639R6126j74186n4720K18926j0826k42693P4630K02935j52210
$$ -18174 -117049 29590 125716 -48470 -103190 115736 104910 -137783 -63153 139782 -12428
221a2428j52841J91122R4390j85782j4590J89168l4284j69824P6253J31871j33346
$$ -12428 -165269 25853 120243 -65539 -80129 109039 74755 -95069 -18816 113055 -20291
232b0291j10682J65819P0724j91961j2933K20216l8591k14601J00156J80487j57207
$$ -20291 -130973 34846 105570 -86391 -99324 120892 82301 -132300 -32144 148343 -8864
243h864j31371J80219O9519j73153j2724J58167j8191j43182L7229J29656p8426
$$ -8864 -140235 39984 109503 -63650 -76374 81793 63602 -79580 -42351 87305 8879
254H879j28275J26853J03504j72492l4110K13258l9232k03967J11180J54897j68951
$$ 8879 -119396 7457 110961 -61531 -95641 117617 78385 -125582 -14402 140495 -28456
265b8456j07596J79344N3437j73908p767J72693j6286j56652N0635J39478r1206
$$ -28456 -136052 43292 96729 -77179 -84946 87747 71461 -85191 -34556 104922 13716
276A3716j19995J19535P7853j44867k5661J60669k3912j52539P6416J28542j24904
$$ 13716 -106279 13256 91109 -53758 -79419 81250 57338 -95201 -18785 109757 -15147
287a5147r9255J51578N6422j65054r553J73683k3843j63383O1252J46432j03322
$$ -15147 -114402 37176 93598 -71456 -81009 92674 68831 -94552 -33300 113132 9810
298I810j28553J31986Q5624j57681k8957J71160k3353j50709P8624J17738j18594
$$ 9810 -118743 13243 98867 -58814 -87771 83389 60036 -90673 -12049 105689 -12905
309a2905q2757J32038L8622j41613k580J45862k5705j36692O2676J24756r8395
$$ -12905 -95662 36376 74998 -66615 -69195 76667 50962 -85730 -23054 101702 3307
320C307j04801J23459O6412j44542k2762J54299j8009j42528O3580J21949j02326
$$ 3307 -101494 21965 88377 -56165 -78927 75372 57363 -85165 -21585 100364 -1962
331a962r4692J23730N1228j40059q025J45558k8799j31501P1674J14791j06837
$$ -1962 -96654 27076 78304 -61755 -69780 75778 46979 -84522 -12848 101943 -4894
342d894r1014J28241M9613j47379q658J49785k9605j30955O9474J09571r5295
$$ -4894 -95908 32333 81946 -65433 -74091 75694 46089 -84866 -15392 94179 -1116
353a116q3476J09812M9871j27491j8871J38819j6967j35894O5082J23064j06967
$$ -1116 -84592 25220 75091 -52400 -71271 67548 50581 -85313 -20231 102833 -4134
364d134r1628J32079M1545j44748L597J36674l8618j13127P0422R4990q9879p6000
$$ -4134 -95762 36317 77862 -66886 -63289 73385 34767 -78360 -7938 87052 -2827 -78827
376g8827J04316M8328j25805k1434J37624j3995j34226O1130J22549r8920r0498
$$ -78827 25489 73817 -51988 -73422 64202 50207 -84019 -22889 99660 740 -89758
387h9758J24909M2078j40387J822J32005m1172j08805P3374Q7868q8449o4721
$$ -89758 35151 77229 -63158 -61336 70669 29497 -79308 -5934 81934 -6515 -71236
398g1236R8965L9988j15456j7435J25798j6176j25874O1942J16118r9986q5128
$$ -71236 27729 67717 -47739 -65174 60624 44448 -81426 -19484 96634 -3352 -88480
409h8480J25970L9985j40647j147J33622l4732j15427O8048R8533q7602p1517
$$ -88480 37490 77475 -63172 -64319 69303 34571 -80856 -12808 85725 -1877 -73394
420g3394J03793L8372j18434r464J17710k5072j09793O0798R8694q6624p2478
$$ -73394 30399 68771 -49663 -59127 58583 33511 -76282 -15484 83210 -3414 -75892
431g5892J09503L7790j25189l849J21489l2991j07419O4728R1097q2755o7231
$$ -75892 33611 71401 -53788 -57637 63852 30861 -76558 -11830 79267 -3488 -70719
442g0719R9086M1148j16336j5063J21443k3007j16183O4638R9095r2422o2772
$$ -70719 28367 69515 -46821 -61884 59559 36552 -79631 -14993 84102 -8320 -71092
453g1092J09433K4230j13688L933J03031l0435r3882N3338Q7237p1815p0140R5910
$$ -71092 38341 62571 -51117 -47184 55847 25412 -68470 -15132 72105 290 -69850 26060
465B6060M6305j17386j6370J23291k5917j17786O7722R8091r6622n8892J14790
$$ 26060 72365 -45021 -61391 61900 35983 -81803 -14081 84010 -12612 -71504 43286
476D3286J6944j14848J6023R5636m1447p8016N3166O8300n9292n9554P8944M9623
$$ 43286 60230 -54618 -38595 57041 15594 -62422 -9256 59044 -248 -59802 19142 68765
488F8765j05466k4958J22581k2114j22717P1095R6620j02681n0245J14039Q682
$$ 68765 -36701 -61659 60922 38808 -83909 -12814 83806 -18875 -69120 44919 53601
499E3601j04874J7379Q6287l5191p5853M8000P0386o2505n7264Q5822L7553j04864
$$ 53601 -51273 -33894 52393 17202 -58651 -10651 59735 -2770 -60034 25788 63341 -41523
511d1523q691J09293l0870j04122O5251Q4299q9674n0701J06519J8214j06854
$$ -41523 -50214 59079 28209 -75913 -10662 73637 -16037 -66738 39781 57995 -48859
522d8859J1778R5403l8173q4196N4905P1210p0690n5089R0828L4280j05981j869
$$ -48859 -37081 58322 20149 -64047 -9142 62068 -8622 -63711 27117 61397 -44584 -46453
534d6453J08544l7431r6071O8765O9862q4240l9311Q9078J7062q8713n33Q7971
$$ -46453 62091 24660 -71411 -2646 67216 -17024 -56335 32743 49805 -38908 -39441 48530
546D8530k2189r0391M8838Q2131p6544n6209J00332K3961j05311J0857R6208m1303
$$ 48530 26341 -64050 -15212 66919 -9625 -65834 34498 58459 -46852 -35995 60213 18910
558A8910q3741N9966O5042p5872m3780Q9454K0955r3835O630R1544l1660q2835
$$ 18910 -64831 -4865 60177 -15695 -59475 29979 50934 -42901 -36271 55273 23613 -59222
570e9222N1140O9563o8494n3391Q5687L1509j00323j681J03756l5102r3464O6515
$$ -59222 -8082 61481 -7013 -60404 25283 56792 -43531 -45212 58544 23442 -70022 -3507
582c507O8689q4600l5947R2274R698q8818J1718Q2031l1974p6779M8833O4336
$$ -3507 65182 -19418 -55365 36909 46607 -42211 -30493 51538 19564 -57215 -8382 55954
594E5954o7695m6904Q4359K7025r2362q37R5777k6830r0588N5497P2745q2206
$$ 55954 -11741 -58645 25714 52739 -39623 -40460 55317 28487 -62101 -6604 66141 -16065
606a6065m4585R5986R726r3682K0249P8200l8647o1196M7830N1670n5517m4791
$$ -16065 -60650 35336 45062 -48620 -28371 49829 11182 -50014 -2184 49486 -6031 -50822
618e0822P1807L3004r0258o602R8450l2517r0181O6215O2790q5016k9935Q7513
$$ -50822 20985 53989 -36269 -42871 55579 23062 -67119 -904 61886 -23130 -53065 34448
630C4448N221p8956J3018P3109k7468p0337M4228O3193o5759m8278Q3319K2497
$$ 34448 39669 -39287 -26269 46840 19372 -50965 -6737 56456 -9303 -57581 25738 48235
642D8235r1930Q348Q9402l6693p6343N9304N7107p2503l3418P7994J0288p7011
$$ 48235 -43695 -35347 54055 17362 -58981 323 57430 -15073 -48491 29503 39791 -37220
654c7220Q876P1988k6145o7728M1929O0471o0532m5292Q0673K0611r1346J2936
$$ -37220 -28344 43644 17499 -50229 -8300 52171 -8361 -53653 27020 47631 -43715 -30779
666c0779Q7046m3849o8407O1298M2829o6365k2873O5490J0834o7134O74P3112
$$ -30779 56267 12418 -55989 5309 48138 -18227 -41100 24390 35224 -31910 -31236 41876
678D1876j8729p4943M4756O4056p0256l9358Q5159Q934q5356J7700P4675l7224
$$ 41876 23147 -51796 -7040 57016 -13240 -52598 32561 41495 -43861 -26161 48514 11290
690A1290o1084N0908M6899o2690l0643P2789J1507p6864J0520P3136l2057o3122
$$ 11290 -49794 1114 48013 -14677 -45320 27469 38976 -37888 -27368 45768 13711 -49411
702d9411M9721M8470o3406l1152P3149J1488p6830J1203P3269l3807o2829N1805
$$ -49411 310 48780 -14626 -45778 27371 38859 -37971 -26768 46501 12694 -50135 1670
714A670M6786o4110k8881P1181J0577p3228R858P1085l1037o2591M9535M6914
$$ 1670 48456 -15654 -44535 26646 37223 -36005 -26147 44938 13901 -48690 845 47759
726D7759o2803k7881O8302Q235o8430J0504O6069k8639n9970M7533M8037o3921
$$ 47759 -15044 -42925 25377 33612 -34818 -24314 41755 13116 -46854 679 48716 -15205
738a5205k8227P3387M031p3096J7976O4534l4375n4191M4958M3993n5005l2310
$$ -15205 -43432 29955 33986 -39110 -21134 43400 9025 -45166 -208 43785 -11220 -43530
750d3530O6967J6035p5280Q075P5690l3966o4290N3651M2850o4629k1039O5540
$$ -43530 23437 39472 -35808 -27733 47957 13991 -50299 3352 46202 -18427 -39466 26074
762B6074K225o2230J3442N9137k7115n3099M3080M3651n8425k8242O8894P241
$$ 26074 28299 -33931 -20489 38648 11533 -41566 1514 45165 -13260 -41502 27392 34633
774C4633p3146J3973O8259l3875n6888M9388M1489n8739k3231O3522O263o2911
$$ 34633 -38513 -24540 43719 9844 -47044 2344 43833 -14906 -38137 25385 31648 -31263
786c1263J0077N9497k5832n3895M0657M2889n6225k7122O6842N209o8922J9511
$$ -31263 -21186 38311 12479 -41416 -759 42130 -14095 -41217 25625 30834 -38088 -18577
798a8577O2657l8565m7902N1455L2468n8015j9959O0779O984o5239P020O6741
$$ -18577 44080 5515 -42387 9068 41536 -16479 -36438 24341 31325 -33914 -26894 39847
810C9847k5504o1038M6118M7157o0417k4662O6154J599o2662J7147N3457l1441
$$ 39847 14343 -46695 -577 46580 -13837 -38499 27655 29254 -33408 -16261 37196 5755
822E755m4040M1598L3314n1394k0795N9430M803o2808J4854O0999l3025n1569
$$ 5755 -38285 3313 36627 -14767 -35562 23868 28671 -34137 -19283 41716 8691 -42878
834d2878M8662L7751n9601k2367O3796M513o4506J1550N9942k6014n0299L9713
$$ -42878 5784 43535 -16066 -38433 25363 29876 -34630 -23080 36862 10848 -39451 262
846B62L9052m8971k3631N5766N704n8992J2748N5117l2080m5829M7319L1253n6356
$$ 262 39314 -9657 -33288 22478 28182 -30810 -18062 37055 4975 -40854 6465 37718 -18638
859a8638j4075N9827j759n8510J6482N5178l0179m8982M3967L8824n6515k4236
$$ -18638 -32713 27114 25355 -33155 -16673 38505 8326 -40656 3311 42135 -14380 -38616
$$ [...]
8191F00
##END NTUPLES=NMR FID
##END=
