##TITLE=1H_IG-Bacid
 CDCl3
 64 sc, 
 30.11.2023
##JCAMPDX= 6.0         $$ Bruker NMR JCAMP-DX V2.0
##DATA TYPE= NMR FID
##DATA CLASS= NTUPLES
##ORIGIN= UXNMR, Bruker Analytische Messtechnik GmbH
##OWNER= root
$$ XWIN-NMR		Version 3.5
$$ Thu Nov 30 13:58:32 2023 Russian Standard Time (UT+4h)  she@DPX200
##.OBSERVE FREQUENCY= 200.1313
##.OBSERVE NUCLEUS= ^1H
##.DELAY= (6, 6)
##.ACQUISITION MODE= SIMULTANEOUS
##.ACQUISITION SCHEME= undefined
##.AVERAGES= 64
##.DIGITISER RES= 18
##SPECTROMETER/DATA SYSTEM= spect
##.PULSE SEQUENCE= zg30
##.SOLVENT NAME= CDCl3
##.SHIFT REFERENCE= (INTERNAL, CDCl3, 0, 15.7039)
##AUDIT TRAIL= $$ (NUMBER, WHEN, WHO, WHERE, WHAT)
$$ ##TITLE= Audit trail, XWIN-NMR		Version 3.5
$$ ##JCAMPDX= 5.01
$$ ##ORIGIN= Bruker BioSpin GmbH
$$ ##OWNER= she
$$ F:/spectra/data/she/nmr/H-F/1/audita.txt
$$ ##AUDIT TRAIL=  $$ (NUMBER, WHEN, WHO, WHERE, WHAT)
(   1,<2023-11-30 13:57:43.25 +0400>,<she>,<DPX200>,
      <continue with go, POWCHK disabled, PULCHK disabled
       configuration hash MD5:
       00 E9 B6 7A A2 85 ED C7 34 08 36 98 17 FE 4E 26
       data hash MD5: 16K
       8F 47 29 D8 08 47 1B 36 6D 13 99 D0 AF 19 D5 C5>)
$$ ##END=
$$ 
$$ hash MD5
$$ D5 63 63 C5 9F 4A 59 5D 42 8C BD 92 8E 8E 72 14
##$RELAX= 
##$RELAX= 
##$RELAX= 
##$RELAX= 
##$RELAX= 
##$RELAX= 
$$ Bruker specific parameters
$$ --------------------------
##$DU= <F:/spectra>
##$EXPNO= 1
##$NAME= <H-F>
##$PROCNO= 1
##$TYPE= <nmr>
##$USER= <she>
##$AMP= (0..31)
100 100 100 100 100 100 100 100 100 100 100 100 100 100 100 100 100 100 
100 100 100 100 100 100 100 100 100 100 100 100 100 100 
##$AQSEQ= 0
##$AQ_mod= 1
##$AUNM= <au_zg>
##$AUTOPOS= <>
##$BF1= 200.13
##$BF2= 200.13
##$BF3= 200.13
##$BF4= 200.13
##$BF5= 200.13
##$BF6= 200.13
##$BF7= 200.13
##$BF8= 200.13
##$BYTORDA= 1
##$CFDGTYP= 0
##$CFRGTYP= 5
##$CHEMSTR= <none>
##$CNST= (0..31)
1 1 145 1 1 1 1 1 1 1 1 1 1 1 1 1 1 1 1 1 1 1 1 1 1 1 1 1 1 1 1 1 
##$CPDPRG= <>
##$CPDPRG1= <>
##$CPDPRG2= <>
##$CPDPRG3= <>
##$CPDPRG4= <mlev>
##$CPDPRG5= <mlev>
##$CPDPRG6= <mlev>
##$CPDPRG7= <mlev>
##$CPDPRG8= <mlev>
##$CPDPRGB= <>
##$CPDPRGT= <>
##$D= (0..31)
0 1.2 0 0 0 0 0 0 0 0.06 0 0.03 0 0 0 0 0.0002 0 0 0 0 0 0 0 0 0 0 0 0 
0 0 0 
##$DATE= 1701338023
##$DBL= (0..7)
120 120 120 120 120 120 120 120 
##$DBP= (0..7)
150 150 150 150 150 150 150 150 
##$DBP07= 0
##$DBPNAM0= <>
##$DBPNAM1= <>
##$DBPNAM2= <>
##$DBPNAM3= <>
##$DBPNAM4= <>
##$DBPNAM5= <>
##$DBPNAM6= <>
##$DBPNAM7= <>
##$DBPOAL= (0..7)
0.5 0.5 0.5 0.5 0.5 0.5 0.5 0.5 
##$DBPOFFS= (0..7)
0 0 0 0 0 0 0 0 
##$DE= 6
##$DECBNUC= <off>
##$DECIM= 32
##$DECNUC= <off>
##$DECSTAT= 4
##$DIGMOD= 1
##$DIGTYP= 9
##$DL= (0..7)
0 120 120 120 120 120 120 120 
##$DP= (0..7)
150 150 150 150 150 150 150 150 
##$DP07= 0
##$DPNAME0= <>
##$DPNAME1= <>
##$DPNAME2= <>
##$DPNAME3= <>
##$DPNAME4= <>
##$DPNAME5= <>
##$DPNAME6= <>
##$DPNAME7= <>
##$DPOAL= (0..7)
0.5 0.5 0.5 0.5 0.5 0.5 0.5 0.5 
##$DPOFFS= (0..7)
0 0 0 0 0 0 0 0 
##$DQDMODE= 0
##$DR= 18
##$DS= 0
##$DSLIST= <SSSSSSSSSSSSSSS>
$$ [...]
##$SUBNAM2= <"">
##$SUBNAM3= <"">
##$SUBNAM4= <"">
##$SUBNAM5= <"">
##$SUBNAM6= <"">
##$SUBNAM7= <"">
##$SUBNAM8= <"">
##$SUBNAM9= <"">
##$SW= 18.0517328524113
##$SWIBOX= (0..15)
0 0 2 0 0 0 0 0 0 0 0 0 0 0 0 0 
##$SW_h= 3612.71676300578
##$TD= 16384
##$TD0= 1
##$TE= 0
##$TE2= 300
##$TE3= 300
##$TEG= 300
##$TL= (0..7)
0 120 120 120 120 120 120 120 
##$TP= (0..7)
150 150 150 150 150 150 150 150 
##$TP07= 0
##$TPNAME0= <>
##$TPNAME1= <>
##$TPNAME2= <>
##$TPNAME3= <>
##$TPNAME4= <>
##$TPNAME5= <>
##$TPNAME6= <>
##$TPNAME7= <>
##$TPOAL= (0..7)
0.5 0.5 0.5 0.5 0.5 0.5 0.5 0.5 
##$TPOFFS= (0..7)
0 0 0 0 0 0 0 0 
##$TUNHIN= 0
##$TUNHOUT= 0
##$TUNXOUT= 0
##$USERA1= <user>
##$USERA2= <user>
##$USERA3= <user>
##$USERA4= <user>
##$USERA5= <user>
##$V9= 5
##$VALIST= <valist>
##$VCLIST= <CCCCCCCCCCCCCCC>
##$VD= 0
##$VDLIST= <DDDDDDDDDDDDDDD>
##$VPLIST= <PPPPPPPPPPPPPPP>
##$VTLIST= <TTTTTTTTTTTTTTT>
##$WBST= 1024
##$WBSW= 4
##$XGAIN= (0..3)
0 0 0 0 
##$XL= 0
##$YL= 0
##$YMAX_a= 205734
##$YMIN_a= -214751
##$ZGOPTNS= <>
##$ZL1= 120
##$ZL2= 120
##$ZL3= 120
##$ZL4= 120
##$ABSF1= 10
##$ABSF2= 0
##$ABSG= 5
##$ABSL= 3
##$ALPHA= 0
##$AQORDER= 0
##$ASSFAC= 0
##$ASSFACI= 0
##$ASSFACX= 0
##$ASSWID= 0
##$AUNMP= <proc_1d>
##$AZFE= 0.1
##$AZFW= 0.1
##$BCFW= 1
##$BC_mod= 2
##$BYTORDP= 1
##$COROFFS= 0
##$CY= 11.3945322036743
##$DATMOD= 1
##$DC= 2
##$DFILT= <>
##$DTYPP= 0
##$F1P= 15.7292609196834
##$F2P= 12.9074282941183
##$FCOR= 0.5
##$FTSIZE= 0
##$FT_mod= 4
##$GAMMA= 1
##$GB= 0.15
##$INTBC= 1
##$INTSCL= 1
##$ISEN= 128
##$LB= 0.24
##$LEV0= 0
##$LPBIN= 0
##$MAXI= 10000
##$MC2= 0
##$MEAN= 0
##$ME_mod= 0
##$MI= 1.114404
##$NCOEF= 0
##$NC_proc= 0
##$NLEV= 6
##$NOISF1= 3.799351
##$NOISF2= 2.8
##$NSP= 1
##$NTH_PI= 0
##$NZP= 0
##$OFFSET= 15.70392
##$PC= 1
##$PHC0= -24599.91
##$PHC1= 21.85271
##$PH_mod= 1
##$PKNL= yes
##$PPARMOD= 0
##$PSCAL= 0
##$PSIGN= 0
##$REVERSE= no
##$SF= 200.130013532006
##$SI= 16384
##$SIGF1= 3
##$SIGF2= 2
##$SINO= 400
##$SIOLD= 16384
##$SREGLST= <1H.CDCl3>
##$SSB= 0
##$STSI= 0
##$STSR= 0
##$SW_p= 3612.71676300578
##$SYMM= 0
##$S_DEV= 0
##$TDeff= 0
##$TDoff= 0
##$TI= <>
##$TILT= no
##$TM1= 0
##$TM2= 0
##$TOPLEV= 0
##$USERP1= <user>
##$USERP2= <user>
##$USERP3= <user>
##$USERP4= <user>
##$USERP5= <user>
##$WDW= 1
##$XDIM= 8192
##$YMAX_p= 0
##$YMIN_p= 0
$$ End of Bruker specific parameters
$$ ---------------------------------
##NTUPLES= NMR FID
##VAR_NAME=  TIME,          FID/REAL,        FID/IMAG
##SYMBOL=    X,             R,               I
##VAR_TYPE=  INDEPENDENT,   DEPENDENT,       DEPENDENT
##VAR_FORM=  AFFN,          ASDF,            ASDF
##VAR_DIM=   8192,          8192,            8192
##UNITS=     SECONDS,       ARBITRARY UNITS, ARBITRARY UNITS
##FACTOR=    0.0002768,     1,               1
##FIRST=     0,             0,               0
##LAST=      2.2672688,     0,               0
##MIN=       0,             -214751,         0
##MAX=       2.2672688,     205734,          0
$$ Real data points
##PAGE= N=1
##DATA TABLE= (X++(R..R)), XYDATA
$$ [...]
2457a92k8L06Oj81J142k84k71l02k50P30M3n31o0k28l85J056j005o9J43K88o31
2478g03k61N52O05K4K89r59J34L72O56l76p67K76O73Pq59Q16o59k25P3M45R6K14
2500D23j191K51K91J71N48k60l33O3J073k86k06L99r90p6L05J07l02N8o54o9J2
2521f66kN2O36j17j43j62M36m04J063l77J53k58m69J04J31M80k40p85J091p19
2541a96lm6J54p26O80k1n84L85J182k79q0q57J096j056P59l14R20q54j37q34L59
2562d52J482j337j85k31Q01l53K95J07Q1p61L17P66j46M2L81n72r67J453j115
2581c94JL43n78p18M99M75K30k77k57O31k7K57RR0p0M60L08o89J43m04l97L72
2603GM01J12j447Q58O67l04j001R17q13L14n91P87O78j2j01mr0P89l25P1r22o18
$$ y = [-192, -220, 86, 92, -89, 1053, 769, 498, 196, -54, 676, 719, 188, 128, -100, -485, 571, -434, -503, -360, -72, -703, -964, -412, 193, 217, 506, -453, -319, 53, 709, 333, -434, -158, 515, 522, -337, 479, -180, -405, -332, 113, 209, 423, -768, -517, -226, -55, 493, 233, -100, -37, 1036, 750, 544, 943, -47, -123, 182, 289, -13, 45, -609, -678, -666, -668, -616, 20, -97, -240, -402, 34, -370, 693, 316, 469, 211, -258, -154, -23, 457, 217, -568, 523, -196, -199, -245, -91, -817, -137, -158, -742, -357, 825, 546, 466, -391, 705, -351, 408, 94, 1014, 160, 23, -811, -452, 1030, -307, -492, -723, 78, -275, 20, 127, 208, -553, -236, 530, 384, 426, 807, 235, -732, 721, -394, -393, -50, -628, -1346, -847, -372, -142, -419, -676, -45, -72, 185, 194, 284, 214, 674, 982, 293, 436, 32, -365, 7, 408, 520, -927, -69, 598, 294, -707, 210, -603, -289, -880, -93, 585, 573, 472, 468, 378, 1167, 842, 913, -9, -627]
2625f27Q42O0l60j34k80l81Q96k35J47m38N45K90j95j03K23k35N92p44M57M40
2645G60l90j36l91J000n92l66l75m45Q53n19O47J35p93P2R45k19K92j02k86R35
2665A025m83k42p8L5K81j051k53L41L64q5k40j32J75L74l06O1l25L12R5L82P2
2686C22OK23O00l56r07o5M23j5p30k14N89p31j73R04m08n6N60j75L76j81O44K00
2708H36mp99Q2L14J74J10o33N75j148L53l15J08j118J528n4j6l16L2K41M64k75
2729A39m49K38K76k55K53K89r4N4l67o60j3L50l9l12O89o49J36O25j92o24K41
2750c64L44O47k93m71M73o85K90r4K07N47l44m23m12M32k61L09m83K23l14O88
2770A6m52N26N03J20n23j5N15o5K37p08O6q08J199m67j270N49O72j48l64K34o65
$$ y = [-627, 215, 275, -85, -219, -499, -880, 16, -219, -72, -510, 35, 325, 130, 27, 250, 15, 607, -137, 320, 760, 370, 234, -157, 843, 251, -115, -490, -935, -82, -601, 46, 181, -612, -540, 405, 186, 478, 376, 90, 1025, 542, 300, 222, 257, 538, -513, -766, -425, -61, -146, -386, -518, -343, 31, -275, -214, -539, -227, -132, 250, 322, 328, 551, 1151, 795, -112, -177, 246, 231, -499, -713, -124, -855, -1028, -124, -532, -588, -28, -203, 173, -8, 636, 836, 832, 33, 115, 429, 603, 713, 80, 655, -493, -140, -455, -347, -1465, 63, 9, -7, -323, -291, -50, 414, 139, -310, -72, 204, -51, 202, 491, 397, 451, 84, -576, -589, -239, -278, -590, 99, -550, -414, 211, 19, -605, -364, -20, 627, 334, -137, 336, -349, -59, -153, 54, 601, 257, -166, -578, -146, -407, -98, -581, -358, -672, 16, -436, 90, 593, 713, 190, 175, 690, 625, 862, 154, 220, -588, 611, 144, -1126, -577, 95, -53, -417, -183, -848]
2791h48J458r32P64k60j12l5m77J5O55J26j32J37n81M15J00p15O7J29j45l1Q80
2812D78j384M91M94k66j47L71L72L51J060p14j394P28l20o25N20L2o02r7L51L63
2832F2J82q51M5l50P73K9r04J743n95O28j618Q76%J42O4K4J31p30k3M00n7K64
2854B35k22l78L07O2O51l17j8m32K87k11J296q45M06p30K72m47m35Q72m89q6L37
2875A15r76P35m7J35K1P8o3R59o72m72K44K23k91l44R16J61r45L46j207J032j86
2896b38J67K48o28N9K25K37k31N64j89M63m33K8K37k52j02J218j370O69j011L08
2916c1l51L90o51M68l36l26O18K13k19l67O60R0o95L89M64l00k09O60j34j89K43
2937C87J08k60o47K46j39j22J66O99r66l88R14J6r18Q65o38P69J71P6k29K31J097
$$ y = [-848, 610, -322, 442, 182, 70, 35, -442, -427, 228, 354, 222, 359, -222, 193, 293, -422, -355, -226, -371, -402, 478, -906, -415, 79, -187, -334, 37, 409, 760, 1820, 1106, -288, 440, 120, -505, 15, 47, -555, -652, -301, 62, 244, -607, -562, -912, -139, -110, -1014, 729, 134, 762, -856, 20, 20, 162, 226, 250, 381, -349, -372, 28, -29, 235, 13, -365, -58, 4, 655, 338, 320, -112, 175, -36, 1260, 415, 821, 91, 363, -84, -519, 353, -136, -222, 115, -861, -126, -173, -38, -17, 61, -2, 957, 285, -187, 57, 280, -11, -355, 561, 722, -223, 123, -1084, -52, -238, -71, 177, -451, -392, -167, 70, -161, 403, 214, 677, 244, 272, 509, 257, 155, 1373, 3, 672, -339, -31, -382, 8, -643, -175, -511, -837, -219, -6, -225, -592, 68, 158, -537, -148, 316, 16, -193, 467, 333, 144, 387, 495, 235, -412, -166, -305, -427, -261, 438, -528, -916, -2, 14, -904, -39, -677, 92, 263, 339, 110, 341, 1438]
2958A438o88k57m21kO4o4q06K07M55l29M42l5k52K31k49O2J042o64L94J5q08J36
2980h9J99M25m23j10K1m1J7k42o2J69M28k80K04n7n13K16k82P67L42p08J63P5
3002B19k39o15P80k24l40j5P70m55J44R0p00M92q8j4J72q8O00l42Q01m72p84L12
3024Dn2l42M84k88k21N56j97k1l96l63P62N33j120M83m17K48n1N19k65O6M63k24
3046A61m8k72Q95q7n76K29l92o18J003o59L72n8Q87q42L4k17Q9p0M83J97j14J95
3068E92l2q38L98N39l13p5n36N66l15rk18M10M23n52o37N51k3r6J25K67n45J022
3090G04J59k18o23m15N57J52m62P03j008k91Q56r76M95J083j016K3L56k84k67
3109d72n7M21J072l48o10N69M20p60m31Q69p26m31N15j60L3N11q73N0M42k31L81
$$ y = [1438, 750, 493, 72, 70, 134, 70, -736, -529, -74, -403, 39, 4, -248, -17, -266, -204, 838, 174, 568, 583, -225, -89, 110, 535, 112, 2, 23, -18, -1, -243, -305, -136, 292, 12, 216, 159, -354, -138, -420, 347, 689, -19, 144, 219, -20, -635, 145, -79, -419, -434, 336, -119, 25, 115, -585, -93, -181, -195, -23, -111, 489, 147, 948, 476, -308, 4, -48, -390, 94, -194, -415, 141, -56, -77, -473, -836, -74, 459, -661, -178, -595, -347, -398, 121, -144, -78, 385, 161, 113, -159, 736, 649, 73, 302, -90, -708, 295, -364, 8, -50, 837, -5, 29, -188, -99, -169, 314, 511, 397, 592, 560, -278, 120, 659, 346, 271, -265, 301, -14, -23, -241, 169, 592, 40, -597, -46, -69, -165, -40, 227, -318, 704, 863, 645, 22, -393, 164, 316, -146, 557, -451, -742, 114, -862, -367, 716, -300, -277, 79, -205, -472, -529, -108, 964, 616, 6, 575, 995, 235, -196, 673, -53, -484, 31, -129, -96, 415, -458, -408, 34, -197, 184]
3130A84Pm33L66P9J26k36N49n15o6O79j83n33R7k88j43K15R4r2M35K50o73o05
3152f86O87l44Q2K65J67R54o94r6M60o53J47n36r6N2J94m39k81R17j41O3p80N20
3174b38M83K42J92o37n89P92j23K71q55K65J250p36l56l15j40Q30n60n02O33J44
3194E1m8j26l23M40pO6J65J0m6N16j83n73n66n7O95R9o93J54K02k47q9N64N32
3217E36r62J69M12np85J098j040K99Q27p56J434p55r01N45Q8o63O24q32N3P08
3237I4k7J97l38K77M66r39K77L85Kk8o65N95q1o19O01M02l43p38q0O58l36n37
3259g77O2O02Q4k78K55M6O33m13j081Q34j32N58o50J09O20l24l51j54m5k69M66
3280b05K14K02m71j21r7l46R54L18j26k18L22n28P83m11l77k26J93p4L78l6l38
$$ y = [184, 191, -242, 124, 203, 329, 93, 642, 127, 61, 740, 557, 24, 121, -167, -310, -95, -1, -93, 342, 592, -81, -686, 1, -343, -261, 4, 171, 1125, 431, 335, 795, 142, 289, -247, -343, -291, -97, -536, -817, 100, -41, 22, -758, -238, 245, 487, 679, 42, -547, 245, 122, 393, -462, -197, 1053, 317, -39, -354, -494, 336, -224, -726, -93, 51, 3, -123, -446, -6, -13, 53, 218, 228, 182, 698, 515, -58, -624, -681, 14, 113, -580, -426, -224, -471, -560, 4, 536, -426, -257, 155, 150, -635, 463, -577, -278, 549, -207, 1227, 472, -429, 116, 204, -459, 165, -667, -614, 94, 67, 264, -74, 203, 669, -270, 7, 392, 394, 366, -299, 296, 215, -404, 197, 599, 256, -482, -562, 96, -240, -777, -715, -113, -29, -307, -52, -6, 627, 214, -867, -33, -165, 393, -257, -148, 472, 148, -203, -357, -402, -671, -205, 9, 211, -260, -381, -478, -824, 130, 448, 322, 104, 426, -102, 681, 270, -107, -333, -140, -214, 164, 128, -210]
3301b10l51K21k48J049j36r3l26L15j97P18l42l63k60J31N84l20o16O99j71j35
3321e1l7M59n17JL84q72N80n1P8N40j337M36P15m20L03L38l02l36J69M24m28O68
3343G44l67k58j122J065M27r80K66K12l28N51p1k15K44L11N4j68m47L55J77j56
3363B94m93L0j78j09M71K4k49M01j83l86K14O25o70K13j60kO41j46p14N27J67
3384C17lj45m68J079r73Q46j553N76J77K12l05J101j347j25O25L63L20q25M99
3403C71m69j32k83J131j248N74j04k52M08k46l35O13o03L10j70L24l70M22L1K11
3423A83O88l18o71m74N66j78N53n56M77m53o1m40L74K91N41j9J09q48r7J25k32
3444d40L00L21M8j29L79j72k66n3j61O57P41j603N26o95L44O25j173Q50K95p42
$$ y = [-210, -561, -340, -588, 461, 325, 232, -94, 221, 24, 742, 400, 37, -223, -92, 492, 172, -444, 255, 84, -51, -88, 371, -146, -145, 239, -633, -53, -104, -26, 514, -823, -387, 328, -92, 211, 549, 247, -89, 80, 504, 76, 744, 377, 119, -1003, 62, 489, -491, -225, -13, -341, 210, 139, -76, 168, 479, 533, 365, -82, 273, 450, 294, -199, -169, -347, -456, 15, 39, -210, 191, 8, -378, -164, 461, -209, 4, -156, -158, 483, 337, -377, 150, 317, 314, 169, -299, 780, -193, 653, -900, -324, -147, 65, -240, 861, -486, -611, 14, 377, 697, -128, 371, -98, -230, -513, 618, -630, -56, -160, -412, -4, -250, -585, 28, -575, -265, -435, -111, -481, -59, -28, 183, 871, 553, -118, -592, -26, -204, 349, -207, 270, -183, -244, -684, -310, -19, 522, 503, 612, -236, -333, -208, -440, -140, 181, 229, 100, 479, 307, 41, -12, -173, 484, 1225, -378, 148, -547, -203, 422, -751, 99, 394, -348]
3464c48M68J31K96r42j77J116k47O77m90j13o3l27l03K07K78p28jj93Q15m9n41
3485e34M29L21J32P1j37o63Q77l10o1K10n06J71M67N0n62J81n41N29n77M56m06
3506d03O04p92J34O99k08j39K87R4j62M15q0l00M56q59K96j08q72R21L0P4l96
3527c09K02N28l43l68j7M31N6l70j15K7J374j073M04m24l66N56l83O23J5l29n40
3548d21O36K15q92m9M34l3l25L08J85l0p7L53K45l13m6O41q54L37m15p9J96o18
3570f02P83l65N55n23K27n19J0O5L96j2j42N48n19L76l3N63j212P2N9L90L75q51
3592c59L54O13j544J025k6q1o82P05n27Q15l20m04P83K64m72K10j063N01K88k73
3612a93N09n5n01j40k37qm4N35L13l70L95j02O56j115N9O63o4m64P10q52o3o63
$$ y = [-348, 120, 251, 547, -395, -572, 544, 297, 974, 484, 371, 308, -19, -322, -115, 163, -565, -566, -759, 56, 7, -534, -105, 216, 348, 419, 282, -381, 496, 186, 125, 335, -171, 0, 467, 517, -45, 136, -405, 124, -453, 3, -403, 201, -591, -457, 242, 34, -105, 182, 276, 114, 529, 449, 149, 605, -254, 42, -66, -938, -17, 13, 87, -309, -107, 421, 78, -290, -307, 124, 180, -190, -305, -278, 1096, 23, 427, 3, -363, 193, -190, 433, 448, 119, -421, 215, 430, -462, -511, -77, -110, -435, -127, 58, 28, -49, 304, 549, 236, 190, 831, -23, 314, -101, -180, 16, -602, 181, -184, 371, -152, 75, -444, -434, -369, 27, 15, -127, 421, -98, 278, 245, 808, -404, -332, -273, 117, 492, -359, -5, 608, -936, 89, 63, -18, -700, 5, -522, 293, -27, -431, 352, 616, 144, 354, -709, -208, 80, -193, 316, 261, -240, -380, -617, -625, -669, -134, 179, -191, 204, 102, 758, -357, -298, 365, 301, -163, 547, -305, -368, -1031]
3634a031P55Q28k99n9J67m73K23k13P29j209N03j51M87m37K11k3J92k61P79o34
3654H4k97J14M80l62j07l61L75l40K39j4M02j15o81L90K4N08k62l10K8M01K26
3675D22k02L9k08R36j541N01j91o48Q90J33r7K04r0n6R8J53J97q57o4P10q10O34
3697A53j67L58k60Q2L70j195J106j074L45Q93q18O61p89J35M64J50p52R4N11J05
3717C72L26m73o88n2N23NN23r09m27L73R98p45Q6J11k73J68j86Q06l55K97k48
3738B32J7K30p93J335r93L40n58j11J232j165k36J73l72J09J45O67o43L73P8L3
3758I3Q77o63L8L79o30M4J51n12L02n70j06L47K93J57o45O0O55K33o17m52O00
3779C4l16J33R5k74J14K26O93j273O88N5N13o76n16L33j60O20j144J019l72m12
$$ y = [-1031, -276, 552, 253, 194, 361, -112, 111, -102, 627, -582, -79, -230, 257, -180, 31, 8, 200, -61, 718, 84, -213, -99, 381, 19, -88, -449, -74, -414, -175, -189, 213, 98, -583, -193, -169, 339, 77, -233, -205, 196, 422, 220, 259, 51, 987, -554, -53, -244, -892, -2, 131, 34, 238, 148, 92, 190, 343, 540, -317, -381, 329, -481, 153, -14, 344, 84, 166, 536, -659, 447, -627, -282, 611, -207, 454, -335, -200, 264, 414, -338, -244, 267, 372, 698, 225, -463, -515, 8, 13, 536, -373, -800, -427, 571, -174, -88, 23, -250, -82, -268, 538, 183, 480, 232, 249, 479, -314, 1021, 28, 368, -190, -301, 931, -234, -470, -297, -669, -560, -415, 252, -391, -18, 60, 93, 970, 307, 345, 724, 94, 138, 289, -223, 79, -491, -597, -250, 43, 200, -445, -385, 270, 503, -114, -566, 34, -282, -149, -54, -328, -214, 12, 705, -568, 120, 175, 688, 12, -504, -171, -331, 289, -855, 164, -208, -620]
3799f20J058p89K25k1K41n93M3J68l70Q54n72L03J03l7M43m41l40J45m7J17P09
3820E79p40N97n26N26k46k5q53J269j139O54j50k99m9P69p40k18Q8M83r71J337
3840C46p66L29o18N25Q3L1l61J025N02j970R69L64o07k54J98K37L94m86O90j214
3860e83N64J92N06M6k52o49Q3K5j79Q40l01K80q01M34R6j174J509N4n26j50k59
3881b45L73k72K95N5m17k04M45j05m6j99j44L72l7j96o0M37J39j84O14o75L15
3902B61q86m4N07J92K49o64n63R16j116Q81j50J34K89J34K80J43J88j85o68l80
3922d82j13K23j54N67m04L49p72M83o8O16o48Q81l11r40M90K65K06k63P74n18
3942A81K61p40P32l68Q49k08n47p37M54o0Q0J19p58O15J07q4j77L92O74j588O54
$$ y = [-620, 438, -351, -126, -147, 94, -499, -456, -288, -658, 196, -376, -73, 30, -7, 436, -5, -345, -200, -247, -130, 579, -161, 436, -90, 436, 190, 165, -688, 581, -558, 96, -54, -353, -402, 367, -373, -591, -503, -20, -991, 346, -420, -91, -709, -184, -101, -70, -431, 594, 1096, -874, 95, 459, -148, -402, -204, 33, 427, -59, 631, -583, -19, 173, 679, 725, 473, -176, -93, -68, -247, 593, 292, 572, -229, 205, 301, -873, 636, 690, 164, 14, -245, 128, -144, 151, 206, -211, -415, 30, -75, -121, -320, -464, -92, -129, -325, -385, 52, 191, 7, 621, -54, 261, -625, -669, -162, 30, 279, -385, -948, -32, -1148, -267, -417, -283, 6, 140, 420, 563, 751, 566, -102, -482, -595, -372, -526, 41, -363, -14, -786, -303, -371, 245, -403, 478, 167, -773, -283, -18, 188, -75, 699, 181, 442, -298, 434, 66, 915, 707, 160, -577, -123, -183, -103, 16, -742, -127, -20, -104, -281, 111, 785, -803, -149]
3963a49Q6k07l9P59m44J94Q12j662N67m4J00p80R01O38o76K47J11m74J183j013
3983A10L5MK91k50O74q13N74o8m6l36O43o46P2o39N07P8L84p25Q54j156L67n16
4005f02L54N51o12j43K70m07L20N37n61N75L1m7o80M4L48K12L42l50j72j44L45
4026B11k70j86Q95o61p%n29J68L19n36L77l9M25o10L61J44K13l02p29R66K5o48
4048d13R38n91k0K10J30Q9j036P97m39P13m58O7l94L09N58j046J31j75O96j82
4068a16k94Q73n31J10L93J99K74j025J86J25l18L26J06q1n4k11l6N7j50M51l04
4089b0k83k88J043l78k46Q11r04J42J13l90K01J9J05j43l64L32M04o96P99n2j19
4110H6K41o61j2R28p68K15K10M3k32j48n29J008r9j042J247m04L1R3L37r69P06
$$ y = [-149, -63, -270, -309, 450, 6, 200, 1012, -650, -83, -127, -27, -807, 94, 732, 56, 303, 414, -60, 1123, 110, 145, 149, 440, 190, 864, 51, 625, 557, 511, 175, 818, 172, 244, -395, 112, 190, 574, -151, 703, -453, -86, -602, -248, 303, -309, -452, -182, -589, -269, 268, -293, 282, 313, 266, -414, -370, -22, 190, 532, 182, 10, -134, 211, -59, -245, 650, -11, -18, -18, -547, -379, -60, -596, -219, -258, 167, -443, -82, 62, 275, -27, -756, 210, 235, -413, 525, -66, -86, 124, 254, 343, -693, 104, -335, 378, -80, -13, -407, -98, 460, -586, -455, -630, 66, -116, -410, 463, -68, 42, 435, 634, 908, -117, 69, 194, -124, 202, 308, 227, 173, -38, -74, -17, -167, 284, -20, -303, -591, 452, 74, -172, 639, -265, -123, -10, -400, -199, -180, -75, -218, -582, -250, 154, -542, 257, 205, 86, 327, -334, -346, 582, -186, 29, 239, 282, 50, -98, -627, 381, 282, -760, 487, 83, 114, 207, 544, -425, 281]
4131B81K13r58N95K32n53n3P35r60N70L8m65N21j85L09p75j97M50j0O39p25j0
4152c08P4m53n2O14K77l54P90k61K17l64mK76r47M58j29J04l69R10k20k12P40
4173G87o26j09m01N12m48N79J39m36n14j43M86k4p1q5M21k08P27j8o47O57j051
4194d73Q59R02r12q8k98K85l31P34j189K36N67k46j03o14O79o7j46R15l79N4j120
4215g35J015q30M96k20L84N21j028k41L22K62j32k52m39P31P5k81Q45l72m20R62
4235F63o09R0m90P74o07j8M03j76n03L33m7L89ko62M64M14n63O00l54L59p26J73
4257i5K82J46q95Q23j45N3l57j9M56m45j070J710q58J102p68j01M38L05l25j123
4277h86N82k42O03p74P87J05o32M7M14N08m04j18o16R11l91J79r45O63j24N52
$$ y = [281, 494, -464, 131, 363, -190, -243, 492, -468, 102, 140, -325, 196, 11, 320, -455, -652, -202, -212, 427, -298, -308, -234, -687, -739, -125, 152, -202, 588, 327, 544, 180, 176, 452, -495, -37, -166, -62, -431, 479, 259, 47, 787, 161, 52, -349, 163, -285, 294, 433, -3, -517, -660, -174, -198, -269, -354, 67, -141, 586, 568, -79, 578, -473, 386, 1288, 376, 288, -10, 275, -56, 678, -511, -275, 292, 46, -57, -671, 8, -59, -205, 710, 331, 385, -735, 280, -550, -54, -274, 110, 631, -397, -638, -316, -54, -186, -438, -877, -146, -71, -352, 493, 121, -299, 663, 54, 144, -346, 428, -179, -197, 206, 30, -473, -140, -187, 202, 200, -462, 2, 416, -147, 453, 99, 458, -268, -95, 187, 333, -562, 261, 116, 169, -188, -207, 249, -196, -1266, 444, -414, 688, -80, -181, 257, 562, 237, -886, -304, -546, 57, -717, 70, 175, -457, -410, 4, 512, 108, -10, -626, 285, -106, 73, -872, -209, -333, 219]
4297B19Mr02M65l77P73o26j77N53L6o63M76j5o66Q61K10m37K28M13p76R75j159
4318e85K16J23L54M09J75n09K95m25m21P89j025K66N9N62j246R37l32o10R87K86
4338C05m30M82M7o23l6k94j37O75N28n84j91J34Q21p42j83l48J79O56l47j71j2
4359b71J014j025O06k77r5M70q59L50L02j79l91O34j92M45n98N67n77q1K58n72
4379d71N77M7o39J012n47O9Q7j57K00m02M52p08j6K17P3Q73p25l95k10O71n06
4400d98R25k29p76K22L48n46P11l16K66K90l40N92p69N22K83p69l34K44j77P34
4420C83k18k69j93M99j68k64n1o4K66j00M49k72K93j83N75l67J2l71N71k87K65
4441E06n18r0k01M19l11j98L02n74J54R15k64j80l7L64K47n62l2M25k29j3L83
$$ y = [219, 223, -679, -214, -591, 182, -444, -621, -68, -32, -695, -219, -234, -900, -39, 171, -266, -38, 375, -401, 574, -585, -369, -246, 108, 517, 692, 183, 478, 53, -368, 421, -604, -338, -279, 283, -963, -26, -358, -968, 19, 305, -125, 357, 404, -219, -255, -549, -686, -11, 517, -67, -258, -124, 697, -45, -228, -576, -397, 259, -88, -259, -271, 743, -282, 324, 47, -48, 422, -437, -87, 215, 36, -355, 279, 87, 532, -66, 501, -76, -157, 101, -471, 106, 153, -486, 526, -21, 48, 135, -22, 178, -224, 228, -480, -496, -279, -206, 667, -58, -453, -663, 8, -498, 427, 198, -578, -356, -8, -554, 157, -159, 107, 397, 57, 649, -120, 402, 685, -84, -418, -174, -351, 383, 165, -104, -297, 202, 34, -230, -281, -345, -79, -179, 270, -2, 291, 108, 683, 316, 328, -43, 528, 241, 506, -12, -102, -303, 116, -195, -393, -91, -665, -511, 404, 140, -40, -77, 287, 534, -28, -60, 365, 136, 123, 506]
4462E06q30L97k21L5M0l80K81M65l19K97o57L41L74p04k29N84k08J5K53m04L03
4483f1l45O75m07m69K81O72m37L11J08n77N84Kj018L70J108n44O32o14n22L53
4503A02m33M74O49q82K5P96o18m36m48j07M34J05P45j166J131K94n31R5k8L09
4523E10j044K68O92p09K03L75n13n2K57k53M88M9j14M2m60o9j02O12m27J4M80
4544B47j070J549m01q3m50p2J98j06J97k20l25Q86o79K22J59k03J26K00k6k09
4564f0J71j44J01j1J1L91j461J162K2K08nK48o60o0N79k98K05p16J99K93k14m02
4586d41l27O71O10r02L83j80Q18r37O6k86k25J140p63K80L5l05oO4M02j22k78
4607c03J193q47N90m23J54m37K14r4J88J70j294J025j0L93n82j55J240j572J93
$$ y = [506, -324, 73, -148, -113, -73, -453, -172, 293, -26, 271, -386, -45, 329, -375, -604, -20, -228, -213, 40, -364, -61, -406, 269, -138, -607, -326, 346, -91, 220, 328, -249, 335, 337, -681, -311, 797, 253, 885, 271, -251, 102, -331, 143, 792, -90, -65, 731, 113, -323, -771, -878, -444, -339, 406, -760, 371, 665, 134, 229, 201, 510, -534, -266, 426, -283, -80, 295, -218, -270, -13, -266, 222, 271, 157, 199, -261, -330, -432, 180, -247, -233, 247, -823, 726, 325, 242, -208, -280, -82, -188, 9, -211, -536, 350, -329, -107, 52, -151, -25, 175, 149, -60, 111, -33, 68, 57, 68, 459, -1002, 160, 182, 390, 385, 633, -27, -87, 492, 194, 399, -317, -118, 175, -39, -441, -768, -97, 513, -389, -6, -186, 632, -305, -239, -525, -750, 390, -373, -93, -58, -363, -369, -305, 97, -25, -303, 890, 43, 633, 210, 364, -73, 141, 47, 235, 405, -889, 136, 126, 519, -63, -218, 1022, -550, -357]
4626c57K96O71p42L46q00L22J15J39RJ70p0L0J59n53l88J18L04J44j72P39p31
4647b51M94q79Q03j08p3J51l42r6M52k96L01l9l05J86l93R00l34o92L78O89j290
4668g44N18l9L03k3M3P53j065N43J43k65l19O08r02O30m39M32k18L45m44q8j1
4689b39J087n58r53P83q94R66l58N29m55m96O06j63l5J51O36j024q70J086K16
4708A5m5K45k95l14n1O81J5j89J54j88k48Q8Q51l97q48M49l73K01L8R7M18m04
4730a00m0K40n41N83o10N62N16p70k81Q70J67o60m02K14P17O8j32j067Q60n50
4750c56O58N20K70p73n56k1K29M86m92om51J75q05J649j006P27r55j63J052j03
4770G9M25l16m7k07O98o19R5l10J30j50K50o61J72M32N11l11o50J35N25k12R0
$$ y = [-357, -61, 610, -132, 214, -586, -264, -149, -10, -1, 169, 99, 129, 288, -265, -653, -535, -231, -87, -259, 480, -251, 243, -636, 167, 59, -14, 137, -205, -301, 151, -145, 156, 117, -188, -2, -395, 505, 171, -521, -143, 546, -744, -226, -265, 38, 15, 58, 811, -254, 289, 432, 167, -152, 456, -446, 184, -255, 177, -41, 304, -140, -228, -239, 848, 290, -663, 120, -774, 192, -166, 363, -92, -588, 18, -145, -180, -29, 607, -417, -1287, -201, 15, -30, 215, -80, -394, -445, 236, 251, 62, 216, 28, -220, -132, 719, 322, -526, -77, -450, -249, -211, -114, 304, -100, -140, 100, -441, 142, -468, 94, 610, -160, -441, 429, 596, -64, -466, -252, 465, 533, 401, -666, 194, -356, 302, 822, 1092, 319, -237, -258, -29, 457, -35, -41, -492, -317, -1122, 527, -479, 248, -707, -870, 182, 79, 504, 188, 141, -66, 632, 13, 108, -202, -72, -222, 28, -633, -461, -29, 482, 171, -479, -344, 181, -31, 59]
4791E9n23J3J21N53P5l36J12l81j31N41l51m23L76j00Q64o8j08P1l00R22p13o06
4813c33M37l82j8N98j35l76n7J38M01k69O30k57m11J48o2L07J36k4m35j51j8M77
4835C44l71j89j91l51J065L39p89j60P7j16M09j79l0L15N81n10J47n90n98M34
4855c63O53q21j33J219m03o36K61J7K93k05K23p4m28P84m86k02O64p54J045n65
4875H9O07o36j64L74L8n64P76p16M00l17Mj95K03j45J82K29n42M30j14j52p0Q49
4897E66n17n12M18l19P27p04J06K93L01K4k50o78K90P33j78p32O74N05j11K01
4917H37j155O79p82J66L52l13l03P55m27p08N17j26N30K51r22N24m0j98L30L15
4937B82K31l17o91K82O73o83O7n81N04K20l89M42P14q21l5L50M1l03j99N81L3
$$ y = [59, -464, -451, -330, 223, 298, -38, 74, -307, -438, 103, -248, -671, -295, -395, 469, 401, 293, 364, 64, 986, 273, -333, 104, -278, -296, 302, 167, -209, -266, -128, 273, 4, 634, 377, -34, 114, 52, 359, 495, 471, 36, -115, -133, 344, -27, -216, -407, -758, 307, 646, -143, -303, -226, -342, 67, -112, -142, 173, 754, 244, 391, -199, -797, -363, 290, -531, -664, 555, 152, -484, -223, -206, 87, -118, 105, 31, -397, 387, -99, -301, 363, -391, 654, 89, 696, 60, -104, 270, 308, -256, 520, -196, 204, -113, -109, -304, -101, -246, -64, 165, -377, 53, -61, -213, -283, 566, 49, -463, -45, -364, 363, -341, -235, 58, 359, 383, 133, -545, -255, 478, 300, -432, 242, 747, 636, 837, -318, 361, -421, -255, 97, -216, -519, 236, -191, -899, -382, -508, 22, 273, -649, -125, -165, -363, -33, 282, 513, 196, -495, -213, 460, -223, -156, -737, -233, -13, -402, 40, 754, -67, -102, 248, 289, -14, -213, 368, 401]
4958D01l8m92M95O9n27J46J45j69l40M58o91M77P28l35j022L72L32J78N99l74
4978D12q33P5Q30j88l93l87P30n15J50M41q07M99O43p99m18Q91j21j76L47M03
4998G84j142L50J06L29j2K73j085l9L86L34j62l36O52o06O30l77j84j23N49k18
5018A09j45J17L17n99j80L80L04o54N51n17P84Lr62R9N38l00j55O43k5k19j39
5039e0p39J26M80M88p82Q08m50J93k09L95m27l0J91K45k08K37n37N2K62J80n17
5060b92K31L31q7M37j074N95M33q95N27o02P12m26J74j52n91N21L88m72J83n0
5080a09j8l10n9M53J61K97l66L7l34Q95n75k34N10p61N04K3L25L20n44j63J58
5101B10j006R18j85K8J44L74K45q46K12k40P53l71n39j37N2Q96j387J337l87m14
$$ y = [401, 363, -129, 366, 435, -92, 54, 199, 30, -310, 148, -543, -66, 662, 327, -695, -323, 9, 187, 786, 412, -421, -346, 484, 296, -97, -484, 246, -269, -119, 322, -485, 14, 657, -142, -560, 331, 210, 34, 381, 784, -358, -8, 98, 427, 415, 688, -397, -436, -50, 284, 122, -214, 438, -168, 462, 85, -99, -222, 327, 109, -36, 81, 398, -201, -381, -1, 303, -351, 200, -317, 467, 470, -492, -393, 145, -155, -310, 333, 308, 89, -50, -789, -663, -183, 305, -477, 331, -119, 74, -135, 260, -167, -197, -6, 239, 31, 268, -269, -217, 45, 225, -292, -61, 270, 183, 620, -454, 141, 574, -321, 206, -396, 316, -110, 64, -88, -679, -158, 230, -242, -59, -109, -127, -437, -496, -43, 118, 415, 49, 86, -248, 647, 72, -162, 348, -413, 91, 114, 439, 759, 215, 52, 210, -796, 122, -63, -35, 109, 483, 728, -118, 94, -146, 607, 236, -303, -440, -388, 508, -879, 458, 71, -343]
5121c43R95po30k00M46j83J72M26J89l27l84J42P1m41P93j055k0J51M34K32J50
5142F11j354Q41p1K1n15l38K021p62q92L30J73m78Q71j8q97J051m97m99O80L2
5162C10o86j79Q92k26r5M13o51J97n67J050j118Q62J35K18o11j03K84J73J85m05
5182G8J71m53k06l49R96q70J276j75p66L18K42n77M91o26M21j14J215q76m30J35
5202i9m02O77M19M1o67J18p50P64p7M81r02Q02j94l43L98p08K52J73LQ49l70m74
5224im15J62P9m55J04K89J58N2l25J75N2K71k36k21j6K57K31l24l67M11J134j228
5246b21m6M49m00J14J74O58q06j13P71n34K77l98J90o8L17O7o48L99j93Q57j122
5267b76R83o21l74J17j05P68n64k49K28n60L86K01n83N97j05P6n97N98J84l12
$$ y = [-343, 652, 645, 15, -185, 261, 78, 250, 676, 865, 538, 154, 296, 367, -74, 719, -336, -356, -205, 229, 461, 611, -743, 98, 27, 48, -467, -805, 1216, 454, -438, -108, 65, -413, 458, 440, -457, 594, 97, -402, 278, 310, -376, -555, 337, 111, 16, 429, -222, -25, -592, 458, -660, 202, 337, 555, -56, -159, 125, 298, 483, 78, 249, -204, -410, -759, 237, -633, 643, 468, -298, 20, 262, -315, 176, -450, -29, -143, 1072, 196, -234, -99, -501, 176, 595, 636, -31, 87, -663, 101, 24, 505, -397, 405, 211, -132, 266, -442, -190, -17, -14, 835, 465, -9, -424, -262, -183, -638, -534, -245, -87, -35, -360, -185, -133, 138, -98, -319, -335, -78, 153, -171, -538, -127, 1007, -221, -267, 182, -218, -104, 70, 728, -78, -191, 580, 46, 323, -75, 115, 47, 364, 431, -217, 182, -11, 846, -276, 707, 86, -288, -171, -276, 492, -72, -321, -93, -653, -267, -66, -649, -52, -157, -81, -678, -80, 104, -208]
5287b08k84K71K30n42J099j073N38K28j132J219j03m97p54J664p17Q10j123P57
5305C83j50L74p50N86n12m42Q06j12l2o95O58k4n47R63r44P22j14m38n35Q59j84
5326a28N02q50K45L01m95J37k00K29j67M87m10M31R2o59O80K37p89N6Q16o22L67
5347B60n02J04J67L53M5j33j010N62N27k79k22p17O68R0m75J367n45P28l02p37
5367e1j06l27J330j01p42j71O24k59l31N72n82n4l3P7K04q6N20q7p89J40K88j4
5389B2P65q06N66o80k45J134j331J24m8R1J363m76o36P8J57K78L45j069K48j96
5409c16N46J3j122J086m3K2K19p1k27l70kk37k07J135p88L46K81o84M06j03J59
5430D3J25K1l47L64j62N83j39L94n88j38j79N55M0q68M72L31Q2n11M04r25R4J32
$$ y = [-208, -492, -221, 9, -533, 566, -507, 31, 259, -873, 346, 243, -254, -1008, 656, -61, 749, -374, 383, 233, 607, -143, 443, -69, -511, 295, 183, 151, -544, 114, 90, -457, 506, -438, 284, 170, -268, -803, 56, -128, 374, -476, -231, 70, -425, -288, -488, -259, -426, 61, -349, 82, 174, -485, 195, 432, -357, -301, 515, -107, 260, -242, -138, 29, 382, 427, 294, -716, -154, 373, 94, -128, -845, -177, -87, -562, 805, 260, 988, 686, -51, -157, -484, 846, 745, 3, -168, 456, 197, -134, 438, -144, -198, -231, -154, 50, -36, 484, 397, -392, -252, 36, 22, 787, -19, 547, -133, -378, 756, -575, -451, -499, -408, 955, 479, -157, -79, 78, 356, 701, -368, -120, -316, 230, 243, -879, 207, 164, 186, 405, 334, 107, -263, -265, -502, -709, 426, -362, -16, 265, -419, -13, -116, 43, 168, 189, -158, 206, 44, 627, 488, 882, 294, 156, -23, 532, 572, -296, 176, 507, 589, 78, 482, -443, -349, -217]
5452b17Jk12K66M3K43P81o24J26n41K05j95n32J121p21l05M47K05q50M51j19L82
5473d5O9J14m57L58O1q6N60L58r83l18O41m45P36l79N04j029J22M47j5p53O82
5494A42K29l28J42J25m02j4J93o88M15O5M55j45L2L71k07l35k92L50J2j3L8J82
5516C27n02m1p6O81p36o8M53J9Jk26L79K89o99J64q46R07l06J21N08o0n2n59P04
5539C82l30n38M48k78N93K92r06L08o49O81m65O38J44l81l19P27nm65J78n86O94
5560A63l25m6K88o74O66o08N14k50N32M33o75L80m34k76M85L77q96k7J091k63
5580D55K16r23J01N8P3N58r08M06r7l97N0J13N74o97L53O87k90k74m4M90J9q35
5602c12M88m93J39L35j15K44nJ27n73K58M63m53L12m90P2k05O35p48J1L96M86
$$ y = [-217, -216, -428, -162, -119, 124, 905, 281, 407, -134, 71, -124, -656, 465, -256, -561, -114, 91, -759, -308, -427, -45, 24, 138, -319, 39, 100, 14, 574, 932, -51, -369, 272, -173, 563, 184, 688, -341, -219, 228, 213, -540, 142, 371, 43, 185, 310, -92, -106, 87, -601, -186, -121, 334, 189, 221, 592, 385, 50, -242, 108, 120, 107, 145, 327, -175, -216, -292, 389, -347, -415, 38, 57, 58, -168, 211, 500, -199, -35, -881, 26, -280, -159, 349, 289, 237, -322, 382, 52, -486, -38, -316, 277, 569, -337, -29, -678, 3, -462, 176, 320, -61, -380, 347, 342, -123, 55, -531, 163, -162, -208, 80, -594, 72, -536, -22, -272, 260, 693, 18, 398, -36, -312, 173, 550, -346, -373, 718, 455, 671, -252, -151, -93, -20, 538, -370, 36, -61, -458, -408, -295, 279, -418, -65, 622, 332, 58, 14, 504, 523, -312, 176, -317, -178, 157, 42, 286, 281, 408, -165, 93, 556, 103, 415, -75, -3, -208, 427, -321, -310, 86, 572]
5623E72l99l41L43r08L19M88j74M79k24j56K8L00n28K70Q5k18L41p7k11M30o29
5644b10Q77m71m14L22j071M16Q12k93J14k83M98l60P51O8o36j31K11l58R09p88
5664c7m0J39K35p93R27o97J17k8m73N57j03N6j00K01k9l39N95m27k36J183n97
5685A11p63K63J79J055p16k76m8l27R49r18P86k67Q1j42M07m28k90J88j47J61
5705a42K98J47l7p17J02L26J73R2l60R7M15j94n53O18n19K91j13K25K04p83P58
5726C28p73K80M82m66N59j060L80o03O42K96l93o9k02R33J70o80K64k31j68J75
5746a36j45M05l04O30j02m49L93L24r93l35O89jP0Q27r35M1O04L76j13j400J76
5767c78M48O75m48l12J84N54p87M00K92j002N09J85l24L7l60K35M79m30J66K34
$$ y = [572, 173, -168, 175, -733, -414, 74, -100, 379, 155, -1, 27, 327, -201, 69, 154, -64, 277, 200, -11, 419, -210, 667, 196, -218, 104, -967, -551, 261, -32, 82, -201, 297, -63, 688, 756, 120, -11, 200, -158, 751, -37, -77, 62, 297, -496, 431, -266, -149, -177, -650, -93, -196, -140, -240, -39, -68, -407, 188, -239, -475, 708, 111, -652, -389, -210, 845, 129, -147, -195, -522, 427, -491, 295, 28, 109, -33, 374, -54, -344, -156, -303, -142, 156, 303, 266, -451, -349, -23, 150, 242, -118, -21, 394, 200, -353, 265, -254, 37, -76, 149, 353, -430, 328, -445, -165, 317, -149, 410, -650, -270, -873, -231, 65, -328, -397, -599, 334, 504, -176, 88, -143, -311, -136, -281, 124, -180, 450, 348, -101, 292, 616, -377, -712, -23, -24, 46, 873, -62, -21, 583, 959, 846, -554, -378, 70, 745, 297, -15, 169, 723, -64, 336, 628, -374, 135, 320, -4, 33, -327, -92, 387, -43, 123, 357]
5787C57l74l07M74l21N8J36n96J46L22k79Q30M7j76q39J109n28j11j03j28Q99
5807F16p95K04R6O6j194P46J4L01p2r0N73o51J62j30Rk55j50O96M0m59K00l1k90
5830c94M77l97J97M4M90n15K0n76P40N19o53l24L57j03N16l21j48J70j90n66m
5851f61K02N52N69q53m50J44K28J72o8K2Q82j353J046q87N47o56L67K59j30N38
5871D70r92M20k40P3J43P53q8k7q23Q9J069j479P37R0M96j362P82j87K15R2j81
5892E0J78J31L84m69k3K56o43j77N25r74M65j46K37n00J301l05n47M52N4o13j13
5913d77J289j091L38N90n65oj32r1n44k80Q49K01m76O20l37O49l08l69j39N04
5933B25M98j512N51l20K63Q0P6O95r49M8O2Q08p57K30K13l95J2O0k15K7j29K70
$$ y = [357, -17, -324, 150, -171, -113, 23, -573, -427, -105, -384, 446, 493, 317, -522, 587, 59, -52, -155, -283, 616, -179, 25, 121, 187, -1007, -261, -247, 54, -18, -108, 465, -186, -24, -154, -145, -400, -550, 146, 186, -273, -73, -104, -394, 83, -314, -117, -73, 417, -98, -78, -654, 86, 605, -48, -372, -15, -118, 398, 77, -71, 99, -91, -657, -661, -459, 93, 662, -191, -641, -497, -269, -97, -165, -143, 739, -614, 432, -455, 92, -564, -197, 62, -68, 470, -522, -102, -342, -269, -126, 627, 539, 512, -311, -222, 847, -632, 105, 195, 691, -671, 111, -76, 139, 231, 50, 228, 359, 743, 274, 251, 507, -136, -313, 212, -762, -297, -443, -206, -706, 595, 290, -257, 195, 249, -364, -477, 812, -279, 59, 649, 84, 78, -54, -145, -689, -969, -120, 81, -395, 225, -112, 537, 229, -140, -279, 225, 723, -789, -238, -558, -295, -215, -139, 556, -393, -345, -283, 525, -232, -2, 211, -184, -172, -112, -327, -300, -429, -159]
5955a59R8o19Q27N26l70j058R68p9o60%L34K88n75n65J350n75l12n8N95o2J68
5976F2O25o97K83l46k93K88m45M42K23k56l0O26k96n72k22O60l48N62k24j76N55
5997D21k35M32j08k3O8k03k8pJ9m25q04R04o9j6O0j45N19o37m87R32M21j245O41
6020a5l96M50Q1K07m49N13kp95Q2o8K00pK0M92j96M35k27k77N37q72J244j302
6042c45L1M14j076Q20J70N7j11q9m69L52J45m9L05J96J53n71J72j06lp9M77k42
6064A52l27l3N5j06q64J105Q10r46k94M41l87K5P44p98J92P50q77Q2k7O21K43
6085E61j062Q91m67k35Q13J65m25j71K01L41o60K7n12O86K02M2O05j120K60k95
6105a53K83j56j14J26k64O21L34k22m33P37o99l21J51l35O81p05J98M27J90j40
$$ y = [-159, -61, -680, 147, 673, 303, -755, 213, 134, -526, -526, -192, 96, -479, -1044, 306, -269, -581, -639, -44, -106, 62, 687, -10, 273, -73, -366, -78, -523, -81, 142, -114, -144, 482, 186, -386, -608, 52, -296, 266, 42, -134, 421, 186, 618, 510, 487, 555, 352, 324, 317, 336, -89, -893, 11, -58, -74, -14, -159, 360, -277, -764, 168, 589, -656, -15, -411, 39, 120, 327, -122, 391, 389, -406, -324, -392, -192, -199, -179, 313, 117, 552, 325, 48, 585, -287, 957, -345, -314, 100, -976, -156, 14, 71, -40, -129, -598, -246, -101, -150, 155, 351, 504, -67, 105, -1, -4, -83, 394, 152, -175, -208, -153, -259, -1123, -18, 792, -154, -448, -7, -394, -369, 375, -423, -231, 519, -358, -276, -303, 318, 561, -501, 390, -77, -312, 501, 666, 241, 70, 271, 612, -48, -21, -533, 153, 355, 397, 1002, -118, 142, -153, 130, -26, -140, -14, -278, 343, 677, 455, 22, 759, 60, -261, -110, -445, 236, -469, -271, 156, 346, 206]
6125B06k14l57N54M11o04L20p72P61k27M36k28j79k66J15k08K51p5L88J57j002
6145e33L37j68M12l79Q92r05L78k67M80P6N4q37O45L47p38QP50o25m24O61m0n42
6167d18N07n08J030o04L33l81L81l71m19L37j52J110j199L65L04k03L16m07k99
6186b78M69O13j451P51j85L32o77N88l74O22J44p77q75P40J263j031k41P27l00
6205F0p1O2n74O02L46l61n29Q57n32N89l68J20n12j22N54k92J76O41j767J625
6225E04q86P08o61R95j177O40q4j74j64O18j55j92L41m53O28m65L06j47m00O8
6245a50l80M01Q50j204P49J3K71p57M0M28j01q02O83k91P16o84L75n96K46Q98
6265G05n83n32L68p74P35N06o21k94M03M22n37P1l47r9L67M79l43J52p78K72R70
$$ y = [206, -8, -365, 189, 600, -4, 316, -456, 305, 78, 514, 286, 107, -159, -44, -252, -1, -76, 312, 469, -533, -196, -364, 48, -331, 561, -344, 34, -233, 247, 323, 377, -460, 185, 532, -206, -198, 552, -73, -497, 164, 124, -418, 89, -419, 611, 7, 340, -41, 340, -31, -450, -113, -265, 845, -354, 11, 315, 112, 428, 21, -278, 191, 804, -647, 104, -81, 251, -426, 162, -212, 410, 554, -223, -1098, -358, 905, -126, -367, 360, 60, -11, 51, -523, 79, 425, 64, -465, 392, -140, 449, 81, 201, -311, -433, 121, -171, 5, 646, -1121, 504, -382, 326, -335, 660, -517, 123, 39, -135, -299, 319, 164, -28, 313, -140, 488, 23, 329, 182, -218, -150, -530, -129, 721, -483, 266, 279, 550, -207, -167, 261, 160, -642, 41, -250, 466, -218, 157, -439, -193, 705, 122, -410, -42, -816, -81, 425, -196, -490, -87, 335, -202, -131, -478, -577, -210, 269, -74, 78, -700, -428, 542]
6286E42j71q57J071n73N96o16r1L29P0L00q77N11J00j20j505J012N69j27m78J69
6306a46K67n30M14J06l03l02R99n72k16j72J052p78K03K24l62J55K97m03K96L24
6326E53m13l84M92l44o87R2N92K64J19q41L92m6K79J24M43k76k27O61p65l61L43
6347A0m34l47M00L08m47K22R01j085K59K23J25o81J037m5r52K82k62P40k71n82
6367e99L74M76p15m40J033r22Q85l83j65O36l17K9k26L42J07k38M61o64N39j93
6387B0N2L39p16L88M33p36j07P89j4r14l33M64O60m64L17n7n20L41M65o89N79
6408B97j84J57n87J77n94K10R62j15l51n19R41r0o62J024j263N48M74m46J0l10
6428c21K61k53L77L90l24P17j161P28l57L04q4n96L37k01P38o02p99O56M68j57
$$ y = [542, 371, -486, 585, 12, 608, -8, -99, 230, 300, 600, -277, 234, 334, 214, -1291, -279, 290, 163, -315, -146, 121, -409, 5, 111, -192, -494, 505, -67, -283, -455, 597, -181, 22, 246, -116, 39, 336, -67, 229, 553, 140, -244, 248, -96, -783, -691, -99, 165, 284, -557, -165, -211, 68, 192, 635, 359, 132, 793, 28, -333, 10, -424, -771, -371, -63, -510, -288, 613, -472, -213, 10, 135, -546, 491, 446, -506, -224, -486, 254, -17, -599, -225, 251, -464, -904, 129, -793, 92, -291, -456, 180, -137, -108, -334, 8, 115, -123, 338, -326, 213, 20, 72, 411, -305, 83, 516, -220, -327, 462, 448, -466, -799, -335, 325, -139, 178, 121, -399, -58, 407, -282, 297, 113, 270, -317, -140, -734, -524, 438, 323, -28, -547, 394, 304, -358, 666, -597, -49, 425, -21, -11, -321, -60, -313, 64, 454, 130, 847, -314, 414, 57, 361, 277, -319, 18, -183, 555, -47, -846, -190, 278, 121]
6448A21m27j96P39m34k7j16Q49n22L27r15O85K5r1l88M90J84l00K47l28L23j86
6469F0L11j12l75m9R78q75L60J70p81j95M88K88l60K55k37j079J444l18N91r08
6489c44L90K83k96L53l40q12J182k94j21m17L44k69O88q2o91O55k7m81k63Q42
6509C00R1N66n19r83Q02K32p69J55k67N11O55o85l76O4P41Q8q64L77n75N90K26
6530C60l79n1k62N79o47R1P65q97O64k87J87O49o79M09q41P1N43J43o39L50l0
6551I9r1m07P80M48j473P49k5r8o23J042q32M48j91k53M74k28l26n5K88J35L51
6572B12j68j34J03K12N83p58O61o02K61J54o28k47j93L61M54k33j45Q5N08r52
6592d66J18Q87p14L71L4m53L62L95q97K14O30r56M78O58j871Q58Q3K42K7k79l20
$$ y = [121, -306, -502, 237, -197, -224, -340, 509, -13, 314, -601, 84, 109, 18, -370, 120, 304, 4, 251, -77, 246, 60, 371, 259, -116, -165, 813, -62, 298, 468, -313, -508, -20, 268, -92, 163, -74, -1153, 291, -27, 564, -344, 46, 329, 33, 386, 46, -766, 416, 122, 1, -416, -72, -341, 347, 265, -426, 229, 202, -279, -542, 300, 391, 957, 438, -545, 257, 489, -280, -125, -392, 119, 774, 89, -287, -223, 518, 606, -258, 119, -456, 134, 360, -19, -70, -332, 247, -400, -309, 456, -441, 223, -64, 123, 772, 93, 502, -339, -268, 275, 418, -221, 129, 99, 8, -399, 381, 829, -644, 105, 80, -18, -641, 401, -431, 17, -174, -427, 47, -181, -507, -562, -274, -139, 212, 44, -90, 13, 225, 808, 50, 711, 109, 370, 524, -104, -351, -544, -183, 271, 38, -107, -22, 486, -466, -348, 539, -175, 196, 230, -223, 139, 534, -363, -149, 481, -475, 3, 661, -1210, -352, -269, -27, 0, -279, -599]
6613e99L97j70J076j170R34j68n69J09k42k69J070l41m59K38L0M1J83k56j14N31
6633B52Q03m68r69N68M9K72n76o01J194k11j46M4J47l2o41L30k81Q66l66M2m97
6654b21Q17m86N7J37r29O59j09j73j20M2J48L29n1m99K81N55o68L05J56l93N41
6675C78n91R68n80l67N7p3j36L98l21n02L20J05Q0O20N1m37L21j92L45M3j039
6696e52j07J00P99l34Q6K9o73J039m68j42M81J54n61K93l87j16J93M33J61l18
6716A10m16q1K69J3Q41j01j005N79q06N98J48O52j265N68L70n09O3OO35o54K61
6737B76O05r28J26j16Q0m87J04j06J27R29o49k20N04k04k47J8j4J48M37K74n51
6758A06k98N52k18m00N19M81q0j332N23l71R73k0j108K93n7P11j29o1q8L87k09
$$ y = [-599, -202, -372, 704, -466, 468, 300, -269, -160, -402, -671, 399, 58, -401, -163, -133, -92, 91, -165, -279, 252, 1055, 587, -382, 186, 235, 507, -69, -670, 524, 313, 167, 211, 358, 326, -315, 15, -266, 600, 234, 276, -221, 596, 110, 167, 304, -625, 34, -75, -248, -368, -326, -178, 151, 100, -399, -118, 437, -231, 74, 230, -163, 378, -213, 755, 175, -192, -135, -208, -344, 54, -267, -769, -449, -344, -264, 356, 407, -30, 291, 99, 444, 487, -552, -659, -559, 240, -94, -8, 21, -652, 387, -81, -223, 258, 412, -149, 144, -243, -359, -166, 267, 428, 110, -306, -387, -118, -105, 736, 635, -370, 209, -597, 1, 149, 801, -464, 104, 474, -35, 28, 34, 669, 15, 276, 881, -47, 79, -37, 43, -444, -340, -446, -319, 610, -39, -259, 245, 41, -206, -188, -202, -54, 383, 657, 106, -192, 360, 142, -258, 261, 742, 662, -670, -147, -518, 455, 435, -673, -380, -437, 274, 145, 84, -4, 383, 174]
6779A74o65R30q01Q64m95n08O9K82r3o46O84P7l81J18J93k88J101r34J1M62P3
6800B27J37J43n20q74J271r78J128j08J95o04r5K69L25o85M91m05L66m88K36l36
6820c05M49j94o20Q96n6J45j51n21N00K38L56m00o45J33l99L74M38k19J45m56
6840b92O78q95L6P32O8q60K64N33m42L93l74J63k08M08K04q95O61p41M62P01n46
6861E0j66p06M33P0O93j385J096O0p4k07j34K4M2K74m10Q22k90k94Q1l51R43o94
6883a23J3L14N28o53N48L18j347Q12o9k93j45q15O89j88m65J017M67m93k76O93
6903E32q09k37M20j59P07j19P47q74k4J93n79k12L96m80M56Q11o79N9o73O74p4
6924G6j76J07q70P07K05J04J57m65j56N24K31o80R2r0N94j061Q79K59l1l46L48
$$ y = [174, -491, 439, -362, 502, 7, -501, -432, -150, -243, -889, -205, -128, -509, -391, -198, -486, 615, -319, -308, 154, 227, 364, 507, -13, -887, 384, -594, 534, 426, 621, 17, -78, 191, 516, -169, 322, -83, 283, -205, 31, -305, 144, -50, -670, 226, 170, 315, 164, -357, 143, 381, 737, 337, -308, -175, -574, -200, 238, 19, 164, -292, 386, -509, -473, 259, 327, -533, -269, 264, -178, 215, -159, 4, -204, 204, 408, -487, 174, -567, -105, 596, 50, -116, -822, -389, -319, 374, -1011, 85, 145, 71, -136, -270, -246, -204, 70, -340, 482, 192, -102, -21, -372, 571, -123, -110, 204, 732, 79, 627, 945, -402, 410, 341, 48, -97, -912, -223, -411, -876, 141, 608, 115, -161, 532, -277, -514, -94, -253, 454, 335, 1082, 208, 184, 377, -202, -414, -18, -498, -42, 769, 90, 149, -524, 150, 76, -100, 7, -863, -156, 49, 153, 310, -155, -311, 213, 444, -236, -144, -234, 360, -701, 178, 437, 406, 60, 408]
6945D08k78o91Q90r9k02K5l0k99Q88j444Q96k88j75K32M20j36J70l97o1k38J376
6966I67q86Q2K02j98j004O32K41o62P90o13J154m82k79j98J05p95J110l88M14
6985A92o44N70J30o03R37j309O18Q87j110l75R06o36N34k81M8l28M18P1l18O20
7005C27j51mn75P52j231P20R17q22L97J96j75m4p50k16Q16j24O38q25L52l01l38
7026d41N88m33O17p38L79L60q5k59Q86j235K69L29J47m40%n77K58R16m38l4n30
7047d61L38j3j20O59L82m22j27q0k60J88m25K00j46K10k61N75p95L27o03J070
7067B36Q6n55K34J94M85k83p83N5P52L40m50k27j63j12K69o6q70N88m65L94J028
7088F87m43k78m13O7N84J56l24R63j540K16R75p86j9O73j035J317n43l35P5P1
$$ y = [408, 130, -561, 329, 230, 28, 53, 23, -276, 612, -832, 64, -224, -399, -167, 253, 117, 287, -110, -171, -409, 967, 81, 163, 365, 167, -837, -205, 36, -626, 164, -449, 705, 223, -56, -254, -149, -944, 166, -222, 192, -452, 118, 248, -355, 582, -727, -109, 778, -332, -707, 199, -437, 97, -184, -136, -464, -46, 25, -293, 327, 176, 172, -403, 349, -882, -162, 755, -67, 330, 526, 351, 307, -443, -659, 157, 33, 671, -154, 198, -103, -441, 147, -286, 331, -407, -28, 332, 247, -12, 874, -361, -92, 237, 384, -56, -56, -633, -375, 541, 103, 69, -461, -123, -136, -256, 403, 785, 363, 236, 156, -104, 84, -341, -141, -287, -77, -338, 237, -558, -231, -834, 236, 322, -233, 1, 195, 680, 397, -386, -331, 421, 761, 311, 84, -79, -191, 78, 12, -858, -270, -735, -341, 687, 244, -34, -447, -380, 204, 360, 36, 999, -541, -325, 650, -136, -155, 518, -517, 800, 257, -78, -3, 68]
7108F8O85q59q12R88K39o33M82k23K46L27p32M51j20oJ51o04j15m6Q91O32o93
7129C17k87J00n63p0KL62P16q50L94m20N09k92k41P32l61K64r16L73L80q62L75
7150c38M17K74l66k16l70Q82r82P66q89R29L21l52L57o94N93m35O21q11J08P4
7170a11J44j67k16O42m19J36l98L17k02j026J001N02j91k71K71j03j63k46P02
7189B02K5L15l20n60l58M9M34K87L84j059K08R83p08ol70M96k31r1M22M47m16
7210A33j87M37p53J210j140K22N49q97j02Q17l90K92j60M13L29j179j0M76j73
7229a13J89o5k05l47J122p12L82m87k59R80k40R0j61ro15n56N41L44M71n17R7
7250g0p8R98k42r17L32o5k5R59r93nK83O62j16r07o46M66Q6K67m6J53l27j63Q83
$$ y = [68, 753, -106, -918, 70, 309, -324, 158, -65, 181, 508, -224, 227, 107, 101, 252, -352, -467, -513, 378, 1010, 317, 30, 130, -433, -503, -501, -139, 577, -273, 121, -299, 210, -82, -323, 409, 48, 312, -604, -231, 149, -713, -338, 79, 353, -13, -229, -599, 283, -699, 67, -822, 107, 428, 76, 433, -261, 332, -103, 518, -293, -185, -111, 33, -134, -350, 292, -127, 9, -389, -72, -274, -1300, -299, 203, 12, -259, 12, -91, -254, -500, 202, 227, 542, 222, -338, -696, -647, -213, 74, 458, -601, -393, 590, -118, -124, -494, 2, -229, -320, 102, 549, 133, -54, 383, -370, 840, -300, -78, 471, -426, -528, 289, -101, 191, 31, 444, 773, -406, -416, 60, -113, 76, 11, -194, -541, 581, -131, 251, -236, -495, 485, 245, 335, 174, 165, -450, -1006, -465, -121, 350, -167, -70, -148, 850, 608, -309, 23, -42, -67, 892, -101, -106, 177, 839, 723, -184, -830, -364, -278, -11, -57, 96, -231, -394, 489]
7273D89j182J163o37l76J143p31L86j220J392r4M32j836R35p3J30j71M92n18O18
7292C42j99m20O65m18k80P91q77J37P93j092N80j87m21L95L69l40K5N56n50O14
7312D83m35P23j169O00k46K26M45L31o29m95k4L43p7K68n10J53n90r0J185o86
7332a94K29m08J071j063N64l30P19K09r32J40j05Q91l89q88N10r7N67J31r52M34
7352A07m82K83L47J3m41l10N28N24r6o47L1J97n08R54o77N55m94k49P18K34q12
7373b25J26J17rp94J038m36M85j08M7m3L24K8j017j41J99L82J34J20l04J65J42
7394B30m06J64J25K19r4K0l19M07j37q76M94j55M15l37K09N08j390Q93J50n74
7414d54M15K14M26m04n78J70J60LM88o29j55N06J60j29r75Q12K05k53J57n5J57
$$ y = [489, -693, 470, -167, -543, 600, -131, 255, -965, 427, 333, 765, -1071, -136, -209, -79, -250, 242, -276, 342, 143, -277, 388, -30, -310, 481, -396, -259, 534, -558, 22, -165, -586, -191, 178, -162, -137, 419, -131, 483, 48, 771, -398, 202, -44, 182, 627, 958, 329, -166, -190, 153, 76, 344, -166, -13, -603, -693, 492, -194, 35, -373, 698, -365, 199, -131, 588, 797, -135, 5, -100, 791, 402, -486, 24, -73, 494, 625, -327, 107, -375, -92, 255, 268, -173, -483, 45, 569, 473, -174, -143, 54, -454, 500, -177, 378, -116, -365, 353, 587, -225, -99, 18, 9, -785, 253, -183, 302, 194, 241, 198, 522, 550, -467, -608, -409, -27, 107, 227, -77, 88, 230, -176, -12, 113, 332, 238, 258, -61, 346, 209, -667, -173, -328, 87, -250, -41, 467, -923, -30, 120, -454, -39, 175, 601, 197, -381, -211, -51, -48, 440, -189, -344, 162, 322, 193, -782, 30, 235, -18, 139, 84, 241]
7435B41l23l31K03M7j53K38M51o45mN00j80j11j16L15J76l58J46J24j42J75l14
7456f1L29m06N76q6o65K58J84n87k25L34L90k13j28K97m3m91Q87L02k82l90j016
7477a036O02k28L99K31O15l32M26r19O35k04n94K85R4L19m17l8K27J07o36k9O1
7498d32L51M69n58J03l42M73L83p68J32L07k20P84j349J45J95M30j66Q4k24N35
7518C32M5p29O68r55O86l82M06j77n9p3n5O39l40j3n7L82O8j083R75K72p30K70
7540I0O0j88J91l08k70l01N79r3j50Q98j128L30K88j56N21l38L32q39K72J09M0
7561f1J309j276j052N22L94O06l70j92L75m3l89o13L53P94K9p55N60n62N38k93
7581a26K86q21N78l18j39N13m4n2L25k02j00k31L81j42L6n32O80J86l18k18O79
$$ y = [241, -82, -413, -210, -163, -316, -78, 373, -272, -276, 224, 44, -67, -183, 132, 308, -50, 96, 220, 78, 253, -61, 268, -138, 438, 352, -313, -55, 129, -458, -683, -349, 41, -172, -300, -3, -46, -537, 350, 652, 370, -20, -1036, -434, -662, -263, -32, 583, 251, 677, -242, 393, 189, -405, -120, -26, 293, -124, -162, 65, 172, -464, -493, -432, -81, 388, -170, -67, -409, 64, 447, -321, -189, 118, -102, 682, -667, -522, -327, 103, -63, 21, -203, 332, 377, -352, 316, -639, 47, -335, 71, -106, -165, -238, -293, 346, 6, -7, -64, 318, 386, -697, 278, 550, -180, 90, 150, -38, 153, -155, -425, -726, -147, -240, -390, 508, -620, -290, -2, -158, 363, 25, 357, -482, -210, -101, -61, 1248, -28, -1080, -558, -164, 442, 72, -120, 255, 212, -177, -790, -437, 357, 386, -369, 191, -371, 167, -126, 160, -661, -83, -401, -540, -27, -71, -123, 202, 0, -100, -331, 50, -92, -56, -588, 92, 278, -40, -258, 421]
7602D21j69L52p26n21P55m43M86J04n48L62O58l45q60K87O15o52J95O62J41o96
7622G8K81n8j221J269J49Q2j230O58l44K12P5l3j91L35j083N84P15m46O45m76
7642AJ13J29K2o93N42n41Q93o09N84p65j33n17J263K30q99R84q22L55J90l49N02
7663D80n03m7j97P61l36k18M68O06q95J58j329J375N93n45k50n3j20N11p34N39
7683B64m60N23m45QM31K62p89k25J29K36l85K44l40O01M76q92N04K10o12L51J49
7704B40L13m06j93L31m74l49N76L85r60K89O23j23p12l8J39%L87q3L30j09l63
7725a97j9K13J38l19K40j1J294p02r63L29o35P91L96q29j26n69Q36j65j94J629
7745A137j224R52q94n70O37j98o06N77M6K23K35l48n67M85K71n66L52o8o34M14
$$ y = [421, 252, 604, -122, -643, 112, -331, 155, 259, -289, 73, 731, 386, -474, -187, 428, -224, -29, 633, 774, 78, 359, 301, -920, 349, 498, 580, -650, 8, -336, -124, -49, -82, -273, 62, -1021, -437, 278, -168, 477, 1, 114, 243, 265, -428, 114, -427, 466, -143, 441, -324, -457, -974, 289, 519, -380, 604, -218, 137, 327, -22, 480, -23, -70, -267, 494, 158, -60, 408, 1014, 119, 277, -1052, 323, 916, 371, 121, 68, -52, 459, -275, 264, -196, 327, -118, -110, 321, 583, -206, -431, -302, -66, -451, -207, -547, 54, 530, -362, 142, 352, -260, 91, 240, 553, 147, -46, 285, -189, -538, 38, 423, -537, -248, 375, 252, -460, -498, -359, -359, 28, -55, 275, 166, -197, -216, -3, 135, -184, 56, 45, 1339, 637, -326, 3, -632, 159, 555, -274, -400, -969, -133, -298, -492, 1137, -87, 865, -29, -599, 38, -160, -766, -189, -143, 80, 315, -33, -600, -115, 156, -410, -58, -126, -760, -346]
7765c46R41o45J58j63q87N20L31j91J57P39j18p18K28J74L62p03j94J206j300
7784d49K72K67n60P4R03n66L83j90j21K36m22j74l54P96l23l58L56J07O1P69m90
7805B17rL62m89J21n85M42o32M89N42m53L89n46m78j32N03M97P46j030q57P50
7825a53j37K92n09N34n5q02O57M14K03n6O3m85J04M82r07R11j180M64K37m80O44
7846B41k6j34n21J524j604O02k72O67q1j04n25K69R10m16l97N35r58k01j55Q14
7866A68n37K0Q9J12l3K20n8J33J5m22O17m09J22N63k79k8J37o49l23K94Q26p11
7888a33q95J338n70J64L56n08R12o06l14J33J61kK66J3M57q39J13R2j2O8o29N62
7910A27n00K79k02Q37m35p20L31P41M7m08K35n55L10n65K39O69L24p01o2O6L18
$$ y = [-346, 595, -50, 108, -55, -942, -422, -91, -282, -125, 614, 496, -222, 6, 180, 542, -161, -355, 851, -449, -177, 90, -470, -396, 507, -59, 324, 134, 13, 249, -173, -347, -701, 95, -228, -586, -230, -123, -62, 707, 217, 208, 570, 81, 202, -383, 59, -573, -84, 458, 5, 394, -152, -630, -762, -259, 238, 984, -46, -903, -153, -290, 2, -507, 27, -28, -830, -173, 241, 444, 388, 451, -34, 70, 552, -355, 556, -624, -160, 77, -403, 241, 215, 81, -440, 1084, -520, 82, -190, 477, 396, 292, -233, 36, 946, 530, 133, 668, -290, -491, -646, 168, -369, -349, -260, -148, -181, 39, -19, 114, 129, -293, 324, -85, 37, 600, 321, 293, 430, -219, -542, -248, 578, -133, -1028, 310, -260, -96, 260, -248, 664, 58, -256, -123, 38, 36, 302, 315, 772, -67, 46, 138, 126, 194, -435, 127, -373, -94, -296, 541, 106, -614, -283, 458, 505, 97, 332, -223, 87, -478, -239, 430, 754, 53, -9, 57, 375]
7931C75o37N81j113R14J87n23M58J87q42m17N25O86n29K68l17L88o0n62N76m36
7951b91M20l17K02K43l2m83L46l29N26k35k04N51p18L85J25k32j04k19l88P60
7971Fm18M67K28k95J18N80o20M62n21m59K05O21q02Q97j272P00K0O31m8n28r2
7992a20O06m56j44O52p69L1N42m2k37O6m10L81k82k13M96O7q59J055q5K26r88
8013d83N29L85p16J61O47k30l58M21m27m09N11N2L46k61r92J376r4j101Q14J79
8033C50m5K31o60N34Q4n0q54L39L28k67p64R46k96l31K79O44o31n83L59L64L83
8054C60m20O3K72Q1k27k82J179p23j28o29L64m18N39N3p5n0r03M89O13K87l59
8075H6p15L23N48J22r32J698o74q0p61M8%L81J41p32L85L37O75n98m01k02R26
$$ y = [375, -262, 319, -794, 120, 307, -216, 242, 429, -413, -830, -305, 381, -148, 120, -197, 191, 131, -431, 145, -291, 129, -188, 14, 257, 225, -258, 88, -241, 285, 50, -154, 397, -321, 64, 189, -43, -147, -366, -754, 6, -412, 55, 283, -12, 106, 686, 66, 528, 7, -452, -247, 374, -428, 469, -803, -103, -83, 548, 500, -28, -120, 486, 30, -114, 538, -231, -200, 342, 300, 63, 129, -281, 100, -182, -395, 101, 168, -691, 364, 279, 505, -483, 46, 431, -285, -124, 523, 293, -65, 356, -71, -480, 31, 83, 429, 168, -824, 552, 458, -643, 171, 350, 305, 536, -124, 410, 494, 444, -410, -71, 257, -10, -774, 172, -124, -455, -176, 468, -163, -746, -387, -23, 360, -60, 3, 275, 356, 129, -153, 1026, 303, 175, -454, -90, -508, 31, 84, 9, -41, -944, -455, 158, 445, 86, -629, -306, 242, 364, -568, 1130, 456, 376, -385, -337, -337, 44, 185, -547, -162, 175, 850, 252, -149, -351, 575]
8096E75q71L54Q1n36N65J01p57J469j176P26l49P7K21j348Q20m01J03O39o91J416
8116A018j027J03L96l78O8L4n05k97k26Q46L53l40m8L23q8k23J19m0O32q11O76
8137E85j302O18p90J332j44q56L36k22k97N75L99K15o62N07m61O42j74k82l63
8156c44O78l53l46K93j39q86R43M30n59K97j96L37k67k87K12k6J37j43O60l03
8176A38m89N99j00N74r76O37o87n2O85l15Q27j44r83J040m87
$$ y = [575, -296, 58, 139, -397, 168, 269, -488, 981, -195, 531, 182, 259, 480, -868, -48, -449, -346, 293, -398, 1018, -9, 94, 490, 112, 180, 214, -291, -588, -814, 32, 385, 45, -3, 320, 232, 9, 128, 88, 720, -91, 585, -717, -99, -889, 443, 299, -557, -221, -443, -740, -165, 234, 449, -213, 294, -167, 475, 301, 19, -344, 334, -19, -365, -72, -211, -1097, -154, 276, -283, 14, -182, 155, -112, -399, -187, -213, -76, -219, 441, 138, -351, 248, 148, 722, -254, 383, -304, -356, 329, 14, 841, 697, -286, 754, 267]
8191B67
$$ Imaginary data points
##PAGE= N=2
##DATA TABLE= (X++(I..I)), XYDATA
0@%%%%%%%%%%%%%%%%%%Ko6J28j28J28j28J28j86K50k56K82l46L84m42N07n71O53
35C39p23Q25r34J040j157J287j429J588j760J945k154K380k624K896l188L511
51A842l871M266m704N193n745O369p080P906q869J0015j1405J3133j5356J8325
65A0019k2524K8954m0207O5761k56754P6985K49191k02203J6485J58970J6781
76A01458r2908P0994l8106j17472L4094J19082p7764p9316Q7218J03013m7990
87F2303o8196j6592J4784J647q643m2756j8360M4485N9859j6998l9033K0626M5017
100C8143P074r018l1643l2925M4108O0497p4748q0717Q8810P2646r3044m6423
112e7240O9849j4640n6213N5503N058r3335M8169J30110n5327r8059Q3210P1840
$$ y = [0, 0, 0, 0, 0, 0, 0, 0, 0, 0, 0, 0, 0, 0, 0, 0, 0, 0, 0, 2, -64, 64, -64, 64, -64, 64, -122, 128, -128, 154, -192, 192, -250, 257, -314, 339, -384, 441, -493, 547, -610, 677, -752, 836, -924, 1021, -1133, 1247, -1377, 1519, -1669, 1842, -2029, 2237, -2467, 2726, -3019, 3350, -3730, 4176, -4693, 5322, -6083, 7050, -8306, 10019, -12505, 16449, -23758, 42003, -214751, -137766, 111425, -90778, -74293, 84677, 101458, 8550, 79544, 41438, -76034, -41940, 77142, -622, -79938, 7280, 110293, 62303, -5893, -22485, -7701, -6054, -14697, -57453, -75813, -31328, 28531, 11533, -27500, -6874, 38143, 45217, 36199, 4556, -28369, 15739, 76236, 1488, -79229, 9581, 82227, -10817, -57240, 12609, -2031, -58244, -2741, 2317, -91018, -42849, 87261, 31934, -66125, 17085, 88925]
124H8925q2257m0753N0949k966k0212M5938M740o6603L913N7394k9646p7854P251
137f1181N5061M232j9594J0444J4670R727J7870j4415m4880J1280M9039n779k9361
150b887K0353J3775j8901M332q553n4512K140O2207k1724o1328M1769N6150l7972
163e151j6828M2579j7133l0365N2099K1286o3943K395P3346j5987o6999J5978
175h723L7944k9133j7494K1609j4410k6514K7139J7306l9248r016M6748J1984
187A8192l0048P130K4858o572k830J4212j4758j5608K5660R259l4212p187J9339
200G435j5442j9504J4158k474j6742L0169K5677l3854q804M1886o855m0622J6855
213h117L0564k1671k206L7460p806l0798K0292J4203m8411k1798L3128j995l1216
$$ y = [88925, 6668, -34085, 16864, 13898, -6314, 39624, 44364, -22239, -18326, 39068, 9422, -68432, -61181, -6120, -1888, -21482, -11038, 3632, 13359, 31229, 16814, -28066, -16786, 32253, 26474, -2887, 17466, 31241, 12340, 16672, 8119, -46393, -44253, 17954, -3770, -65098, -23329, 32821, -5151, -21979, 20600, 3467, -26898, 25201, 46487, -17456, -15061, 58285, 42298, -24701, -8723, 29221, 88, -17406, 4203, -10207, -36721, -9582, 7724, -31524, -40540, 6208, 18192, -11856, -4726, 20132, 13560, 10730, 24942, 10184, -5424, 20236, 29495, -4717, -11904, 7435, -8007, -27511, -13353, -15827, -32569, -2400, 23277, -10577, -19381, 22505, 15650, -24972, -8117, 22447, 776, -1430, 36030, 28224, -2574, 17718, 31921, -16490, -38288, -5160, -7155, -38371]
226c8371J9327K8687j7232p877K9443m504k5164J6911K1331k1675p492K7127N13
239B1024k0059J0222R528k2370n666J4208j3861j7095J5750N157k2001N862K2701
252C400j1519p348K8676O058k3496J0674J8903j8815j0338K3778l668k8458J3499
265A346J9675k8090j6709K7504O8l0225O001K0085j4823l582K8228j864k2549
278a4935K0439K5010k1990j5536K5350N282k2243M31O239j5404m40J6930j3672
291d539k1738J7889J7074k1696r255J8478L520p002J1816J387j3306J6622K5417
304C4667j9529k3869J9475J2232k2534j0533J0193p483l831J4683q483k4509J8725
317a0796K7332k1825k2769K3640J7505j4288R44J3277o140J322J9852j2776k7896
$$ y = [-38371, -19044, 9643, -7589, -15466, 13977, 9473, -15691, 1220, 22551, 876, -6616, 20511, 21024, 965, 11187, 20715, -1655, -7321, 6887, -6974, -24069, -8319, -3162, -25163, -19301, 3400, -8119, -15467, 13209, 19267, -4229, 6445, 25348, 6533, -3805, 19973, 16305, -12153, 1346, 21021, -7069, -23778, 3726, 3794, -26431, -20430, -345, -15168, -18750, 9478, 7614, -14935, 5504, 30514, 8524, -7012, 18338, 23620, 1377, 1808, 8047, -7357, -7797, 9133, -4539, -26277, -8388, 8686, -13010, -22265, -3787, -267, -7269, 4547, 5934, -7372, 9250, 34667, 15138, -8731, 10744, 22976, 442, -10091, 102, -7381, -11212, 3471, -5012, -29521, -10796, 16536, -5289, -28058, -4418, 13087, -1201, -257, 13020, 6880, 8202, 28054, 15278, -12618]
330a2618J2445K3587k1079k3637J2984P589r498K104J098j2198P555K2679q791
343B220k2587J7864K5878j0329j5893R154K034k780R969o145k0512R452K2824
356B1149j8423k8369J3079J5643j5519n594J0035k554K862K3104k595k2367J0462
369I13K5808j2791k2907J1761J1923j0852J113K866j5339l583K0399n356k8738
382b4783N832K3186p330j5525Q936Q599j492R320N472j5093L781K4281n694k3798
396d308K411J4549r721q185N312n200o015J2567P12k3474K71K4376J43j5987Q627
411c922J3949l209K637P174j3748p697J9884J171k4034j536K2104l704j6233J271
425e893p65j0644M675J0175j2279k518K3467Q027j6969K35J5311l102p139O153
$$ y = [-12618, -173, 23414, 2335, -21302, -8318, -729, -10227, -8123, -7025, -19223, -11668, 11011, 2220, -20367, -2503, 23375, 13046, -2847, 6307, 8341, 5561, 15530, 9385, -11127, -1675, 21149, 2726, -25643, -12564, 3079, -12440, -18034, -7999, -10553, -7691, 15413, 12818, -9549, 913, 26721, 13930, -8977, 2784, 14707, 3855, 4968, 7834, -7505, -11088, 9311, 3955, -24783, -18951, 4235, -3095, -18620, -9684, -1085, -2577, 6743, 12215, -2878, 903, 25184, 19490, -4308, -1897, 12652, 2931, -5254, 58, -5142, -11157, 1410, 2122, -21352, -21081, 3295, 3438, -12549, -3922, 10027, 6818, 9455, 16629, 2881, -4816, 15068, 16239, -7795, -9331, 12773, 9069, -7164, -5893, -6658, -17302, -12627, -2452, -14731, -17249, 6218, 14245, -2724, -2489, 12822, 9720, 2581, 8734]
439H734k405q080J0331R858j8522j0930J4074J478j7610j932R298l567M41J1070
453B238p674p603J7664J1866j6865l331J8888M90j3205J636L269j0330J340R095
467G478j0753j1485J5222P158j6373n092J0462l697o994J0486M840p240J0715
480D727J5462r227j1647J2076N550j3325l813N854o823o401P017k457j2258O022
494i243J2960r205o596J3874L659j0566L266P433j0998j394J5731K401r293Q711
508A0740J0377j2956r433L871r298j1759P719N472j0225K234J9296J09r926N446
522A667N837r781K1R906n164m052J2053N715j2612l885R018m478r796K314q62
537d099r872L681R983q356p463J4927J0574j0444j802R499J71l479O088m568q880
$$ y = [8734, 6329, -1751, 8580, 18438, -84, -11014, 3060, 4538, -13072, -15004, -5706, -9273, -8832, 2238, -5436, -13039, 4625, 16491, -374, -3705, 15183, 15673, 2468, 4104, 7373, -2957, -1617, 7478, -3275, -14760, 462, 7620, -8753, -13845, -3383, -7080, -14074, -3588, 1252, -5988, 4727, 20189, 10962, -685, 11391, 16941, 3616, -197, 5657, -1166, -7567, -550, -3007, -15265, -9243, 3717, -5488, -12084, 1790, 5449, -5117, -1851, 5582, -5416, -6810, 8921, 11322, 2029, 10740, 21117, 8161, -1272, 2599, -6699, -18458, -10739, -5267, -15492, -13258, 6038, 6147, -3779, 1667, 7504, -2277, -2256, 7650, 2486, -1566, 10487, 16202, 3590, -295, 8723, 4245, -5551, -3237, -4099, -13971, -10290, -307, -8663, -16126, -1199, 9375, -1069, -2871, 6628, 6799, 3320, 9408, 4840, -4040]
552d040R268J1763j3283j1152J0811J984j4076m009L274l610L772J3032n608p901
566i775J3757J0051j2095r122J0508N245l931J535N06n475N607Q468j4732j7210
580a6663Q792J0207q946q158P681O131o77K961l367o414Q482J3764p358j2481
594f046J0350J3000p793p854J202l109j912N823p527j2994R214J4542j0831j2758
608a6693Q457J1150k766N13K121l757N300J1051q621j3470Q777J3040q068j2183
622e149L184M131l074N41m898r272N414J2332m128j3120P451J4845l017o543K890
637A587K278K148O108k535j2349J944J2874p484j6839K916R702k564l280K217
651c277k874M32J1310k903j5511L779J6180j034p879O934N597l05M01l275j1204
$$ y = [-4040, 5228, 16991, 3708, -7444, 3367, 5351, -8725, -12734, -9460, -13070, -9298, 3734, -1874, -9775, 3982, 14033, 1938, -7184, 3324, 8569, 4638, 6173, 6679, 1204, 6811, 15279, 547, -16663, -7871, 2336, -6610, -14768, -7087, -956, -1633, 1328, -2039, -8453, 29, 13793, 6435, -6046, 4304, 17304, 9511, 1657, 2859, -250, -2162, 3661, -3866, -16860, -7646, 6896, -3935, -16693, -8236, 2914, 148, 661, 2782, -975, 4325, 15376, 6755, -6715, 2062, 15102, 7034, -5149, -1965, 2166, -908, -367, -5265, -14537, -9123, 3209, -919, -14039, -6588, 8257, 5240, -1303, 1587, 3865, 6013, 12121, 9586, -2763, -819, 12055, 4571, -12268, -9352, 350, -2214, -5494, -3277, -6151, -5719, 5591, 2688, -12823, -9044, 7136, 6102, -1777, 5157, 10754, 10449, 10850, 7575, -3629]
666c629j094J0344m421j3942J405J1558j095n650K038J378o66N723J348q598P16
681d585J3748K204j1260K07Q253m76l797k67n381m606O214J230j3730j943J3847
696c42K169q781K123N184n80K504L143o142j576J2496J674j1726o89R260j476
711G241q141j040j440l808L645L064q271k449J0390K941p610k76Q449J082j362
726B415K366n34l353O191L949r165o041P818J736j0606j510N015j932j859L255
741b255l866l007Q575N837q042k150J0823K562n584J355K752m263J25K637o198
756f99m460O020K148p723k559N024o13l726K413J339k021M751N765m635k638Q640
772G026K553o201j574L393j454n295K896j388n021J851K926n644l184P005K194
$$ y = [-3629, -4723, 5621, 1200, -12742, -11337, 221, -874, -6524, -4486, -3108, -3774, 1949, 3297, -5301, -4585, 9163, 11367, 107, 314, 8567, 8091, 4294, 4027, -1354, -5960, 254, 1484, -12246, -14189, -342, 1827, -6954, -4831, 353, -227, 2277, 5420, -722, -2298, 10198, 11872, 146, -543, 8717, 7241, -900, -1940, -3380, -7188, -3543, -479, -8750, -11199, -809, 2132, -5478, -5754, 2695, 3777, 2415, 4781, 4247, 894, 7085, 11034, 1869, -4172, 3646, 5382, -5224, -6734, -1719, -3651, -5510, -2255, -6121, -9128, -553, 5284, -2758, -4908, 5915, 8477, 2893, 4248, 7000, 2737, 2862, 5499, -699, -5159, 861, 3009, -4714, -7273, -2249, -2862, -6588, -4175, -2836, -4857, -106, 5659, 1024, -1614, 7026, 9579, 3378, 1804, 5197, 3743, -1552, 1344, -44, -5065, -3214, -288, -5932, -9116, -2111, 83]
787H3o407K731O232k516j356N282Q99l733L343L407n902j547N093j815p019J885
803a340J964o440r99L659k353j203N288J903m606J419P771n38m488K556L892k442
819D043j396J823k619k329L868j920p867P95O071l863m733L125L159k215R02M297
835A141j219L70P105q35p182K016O196k964m796K294Lk468M18n55o628o78O799
852i83j613o262L413P359K45j296Q21j10L77L374l90n604J530P292j996q602J052
869a393L306l059k533p40k185J68N828J280o489J831Q268l0n277J206M017O17
885D815o9J31n462j88N594q97q391j315N983m04o004N38M86J270M131K150o493
902d125K374Q499N1o332j116M721l09j396n21j652r61N236o91q936k750O416M51
$$ y = [83, -6324, -3593, 2639, 123, -1233, 4049, 4948, 1215, 4558, 7965, 2063, 516, 5609, 3794, -3225, -1340, 624, -5816, -6815, -3156, -5509, -6712, -1424, 479, -4127, -2708, 5063, 4525, 37, 2593, 6485, 4043, 2647, 4470, 1851, -478, 3390, 1470, -6397, -5602, 469, -3394, -8127, -5002, -1843, -4058, -3156, 1141, -78, 292, 7397, 6562, -620, 1396, 7592, 4628, -168, 2126, 2129, -339, 79, -476, -7104, -7782, -983, -2596, -8858, -5445, 1914, 2159, 863, 1684, 1574, 1951, 5325, 4935, -669, 861, 8153, 6157, -2445, -1393, 1913, -1146, -3679, -4419, -6604, -6436, -608, 672, -5817, -3986, 4282, 4252, -1025, 181, 4198, 4815, 4746, 4877, -585, -773, 4821, 3924, -4467, -5782, 201, -203, -6207, -5669, -5183, -3913, 218, 2368, -4125, -1751, 6748, 6799, 467, -649, 4072, 3763, 2367, 1846, 194, -767, 4469, 3778, -5158, -7908, -1492, -1041]
919a041n856o02M219K363K006J687l384o37Q074K201r042k279O104K667m985j853
935c58n44r09J740j88n585k161Q622K083o971k005O154J212j58M39m01j26N083
952E927K446p147k272N307J999q214l663J909J741Q97p42l364j236N758L854o080
968b880k636O750L935k391k124J085Q75J294J675m824l385M920K593p092l778
983e983K845J758j738l95m54J8N201L034m001l604N199M468m105k325K690J772
999D380l22L17m237l196K377K123o085m320N956L029j731m02J120p52J859K313
1015B429j567k811M718M637l183m277K773P88j664j084j238j859o9K589k199m764
1031f781L829M161k697j521K269J291M69K068m64j547J440K601k885l549K610
$$ y = [-1041, -6897, -7499, -3280, -917, 1089, 2776, -608, -1245, 6829, 9030, -12, -2291, 3813, 6480, 1495, -358, -902, -1811, -71, -259, -5844, -8005, 617, 2700, -4271, -6276, -122, 1090, 932, 1371, 970, 844, 5927, 8373, 1226, -1046, 4261, 6260, -1954, -5617, -3708, -1967, -1070, -1812, -5176, -6412, -654, 3200, -2880, -5516, 1234, 5169, 2778, 654, 1739, 2614, 3908, 5583, 759, -2626, 2294, 4887, -2205, -5983, -3138, -1380, -3118, -3513, -3967, -3949, 1252, 4286, 285, -3319, 1880, 6348, 2243, -82, 2608, 4380, 4058, 4375, 138, -3058, -681, 1442, -4643, -8963, -3007, 22, -1709, -2111, -991, -1743, 116, 2429, 862, -1949, 2769, 7406, 4223, -54, 2719, 3507, 1843, 759, -479, -2338, -2407, 182, -2017, -6781, -2952, 1209, -1488, -3009, -740, 551, 1020, 3088, 2624, 1077, 2517, 5118, 2233, -1316, 1294]
1046A294J854k667l470J102j055l43J744q86k240K912M856k370k450K553K109
1061B943j904L98J022J28j517K696k85m004R0R60j779k961K117k11j519J136J870
1078h20j869J245L022M95k799K144K833j858q68J995j093k352J007n92k121q22
1094b453K760j461k897K222L75k408J025L069r24j114L610J622j338O68J328j003
1110C081j988J216m52l432L1K350k142k813K761j57k277J477R75n04k69K981J083
1127A921k346K581J828r85p98K94p92j944J428L24m036K25J729o11k630P05L145
1144C8j002p80J183k91p4K814R59j837Q84J843j17l221N34m3j841N70N16l285
1162c150j111K900K90k850O53K484Q21p84L3K155M43J243M33k776j234L955o4
$$ y = [1294, 3148, 481, -2989, -1887, -2942, -3285, -1541, -2427, -4667, -1755, 3101, 731, -1719, 834, 2943, 1039, 1437, 2459, 2587, 1070, 3766, 3481, -523, -433, 527, -1252, -4213, -2096, -2307, -3826, -2690, -820, -2689, -1444, 1578, 2073, -726, 1418, 4251, 2393, 1525, 3520, 2427, 75, 1082, 490, -1631, -2453, 307, -1154, -4051, -1829, -1454, -3862, -2837, 232, -692, -1806, 1804, 3426, 2088, 2756, 4084, 3081, 1093, 2309, 1857, -1575, -1544, 806, -1336, -4149, -1388, -1545, -3822, -2345, -1370, -1874, -2143, 838, 1921, -425, 2156, 3984, 2999, 2201, 2495, 1703, -241, 1187, 1511, -2525, -2300, -571, -1182, -3812, -3107, 38, -964, -1744, -561, -852, -926, 1888, 2847, 1010, 1894, 3737, 3620, 399, 933, 890, -951, -381, 135, -3150, -4261, -1361, -1071, -3921, -3268, -784, 37, -747, -714, 1441, 1884, 3127, 3560, 784, -450, 3505, 3441]
1179C441l564j580K535p65j843K22j620l90K343R27l241R9M468J090j504j69J459
1196A908L72J21M27k063q59L131o99l455j511K012M50j988j253O65n08J953J257
1213d0k491J238L249J934l242j414K762K052j458p37j218j217O69J715l379k535
1229d112L081J440l044o14J459M25J260O36j532j38L268K373j753k929K830P43
1245C393k217j160j33p68j68J216k362j321K336J700l264j616L623J975m78l95
1261C61K88j24J857J357k496j836K908O79j804k210N09j1j317N72n53k075K663
1278a232J959j865j316K950J569j064o71J676Oj87O34j281k34O00J052l387j922
1295b713P58R71k030J422L72o76N58K331n37k158J807K631r96j714K098K1n01
$$ y = [3441, -123, -1703, 832, 67, -1776, -1554, -3174, -3564, -1221, -294, -3535, -3436, 1032, 2122, 618, 449, 1908, 2280, 2401, 2828, 765, -94, 3037, 2338, -1117, -2628, -616, -166, -2154, -3407, -2742, -3250, -1297, -40, -2531, -1293, 1956, 3890, 648, -766, 1996, 4048, 2590, 1853, 635, -582, 87, 1802, -1577, -4112, -1031, 409, -2635, -3249, -1790, -1365, -105, 531, -1001, -1139, 2129, 4502, 2749, -180, 2650, 3393, 1176, 16, -117, -885, -1053, 163, -2199, -3520, -1184, 516, -2748, -4364, -741, 1234, 756, 361, 649, 525, 2382, 3739, 1243, -593, 2315, 2994, 1190, -1020, -511, -522, -1839, -1267, -1820, -3895, -1232, 727, -1138, -2454, 496, 2065, 1001, 330, 2006, 2012, 1825, 2459, 1178, 944, 1544, 2596, -791, -2713, -1955, -984, -3014, -1592, -1220, -1896, -1338, 993, 456, -1702, 105, 2736, 1740, 26, 2124, 2145, 1644]
1312A644M4M4k493M09O3j303j595J007K254j938K28P42N4l13K047J0j855J761
1330H10K034q11j157J090L48q04r15J95j856o41J290j462j693P57J893m50n1J939
1348E16n8r13M11J402o50J97R97l96j093P63O39j957q13O00n12j826K30J205K32
1367a026l81J423p38L04J637P06j034j68K313j245j027l5R96j418L76n41q21j286
1385a965J503k65k156Q24K663r91j165J95J093m68J881Q25p32l50J325J010k629
1402E98r37J271j17j262p69n65j138J403J073j674n49K399Q21j338j19J135J329
1419A561nK7j027N26J395L89l022n85R80j32k403j49J109K66K2M9n04p25L405
1438A177J80j101p10J026J849lr00k22K79P93j270j983j870K010J309k403p39
$$ y = [1644, 1688, 1732, -761, -352, -289, -1592, -3187, -2180, 74, -1864, -1636, -894, -840, -1153, 894, 904, -951, 810, 2844, 2033, 876, 1966, 2314, 1510, 595, 790, -1066, -1707, -417, -1879, -3572, -2815, -922, -1372, -1423, 516, 458, -455, -44, 1358, 708, 905, 1902, 1506, 413, 1176, 1815, -142, -955, -355, -867, -2693, -2463, -1258, -1026, -1407, 16, -722, -418, 1219, 1925, 891, 723, 3036, 1791, 764, 729, 1725, 307, 683, 142, -679, -1965, -462, -727, -2883, -2059, 604, -387, -1552, -1357, -264, -732, 1149, 1974, 1242, 892, 2217, 3227, 598, -339, 932, 815, -447, -1216, -1781, -2919, -1516, -443, -2117, -2666, -267, 554, -784, -903, 232, 1561, 1556, 1583, 556, 1082, 2477, 2866, -156, -741, 239, 107, -2296, -2445, -1336, -1070, -1048, -999, -1503, -2228, 1177, 1357, 256, -454, 572, 2421, 2418, 1518, 1296, 1575, 2368, 1098, -885, -2755, -745, 564, -1839, -2578]
1455b578J870R37j195n9K17l07J696J521j718o52K996P74j780j608k49K54j19
1472@m78j831L30J137J142j805j185J159K385m77r71N4J031R58J180j815p7O99
1490A436K122j952k188l87P70j88n26p81m28J626Q39j447q65J706J203j260m76
1507g96P26J116O69O83j860j64J026J267k356j809N96R17r16j08j672L65J708
1524f08J562j959j379K465K151p43j491M88J407N20j520O3j601K127k02j319k254
1541b293J420J183j081j562L67N19R66O81j06q57J440J950j247j249J75J797m81
1558A622n40o82j250Q29J783k180k217J323J807j274j376N83J839J000j201j32
1574f6O61N92J505j162j703R11N89n55k036Q90k51Q24o47k40j799O45O39N59j392
$$ y = [-2578, -708, 229, -966, -1025, -808, -1115, 581, 2102, 384, -268, 2728, 3502, 1722, 114, -135, 119, 0, -478, -2309, -1979, -842, 300, -1505, -2690, -1531, 854, 377, -594, -540, 491, 1449, 2629, 814, 737, 1436, 3558, 1606, -582, -969, -199, -387, -913, -1694, -2122, -496, 343, -1104, -1969, -263, 940, -320, -796, -70, 1046, 1715, 2398, 538, 374, 1400, 2667, 311, -1498, -902, 15, -901, -1009, -2681, -2316, -608, 954, -1005, -2384, 81, 2232, 1489, -2, 486, 1893, 2413, 893, 956, -645, 1482, 1280, -39, -2293, -873, 310, -771, -2333, -1966, -1447, -481, 200, 94, -763, 677, 2627, 1380, 131, 306, 2103, 1622, 1082, 400, -850, -21, 1762, -418, -2635, -1312, 495, -779, -2155, -1572, 267, 1267, 66, -66, 595, 1187, 2692, 1530, -173, 738, 1327, 772, -1264, -374, -625, 199, -448, -688, -2487, -1842, -1203, -644, -2036]
1593b036J074J932j16L87r71J278j39J154r18j504J40J781k317j163M9L29K21
1610h19n90n0l26O33J617l39j083J198J391p52j272R21J091m39m31L41j689j18
1628g16Q93J11j564o8M96J61p36R99L10k80m8N52k3m6J468r6j080m2J074q99Q32
1649A298j57p01p94K63k3j224J45L99J16q10J463M95j17J71R39o70j045M19J064
1668A231l10n57O90n55o82k20k31p80j72L53l40O28K67J77o59J420P67m77j17
1687D33L59J060j372J225q14m62l58N6n08k42l4k41m8j257N69J201q64J392K21
1706C16m56M71K08m0q6M75J029j231j385P88O02k60j097L64q91L10M30j183l04
1725a940Q45J230n95j84R89Q81K52n65K54k98P86l48o54j447Q53J61r01l0p55
$$ y = [-2036, -962, 970, 854, 1241, 270, 1548, 1409, 2563, 1645, 141, 281, 2062, -255, -1418, -1369, -1040, -819, -1409, -1459, -1785, -1152, 465, 126, -957, 241, 1632, 880, -392, 529, 1620, 1181, 750, 1091, -598, -716, 177, 288, -1276, -1344, -848, -687, -1423, -424, -114, -394, -442, 110, 87, 41, 1509, 1413, 333, 291, 1365, 466, 1298, 1141, 440, -354, -91, -114, -1338, -1193, -794, -678, -1488, -25, 470, 353, 524, 1463, 793, -252, 167, 1231, 921, 364, 1054, 499, -183, -403, -634, -1414, -1586, -1233, -1573, -945, -678, -501, -1160, 260, 1027, 550, 433, 792, 1852, 480, 1705, 891, 429, 71, 127, -381, -623, -657, -898, -946, -2203, -1634, -433, -1297, 95, 316, -140, 331, 539, 499, 413, 888, 1917, 686, -699, 89, 691, 431, -666, -302, -1193, -883, -453, -1636, -1940, -1095, 135, -460, -644, 345, 1226, 1478, 913, 1167, 869, 1655, 1307, 653, -794, 59, 220, -681, -711, -1466]
1744a466P51l79N86j05j177J114J354n58k24M72Q00k15j94R3o41J13P54j094j336
1763a352N74J402j491q2P05j182o4Q04p4K93K93J199l84o08P76J414p33m70o53
1782C67j02j18l56n32q80R9Q99K57k61n58J337k97M79m11r97J399M94n09l27L96
1802C79K186r02n41j036l2j0o2k52j236k13J554K59j619N22Q83J140j019O49Q6
1821G36j91N05j37k46l52P61M05j668k61O7N15m75n94l52R1J106l40k96l43J704
1841F35Q54q84k77R92J48K03r40n84m49Q48l04O2j973J453n58q09R15k17rJ209
1861C15m5m69k8K00J325r25N7L95O32o04o08o1J89m5o17j105L84R17n60K49p9
1882d83K32N92o6j53L64l46J420j059R9K17j55O56q99m72k41Q69q58q5j299O00
$$ y = [-1466, -715, -1094, -508, -613, -1790, -676, 678, 120, -104, 368, 1168, 953, 759, 852, 211, 324, 1078, -16, -1352, -778, 624, -867, -949, -244, -1426, -1490, -686, -760, -467, -174, 1025, 641, 33, 809, 2223, 1490, 1020, 367, 265, 147, -209, -741, -1621, -1522, -623, -366, -627, -1185, 152, -145, 334, -77, -1074, 325, 819, 310, -17, 379, 2565, 1663, 1122, 86, 54, 44, -18, -270, -1506, -1719, -165, 94, -1525, -1003, -120, 1020, 1, 650, 736, 545, 1050, 913, 667, 315, 1076, 1481, -187, -448, -381, 134, -341, -935, -1287, -1196, -90, -430, -726, -1069, 635, 1489, 605, 328, 1320, 1468, 1671, 731, 147, -302, 546, 242, 304, -1669, -216, -774, -1583, -668, -885, -894, 315, 270, -199, -227, -27, 1298, 373, 430, 825, 1457, 853, 245, 184, 373, 328, -289, -1394, -1010, -93, -653, -404, -483, -251, 341, 275, 122, 486, 140, 1560, 501, 600, 817, 662, 1318, 419, -53, -294, 575, -283, -368, -1667, -1067]
1902a067m35Q41o11k73J856j51J047p83M52p15Q12kj3q32R34o80j331R34j87m37
1922f41r24O09J45n57M65J058p70M62M51p13L5J195L24j187P48Q18j487k8o47
1941f44K53l14J83K39M38n83j5R5j096O03J103m65k87J490n80L23M51M9n93m73
1961A77J021n78j294l73M73l38O05K59j063O05M94o34j36o4J605P78n91l12N08
1980A142m97k29N47j292L24j09J137j789J03j21K55j68M85o61L61M80K83k7j3
1999B11M86P87j134l51r9J561q46M19j824N16m01R1o5n28L30O96q45O74J25j5
2019b12O47k72n9j13K17R20m58p31J69j98Q34j474K77r3N89l36k00r63Q22J529
2039H95j469L43R96o00R11l30m04O60p14Q36q1j419J151k33j103M87j118R07p39
$$ y = [-1067, -1502, -661, -1272, -1545, 311, 160, 1207, 424, 876, 161, 973, 971, 958, 126, 1060, 380, -951, -17, -204, -641, -1565, -956, -811, -1368, -903, 155, -615, -153, 298, -415, -380, 815, 1139, -48, 700, 1518, 31, 3, -644, -391, -705, -522, -283, 155, -428, -443, -348, -1444, -841, 262, -203, -490, 1000, 420, 743, 1194, 1243, 650, 177, 1198, 620, -674, -1047, -574, -912, -307, -48, -1111, -506, -12, -646, -782, -846, 759, 1537, 946, 634, 1142, 645, 416, 963, -329, -5, -114, 1023, -766, -663, -784, -529, -697, -212, -873, -512, -32, 251, 224, 211, 697, 1484, 350, -1, -100, 1461, 615, 1034, -790, -274, -675, -584, -649, -1177, -847, -151, -996, -322, -197, -212, 435, 163, 104, -9, 208, 1128, 670, -61, 108, -90, 744, -730, -453, -546, 43, -293, -493, -1456, -634, 895, -574, -231, 765, 165, 1076, 746, 342, 1002, 288, 1124, 1043, -376, 775, 542, -561, -74, -1192, -285, -1024]
2058a024Q01j165l2J022N47P9p45J465o84O71j14o54L84k21M10q33m82l22N49
2077c48N23p63k39P45l26L69m10R5L71O50n82o94J340M15N99j572k59P63j343
2096f66Q98k47o06l12J114p36j063L10J034L45o08P92q92P61R88q01K22p16J762
2115A579k35j375k27K08J169j244l43p72L61J025r03j179R30J045O4l07m67J086
2133D15O1J96K75j029O39J82J34q79m96J18l03J73R0n47K82J033o86J7k44J094
2153E25l31k48M22J66jj89M15j690J142J24L43j039k75O43k4q93j48K28M0P70
2173b0L30m76m06J305L28r00L21J82K17J29q08L40q26j48P05j024j35K72j49O55
2193a08j134J087N33l28L37m30K02L63m32J199r27P79q21l24R91p85L50p64l54
$$ y = [-1024, -223, -1388, -1420, -398, 149, 228, -517, 948, 264, 935, 821, 167, 551, 330, 740, -93, -575, -897, -348, 175, -588, -827, -82, -408, -39, -449, -354, 17, 667, 85, -609, 731, 1146, 1745, 173, -86, 677, -666, 232, -15, -621, -933, 181, -555, -1618, -1308, -274, 71, -537, 255, -637, 124, 1112, 311, 533, -183, 1579, 1344, -31, -258, -50, 1119, -125, -468, -1240, -879, 146, -757, -1936, -1006, 39, 103, -204, -671, 415, 476, 672, 947, -82, 557, 739, 873, -6, -502, -384, -687, -514, -424, -971, -689, 344, -342, -325, -569, 525, 194, -54, 368, 534, 533, 344, 759, -931, 211, 335, 678, -361, -636, 7, -17, -910, -1058, -830, -790, -20, 310, -166, -572, 733, 1061, 161, 482, 664, 881, 1010, 202, 542, -284, -432, 273, -751, -886, -614, -763, -108, -1242, -155, 378, 50, 387, -43, 159, 522, 90, 1289, 362, 1141, 320, -4, 987, 202, 552, -212, -566]
2212e66k19J58K04Q8N5q37J296m20M76n55J023j29j02O54j2j979N84P76j681P89
2232c97M55m18m41J28K22P24j37J79o30L6J13J030m11L85m35P73o81K50l81q71
2252e07L66l30j21k83J78o23J31L30J080o52l55R71p0K16j172J229k6K43n4Q65
2272A416j571M45M64m50m90p83J00Q34n92L95o57P77J24M46r45M96N0O79k94K07
2292F51J10q55Q17j25r15k26L19Pm09r3j8M7L63J74m96O50J044n98k16o76P72
2313C27L42J047j194k3k02P4n86l55O15m09L83p53N12l13L24k39R11j076p5J440
2333G50k7n8q08p7P66k3q54R26K24j72n74q75L69K34l04o26K44O47L05O50j206
2354d89j0N27L40Q9q83K96J254m01n16P1r79J234l72k57n70N27l99N13m95k4P16
$$ y = [-566, -785, -627, -423, -335, -280, -1117, 179, -241, 235, -320, 703, 574, 472, 1126, 1114, -865, -281, 495, -1186, -397, 58, -360, -801, -673, -451, 273, 136, 315, -315, -279, -166, 864, 453, 838, 403, 1176, 495, 745, 364, -507, -141, -471, -592, -875, -697, -1320, -1189, -859, 221, -431, -786, 185, 115, 331, -841, 388, 362, 605, 551, 1416, -155, 290, 754, 304, -186, -969, -869, -35, -627, -232, -889, -112, 12, 458, -487, 9, 59, 738, 444, 651, 761, -94, 723, 598, -317, -543, -224, -217, -626, -719, -737, -690, -327, -153, -649, 1, 1045, 447, 231, -445, 327, 669, 1716, 522, 499, 297, 371, -215, -570, 45, -364, 19, -734, -222, -535, -211, -450, 461, -615, -690, 750, 723, 665, -143, -220, 546, 523, -331, 595, 819, 647, 73, -802, -433, -199, -503, -1129, -885, -238, 67, 717, -489, -499, 28, 368, 457, -426, -130, 1124, 723, 207, 278, -701, 533, 161, -96, -666, -139, -538, -25, -520, -544, 172]
2375A72J91k97o79R58Q11j68j016K30O1N15K23j612J65L34O61r93m04J18J06n8
2395f82P1Q4m00J254M66j64r74M96J159L8j157O2l47J49k6n60j68M19N97q78P30
2416A69k18m59J357j550Q87o00P74n02N64m26J203j88J05r36J65q20l25O45n86
2435g41mM16O74j061k29p3R74O90J31r55N97q6j91%k3K37N50j54o71J17q2m26
2457c10Q27m31j228N44K41k25j96P46K4R22r26J67N88L60k71o12k64M14m90K16
2477I6k0l83K79j06p00M36o44P98M59l74L60m69J348o14l01Q0N77N9o76l31Q04
2498F78j674n5J567p36p15r0L02Q71L65k86r48J004J21o64J04M84n60O45p34J99
2518a22O68kj241R16m85N37N0n37q31R40m82k24P35O1R4M36r30N01J312k30k83
$$ y = [172, 363, 66, -613, 345, 1156, 988, -28, 202, 263, 778, 1001, -611, -446, -112, 549, -444, -848, -730, -624, -682, -611, -527, -927, 327, 793, 629, -345, 151, 1310, 1348, 191, 253, -94, 55, 29, -531, -699, -280, 317, -561, 169, -49, -508, 849, -701, 186, -414, 360, -142, 422, -4, 1199, 1011, 1116, 180, 345, -475, -800, -155, -741, -745, -329, 345, -716, -945, -1018, -44, 646, 777, -178, 419, 333, 142, 142, 119, 356, 906, 752, 81, 198, 116, -310, 517, 86, -1142, -598, -357, -582, -778, -32, -8, 914, -12, 155, 743, 1103, 832, 220, -44, 370, -120, 96, 76, -307, -28, -134, -834, -398, -1042, -244, 215, -159, 201, -268, 1080, 466, 165, 245, 822, 881, 205, -126, 678, -996, -1051, 516, -220, -935, -1025, -723, 148, 513, 227, -721, 283, 404, -260, -156, 328, -232, 413, -321, -122, 546, 544, -697, 219, -266, 271, 321, -216, -1047, -107, -589, -813, -78, -17, 77, 513, -417, 84, 1396, 1166, 883]
2539H83j330J148k12k34n09p33L39QK61O36p80LO74j95L45r04J200j95l69N10
2559E46L44o28M89j020M04K41o11Q12j011J99n63M04K53J79L68k47L68J82p26
2578a7m83Q07J48l50k14O57j021J378j280J05P7j10J33l18J05P33j226J244p30
2597c62J37r5M39l89K60O70k51K35m60L74m39p50R07k69q21k76P48K81k27L6R9
2618a53j36l28O08k97P99l52o4o9M70k56M72m29k92J05o3n18P43j32q92N31j25
2639c78P7J09l90l7N61Q32k38o84MQ38j52n37K05o23Q72j331M17N02m21J17k79
2660e36j09k94P43k3QN76M4l78Q0J43O26r72R04j27q87j09K59j59K31n20m58J74
2682g84O58nJ69l49r0J238q89k08P42l85N97r77J732q35m05m41j49P67o00M63
$$ y = [883, -447, 701, 489, 255, -254, -987, -648, -640, -379, 257, -523, -520, 154, -41, 304, -600, 600, 405, 36, 546, 890, 262, 751, -269, 135, 376, -235, 577, -434, -235, -798, -394, -141, 38, 406, 159, 527, 709, -17, -500, 307, 455, 105, -109, 548, -473, 905, -375, -270, -193, -303, -170, -488, -383, 350, -876, 368, -362, -225, -320, 119, -270, -10, 660, 409, 644, 184, 558, 119, -631, 276, 7, -814, -1090, -342, -61, -288, -252, -153, -289, -617, -9, -306, 493, 141, 77, 8, 478, 222, 694, 265, -27, 78, 15, -503, 240, 108, -784, -253, -378, -301, -192, -582, -619, -58, 774, 536, -148, -144, 694, 542, 5, 210, -413, 459, -872, -455, 47, -374, -257, -536, -645, -939, -196, -219, -211, 365, 409, 31, 111, 254, 880, -92, 812, 685, -202, -311, -52, -211, 20, -500, -958, -784, -126, -131, 38, -311, -401, 837, -52, -260, 482, 97, 694, -283, 1449, 614, 209, -232, -381, 386, -214, 249]
2702B49L94j180j17j7L60M49q75K88N84l26O60m56k17J477q03K62l99J81o99K62
2722G7j13K49n61M54j0m32J62O85j087O06L42p75k4R56o99O57m10M66r71J092
2742F64j151K94L42l10n73O19q7k30O1K6J42o88N8O57K7K22N55r4r5n54K93m20
2764b42O10J077j205k39l93q5L0J41M51n61O52m03N52q42R83k28K71p2o2M43q59
2785A9K06k13J77n15j07K61Q7N7p62N28K47k18l77R02K94r46J337j19m88q90J146
2806F26o46r7lk20q1L34p46L67R6P16r00J20P13l31J85l35M53j93J66n1l12P17
2828E78p95R53q01k39N88o5o18j01Q30p91J87R06o72q33M8J114j087Q41J26o54
2848d85N21J69K7o0N82q05q5j48Q51j39q04R6n61O42l4q5P44j067O54Q23q34M89
$$ y = [249, 643, -537, -654, -671, -311, 138, -737, -449, 135, -191, 469, 13, -204, 1273, 470, 732, 333, 514, -185, 77, -36, 213, -348, 106, 96, -336, -174, 511, -576, 30, 372, -403, -427, 529, -170, 487, 77, 543, -428, 664, -487, -193, 149, -161, -734, -115, -202, -432, -371, -345, -203, -891, -833, -176, -149, 73, 628, 534, 439, -115, 178, -242, 368, 1445, 240, 1, -392, -477, -447, -306, 145, -416, 236, -167, 385, -457, 526, 298, 569, 497, 435, 878, 19, 225, 12, 189, -326, -433, -172, -85, -28, -790, -262, -15, -233, -610, 292, 586, -360, 977, 858, 370, -520, 626, -20, -117, -120, -340, -421, -87, -833, -466, -370, 346, -554, -434, 279, -52, 133, -202, 251, 58, 224, 173, -139, 578, -217, 736, -65, -304, 284, 219, -399, -500, 330, -461, -274, 632, -40, -873, -825, 289, -798, 43, 169, -485, 36, 205, 232, 172, 754, -51, -136, -284, 567, 428, -376, -280, -841, -199, -233, -318, 426, -641, 13, 836, 2, 491]
2870D91o50M97o00M41j58J88n50L82l30l96N80p11L11J06l07L22K33l7K89O75
2890G76l15R2n04j04L21J33J34n63Q52q66m21Q30m25m41O02k94N29q56J82Q25
2910D87m65O5j12k54K10n87J121m93K53J76r04P23m20j9p1K5r9p1J9J58o24Q07
2932g5K03N69Ro62l17R13J52m45J80m05j75r4j25J09l46R69r56j98K67L59k78
2953c46l7o5L52K44N68m22J53K88l40m50j1K55L20r21Q9P4p2K40o90J89R30j74
2975A74k02M18p74j69J021o54L81K28L17j338J377m51Q1n06j55p40P62Q28j435
2994h37R25n32L3K75L47l55M08p60L70L43J88l02K52p51K68M43l44l60L8K40L70
3015B59o73l40Q97o80R25j037Q05p98J108q49R73m97M82Q23r82k26J15k48o11
$$ y = [491, -159, 338, -262, 179, 21, 209, -341, 41, -289, -685, -105, -816, -505, -399, -706, -384, -151, -188, 101, 776, 461, 553, 49, -55, 266, 399, 533, -30, 822, -44, -465, 365, -60, -501, 101, -193, 336, -520, -338, 487, 22, 87, -25, -279, -69, -656, 465, -28, 225, 401, -503, 220, -200, -219, -290, -265, -364, -435, -416, -258, -882, -75, 128, 697, 706, 44, -273, 640, 792, 347, 527, 122, -53, -147, -272, -163, -509, 460, -496, -694, -427, -68, -346, -383, -448, -96, 148, 716, 294, 447, 735, 395, -55, -66, 189, 509, -412, -323, -249, -321, -81, -771, -582, 348, 174, -28, 390, -384, -553, 468, -186, 195, 423, 740, -598, 779, 328, 409, -97, -252, -992, -230, 598, -837, 88, -444, -411, -136, 211, -144, 264, -496, -126, 217, 405, 103, 355, -396, -128, 315, -29, -389, -351, -111, 259, -414, -754, 143, -537, 388, -649, 156, -642, 466, -383, 590, 93, 575, 1398, 416, 190, 305, 57, -554]
3034e54R72K62m60o13M95m56k89O39j64l98M16O89o96J09m59J491r09M48k10k57
3054E6L11n43O66m90j22J70j81j42m48K44J09J70O08o46j05N77l8O59j36j9o25
3075G5n25M30K35n73L89J074j437p4K37K05J05j84p34P85L2l76L68M57p56J067
3095H00p59L97n18m58Q78o91J58j80m25J01P75l84J07rL85o98P67m80O94j70n57
3116b67l55Q42M38j221L86N67p82J40L38m46N32n42j52J102j467N97K96j58j53
3135c05M20l54n30N17N9K61p9J052q30j45M67p40J84RL67k10j31p7k91R5k52L61
3157a52P6O42j014N23l31M98M68l84j8p71Q66rl18j62n41J89L0j49PK63PL5M52
3180B07m4l52L11P3P61q63QPm80N05k27j50J24L62j42P5k56L56m65n3Q63l24J34
$$ y = [-554, 418, 680, 220, -393, 102, -354, -643, -4, -168, -566, -150, 539, -157, -48, -507, 984, 75, 523, 313, 56, 367, -176, 490, 0, -122, 48, -133, -275, -723, -479, -370, -200, 408, -238, -343, 234, 196, 855, 719, 700, 75, -450, -20, 215, -358, 31, 1105, -332, -406, -169, 36, 141, -43, -777, 8, 40, -336, 32, 489, -267, 800, 41, 438, -80, -538, 340, -351, -193, -373, -798, -697, 78, -306, -199, -208, 177, -521, 246, -234, 460, 290, -267, -622, 220, 658, -563, -177, 390, -392, -252, 86, -360, 172, -370, -522, 580, -887, -290, 6, -152, -305, 115, -239, -769, -252, -193, 68, -11, 1041, 211, 66, 533, -207, -23, -14, 353, 143, 12, -65, -356, -261, -513, -152, -76, 566, -448, 75, -256, 242, 710, 326, 308, -463, 403, 394, 76, -86, -627, -438, -408, -557, -550, -287, -280, -245, 207, 163, -189, 122, 195, 956, 93, 101, 108, -372, 133, -94, -244, -120, 242, 100, 175, -81, 275, -190, -243, 620, 296, 430]
3203D30P1p44JJ3L20j83J138o36o20L99J40l03k16J35j21L55r72P38j73N9j57
3224c26M36R33j804Q82M49L5M03o91n97k94k17O91Q00j022L9j25L24l8q5K31L80
3245D04m29K5L1N82k31o4l40N01l46p9l16Q3K7J02l11M76j11n77Q6M77Q3m15J187
3268H45j016P74m68K06n30j74Q57l00j06J91m23M65J01j49l10O6M8n77J071q74
3288c03Q7P39r0r14R56n11N16K68j155l38J551o37n35K06M60m5L39j120J78ON23
3309A81K42o27P8j4j69L72K68o44J11O69J8m71L38j20r69O73R0l53K87m38J53
3330c25j68L16n75J115P1m95L71O0o87k63J256n32L60m83n05L23P2l11K74o4j52
3351c42M7K13P6M48j128J080q13m5JP11K72j203P33rl65O74J28O2n50O45q40J42
$$ y = [430, 501, -243, -242, -229, 91, -92, 1046, 410, -210, 189, 329, 26, -190, -55, -176, 179, -793, -55, -228, -169, -326, 110, 1043, -761, 121, 570, 605, 1008, 317, -280, -574, -791, -100, 700, -322, -283, -408, -84, -122, -207, 24, 404, -25, 0, 31, 613, 382, 318, -22, 479, 133, 54, -262, -179, -152, -50, -361, 115, 4, -573, -487, -10, 73, -342, 845, -171, 603, 135, 341, -189, -363, 494, 194, 88, 279, -144, 321, 422, 273, -37, 29, 77, -500, 571, -303, -216, 523, 433, -481, 475, -36, 480, 748, -407, -745, 806, 169, -366, -160, 300, 255, 594, -526, -348, -342, 181, 423, -204, -126, -140, -309, 63, 331, -313, -202, 467, 485, 14, 352, 232, -737, -64, 26, -327, -40, -478, -325, -493, -177, -752, 363, 434, -61, 310, 370, -317, -580, 676, 144, 504, 21, -484, -161, -89, -400, -126, -190, -342, -295, -82, -6, 442, -686, 394, -419, -464, -463, 248, 520, -683, 50, 41, -324, 350, 478, 540, -10, 635, -205, -63]
3373f3K29n94p1m45O94J014o17j050P95o53J155L29m58P4r61R77n41K40j96J86
3393D4N2j93N4N14j202K79O85j197Q1N53O55m56L55k63N90o43J23m9N19K06k27
3414D80n56j06l86N59k18kJ12qr7L03n63J03O17j74Q12N3n30k06o8Q0M9q8Q6K35
3438D87J36j106l51N96L72M71l44l49M47K46l28l15m28L66n60J142j50m74J031
3457H89k77p84M85n21m40J194r75kK46k6K90L17p28O21m83N32m53M78p86J208
3477G85p78N26n04J52l97J41M8p17J342o59l55R89k93j35j56m90k75R24L12p67
3497c07O32l67N95m68o10k86J015o16j07N4L0j22M94J44o87O12L91l86m5O9K36
3518B71j07m20O04o65j74J72L38n8J8K32n5j36k28m82P39k31L33Jj88N2Q69j270
$$ y = [-63, 166, -428, -499, -944, -250, 764, 147, -903, -108, -761, 394, 723, 265, 339, -622, 355, -186, 54, -142, 44, 96, -97, -43, 471, -731, -452, 233, -964, -883, -330, 325, -131, 224, -39, 551, -92, 31, -18, 501, 707, 480, -76, -182, -568, -9, -227, -229, -117, -125, -222, 81, -482, -379, 238, 64, 876, 929, 399, 193, 125, 205, 254, 166, 252, 487, 623, -483, -834, -238, 134, 605, 261, -88, 359, 605, 277, -38, -466, -100, -660, 482, 332, -142, 889, 612, -172, 313, -208, -648, 546, -429, -431, -185, -211, 79, 396, -332, 289, -194, 338, -115, 363, -423, 785, 7, 533, 29, 181, -216, -75, -27, -744, 598, -61, -416, 573, 280, 145, -11, -501, -776, 148, 460, -307, 325, -42, 553, 85, -525, -811, 204, -412, -519, -465, -435, -557, -63, 81, -606, 6, 397, 11, -34, 35, 271, 164, -256, 348, -317, -491, -319, 19, -39, -21, 211, 156, 20, -208, -690, 49, -182, 151, 152, -36, 16, 885, -385]
3540c85l83M99L12k69M18J49q46L81J91k80K95j55l93M24o4o18O46M43o41o25
3560i01Q10k23L8L2Q20k93j21j76n8L94p65N39l57p7Q37q54Q69l96J14j19J80
3581B93m65K23K42j19M6k08J33k02K82O79o40j52Q6j123J89P11k23l96M06J86
3601e2J87j28j05j45O3PQ07o22o13Q89J81qK67r37O3l47L19j6J1L59p44K49l60
3624f75J10J269l00m55O48m64l11r0M93m17J76K57o41L44M2Ll8l39Q1m89J422
3645F26o77n7K07O60p06o5K61n3Q3Lm54J138j224O31p06L32J08j27l81N52l89
3666b38j64O17k73j10q72Q53l55P06r2J93r21P45J7M68j00j3j65N8l47j13l18
3687d24k37N99j72K73q20J560o93n09R3M54J36m58J50K57J88j52K60p62j90J75
$$ y = [-385, -768, -269, 43, -226, 192, 341, -505, -124, 67, -213, 82, -73, -466, -42, -106, -724, -78, 365, -276, -901, -91, -314, -276, -244, 576, 283, 162, -14, -72, 322, -443, 96, -261, -338, 499, -355, 514, 118, 232, 113, 293, -172, 51, 293, 174, 220, 12, 145, -57, 225, 904, 264, 112, 198, -925, -736, -25, -248, -644, -238, -52, 135, 7, -98, -243, -180, -173, 634, 12, -601, 288, 469, 461, 728, -209, -146, -493, -174, -190, -179, 180, -564, -315, -675, -565, 704, 404, -51, 597, 133, -178, -268, 225, -192, -16, 241, -400, -56, -14, -11, -49, -388, -307, -796, 626, -51, -108, 99, 759, 53, -12, 249, 196, 279, 282, -172, 966, -258, 373, -333, -1, 107, -20, -401, 151, -238, -402, 215, -58, -168, -1040, -187, -542, 164, 72, 265, -656, 89, 106, 574, 474, 461, 296, 354, 7, -106, -424, -661, -62, -234, 39, -781, 779, 86, -423, -330, 124, 260, -198, -48, 209, 397, 245, 505, -257, -447, -272]
3707b72L04j70L70r61M76n77Q80o8O38m48J91o50J70m0M80n0o12L75N7N86j09
3728E70k83l71r16R77j58K15j19l97O44Q9K98pl20n45k90M26m00Q09r7J42p14
3749d47J81Q65o70K98p86M16m02k5N87j29L29K98j85q17K43J09O46j20M67n31
3769C27l41M49K80n40m32K06ll22J40P87k17m24k11M48K01l55N48r93J41N06n74
3790c79O19P27r4j64l14l37k1K01O9K82P2n98l49N37n42k03L66q64J117j249J958
3811H34j362M86p21J161o24J21L47p30L58l38L22j52M28K21N9j054P95l10L63
3830B04L50m74O24p0l83m22K51M11j96k02N3J25r9N3o49O27l75K27K46J50m81
3851c0M17l83N03p96M66K12k0l58P1l48M01l66P72q68Q85q63J85o5K87q44K82
$$ y = [-272, 32, -138, 232, -729, -253, -830, 50, -18, 620, 172, 363, -287, -117, -157, 323, 273, -339, 36, 93, 679, 570, 287, -84, -1000, -23, -181, 34, -85, -482, 162, 251, 549, 542, 222, -323, -613, -187, -587, 222, 125, 267, -447, -266, 599, -71, 227, -559, -143, -545, -570, 17, -112, 217, 515, 330, -487, -244, -135, 511, 391, 858, 327, -14, 435, 715, 175, -257, -51, -54, -376, -236, 551, 334, -90, -301, 147, 348, -7, 541, -452, -311, 195, -379, 240, 967, 873, 709, 395, 58, 37, 238, 307, 589, 661, 63, -286, 251, -291, -494, -128, -992, 125, -1124, 834, -528, -42, -763, 398, -226, -105, 242, -488, -130, -468, -146, -298, 130, 351, 410, -644, 151, -159, 204, 554, 80, 704, 634, 251, -171, 80, 491, 295, 93, 146, 271, 172, 225, -424, 203, -172, 55, 301, 451, -30, 387, 4, 507, -289, 177, 389, 369, 11, 82, -266, 135, -231, 541, -327, 558, -305, -120, -185, 102, -742, -460]
3872d60M37K66RP06r75k77r3N08j22j33N70p73O59p22L85m75O55m30r95J243J41
3893A24n27J54N64m77J97N65l40N2m46Q70n65r0r59J64K55M06n37J01L5K09P83
3914E38r29M1N71j8O6p54R20j89p7R74j435M74J81m82L68l37J78K21o02K44k22
3935b69M67j97l8n1k38j61Q89n10J039p51M7K30j66Q0r03P19l65O56j131P71J27
3956B45m92N38j77M90m75n1J13M7l48L02p08P94l31q60J351j265O26j14K49n65
3976f31P19m16J179j101Qk42O01k1r61P49n66R23m44L02J21J57n05n06J57K30
3996b47O55m37K15l58L63m25L12n47j87R81m12K60l18Op79J226J56l50m27p7Q56
4017D66m04k47O90J79n58N11p54j45j69O12j77j27J513j453l74J007o46J45j59
$$ y = [-460, -23, 243, 252, 958, -17, -294, -387, 121, -1, -134, 436, -337, 322, -400, -15, -490, 165, -265, -1260, -17, 124, -403, -249, 315, -162, 35, 600, 260, 312, -134, 736, 171, 81, -878, -714, -459, -53, -590, -489, -454, -245, 538, -391, -350, 221, 203, 269, -485, 435, 246, 169, 1143, -292, 182, 363, -119, 249, -88, 90, 311, -291, -47, -269, 198, 1, -37, -88, -326, -487, 402, -108, 931, 180, 227, 457, 291, 371, -532, 187, -178, 478, -653, 118, 245, -247, 291, 114, 604, 129, 78, 191, 238, -110, 192, -516, 278, -53, -913, 438, -827, -201, -315, -66, -631, 88, -328, 851, -250, -242, -484, 117, 96, -865, -116, -682, 241, -203, 99, 220, 377, -128, -634, -477, -247, 408, -29, 186, -172, 191, -234, 78, -469, -656, 325, -87, 173, -145, -139, -918, 308, 464, 114, -313, -390, 466, 62, -185, 505, 684, 126, 637, -117, -262, -431, 181, 4, -123, 1390, -63, -437, 570, -76, 69, -90]
4036i0o02P77J4m42O68k96j03l86q3L36J87m20L67L08n27N31j0q21O45J48J04
4057C05j0J43j027J28K70Q11j502J035K0Q5m46O19J18p32J38k35P29r0L22j8n82
4078H1k35N40K12m38l35l97J69J43j52L71M82p21L43j79L97o21M16r8m20J167
4098G25l94K88n30L61p64R51k73k05p46M27K97k42L95m53L59q94P44l98k15O25
4118E8P01j713J156N59k55o53K86j74RN52j123O28J09k10k43Q13l83l81J89L33
4138B58l53J88p5l75L75j03j83P18jn42L88n98O01LJ58j68r7j50l45J52J35p82
4160g96J185P9n06R8P27n49k48q79J487j038J481p67j32k13j40Q45p93L5j89J93
4180a20L68k54p99R08J5j91j13N00J98p78K28J13q19J437m42r96Q11J57r7j108
$$ y = [-90, -692, 85, 99, -343, 325, 29, -74, -460, -543, -207, -20, -440, -73, 235, -292, 239, 229, -592, 53, 201, 305, 295, 438, -589, -461, -191, 620, -882, 153, 173, 258, -188, 431, 549, -183, -45, -280, 449, 359, 681, 663, 81, -154, 386, 598, 160, -175, -572, -403, -260, -412, -41, 441, -280, 63, -116, 281, -340, 76, -22, -442, 725, 331, 619, 89, 450, -314, 637, 364, 159, -587, -160, 137, -105, 290, -163, 196, -698, 46, -352, -567, 58, 759, -954, 202, 761, 506, -147, 139, -35, -26, 526, -597, 31, 140, -70, -313, 500, 117, -264, -75, 258, -95, 93, 18, -357, 18, -85, -268, 450, 449, -93, 295, -303, 298, 301, 459, 291, 194, 44, -301, -149, -14, -796, 389, 468, -38, 60, 787, 238, -10, -889, 598, -440, 1041, 274, 142, -71, -211, 634, -159, -124, -313, -120, 248, -6, -805, 103, 118, -73, -186, 314, 512, -266, -38, 75, -744, 693, 251, -745, 66, 223, 126, -982]
4200i82P06P51m13L3j26p0q14L89N72l39O84m39n9N25m36L41k34O12j21J0r4m36
4222F0o36L74J42p73J347j070m07J177n15R24j31j04l90M18m28N10j46j14J92
4241D30m32k50M48J82m36m83L85J68j37L60N7j43q8M47k34O8o74M47m98Q14n19
4262h8j57L90L1J72q5n17O96j57o62P15m67J19n26N55k44k96R14j31j07m90L46
4283A1n7k08J15o3O07q25K35N0K07q8jm8P8n23L46O78p31J64L99m43L51m03J14
4306c5k07K17L90j238Q37N72m19N43N0j220j26O91P3l57Qj25N82K50m91K33O5
4327B93M53j026M19j40J48l70l13P92m89J2J76O5L89r02K6m31R22j56O79J44n02
4348A89p5j76J10M6k87O33j41n62P04r43K02J51O70n81o51O71l2l26J239m36j22
$$ y = [-982, -276, 475, 62, 95, -31, -101, -915, -526, 46, -293, 391, -48, -107, 418, -18, 323, 89, 701, 580, 590, 496, 60, -576, -202, -60, -833, 514, -556, -963, 214, -301, 623, 492, 388, -2, 416, -12, 498, 352, 238, 430, -2, -252, 196, 378, -58, -541, -156, 12, -125, 235, 292, 149, 61, 508, 274, 342, -332, 115, -383, 431, -88, -245, 145, 176, 348, 263, -254, 442, 285, -377, 338, -129, -10, -536, 19, -225, -521, 393, 262, 155, -335, 11, -46, -254, -139, -202, 405, -420, -185, -135, 72, -16, -17, -65, 13, -510, -164, 514, -217, -53, 346, -97, 254, -149, -35, -242, -25, 365, -873, -36, 536, 117, 660, 710, -510, -636, 55, 128, -229, -221, -346, 236, 486, -5, 228, 293, 746, -280, 139, -1, 147, -223, -536, 256, -233, -221, -45, 20, 409, -493, -467, -898, 24, -132, 547, 691, 189, 114, -62, 48, 94, -193, 440, 299, -263, 441, -502, -300, -149, 521, -60, -711, -40, -72, -398, 841, 405, 283]
4369B83p07Q01K1p40O54N18m34m09L2J72M34j023k51J200Q2O3q90l37L9P80l50
4390f2j03J095o24J27m74L45K12L3l72j40no01K32J013j796J706p46K73n62n8
4410e07N39p61N08M19J58L42m0o68n29J058p42m3O16l36L65o49l18P40J21O59
4430I32m48k5l29q88P08N17m85r1K48j52k73M37l17M2j21R89n61k19j63k32Q01
4451C70n70qQ37n94J29m08p20J180o69R06n84J42m97R85J18r53l41J108K36j077
4471d10J285n20n90J123j059j28L91J95J80o84l60N52K79M83r77j65M20J85P54
4490I54j80r28N15m76N51r59M12K91n42O94l91K91n26J4j02L7N45o7l7n2j005
4511i61P83k3j98Q34q36P19j225J263p49N86n77K50j52N03l1p22P94K36q42j77
$$ y = [283, -424, 377, 398, -342, 312, 830, 396, -13, 19, 191, 625, -398, -649, 551, 633, 696, -194, -531, -492, 288, -62, -165, 930, 306, 433, -41, 304, 516, 549, 177, 37, 32, -569, -337, 676, -1120, 586, -160, 113, -449, -507, 32, -729, -221, 198, 356, 698, 658, -10, -539, 519, -223, -266, 350, 14, 379, -270, -588, 152, 273, 932, 484, 459, 130, -758, -50, 467, -18, -109, 139, -13, -286, 151, -166, -124, -245, 744, 183, -36, -199, -431, 370, -200, -208, 629, 35, 164, -244, -964, 216, -453, 453, -131, 11, -486, 499, 617, -336, -677, 431, 667, -410, 875, 355, -235, 888, -171, -299, 92, 287, 467, -217, -577, -25, 254, 737, -240, -405, 15, 200, 954, 774, -154, 361, -115, 436, -523, -111, 180, -362, 332, -59, 232, -294, -280, -382, -345, 200, 133, 96, 44, -961, -178, -201, -399, 435, -401, 318, -907, 356, -393, 193, -384, -134, -286, 217, 186, -536, 258, 494, -348, -525]
4531e25P82N64n71j07p63O82M7N9q36J206p30k04O55l4r0o11P49k38L89n81J45
4552a2l28L07O83p05J71l63J95n19N79J34m57L32L23o55P59m95J29m7K59p77O78
4573A91L83j087P81m9n47m3%K01n43N30L9L18J4o95O59q22k74J071q5k88j39M64
4595G9J42l19O55j319N04P38P2m27p31J224j041M66J45J67n09j01l0o97P52k81
4615e11J126r1l33n26J322o24j02n06L83k78M54l41O24k73m09M89m91oK54l04
4635a43P22j07m46J3l51N72k62J41K90M49j073L20M33o60L05P5p63P84k83J72
4655A88k30K74l11m83K27R16K6n73K5m61L17L06P68j186M59J64o55J035r31j88
4675c13p6J450r34L56p17K8L1J3k6J39k28M50p01J72R95r21Rl90O85n68J417j176
$$ y = [-525, 257, 821, 250, 143, -620, 62, 109, 168, -668, 538, -192, -396, 259, 225, 135, -476, 273, 35, 424, -157, -12, -340, -33, 650, -55, 116, -247, -52, -571, 8, 142, -315, 17, 340, -315, 444, -51, 78, 31, 290, -487, 191, 574, -513, 268, 219, -328, -371, -371, -170, -713, -183, -144, 174, 188, -507, 152, -670, -944, 127, 42, -246, -385, 79, 221, -98, 557, -762, -258, 480, 552, 125, -606, 618, -423, 43, 188, 355, -154, -255, -285, -982, -230, -511, 615, 524, 191, -335, 987, 363, 261, -245, 138, -140, 314, -27, 597, 324, -85, 404, -87, -93, 161, -143, 579, 472, 26, 39, -312, 260, -2, 139, 429, 878, -195, 125, 558, -102, 203, 278, -485, 299, 16, 188, -42, 232, -79, -562, -335, 581, 607, 34, 59, -402, -85, 221, 989, -197, 262, 426, -229, 806, -125, -313, -389, 1061, 127, 483, -234, -206, -175, -162, -188, -49, -277, 173, -528, -356, 639, -282, -273, -663, 22, -546, 871, -305]
4697c05N7L1M10k69o92O26o1M51k57k80m14L57K27N98j07o69n00P08K18N17q20
4718a74k38L04O6n8L31O2L46r80Q47r39J002r80M90M24l72k56K36L8k03Q9o4L41
4740C12l65J88k19K13n59P35j128J322l87m8J2k68J56O9m31M81j07n07O79l97
4760b49J75M1K39l01K19n58L00p0N37J9k43J86J18o07M31p9j11k31m7m87P88j87
4782a17O3j01j10l88R61m27K91J26n25O86m62J06J21j15m26M54n85P32l80o18
4802g14R97l8j149Q50K57L06r14N51M5l33M15P03j302J99P67q64q3L60Q1l44l52
4823e62J390n90l52K28j60R70j204J32pK88p28J212n89O04n54J18q3P28m96k03
4843A42m10K01J035p61m09k25O03m81J387j405O8l81M00L70j020J627R6r51L40
$$ y = [-305, -248, -217, 193, -76, -768, -142, -203, 248, -9, -289, -703, -346, -119, 479, 372, -297, -797, -89, 129, 646, -174, -412, -108, -42, -100, 231, 293, 639, -341, 506, -433, 569, -411, 79, 503, 131, -125, 111, 149, -54, 35, -29, 312, -53, 135, -84, 129, -430, 305, -823, 499, 112, 64, 76, -192, -36, 33, -398, 83, -24, -531, 148, -249, -74, -33, 206, -95, 124, -434, -134, -204, 333, 352, 109, 295, 413, -194, 237, 158, 47, -184, -231, -718, 70, -117, -54, -155, -265, -653, 308, -119, 172, 298, -227, 459, -3, 103, 224, 109, -317, 137, -448, 284, -96, -714, 283, 245, -904, -54, 203, 509, -405, 146, 191, -142, 273, 976, -326, -127, 640, -224, -307, 53, 134, -210, -562, 828, 238, -114, 114, -46, 924, -280, -148, -155, 133, -595, 617, 28, 632, 78, 196, 113, 841, 345, 142, -268, -67, 968, 207, -202, -427, 176, -305, 1082, -323, -255, -636, -236, 134, -886, 741, 837, -114, 226]
4862B26l99k9O90p66R8R50n6m49j96k78K0N11o62J22K92m67O07r1o66O36M7k15
4884g5n1L92m1l92N36K57m44K96n19j088J312N2j95q5l36K86r43Q49j30K32L3
4905e4k32J000j272J87P14n50M22l4om41L91J82m77L56k13m17PK26O41j259J471
4926F42q91l82M93j47K5K07r77J068J89q53K27N32N89n85M47n64o6q4J37k23n11
4947g27L65Q70R8l24m19N22k71L05j9j061L42O48r39m8P25n0j2r75J018K75L71
4968F94l77o7j92k13M64l10J4J55m00R8J54k44n48M34J032m89p77P66m32N47Q8
4989C97K6l16j075J036l87N26l39n9L36j92Q8P31p53j63k91O49j87m02M81J40
5009B46o9q78N84J62j79k73O89j25J48p97M27L18l38l87R95m32Q6L78j98n66J119
$$ y = [226, -173, -202, 488, -278, -180, 770, 714, 265, 69, -209, -189, 322, -340, -218, 74, -393, 214, 123, -543, 93, 140, -75, -126, 266, 225, -167, 369, 626, 182, 478, -41, -1129, 183, 235, 40, -45, -381, -95, -1038, -189, -319, -87, -54, -286, 714, -558, -371, 343, -207, 215, 181, 175, -266, 125, 307, -170, 186, -27, -444, -437, -211, 430, -829, 642, -249, -631, -138, -285, -260, -53, -1030, 38, 227, -626, -399, 133, 722, 137, 584, 20, -46, -130, 7, -216, -727, -362, 508, 606, 282, -137, 385, 114, 419, 400, -661, -319, 329, -610, -658, 67, 17, 5, -970, 48, 323, 694, 317, 250, 58, -155, 309, -1, 13, 168, -232, -134, 20, -224, -772, -338, 694, 205, -572, 194, -238, 309, 397, 423, 107, -968, 68, -319, 207, -132, -191, 145, -47, 41, 772, 19, -144, -435, 214, 27, -375, 106, 246, 177, -701, -117, 45, -134, -407, 282, 157, 305, -492, -65, 253, -85, -472, 523, 91, 177, 555, 357, -209, 910]
5030I10j524N71R32l83m08l12j52N06l81Q35k45l16q36J390o27m11p1J74J002
5049F54l39k45O33p58M3n41Q73m1J67j137P80P18j701J083J8L7J02l0j302P74
5069b12J36L38o17K11J75j62P15k68q39O62n06L38o63J62J87M39p7K95j04m5M10
5090E75j055J180n86j48k39K01j99N68n06k17Q75p55O01p32J50M85J4k11P4K68
5110C43j83K3l45n3l22P15j36Q3K32l42P14o87L48q97N75m87J97k3Q16n30O0l83
5132b82l58P83N1K9p11N96l84J75K88q3J53l34j83M27l13P31j018N08L91m84K79
5153B61J20j83l19n06P73k87J72m48k14J25P30Mo70L22m31O42l86J62L19M14k89
5174C11l38M39K21p41J70m71O82J26K53l18M15m94k88j70N7N18l99J022j523R34
$$ y = [910, -614, -43, 889, 506, 98, -214, -366, 140, -241, 594, 349, 33, -803, 587, -40, -451, -522, -348, 654, 315, 70, 703, -55, -12, -553, 320, 279, 446, -691, 89, 807, -894, 189, 207, 244, 346, 316, -986, -212, -76, 262, -355, -144, 31, -131, 584, 316, -523, 139, -367, -29, -692, -530, -343, 96, 19, 314, 210, 165, 575, -480, 700, 114, -34, -273, -72, -271, 297, -209, -426, 449, -306, 295, -437, -287, 198, 212, 1, 75, 343, 160, 183, -162, -215, -537, 178, 42, 125, 357, 15, 729, 42, 390, -507, 68, -419, -222, -245, 571, 41, 101, -282, -640, 143, 194, 223, -488, 108, -276, -101, 187, 104, 257, -77, -260, 167, -146, 585, -433, 75, 466, -18, 261, 381, 198, -121, -627, 146, -141, 31, -417, -631, -506, 224, 228, -442, -120, -551, 91, -295, -133, 186, 600, 311, -27, 412, 633, -108, 62, -409, 273, 399, 652, 334, 749, 255, -33, -203, -146, 372, -27, 995, -528, 406]
5194D06k58l56M00r12r6R91K6l13k84L45K73k75km25O26n4m89Q30q5j135N77L41
5216A31L14L13j020L86k88O19Ql59M06n9k84n74L32l69L51k49L05NM31k93o61
5237e55O81m75L67K74j69l5k34Jj63Q85j233K65L84k11L72K09jk60M26m04m78
5258c54l00N00J62J94m5j39O71r02k9N55l55O46k03L96r29l44O83m67J31J13l0
5279d6K57M57j120N66J05o03P8R63j132M81K7l66m22K49Q06k99k27K07K07j02
5299H6N60q66J8P73p48M72j24q62L40L70Q66m55p46k24Q20o93K03J11l56j50P93
5320A88o92O20m41K91M01p54J97P29N9k74p13K66P61l10m51Q94n80K20o91N55
5340B75K27o90P59o36R41r06O01j228L34P94j05n39k98P80l28j01J83k31M3j91
$$ y = [406, 148, -208, 192, -720, -816, 175, 201, -112, -396, -51, 222, -53, -55, -480, 146, 92, -397, 433, 348, -787, -210, 131, 445, 758, -262, 124, -164, 455, 463, 104, 510, 451, 167, -407, -75, -444, -93, -342, -37, -32, 399, 106, -555, 126, -349, 18, 292, 123, 88, -146, -145, -308, 577, -656, -391, -7, -218, 154, 363, 362, 102, 528, 124, -354, -654, -154, 8, 202, 157, 18, 689, -213, -242, 313, -42, 604, 401, 797, -132, -476, 207, -260, -129, -16, -46, 211, 668, -452, 114, 219, -384, -306, 657, -475, 6, 33, -333, -755, -506, 300, 1, -226, -19, 188, 86, 646, -220, -202, 571, -177, 295, 171, -691, -351, 19, 885, 430, -316, -540, 280, -413, -210, -99, -455, -605, 188, -504, 116, -325, -34, 367, -387, -190, 539, 598, 324, -389, -123, 638, 328, -123, 771, 191, 411, -280, 275, 502, -188, 571, -65, 876, -30, 571, -657, -323, 471, 366, -173, -471, 309, -19, -120, 63, -168, -125, -316]
5360c16O63o86M16M58j215J055p45P66q40J170j68q00J030k35J08p83k66K59J54
5379B5n83O04L4M39j49J67j046P98RL71j113O31k48j87j45R49j83p06L97jn30
5400d67M21N34j30Q7l16J35L5j37k71o24K87Q13j113J034l62P9N62p90m47M24
$$ y = [-316, 347, -339, 77, 535, -680, 375, -370, 396, -444, 726, 558, -242, 788, 553, 661, -122, -388, -129, 25, -558, 46, 80, 519, 370, 537, -509, 289, 298, 669, -444, 187, -61, -248, -393, 556, 373, -333, 64, 63, -467, -46, 488, 358, 445, 129, 264, 299, 162, -109, -733, -446, 367, -746, 288, -74, 5, 567, -223, -670, -246]
$$ [...]
8191C04
##END NTUPLES=NMR FID
##END=
