##TITLE=1H_IG-APTMSn
 CDCl3
 8 sc, 
 3.4.2024
##JCAMPDX= 6.0         $$ Bruker NMR JCAMP-DX V2.0
##DATA TYPE= NMR FID
##DATA CLASS= NTUPLES
##ORIGIN= UXNMR, Bruker Analytische Messtechnik GmbH
##OWNER= root
$$ XWIN-NMR		Version 3.5
$$ Wed Apr  3 13:58:30 2024 Russian Standard Time (UT+4h)  she@DPX200
##.OBSERVE FREQUENCY= 200.1309
##.OBSERVE NUCLEUS= ^1H
##.DELAY= (6, 6)
##.ACQUISITION MODE= SIMULTANEOUS
##.ACQUISITION SCHEME= undefined
##.AVERAGES= 8
##.DIGITISER RES= 18
##SPECTROMETER/DATA SYSTEM= spect
##.PULSE SEQUENCE= zg30
##.SOLVENT NAME= MeOD
##.SHIFT REFERENCE= (INTERNAL, MeOD, 0, 15.7039)
##AUDIT TRAIL= $$ (NUMBER, WHEN, WHO, WHERE, WHAT)
$$ ##TITLE= Audit trail, XWIN-NMR		Version 3.5
$$ ##JCAMPDX= 5.01
$$ ##ORIGIN= Bruker BioSpin GmbH
$$ ##OWNER= she
$$ F:/spectra/data/she/nmr/H-F/1/audita.txt
$$ ##AUDIT TRAIL=  $$ (NUMBER, WHEN, WHO, WHERE, WHAT)
(   1,<2024-04-03 13:56:56.68 +0400>,<she>,<DPX200>,
      <created by zg, POWCHK disabled, PULCHK disabled
       configuration hash MD5:
       00 E9 B6 7A A2 85 ED C7 34 08 36 98 17 FE 4E 26
       data hash MD5: 16K
       32 B7 4B 99 1B 81 58 A9 C4 04 C3 3F 10 09 45 D4>)
$$ ##END=
$$ 
$$ hash MD5
$$ A0 DA 36 52 2A 9B 7A 0E 13 35 AC E8 EE C2 26 BE
##$RELAX= 
##$RELAX= 
##$RELAX= 
##$RELAX= 
##$RELAX= 
##$RELAX= 
$$ Bruker specific parameters
$$ --------------------------
##$DU= <F:/spectra>
##$EXPNO= 1
##$NAME= <H-F>
##$PROCNO= 1
##$TYPE= <nmr>
##$USER= <she>
##$AMP= (0..31)
100 100 100 100 100 100 100 100 100 100 100 100 100 100 100 100 100 100 
100 100 100 100 100 100 100 100 100 100 100 100 100 100 
##$AQSEQ= 0
##$AQ_mod= 1
##$AUNM= <au_zg>
##$AUTOPOS= <>
##$BF1= 200.13
##$BF2= 200.13
##$BF3= 200.13
##$BF4= 200.13
##$BF5= 200.13
##$BF6= 200.13
##$BF7= 200.13
##$BF8= 200.13
##$BYTORDA= 1
##$CFDGTYP= 0
##$CFRGTYP= 5
##$CHEMSTR= <none>
##$CNST= (0..31)
1 1 145 1 1 1 1 1 1 1 1 1 1 1 1 1 1 1 1 1 1 1 1 1 1 1 1 1 1 1 1 1 
##$CPDPRG= <>
##$CPDPRG1= <>
##$CPDPRG2= <>
##$CPDPRG3= <>
##$CPDPRG4= <mlev>
##$CPDPRG5= <mlev>
##$CPDPRG6= <mlev>
##$CPDPRG7= <mlev>
##$CPDPRG8= <mlev>
##$CPDPRGB= <>
##$CPDPRGT= <>
##$D= (0..31)
0 1.2 0 0 0 0 0 0 0 0.06 0 0.03 0 0 0 0 0.0002 0 0 0 0 0 0 0 0 0 0 0 0 
0 0 0 
##$DATE= 1712138216
##$DBL= (0..7)
120 120 120 120 120 120 120 120 
##$DBP= (0..7)
150 150 150 150 150 150 150 150 
##$DBP07= 0
##$DBPNAM0= <>
##$DBPNAM1= <>
##$DBPNAM2= <>
##$DBPNAM3= <>
##$DBPNAM4= <>
##$DBPNAM5= <>
##$DBPNAM6= <>
##$DBPNAM7= <>
##$DBPOAL= (0..7)
0.5 0.5 0.5 0.5 0.5 0.5 0.5 0.5 
##$DBPOFFS= (0..7)
0 0 0 0 0 0 0 0 
##$DE= 6
##$DECBNUC= <off>
##$DECIM= 32
##$DECNUC= <off>
##$DECSTAT= 4
##$DIGMOD= 1
##$DIGTYP= 9
##$DL= (0..7)
0 120 120 120 120 120 120 120 
##$DP= (0..7)
150 150 150 150 150 150 150 150 
##$DP07= 0
##$DPNAME0= <>
##$DPNAME1= <>
##$DPNAME2= <>
##$DPNAME3= <>
##$DPNAME4= <>
##$DPNAME5= <>
##$DPNAME6= <>
##$DPNAME7= <>
##$DPOAL= (0..7)
0.5 0.5 0.5 0.5 0.5 0.5 0.5 0.5 
##$DPOFFS= (0..7)
0 0 0 0 0 0 0 0 
##$DQDMODE= 0
##$DR= 18
##$DS= 0
##$DSLIST= <SSSSSSSSSSSSSSS>
$$ [...]
##$SUBNAM2= <"">
##$SUBNAM3= <"">
##$SUBNAM4= <"">
##$SUBNAM5= <"">
##$SUBNAM6= <"">
##$SUBNAM7= <"">
##$SUBNAM8= <"">
##$SUBNAM9= <"">
##$SW= 18.0517689322627
##$SWIBOX= (0..15)
0 0 2 0 0 0 0 0 0 0 0 0 0 0 0 0 
##$SW_h= 3612.71676300578
##$TD= 16384
##$TD0= 1
##$TE= 0
##$TE2= 300
##$TE3= 300
##$TEG= 300
##$TL= (0..7)
0 120 120 120 120 120 120 120 
##$TP= (0..7)
150 150 150 150 150 150 150 150 
##$TP07= 0
##$TPNAME0= <>
##$TPNAME1= <>
##$TPNAME2= <>
##$TPNAME3= <>
##$TPNAME4= <>
##$TPNAME5= <>
##$TPNAME6= <>
##$TPNAME7= <>
##$TPOAL= (0..7)
0.5 0.5 0.5 0.5 0.5 0.5 0.5 0.5 
##$TPOFFS= (0..7)
0 0 0 0 0 0 0 0 
##$TUNHIN= 0
##$TUNHOUT= 0
##$TUNXOUT= 0
##$USERA1= <user>
##$USERA2= <user>
##$USERA3= <user>
##$USERA4= <user>
##$USERA5= <user>
##$V9= 5
##$VALIST= <valist>
##$VCLIST= <CCCCCCCCCCCCCCC>
##$VD= 0
##$VDLIST= <DDDDDDDDDDDDDDD>
##$VPLIST= <PPPPPPPPPPPPPPP>
##$VTLIST= <TTTTTTTTTTTTTTT>
##$WBST= 1024
##$WBSW= 4
##$XGAIN= (0..3)
0 0 0 0 
##$XL= 0
##$YL= 0
##$YMAX_a= 151397
##$YMIN_a= -124467
##$ZGOPTNS= <>
##$ZL1= 120
##$ZL2= 120
##$ZL3= 120
##$ZL4= 120
##$ABSF1= 10
##$ABSF2= 0
##$ABSG= 5
##$ABSL= 3
##$ALPHA= 0
##$AQORDER= 0
##$ASSFAC= 0
##$ASSFACI= 0
##$ASSFACX= 0
##$ASSWID= 0
##$AUNMP= <proc_1d>
##$AZFE= 0.1
##$AZFW= 0.1
##$BCFW= 1
##$BC_mod= 2
##$BYTORDP= 1
##$COROFFS= 0
##$CY= 11.3945322036743
##$DATMOD= 1
##$DC= 2
##$DFILT= <>
##$DTYPP= 0
##$F1P= 15.7292609196834
##$F2P= 12.9074282941183
##$FCOR= 0.5
##$FTSIZE= 0
##$FT_mod= 4
##$GAMMA= 1
##$GB= 0.15
##$INTBC= 1
##$INTSCL= 1
##$ISEN= 128
##$LB= 0.24
##$LEV0= 0
##$LPBIN= 0
##$MAXI= 10000
##$MC2= 0
##$MEAN= 0
##$ME_mod= 0
##$MI= 1.114404
##$NCOEF= 0
##$NC_proc= 0
##$NLEV= 6
##$NOISF1= 3.799351
##$NOISF2= 2.8
##$NSP= 1
##$NTH_PI= 0
##$NZP= 0
##$OFFSET= 15.70392
##$PC= 1
##$PHC0= -25380.45
##$PHC1= 14.58731
##$PH_mod= 1
##$PKNL= yes
##$PPARMOD= 0
##$PSCAL= 0
##$PSIGN= 0
##$REVERSE= no
##$SF= 200.130013532006
##$SI= 16384
##$SIGF1= 3
##$SIGF2= 2
##$SINO= 400
##$SIOLD= 16384
##$SREGLST= <1H.CDCl3>
##$SSB= 0
##$STSI= 0
##$STSR= 0
##$SW_p= 3612.71676300578
##$SYMM= 0
##$S_DEV= 0
##$TDeff= 0
##$TDoff= 0
##$TI= <>
##$TILT= no
##$TM1= 0
##$TM2= 0
##$TOPLEV= 0
##$USERP1= <user>
##$USERP2= <user>
##$USERP3= <user>
##$USERP4= <user>
##$USERP5= <user>
##$WDW= 1
##$XDIM= 8192
##$YMAX_p= 0
##$YMIN_p= 0
$$ End of Bruker specific parameters
$$ ---------------------------------
##NTUPLES= NMR FID
##VAR_NAME=  TIME,          FID/REAL,        FID/IMAG
##SYMBOL=    X,             R,               I
##VAR_TYPE=  INDEPENDENT,   DEPENDENT,       DEPENDENT
##VAR_FORM=  AFFN,          ASDF,            ASDF
##VAR_DIM=   8192,          8192,            8192
##UNITS=     SECONDS,       ARBITRARY UNITS, ARBITRARY UNITS
##FACTOR=    0.0002768,     1,               1
##FIRST=     0,             0,               0
##LAST=      2.2672688,     0,               0
##MIN=       0,             -124467,         0
##MAX=       2.2672688,     151397,          0
$$ Real data points
##PAGE= N=1
##DATA TABLE= (X++(R..R)), XYDATA
0@%%%%%%%%%%%%Qj6J6j6J6j6K4l2M0m8N6o4P2q8J04j20J36j57J81k08K37k68L03
35A60l38L79m26M76n32N94o60P32q11Q98r94J096j209J335j470J618j783J966
53A031k168K394k649K938l268L649m099M635n283O097p146Q551j0555J3652j9117
68a1338L1548j09483q020K11831m4482l3110l0234r3758j3795J42823N0829m6156
80D6655n5830m3181j9771M4842P7567O3595p2875j46606j417J21611N3910R634
92G8134m1260j20457k3678J21115N4168j9827j6865o8587m7625O4783N3509J8308
104E1718K0449q4351j12218O7440J23473Q012l2912n5462q2719K9614J22334L4662
116I0040o3433o1015j9799J7957L2064M8238L7241o8351j04929K8891Q4088J9834
$$ plain form
0 0 0 0 0 0 0 0 0 0 0 0 0 0 8 -8 8 -8 8 -8 16 -16 24 -24 32 -32 40 -48 56 -64 72 -85 96 -112 125 -143 160
35 160 -178 201 -225 251 -281 313 -347 385 -426 472 -522 574 -635 700 -770 848 -935 1031
53 1031 -1137 1257 -1392 1546 -1722 1927 -2172 2463 -2820 3277 -3869 4682 -5873 7779 -11338
68 -11338 20210 -89273 -97293 114538 70056 36946 6712 -87046 -100841 41982 92811 46655
80 46655 -9175 -52356 -72127 -27285 50282 113877 41002 -105604 -107021 14590 68500 78134
92 78134 36874 -83583 -107261 13854 68022 48195 31330 -37257 -84882 -20099 33410 51718
104 51718 72167 -12184 -124402 -56962 66511 74523 41611 -13851 -96570 -66956 55378 90040
116 90040 26607 -34408 -54207 -36250 -4186 44052 81293 12942 -91987 -63096 20992 40826
128D0826K4774k1296j30856k2746J41832N3009n7531k4076l6043m1221N8030P6296
140F0998q041m1137m0882l1754K4664O6829M2286k8065q7451m3319O0808P2910
152D7846J5222k9532o8738m0769N3965O1547K571j0070l7210n9122J9395P0995
164B6100K1110o786k9410p4424r758R4864N2873l9203m8528l4261m989N6336N7517
177F1441j5590n7707l2663R068K8580L3879K5994k7315p3010j6400O0918M3758
189D0953L073j7723n9317l9432N9063O7764j3663l5545k3604k8189J5891O2319
201C1590K0933l5154l6153k2305M006M9178M6429k0725o3042k9493K6065M5671
213A7000L0884q908n3302m1249K4761M9603J7596n898k6115m6540o703N5147M0915
$$ plain form
128 40826 65600 44304 -86552 -109298 32534 85543 28012 3936 -32107 -73328 -15298 60998
140 60998 52957 11820 -29062 -60816 -36152 30677 72963 44898 -42553 -85872 -25064 47846
152 47846 63068 33536 -35202 -75971 -22006 39541 42112 32042 -5168 -64290 -44895 26100
164 26100 47210 40424 11014 -63410 -73168 21696 74569 35366 -13162 -47423 -52412 3924 61441
177 61441 45851 -11856 -44519 -35451 -6871 27008 53002 25687 -47323 -63723 -2805 40953
189 40953 44026 26303 -33014 -72446 -13383 54381 40718 5173 -18431 -46620 -30729 31590
201 31590 52523 17369 -18784 -41089 -37083 12095 58524 37799 -25243 -54736 -28671 17000
213 17000 47884 38976 -14326 -55575 -30814 18789 36385 30487 4372 -42168 -48871 6276 47191
226D7191j2387l1941l6101j7626M2043N9575n376n1970k9908J374K3667M3356
238C1897J7342m1092m5657J532K6963K8290K2730j6721n4765k1480L7641M0894
250B7574J0457j5311l9794l1905K3959N2888J4355k6642l0025k0924L700M2634
262A0966L6747k0023m4640j7555P563K7014L9886R28n2239l3686J8972L1181K4309
275B9423Q889l3868m6210N483M2029K4656n7k0840l8358j4475L6106M2215M59
288C5452k9651k8903j2812J8837M3739J7143l4336l7747l545J6819K9251K7158
300D1405j7959m9308j3198K7222K6220J7493m168m1483l0989K3685L9658J2982
312C1560r157k7115l1556N128M2885K6714j5239l0961k1742q02K9582L6924l112
$$ plain form
226 47191 34804 2863 -33238 -50864 -8821 50754 45378 -6592 -36500 -35126 -11459 31897
238 31897 49239 8147 -37510 -35978 -9015 19275 42005 25284 -29481 -50961 -13320 27574
250 27574 38031 22720 -17074 -48979 -25020 27868 42223 15581 -14444 -35368 -31668 10966
262 10966 47713 27690 -16950 -34505 -26942 72 39958 40886 -11353 -45039 -26067 5114 29423
275 29423 38312 4444 -41766 -36283 5746 30402 30345 9505 -28853 -43328 -7222 34993 35452
288 35452 5801 -23102 -35914 -17077 26662 43805 9469 -28278 -31823 -15004 14247 41405
300 41405 23446 -25862 -39060 -11838 14382 31875 27707 -13776 -44765 -21080 18578 31560
312 31560 22403 -4712 -36268 -31140 11745 38459 23220 -7741 -29483 -30285 -703 36221 33109
325C3109l9932k4977P268K1774K8026J1083l1944l8803M248K9849K1354Q812j6137
338A3730l8973j2447L2623L0842J275j5800k6653k0236J8512M0210J0272k3396
350I959k4702j3085P340L3253K4427j9002l5754j1787J2070K3772K3921m361l6454
363a0403k3888J5019K8376J6635j039k4912l1977K673L6660K2686q558k0811k3671
376b3210q248K9435L4422o365k8644j7566n493J5253L3953R090k9337k6369j517
389b4596J5370K6146J5124j9872l4169q347K1991K5795Q156j2938k5617j6949
401b9906J5016L2257R287j5674j7905j7107p4L3228K4513j8566k6581j0077L54
414b1235K3388L0464r884l5030j2241Q871J6186K0845K538k4796k2899J402K1529
$$ plain form
325 33109 -6823 -31800 -24532 -2758 25268 36351 4407 -34396 -30148 -299 21055 29867 13730
338 13730 -25243 -37690 -5067 25775 27050 11250 -15403 -35639 -17127 23083 33355 9959
350 9959 -14743 -27828 -20488 12765 37192 18190 -17564 -29351 -17281 6491 30412 26051 -10403
363 -10403 -34291 -19272 9104 25739 24700 -212 -32189 -29516 7144 29830 21272 461 -23210
376 -23210 -31458 -2023 32399 26034 -2610 -20176 -25669 -10416 23537 32627 3290 -23079 -24596
389 -24596 -9226 16920 32044 12172 -21997 -30344 -8353 17442 25598 12660 -12957 -29906
401 -29906 -14890 17367 26654 10980 -6925 -24032 -24106 9122 33635 15069 -11512 -21589 -21235
414 -21235 2153 32617 22733 -12297 -24538 -15667 519 21364 23902 -894 -23793 -22391 -862
427h62K2242K190j8525k4078j0058K2135L3230n68k6288j6545n077J1705L0397
440A9898P730k5454j6830k528K660K3467K0479j7393k6628p291N977K3388K3761
453C1236j3881l3470r789J4144K1438J3751r310k2351j3323M868K2138J7390q002
466A4839j6680j3012r682J8578L5849m778l4509j1427M262J0941K7932N939l3535
479e283j8898J1899J1768J1272Q943j2265k1357p614J1389K3971J1251j6295k1909
492a3128r618Q919K8869J4301k4191k3589J883R090J5019J3496j1586j8661l962
505a3158j47J1790K3782k948k6840j2201L269J5151K5993q53l3806j5674J5184
518a0458J6751R309j344j5355j4328o32J3505J7804J902j3977j2807r930N495
$$ plain form
427 -862 21380 23570 5045 -19033 -29091 -6956 26274 25706 -582 -17127 -22204 -10499 19898
440 19898 27628 2174 -14656 -17184 -14524 8943 29422 12029 -14599 -21890 -15913 7475 31236
453 31236 17355 -16115 -25904 -11760 9678 23429 14119 -8232 -21555 -16687 5451 22841 14839
466 14839 -1841 -14853 -24535 -5957 29892 25114 -9395 -20822 -16560 -5619 22313 28252 -5283
479 -5283 -24181 -12282 -514 10758 19701 7436 -13921 -21535 -10146 13825 25076 8781 -13128
492 -13128 -22746 -13827 15042 29343 5152 -18437 -16554 -7464 7555 21051 9465 -9196 -13158
505 -13158 -13305 -1515 22267 19319 -7521 -19722 -16453 -1302 24691 23838 -9968 -25642 -10458
518 -10458 6293 15602 14258 -1097 -15425 -16057 -2552 15252 17154 3177 -9630 -19560 -14065
531a4065L1564J3428l0430k3447P827J1636J4276J2051j7233k4219M165J3818
543f29O291P312j181j6478j3693L544J9857J7763p938k4202j1705Q171K0842J5332
557B3286j1980k3876m327J0219J0521R699k031j4193q379j037O314J9536Q467
570B2219k1235k0596L023J5064J7264N098k0672k1277O725J9143P923k574p506
583B599j0203o309O097J5943Q453q795j4856r406L646K1047J6157j5010k5138
596a5775j969J3932J2128O411o928j6438m997Q611Q271O432K647j0956j6659p44
610a6034J7465J5632k008j7025j6051K312K0540J4540q555j6873o253L107Q541
623f62J1119J988j0922j1099k715O404J4327R734j0390k1312n770J6029J7082
$$ plain form
531 -14065 17499 30927 497 -22950 -15123 -3487 10789 22840 5607 -18612 -14447 -629
543 -629 5662 12974 11793 -4685 -18378 -14834 5023 22786 14848 -9354 -21059 -12888 7954 23286
557 23286 11306 -12570 -16897 -6678 3843 13542 11511 -2682 -11061 -12098 -5784 13752 22219
570 22219 984 -19612 -16589 -1525 15739 20837 165 -21112 -14387 4756 12679 10105 2599
583 2599 -7604 -13913 -7816 8127 16580 7785 -7071 -16477 -12831 8216 24373 9363 -15775
596 -15775 -17744 -3812 8316 14727 7799 -8639 -13636 -5025 3246 9678 12325 1369 -15290 -16034
610 -16034 1431 17063 15055 -1970 -18021 -15709 4831 19371 10816 -6057 -12310 -9203 -662
623 -662 10457 12445 1523 -9576 -12291 -5887 8440 18174 7784 -13528 -19298 -3269 13813
636A3813J137j2042j3931l790J1903J3883Lp967o696o843M50J3668J0649m849
650I388j2649j0958J159J7826J3802q783j7251o580N840J2626Q459m790j1698
663c609o914K079Q819Q423K152o698j4338o537J4593J6728k386j1869j0332n169
677a5058J1842J8587k381j5591n744K8L128J1635O614q398j1524n081M575J3288
691E920Q382o314j4049r130O792J7271N374j0265r832m836K596J3048P546o987
705E516q107n451k581J0696J3230l797j1907p439j825J0941J5231l211j5120o572
719a0396K029P773J0554L56j0550q486j048P255J0798K277p247r413o375O611
733e862J5934K608j1469p798l229K919J3931O554j1000r237p69J279Q561R499
$$ plain form
636 13813 14950 2908 -11023 -14813 -2910 10973 10976 3009 -3687 -10530 -10080 3588 14237 9388
650 9388 -3261 -14219 -13060 4766 18568 9785 -7466 -14046 -8206 4420 12879 8089 -3609
663 -3609 -10523 -8444 375 8798 10950 4252 -10086 -16623 -2030 14698 12312 443 -9889 -15058
677 -15058 -3216 15371 12990 -2601 -8345 -8317 -5189 6446 13060 4662 -6862 -11943 -7368 5920
691 5920 14302 7988 -6061 -15191 -8399 8872 14246 3981 -5851 -10687 -8091 4957 12503 5516
705 5516 -2591 -8042 -10623 73 13303 9506 -2401 -9840 -11665 -724 14507 11296 -3824 -10396
719 -10396 -8367 -594 9960 10316 -234 -8720 -9768 -2513 8285 10562 3315 -6098 -12473 -5862
733 -5862 10072 12680 1211 -6587 -9816 -6897 7034 13588 2588 -6649 -7418 -6139 2422 11921
747A1921n089j1827m724K517R201R225k955j1358p171K085J0533Q640l708r584
761b294o158n26Q814J0811k073r984n740j628O048J2508J303j1881p718K09N180
776c129J0580M275j0056j0274n5O150Q477M434o543j0690l361O147R798M202n669
791D286r045m571L632J0297N966n830r076l838J736Q220Q481l269j0767m652K669
806e761O568P866j64j0535p452L070P312O020J067p296q944J37Q191P120P37o114
822A822q665k572P278R457J603p145q138k005N461Q624L680o122r283k305M961
837c349O828M945k620j0218n366N804P908L739j426q625p752M396R784L416k426
852E038o148o917J231R003N667j836o591o742Q4P484O837K72p049q246N16Q040
$$ plain form
747 11921 6832 -4995 -9719 -7202 1999 11224 8269 -3089 -10260 -8175 2358 10998 7290 -2294
761 -2294 -8452 -8978 -164 10647 8574 -1410 -7150 -8778 -2730 9778 11081 -800 -8518 -8309 -3129
776 -3129 7451 11726 1670 -8604 -8659 -2509 5968 10402 3859 -6831 -10192 -4045 5753 9955 4286
791 4286 -4759 -9330 -5698 4599 10565 4735 -4341 -8179 -6443 1777 10258 6989 -3778 -8430 -5761
806 -5761 807 8673 8509 -2026 -9478 -6408 904 6924 7991 695 -8249 -8112 79 7199 7936 1822
822 1822 -6843 -9415 -2137 7320 8923 1778 -6360 -8365 -2904 5720 9400 3278 -6005 -8310 -3349
837 -3349 3479 8424 5804 -4414 -9780 -3976 3932 7671 6245 -2380 -10132 -5736 4048 7464 5038
852 5038 -1110 -8027 -6796 2207 7874 6038 -553 -7295 -7211 273 7110 7382 333 -7913 -7397 643
868F43N782O27n145q953j357Q437N826J09k993p951m339P591Q017J44l243o656
884c461n660N393R386J393m089n940m919L464Q405L195k763o488n741K907P769
899B851L294j085n527p553J863R134L194j610l543p527j164R251N101k252l327
914A100o276l071Q017P422j586m577n694l077O365P619k25m496n895l139N484
929b029P087J014k757o475n427N446Q601L92k959m822o394L560J0246J151m694
944A940l213m483K59Q185L987l290m344m731l03P334N243j751m961o003l65Q141
960A645N001k804m115m431j472O304N523j448l067m353l566M946P274Nl614n090
976c262m617M900R406k3n871l778k303K492P091K011m227m349k639J389N551L751
$$ plain form
868 643 6425 7052 1907 -7046 -8403 34 5860 5969 2976 -4975 -9314 -1723 6294 6438 3195 -3461
884 -3461 -9121 -3728 5658 7051 2962 -2978 -7897 -4433 3972 7167 4404 -2084 -7825 -4918 2851
899 2851 6145 5060 -467 -8020 -6157 2977 6171 4561 1018 -6509 -7673 1578 6679 4427 1100
914 1100 -5176 -8247 -230 7192 5606 1029 -4665 -7742 -1377 6242 6017 1521 -4374 -7513 -2029
929 -2029 5058 6072 3315 -3160 -8587 -3141 5460 5852 2893 -1929 -8323 -4763 5483 6634 1940
944 1940 -1273 -5756 -5497 2688 6675 3385 -959 -5690 -5993 1341 6584 4833 -128 -6131 -6496 1645
960 1645 6646 3842 -273 -4704 -6176 128 5651 4203 1136 -3217 -6783 -1837 5437 5442 1828 -3262
976 -3262 -7879 -2979 6427 6404 533 -3245 -5548 -3056 4035 6046 1819 -2530 -5169 -3780 1771 5522
992E522r29n254o459J451Q939L589l684m463m470O1P891M621m113m143j826j155
1008d422L500N730M29m417n222j987M930P034O92n450o027j202O003O359r18n179
1024a47l732p36L125M640J391k144m215l925J863O968L421l254n897m074K531
1039d185P932L262n034n525q51K211L633K829q81m079l498J52L610M442J396m355
1055A059o678n48O838N493j453n480m278N74M952L891q44l385k880j031J785M375
1071B390L022k495o081k997L254O320L271l985p445j547N480M739M16k503m240
1086b401k216K510L762J835j14l399m876J7N712N122j011o488m743K426N837L043
1102E016j593m927l255K188L689J545N45j780m518j551L295M335K221l017o761
$$ plain form
992 5522 4593 -661 -7120 -5669 3270 6859 3175 -1288 -5758 -5697 2194 6815 2702 -1441 -3267 -4422
1008 -4422 -922 4808 5237 820 -4402 -6389 -1459 5575 6267 817 -5210 -6412 -409 5950 5032 -147
1024 -147 -3879 -4615 -1490 3150 4541 2397 -1818 -5743 -3880 3088 6509 3255 -2642 -6716 -4185
1039 -4185 3747 7009 1975 -3550 -4401 -2190 1443 4272 3391 -688 -4186 -4034 -424 4018 5414 1059
1055 1059 -5619 -6167 671 6164 4711 -769 -5047 -4473 479 4370 3526 141 -2739 -3770 -1985 2390
1071 2390 5412 2917 -3164 -6161 -2907 3413 6684 2699 -4746 -6293 -813 3926 4342 1839 -2401
1086 -2401 -4617 -2107 1655 3490 3376 -23 -4899 -4882 830 5952 4941 -1547 -6290 -3864 1973 5016
1102 5016 3423 -1504 -4759 -2571 1118 2663 3208 1428 -3090 -4641 -1346 2989 5210 2193 -4568
1117d568j457N726M762J04l495n118p76M799L326n56j438k675k541J230L988L255
1133D566p53n455l990K490N050L026j111o047m003M158N128Q0j068j971l715Q7
1149c528M070K531K28k111m697j567M368M987P34m375n527L11N303L047n79k597
1165E98l857o71L610K820N65q66l891l110K558M660K078j650n384l338L957N426
1181C505O28k366l649k587K448M427Q78j460k341k934O4L827L410r9l886m320
1197d455O89M684L003n37l556m092O86M618K155q27j568l057j633L023L723M97
1213C353j937l592k353K685M904J314k982m111j401K819L920J042k101l531j890
1228c861J936L596J749r22l328l247J051M502K617j362l705l148Q68M445K832
$$ plain form
1117 -4568 -6025 -299 4463 4567 1072 -4046 -4822 -23 3303 2747 1309 -1366 -3907 -2677 1311 4566
1133 4566 3813 -1642 -5632 -3142 1908 4934 3823 -2224 -6227 -2069 3059 3139 2071 100 -3615 -3528
1149 -3528 542 3073 3301 1190 -3507 -5074 -706 4281 5015 640 -4887 -4576 727 3774 3195 598
1165 598 -3259 -3930 -320 2500 3065 2199 -1692 -4802 -2244 2416 4494 2844 -2540 -5878 -1921 3505
1181 3505 4133 1767 -1882 -4469 -2021 2406 3284 1824 -517 -3451 -3387 440 3850 3751 -135 -4455
1197 -4455 -3766 918 3921 3384 -172 -4264 -3578 1040 3195 2368 800 -2257 -3890 -867 2856 3353
1213 3353 1416 -2176 -4529 -1844 3060 4374 1392 -2719 -4120 -1301 2619 3661 1560 -1971 -3861
1228 -3861 -1925 1671 3420 2498 -830 -4077 -3026 1476 4093 2731 -974 -4122 -3254 1191 4023
1243D023j385l367k545K59L314L136l70l102k945m58K791L787N77l242l508m10
1259c445K766L504Q44k819l627p80K558L342J040k056l280j565J799L811J695
1274C787k246l389j492J187L475K599j800l877j462J203K763K789p11l982k350
1289c506J096K849K722j63l505k738O05K742K860J75l101k860r3K179L275R94
1305C531l002l196l11J886L360J689l012l749j42J852K659K034k013l953p07J835
1321a239K440K199j115m022j746J577K934K531j089m142j804J633K726K453o81
1336B655l903j940J298K074K440M29l443k714P87K045K762J162l475l547Q44K337
1352a89K233J225k590l651L45K314J942J306j543l410q63J611K495K123j518l930
$$ plain form
1243 4023 2638 -729 -3274 -3015 299 3435 3065 -37 -2982 -3440 -649 3138 3715 473 -3035 -3445
1259 -3445 -679 2825 3669 850 -2777 -3557 -999 2343 3383 1327 -1953 -3518 -1719 2092 3787
1274 3787 1541 -1848 -3340 -2153 1322 3921 2121 -1756 -3218 -2015 748 3537 2826 -1156 -3506
1289 -3506 -2410 439 3161 2998 -507 -3245 -2640 102 2962 3137 36 -2824 -2917 -738 2537 3531
1305 3531 529 -2667 -2978 -1092 2268 3957 945 -2804 -2946 -1094 1565 3599 1586 -2367 -3074 -1239
1321 -1239 1201 3400 2285 -1737 -3483 -1906 1028 3559 2470 -1672 -3476 -1843 883 3336 2655
1336 2655 -1248 -3188 -1890 184 2624 3053 -390 -3104 -2317 -272 2490 3652 177 -3370 -2526 -189
1352 -189 2044 3269 679 -2972 -2627 -313 1629 2935 1392 -2018 -2881 -1270 1225 3348 1830 -2100
1368b100r88J754K370K372j088m323j241K160J860J774k7l571k225J552K228K041
1384B548M20l321k983J033K582K328M59l275l157J000K612K049O39k543l156K86
1400b479K118K115J330k048l653k31K190K196J669j554m069p62K576K113J131
1415B642r19l440j455K010K417J403o47l152j884J424K442J847l51l310k225J446
1431a752K466J723N7k820k626R15K399J835L76k414k964L80K450J970O69j897
1447G67l201k86K485K087O05j404k867j059J847K663J174j471k939j174J528K481
1463A236J597j098l260j461J739K338J280m57k572k160R56K692J709m77k476k363
1479b777M30K805K319m54k772k261N92K519J993k20k192k210j06K017K327M71
$$ plain form
1368 -2100 -3088 -1334 1036 3408 2320 -2003 -3244 -1084 776 2550 2523 -1048 -3273 -1721 507 2548
1384 2548 2968 -353 -3336 -2303 279 2607 3066 -209 -3366 -2366 246 2295 2934 391 -2765 -2479
1400 -2479 -361 1754 3084 1036 -2617 -2848 -658 1538 3207 1653 -2416 -3178 -602 1511 2642
1415 2642 1723 -1717 -3172 -1162 1255 2658 2011 -1141 -3025 -1601 841 2688 2337 -973 -3198 -1752
1431 -1752 714 2437 2494 -326 -2952 -2037 362 2197 2573 159 -2805 -2425 25 1995 2664 767
1447 767 -2434 -2720 -235 1852 2457 1053 -1814 -2873 -1026 1637 2811 1340 -1599 -2773 -1245 1236
1463 1236 2833 1735 -1525 -2986 -1247 1091 2371 1914 -658 -2818 -1862 830 2539 2062 -414 -2777
1479 -2777 -2347 458 2777 2323 -449 -2710 -2118 401 2394 2174 -18 -2228 -2334 -317 2010 2481
1495B481j871k533p23J828K818R12k125k916o19K040K531O27j616k209r40J173
1511a142K345J148j034k033j622K50K693K347j034k911j636P79K611K069j043
1526A787k738j357O97J877J754j28j878j810m46J703K705M97k275k555o08K124
1542f51L176K05k790k038K9J484K334O70j925j862n28M95K166J924j076k744j545
1559b676Q63K981K022j699k999j049J141K427J561j386k242o56L24J354K090N9
1575B115k207j926l39J967K985Nl041k050M14K122K470k85k791j410O26R29J579
1592A163R71j382k110p82Q88K496J622j604k856j073J352K914J296k262k391k2
1608a780R20J492J508p59k122r45J39J316K351K26k651k211L45K431K468n61k927
$$ plain form
1495 2481 610 -1923 -2646 -818 2000 2912 787 -2129 -2748 -708 1823 2450 834 -1375 -2315 -1142
1511 -1142 1203 2351 1317 -716 -2338 -2088 605 2952 1918 -993 -2629 -1850 761 2830 1787
1526 1787 -951 -2308 -1611 266 2020 1892 14 -1796 -2242 -539 2166 2663 388 -2167 -2775 -651
1542 -651 2525 2730 -60 -2098 -2069 -585 1749 2419 494 -1368 -1896 -1401 765 2689 1613 -1131 -2676
1559 -2676 -1813 1168 3190 1491 -1508 -2557 -1416 1011 2572 1186 -1056 -1712 -1388 -34 2056 2115
1575 2115 -92 -2018 -2357 -390 2595 2600 -441 -2491 -2077 45 2515 2230 -561 -1971 -1345 -416 1163
1592 1163 2134 752 -1358 -2140 -1252 1244 2866 1262 -1594 -2667 -1315 1599 2895 633 -1758 -1780
1608 -1780 -860 632 2140 1381 -741 -1686 -1547 -231 2120 2346 -305 -2516 -2171 260 2728 2167 -760
1625g60j620Q03J855J682k13k018j341O3R36J939J108j613k506p69J469K753J085
1642B853k262k765j58J868K138N97j724k003k47R36J392J273m32k131j505M90
1658a680K155J999n22k725j801R59K473J491r77k191j096O08J532J432Kj587j594
1675a522k57J260K093Q16j872k654k28K205K121J34j764k094l18J839J874Q3j239
1692D77j484q61P04K071J355q82k373j409J080K407J259r80k362j484J158K444
1708A120Q81r18j487j317J16J862J610j95j682j906j49K095J966p0j763k131k24
1725b192K397J903n77j510j394n90J476K139J86j396j619q12J176K179P22j191
1741H97k095j230J507K478L52j218j410j263O59K477Q72j183j332j233L4K172
$$ plain form
1625 -760 -2380 -1577 278 1960 1747 -271 -1612 -1549 -613 1326 2434 821 -1685 -2454 -985 1768 2853
1642 2853 591 -2174 -2332 -464 1674 2271 547 -1456 -1703 -767 625 1898 1466 -665 -2170 -1680
1658 -1680 475 2474 1952 -773 -2574 -1615 858 2349 1372 -819 -1915 -1307 225 1657 1659 72 -1522
1675 -1522 -1779 -519 1574 2390 518 -2136 -2364 -159 1962 2096 332 -1762 -2080 -241 1633 1716 477
1692 477 -1007 -1868 -1164 907 2262 1380 -993 -2402 -1322 1085 2344 1364 -998 -2482 -1324 1120
1708 1120 2001 1083 -404 -1721 -1605 257 1867 1672 -10 -1916 -2065 30 1996 1926 163 -1968 -2192
1725 -2192 205 2108 1531 21 -1373 -1963 -487 1652 1838 442 -1177 -1989 -813 1366 2088 897
1741 897 -1198 -2428 -921 1557 1909 691 -719 -1982 -1323 1154 2026 843 -489 -1722 -1688 484
1757D84J572o76j653j554PK236J646o72j461j530m10K012J977m83j416j367p10
1774a998J614K228o7j478j543r01J448K439R3j449j370j039R94K591N33j568j444
1791i17j020O29K486R90j380j585j068M67K377J154j206j440j149m4K157J644
1807B095q88j517j209l14J960K010o71j659j250m40J730K123m85j634r77n48J085
1824e89K228J85j600j314o85Q90K265N98j482j604q24J001K377N43j566j279p24
1841a580L30K123J143j278j438p72J5J863J725p89j885j197J45J974J694q11j737
1858d75j011o0J573J843m06j628j062l65J084K034L09j608j594n03J312K205K91
1875A939j719j504m30J027K055M95j594j363l60N47J734J136j052j823q16O19
$$ plain form
1757 484 2056 1380 -273 -1827 -1820 416 2062 1390 -71 -1601 -2011 1 1978 1495 79 -1288 -1998
1774 -1998 -384 1844 1777 299 -1244 -2145 -697 1742 1835 386 -984 -2023 -1029 1562 2095 527 -917
1791 -917 -1937 -1308 1178 2168 788 -797 -1865 -1398 979 2133 927 -513 -1662 -1706 451 2095
1807 2095 1207 -310 -1519 -1833 127 2137 1466 -193 -1443 -1883 -153 1970 1485 -149 -1126 -1674 -589
1824 -589 1639 1824 224 -1090 -1775 -885 1380 1978 496 -1108 -1932 -931 1446 1989 423 -856 -1580
1841 -1580 -1250 873 2016 738 -700 -1472 -1457 406 2131 1342 -543 -1740 -1595 379 2073 1262 -475
1858 -475 -1486 -1546 27 1870 1464 -164 -1226 -1591 -507 1527 1836 228 -1366 -1869 -557 1648 1939
1875 1939 220 -1284 -1714 -687 1368 1863 269 -1094 -1454 -907 827 1963 911 -912 -1728 -1109
1891a109J866J221r46j869r60O20J891J203q84j651q02K28J354J464k57j603j203
1908a437m1J304J762J41j677j560p4J382J683J63j521j478j62J113J542N13j091
1925E62j598n98Q98J712Q19j013j816p92R50J840R07r87j797p78Q04J625R47o53
1943A032j681j052N66J594J187l06j684j372M05J658J276k21j587j483K18J595
1959A45J303k3j286j518j74J411J487J85j194j618l75J293J527M20j030j664n35
1976a646J182J468N02p38j642q99J014J656O35o34j566j059Q34J717O93n78j424
1993d85j155N49J617Q66k86j245j349J31J609J232j40j353j549L4J649J267o5
2010A327j147j508j79J482J242M8p64j446p83J165J690M24q80j611q59J151J822
$$ plain form
1891 -1109 757 1978 1032 -837 -1797 -1177 714 1917 1033 -618 -1420 -1192 162 1626 1369 -234 -1437
1908 -1437 -1478 -174 1588 1729 52 -1508 -1582 -200 1483 1646 125 -1353 -1515 -402 1140 1653 562
1925 562 -1036 -1634 -736 976 1795 782 -1034 -1826 -876 964 1871 884 -913 -1691 -887 738 1685 1032
1943 1032 -649 -1701 -1135 459 1646 1340 -344 -1716 -1311 347 1623 1402 -185 -1668 -1450 145
1959 145 1448 1425 139 -1379 -1553 -142 1345 1530 336 -1282 -1657 -364 1163 1583 553 -1111 -1646
1976 -1646 -464 1004 1506 768 -874 -1773 -759 897 1532 898 -668 -1727 -893 824 1517 939 -485
1993 -485 -1640 -1091 526 1392 1106 -139 -1488 -1357 252 1484 1344 -9 -1558 -1524 125 1392 1327
2010 1327 180 -1328 -1507 -25 1217 1265 501 -945 -1728 -563 1127 1551 671 -940 -1799 -648 1174
2027A174M47r68j586p81J074J603L48o21j145j062M96J672Q60m75j358j323L35
2044a310J847J123n49j521j245M95J761Q16n27r59j082j90J325J238m4r00j263
2061i85o12J173J748L17j288j631l38J388J437M0q95j191n68R03J383L24n31j028
2079c54j089K93J763J070p22j627j018O76J785Q63p82j481q23N85J385O77l78
2096H23r06j016k24J255J469J8j335j458j61J473J595r3j531j332J40J360J120
2113A197r0q85j000m65O68J395N91p58j412q04O95J768Q96j099j772m67J054J344
2131H56M29p34j203n65N29J104P33k11j081j077k0J362J420k69j684j125M54J383
2149C01J085k39j433r86M04R81P48J80p24j211m40Q24J438O36j030j609m18J025
$$ plain form
2027 1174 1621 653 -933 -1714 -640 963 1311 690 -455 -1517 -1021 651 1511 1036 -322 -1645 -1310
2044 -1310 537 1660 1111 -410 -1655 -1160 601 1417 890 -69 -1151 -1341 -16 1222 1178 278 -985
2061 -985 -1597 -424 1324 1641 353 -1278 -1616 -228 1209 1249 354 -837 -1405 -502 881 1205 674 -354
2079 -354 -1443 -1150 613 1683 961 -666 -1684 -1008 777 1640 858 -623 -1446 -861 524 1201 823
2096 823 -83 -1099 -1323 -68 1401 1419 84 -1374 -1535 -62 1533 1440 -91 -1423 -1283 77 1197
2113 1197 1107 222 -778 -1243 -575 820 1411 653 -759 -1563 -868 900 1796 697 -1075 -1542 -488 856
2131 856 1285 551 -652 -1217 -688 416 1149 938 -143 -1220 -1240 122 1542 1273 -411 -1536 -1082 301
2149 301 1386 1147 -286 -1272 -868 113 861 1041 317 -894 -1334 -510 928 1564 534 -1075 -1493 -468
2167d68J494N54j151j608j34J053R37M38m18j223p23M90J164R17k95j521j011
2184a505M93J431J151m52j808q62R26J146N69j47j192j049L99J084P67J45r24
2201A72j305j35J139J297K75j361j481K11J210R00K86q81j423n2J045P72L66l65
2219F70j321p09P24J216P71m98j580p11Q87J166O30l84j475p92Q46J044M74p3
2237H85j058j045L12J133Q68M6j244j258L08J220R11R8j154j376L02J265P36Q6
2255A035p60j313j96J081J010L20p12j394m04J020J141M46o40j518n32J026J120
2272G30L94m40j295p29P76J184N18l37j221r14O08J179O25j90j179j032M85J256
2290D18O50j70j006j084J98J194Q26p5r65j084Q0J086Q58J20q15j216j56J021
$$ plain form
2167 -468 1026 1580 429 -1179 -1313 -260 677 1115 697 -526 -1249 -759 405 1322 1027 -494 -1505
2184 -1505 -1012 419 1570 1118 -690 -1552 -626 520 1089 942 -250 -1299 -900 184 951 1096 172
2201 172 -1133 -1268 -129 1168 1443 82 -1399 -1188 22 922 1208 327 -1096 -1148 -103 669 1035 670
2219 670 -651 -1360 -636 580 1351 853 -727 -1438 -551 615 1245 861 -614 -1406 -560 484 958 885
2237 885 -173 -1218 -906 227 1095 1141 -103 -1361 -1053 167 1078 1176 22 -1354 -1052 213 949 1035
2255 1035 275 -1038 -1234 -153 857 1177 465 -929 -1333 -313 828 1274 634 -884 -1416 -390 730
2272 730 1124 684 -611 -1340 -564 620 1138 801 -420 -1334 -726 453 1078 888 -291 -1323 -838 418
2290 418 1068 898 -108 -1192 -994 200 1026 951 -14 -1098 -1018 68 926 1046 231 -985 -1141 -120
2308a20R36K10o22j186m68Q87J172L71o41j238n64P64J144M86n16j181o55O10
2326f11J130N73l25j086q54L33J185Q28k92j193r31L54J217Q31k49j129r06K55
2344h70J071P93j24r01r30m8R24J039J44r45j103j60R23J117K14r57j117j34Q36
2363b28J008K94p17j011l23N13R47O18m74j157o20M85J108P52m61j211o41M57
2381f61J054P00m16j093n21K55P60Q66j4j041q54J15Q19R74J19j095j040R7R61
2400a5R90O5j046q83N7O54Q85L79q21j067j81N88R50O39o40j301l93O68J104N78
2420A210p11j233k99N51Q60P19l89j211m79M35P66P67p4j225q35M03R72Q17j65
2439H79j171p29L43Q13P81J5j090q11K82O39P25L40q38j102L3P93Q18L41p97j122
$$ plain form
2308 -120 816 1026 404 -782 -1250 -363 809 1180 539 -699 -1263 -499 645 1131 615 -566 -1221 -611
2326 -611 519 1092 767 -319 -1173 -840 345 1173 881 -312 -1243 -889 328 1159 910 -219 -1125 -870
2344 -870 201 994 870 -31 -961 -1009 -85 954 1098 153 -950 -1110 -187 930 1144 187 -930 -1064 -228
2363 -228 780 1074 357 -654 -977 -464 483 1101 627 -530 -1150 -665 443 1195 734 -477 -1118 -661
2381 -661 393 1093 677 -416 -937 -682 78 944 930 -111 -965 -850 -31 943 1062 -33 -1073 -976 -15
2400 -15 975 1040 -6 -889 -832 -178 707 1086 265 -802 -983 -395 555 1194 554 -747 -1140 -472 632 1210
2420 1210 499 -734 -1033 -482 378 1097 708 -503 -982 -547 219 986 912 -313 -1148 -745 227 1044 879
2439 879 -292 -1021 -678 135 916 931 -159 -970 -688 -49 676 1016 178 -924 -891 -98 720 1061 264 -858
2459h58q7P00Q23M55o44j136j56N87P13N84l19j194n31N43Q63O58k63j166o09
2478a037M65Q43P14j43j174p15M25P59O88R0j027r32K73R22P23N1r49r68J64Q38
2498A0P58J75q54j011P4P96P21K91o05j174k05Q29Q51L10o09j070k79P07Q32M15
2518I62m50j060m21N68P53M95j39j009p72M66R92N67k43r70p18L20R09O20j72
2537F98r06o58K50P08N71J74o95j002l4R03P57P4o90r60j45Q72R18L4p38q09j31
2558h09O03P16L19l95r56m77N61R48M62l75j013o82N13J163M61n96r10m35L74
2577e28Q54N32k35q07o55J53Q03O87k6p95r19pJ102Q81l00r05o48P6Q18P45j41
2598F85p55n64o4N04P47K98n23q99m08O47J057K25o94q83l19N95J021K19o89o43
$$ plain form
2459 -858 -945 -245 578 1033 389 -747 -903 -316 397 981 662 -532 -1063 -520 343 1001 738 -428 -1037
2478 -1037 -572 271 985 842 -332 -1047 -622 137 825 915 -112 -1044 -771 151 874 925 -24 -992 -828 10
2498 10 768 943 89 -922 -848 -52 669 960 355 -819 -1024 -195 656 966 357 -713 -992 -285 547 962
2518 962 512 -548 -969 -401 352 847 708 -301 -1073 -607 385 952 709 -261 -979 -659 250 870 698
2537 698 -208 -866 -616 92 663 837 142 -860 -894 9 766 840 150 -810 -955 -83 835 869 131 -678 -809
2558 -809 -206 510 829 434 -522 -999 -438 510 972 597 -416 -1098 -585 578 1039 443 -467 -902 -528
2577 -528 326 858 623 -184 -839 -686 117 804 778 -17 -936 -943 159 1040 740 -165 -813 -737 81 826 685
2598 685 -70 -634 -698 -194 553 851 328 -571 -979 -332 725 950 256 -627 -946 -351 670 889 200 -443
2618d43k26K15P13N69k61p92o24J07R22Q09k57r49p25J67J070P37m87q64l81P9
2638f21O15P60l1p42n90j29N23R24K40p84r55k07Q31J078j9r10o60m1N06Q62J99
2659H49p27o32j46K06P45O42l96r72n21L86J052N57n74r55l82L25R02N66n17p64
2679c56k23Q1M84P67Mq48o63MO92Q78Pq95p27N7P56Q33j28q61m74N3L44P17L04
2702H06o26p21j75L77Q01M92n61r73l40N22R62L76o60q13j78L11P19N37l62q44
2722c50l74J71O39P39r3r26o89J92Q75P42k30r29n78J93P14O69j05p80n55P7N20
2743g8P00J90o88q00r0O08P96K02p14q25o2O16P50J93o11p28j54M19O61L60l66
2764C79p77l74L30P80M93l00q52n07L20P80N18k52p94n07K22P00N73r3p03o31
$$ plain form
2618 -443 -669 -454 259 828 567 -225 -849 -742 180 989 732 -217 -942 -775 295 1032 545 -319 -700 -621
2638 -621 -6 754 723 -19 -609 -738 -215 709 949 165 -790 -997 -166 912 893 -17 -677 -718 -212 650 849
2659 849 122 -510 -656 -450 295 937 541 -431 -952 -566 486 1043 469 -486 -868 -543 359 925 408 -356
2679 -356 -579 -498 -14 753 757 -91 -754 -750 -58 820 827 -68 -795 -738 18 851 723 -138 -612 -559 -215 502 806
2702 806 180 -541 -716 -339 462 954 393 -580 -920 -398 564 940 280 -533 -711 -400 319 856 494 -350
2722 -350 -724 -553 86 825 732 -194 -883 -691 184 926 696 -233 -811 -618 96 765 660 -120 -675 -598 -78
2743 -78 622 812 124 -676 -766 -158 638 840 126 -699 -761 -145 605 798 187 -541 -695 -276 385 745 379
2764 379 -398 -772 -442 338 831 531 -321 -828 -508 272 790 538 -256 -763 -541 159 732 639 -64 -695
2784f95M5O68O61L1o93p28k9P09P23N4o44p42r2O26P16J06n67p31j92N63P70K03
2806G62m87p47l15M56Q15L07m38p72m01L93Q38M00l62p48m92K91Q42M33k97o94
2826b16n48J59Q19N44k24o25n66j0P26O88j22o63o21m4O91P01l0o05o44j15O43
2847f2O95l4m92n40k88M41Q17J89n02o12l38L66Q40L14m80p01m01L75Q49K92l74
2868C54n66m60J14Q15N31l14o44n04oP61P27j70p58o06O2P97O23j90o14n53j27
2889g28O81P61j13n74m89k29M56Q76J60o83o97j78N62P83J27n61o04k67M51Q31
2909E65J33n36m76l01J34P92N06m21p20l70J99P68N26l26p14m85J66P81N06k97
2929D30n63l84r8N83P47q0o72n48p2N27P73O9o61o51q8N97P37jn61n14k18L56
$$ plain form
2784 -695 -650 18 679 710 17 -711 -740 -31 692 746 102 -640 -732 -106 610 716 149 -582 -774 -211 559 762
2806 762 275 -472 -787 -331 484 791 353 -419 -820 -427 411 811 449 -299 -791 -500 342 775 478 -216
2826 -216 -764 -605 214 758 534 -91 -657 -667 59 747 625 -38 -659 -703 -12 689 659 54 -590 -705 -62
2847 -62 633 599 107 -433 -721 -280 537 726 224 -388 -726 -360 480 794 314 -387 -788 -413 436 728 354
2868 354 -212 -672 -558 257 788 474 -170 -674 -680 81 808 638 -120 -726 -664 133 756 566 -48 -601 -728
2889 -728 -47 714 601 27 -462 -691 -235 641 801 118 -579 -757 -195 588 715 154 -450 -717 -266 565
2909 565 698 162 -314 -615 -481 311 817 396 -324 -694 -495 273 799 473 -241 -726 -560 221 727 430
2929 430 -133 -517 -615 -32 715 635 -37 -585 -657 -130 643 712 51 -600 -688 -91 646 645 84 -430 -648 -292
2951b92P83K31n33o15k22L04P54M08m66p67l43L72P78L50m12o52l43J93P31N07
2971G66l01o76m33R2O45O20j29p33n47J11O81O17j23o42n27k1N58O59Jn85n66
2992e33p5M66O70J72n39o71j47M87O59J62m62o23k13L87O49K82l79o31k94K63
3012c70O49M00k71o94m10K57O89M34k24o32m65J35O30N12j07n98n58K6O15O18
3032F36Ln94o75j6O39O17Rn77o03q8N52O20J12m52o37k08M64O68J96m10o99k88
3054g31M64P43K13m25o43k90M03O37K37k73n92m05K45O74L87j77n89n49J22P65
3074B16M97k17o46n09J39O51M50p7m96n46l0N54N12N1l91o46k57N77P52O3n17
3095A30o26j53N10O47R3m27n78k31M09N73J89k06n26m98K52Q00L60l46o42m35
$$ plain form
2951 -292 491 722 189 -426 -648 -344 410 818 352 -415 -758 -386 392 742 330 -322 -665 -472 259 766
2971 766 465 -211 -644 -552 93 713 584 -149 -696 -585 96 713 590 -52 -579 -600 -42 617 618 33 -533
2992 -533 -608 -142 528 700 161 -510 -657 -170 489 651 189 -434 -647 -260 389 671 292 -339 -633 -370
3012 -370 279 679 408 -286 -696 -439 250 684 460 -172 -637 -502 128 640 533 -65 -623 -597 18 636
3032 636 639 45 -630 -646 -7 610 619 42 -561 -649 -97 523 635 183 -454 -662 -198 470 666 256 -443 -731
3054 -731 -267 476 689 264 -379 -669 -266 371 608 335 -257 -662 -417 257 644 467 -122 -671 -549 216
3074 216 713 496 -150 -659 -520 131 581 504 8 -538 -568 -14 498 549 158 -488 -745 -168 584 647 130
3095 130 -496 -649 -139 508 601 174 -404 -635 -226 347 536 330 -196 -694 -442 358 718 372 -270 -705
3115g05K44P61L99l05o35l96K33O11L40r9m34n89o7O76O20r6n40n98j04O70P15
3136G01p7o73n54L1N56M89K2l62n17k29M30O35J40l57n51l84L35Q15K59n03o19
3157d13j95L72N92K21k97n17l24J90N56L39j33m44n19j6O88O12j81o69m76Q4O04
3178G4N41j16n77m48K9M82M78P4l91n52k47M36P28J65n13o37j91M62P26J63n38
3199A48o01j01L66N37K14k99n52k99K41O02L79k41o30m12K05O98M38l19o65l23
3219f14K45N45M12j60n61l90Q6M54M61N8n08n75m9N51O22K8n59n68k9M73N67Q3
3241E72n00n28m6L38M84K63l02o14k72L36N84L00l09o35l15L18O22L25l04n98
3261b81k66K37M79L73j06o02m35J74N34M35pn71n73Q0O12M90m3n90n04L7N01N37
$$ plain form
3115 -705 -461 300 699 394 -241 -637 -404 207 547 448 14 -575 -642 34 654 558 18 -580 -684 -14 701
3136 701 624 -49 -603 -572 -16 473 495 133 -384 -613 -183 452 592 235 -316 -700 -365 450 709 206 -413
3157 -413 -608 -236 356 577 280 -237 -561 -371 185 524 391 -53 -572 -588 100 712 531 -138 -614 -530 74
3178 74 615 499 -78 -526 -497 -15 463 537 146 -406 -653 -217 511 676 163 -474 -665 -203 523 686 148
3199 148 -453 -554 -188 349 563 264 -288 -587 -346 256 635 394 -236 -648 -443 255 693 374 -291 -614
3219 -614 -369 176 588 428 -133 -523 -437 17 478 536 28 -547 -596 -45 577 605 46 -522 -551 -78 489 572
3241 572 72 -456 -502 -164 320 583 281 -333 -605 -269 315 615 306 -329 -644 -326 296 621 317 -281
3261 -281 -547 -310 169 542 436 -166 -601 -427 107 542 535 -36 -609 -529 83 573 530 -60 -564 -527 -26 511
3283E11P7n12n96mM58M70J89m05o62j61M85N75J55l73o03j96M02N59K10l39o11
3304c71k10L39M85K86j78o04l31K96N15K93j23n55m38K05N48L65r2n24m32J01
3324d25M85M34J6n17n40N2M94M17J17l99n98j08M99N04J24l67o05j88M01N74K16
3345E86l59o11j88L74N13K48k47o15l13L42N35K45j68n16m08K19N80L60j85n71
3365a79l80J71N33L82j01n21m60J41N26L70k8m33n17l9N11N00K5m46n18q0M64
3386g9N35J02m36n63q5M16M62J28k82n12k32L26N39K23k71n19l08K35N64L05k36
3407C12n62k88K44N03K82j31m68l95J09N06L79q2m71m29K3M85N05kn39n03J9N01
3429bM64J4m21n01p7M37N01J25l97n24j57L27N62K37l83o01j69L70N38K08l09
$$ plain form
3283 511 588 76 -520 -524 -66 404 593 188 -474 -635 -150 425 580 207 -396 -592 -190 369 579 240 -371
3304 -371 -581 -242 243 529 351 -253 -584 -288 227 520 397 -158 -596 -391 157 522 430 -94 -526 -425
3324 -425 60 494 510 -7 -547 -495 -1 416 533 134 -464 -572 -73 431 555 188 -417 -605 -204 370 586
3345 586 227 -384 -572 -198 315 563 316 -299 -612 -270 265 510 342 -174 -582 -363 217 577 392 -179
3365 -179 -559 -388 145 527 426 -95 -555 -414 112 482 454 21 -496 -535 -24 476 501 55 -463 -543 -79
3386 -79 456 558 122 -441 -526 -110 352 480 198 -314 -546 -220 319 542 271 -248 -556 -321 243 548 312
3407 312 -250 -538 -294 209 491 360 -108 -503 -394 112 491 409 -62 -491 -468 17 522 520 -19 -522 -503 -2
3429 -2 462 476 55 -446 -523 -86 415 540 143 -381 -538 -211 351 588 205 -396 -565 -195 343 551 242
3450B42n40k29K78N12K51k52m85k60J65M66L87j53n61l37J66M79L50r1n02l88
3470e02R9M71M06n8m42l88kL46M72J16m59n07l0L63M87J61l79n29j40L67N03J61
3492E16l41m88j83K43M88L35k70n91k24K58M53L19j64n77l24K29M92L28j53m90
3512a44l14J00M28M22o2n54l74J25L84M20M9m78m84N2M38M22L6m22m54n8L49M88
3534C69J71m12n08p1L27M35K16l02n76j48L16M50K17k32m97k23K17M39L11j91
3554C08n21k58J85M09L39q3n06l52J71M25L06l5m41l67N4L57M10M5m21m46OL69
3576d6M23J29l88n48n3M15M32J09l29m83j41L20M57K30k85n49j89K64M58K91k12
3597C05n67k80L13M81K35k06m86k54J87M27K89j10m58l09J23L75L61%m76m30R3
$$ plain form
3450 242 -298 -527 -249 263 514 262 -223 -483 -318 148 535 382 -179 -516 -350 129 479 388 -114 -502
3470 -502 -403 68 474 416 -26 -414 -416 -70 402 518 59 -448 -478 -115 372 533 154 -375 -515 -148 355 516
3492 516 175 -313 -496 -253 235 570 300 -291 -515 -257 196 515 351 -226 -550 -321 171 499 346 -144
3512 -144 -458 -358 70 492 430 -124 -498 -373 11 431 480 2 -482 -430 8 430 466 44 -410 -468 -119 369
3534 369 540 128 -380 -451 -124 311 527 225 -351 -499 -183 267 484 252 -245 -468 -251 188 499 308
3554 308 -213 -471 -286 123 462 379 -127 -479 -308 117 423 388 -53 -420 -366 -9 401 446 25 -421 -415 -46
3576 -46 377 506 118 -430 -483 -68 364 473 144 -339 -480 -160 297 527 242 -307 -496 -232 226 517 305
3597 305 -262 -542 -229 252 487 281 -205 -459 -272 155 444 334 -124 -433 -310 65 426 426 -50 -480 -387
3618c87M49L54k1l94m12J8M05L65L2l51l92p7K94M00J97k98n13j55L33M76J68
3639D91k74m99k11K94M58J91k40m33k06J61M07L10r2m83l44J52M36L39q6m87l72
3660d88J37M84L12q9m13l42N3L52L73Ql61l96n8L44M54J10l82n05n0L88M43O8
3682D42l59m35q7L16M23J43k70m08k09K08M45K66k32m76k51K18M74K67j91m58
3702a74k64J78M06K63j32l88k65N0L49L65j8l92l61J3L47M03K6m03l97LL68L68
3724C45N0l37l67q9K75M03J50l04m02j60K22M63K49k74n10j78K52M63K19k39m70
3745b39k07J96M13K67j49m19k64R6L95L50q8m74l15J10L83L66p5m26l21Q2L69
3766E0L22j5l62l31l2L14L63R4l29m06n0K92M12J27l37m29q5K82L69J72k40m19
$$ plain form
3618 -387 62 416 395 1 -411 -393 12 377 409 58 -334 -411 -117 283 480 182 -331 -486 -153 323 491
3639 491 217 -282 -493 -199 259 450 210 -223 -429 -268 139 449 357 -126 -470 -318 118 457 371 -116 -488
3660 -488 -351 133 445 356 -57 -399 -346 6 379 387 26 -370 -428 -84 370 480 98 -407 -457 -69 374 442
3682 442 83 -352 -439 -123 300 443 173 -235 -444 -236 209 475 243 -233 -484 -266 208 475 284 -174
3702 -174 -438 -260 146 409 277 -111 -376 -326 23 388 370 -22 -383 -370 -23 380 406 3 -394 -391 -23 345
3724 345 395 58 -309 -398 -123 280 430 126 -276 -436 -214 249 498 224 -286 -464 -212 251 470 231 -239
3745 -239 -446 -250 163 430 281 -138 -402 -306 89 439 351 -123 -438 -328 55 421 346 -80 -401 -319 50
3766 50 372 357 -5 -336 -368 -54 309 403 74 -332 -382 -90 322 449 112 -317 -402 -120 249 421 181 -238
3788b38j72K33L80K22j86m32k18J43M00K97j40m39k59J30L80K96p0m22l07Q8L56
3809D2L01ml62l45L3L34L62J0l58l66nK99L76Q7l37m12l3K99L62J28k69m27j39
3832d24K87L95J50k49l96j83K25L99K34k03m52k16K08L73K38j09m24k73J67L99
3852A46K44r8l73k85P2L44L06m2l63l03M5L03L15M2l05l78k7L26L28M4k62l62
3874b83r2K81L63J11k41l76j37K16L64J87j97m25j97K21L99K07j53m08k59J72
3894b47M01K26j23l67k71R8L75K84o3l51l27N6L67K91l0l42l37K5L61L10mk98
3916C4l32l3K96L22M5k49l53r9K63L63J11k32l76j39K35L78J43k29l65j65K04
3937a78L59J75j55l32k28J11L85K31j15l51k73P3L89K80q5l48k82P1L22K74k7
$$ plain form
3788 -238 -410 -177 203 425 239 -193 -411 -268 132 429 289 -150 -409 -279 101 397 327 -95 -402 -314 42
3809 42 343 339 -23 -368 -335 -1 361 371 13 -353 -358 -59 317 404 67 -345 -378 -79 283 411 142 -285 -424
3832 -424 -137 258 408 159 -237 -420 -195 204 438 235 -217 -433 -225 148 386 277 -147 -420 -253 146
3852 146 390 292 -81 -366 -294 50 356 314 -49 -352 -307 -4 311 353 48 -330 -357 -31 297 341 79 -283
3874 -283 -375 -94 269 380 139 -237 -374 -158 206 393 196 -229 -426 -205 194 401 248 -160 -419 -247
3894 -247 154 380 257 -110 -381 -283 92 376 313 -38 -365 -309 58 349 319 -23 -360 -335 26 336 332 34
3916 34 -298 -331 -35 287 332 83 -270 -369 -106 257 368 136 -240 -379 -144 234 377 148 -217 -382 -178
3937 -178 181 356 201 -131 -359 -248 137 368 253 -98 -371 -298 91 371 286 -62 -344 -273 49 323 296
3958B96k90k97m0L03L23J9k57l28p0K62L61Q0k90l44r5K63L47J02k28l28j48K01
3980a58L62J58j99l39j97J55L86K25j81l60k22J56L62K20j17l59k44J00L36K59
4000C43q2l08k58K3L09K99k9l12k90kK97K90J5k63k87m6K53L10M7k44k79j10J99
4023a25L32J33k14l24j31J93L22J43j62l22j87J60L37J86j45l25j87R6L31K41
4043C52r1l41k51P1L25K53n2l04k80L1L10K83k8k76k74l0K60L03M7k62l06m5K55
4066e0K99P2k30l16q7K11L05J02j94k88j36J60L28J64j67l32j60J47L01J73j01
4087B01l15k03J18L05K06q7k83k30N2K69K65m6k90k61M4K72K51Kk52k87pK64K45
4110B33L1k08k63o7J84K91J00j99k94r9J86K82J28j74l05j32J71K93J32j35k80
$$ plain form
3958 296 6 -291 -331 -28 295 314 57 -271 -341 -79 282 362 72 -272 -367 -104 243 345 117 -211 -359 -158
3980 -158 204 362 163 -176 -373 -218 168 393 212 -148 -370 -214 148 368 251 -108 -352 -252 84 343
4000 343 261 -47 -305 -282 27 326 297 -15 -305 -307 -10 280 295 32 -255 -301 -48 262 309 65 -214 -324 -125
4023 -125 207 340 126 -198 -329 -136 186 329 167 -155 -342 -182 155 341 196 -129 -316 -220 111 352
4043 352 261 -80 -331 -260 65 318 266 -38 -318 -287 23 306 278 2 -272 -302 -42 261 308 46 -260 -305 -50
4066 -50 249 321 91 -225 -312 -101 204 306 112 -176 -312 -152 176 340 173 -159 -319 -172 129 302 201
4087 201 -114 -317 -199 106 312 225 -58 -288 -236 33 298 252 -38 -299 -255 17 268 270 18 -269 -276 -12 233
4110 233 264 56 -207 -274 -90 201 301 102 -192 -291 -105 177 305 131 -174 -306 -135 158 290 155 -125
4131a25j73J23K71J96q9l04k18R7L07K23o4l00k48O3L00K28n3k80k30K0K60K42
4153B46J4k33k68l3K41K55M7k06k94p5K50K85M2k05k41r6J74K70P7j42k59j24
4175b75J42K54J50r8k81j86J19L08J49j19k60j84P8K83J86o6k53j91K8K30K22
4196B36Pk21k90j0K83K49Lk17k75l1K32K66L0k07k62o0J90K33J09j48k72j30J86
4219i9K67R1j23k74j65J48K99J22j32k51j32R4K50J55p0k52k01Q5K52J83m1k25
4241a9k37K8K78K19o6k29k09JK24K17L1k13k10m0J94K11P4j72k61q7J76K65O6
4264B41j44k43j08J46K48J01j34k27j19J07K07J46o2k35j82R1K44J69n8k28k07
4285b47M4K47J97n5k25j91K0K20K16Ok25k37oK09K32L2j89k49m2K04K49L2j84
$$ plain form
4131 -125 -298 -175 96 292 203 -101 -319 -222 85 308 244 -56 -304 -241 59 287 234 -46 -276 -256 4 246
4153 246 260 27 -241 -274 -33 222 269 63 -231 -306 -56 229 271 66 -175 -271 -97 173 250 108 -151 -275
4175 -275 -133 121 271 173 -108 -294 -175 133 282 163 -97 -281 -203 80 266 200 -53 -244 -216 14 236
4196 236 243 22 -268 -278 5 254 257 40 -235 -266 -34 232 262 55 -207 -267 -77 156 265 117 -155 -285 -99
4219 -99 168 259 136 -138 -303 -155 144 266 134 -117 -249 -155 95 250 180 -72 -273 -188 64 247 206 -19
4241 -19 -256 -228 50 269 203 -26 -235 -234 -10 207 238 25 -185 -225 -31 180 254 82 -179 -266 -90 175 241
4264 241 97 -146 -254 -108 140 241 107 -120 -239 -132 75 221 159 -76 -258 -167 77 246 188 -40 -247
4285 -247 -203 44 241 186 -39 -230 -210 10 226 232 7 -230 -236 -27 205 237 48 -201 -243 -39 210 242 58
4308E8k23q2J66K39R2j64k26r6J40K17J12r8k31j52J15K37J20q0k22j50Q2K31
4330H5J48p1k02j69M2K12J64j7k08j95J9J93K00Mj78k15l4J95K19J4j68k25l6
4353b23J65K29N8j51k19r2J53K06R8j27k20j10J20K18J14q5k16j43R3K24J25p0
4375A47k14j56P4K03J59m3j96j77K7K13J59jj92k18RK19J92pj78k05j9J79K02
4398A77J7j63k00l9J70J76Q1j22k22q0J32J99P0r2k08j22J15K18R0q5j76j17O7
4421a14J80J29o0j65j62M8J70J60j5j68j91QK11J48k4j56j78j2J84J81J6j51j98
4444a59l0J44J98N7j44k06p9J64K08O2j33j97r0J16K18P2j11j83j08Q7J92J08
4466A86n7j91j39Q0J81J28n5j73j52K7K08J27l4j67j36K0J48J55rj38j70j9J63
$$ plain form
4308 58 -165 -247 -81 158 250 86 -140 -236 -96 121 233 135 -96 -248 -133 104 224 144 -78 -228 -146 85
4330 85 233 162 -40 -209 -167 45 209 192 -16 -211 -192 1 201 205 27 -188 -222 -27 192 206 38 -187 -223
4353 -223 -58 171 229 78 -141 -233 -80 126 224 97 -123 -233 -113 105 219 134 -82 -225 -132 92 217 147
4375 147 -67 -223 -149 54 213 170 -26 -203 -176 37 196 195 3 -215 -206 13 205 198 20 -185 -204 -25 177
4398 177 194 31 -169 -208 -38 138 219 97 -125 -205 -73 126 196 104 -104 -226 -111 107 197 112 -64 -181 -114
4421 -114 66 195 135 -30 -192 -144 26 186 171 3 -188 -180 31 179 155 -1 -179 -191 -7 174 190 39 -159
4444 -159 -189 -45 153 210 66 -140 -219 -55 153 215 82 -115 -205 -89 129 201 90 -93 -201 -114 78 186
4466 186 129 -62 -201 -121 60 188 133 -40 -192 -165 43 170 136 -31 -167 -147 1 156 147 9 -161 -180 -17
4489a7J70L0j47j70n3J49J89L4j31j72o7J12J87P4j09j71r4Q7J85R4p2j70j30
4512a92P4J85J12o3j70j25N5J77J20m0j55j41J0J71J39j9j37j63%J56J78j0j50
4535A2j64k6J52J62K9j27j73m5J36J84N3j32j77o7R9J97O5j09j83o6R3J65J02
4558A80r6j58r9P1J51J06n7j36j34N3J38J44k8j42j28JJ29J41%j39j33j5J23J56
4582A28K7j24j64k4J06J75M1j23j59l5R6J68O3j08j56p2P6J60R0p8j69r9P3J74
4606F6J04p2j76r5O8J45J13m8j51j19M4J40J27j7j35j23rJ39J37Kj45j51K1J16
4630a9J35L9j31j49k0J09J24N1r8j41p0R8J54P6q8j64p0J02J40O9q0j43q9P3J44
4655E2R5m5j29j12L7J31J20j3j65j17J7J30J29Pj32j22lJ18J25Jj03j36j4Q4J38
$$ plain form
4489 -17 153 183 36 -134 -187 -38 151 185 54 -118 -185 -73 114 188 79 -92 -186 -99 86 180 108 -62 -192
4512 -192 -118 67 179 116 -54 -179 -124 53 173 133 -22 -163 -153 18 157 138 1 -162 -162 -6 172 162 12
4535 12 -152 -178 -26 136 165 38 -135 -180 -44 140 193 61 -116 -183 -84 113 178 69 -114 -180 -87 78 180
4558 180 84 -74 -173 -102 49 155 98 -38 -172 -119 19 163 135 -7 -135 -134 -5 136 136 -3 -136 -151 -28 128
4582 128 155 31 -133 -157 -51 124 165 42 -117 -152 -56 112 175 67 -89 -161 -85 75 165 87 -82 -181 -108 66
4606 66 170 98 -78 -173 -105 40 153 105 -46 -165 -121 19 146 129 -6 -129 -138 1 138 140 -5 -156 -135 -19
4630 -19 116 155 24 -125 -145 -36 88 139 41 -100 -170 -72 82 158 70 -94 -164 -62 78 147 67 -76 -165 -92 52
4655 52 147 102 -27 -139 -102 29 149 136 -29 -146 -129 1 130 137 5 -117 -120 -2 123 124 21 -115 -129 -45 93
4680I3N8j01j54m6R1J57O0r3j78n2J06J40O5p6j48n8O6J32Q9o6j48r2N2J43J07
4705A47k7j60j16N9J44J06n0j30j03K5J13J24j2j09j26kJ13J10K7j03j40k3R8
4728c5J34L2r8j26l0Q0J31N9p9j30p5P6J20P4m1j55q5O1J49R1n1j50r4M7J33R7
4754A35l2j32j15M5J21J16j6j15j32j1J25J36pj16j18j7J22J18J9j07j33qQ3J28
4778H9L0p0j18o2P7J41N2p2j34o6N6J53O0p1j24p0N1J27Q4l5j34r9M5J21Q2j3
4804A00j20j02NJ38J10k1j16j05NR5J09J1q7j27j1Q5J17L9q2j29m9Q9J27N0p2
4829E9j33n9Q2J25N7n9j34n6O3J06Q8o9j18p6M3J28R6n4j17j05L5J28R3l0j18
4854b5r2QJ18J20k2j15j00jJ03J13Pr4j31k4J19J07K8r4j04m5Q5J28K5p0j18l7
$$ plain form
4680 93 151 50 -104 -150 -59 98 158 65 -113 -165 -59 81 146 70 -78 -136 -70 62 151 85 -63 -155 -103 40 147
4705 147 120 -40 -156 -97 47 153 103 -27 -130 -105 8 132 120 11 -115 -117 -4 106 133 30 -110 -133 -35
4728 -35 99 131 33 -93 -123 -43 88 147 68 -62 -137 -61 59 133 92 -63 -148 -87 62 153 102 -48 -142 -95 38 135
4754 135 103 -29 -144 -99 22 138 122 7 -125 -136 -11 125 118 2 -116 -133 -11 107 126 19 -114 -122 -39 89
4778 89 119 49 -69 -131 -54 87 139 67 -67 -133 -77 76 136 65 -59 -129 -78 49 133 98 -36 -135 -90 31 113 100
4804 100 -20 -122 -117 21 131 110 -6 -111 -106 -11 98 109 22 -105 -116 -31 86 125 43 -86 -135 -46 81 131 59
4829 59 -74 -133 -51 74 131 72 -62 -118 -55 51 139 70 -48 -124 -81 47 143 89 -28 -133 -98 30 123 93 -25
4854 -25 -117 -109 9 129 107 -8 -108 -109 -6 107 114 20 -111 -135 -16 91 119 25 -79 -124 -39 89 114 44 -74 -111
4880a11N0J11P2m6j26p0N4J10O6k9j12r4L1J35P1k6j17q7K2J02J12j4j16j09L0
4905i1R9R5K0r3j35k0J15J26Lj01j13k6Q2J35L5r2j32j4P2J07N2p0j19p5Q5J21
4931F6N6o0j05p5L7J42P1n7j25p4L5J08Q9nj13j04K6J09Q8j7r3j13NJ13J15Lj14
4958Hj05NQ3J00K9q7j22k7Q6J08L1n9j09p2Q4J23M8p2j06n3M4J24O2n8j10o9N1
4985f3J06P6l2j09j04L2J28Q1l3r3q6oJ31R6j7j25q6J5R1R1Rq4j15nJ03J11oq1
5013B5j15l0Q3J22J4p1r6k9O1J08L8n5j12n7O3R7N8l0j10p8M4J18O3l6r7q4K1
5040h5J05P9j6j04q4J1J14R1oq2j23j2J12J05Nr8j07k3R1J23J6p6j14l0O6J08
5066F6M8n7j14o9P2J31M4o2j03p1N3J09O4l5j13p1L8J11P4k1j04j06J9J20Q1k4
$$ plain form
4880 -111 -61 50 122 76 -50 -120 -66 44 110 81 -31 -125 -94 41 112 86 -31 -118 -96 6 118 104 -12 -121 -91
4905 -91 8 103 123 30 -105 -125 -10 116 119 18 -95 -121 -39 96 131 39 -93 -107 -35 72 124 54 -65 -140 -55 66
4931 66 122 62 -43 -118 -81 61 132 75 -50 -124 -89 19 108 103 -10 -114 -88 21 109 92 -1 -114 -109 4 119 122 8
4958 8 -97 -92 -9 91 120 33 -89 -116 -30 78 109 50 -59 -131 -47 76 124 52 -54 -107 -63 61 123 65 -45 -114 -63
4985 -63 43 119 87 -22 -126 -94 34 115 82 -11 -97 -103 28 124 107 -18 -104 -89 2 93 102 18 -97 -102 1 112 106 25
5013 25 -90 -120 -37 85 99 28 -68 -97 -36 72 110 55 -57 -114 -51 46 104 74 -36 -114 -70 48 111 75 -22 -106 -85
5040 -85 20 99 83 -21 -105 -94 20 111 105 23 -100 -112 0 105 110 12 -95 -118 -27 96 112 36 -78 -108 -42 66
5066 66 114 57 -57 -126 -54 77 121 59 -44 -115 -62 47 111 76 -37 -108 -70 41 115 94 -10 -116 -97 23 104 80
5092H0q6r0LR8R7J0j03j04RP9R0K1p9j24j8R9J14J0p3j08l5P6J10L9p5j06l6N1
5120e1J18L8l5j10o8M1J12O5l7r7q0J8J21P5k9j05o5K0Q2Q7j7p7j01kR4R6Jo8
5148B6j17j7J00J13jr6r5j5Q9Q7L3p0j15k5P5J02L8o0j17n5P3J12N7n7j12n1M2
5175e6J08O5n4r9o5K9J07O4k0q6r3OJ08Q6rj00r6J6R5R4Lq5j05j1Q6R5J8p6j02
5204g7l5Q5J08K2o9j00l4N8J27L7p3r9o5O0J09O5n0j04p6M7J03P4l1j04q7J0J14
5231A5R1j4j06r2J8J11Q4j0r8r9MR3R4J3q6r7j7Q5J13K0r8j10k1Q2J17J9p0j01
5259f0m3P8R3M8o5j03n6M8J07O8m8j14o1L6J11P9m6j01o9K5R8P2k2q0p7pJ07P7
5287I5Jq5j02rR3J07J3r7j04j1Q9R6K2p7j02l2N4J26M0o6j09n5N7J34N1o7j17
$$ plain form
5092 80 -6 -96 -93 5 102 112 9 -95 -86 -7 83 104 25 -99 -117 -18 96 106 33 -75 -110 -34 76 115 40 -66 -102 -51
5120 -51 67 105 70 -40 -108 -67 45 110 73 -24 -104 -86 35 110 81 -24 -89 -69 13 100 83 6 -95 -97 -3 93 94 26
5148 26 -91 -108 -8 105 104 8 -87 -102 -13 74 107 37 -78 -103 -28 74 112 52 -65 -120 -47 65 122 65 -47 -98 -56
5175 -56 52 117 63 -36 -101 -72 35 99 79 -7 -100 -94 14 100 91 -9 -105 -89 6 100 103 18 -87 -98 -12 83 101 25 -77
5204 -77 -112 -27 81 103 34 -66 -100 -42 85 122 49 -50 -115 -55 54 119 69 -35 -111 -64 39 113 82 -22 -109 -99 15
5231 15 106 92 -14 -106 -88 23 107 97 -1 -100 -96 -3 91 104 18 -79 -96 -11 102 122 24 -86 -107 -25 92 111 41 -60
5259 -60 -103 -25 68 116 51 -52 -108 -60 47 115 67 -47 -108 -72 39 118 72 -29 -98 -73 25 97 75 -5 -82 -89 18 95
5287 95 96 11 -91 -100 -7 100 113 16 -88 -99 -10 86 108 31 -71 -103 -49 77 117 51 -58 -113 -56 78 129 62 -55
5314e5o4O7J05O3m0j13p0L6J17P2m2q4r0PJ20R1l0j00r3K0Q2Q8J8j01r4lJ07P7
5342I1No9j11k1P6J15K9r3r6k4O3J07L8p4j08l9P4J11L0m8j12m3L9J10O2n1r9
5369c8p0L2R5R6k9j08o7J4R3P0jq6j04QJ04R5%r7q3k1P5J19J7r5j15j8Q3J11K7
5398A07p2j12l2P7J09K7p0r5o9P2J33M2n9j09n8M9J19O2n1j14p6M9J21O0l4r7
5424b1p9QJ10P9rj01r3J1R2Q5K6q9j07nQ0J06J3p9j00l0P3J11K0o2j03m0N5J22
5452G3M2n6j26m5N2J15N5l2j25o9O1J07P4m8j23p1L3J06Q7j8j16p9MJ20R2j4j13
5479a4r9PJ08Q5Jp7j03KQ0Q7L5r0j05j1O5J04L0p0j01m2O6J13M4o4j11m4N5J01
5507E2M7n9r7n3N0J04O4l0j17o2J6J06P4k1r9p5PJ05Q5qq5q9j7R2J07mp7r1k7
$$ plain form
5314 -55 -119 -52 53 116 76 -37 -107 -71 46 118 76 -8 -98 -91 29 120 90 -10 -103 -83 -1 87 105 4 -90 -93 14 91
5342 91 96 27 -84 -105 -29 86 115 22 -74 -98 -35 72 110 36 -72 -111 -37 74 104 56 -56 -99 -60 50 112 61 -38
5369 -38 -108 -76 19 115 86 -22 -89 -75 18 88 87 1 -103 -95 9 104 104 7 -76 -97 -22 97 114 19 -96 -114 -31 80 107
5398 107 35 -77 -109 -32 77 104 34 -61 -130 -58 75 117 58 -51 -109 -60 59 121 70 -44 -120 -71 50 110 76 -21
5424 -21 -100 -92 18 97 88 -13 -106 -95 -3 82 108 19 -88 -93 -13 93 106 27 -73 -103 -30 81 101 39 -64 -104 -49 73
5452 73 115 59 -67 -112 -60 55 110 78 -47 -116 -55 52 126 78 -45 -116 -83 23 110 92 -24 -103 -99 21 113 99 -14
5479 -14 -113 -106 2 87 88 11 -92 -90 -10 77 112 22 -83 -94 -29 75 105 35 -66 -108 -42 71 115 51 -60 -104 -49 52
5507 52 99 40 -57 -110 -60 44 108 78 -39 -101 -85 21 95 74 -25 -100 -93 12 97 89 4 -85 -102 -10 97 93 16 -75 -102
5536a02Q7J01K9p3j22j3O6R4L3o7j00n5Q3J03N3o1j14o9O5J16O6o8j12o1N5J05
5562C9P2m4j06p9M2J13N4j0j04r1K4R8R6j4r9p9KQ1R7jq7r2j5P2J01M2p4j06k9
5591i7N1J07M8p1r5o1P1J04N4o1j03n6M3J11O0m3j14o5L7J13Q3m0j01p6K2R7Q8
5618A06k0j02q5MJ04R3nr8p9j3Q9J11pp8j10k3Q1J17K3p9j02m0P2J18K9p1j00
5645f5m4N8J14M8o1j02n7M1J19N5m6j04p4M0J08O7k2j04o7K3J02Q5l3r0r3J3R6
5672GR7kj03r4JR2J03Mq7r5k0N7J12L2p9q9n0O2J18N2o5j12n5O3J09O3p1j02n2
5701a04M7J03O3l3j12p2K9J04R0m0j01q0K2J12R0k4j11p8RR5Q4nr6q2jR0R4Kp7
5730A8r0l6P9J12Qo9q8l6N8J08M5p2q9l6L6J03N4m9r1o0L2J12O1l3j08o9K6R7
$$ plain form
5536 -102 -15 86 115 42 -80 -93 -27 67 100 33 -67 -122 -39 64 117 56 -58 -127 -62 54 120 52 -60 -121 -66 39
5562 39 111 67 -39 -118 -76 37 91 81 -23 -114 -90 8 104 90 -9 -88 -86 -5 92 91 4 -88 -103 -31 70 112 38 -68 -97
5591 -97 -46 61 109 38 -57 -118 -47 57 111 50 -53 -109 -66 45 105 62 -52 -117 -80 33 116 76 -25 -101 -79 18 106
5618 106 86 -16 -101 -97 7 100 95 -3 -82 -95 -6 105 98 20 -90 -113 -32 85 108 29 -73 -113 -41 77 106 35 -65
5645 -65 -109 -51 63 111 50 -52 -109 -68 51 106 60 -44 -118 -78 30 97 75 -29 -96 -73 29 114 81 -9 -102 -89 7
5672 7 104 102 -1 -95 -94 -2 101 105 18 -77 -97 -40 72 104 25 -64 -114 -52 66 118 53 -59 -114 -51 58 121 50 -52 -104
5701 -104 -57 46 109 76 -36 -108 -79 25 115 75 -26 -106 -84 28 118 94 -17 -95 -86 9 93 88 -8 -90 -91 -1 93 95 18
5730 18 -72 -108 -29 83 91 22 -66 -102 -44 64 109 37 -52 -88 -52 51 105 56 -35 -95 -63 49 110 77 -31 -100 -74 23
5758B3Q6l6r2p8K1R3Q7j3r0j00MR1R9Oj05r6qQ8J20Pr4r7j9Q2J04L2q6j09k3O0
5788d3J01N5o2r8n6N6J04O1p1r9n7N5J09O2m6j09n5K4J08N6k3r5q6K3J03Q5k3
5815G9r2q6K5O9J03j6q8q4%Q1P7K2o3j05j0O6J02L1p0j10m4O8R8O0n8r8m4L5J03
5844E1O6m9j14n2L5R2P2k2r8q1K7J05O0j0j04p4J2R1J01j7r8q0PQ8Q6kp2j00r
5873h9P5J11Pq2q9k1P2R4K2o8q7l4M4R5N4m8j09l1M6Q7O7n5r4o1L0Q6O8k8j03
5902d1m8K5Q5P7k9p2q0J0Q1P4j6o6q4jQ8R4oq6p5k5Q1Q4J2n5r6j8O4Q2M4o5r9
5933f1l2N2J02M9n4j02n6N0R8N9m7j01n2L6R5M6j5r7o5L4Q8P4k9r4p5K3R2P2n
5962H5r2q0J0Q5P8po8q9pO5Q8J2o5q6j8O6Q2L2o3q8l8N0R3M4m4r3n1M3P9P8l7
$$ plain form
5758 23 109 73 -19 -97 -76 17 104 91 1 -99 -95 -4 95 101 -4 -100 -108 -20 100 107 13 -84 -103 -21 83 115 29 -80 -103 -43
5788 -43 58 113 51 -47 -103 -47 57 118 47 -52 -109 -54 55 117 71 -38 -93 -69 39 95 72 -23 -109 -86 17 102 79
5815 79 -13 -99 -74 -5 98 82 -6 -90 -90 -9 68 90 27 -78 -88 -22 80 111 41 -69 -113 -45 53 113 55 -43 -87 -52 51
5844 51 117 68 -46 -98 -63 29 101 79 -19 -100 -73 32 92 82 -22 -96 -84 7 108 91 -7 -87 -80 8 94 92 20 -80 -89
5873 -89 -14 97 104 22 -67 -88 -16 78 100 32 -55 -89 -45 50 104 56 -53 -84 -38 49 116 61 -33 -94 -64 22 90 62 -41
5902 -41 -89 -64 21 98 69 -3 -83 -73 8 82 66 0 -84 -85 3 97 91 5 -70 -95 -14 70 82 27 -69 -87 -23 59 103 38 -61
5933 -61 -93 -41 61 110 56 -46 -102 -52 46 105 58 -43 -95 -59 36 82 67 -30 -95 -61 27 101 72 -22 -97 -74 18 90 85
5962 85 -7 -87 -77 8 86 79 11 -78 -85 -20 68 80 15 -71 -89 -23 59 91 28 -60 -98 -48 45 89 45 -48 -99 -56 23 101 64
5993F4r7n1J7Q5O3j7q3p6L3Q0O7j4q5o7NQ6P1lq9p2lP9P8J9p7p7k2P5P8K2p9r2
6025h2nO7P9L0o0q7k4M6Q7M8o1r0l6L9Q9M4k4p9o5J6R8N2j4r5o2J9Q3O2j0p5o8
6056g8OO9Q1qo6q6KP6Q8lo6p4j9N8P9J7o7q1j6N5Q9K8n6p8l5M6Q5L8m3q9m4M7
6088d5P7N6k8q4n6L2P2O0k6q2p2K1Q9O5j8p7o5J8O9O6oo4p7MO7Q0oo0p5j3P2O8
6120F2J8o3q5j2N8P4L1o2p5j9M5P1M5m4q6m0M1Q1M4l6p2o1M2P3M4j1p6o8K3N3
6150eO7ko2o7QO3P6oo6p4nO9O4J1o3o2k9Q1O5K1o1p9l3O6P3J4l7p0l7N3P9L1k7
6183E6r9l9M8N7L9j7q5l4K8P0M7j1q2m8MP8N8mq3m9K2N2N9Ro9o0j5N9O3J2n0o7
6215e1oM1P1K0n1p4j6L4P4K7l7o9k6L2P5J3j0p4m4K3Q0L8l0o2m6J5O7O4j8o9n0
$$ plain form
5993 64 -33 -84 -67 18 81 64 -19 -95 -62 18 85 71 -14 -81 -76 10 81 78 -11 -83 -86 -7 71 90 13 -64 -86 -11 67 89 10 -82
6025 -82 -87 -20 59 89 29 -58 -82 -36 51 99 38 -52 -88 -49 40 84 60 -19 -84 -68 30 82 68 -27 -89 -70 13 75 65 -10 -78
6056 -78 -72 -3 78 70 4 -82 -80 -4 84 81 15 -59 -78 -20 59 76 9 -72 -88 -33 56 84 28 -50 -85 -39 46 84 41 -48 -92 -45
6088 -45 32 88 60 -24 -80 -48 24 84 58 -24 -96 -75 14 79 61 -16 -81 -63 6 72 66 2 -75 -71 -4 76 70 10 -65 -78 -6 62
6120 62 80 17 -68 -80 -22 52 83 21 -54 -73 -28 43 88 44 -42 -82 -41 40 84 48 -24 -85 -43 30 74 63 -13 -81 -58 -5
6150 -5 62 60 -2 -69 -61 2 78 72 6 -68 -73 -4 60 71 8 -54 -83 -2 63 84 23 -56 -89 -23 50 64 27 -43 -80 -27 52 83 56
6183 56 -43 -82 -34 23 62 45 -40 -74 -46 24 71 60 -22 -70 -66 12 70 66 -17 -66 -44 8 67 76 7 -53 -68 -9 54 66 16 -51
6215 -51 -57 -16 55 75 24 -50 -66 -32 42 69 32 -37 -63 -31 44 57 47 -27 -71 -48 32 70 40 -22 -68 -53 14 78 60 -9 -59
6246e9kP4O5j4o7n8nN9P8Lo0o2j5N0P5Oo4o5mO1O2ll1o6l0M6O8K1m0o3l6M9P2
6279D5K2l4p0k1L0M8M7l5n5n2J9O6N1j0o1n2LP1O2j3p1m8RN1N3On3m9j1M9O8j3
6311E2l3o6j7M2O2L0o0n9k2N2M9L1l2q1k3M1O6K5j8n7l7NP0N0k4o3o2L5N6N5j6
6342E1o9m9K0N9N2j6n2n5LM6P0%m9o6mN7N7J0n9n4rM0N2J6l8n3j1K1P2J3k9n4
6374b8m1L7O6K5k1n6l1K8N4L4k2n4n2J4N1N3j4n1o4K5N1N3kn2n9mN9N6pm0o0j
6406e3M6N2J9n7m9k0M5N9J8m2o7j8L9Q6J6n0n3l5M1N7L0k6o7k8L1M8M4k0o8l8
6436f0J8N3M8j4n7l7lN5M7Jn7l1j0M2M0J5l8n6k1O3N4jk6o6rL8M4K6m6m0l0M0
6468a8M7L3k9o5j7K1O0K1l1n3l2K5N8N0l3o1k6RM8M6mo6m0NN1M8%m1n4oM7N9%
$$ plain form
6246 -59 -61 13 78 64 -3 -61 -66 -7 71 74 14 -48 -63 -13 62 68 4 -61 -65 -4 58 55 24 -42 -72 -26 42 63 23 -40 -76 -27 45
6279 45 67 33 -37 -58 -28 20 67 32 -23 -75 -56 10 61 51 -10 -62 -59 12 74 61 -10 -58 -49 2 55 61 8 -41 -52 -3 65 52
6311 52 19 -47 -64 -22 40 70 10 -49 -71 -19 30 61 29 -52 -75 -34 32 57 39 -18 -55 -50 20 70 46 -17 -79 -44 12 67 51
6342 51 -18 -67 -47 12 64 48 -4 -59 -56 -10 60 60 11 -55 -59 -2 55 65 6 -48 -57 -17 35 51 13 -40 -51 -30 42 55 26 -28
6374 -28 -69 -32 34 59 38 -18 -49 -21 33 67 45 -9 -61 -47 4 57 43 -8 -72 -47 4 57 55 3 -56 -60 -1 55 48 8 -52 -53
6406 -53 -7 45 64 7 -42 -62 -17 42 60 18 -49 -67 -28 58 74 24 -29 -64 -23 34 64 38 -29 -57 -26 22 66 46 -22 -60
6436 -60 -42 11 59 45 -12 -49 -52 3 50 51 -6 -37 -47 -5 35 50 12 -44 -65 -2 52 51 25 -41 -50 -12 32 58 12 -28 -58 -18
6468 -18 29 62 33 -32 -49 -28 32 53 22 -31 -63 -38 20 70 37 -24 -50 -41 7 53 49 -17 -57 -52 -1 47 47 6 -48 -54 -7 52 52
6501E2m6n6oM8M5K1m3m7k1L1O4Kk0n2k0K2O9J2k3m7l6K9M9K8j3o6l2K4M9L0j0
6532C7m6m3J5N3M0j1n4m1lN0M6Pm2m8j9N7N7ll8n9j7M2O5J3m4m6k9M0N8J4m1n3
6564d3j0J6P0K3l5m1k9K1N6K2k7n6k7L2M8M0l1n8j9J2N3L8lo0m5jN6M8ll5n2K
6596c8M2M7Mm4m8j6L8N7Nk4n4k3L9N1J7l5n1k2K2N8K1k2m7k1K8N2J8k3m5k9J5
6627b8M2L0kn3k8J4M1L6qn1l6MM3M6Jn2m6PL4N9km1n0JK6N7Qm5l5k6M7M4K1l5
6661B3n6j9L1N3Pk0m4k2K0M9K8j7o2k2J8N4K3j8m3k5RN2K5rl9l8QM0L2Jl8l0p
6694c6L1N1Mk9m8j8K8M5K8l5o0j1J7O7L0l9m4k4J5N5K0j3n7k8J9N6L9m1l7j9Q
6725b6L8L5j5n0l0J5M9K8mn0m2PM3L6J1m4m8jM2N1Qm9m2%K5M5J5l0n3j2L6M6J9
$$ plain form
6501 52 6 -50 -56 -8 37 58 15 -32 -53 -22 42 44 24 -28 -48 -26 43 55 32 -15 -51 -22 27 55 42 -24 -56 -32 17 47 37
6532 37 -9 -52 -37 16 56 45 -9 -50 -53 -3 43 50 8 -40 -59 -2 55 52 14 -45 -62 -20 45 58 14 -32 -61 -21 37 51 10 -43
6564 -43 -53 -37 33 56 21 -20 -49 -28 28 50 23 -33 -60 -28 20 60 29 -29 -48 -36 17 55 52 -8 -53 -54 2 50 47 12 -40 -38
6596 -38 4 51 55 11 -37 -53 -15 42 47 23 -31 -54 -15 36 53 18 -33 -55 -33 25 46 24 -23 -44 -16 36 54 31 -14 -43 -28
6627 -28 14 44 42 -11 -39 -25 16 52 44 -7 -43 -39 4 50 51 -1 -47 -40 -6 53 51 10 -40 -39 -13 44 52 7 -28 -54 -7 37 58 23
6661 23 -33 -52 -21 32 39 19 -25 -47 -27 22 50 33 -29 -51 -33 21 44 26 -17 -42 -33 19 44 35 -4 -42 -34 6 38 39 1 -29 -36
6694 -36 -5 46 50 21 -27 -45 -17 28 56 21 -39 -50 -33 34 64 25 -19 -43 -28 27 47 34 -23 -51 -32 24 63 22 -15 -34 -26
6725 -26 12 47 32 -18 -48 -33 16 44 40 -10 -52 -45 -2 34 45 1 -47 -48 -6 45 53 4 -38 -38 -13 32 47 17 -36 -48 -12 34 53
6758E3l1l9l4L8M8K5m1m0k2RN5L3k0n7k6J8N4J9rm3m3J2M8M1km6l4nL4M9Km9m4
6791d7%M6L4J9l2n5k5M4N6Pk8n5k0K6O1K2l6m8j3K5N2J9k4o5l3L6M6L3k8l5k9
6822d7J0M8K9qn2l4J6L5L6j0k4m0LM9K7lm2l8jL6M5J3l9m6LK9L9K1l8n2j6K9M2
6855B0L1l8l5k6QN6M1k3o0j8LO9L2l7l5l8RO0L9j5m4m8ML7N0j2l6l9J1L3N6%l8
6888A7m9j5L8L9J2m0m4j0L8N5J3m3n4kK5M6J8k2n0k2K1N8J6j8l8l7J6M2L3k7l3
6919a7l4K2M7K6j8l1n3J3O5J0km0k8KM4L0Ll6l2k1M5L7Nl1n1KK6N2Ql5l6k0L1
6952a7M7K2l3m8l5K8O6K8k7n2l0K4O2J1j3o3k5J2N3L6mn4l1J1M5L3j3l7n0J2M8
6983FL3Jl9m4RL4L6Ml8m2j6L3L5J9k1l8rJ4M4J8j6l8l3J3N0J5j0k1k7MM4K1j4
$$ plain form
6758 53 22 -17 -51 -13 35 60 19 -21 -43 -34 21 54 34 -23 -49 -31 23 42 33 -10 -53 -41 7 48 46 0 -34 -39 -5 44 46 -3 -47
6791 -47 -47 -1 33 52 20 -35 -60 -16 40 47 19 -36 -56 -30 31 53 17 -31 -44 -19 33 52 28 -37 -70 -34 12 45 17 -18 -47
6822 -47 -37 11 40 32 -20 -54 -38 -3 33 23 -1 -41 -38 11 38 35 -7 -45 -46 -10 35 48 9 -37 -34 -5 34 55 17 -35 -51 -22 20
6855 20 51 13 -22 -48 -40 16 57 34 -26 -44 -41 28 60 23 -12 -50 -41 19 58 43 -1 -49 -45 -8 42 30 -6 -45 -34 -1 55 55 17
6888 17 -32 -47 -9 30 42 2 -42 -52 -14 41 54 11 -43 -45 -20 26 44 22 -28 -50 -29 29 45 27 -11 -48 -32 10 43 16 -17
6919 -17 -51 -29 18 44 26 -5 -58 -45 20 30 28 -12 -40 -38 6 36 39 3 -29 -50 -5 32 37 6 -45 -43 -17 35 43 8 -28 -48 -17
6952 -17 30 52 19 -29 -64 -36 30 58 31 -21 -51 -27 35 46 33 -30 -55 -43 10 46 42 -12 -43 -32 13 46 33 -4 -54 -42 6
6983 6 39 40 1 -43 -34 0 36 40 2 -40 -56 -23 12 31 10 -28 -37 -23 21 39 23 -15 -48 -35 15 30 20 -1 -28 -24 20 41 27
7016B7m1l3J2M7K2jm0l4J3L0M1j1l3k6kK4M1Jl4l9j5L7L7J4l3m0j8L7M7Qj3m0
7048a5k8M2K7J7j7m5k0J9L4K3j7l5j7nN9K3k2l5k7ML8L1mm0k1LM0J7Mk9k2j8K9
7081gL4Jj9l3kK0L2Qk8l0j7K4L9J4k5m0j1J8L4K9j6m5k7K5L5L5k8l1l7K1M9K0
7113D2j5m7k5J3L1M7k4l0k9lM0M0j2k8l2nK8M5%l5l6MJ9L6K8m6l3j0J2M4J6j4
7145B1m7j8K2M5K6k0m4j6OM7K7k3m6k5J3M5K7j3l1l8J2L0K9Rm9l0PM3K7nk3m1
7177c3NJ9L5Qk8m8kK2M1J6k8k9k5K5N6Jk6l8j8J8N3J7k5l7k4J6M2K8j3m7k2QM1
7210HK9j2k3l7J2L9J5Jl1l1pL9M1jm3l1KK8L3J5m5k8oJ4L9L1l8m2lK1L4K4k9l3
7244a5k7K6M1K1j7m0k4J0M8J4j5l2l7QM5K9Jl2l2KL2M1j3l0l7PK6M6rl7l2%J8
$$ plain form
7016 27 -14 -47 -35 12 34 33 -7 -41 -28 2 43 32 -1 -27 -29 -5 36 37 3 -36 -51 -14 23 37 4 -36 -54 -17 30 38 25 -15
7048 -15 -43 -1 26 43 26 -19 -39 -20 14 37 20 -15 -32 -37 22 45 23 -12 -39 -35 3 34 30 -10 -31 -28 12 29 33 4 -18 -36 -7
7081 -7 27 28 9 -24 -26 -6 26 34 6 -24 -41 -17 22 36 11 -29 -40 -22 12 41 25 -20 -47 -22 13 48 20 -11 -48 -27 22 42
7113 42 27 -20 -45 -32 -1 46 22 -8 -37 -40 0 40 28 0 -32 -37 -9 36 36 1 -35 -31 -12 24 52 6 -27 -37 -25 19 35 21
7145 21 -26 -44 -22 23 49 29 -15 -31 -25 22 49 26 -20 -45 -32 13 40 27 -4 -42 -30 0 29 38 -11 -41 -34 9 36 31 8 -33
7177 -33 -28 -9 26 34 6 -42 -44 -22 19 35 7 -22 -47 -22 34 35 9 -29 -47 -29 24 41 16 -21 -45 -29 13 41 28 -19 -41 -33 8
7210 8 37 25 2 -35 -23 16 31 32 1 -30 -37 2 43 42 -1 -32 -30 -2 31 46 1 -27 -33 -19 20 51 13 -29 -32 -11 23 47 18 -15
7244 -15 -42 -16 25 46 29 -11 -35 -25 23 37 22 -10 -47 -39 6 35 36 4 -28 -26 6 47 34 4 -33 -26 0 46 37 0 -32 -32 -14
7277a4N0Jk5m3j1L0M1Qk6l2j2J8M9J0l9l3j4K5L6J8j1l6k9K1L3L5j9n2k3KN5K2
7309C5qk9l1K0J5M4j3l4l5J1K9L4Kl3m6LK6L5J6l3l2k3L4L0J6k3l4rK5L3Rpm8
7342b1k1J4M3K1j7l2k1J9L5K7j9l7k8QM4K1j3l6l3K3L0M3k1k9k0kK7L3j1l1k3
7373b7nK6L5Rk7m7PK7K2J3l0l5mJ9N2J5l5l4pJ8K9K7j7m6j1J2K7M0k0m3j8J2L6
7406B0K4j0l7k1%K6L8Mk4n0kL5L0Ll1k1k6L8L8Nk5l6j3K2M5J1l4l6pL8K6J1j4
7439B7k7k5J7M1J3k6l8k7K6M1K4j9l2k0OL6J8ql9k4J5K4L6ol2k7lL0L5lk8k6j6
7472c7L4K8K0l2m2OK4K3Rk4l2qK7K6J0j3l6oJ4K7J5nl7k1J4L0K5j3l2l6K0K6K7
7505C1Ol4l6J0L4L6pl5m5J0L3L3Mm9pj5K7K4J7l9k5j6L4L9Rj9m6mJ3L9Qj5k8j8
$$ plain form
7277 -14 36 37 12 -31 -42 -12 29 37 11 -21 -33 -15 34 44 5 -28 -42 -17 19 37 26 -10 -39 -18 15 50 31 -21 -44 -42 13 35
7309 35 27 -2 -33 -13 2 46 33 -1 -36 -25 4 38 40 7 -39 -36 -10 25 41 8 -24 -47 -13 17 33 10 -24 -33 -8 25 34 27 -21
7342 -21 -42 -28 15 36 19 -13 -34 -15 20 47 28 -9 -37 -29 15 36 23 -13 -46 -23 7 50 29 0 -20 -22 5 38 27 -4 -27
7373 -27 -32 -6 29 38 11 -36 -29 -2 20 33 3 -32 -36 -17 35 50 15 -19 -26 -8 21 48 31 -15 -26 -14 13 53 33 -10 -28 -16 20
7406 20 44 34 -3 -24 -24 2 40 44 20 -30 -32 3 33 36 5 -16 -42 -4 34 39 14 -22 -35 -13 32 43 9 -27 -34 4 30 41 27
7439 27 0 -25 -8 33 46 20 -18 -45 -19 22 46 27 -5 -25 -19 17 35 27 -12 -36 -21 3 39 33 1 -26 -29 1 36 33 5 -21 -37
7472 -37 -3 25 45 13 -29 -23 1 24 33 9 -23 -31 -4 22 32 19 -17 -23 -9 18 33 28 -9 -30 -16 14 39 26 -6 -42 -22 4 31
7505 31 37 3 -33 -23 11 47 40 5 -40 -30 3 36 40 -9 -16 -31 -4 20 37 -2 -27 -43 -9 30 39 20 -26 -30 -17 22 30 15 -13 -31
7539c1J9K7K9k4l3j6oM5J6ml2j8MM5J8j3l0k4RK3K4Lk9l9jL4L9jk4k8qL4J5J0
7573C3k4l0j6K8M1J3j9m3j9L3J6K1rn0kJ8L2J4j6k5k6J4L3J6j4k1k7kM3J8Kl4
7605bk8jM1K7ol7k2nL4K6Pl3k5j1L0L6mj1m0j0L6K1J7l0j7k4K7K3J6k4k4j5J3
7638a5M4Rj2m1j4J2K4J8oj9m0J1L6L1j3k6k1oL0L1mk7l0rL5L1Mk3k5j5J5M0J1
7671C6l4k9kK2L7qrl2pK2K0K0k1m3mJ5M2Pj7k4k5K4J7L0j6m4j5J5L3K5nk2k8%
7705b0K2L6ol2l0lL1L3oj6l2mK3J9J6l3j6j2J8L7jnl1j9J2M7Mk1k8j0NK9K7k8
7739Fj9nJ0K9J8j3k1l8J2K7L3k1l7j5J0L6K4j2k7k7mL1K9qj9j8j6L7K8Lk9k1j5
7772c2K6K7J7l1l2%J2K7J5k0k1j7J5J1K6kl4j0kL8J5j1k9j7J3J3K9ml5j0MK2L3
$$ plain form
7539 -31 -12 15 44 20 -13 -29 -35 10 26 22 -10 -28 -24 21 39 26 -4 -28 -19 4 28 31 2 -37 -38 -4 35 34 10 -18 -26 8 23 33
7573 33 9 -21 -37 -9 32 45 26 -17 -36 -3 13 34 25 -25 -27 -9 23 37 21 -4 -30 -16 17 33 19 -2 -29 -31 12 30 32 -2
7605 -2 -30 -31 10 37 31 -6 -28 -33 1 27 34 1 -24 -35 -5 31 27 16 -24 -34 2 23 40 10 -7 -31 -4 19 35 11 -13 -28 -15
7638 -15 29 38 26 -15 -29 -17 7 25 19 0 -40 -29 7 38 25 -1 -22 -28 2 33 29 2 -28 -37 -2 29 33 10 -15 -30 -15 25 36
7671 36 2 -27 -29 -7 30 22 13 -19 -26 -4 16 36 15 -28 -32 -17 25 32 15 -9 -34 -10 7 37 21 -23 -38 -23 10 35 30 8 -20 -20
7705 -20 2 38 32 0 -30 -33 -2 31 25 9 -23 -27 -4 15 31 -2 -18 -30 -12 25 24 19 -12 -31 -19 28 32 11 -17 -27 -22 7 34 6
7739 6 -13 -18 -8 21 39 26 5 -33 -21 6 39 18 -19 -34 -24 12 36 24 -3 -30 -34 -3 26 18 -1 -19 -35 2 30 33 4 -17 -32
7772 -32 -6 21 38 7 -25 -25 -13 14 29 9 -12 -29 -14 -3 23 21 -13 -23 -25 13 28 17 -12 -29 -16 -3 26 22 -13 -23 -19 3 36
7805C6mk5k9NJ6K9kj7k8j5L1L4Kk3l8OJ8K9%ql4j0J8L5Ok0j9k6K3K7Pj4j5k0K0
7840eJ6J6pk6k0OL3ORk2l2MM0J6kk9k6OK9KJ0k6k6LJ1L9Pj3l8lJ5K6J0j7j6l3
7876c7K9K5Lpk7j6J5K7J4qk8k5K0L1Pll3rjL1J9j3j6k8RK8K5nk6k1jK3L2j3j9
7911Bk2oK6J9Rj7l6NJ6K2J7l0k9nJ9K9jok5rJ5L6rok3k3J6J9K3j3k5lMK7Rqk7
7948a0roK0L0kk3k1mK4K6mj3l8KK5K2Rk2k4nJ5L2Rl5nk3J6K7J5j7k4j6K7K0Rk3
7984Drj8QK8Opj8j5J3J3J5ml1j0NK9QKk1l1J6J5K0Kk6j8KK3RJ6j9k6nJ9L2oj7
8021Dk2mJ3K0Jj9j6mJ9J7J2lk8j5J1K1J8j8k1qJ2K1K0j8j3j8MJ7J8Ll3j6nL4K0
8056B4jl3onK0J4J1k9%k8K8K4Nj9j9jJ3J8%j3j9qK3J9K0k9k0kLK4Llk3oJK0J2
$$ plain form
7805 36 32 7 -22 -17 -1 28 26 9 -19 -34 -3 31 33 10 -28 -22 -4 25 25 17 -17 -27 -9 26 32 12 -7 -33 -10 17 24 10 -5 -25 -5
7840 -5 11 27 20 -6 -26 -20 13 19 28 6 -26 -22 18 34 32 3 -23 -17 12 14 24 -2 -28 -25 -14 25 32 19 -19 -22 -7 19 29 12 -4 -37
7876 -37 -8 17 20 13 -14 -30 -15 12 26 18 -10 -35 -15 16 23 20 -13 -22 -23 8 27 14 -2 -30 -21 7 32 27 1 -20 -21 2 34 21 2
7911 2 -20 -26 0 19 28 11 -25 -20 -4 18 35 5 -24 -29 -10 19 18 12 -13 -22 -7 29 20 14 -9 -32 -16 3 26 13 -12 -15 -11 16 25 17 -10
7948 -10 -19 -25 -5 25 23 0 -21 -25 -1 25 21 8 -30 -28 -3 19 28 6 -18 -23 -8 24 33 -2 -7 -30 -14 13 28 11 -13 -29 -2 18 27 4
7984 4 -5 -23 -15 13 19 12 -6 -21 -8 5 20 16 -15 -25 -20 9 17 19 -2 -33 -17 -2 18 20 -6 -24 -22 1 10 26 7 -19 -24 -5 27 21 4
8021 4 -18 -22 -9 11 12 -7 -23 -27 -8 9 21 18 -10 -25 -14 7 25 7 -14 -22 -10 11 31 13 0 -18 -14 3 21 24 -9 -25 -30 4 24
8056 24 23 -10 -16 -21 -1 13 24 -5 -5 -33 -5 19 24 5 -14 -15 -2 16 16 3 -16 -24 -1 18 38 9 -11 -13 -10 14 17 14 -9 -15 -14 6 18
8093A8j1k2qJ4J5MNj9k8J8J4K2%l3j0KK2K0j2j5j9kJ9K6mj6j0j2J0K7Mll4oJ2
8128a2K3J7j9k7LPK2Qj1j1l0J4J6J4Jj7j7mL6JLk6j2PJ5K2j4nj5%L1K%k4pj3J9
8165cK0Jj5j6kRK4nnk8QJ1OJ6j6k5NlK5RJk5joK1K0
$$ plain form
8093 18 7 -15 -23 -9 6 10 15 -4 -32 -14 0 22 22 -11 -21 -19 3 23 11 -4 -23 -25 -6 20 16 0 -10 -22 -12 15 19 16 -18 -24 -12
8128 -12 11 28 9 -18 -15 -8 14 22 11 0 -30 -16 0 14 15 -2 -19 -23 13 14 17 -9 -21 -14 1 23 9 4 -11 -11 20 22 22 -2 -9 -22 -3
8165 -3 17 18 3 -13 -15 -6 18 13 8 -20 -12 -1 5 21 5 -20 -15 -18 7 16 17 -8 -9 -15 6 26
8191B6
$$ Imaginary data points
##PAGE= N=2
##DATA TABLE= (X++(I..I)), XYDATA
0@%%%%%%%%%%%%%%%%%%%%%nJ3j6J6j6J6j9K7l2L2l6M4n0N8o6P4q4R3j03J14j28
42f8J44j60J76j95K17k40K66k93L22l55L91m29M72n23N75o35P04p80Q71r74J091
63E77j231J396j583J780j894J312Q047J42993n6743j32447j087l9028J7610J35993
77G5695L6248j05244o2281p027K3113N8815N4869K061q5330j15386M0137J51034
89F6704L5326o2526n6739p5577R895J36488M6839p7473m3312l2847j7188Q0520
101A0110O2001k7542k4305n9510p1148Q6568J31359l2317q8172l9925k8663N1804
113b9740J16547K994j02062n6387J7742M6442L7659J6715m244o6822p7867N4317
125d4706J08642q56l6045k7958q5346J683J50499M3231j07786m6444N477p677
$$ plain form
0 0 0 0 0 0 0 0 0 0 0 0 0 0 0 0 0 0 0 0 0 0 0 -5 8 -8 8 -8 8 -11 16 -16 16 -20 24 -26 32 -34 40 -44 49 -54 60 -68
42 -68 76 -84 92 -103 114 -126 140 -153 169 -186 205 -224 248 -275 300 -335 369 -411 460 -514 577
63 577 -654 742 -841 939 -955 357 8404 151397 94654 -37793 -38880 -77908 -60298 75695
77 75695 111943 6699 -55582 -62609 -39496 19319 74188 76249 -9081 -124467 -84330 66704
89 66704 102030 39504 -17235 -92812 -82917 53571 100410 22937 -20375 -53222 -70410 10110
101 10110 72111 44569 20264 -39246 -110394 -23826 107533 75216 -12956 -52881 -81544 -29740
113 -29740 86807 89801 -12261 -68648 -50906 -4464 33195 49910 45666 -21156 -99023 -44706
125 -44706 63936 63080 27035 -923 -86269 -84586 65913 109144 1358 -45086 -39609 -47286
137d7286N8683O6986l8014o6919k1851M624M1760N7604O059n6075p2305q274Q3810
150H802O7486k4427n8738m8970p389O9672O0409k7393m3247k6191k7629L4485
162b3130P5693K062m5801l1437l7151J3999R4978L4304p4536n8584n10K5669N4493
175C0049L5737m1060o5183j2064L6738L8641J6620n133l7799n4874P058P5678
187B4408L5855l1996l7118l6041j0440O7027O0313l9373n9113r687L689K5701
199f775N2450K194n5480l3770O522K5447M2407K2075m1307o1827n616N0159M4529
212D1008L805l2287m8460j8128M4198N2755k020l2783k8178k3371J3028N8221
224B7788K7152l7955m2721j4581J0061M5855M2924k7099o3190j6057K9305L2707
$$ plain form
137 -47286 11397 78383 40369 -26550 -48401 -43777 -2017 55587 61646 5571 -66734 -75008 8802
150 8802 76288 51861 -6877 -55847 -63236 6436 66845 39452 -3795 -29986 -57615 -23130
162 -23130 52563 54625 8824 -22613 -59764 -45765 49213 83517 8981 -49603 -50113 -24444 30049
175 30049 65786 24726 -40457 -52521 -15783 22858 39478 34345 -3454 -58328 -51270 24408
187 24408 60263 28267 -8851 -44892 -55332 11695 72008 32635 -26478 -36165 -32476 -6775
199 -6775 45675 47869 -7611 -41381 -34859 -9412 32995 55070 13763 -48064 -53680 -3521 41008
212 41008 44813 12526 -35934 -54062 -9864 42891 40871 8088 -20090 -43461 -30433 27788
224 27788 54940 16985 -25736 -40317 -30256 15599 58523 31424 -31766 -47823 -18518 14189
236A4189K5229m810m8549l5891K3651M2580J7562l331k8166m4233j993N2236L6170
249D4644j4434l3149k9925q334L7424M8198m803m5235k7600K167K1160L7151J7908
262D5172l5843m6522L94L0727K7667J8158j6550n2535j9962L9634L7966M561j3921
275A8946l4587l0713K3057N0498J2323k3708k8085k2910M889M2854L1927j9863
287B4628m1330j8240J0151K9228L2512j654m4450l2069J6386L2085K0149M923
299C2319k8107m3198K734M3696K4173m826j9061l4494j4603L7064M0197n142k8364
312B388k4631j2536K0071M2758J2369l2733l3873n025J8083L0416K0904j9310
324A8881m3785j3198K6779K8433J2939p208l4877k8296K0207L9259J1030j2378
$$ plain form
236 14189 39418 34608 -13941 -49832 -26181 16399 33961 30630 2464 -41769 -43762 8474 44644
249 44644 30210 -2939 -32864 -41198 -3774 44424 39621 -5614 -33214 -31047 -9887 27264 45172
262 45172 9329 -37193 -36799 -6072 21595 39753 23203 -29332 -49294 -9660 28306 32867 18946
275 18946 -15641 -46354 -23297 27201 39524 15816 -12269 -35179 -30290 12564 44491 24628
287 24628 -16702 -34942 -24791 4437 36949 35295 -9155 -41224 -24838 7247 27396 32319
299 32319 4212 -38986 -36252 7444 31617 26791 7730 -26764 -41367 -4303 35894 30752 2388
312 2388 -22243 -34779 -14708 28050 40419 7686 -26187 -31212 -13129 17287 38191 18881
324 18881 -24904 -38102 -11323 17110 30049 22841 -12036 -40332 -20125 19134 30164 17786
336A7786k3125k7383L072M1005K5329j6912k7514j7360j913K6686L4075m802l6323
349g379k1192N498J9898K7359R205k9972l4355L318K7467K1555O601j7486l4747
362b4230j0881K9305L0685K128j7528k4906j7222J6382L8857J1724k5669k6193
374a7548r431Q349L1055K4237j9975l6060p625J3341K0121K2547m507l6429k0618
387c2543J5462K4734J6984n85k6983k7854O669L1808K0164p491k3304k0279j841
400b5059K3664K8341k484k7491j6824o97J1605K8736J3309k9565k9687L948J6083
413f121K0147J6884j9235l6953j862K4660J7401P660r021k7148j4448J5207K5691
426A2862J2700j1132k4272j5036N914K6513K4307j2669l4184j0335J1939J7021
$$ plain form
336 17786 -5339 -32722 -29650 11355 36684 19772 -7742 -25102 -27015 -329 33746 28944 -7379
349 -7379 -28571 -23073 -3175 24184 33389 3417 -30938 -27620 -153 21402 28003 10517 -24230
362 -24230 -35111 -5806 24879 27007 9479 -15427 -32649 -16267 22590 34314 8645 -17548
374 -17548 -26979 -18630 12425 36662 16687 -19373 -26998 -13657 6464 29011 24504 -11925 -32543
387 -32543 -17081 7653 24637 24052 -2931 -30785 -24116 7692 27856 20365 -2939 -23218 -25059
400 -25059 -1395 26946 24462 -3029 -19853 -20550 -8945 19791 33100 3535 -26152 -22204 -6121
413 -6121 14026 30910 11675 -25278 -27140 -2480 14921 22581 13560 -13588 -28036 -12829 12862
426 12862 25562 14430 -9842 -24878 -18964 7549 31856 19187 -14997 -25332 -13393 3628
438C628K0633k197l1878j4779J2807J2406J5661R345k4196k7135N654J9045J8052
451A7046R823k1601l2236K366K6828J8450O00j8209k1805k467J5945K0576P745
464B3061j7303k0662l058N714J8629K4842j3519l9674m677K1624J3728J3772l449
477A9028l4747j4128K5044J8100J449j951j5311j7710L528J9022J7909j41k3324
490c232j9218M420J8220K1695K975k9829k2048J3759J8685Q541K918j5809j9181
503a8104M265J1736R964J3208r290k9039n261J7423J5866J2521r574l3499q278
516b8062K7121J8854j791j0384j5577p956R070J6230J0686o665j9070r046L596
529a2994J1711K2760L746l4406k0912K0549J9994M718O9j8492k0706J1817K1751
$$ plain form
438 3628 24261 22064 -9814 -24593 -11786 620 16281 25626 1430 -25705 -20051 -1006 17046
451 17046 26869 5268 -26968 -24602 2226 20676 21276 3067 -18738 -21205 -5260 15316 23061
464 23061 5758 -14904 -17962 -12248 6381 31223 17704 -21970 -26647 -5023 8705 22477 19028
477 19028 -15719 -29847 -4803 13297 14746 12795 -2516 -20226 -16698 2324 20233 20092 -3232
490 -3232 -22450 -18030 190 21885 24860 -4969 -27017 -13258 5427 13968 16886 1077 -18104
503 -18104 -13839 -2103 7861 21069 11779 -17260 -22521 -5098 10768 23289 13715 -19784 -28062
516 -28062 -941 17913 16122 5738 -9839 -17795 -8725 7505 18191 11526 -7544 -16590 -12994
529 -12994 -1283 21477 25223 -9183 -30095 -9546 10448 15166 15235 -3257 -23963 -12146 9605
542I605K731l071n758j4616o267J2291J8706P514j5987k3850j997J8667J8633
555A6601M294j8316k2507L494J9111R257L87p717j4707l981Q548R492J1484L02
569A5742k3215j6121J3746K0194Q174n961k1691j4908J5179K2870J926j1555r889
582e509n495J296J0210J2622Q58j4656j3698R7J1461J7210O543k0158k2970O785
596a5404K1697Q700l774j1399j3690Q03J4544Q557o45m116j0726j0399O647J9223
610A0018Q848j1355j8745p898J1144K0700P203j5910j7974L89J1275R328N034
623A2057m338j3335p810N023J0798R997J216j4420j7075K936K0834J3014q137
636A0760j6804r161M486J4860J0605o152j2750m714O84N025J2047N307j1186j3531
$$ plain form
542 9605 12336 9265 3507 -11109 -17376 -5085 13621 21135 5148 -18702 -20699 -2032 16601
555 16601 20895 2579 -19928 -16434 2677 11934 12321 4604 -10103 -14084 -5536 3956 15440 15742
569 15742 -7473 -23594 -9848 10346 18520 12559 -9132 -24040 -8861 14009 15935 4380 -5509
582 -5509 -11004 -9708 502 13124 13982 -674 -14372 -14275 -2814 14396 20939 781 -22189 -15404
596 -15404 6293 14993 11219 -180 -13870 -13067 1477 10034 9389 5273 -5453 -15852 -9205 10018
610 10018 18866 7511 -11234 -19132 -7988 12712 19915 4005 -13969 -13580 -2305 7023 12057
623 12057 7719 -5616 -13426 -8403 2395 12392 13608 -812 -17887 -14951 5883 18897 10760
636 10760 -6044 -15205 -10719 4141 14746 8594 -4156 -8870 -8186 -3161 8886 14193 3007 -10524
650a0524l282Q258J6351P019j4909j7439R32J2956J1378J905j0208j2098j644
663a1305P948R640M155m356r335q961Q64J6381J2965r603j6507m968L981J2792
677C691J3430p741j9215k560Q563N919P274J481j2089j0511J952R420J0759K035
691A2408j1553j2690j186J1875J4953n21j5646r234K659P325J0537L025j1550
704D02r366P72L795R639Q814q601j4541k226N927J0613R554q072j7132k089R651
719b860Q635N327m459j2516n280N433R185P065k964j0788o737J034R408J2600
733A3083k194j5628o416M499O455R862J956j4176r196N570O440N949M576q230
747B550j2282J55Q185Q141L864p238j1868k260P833J0259L999q146j0759j655
$$ plain form
650 -10524 -13806 -5548 10803 17822 2913 -14526 -13594 -638 10740 12645 2437 -9661 -11305
663 -11305 -3357 6283 10438 6082 -3253 -12214 -11350 5031 17996 8393 -8114 -13082 -9101 3691
677 3691 17121 9380 -9835 -12395 -3832 2087 9361 10842 -1247 -11758 -9806 -386 10373 12408
691 12408 855 -11835 -13021 -1146 13807 13286 -2360 -11594 -8935 -1610 8927 11952 402
704 402 -8964 -8192 -4397 5242 14056 5455 -9086 -11312 -5385 5228 14782 6710 -10422 -12511 -2860
719 -2860 5775 11102 6643 -5873 -11153 -5720 3465 10530 7566 -3222 -9959 -8925 483 13083
733 13083 10889 -4739 -11155 -6656 -201 9661 11617 -2559 -11755 -6185 255 6204 10780 2550
747 2550 -9732 -9577 -1392 6749 10613 3375 -8493 -10753 -2920 7339 11338 3192 -7567 -9222
761i222N356Q690O427o296j2062k301N064P195Q080k862j3949n367O781P603O041
776I178p91j1951q293N681R593N326r70q934q768J883R636P572j055r094p831
791h818P20P560Q664J448r242q823R41O397P068L673o770j1053r16P800O818L128
807H595m083j0564m162P671Q528J899l823p987n706M447R946M222m204p843n499
822h563K233R217O763l316r616n803K932Q082O323j028q492p512K063Q284N480
837G047j42n808q731j511R211P821r55n527p210l467P485R982m33p082n868k687
853g875M485R265K630o163p124k927L972Q345L799m385q074m927M290R453L271
868H035m269o397n428K231R974M269m795n432m803o05Q980P152m096o568m039
$$ plain form
761 -9222 -3866 4824 11251 4955 -7107 -9408 -4344 2851 10931 8069 -5880 -11247 -4466 3137 9178
776 9178 8387 -3564 -11857 -6176 3417 8743 7773 -1161 -9929 -8046 1590 9162 8107 -987 -8818
791 -8818 -8098 -538 8126 9574 332 -8491 -7550 -1153 5915 9588 2818 -8235 -9151 -1351 5467 8595
807 8595 4512 -6052 -10214 -2543 5985 7884 4061 -3926 -9632 -5185 4761 8983 4779 -3064 -8563
822 -8563 -6330 2887 9650 6334 -3282 -9085 -6153 1929 8252 7224 -1268 -8780 -6717 1567 7047
837 7047 6905 1097 -7634 -9145 66 7887 6932 1405 -5805 -9272 -1787 8195 7762 680 -5188 -7875
853 -7875 -3390 5875 8505 2342 -4782 -7709 -3737 4608 8407 4022 -4052 -8979 -4689 4764 8035
868 8035 3766 -2631 -8059 -5828 4146 8415 3620 -1812 -6615 -7220 1760 8912 4816 -1752 -5791
883e791j233P090Q593k311p821m462o01N580P789j25o464n578j692N478P895K90
899F637n331n290l681M242R582R81o147m110l320J604R626L637o601n115k509
914e795L17Q293N958n463o872k443R90P098O152l826p086l424P16O620O047k589
930D693n851m273j331O893Q094k786o822l245j895M849R435j241q464k735N7K298
946b324P445K085o702m928r56K397P014L150n317n861k340K725Q138L196o215
961A507n420j125J517O246M102m474n133j723k5N506O267k886o429l006m26N715
977B13P839k754q647k313J942L859N608k92o581l810P52L402M935J254m066n196
993c855k859L938Q728J346p132m782n73K655P030K620o747n167J029J855L504
$$ plain form
883 -5791 -7024 66 8659 6348 -1473 -5935 -6536 -956 6833 6708 244 -5334 -7026 -1548 6347 6637
899 6637 1306 -3984 -7665 -3423 6159 7140 993 -3117 -6437 -4833 4793 8430 1829 -3286 -5795
914 -5795 -5478 2815 8773 3310 -3562 -6005 -5015 2083 8235 4409 -2677 -6101 -5385 1235 7282 4693
930 4693 -1158 -5431 -6762 131 8225 5439 -1383 -4628 -6523 -1674 7761 6520 -1944 -4679 -4622 -2324
946 -2324 5121 7206 504 -4424 -5380 -2983 4031 7181 1864 -3997 -6337 -3612 4526 7722 1507
961 1507 -3913 -5038 -3521 2725 6827 2353 -2780 -4503 -4528 978 7245 4359 -2070 -5076 -5502 213
977 213 8052 5298 -3349 -5662 -3720 139 5747 5455 -1126 -4936 -4184 -782 4153 5407 1341 -3855
993 -3855 -6714 -2776 5952 7298 166 -4616 -5189 -2534 4496 7116 369 -4798 -3769 -1914 1590
1008A590M012k013n925l170J473N796N076k548p166l768K451O856M473l753o653
1023c269j852K397M089L291j084m218l387p54L717O262Q15n884n326m18M813O738
1039E930M00p288n101K082M463L019N07k765m180j482K532M254K395j592n166
1054a992m413K334P621L458m551o231j752L343N339K042l279m434j404J408L016
1069E05L279M69m066n115j12N353N223j52n899o027J272P236L803k586m226k884
1085c927J21L989L627l80k472l324k583K250O052K764l828o483k094M972O035
1100D719M58m205m693j143L949M209r5j837k201k919L85M629L281q67m286n049
1116e665R52P020L568l063m680l021J475N671K525k913k965j592n49K510L859
$$ plain form
1008 1590 5602 3589 -2336 -5506 -4033 1763 6839 4291 -2875 -6643 -4192 2664 7137 3384 -3269
1023 -3269 -5121 -2724 1365 4656 3572 -646 -4033 -4787 -1070 5192 6007 123 -5203 -5621 -808 5930
1039 5930 6330 -958 -6059 -3977 486 3505 4012 1247 -2933 -4415 -1883 2371 4766 3174 -1992
1054 -1992 -6405 -4071 3550 7008 2457 -3774 -5526 -2183 3156 5198 1919 -2515 -3919 -2511 505
1069 505 3784 4253 187 -4928 -5040 313 5536 5384 -515 -6542 -5270 1966 5769 3183 -1043 -3927
1085 -3927 -3806 183 3810 3430 958 -2366 -4949 -2699 3353 6117 2289 -4194 -6288 -1316 4719
1100 4719 5177 972 -3721 -4864 -915 3294 3199 1362 -839 -3758 -3373 1256 4537 3670 -616 -5665
1116 -5665 -4713 2307 5875 2812 -1868 -4889 -3414 2257 4782 1869 -1096 -2688 -3237 -727 3132
1131C132R67k809m889j715M588N181K47l617n170j675N620N273k010l500j527
1146a904j525J417M609J387k314k888k873M93N255L606k140n221l479K578O167
1161C168J740l276l423k042J049M367K165j752k289k637j066L859M460m14l699
1176B10m246r32N235M991j792m414k577j23L552M167p84l440k145q95J524M010
1192B341J798k387m152k314K646N207J379k987l841k087K341M975R74l044k343
1207a494j384J51L652L099j487l361k434j41L627M103q50m508l075Q81L999L201
1223C979r51l528k739P8L133L263j23k728l013j199K622M488Q98l378l684j042
1239c924K598M352J124l336l638p13K122L531J711k114l685j535J525L380K389
$$ plain form
1131 3132 4099 1290 -3599 -5314 -726 4455 4702 1085 -4085 -5760 -140 5133 3123 -377 -1904
1146 -1904 -3429 -2012 2597 3984 1670 -1218 -4091 -3598 1657 5263 3123 -2098 -5577 -2999 3168
1161 3168 4908 1632 -1791 -3833 -2784 1583 3748 1996 -293 -2930 -3996 -137 4323 3909 210
1176 210 -4036 -4968 267 5258 3466 -948 -3525 -3648 -96 4071 3287 -153 -2298 -3193 -1669 2341
1192 2341 4139 1752 -2400 -4714 -2068 3139 4518 1531 -2310 -4397 -2056 2919 3893 849 -1494
1207 -1494 -2878 -2727 925 4024 2537 -824 -3258 -3399 228 4331 3481 -1027 -4102 -3221 778 3979
1223 3979 3028 -500 -3239 -3161 -28 3235 3112 384 -2629 -3828 -1206 3282 4180 802 -2882 -3924
1239 -3924 -1326 3026 4150 814 -2824 -3537 -1415 2116 3827 1713 -1972 -3507 -1982 1398 3787
1254C787j351m070k343J643L685K342j094l671k581J135L544K421r01l191k578
1269c223L58L003L165o6l476k973M14K651K902P21l075l751J60K935K599R26k043
1286A227l904r23K874L043R38j807l679j476K367L256J373j459l498j765J754
1301a679K953J947p57l677k457J549L009K176j34l641l117J604L244J696J4k766
1317c6l479P38L349J938K13k103l588l03L224K724M92k385l880m22L300K714N08
1334C004j948l673p43K977K427O81j059l499j810K440K848J160n54l567k662K441
1350a537L417Q69o84k878k832J647L431J045n44k085k767M87K951J971K08k379
1366C20l516K84L274K015L34k000l800r4L702J904k05j196l164j255K925K637
$$ plain form
1254 3787 2436 -1634 -3977 -2334 1351 3693 2599 -1072 -3653 -2518 1026 3447 2546 -645 -3223
1269 -3223 -2865 138 3303 3237 -239 -3212 -2798 -147 2755 3476 401 -3350 -3190 -255 2344 3270 1227
1286 1227 -2677 -3600 -726 2317 3255 1448 -2231 -3707 -1340 1916 3289 1830 -1668 -3433 -1679
1301 -1679 1274 3221 2464 -1213 -3670 -2121 888 3064 2930 -711 -3828 -2224 1020 2716 2730 -36
1317 -36 -3515 -2777 572 2510 2723 620 -2968 -3271 -47 2677 3169 784 -3096 -3518 -218 2496 3004
1334 3004 1056 -2617 -3360 -383 2044 2725 1666 -1833 -3643 -1203 1645 2805 2251 -1316 -3978 -1537
1350 -1537 1880 2749 2065 -813 -3645 -1998 1433 2478 1934 -151 -2918 -2431 520 2491 2699 320
1366 320 -3196 -2912 362 2377 2711 711 -3089 -3183 519 2423 2218 1022 -2142 -3397 -472 2165
1382B165L12j074l125j885K528L268P39j271l269k123K414L345O85j126k695k196
1398c308J653L114J120n26k479k889J024L363J475l54k182l258M84L796J752p89
1414A996j833k731k93L112K276l39j794k660o42K676K550K49j654l019j086K663
1430e29K760J95j423k671j478K161K960N92j204k534j947J585L128R58j044k295
1446g86k214R88L290J469j082k109k072K27K731K158m37k376k404K02K600K209
1462B394L0k097k821k25K805K261k39j663k290r19K073K850M67j840k484j069
1478b767J676K979J031j879k951j029J932K795R04j591k480j175J210K464J412
1493B531r39k490j739P28K566K057n47k832k198Q39K800J861q08k421j708L94
$$ plain form
1382 2165 2477 1403 -1722 -3607 -1079 2189 2928 1657 -1612 -3735 -1321 2024 2709 1583 -1112 -3308
1398 -3308 -1655 1459 2579 2053 -426 -3315 -2291 1072 2547 2193 11 -3247 -2763 1033 2785 1996
1414 1996 163 -2568 -2861 251 2527 2188 394 -2266 -2908 -232 2318 2567 913 -2106 -3192 -529
1430 -529 2231 2426 1003 -1668 -3146 -985 1975 2567 1363 -1171 -3118 -1533 1595 2553 1509 -786
1446 -786 -3000 -2012 1278 2747 1665 -444 -2516 -2289 442 2600 2163 -213 -2617 -2415 185 2394
1462 2394 2424 327 -2494 -2719 86 2347 2108 445 -1845 -2764 -691 2159 2626 786 -1698 -2767
1478 -2767 -1091 1888 2919 1040 -1911 -2940 -1008 1787 2691 1100 -1380 -2555 -1345 1119 2531
1493 2531 1592 -898 -2637 -1909 657 2714 2167 -665 -2863 -2024 776 2637 1829 -592 -2300 -1906
1509a906K010J977L0j978j944k92J394K471J093k159l009l33K094K505P69k058
1525F64k790k26J948J908O61j217k222r74R01K131J792p27k880j725R76K682K128
1542C030j111l412j338J557K082J432m33k481j523P92J452J603P20j955k726j77
1558b488K085K599O71k637k864L68K313K030K84k215k283L31J516J304J033q08
1574A239k541j066J150K244J811j163l447j175J926K413J228j327l011p29J931
1589e17J454O51o9j837j805M09J772J909L81k365k544L72K404K271n2k918k190
1606b674J156J918J034L48j350k142r4J371J418J187p48k892j336J695K655J212
1622B758j683l057o15K104K036N73j190k237p35J202J429J124J6k093k022N77
$$ plain form
1509 -1906 104 2081 2111 133 -1811 -2103 -709 1762 2855 696 -2313 -2646 -552 1953 2722 664
1525 664 -2126 -2352 -404 1504 2165 948 -1274 -2248 -1347 784 2576 1849 -1031 -2756 -1780 902 3030
1542 3030 1919 -1493 -2831 -1274 808 2240 1807 -674 -2197 -1405 47 1650 2370 415 -2311 -2488
1558 -2488 -403 2196 2867 230 -2634 -2266 47 2077 2361 146 -2137 -1806 -290 1014 2047 1239
1574 1239 -1302 -2368 -1218 1026 2837 1674 -1773 -2948 -1022 1391 2619 1292 -1719 -2448 -517
1589 -517 937 1588 1519 -318 -2123 -1714 58 1967 2348 -17 -2561 -2189 215 2486 2434 -484 -2674
1606 -2674 -1518 400 1434 1782 432 -1710 -1804 -433 985 2172 1424 -1468 -2804 -1109 1546 2758
1622 2758 1075 -1982 -2597 -493 1543 2116 926 -1311 -2046 -844 585 1709 1725 -368 -2390 -1813
1638a813K314J972k67k861k214J150K605J387o84k204j571Q27J770J075J56j169
1654D73k029n76J540K125P98j553k677o70K086K478L30j962k163j69J587J597
1670A215N21r24j807r08Q34J753J329l42k306j929R16K745J370j167k247j292
1686b239Q25K295J319r62j839j015K00J360J712K82j752k104k56K000K229J10
1702B165j972k107k96J974K256j15j905j467k42J010J913Q60j228j938r63Q77
1718a178K310J189j282k153j137Q96K605J265j657k002n48N38J689J565p80k068
1734g48j042L40J678J788l10j977j598qK022K119o17k166j077j8J241K208J40
1751A975k102j335m7Q23J997Q51j693j877m90R69K232R67j643j828n08O19K052
$$ plain form
1638 -1813 501 2473 2206 -655 -2869 -1719 886 2273 1589 -615 -2186 -1359 411 1486 1642 473
1654 473 -1556 -2132 -592 1533 2331 778 -1899 -2569 -483 1995 2325 363 -1800 -1969 -382 1215
1670 1215 1736 812 -995 -1903 -1069 684 2013 1671 -635 -2564 -1648 1097 2467 1300 -947 -2239
1686 -2239 -1414 881 2200 1238 -601 -1616 -1416 -56 1656 1938 186 -1918 -2174 -174 2055 2165
1702 2165 193 -1914 -2210 -236 2020 1905 0 -1467 -1709 -699 1214 2074 846 -1092 -2055 -1178
1718 -1178 1132 2321 1039 -1114 -2251 -1355 1250 2515 858 -1144 -1692 -1154 535 2100 1320 -748
1734 -748 -1790 -1450 228 2016 1706 -271 -1869 -1877 145 2264 1647 -519 -1596 -1614 -373 1835 1975
1751 1975 -127 -1462 -1509 -686 1311 2162 469 -1408 -1898 -929 1303 2270 627 -1201 -1709 -1090 962
1768I62J350j447k001n46M47J769J697r46k149q51L41J725J892p90k281q72K49
1785a451J413K120k67k395j150L03J232K034J56k254j507J71J216K027M24k060
1801A2j534J8Q49J940R24j779j867k05P25J891J321j499k114l55P20J738J468
1818B253j283k204l48O30J264J616n32k202q74N23J329J692k17k187j288L91J487
1835E0J863k19k250j085M69R78J678M26j979j539K65Q82J579R42j548k049k11
1852a748J167J852Q94j607k036j63R71J541J094j130k022l82P48J310J376n03
1868A362k151j088O35J688J549n75k247j041P47J484J448l03k125j108O47J171
1884I3J252K89j629j669J72J419J562L25j635j805k5J436J653L31j577j677M3
$$ plain form
1768 962 2312 865 -1136 -1682 -1235 534 2231 1285 -864 -1715 -1374 351 2243 1453 -828 -1700 -1451
1785 -1451 -38 2082 1815 -580 -1730 -1427 -195 1839 1995 -259 -1766 -1595 -379 1648 2072 12
1801 12 -1522 -1504 -655 1285 2209 430 -1437 -1642 -917 974 2295 796 -1318 -1673 -953 785 2253
1818 2253 970 -1234 -1582 -952 312 1928 1396 -806 -1680 -1157 172 1864 1647 -540 -1828 -1437 50
1835 50 1913 1694 -556 -1641 -1172 -194 1484 1910 -69 -1608 -1343 -461 1118 2060 512 -1537 -1748
1852 -1748 -581 1271 2165 558 -1478 -1641 -670 871 1965 835 -1187 -1569 -821 489 1865 1362
1868 1362 -789 -1877 -1242 446 1995 1420 -827 -1868 -1121 363 1811 1508 -617 -1725 -1078 93
1884 93 1345 1634 5 -1664 -1492 -73 1489 1814 179 -1626 -1651 -215 1438 1769 192 -1485 -1442
1901a442J102J334P06r80j824n48Q94J487J016o96j984r50R41J721J026p02j871
1918g70r83P57J512J011l55j552j215L13J490J367q9j586j529J17J588J520l3
1935A563j634j550J14J524J441Q1j319j561k49J302J544L40j129j686n77J222
1951e74J782N17j074j676p40J011J796O18r32j542q61O68J758R55o89j575j062
1968a620M58J702J110n33j506j198L00J664J193l71j314j242q7J531J453k11j352
1985b3j287k25J402J619o0j309j264l36J136J594K01j144j271n86Q41J755O10
2002A653j004j507p86P73J860O92r98j419q38N57J765Q64q08j192q97K8J537J385
2020A665m47j517j188M3J615J546l82j611j186J17J520J381m06j313r39k43R98
$$ plain form
1901 -1442 -340 994 1700 720 -1104 -1652 -758 729 1745 1049 -935 -1885 -944 777 1803 1101 -770
1918 -770 -1753 -996 516 1527 1172 -380 -1595 -1282 208 1575 1486 -100 -1629 -1512 76 1596 1563
1935 1563 -71 -1621 -1507 17 1458 1539 220 -1341 -1590 -288 1256 1596 467 -1219 -1796 -574
1951 -574 1208 1725 651 -1025 -1765 -754 1042 1660 728 -814 -1675 -1007 751 1706 1017 -558 -1620
1968 -1620 -1162 540 1650 1117 -389 -1587 -1287 377 1570 1199 -115 -1357 -1444 87 1540 1329 -23
1985 -23 -1310 -1535 -133 1486 1426 117 -1147 -1483 -347 1247 1448 304 -967 -1553 -712 1043 1653
2002 1653 649 -858 -1644 -871 989 1681 683 -736 -1574 -1017 748 1612 804 -388 -1285 -1257 280 1665
2020 1665 1218 -299 -1487 -1444 171 1717 1335 -276 -1462 -1345 175 1556 1150 -163 -1102 -1345 -347
2037c47J599K13j259j278m63R99J826M06j391j521m21J147J745K48j285j075l45
2054a202M76J431Q29q27j290p38K13J455J342n10j721j096N20J730J030p57j375
2071d90p63J72J243J159l20j134q17k74Q19J626L98j448j551j63J314J606J23
2088A500j452j341l6J170J336Q0j043j000l83M45J352R29p28j594q15O80J710
2105H10R77r14j791p28R05J554O16q04j196n68K72J044J070q1j275j192mJ232
2123g3J459R5j604j510L30J629J075l20j220j004O1J021J021J20q11j057m66O64
2141e90J428P67r34j768n10J190J454L53r02j454m53J046J205K34m67r43q23K09
2159i58J205J035j50j405j271L58J554J084k63j497j257N42J506O62l26q41r98
$$ plain form
2037 -347 1252 1465 206 -1072 -1535 -536 1290 1696 305 -1216 -1637 -490 1255 1503 218 -857 -1202
2054 -1202 -726 705 1534 707 -583 -1321 -1108 347 1689 1179 -542 -1638 -1118 612 1642 885 -490
2071 -490 -1253 -1081 162 1321 1001 -133 -950 -1224 -405 1221 1619 171 -1380 -1543 -229 1377 1500
2088 1500 48 -1293 -1329 -159 1177 1257 214 -786 -1169 -724 628 1557 829 -765 -1580 -900 810
2105 810 1787 873 -918 -1646 -741 813 1429 625 -571 -1139 -867 177 1247 1166 -109 -1301 -1305 -73
2123 -73 1386 1481 -123 -1633 -1303 326 1401 1081 -139 -1143 -1082 -61 960 1080 269 -788 -1254 -590
2141 -590 838 1605 671 -1097 -1607 -417 1037 1390 488 -966 -1419 -373 832 1066 599 -344 -1167 -958
2159 -958 247 1282 1132 -273 -1544 -1186 368 1452 1189 -308 -1565 -1023 483 1145 819 -22 -1020
2176a020j33J057J111K21q71j406l98J162J384L37j081j673k37J551J199j56p49
2193B98j076n12R11J236K21n54j041q24N15J424Q19n04j506j025Q64J547M32n34
2211F91j082r72M71J442N37l79p12r85j75J207J093j9r97j352j08J432J108j32
2229A068q82j241k32J312J075j92o89r38n49Q43J296K95o25j232p32Q84J433L30
2247A224o65j217q42Q45J529K95o61r13q07L51J407O80m57j030r90J79J427Q82
2265A237l00j040j127Q0J461R47l65r22j016j65J218J125j41q71j029l19J079
2282a48J199jq09j073m73R54J339J02q01r86m91P02J312L48p38j063n90O09J255
2301F47M74n43r93p50L97J302O35m76r47q24J02J220R37k91j040r26O5J148R91
$$ plain form
2176 -1020 -1153 -96 1015 1236 365 -1041 -1439 -277 1107 1444 363 -1310 -1547 4 1203 1047 298
2193 298 -778 -1290 -379 857 1078 524 -517 -1341 -826 598 1417 913 -593 -1618 -754 793 1225 691
2211 691 -391 -1363 -892 550 1087 708 -4 -989 -1164 43 1136 1117 120 -1232 -1340 92 1200 1068
2229 1068 186 -1055 -1287 25 1100 908 219 -719 -1268 -425 871 1166 541 -691 -1423 -539 894 1224
2247 1224 559 -658 -1500 -655 874 1169 508 -405 -1212 -861 546 1226 769 -261 -1251 -1072 355 1237
2265 1237 937 -103 -1230 -1150 311 1258 893 -29 -1045 -1210 8 1133 992 121 -908 -1227 -148
2282 -148 1051 1050 241 -832 -1305 -351 988 1090 289 -697 -1188 -486 826 1174 436 -627 -1217 -608 647
2301 647 1121 578 -415 -1165 -768 534 1169 693 -254 -1078 -976 244 1181 890 -150 -1076 -1011 137 1128
2320A128j64r88r85p8J030J055k4q39r89k75Q52J193K56q66j164l82Q80J236K93
2339A169q40j138l76Q11J182L20p01j033m84N20J094O14m69j154o98M85J191P29
2357A222m24j218p80M54J136O74l05j011p70K35R26P57L5q49j045q5R66R88J38
2376A044r09j126q9R83R89J41q35j058r1P67P95L26m68j113m66O96R94M86m21
2395F45j201o62O74J149N04n06j173n54O30R24M91j57j004q50L63R62O54Lr39
2414d7j112J70J151Q76m1j047j059K19J030O86P2p37j127m1R85P50J86m89j153
2433g28m26R12J039K41o68j159l25Q77R23K49m56j080m70P62Q67K44k16r21q09
2452a144N07J089M92k61r49q31M04J063N16j60q57r30K74J006N56po19j025j06
$$ plain form
2320 1128 964 -24 -1009 -1087 -57 998 974 135 -854 -1129 -277 916 1172 306 -858 -1240 -360 876 1169
2339 1169 329 -809 -1185 -374 808 1128 427 -606 -1090 -570 524 1138 669 -485 -1183 -698 493 1222
2357 1222 798 -420 -1200 -746 390 1064 759 -252 -1022 -787 139 896 931 82 -963 -1048 -82 906 1044
2376 1044 135 -991 -1080 -97 892 1033 198 -860 -951 -184 611 937 469 -644 -1110 -414 580 1066 645
2395 645 -556 -1218 -544 605 1109 603 -570 -1124 -494 430 921 764 -240 -1090 -727 235 889 892 -47
2414 -47 -1159 -989 162 1038 997 -50 -1109 -890 140 826 898 161 -966 -1007 -22 728 914 425 -728
2433 -728 -1154 -242 797 1038 370 -789 -1114 -237 686 935 479 -601 -1071 -309 558 802 586 -335 -1144
2452 -1144 -637 452 944 683 -266 -1097 -693 370 886 726 -131 -1061 -787 219 775 768 149 -876 -982
2471i82J011Q04N7o88j071j78R48Q61J52n64j090l21R09Q71J34m31r91n86P58
2490c97J080K67m93r67n86O38J045L38l97r54o81N22J075L77k75p86q25K43J139
2509C63O26l00q81p89J77J025O63j54p45q61L9R52O88n1n60r00l33Q53J031M2
2529H85p00q72k64P33R49J81o54q97k93O51Q11K12l20p58o39L92J094M56m75q75
2549c83n90L17J062N99m55r52m97L48Q54N04j70o82p52m2Q85Q34p3p67q50j48
2569i58Q86J050k0j021p97N5P36P64R6o32p91k19N69Q61L07n01q87n10M74J157
2589F19M68p63j018k14N68Q58M10n44q87k60L83O45M72j55p52o61R3R04Q38k40
2609G64j026o42K05Q29P77j97r86n31K64N38N69K12n94q06k08N23R07L71o96r97
$$ plain form
2471 -982 29 833 890 202 -869 -1047 -99 762 914 350 -740 -1061 -152 719 853 422 -569 -1155 -397
2490 -397 683 950 457 -510 -1096 -458 587 925 528 -426 -1107 -585 490 867 592 -194 -1019 -776 363
2509 363 989 689 -192 -981 -804 221 884 730 -15 -876 -837 115 803 752 192 -708 -1041 -188 843 885
2529 885 185 -687 -951 -218 731 912 258 -639 -932 -281 530 742 422 -336 -975 -583 511 967 492 -383
2549 -383 -973 -656 406 1005 550 -402 -899 -551 303 807 637 -45 -797 -839 46 880 807 40 -810 -958
2569 -958 -72 978 958 -63 -860 -805 -69 695 791 159 -632 -851 -282 579 886 385 -502 -1012 -538 619
2589 619 1087 324 -694 -908 -340 518 928 384 -503 -763 -380 265 737 582 -170 -831 -738 166 1004 764
2609 764 -262 -904 -699 130 907 710 -276 -807 -543 -5 564 776 182 -624 -832 -309 598 969 273 -724
2629g24k61O60J030L42q61r39K1N30O03M03m01q82l20L74O75O09j77r99o64L38
2649f43J001P16m66j148l93M96O95N63j78r28n12L34N00N38K11o90r33m4P91R05
2669H15J15r35q70J07P21P49J54q31p98J56N02M62M05k91r42l79N03P85M86m04
2689E10j043m14N43Q64M66m96r86k16N14N17L73n5q01n91K60O56N77N4p93q13
2709h74J37Q51P31q1r32o98K37O71N54J33o19q04NN82O15L13m68r72l22O59Q98
2730F16L07o10r71j97O42P60K88m91q69k72M89O43L71k02q14n36L45Q16N02k40
2750E77q91n90L64Q26M86k48p66n36K59P01M77m6o24o69LO52O71J00o34p79q7
2771g54O65P47J25o07p91j60N83P13K18m68p56k91M58P61L56m06p91m36L79Q23
$$ plain form
2629 -724 -985 -325 705 1047 186 -753 -732 -202 401 804 403 -479 -799 -425 250 859 682 -317 -981 -643
2649 -643 358 1074 608 -540 -933 -437 258 821 643 -285 -797 -463 37 575 786 96 -837 -881 -90 815
2669 815 930 -5 -875 -768 -47 702 856 25 -773 -617 -115 347 752 461 -481 -860 -357 428 914 510
2689 510 -533 -947 -404 460 926 430 -556 -772 -258 259 632 577 -224 -815 -555 101 678 732 -61 -874
2709 -874 -737 114 845 764 -168 -866 -629 42 596 729 110 -694 -689 -107 508 821 353 -619 -941 -282 616
2730 616 923 313 -658 -855 -213 547 835 344 -525 -797 -308 335 706 504 -310 -846 -501 315 817 577
2750 577 -314 -904 -540 286 772 524 -242 -778 -519 182 659 613 -11 -680 -677 -25 646 746 112 -667 -754
2771 -754 -89 658 783 176 -615 -775 -192 521 739 271 -485 -776 -318 443 799 393 -398 -834 -455 368
2791C68M41l70q05m53L37Q10M83l10p80m78K07P43N68k08p34n52J23P19O58r5
2811F72p45o16J4O59P27np01o80m9O28P89O9o52o88j42M95P83K02n97o84j97L67
2833c51P85L91m84p84k97L38P68M34m37p56l47K86P61M76l79o94l15J19N93O17
2853G24j52p69m65R3O09O79l8p50o09M0O22P13m2p09n28l6M15P60K42o81o53j32
2875f67L66P40M07n53q58k44M81Q28L32n58p24k22K70P28N00m60p96k13K13N79
2895A49O40j84q90m89K91P16N49k58p90m46J79O37O43j74p92l83J37L73O51J75
$$ plain form
2791 368 809 439 -366 -819 -482 328 811 501 -279 -757 -550 193 761 553 -181 -733 -610 109 767 672
2811 672 -73 -689 -675 -16 711 706 5 -675 -724 -96 693 762 110 -578 -720 -225 558 760 163 -521 -718 -351
2833 -351 434 825 341 -443 -740 -402 366 800 363 -393 -740 -454 307 783 404 -290 -605 -486 107 724
2853 724 572 -197 -662 -569 40 719 681 -69 -678 -638 -16 697 655 -54 -582 -618 -203 557 799 118 -535 -667
2875 -667 -301 439 846 293 -565 -809 -328 500 832 274 -450 -672 -402 326 826 366 -430 -643 -430 149
2895 149 789 605 -285 -774 -483 233 782 524 -266 -712 -533 104 747 573 -219 -602 -465 -92 559 734
$$ [...]
8191@
##END NTUPLES=NMR FID
##END=
