##TITLE=1H_IG-APTMS
 CDCl3
 8 sc, 
 1.4.2024
##JCAMPDX= 6.0         $$ Bruker NMR JCAMP-DX V2.0
##DATA TYPE= NMR FID
##DATA CLASS= NTUPLES
##ORIGIN= UXNMR, Bruker Analytische Messtechnik GmbH
##OWNER= root
$$ XWIN-NMR		Version 3.5
$$ Mon Apr  1 16:26:17 2024 Russian Standard Time (UT+4h)  she@DPX200
##.OBSERVE FREQUENCY= 200.1311
##.OBSERVE NUCLEUS= ^1H
##.DELAY= (6, 6)
##.ACQUISITION MODE= SIMULTANEOUS
##.ACQUISITION SCHEME= undefined
##.AVERAGES= 8
##.DIGITISER RES= 18
##SPECTROMETER/DATA SYSTEM= spect
##.PULSE SEQUENCE= zg30
##.SOLVENT NAME= D2O
##.SHIFT REFERENCE= (INTERNAL, D2O, 0, 15.7039)
##AUDIT TRAIL= $$ (NUMBER, WHEN, WHO, WHERE, WHAT)
$$ ##TITLE= Audit trail, XWIN-NMR		Version 3.5
$$ ##JCAMPDX= 5.01
$$ ##ORIGIN= Bruker BioSpin GmbH
$$ ##OWNER= she
$$ F:/spectra/data/she/nmr/H-F/1/audita.txt
$$ ##AUDIT TRAIL=  $$ (NUMBER, WHEN, WHO, WHERE, WHAT)
(   1,<2024-04-01 16:24:54.00 +0400>,<she>,<DPX200>,
      <created by zg, POWCHK disabled, PULCHK disabled
       configuration hash MD5:
       00 E9 B6 7A A2 85 ED C7 34 08 36 98 17 FE 4E 26
       data hash MD5: 16K
       B4 8E 2C 47 08 2C F6 5B 55 9A C3 5D 92 93 84 E6>)
$$ ##END=
$$ 
$$ hash MD5
$$ 81 4E 85 D3 DA D8 E0 8D 10 67 94 11 33 28 AB 0D
##$RELAX= 
##$RELAX= 
##$RELAX= 
##$RELAX= 
##$RELAX= 
##$RELAX= 
$$ Bruker specific parameters
$$ --------------------------
##$DU= <F:/spectra>
##$EXPNO= 1
##$NAME= <H-F>
##$PROCNO= 1
##$TYPE= <nmr>
##$USER= <she>
##$AMP= (0..31)
100 100 100 100 100 100 100 100 100 100 100 100 100 100 100 100 100 100 
100 100 100 100 100 100 100 100 100 100 100 100 100 100 
##$AQSEQ= 0
##$AQ_mod= 1
##$AUNM= <au_zg>
##$AUTOPOS= <>
##$BF1= 200.13
##$BF2= 200.13
##$BF3= 200.13
##$BF4= 200.13
##$BF5= 200.13
##$BF6= 200.13
##$BF7= 200.13
##$BF8= 200.13
##$BYTORDA= 1
##$CFDGTYP= 0
##$CFRGTYP= 5
##$CHEMSTR= <none>
##$CNST= (0..31)
1 1 145 1 1 1 1 1 1 1 1 1 1 1 1 1 1 1 1 1 1 1 1 1 1 1 1 1 1 1 1 1 
##$CPDPRG= <>
##$CPDPRG1= <>
##$CPDPRG2= <>
##$CPDPRG3= <>
##$CPDPRG4= <mlev>
##$CPDPRG5= <mlev>
##$CPDPRG6= <mlev>
##$CPDPRG7= <mlev>
##$CPDPRG8= <mlev>
##$CPDPRGB= <>
##$CPDPRGT= <>
##$D= (0..31)
0 1.2 0 0 0 0 0 0 0 0.06 0 0.03 0 0 0 0 0.0002 0 0 0 0 0 0 0 0 0 0 0 0 
0 0 0 
##$DATE= 1711974293
##$DBL= (0..7)
120 120 120 120 120 120 120 120 
##$DBP= (0..7)
150 150 150 150 150 150 150 150 
##$DBP07= 0
##$DBPNAM0= <>
##$DBPNAM1= <>
##$DBPNAM2= <>
##$DBPNAM3= <>
##$DBPNAM4= <>
##$DBPNAM5= <>
##$DBPNAM6= <>
##$DBPNAM7= <>
##$DBPOAL= (0..7)
0.5 0.5 0.5 0.5 0.5 0.5 0.5 0.5 
##$DBPOFFS= (0..7)
0 0 0 0 0 0 0 0 
##$DE= 6
##$DECBNUC= <off>
##$DECIM= 32
##$DECNUC= <off>
##$DECSTAT= 4
##$DIGMOD= 1
##$DIGTYP= 9
##$DL= (0..7)
0 120 120 120 120 120 120 120 
##$DP= (0..7)
150 150 150 150 150 150 150 150 
##$DP07= 0
##$DPNAME0= <>
##$DPNAME1= <>
##$DPNAME2= <>
##$DPNAME3= <>
##$DPNAME4= <>
##$DPNAME5= <>
##$DPNAME6= <>
##$DPNAME7= <>
##$DPOAL= (0..7)
0.5 0.5 0.5 0.5 0.5 0.5 0.5 0.5 
##$DPOFFS= (0..7)
0 0 0 0 0 0 0 0 
##$DQDMODE= 0
##$DR= 18
##$DS= 0
##$DSLIST= <SSSSSSSSSSSSSSS>
##$DSPFIRM= 0
$$ [...]
##$SUBNAM2= <"">
##$SUBNAM3= <"">
##$SUBNAM4= <"">
##$SUBNAM5= <"">
##$SUBNAM6= <"">
##$SUBNAM7= <"">
##$SUBNAM8= <"">
##$SUBNAM9= <"">
##$SW= 18.051750892319
##$SWIBOX= (0..15)
0 0 2 0 0 0 0 0 0 0 0 0 0 0 0 0 
##$SW_h= 3612.71676300578
##$TD= 16384
##$TD0= 1
##$TE= 0
##$TE2= 300
##$TE3= 300
##$TEG= 300
##$TL= (0..7)
0 120 120 120 120 120 120 120 
##$TP= (0..7)
150 150 150 150 150 150 150 150 
##$TP07= 0
##$TPNAME0= <>
##$TPNAME1= <>
##$TPNAME2= <>
##$TPNAME3= <>
##$TPNAME4= <>
##$TPNAME5= <>
##$TPNAME6= <>
##$TPNAME7= <>
##$TPOAL= (0..7)
0.5 0.5 0.5 0.5 0.5 0.5 0.5 0.5 
##$TPOFFS= (0..7)
0 0 0 0 0 0 0 0 
##$TUNHIN= 0
##$TUNHOUT= 0
##$TUNXOUT= 0
##$USERA1= <user>
##$USERA2= <user>
##$USERA3= <user>
##$USERA4= <user>
##$USERA5= <user>
##$V9= 5
##$VALIST= <valist>
##$VCLIST= <CCCCCCCCCCCCCCC>
##$VD= 0
##$VDLIST= <DDDDDDDDDDDDDDD>
##$VPLIST= <PPPPPPPPPPPPPPP>
##$VTLIST= <TTTTTTTTTTTTTTT>
##$WBST= 1024
##$WBSW= 4
##$XGAIN= (0..3)
0 0 0 0 
##$XL= 0
##$YL= 0
##$YMAX_a= 894414
##$YMIN_a= -1038089
##$ZGOPTNS= <>
##$ZL1= 120
##$ZL2= 120
##$ZL3= 120
##$ZL4= 120
##$ABSF1= 10
##$ABSF2= 0
##$ABSG= 5
##$ABSL= 3
##$ALPHA= 0
##$AQORDER= 0
##$ASSFAC= 0
##$ASSFACI= 0
##$ASSFACX= 0
##$ASSWID= 0
##$AUNMP= <proc_1d>
##$AZFE= 0.1
##$AZFW= 0.1
##$BCFW= 1
##$BC_mod= 2
##$BYTORDP= 1
##$COROFFS= 0
##$CY= 11.3945322036743
##$DATMOD= 1
##$DC= 2
##$DFILT= <>
##$DTYPP= 0
##$F1P= 15.7292609196834
##$F2P= 12.9074282941183
##$FCOR= 0.5
##$FTSIZE= 0
##$FT_mod= 4
##$GAMMA= 1
##$GB= 0.15
##$INTBC= 1
##$INTSCL= 1
##$ISEN= 128
##$LB= 0.24
##$LEV0= 0
##$LPBIN= 0
##$MAXI= 10000
##$MC2= 0
##$MEAN= 0
##$ME_mod= 0
##$MI= 1.114404
##$NCOEF= 0
##$NC_proc= 0
##$NLEV= 6
##$NOISF1= 3.799351
##$NOISF2= 2.8
##$NSP= 1
##$NTH_PI= 0
##$NZP= 0
##$OFFSET= 15.70392
##$PC= 1
##$PHC0= -25302.14
##$PHC1= 15.78731
##$PH_mod= 1
##$PKNL= yes
##$PPARMOD= 0
##$PSCAL= 0
##$PSIGN= 0
##$REVERSE= no
##$SF= 200.130013532006
##$SI= 16384
##$SIGF1= 3
##$SIGF2= 2
##$SINO= 400
##$SIOLD= 16384
##$SREGLST= <1H.CDCl3>
##$SSB= 0
##$STSI= 0
##$STSR= 0
##$SW_p= 3612.71676300578
##$SYMM= 0
##$S_DEV= 0
##$TDeff= 0
##$TDoff= 0
##$TI= <>
##$TILT= no
##$TM1= 0
##$TM2= 0
##$TOPLEV= 0
##$USERP1= <user>
##$USERP2= <user>
##$USERP3= <user>
##$USERP4= <user>
##$USERP5= <user>
##$WDW= 1
##$XDIM= 8192
##$YMAX_p= 0
##$YMIN_p= 0
$$ End of Bruker specific parameters
$$ ---------------------------------
##NTUPLES= NMR FID
##VAR_NAME=  TIME,          FID/REAL,        FID/IMAG
##SYMBOL=    X,             R,               I
##VAR_TYPE=  INDEPENDENT,   DEPENDENT,       DEPENDENT
##VAR_FORM=  AFFN,          ASDF,            ASDF
##VAR_DIM=   8192,          8192,            8192
##UNITS=     SECONDS,       ARBITRARY UNITS, ARBITRARY UNITS
##FACTOR=    0.0002768,     1,               1
##FIRST=     0,             0,               0
##LAST=      2.2672688,     0,               0
##MIN=       0,             -1038089,        0
##MAX=       2.2672688,     894414,          0
$$ Real data points
##PAGE= N=1
##DATA TABLE= (X++(R..R)), XYDATA
$$ [...]
2380B579m515j964M582K215m274k407M099K972l638l319L625L656l163l724K829
$$ 2579 -1936 -3900 682 2897 -1377 -3784 315 3287 -351 -3670 -45 3611 448 -3276 -447
2395d47M200k310m575K343M755j736m808J014N377q39n352J15N176M93n474r24
$$ -447 3753 1443 -3132 -789 3966 2230 -2578 -1564 3813 2974 -2378 -2263 2913 3406 -2068 -2992
2411b992N369J248m986k370M942K783n076l231M583L441l800m411L514M644l276
$$ -2992 2377 3625 -1361 -3731 1211 3994 -1082 -4313 270 3711 -89 -4500 -986 3658 382
2426C82m788K271N467j821n712J479N584n47n592k23O020O95n642r72N158K115
$$ 382 -4406 -2135 3332 1511 -4201 -2722 2862 2315 -3277 -3500 2520 3215 -2427 -3399 1759 3874
2442C874m944k588N072K982m374l555M108L572l245m057K847M422k294m706J783
$$ 3874 -1070 -3658 1414 4396 22 -3533 575 4147 902 -3155 -308 4114 1820 -2886 -1103
2457a103M699j514m613O40M521k61m757j47M329P10m603r95M343J089m093j561
$$ -1103 3596 2082 -2531 -1891 2630 2369 -2388 -2535 1794 2504 -2099 -3094 1249 2338 -1755 -3316
2473c316L801J953l797j885L299K489l430k564L264L023l052k952K783L355k233
$$ -3316 485 2438 -1359 -3244 55 2544 -886 -3450 -186 2837 -215 -3167 -384 2971 738
2488G38l653K369L889j889l964J632M112j051m363O72M759m69m711j6M776M34
$$ 738 -2915 -546 3343 1454 -2510 -878 3234 2183 -2180 -1508 3251 2782 -1929 -1945 2831 3265
2504C265m826j167M828J611n084k124M622K460m272l293L918L701l649m364L450
$$ 3265 -1561 -2728 2100 3711 -1373 -3497 1125 3585 -687 -3980 -62 3639 -10 -4374 -924
2519i24M391k603n185K032N296j353n438N88N865p7n775l06N503J364n271j677
$$ -924 3467 864 -4321 -2289 3007 1654 -3784 -3196 2669 2592 -3183 -3489 2014 3378 -1893 -3570
2535c570N093K297m695k777M368L422l689l773L429L817k490m530K296M767j869
$$ -3570 1523 3820 -875 -3652 716 4138 449 -3324 105 3922 1432 -3098 -802 3965 2096
2550B096m781J297M617r20m518J23M434J55m405o16M034Q18l860j302L560J677
$$ 2096 -2685 -1388 3229 2309 -2209 -2086 2348 2503 -1902 -2518 1516 2334 -1526 -2828 732 2409
2566B409l775j715L267J888k913k241K803K498k616k703K559L078k541k907K429
$$ 2409 -1366 -3081 186 2074 -839 -3080 -277 2221 -395 -3098 -539 2539 -2 -2909 -480
2581d80L212j953l279J707L620j403l633J313L852q52l966M41M184j09m161n51
$$ -480 2732 779 -2500 -793 2827 1424 -2209 -896 2956 2104 -1862 -1421 2763 2654 -1507 -2058
2597b058M399P55m398j364M319J739m159k535M164K668m261k836L287L497l041
$$ -2058 2341 3096 -1302 -2666 1653 3392 -767 -3302 862 3530 -731 -3567 -280 3217 176
2612A76m064K576M316j944m972J768M690o79n052K17M951N89n139j092N231J719
$$ 176 -3888 -1312 3004 1060 -3912 -2144 2546 1867 -3185 -2968 1983 2572 -2567 -3659 1572 3291
2628C291m680k198M483K763m024k956L680L542l192l779K809L844j989m248J592
$$ 3291 -1389 -3587 896 3659 -365 -3321 359 3901 709 -3070 -261 3583 1594 -2654 -1062
2643a062M483j190m301O16M092q7m449k13M061O07m019j013L463J275l539j367
$$ -1062 3421 2231 -2070 -1454 2638 2551 -1898 -2111 1950 2557 -1462 -2475 988 2263 -1276 -2643
2659b643L056J502k851j957K958K084k869k094K557K179k313k254J960K799j741
$$ -2643 413 1915 -936 -2893 65 2149 -720 -2814 -257 1922 -391 -2645 -685 2114 373
2674C73l207J937L152j415l125J416L389q58l771Q62L899n16l821J43L875L71
$$ 373 -2834 -897 2255 840 -2285 -869 2520 1662 -2109 -1247 2652 2136 -1685 -1542 2333 2704
2690B704l815r84M086J113m082j621L890J926l857k384L269L148l234l521K774
$$ 2704 -1111 -2095 1991 3104 -978 -2599 1291 3217 -640 -3024 245 3393 159 -3362 -588
2705e88L777k696l973J800M372j383m758R25M780l40m813l03M808Q46m381j352
$$ -588 3189 493 -3480 -1680 2692 1309 -3449 -2524 2256 1916 -2897 -3200 1608 2454 -1927 -3279
2721c279M109K272m099k278L750K791l220l168K905L683k451m004K333L826j537
$$ -3279 830 3102 -997 -3275 475 3266 46 -3122 -217 3466 1015 -2989 -656 3170 1633
2736A633l841J137L960q90l746K54L806R6m037k12L522O08l318j177L076J428
$$ 1633 -2208 -1071 2889 1999 -1747 -1493 2313 2409 -1628 -1840 1682 2290 -1028 -2205 871 2299
2752B299l196j539K879J560k670k047K721J834k222k188K205K321k106k447J787
$$ 2299 -897 -2436 443 2003 -667 -2714 7 1841 -381 -2569 -364 1957 -149 -2596 -809
2767h09K762j561k645J309L029j163l120J137L257p03l261L42L634j15l515l21
$$ -809 1953 392 -2253 -944 2085 922 -2198 -1061 2196 1493 -1768 -1426 2208 2093 -1422 -1743
2783a743L810O95l683j304L762J561l654j984L444K274l312k643K889L013k695
$$ -1743 2067 2762 -921 -2225 1537 3098 -556 -2540 904 3178 -134 -2777 112 3125 430
2798D30l665K335L631j703l940J172M094p86m308J38M270J54m252n50M246J143
$$ 430 -3235 -900 2731 1028 -2912 -1740 2354 1568 -2740 -2602 1668 1822 -2430 -2980 1266 2409
2814B409m059j575L836K217l533k360L023K994k597l094K270L386j968l352J612
$$ 2409 -1650 -3225 611 2828 -705 -3065 -42 2952 355 -2739 -469 2917 949 -2403 -791
2829g91L626j214l405M45L854n61l405L0L440J64l150q25L394N24k984j054K610
$$ -791 2835 1621 -1784 -1339 2515 1954 -1451 -1421 2019 2183 -967 -1792 1602 2126 -858 -1912 698
2846F98J281k683j599K561J573k334k035K380J925k156k080J966K097j622k308
$$ 698 1979 -704 -2303 258 1831 -503 -2538 -158 1767 -389 -2469 -503 1594 -28 -2336
2861b336J541K571j323k832J225L051r85l007O55L376k54l250k0L549L13l549
$$ -2336 -795 1776 453 -2379 -1154 1897 912 -2095 -1440 1936 1682 -1568 -1588 1961 2274 -1275
2877a275n75L604Q63l222j540L265J869l224k200K906K534k732k979K462L150
$$ -1275 -1850 1754 2617 -605 -2145 1120 2989 -235 -2435 471 3005 273 -2706 -244 2906
2892B906k140l497J565L620j135l922N97L894k56m070j69L981P86l952r38L261
$$ 2906 766 -2731 -1166 2454 1319 -2603 -2006 1888 1632 -2438 -2607 1374 2160 -1792 -2730 531
2908E31J632l306j806L121K096k659k314K406K686j964k686J657K992j184l216
$$ 531 2163 -1143 -2949 172 2268 -391 -2705 -299 2387 423 -2263 -606 2386 1202 -2014
2923b014J110L174o01l212N12L185j11l169j27L013K66k797p36K678Q64k775j012
$$ -2014 -904 2270 1669 -1543 -1031 2154 2043 -1126 -1253 1760 2026 -771 -1507 1171 2035 -740 -1752
2940a752K445J148k444j550K531J403k182j925K233J878j931k326J948K278j671
$$ -1752 693 1841 -603 -2153 378 1781 -401 -2326 -93 1785 -146 -2472 -524 1754 83
2955H3k476J442K724j172k759Q58L044o70k836M03L121R0l405M2L158P71l314
$$ 83 -2393 -951 1773 601 -2158 -1300 1744 1074 -1762 -1359 1762 1852 -1553 -1511 1647 2418 -896
2972h96j108L392J366l131j724K911K002k600k512K389K837k305l080J614L287
$$ -896 -2004 1388 2754 -377 -2101 810 2812 212 -2300 89 2926 621 -2459 -845 2442
2987B442j499l300Q43L615n86l691J19L403L73l432q08L137J277k993j547K909
$$ 2442 943 -2357 -1514 2101 1515 -2176 -2057 1346 1719 -1713 -2521 616 1893 -1100 -2647 262
3003B62J663k548j933K229K494k090k401J876K441j241k640J158K741j020k662
$$ 262 1925 -623 -2556 -327 2167 77 -2324 -448 1993 752 -1888 -730 2011 991 -1671
3018a671R06K629l91k594J62K652lk463k27K397L79k347p31K298Q39k382j070
$$ -1671 -765 1864 1473 -1121 -959 1693 1690 -773 -1000 1397 1776 -571 -1302 996 1835 -547 -1617
3035a617K176J063k029j405J929J477k128j636J767K075j779k224J733K219j424
$$ -1617 559 1622 -407 -1812 117 1594 -534 -2170 -403 1672 -107 -2331 -598 1621 197
3050A97k450J191K591j039k672R97K863m86k990K37L188k4k892l31K930R11l089
$$ 197 -2253 -1062 1529 490 -2182 -1185 1678 1192 -1798 -1561 1627 1603 -1289 -1620 1310 2221 -868
3067h68j230L205J615k865k088K438K625k579k405J801L026j729l244J515K929
$$ -868 -2098 1107 2722 -143 -2231 207 2832 253 -2152 -351 2675 946 -2298 -783 2146
3082B146q83l108K62L270K5l192n15L236P35l212j214K901J471k742j699K348
$$ 2146 1263 -1845 -1583 1687 1712 -1480 -1995 1241 1976 -1236 -2450 451 1922 -820 -2519 -171
3098a71K086k308j946J890K148j430k233J315K413j091k308O97K370k38k367K67
$$ -171 1915 -393 -2339 -449 1699 269 -1964 -649 1764 673 -1635 -938 1432 1194 -1173 -906
3114i06K275J3k345N0K167L11k141m82K257M10k119q39K185O63j900r56J925R48
$$ -906 1369 1382 -963 -913 1254 1565 -576 -1058 1199 1609 -510 -1349 836 1499 -401 -1357 568 1516
3132A516j979j182K007J116j797j449J446J729j349k056J433K064j087k521R79
$$ 1516 -463 -1645 362 1478 -319 -1768 -322 1407 58 -1998 -565 1499 412 -2109 -1130
3147a130K672r04k754Q55K714k71k833p0L147M03l024p37K902J140k798j246K530
$$ -1130 1542 638 -2116 -1261 1453 1182 -1651 -1721 1426 1829 -1195 -1932 970 2110 -688 -1934 596
3164E96J968k376k199K233K486j912k845J560K951j081l168Q67K845m74l059j20
$$ 596 2564 188 -2011 222 2708 796 -2049 -489 2462 1381 -1787 -920 1925 1451 -1608 -1728
3180a728L034L89k920p12K600J226k738j474K376J531j938k058J977K259j800
$$ -1728 1306 1695 -1225 -1937 663 1889 -849 -2323 53 1584 -354 -2412 -435 1824 24
3195B4k292J603K105j012k174J152K138o97k248N18K133k22k074J37K026P8j832
$$ 24 -2268 -665 1440 428 -1746 -594 1544 847 -1401 -883 1250 1028 -1046 -909 1117 1195 -637
3212f37k57J747N49j765l22J684L04j552p66J638Q43j727q84J673J120k163j063
$$ -637 -894 853 1402 -363 -685 999 1303 -249 -1015 623 1466 -261 -1145 528 1648 -515 -1578
3229a578J864J128j622j697J726J598j530k027J267K338j182k338Q83K497n00
$$ -1578 286 1414 -208 -1905 -179 1419 -111 -2138 -871 1467 285 -2053 -1170 1327 827
3244H27k659K59K905l3k714m17L149O00k806j152K896J541k654j641K371K051
$$ 827 -1832 -1573 1332 1299 -1415 -1832 1317 1917 -889 -2041 855 2396 -258 -1899 472 2523
3260B523k113k506J980K587j704k562J056K983q52k986M35K848P1k843n62K681
$$ 2523 410 -2096 -116 2471 767 -1795 -739 2244 1392 -1594 -1159 1689 1760 -1083 -1645 1036
3276A036O11k440j148K454J179k265j533K122J552j740j874J454K142j256k204
$$ 1036 1647 -793 -1941 513 1692 -573 -2106 16 1568 -172 -2046 -592 1550 294 -1910
3291a910Q60K281p86j844M08K120k56k103K57J962J67k014Q4J834K53j690l48
$$ -1910 -1050 1231 445 -1399 -991 1129 873 -1230 -973 989 1156 -858 -774 1060 1313 -377 -725
3308g25J686K91j575n70J749N66j818l80J662L65j528r07J528R92j763r02J513
$$ -725 961 1252 -323 -893 856 1422 -396 -776 886 1251 -277 -1184 344 1336 -427 -1329 184
3325A84J072j474j533J559J713j497j971J236K147q45k380O02K386l04k634J94
$$ 184 1256 -218 -1751 -192 1521 24 -1947 -711 1436 591 -1789 -1187 1199 895 -1739 -1545
3341a545K602L48k680o36K819J041k611j332K605J654k532j587J952K182j734
$$ -1545 1057 1405 -1275 -1911 908 1949 -662 -1994 611 2265 -267 -1854 98 2280 546
3356E46k521J584K685j113k716O34K963m03k970j31K929J93k630n59K354R97k370
$$ 546 -1975 -391 2294 1181 -1535 -901 2062 1659 -1311 -1442 1487 1680 -950 -1509 845 1842 -528
3373e28j340K082J414j728j753J287J972j396j862J005K020q65j843M99K019l97
$$ -528 -1868 214 1628 -100 -1853 -566 1406 10 -1852 -847 1173 308 -1535 -1036 983 586
3389E86j773J54J870Q1j791m2J639J86j558J2J489K52j518k77J502L36j264o22
$$ 586 -1187 -1033 837 918 -873 -915 724 910 -648 -636 853 1105 -413 -690 812 1148 -116 -738
3407g38J399N62j476n23J451P21j586p62J312Q99j430j234J405J405j649j257
$$ -738 661 1223 -253 -776 675 1396 -190 -952 360 1259 -171 -1405 0 1405 -244 -1501
3423a501J133J729j153k068J037K213r70k143M01K574k93k588l4K752L17k616
$$ -1501 -368 1361 208 -1860 -823 1390 420 -1723 -1322 1252 959 -1629 -1663 1089 1406 -1210
3439a210n88K556J107k484j221K091J944k211j896J728K381j524k407J113K719
$$ -1210 -1798 758 1865 -619 -1840 251 2195 -16 -1912 -184 2197 673 -1734 -621 2098
3454B098q01k527K38K556J40k687l54K415O48k430q58K189J191k203j333J843
$$ 2098 1297 -1230 -992 1564 1704 -983 -1337 1078 1726 -704 -1562 627 1818 -385 -1718 125
3470A25J431j439j875J146J885j079j835Q16J824o46j614K43J718k0j817J69J563
$$ 125 1556 117 -1758 -612 1273 194 -1641 -825 999 353 -1261 -1018 700 680 -1137 -968 595
3487E95N1j362j71J398K08j100n44J564L50j431k42J283N58j309o24J448O39j511
$$ 595 646 -716 -887 511 719 -381 -925 639 989 -442 -684 599 1157 -152 -776 672 1311 -200
3505b00n15J313O57j358r71J583Q15j408j133J320J283j375j598J216J601r24
$$ -200 -715 598 1255 -103 -1074 509 1324 -84 -1217 103 1386 11 -1587 -371 1230 306
3521C06k087Q78K201q00k079K63K263J61k355k83K464N30k423r14K356J263k116
$$ 306 -1781 -903 1298 498 -1581 -1318 945 1106 -1249 -1532 932 1462 -961 -1875 481 1744 -372
3538c72j440J980J843j720j923J405K272j123k411Q47K392l90k724M39K358J93
$$ -372 -1812 168 2011 291 -1632 -227 2045 922 -1489 -642 1750 1360 -1364 -925 1433 1626
3554A626k521m90K328R05k274j175K082J245j884j396J533J508j295k005J298
$$ 1626 -895 -1385 943 1848 -426 -1601 481 1726 -158 -1554 -21 1487 192 -1813 -515
3569e15J494n64j927N59J796l89j586N7J715N4j458k37J642P6j494OJ231J97j041
$$ -515 979 415 -1512 -953 843 454 -1132 -1075 640 694 -764 -1001 641 717 -777 -771 460 657 -384
3588c84l68J099N49j014n11J246M33j259m61J148O24j127r02J393O52j164p30
$$ -384 -752 347 896 -118 -629 617 1050 -209 -670 478 1102 -25 -927 466 1118 -46 -776
3605g76J052Q81j162j222J181J182r09j545R09J688q66j882O70J802k31k166J78
$$ -776 276 1157 -5 -1227 -46 1136 227 -1318 -409 1279 413 -1469 -799 1003 772 -1394 -1216
3622a216K126J0k002m93K258Q89k296r67K048J348j802j806J934J808j434k039
$$ -1216 910 920 -1082 -1575 683 1572 -724 -1691 357 1705 -97 -1903 31 1839 405 -1634
3638a634J092K561j027k408O23K261j8k432k1K357J57k259m98K064R16j944j209
$$ -1634 -542 2019 992 -1416 -793 1468 1450 -982 -1003 1354 1511 -748 -1246 818 1734 -210 -1419
3655a419J773J243j678j480J322J788j227j841Q20J840o94j751L76J798m09j690
$$ -1419 354 1597 -81 -1561 -239 1549 322 -1519 -699 1141 447 -1304 -928 870 461 -1229
3671a229J90J613N7j365l38J573K08j260k65J156M89j132l59J010N53r99l77R42
$$ -1229 -1039 574 631 -734 -1072 501 709 -551 -816 340 829 -303 -662 348 901 -98 -475 467
3689D67O77j036p76J117P72j215q92J273Q70j235q99J081R72j097j182R31J230
$$ 467 1144 108 -668 449 1221 6 -886 387 1257 22 -877 204 1176 79 -1103 -172 1058
3706A058n98j600O38J397l41j884L23J852k16j669k90K012M26j942n86J930O18
$$ 1058 460 -1140 -502 895 554 -1330 -1007 845 629 -1040 -1330 682 1108 -834 -1420 510 1128
3723A128j592j058J447J622j654j581J543J772j205j769P50K128o35j911L23K086
$$ 1128 -464 -1522 -75 1547 -107 -1688 -145 1627 422 -1347 -597 1531 896 -1015 -692 1394
3739A394k07k071j5J950N71k235o96K014Q27j680j075J355J277j252j563J078
$$ 1394 1187 -884 -899 1051 1622 -613 -1309 705 1532 -148 -1223 132 1409 157 -1406 -328
3755c28J632j140j631J066J524o13j647L43J360pj479j17J529K15j630p5J352
$$ -328 1304 164 -1467 -401 1123 510 -1137 -794 566 559 -920 -1037 492 707 -923 -998 354
3772C54M26j275l87J055N57q91p79J297M90q49p43R24P08q92p89J222O42q78q67
$$ 354 780 -495 -882 173 730 -161 -940 357 847 -2 -745 179 887 -5 -794 428 1070 192 -675
3791f75Q46Q89q30r80P19J014o64j043L96J353n91j347M71J506n06j693K61J475
$$ -675 171 1060 230 -750 -31 983 319 -724 -328 1025 434 -913 -442 1064 558 -1135 -874 601
3809F01K48j723k71J719L76j683n47J327R57j386r74J273J145j027j187P50J786
$$ 601 849 -874 -1145 574 950 -733 -1280 47 1004 -382 -1356 -83 1062 35 -1152 -402 1384
3826A384q50j580N01J712j47k018K24K088nj918k44J714N10j900m12J532P32j430
$$ 1384 534 -1046 -545 1167 1020 -998 -774 1314 1309 -609 -853 861 1371 -529 -941 591 1323 -107
3844a07j050J393J079j199j230R84J261q43j479O73J433n53j354K70J534k21j576
$$ -107 -1157 236 1315 116 -1114 -130 1131 288 -1191 -518 915 362 -992 -722 812 591 -985
3861i85K08J392N7j417k67J427K35j196k47J006O07j075n36R13P88q74q85P99
$$ -985 -777 615 672 -745 -1012 415 650 -546 -793 213 820 -255 -791 122 910 36 -849 -50
3879e0J212r58r88P04J203p44j042O31J136n75j177O22Q99j98j321J37J317j91
$$ -50 1162 204 -784 -80 1123 379 -663 -32 1104 529 -648 -26 873 675 -646 -509 808 617
3897F17j331K7J262K49j635k12J270N06j433n26J355P80j374p55J024J152j174
$$ 617 -714 -687 575 824 -811 -1023 247 753 -680 -1206 149 929 -445 -1200 -176 976 -198
3914a98j019Q21J190o45j292Q73J258n05j451M53J490j43j607K84J436J4j455
$$ -198 -1217 -396 794 149 -1143 -270 988 483 -968 -515 975 832 -775 -491 945 959 -496
3931d96l10J595M15j443o67J376Q46j444q09J174R47j061j318J071J112q19j316
$$ -496 -806 789 1204 -239 -906 470 1316 -128 -937 237 1184 123 -1195 -124 988 169 -1147
3948a147O47J442o86j354K24J534k34j364J12J244K66j382k94J494K64j434l84
$$ -1147 -500 942 256 -1098 -874 660 426 -938 -826 418 684 -698 -992 502 766 -668 -1052
3965a052J371P31j208p81J258Q01j069q54Q38J132p70j083N98J137o13r43L11
$$ -1052 319 1050 -158 -939 319 1120 51 -803 35 1167 397 -686 -88 1049 436 -507 -196
3982a96J279l74j199P7J328j21j407q2J443o2j373j60J235L12j065o02J069O10
$$ -196 1083 709 -490 -413 915 794 -613 -695 748 686 -687 -847 388 700 -365 -967 102 712
4000G12j000p49J053P59r28r41O60J091n31j124M75J389n50j405N38J390l58j231
$$ 712 -288 -1037 16 775 -153 -1094 -434 657 126 -998 -523 866 316 -1089 -551 839 481 -750
4018g50J19J537l19j151r9J335K97j406l24J245O67j365l98J059N18r25q45J069
$$ -750 -631 906 587 -564 -663 672 969 -437 -761 484 1151 -214 -612 447 965 40 -805 264
4036B64P22r52r24P06J119p97r81L70J275m86j141J10J222j15j082j25J272N2
$$ 264 986 34 -890 -184 935 138 -843 -473 802 316 -825 -715 507 392 -690 -815 457 509
4054E09j303j49J404K12j211l55J334L88q91r90J273R17j189q26J003J046r10
$$ 509 -794 -943 461 673 -538 -893 441 829 -62 -1052 221 1138 -51 -877 126 1172 262
4071B62j034N67J294o95j003K56J311j28j477J77J188J90j435o2R77M26j155n63
$$ 262 -772 -205 1089 394 -609 -353 958 830 -647 -470 718 908 -527 -589 388 814 -341 -904
4089i04J303O05j396o93J078O31q06q34Q34Q29p92p47N80R50n99r66M00J036j04
$$ -904 399 1004 -392 -1085 -7 624 -182 -1016 -182 647 -145 -892 -312 638 39 -927 -527 509 405
4108D05j261L58R95N3j051k51J225J73j049j57J042L23r82m03R36O12j186k90
$$ 405 -856 -498 497 550 -501 -752 473 646 -403 -560 482 805 -177 -580 356 968 -218 -508
4126e08P89P10j013p76R20Q32o66j028P64P67o80j107O10J187n27j123M14J107
$$ -508 281 991 -22 -798 122 954 288 -740 24 791 111 -996 -386 801 274 -849 -435 672
4144F72k59j281J82J265r7j231j31J115O13j390k58R86P36j158o23P82J073q14
$$ 672 413 -868 -686 579 482 -749 -880 235 848 -542 -800 186 922 -236 -859 -77 996 182
4162A82j141Q99J288r63j341P38J588n08j314J55J338j23j308j60J423K33j358
$$ 182 -959 -60 1228 265 -1076 -338 1250 742 -572 -417 921 798 -510 -670 753 986 -372
4179c72m49J395L21j150n87R40P18q06r33P92R40p02j032M78J105o09p07J07J034
$$ -372 -821 574 895 -255 -842 98 816 10 -923 -131 809 107 -925 -447 658 49 -658 -551 483
4198D83k34r53j3J152l8r17N7Q93J47j044l6J053J00r22l48Q62M99r70l57P68
$$ 483 249 -704 -717 435 397 -520 -463 430 577 -467 -503 550 650 -272 -620 242 741 -229 -586 182
4218A82N90o65n53P36N15p75o15P65N49n11p73M28Q96m37j212N89R45l05j071
$$ 182 772 107 -446 290 805 30 -585 180 729 218 -555 -127 769 332 -880 -291 654 349 -722
4237g22K02Q96R8j356J29J227J09j140m94J437K63j231m67J248O47j087o52Q00
$$ -722 -520 376 474 -882 -753 474 583 -557 -1051 386 649 -582 -1049 199 846 -241 -893 -93
4255i3J072p06j043M81J274n57j227N55J122j63j271Q3J247J10j267k45J229K68
$$ -93 979 273 -770 -289 985 428 -799 -244 878 715 -556 -473 774 884 -383 -628 601 869
4273H69j152m48J017N15q64q13J034O94q77r02P83Q09m98j021K74J320n42j007
$$ 869 -283 -731 286 801 -63 -876 158 852 -25 -927 -144 665 167 -854 -580 740 198 -809
4291h09L59P76J4j219L02J001N4r54p3R12J48p16m10R20K94p21l64P47M40o93
$$ -809 -450 326 340 -879 -577 424 478 -476 -549 363 511 -205 -615 305 599 -122 -486 261 701 8
4311Hm44Q38L56p22l57M99O22n97p43M35Q16m41r41M98O49k37q78K44J016m33
$$ 8 -436 402 758 36 -321 178 800 203 -540 -105 711 270 -671 -173 476 239 -639 -395 621 188
4331A88r26J60R68M1j249K20Q89K39j200k33J126M62r10p64J122O09q25q23P88
$$ 188 -738 -578 390 431 -818 -598 291 530 -670 -903 223 685 -225 -989 133 742 -83 -906 -118
4350a18J012p40j085P17J048k61j269L67J001K5j175L3J221o4j097k29J108L04
$$ -118 894 154 -931 -214 834 573 -696 -329 672 697 -478 -445 776 712 -385 -614 494 798
4368G98j046m86J044O30p52r67Q05P13p87q13M98R58l74r65L73Q70k95q30Q7P72
$$ 798 -248 -734 310 940 188 -779 26 739 -48 -861 -363 595 221 -744 -371 499 204 -626 -539 233
4388B33J53j013k8R42K06r02j56P28L47p86l42Q95K60p09l24Q24L36m99m96N22
$$ 233 386 -627 -655 287 493 -409 -565 163 510 -276 -618 277 537 -172 -496 328 664 165 -331 191
4408A91M58o50n72P44N67n43o50N47N45l04q43L51Q51l81r20J54R89m02p88J68
$$ 191 649 -1 -573 171 738 195 -455 92 637 333 -510 -159 692 311 -609 -455 534 132 -656 -488
4428d88Q25K70j118j94J110J09j119k51J011L64o34q71R47Q81p96q59O26R17m99
$$ -488 337 607 -511 -705 405 514 -605 -856 155 519 -115 -986 -39 842 46 -813 -187 730 231
4447B31r36N03Q37j03r39p5J031M0q67l32J239L4q41l09P44Q06j188n20P55O84
$$ 231 -705 -202 635 532 -407 -482 549 589 -278 -610 629 663 -178 -487 257 1063 -125 -645 110 794
4467G94p43p52O52P78o05p90N18P05l11q39k0J115k18r11m9Q34K32p89j47P71
$$ 794 51 -701 -49 729 124 -666 -148 557 246 -593 -613 502 284 -627 -676 158 390 -399 -546 225
4487B25Q1o91q7O31K44o21l43P77J08l28m08N82M44n78k94K67O77o37m89M06O89
$$ 225 306 -385 -472 159 403 -218 -561 216 324 -4 -412 170 614 36 -258 9 686 49 -440 -34 655
4508F55m41o91M71O83n66n46J59Q28k44r13J79P52L0q72r0O91L40q43l63R28M94
$$ 655 214 -477 -6 677 111 -435 -276 552 308 -605 -426 326 356 -516 -606 85 425 -418 -781 147 641
4529F41j009n18R05M87o69o75P58P88o85p85M28R76m17q79K89J016p3j162k3J232
$$ 641 -368 -886 19 506 -163 -838 -80 708 23 -762 -334 642 225 -654 -365 651 578 -584 -607 625
4549F25j09q47k15R31L42q99m57Q51N79q27n67O96O20n58p18L01Q35l16r22L93
$$ 625 516 -331 -546 385 727 -172 -629 222 801 -26 -593 103 723 165 -553 -252 583 267 -655 -262
4569b62Q49m20p09J51O21K7n86j47N67J65p79R9O10J99o56k73P40K50p48m15P95
$$ -262 587 167 -542 -391 230 257 -329 -476 91 256 -523 -424 186 385 -271 -544 196 446 -302 -717 78
4590G8N06p02l52Q11J71n00m64M46P17o16n75N92M26k94p17L01O21j40p21R5Q07
$$ 78 584 -118 -470 341 512 12 -452 -6 711 95 -480 112 538 244 -473 -172 449 309 -412 -317 490
4611D90K9j143K31Q26J06r89k23R86K38r44m53Q20O22r33m41O39Q23o69q06N41
$$ 490 519 -624 -393 433 539 -450 -673 313 551 -393 -846 -26 596 -337 -778 -139 684 15 -791 -250
4631b50O88l68o50K10J057m43q22J33J039J15j139l8J013J90r85l41Q71N81q37
$$ -250 438 70 -580 -370 687 244 -578 -445 594 709 -430 -468 545 735 -250 -591 280 861 24
4650B4m56O11M17l74o21L87O25o54n10L48P52l94n94L37N12j75q24K27O10j1n87
$$ 24 -432 179 596 222 -399 -12 613 -41 -551 -203 549 155 -439 -102 410 235 -589 -362 248 237 -350
4671c50n9O46On96j24N18M07o09j55M82J89n95j87N18M31o92k22N04K70l51k53
$$ -350 -409 237 243 -353 -477 41 448 -161 -316 166 355 -240 -427 91 522 -170 -392 112 382 31 -222
4692b22J56Q70o83n76N69O25n98m92K96N65j07q79K64O94Jr05j12R94n6o09m81
$$ -222 -66 804 121 -455 114 739 141 -351 -55 510 403 -476 -212 482 483 -422 -534 460 404 -205 -686
4713f86J024L04r45n09R53K45m69q27Q08O69m66p72M06Q70k07r36J1J041j80q45
$$ -686 338 642 -303 -812 141 386 -83 -910 -102 567 101 -671 -265 605 398 -538 -527 514 334 -511
4733e11l6R54J49r80l1P41L01o67n33O31N70m18p40O96O16m97q17N53M75k06n42
$$ -511 -547 407 556 -424 -455 286 587 -80 -613 18 588 170 -570 126 742 245 -572 -19 456 250 -292
4754b92P0N70r3n99K80K21p0m20KN97k2o39pN89k13k50P6J97L19n92j74N84Pm03
$$ -292 -222 348 255 -344 -64 157 87 -333 -331 266 244 -395 -402 187 -26 -276 -200 -3 316 -276 -450 134 141 -262
4778b62j74O11J06m14k78M44M76o81k64N37M77l32n34J35O93k44n36J03P88j68
$$ -262 -436 175 281 -133 -411 33 509 -172 -436 101 578 246 -288 -153 540 296 -240 -137 651 483
4798D83r46J22P55J57q43k78J006k5p27k80P55M29p25n59M67P02m61n32L21O69
$$ 483 -463 -341 414 571 -272 -550 456 431 -296 -576 179 608 -117 -676 -209 493 32 -500 -179 490
4818D90l02p20K98O37j14p13J17O16J09q02r3Q33K02q35k47P14M86o67n22N54
$$ 490 188 -532 -234 403 289 -424 -307 309 418 -384 -477 356 558 -277 -524 190 676 9 -513 41
4838D1N66o49m09M81M01j44p01L68M10j26o07R2M75Km79Q1L34P6n87J47K94P1
$$ 41 607 -42 -451 30 431 287 -414 -46 364 238 -369 -277 198 200 -279 -198 136 212 -375 -228 66 137
4860A37n26o5M83J39m43j91N94R2m97k50O31M4p5n06N19K03n81o7M26L85m14l12
$$ 137 -389 -454 29 168 -275 -466 128 220 -277 -527 104 148 73 -433 86 289 -292 -359 67 452 38 -274
4882b74L61K82j45n80K37P76k60q05R8Q68l31o78J93O50J06o79n05R98L19p49
$$ -274 87 369 224 -356 -119 657 397 -408 -310 558 227 -451 -258 392 498 -181 -686 312 631 -118
4902a18m52L90Q06r56k31M82O57m23o72K10P92l03o43J78N79R6q15kP03J71p22
$$ -118 -570 -180 626 -330 -561 -79 578 155 -517 -307 485 182 -461 -283 296 392 -423 -425 278 449 -273
4923b73l50N77M78n01o16R20J42l30n17O28K95j59o04J99N93k87m01J08M55j22
$$ -273 -623 -46 432 -69 -685 235 377 47 -470 158 453 294 -310 -111 482 195 -206 -98 357 235
4943B35m51O4M48M7m70j26L22J75m37j45N40p2l77J02J84O0l29j08N04J56n40
$$ 235 -216 -152 296 343 -127 -253 69 244 -193 -338 202 130 -247 -145 39 99 -230 -338 166 322 -218
4964b18j77N45Q1m38j25L31M93o41j43L35L18k77k90K47L45j60p85N55N27j56
$$ -218 -395 150 231 -207 -332 -1 492 -149 -292 43 361 84 -206 41 386 226 -559 -4 523 367
4984C67p18J50P47j00p17k18Q31K20q21n3M60L52o68m30O47M93n43o26L74Q55
$$ 367 -351 -201 546 446 -271 -489 342 562 -259 -312 148 500 -168 -598 49 542 -1 -627 -253 602
5004F02n05o20L48O22k56p54K17P47rp14k67Q54j44k29n71Q81K11l78m56L02O54
$$ 602 97 -523 -175 447 191 -563 -346 401 392 -322 -589 265 121 -108 -679 202 413 35 -421 -119 535
5025E35l80n13K78N63l02m64K06O58k55l92O9L59j51m10k7M55K55m91j71M31m
$$ 535 155 -358 -80 483 181 -283 -77 581 326 -66 3 362 211 -199 -226 229 484 -7 -178 253 249
5046B49m43m8K96J5r4l34K32K52k33l47N19j36j30r5L86%l22j95M66R0n6m06M26
$$ 249 -194 -242 54 69 -25 -359 -127 125 -108 -455 64 -72 -202 -297 89 89 -233 -428 38 128 72 -334 92
5069I2K06j72m14K19L09k15m35K88N53j15n84jO33P8p36j09Q39N2o79k41O30L63
$$ 92 298 126 -288 -69 240 25 -410 -122 431 316 -268 -269 364 442 -294 -403 436 488 -191 -432 198 561
5091E61n43n39M74M83m37n83L85O57k10o82J15P58j76p55J30N33j8m26r1O40K35
$$ 561 18 -521 -47 436 -1 -584 -199 458 248 -434 -319 439 263 -492 -362 171 153 -273 -364 276 511
5112E11n91l83M74M02n29k76M52J68l6o38L92N40k63m54j7O45o4o54L08M34k50
$$ 511 -80 -463 11 413 -116 -392 60 228 192 -446 -54 486 223 -231 -248 397 333 -321 -13 421 171
5133A71k08j00L16k3l25K8K33P7j91l08M29L9l49J5L14j9l56j3K93J93m07j20
$$ 171 -37 -137 179 156 -169 -141 92 169 -22 -330 99 138 -211 -196 118 99 -257 -270 23 216 -191 -311
5155c11M01J01k77j8M8L84m58qP4M91l51l26K95K12r2l87J01N51J6q13J38O17
$$ -311 90 191 -86 -104 -56 328 -130 -138 -64 427 76 -250 45 257 165 -222 -121 430 446 -367 -229 388
5177C88N1o33j87N92K45m86l84N32K70m02n06L15N18j17p79L48N66j74p02K30
$$ 388 439 -194 -381 211 456 -30 -414 118 388 -14 -520 -205 313 196 -583 -235 331 157 -545 -315
5197c15P24n0p82J10L88K22n64j00L99L68n15k75M68K85k46m94K94L96j84n13
$$ -315 409 359 -423 -313 75 297 -267 -367 32 400 -115 -390 78 363 117 -377 -83 313 129 -384
5217c84M62L21q2m02k5M27ql68q8K90K8l30R8J64J05k42j24K17K5k28J42J06R1
$$ -384 78 399 317 -85 -110 317 309 -59 -147 143 171 -159 -61 103 208 -34 -158 59 84 -144 -2 104 195
5240A95m00k89N74N9l00k03L20Q7j52k73L32J92k05k50K68K85j40l50K13L21k44
$$ 195 -205 -494 80 139 -161 -364 -44 43 -109 -382 -50 142 -63 -313 -45 240 100 -250 -37 284 40
5261D0m24L00M79j61m73K1P20k27m73O7M45Q5o02M5L27L79m59l13L59M33n30n17
$$ 40 -384 -84 395 234 -239 -218 502 275 -198 -131 314 399 -203 -158 169 548 89 -224 135 568 38 -479
5283d79M79K82k40l54K59K91j1o34P7L67J96o75J1O83J44m95l28K62N91m23l49
$$ -479 0 282 42 -312 -53 238 227 -407 -330 37 233 -442 -431 252 396 -99 -427 -165 426 3 -346
5304c46L20K61j83l70L24J71nj64j35M23j25k52pM32r6m37N4K83J22m48Q1J93
$$ -346 -26 235 52 -318 6 177 172 8 -127 296 171 -81 -88 344 248 -189 -135 148 270 -178 -97 96
5326I6K14m10j75M07J8k02l69M65O4j70j97K10J60k33mJ67R4k99j62K30K30j46
$$ 96 310 -100 -275 132 150 -52 -421 44 108 -62 -259 -49 111 -122 -126 41 135 -164 -326 -96 134 -12
5348a2m46L98L19j91l74J48L40j69l56R8N80P6p29o5O14k1k90j16M17J66m10l13
$$ -12 -458 -60 259 68 -306 -158 182 13 -343 -245 335 411 -318 -383 231 210 -80 -196 221 387 -23 -336
5370c36L91M90n44m94N12M09l42k96R3L94j4p24K22M50o5l64p2O33j41n46P0L43
$$ -336 55 545 1 -493 19 428 86 -210 -117 277 263 -461 -239 211 146 -218 -290 343 202 -344 -274 69
5392F9J43m58j34M97Mk58k43L36J72j12m72M36K87j25m29J17M33k19j65J1L52
$$ 69 212 -246 -380 117 121 -137 -380 -44 128 16 -456 -20 267 142 -287 -170 263 44 -121 -110 242
5413B42j17j84j53N82k9l84l5K64Q9l37j54M94j12j05k43J88O6j04l39L62K68
$$ 242 125 -59 -212 370 341 -43 -78 186 275 -62 -216 278 166 61 -182 6 72 -32 -371 -9 259
5434B59k22m64J46M45q9m07J44N11k85l66K53L20l4o15J77M20r1k25q1K71J78
$$ 259 37 -427 -281 164 75 -332 -188 323 38 -328 -75 245 211 -404 -227 193 102 -123 -204 67 245
5455B45l14k21N00J41m21r9J70K90l14k69K69L79l51k45J72M68l59l84K33K01
$$ 245 -69 -290 210 351 -70 -169 1 291 -23 -292 -23 356 5 -240 -68 400 41 -343 -110 91
5475I1k8j76k14L96O8m58L6M35O1l49k11M86K8j86j97K33J74k52l58L92K21j45
$$ 91 63 -113 -327 69 137 -321 -285 150 211 -138 -349 137 165 -21 -218 15 189 -63 -421 -29 192 47
5497D7j53J00J69k1l01K06R7q5j08QJ45k5l50R5K88R6k49p5K32N9k48J2K91L4
$$ 47 -106 -6 163 142 -159 47 144 59 -49 -41 104 79 -271 -176 112 208 -41 -116 116 175 -73 -61 230 264
5521B64l68n5L04K6k37j53K03J79j40l09M04P6k37l34J50L54k00q7N5K88j00m22
$$ 264 -104 -159 145 171 -66 -219 -16 163 23 -286 118 194 -43 -377 -227 127 -73 -160 -105 183 83 -339
5543c39J89M00p7l25j15M18N8k38q9K43J96n04q5L62J35k30j88L53K04k92l13
$$ -339 -150 250 173 -152 -267 151 209 -29 -118 125 321 -183 -268 94 229 -1 -189 164 368 76 -237
5564b37J98K81j19l71J65M32q8o33J39M76m1l25k48N06J41m81j5J57L49l81k25
$$ -237 -39 242 123 -248 -83 349 261 -372 -233 243 202 -123 -371 135 276 -205 -220 -63 286 -95 -320
5585c20J85L89k88k49J71L99k44n76M80L57o5n04J28L18N2m73K07K57L0m90J93
$$ -320 -135 254 -34 -283 -112 287 43 -533 -53 304 239 -265 -137 181 233 -240 -33 224 254 -236 -43
5606d3J58R6k48k14M46R4k50j24L55L9k43l12K23J49j14k39J48L17k00l8l0J82
$$ -43 115 211 -37 -251 195 289 39 -85 270 309 66 -246 -23 126 12 -227 -79 238 38 0 -30 152
5628A52j06k89J83K83j03k64RK46L4k94m3J91J6k11j25L48J91k52k37M02J12l56
$$ 152 46 -243 -60 223 120 -144 -135 111 145 -149 -192 -1 15 -196 -321 27 218 -34 -271 131 243 -113
5650a13J57j2K82l49l69L82L96l53j69o9L69ml93K45J53O1n35N7L88N5n77K27
$$ -113 44 32 314 -35 -404 -22 374 21 -148 -217 152 148 -245 0 153 214 -321 -264 124 179 -398 -171
5672a71J59K82l61k11J51K88j24k81R8M50l73j3Q9K24j73k95J19M97l10m25J76
$$ -171 -12 270 -91 -302 -151 137 13 -268 -170 280 -93 -106 -17 207 34 -261 -142 355 45 -380 -204
5693b04N48k77l4j90L69k4l40N2L18pl66j92M70K80l58k15K43J95k19k22K44R0
$$ -204 344 67 33 -157 212 188 -152 -100 218 211 -155 -347 123 403 45 -170 73 268 49 -173 71 161
5715A61m7m06K45K70j67l16J04J04K1j88Q8J17N0k17oM77j16j83j35K89J66m11
$$ 161 114 -292 -47 223 56 -260 -156 -52 -31 -219 -131 -14 36 -181 -187 290 174 -9 -144 145 311 -100
5737a00PJ45J96k01q3J5K75j61l00K08L26m15m1K28R4K01n99K10K6Q2k80J15J55
$$ -100 -93 52 248 47 -36 -21 254 93 -207 1 327 -88 -129 99 193 394 -205 5 31 113 -167 -52 103
5760A03K03n38n9N31p7l36PL19L4k84k77L39J91k62j41K37K38j85k93J83K33k33
$$ 103 306 -232 -291 240 163 -173 -166 153 187 -97 -374 -35 156 -106 -247 -10 228 43 -250 -67 166 -67
5782f7k65K31K65p5k83J11K11l9k71Q2K17O4k52j33K87J36l62J30O8J80j47l14
$$ -67 -332 -101 164 89 -194 -83 128 89 -182 -100 117 181 -71 -204 83 219 -143 -13 55 235 88 -226
5804b26J65J92k88j4J80K22k90l3J73j6M6k82l8K44Mj90R1j3J05k00Q6M2K06k91
$$ -226 -61 131 -157 -171 9 231 -59 -92 81 65 111 -171 -209 35 39 -151 -60 -73 32 -168 -82 -40 166 -125
5828a25o3J37L19k91k67L39J49p2l46K42K94k73j89Q1L79j84k18j11M43J8m51
$$ -125 -188 -51 268 -23 -290 49 198 126 -220 22 316 43 -146 -65 314 130 -88 -199 244 262 -189
5849a89K14K8r2m9J20O5j56kj52J21M64l55k09J11K80j82k17L62j35p2k63L79
$$ -189 25 53 -39 -88 32 97 -59 -61 -213 -92 372 17 -192 -81 199 17 -200 162 27 -45 -308 71
5871G1K26l05j10L8P1J01l25Q2K37Q6l96K34J08Ol46nK47K21k61j00K93K79n81
$$ 71 297 -8 -118 -80 -9 92 -233 -151 86 172 -224 10 118 124 -222 -227 20 241 -20 -120 173 452 -129
5894a29n5M05nj17k34J37J44k6j89l4L30J6m04o6N39j45l35o0N52j90l94J01J38
$$ -129 -184 221 216 99 -135 2 146 120 -69 -103 227 243 -161 -227 312 167 -168 -228 324 134 -260 -159 -21
5917b1J59k22l02K93K32j08j88J18JN3k93K31J68r1j65p2K03J58l16Q5J73J47
$$ -21 138 -84 -386 -93 139 31 -157 -39 -38 15 -278 -47 121 30 -135 -207 -4 154 -162 -77 96 243
5939B43k16j60K06L2j80R1J71k30P1J6K29k17j39J31M3q1Q8l16K55J23k44r2J53
$$ 243 27 -133 73 105 -75 16 187 -43 28 44 273 56 -83 48 91 10 98 -218 37 160 -84 -176 -23
5962b3K65k49k17mL74k17j39J73R9k9j59q0L34j64j98J11K99jk97L6L10o4k91
$$ -23 242 -7 -224 -228 146 -71 -210 -37 62 33 -126 -206 128 -36 -234 -123 176 175 -122 -86 224 160 -131
5985a31j43L29J79k76m06N57M10n02k45J08M02k81l00N9M95j59j54j08J43K16
$$ -131 -274 55 234 -42 -448 109 519 17 -228 -120 282 1 -299 -240 255 96 -58 -166 -23 193
6005A93j85j12L08ol53j11K94K33l17j84J14K86j47k48J51L02k85k55K99J06K6
$$ 193 8 -104 204 198 -155 -266 28 261 -56 -240 -126 160 13 -235 -84 218 -67 -322 -23 83 109
6026A09j62q5K13K8j54k07K85mj62J50J23j68J3N3R4J15k04k25K52j16n6N7J11
$$ 109 -53 -138 75 103 -51 -258 27 23 -139 11 134 -34 -21 32 126 241 37 -188 64 -52 -108 -51 60
6049F0MKo9P7J80l47m8p5K96j21P6r1J28r8k03J76J35Rl20P8L56p8k59J30K17
$$ 60 64 66 -3 74 254 -93 -141 -216 80 -41 35 -56 72 -26 -229 -53 82 91 -229 -151 205 127 -132 -2 215
6074B15K9j97p6L33r5l77q6L25J79j99k27K49J59j99k41J37K44o1k46j62P03k57
$$ 215 244 47 -29 304 209 -168 -254 71 250 51 -176 73 232 33 -208 -71 173 112 -134 -296 407 150
6096A50l57M3K74J97l44j39L00q8r8j96K51N2l0r4N7J31n9k37J79R7P1k62MJ85
$$ 150 -207 -164 110 307 -37 -176 124 36 -62 -258 -7 45 15 -79 -22 109 50 -187 -8 89 160 -102 -98 87
6120H7q3j02NL2J90r1k0J74j80j16J9K25j07k9j08K25j4k01o3J92nl9k18K70r1
$$ 87 4 -98 -93 -61 129 38 18 192 12 -104 -85 140 33 4 -104 121 107 -94 -157 35 30 -9 -227 43 -48
6145d8O2m4mJ96j76j3M4mO6j77J31J99q4m63L02J00J6l18j1K01J27l17L9K17M2
$$ -48 14 -30 -34 162 -14 -27 17 13 79 -98 33 232 148 -315 -13 87 103 -215 -226 -25 102 -215 -176 41 83
6170H3k14r1M40L4l19m2J79O6k46J39LJ22J05m82R9L34o2l34J51K71ll49M6K78
$$ 83 -131 -222 218 252 -67 -109 70 136 -110 29 32 154 259 -223 -124 210 148 -186 -35 236 233 -116 -70 208
6194B08j46k2j27l7L15k77p3J00J96k11N8p1L74k10j51J94n0N0j55k9Q9J39k04
$$ 208 62 40 -87 -124 191 -86 -159 -59 137 -74 -16 -87 287 77 -74 120 70 120 -35 -64 25 164 -40
6217d0o3K64j16j33k6O3R3mp1L4P7j87K39j11L0j27J12Q7p2j00Q2Q0n5o7o4J56
$$ -40 -103 161 45 -88 -114 -51 42 38 -33 1 78 -109 130 19 49 -78 34 121 49 -51 31 111 56 -11 -75 81
6243H1J01j16k81L01K7q2j60n0K14k24P7J11O7k5n8j16J57lj32J26J11k5j61j07
$$ 81 182 66 -215 86 113 31 -129 -179 35 -189 -112 -1 66 41 -17 -133 24 21 -111 15 126 101 -60 -167
6267a67%K94j23j28J08J84N5l49J34J64k6l57J09L47j30k33N0K62n1k63R5N5O2
$$ -167 -167 127 4 -124 -16 168 223 -126 8 172 146 -211 -102 245 115 -118 -68 194 143 -120 -25 30 92
6290I2o1j86J62J80l90k6J64J98k04j36J66J05k6j85M5N7R1k01M4J80Qm6o6Q2
$$ 92 31 -155 7 187 -203 -229 -65 133 -71 -207 -41 64 38 -147 -102 -45 46 -155 -111 69 77 31 -35 47
6314D7R1j17LJ70rl68J7rJ77J47q2Ko2m4j23J63J48p7j52J01j49L24k67j10K68
$$ 47 138 21 24 194 185 -183 -166 -175 2 149 67 69 7 -37 -160 3 151 74 -78 23 -126 198 -69 -179 89
6339H9j4j58m4K53k55m6J24J31n0J1p1r8K16k46J22n9L27k33r3MJ76oj37J91R9
$$ 89 75 -83 -127 126 -129 -175 -51 80 30 41 -30 -128 88 -158 -36 -95 232 -1 -94 -90 86 80 -57 134 233
6364B33j30k62L4K43j16o6R2L15k82j99J37j8m0p9J6L92j85j00r7J49oJ56j19
$$ 233 103 -159 -125 118 2 -64 28 343 61 -138 -1 -19 -59 -138 -122 270 85 -15 -112 37 31 187 68
6387F8j77J95Jj70K5J35j4m90L00J32j39R0J5Q8j22Q0j95Q1J64j85r3J72Qp7O7
$$ 68 -109 86 87 -83 -58 77 63 -427 -127 5 -134 -44 -29 59 -63 17 -178 -97 67 -118 -211 -39 -31 -108 -41
6412d1j0J31J11l02J40J95J4k66J73j50j1n3J64J3K8k36J40N0M9j70j20K34K0
$$ -41 -51 80 191 -111 29 224 238 -28 145 -5 -16 -69 95 108 136 -100 40 90 139 -31 -151 83 103
6435A03l03J89Q0J85j96k34O0J04K1j02K42lj45j00J86J3j11on4J65j57m9%J08
$$ 103 -200 -11 69 254 58 -176 -116 -12 9 -93 149 146 1 -99 87 100 -11 -17 -71 94 -63 -112 -112 -4
6459dJ3o8PJ43J8Ok00K44o7j80K94k1j31o9J15MR7j30k43K47j70J99k61J24M4
$$ -4 9 -59 -52 91 109 115 -85 159 92 -88 206 185 54 -15 100 104 201 71 -172 75 -95 104 -157 -33 11
6484A1j00o7J56pp1J11r6N1r4O9M7Q9j93J69q8q2K74l20L0J66lnp3J08Km6j78
$$ 11 -89 -156 0 -7 -78 33 -63 -12 -106 -37 10 99 -94 75 -13 -95 179 -141 -111 55 52 47 -26 82 84 38 -140
6511a40P6O3N7p5l2J17l8m0k4q8Q2n1J32J83k16R6J9k27K1q5J05O1k4N5q8O0J16
$$ -140 -64 -1 56 -19 -51 66 28 -12 -36 -124 -42 -93 39 222 6 102 121 -106 -85 -170 -65 -4 -28 27 -61 -1 115
6538A15l54J85R9O2l21J06J54q4L4j33J73n0k6J0P4L1L2j57n1J96q2L3J3j04J63
$$ 115 -239 -54 45 107 -214 -108 46 -38 -4 -137 36 -14 -40 -30 44 75 107 -50 -101 95 13 46 59 -45 118
6563A18p5p8O3N7Oj99J00J08m7j57P4Q4l3j12R2J10j36K7LJ24j17p6N8M6L5j46
$$ 118 43 -35 28 85 91 -108 -8 100 53 -104 -30 54 21 -91 1 111 -25 2 5 129 12 -64 -6 40 75 -71
6589g1Q0J00J2j66m3j1JP2o9J51n3J3j63K48p7n3P3j73J84Q9k59O2J40j74n1M
$$ -71 9 109 121 -45 -88 -99 -98 -26 -95 56 3 16 -147 101 24 -29 44 -129 55 144 -115 -53 87 -87 -138 -134
6615a34J34j43M7J56l0K3k25K75j9j3k84J14J20J78k80j8J65j54j9M7j0L02j47
$$ -134 0 -143 -96 60 30 53 -172 103 84 71 -213 -99 21 199 -81 -99 66 -88 -107 -60 -70 232 85
6638H5n5r1K06n4k37J71j5L8k46J75P0j83p7L18Lj65J16j00R6O0l9J0N6p3n9k1
$$ 85 30 -61 145 91 -146 25 10 48 -198 -23 47 -136 -213 105 108 -57 59 -41 55 115 76 86 142 69 10 -11
6664a1J13j38P0m9J88k02o5J07M0j3j2j63o2J11K94j95j40j47L90k92J82j10k7
$$ -11 102 -36 34 -15 173 -29 -94 13 53 40 28 -135 -197 -86 208 13 -127 -274 116 -176 6 -104 -131
6687a31K39l12J91l4p2jJ14r3J36M3o3n8O7j35K11j13J0P1j25J04m2J54ok8k72
$$ -131 108 -204 -13 -47 -119 -120 -6 -99 37 80 17 -41 26 -109 102 -11 -1 70 -55 49 7 161 155 127 -145
6712a45P8J80p4M3j49O5J21k65R9K9L4r7o7J35j84J94J9k9MM4M4j46M4J95k51
$$ -145 -67 113 39 82 -67 -2 119 -146 -47 -18 16 -81 -148 -13 -197 -3 16 -13 -9 35 79 -67 -23 172 -79
6737g9J40j20J93k08M7l4J13K2n4j39p3L01j74K7q2J81pk4j21O9Q6j6Q4j0k05
$$ -79 61 -59 134 -74 -27 -61 52 74 20 -119 -192 109 -65 -38 -120 61 54 30 -91 -22 64 48 132 122 -83
6762h3J40n8K38k36J19p8k8J59k50m1J31N5j8Nq7k0l2J66j38Qj88L54q8J8j75
$$ -83 57 -1 237 1 120 42 14 173 -77 -118 13 68 50 55 -32 -52 -84 82 -56 -48 -236 118 30 48 -127
6787a27O2N6J29q3j68J28j9Pl7J84j63pj9J5N9Pj26j38K54J1K4j46K07P4j91J97
$$ -127 -65 -9 120 37 -131 -3 -22 -15 -52 132 -31 -38 -57 -42 17 24 -102 -240 14 25 49 -97 110 184 -7 190
6813A90j07j57J84k71J53R2j48rj57K83o4M1j4N8m1j11M8P8l1o5K23k03j04K00
$$ 190 83 -74 110 -161 -8 84 -64 -73 -230 53 -11 30 16 74 33 -78 -30 48 17 -48 175 -28 -132 68
6837F8j13j6K96l83M0L4j4j9L2J09L8J53k25K3J69q0j22j2qp3J18j02J88k1j4
$$ 68 -45 -61 235 -148 -108 -74 -88 -107 -75 34 72 225 0 23 192 112 -10 -22 -30 -103 15 -87 101 80 66
6862F6j58J06K4L4m3p1L5q8N4n1J42k1m9n2Q1q8J15o2p2J80o6q8J99N3r0m3k6
$$ 66 -92 14 38 72 29 -42 -7 -95 -41 -92 50 29 -20 -72 9 -79 36 -26 -98 82 16 -72 127 180 90 47 21
6889B1j52Q2J72k27o5J80k5M5J7k41O5J45k7N1J06l58J15l1J10K64l94P3J43p8
$$ 21 -131 -49 123 -104 -169 11 -14 31 48 -193 -128 17 -10 41 147 -211 -96 -127 -17 247 -147 -74 69 -9
6913io0J1j9L01k82Q7L4oq8J22j47K4n1J05J74l63J33k2J72j73j5J38K4j07O7
$$ -9 -69 -58 -77 224 -58 29 63 57 -31 91 -56 -32 -83 22 196 -167 -34 -56 116 -57 -72 66 90 -17 50
6938E0o0N3oj37M9N6P9k07K45j35K4j70K10O7N4j22j29M5J15j35Q8l1j1Q1k03
$$ 50 -10 43 37 -100 -51 5 84 -123 122 -13 11 -159 51 118 172 50 -79 -34 81 -54 34 3 -8 73 -130
6963a30Q3P6l6P4Q5j44kK7l9K7j09P3j61Q0J01o5J81j04j58n7K31N9o6l7K5J73
$$ -130 -47 29 -7 67 152 8 6 33 -6 21 -88 -15 -176 -96 5 -60 121 17 -141 -198 33 92 26 -11 14 187
6989A87m13P4J45P1j59J64j56J56n3L3OR9K3k35N8N0L0j34O2K1n1R6J3j89M7P4
$$ 187 -226 -152 -7 64 -95 69 -87 69 16 49 55 154 177 -58 0 50 80 -54 8 29 -22 74 87 -102 -55 19
7015A9j06K45q9j78J37j35n2R7oL2J71j29j29K15p2O2oL4j85J15n5r6O9m9K23
$$ 19 -87 158 69 -109 28 -107 -159 -62 -68 -36 135 6 -123 92 20 82 76 110 -75 40 -15 -111 -42 -91 132
7040A32j50p4N7p0N1J96j36n3J92k52J69j68J38j10K40k25N2m4M6K04k24O5r9
$$ 132 -18 -92 -35 -105 -54 142 6 -47 145 -107 62 -106 32 -78 162 -63 -11 -55 -9 195 -29 36 -63
7063f3J38m4P8J0k27J85j30K21j35K2nj20o1J81J8q4J00j46K9j09R0O7l4j29R
$$ -63 75 31 109 119 -108 77 -53 168 33 55 50 -70 -131 50 68 -16 84 -62 -33 -142 -52 15 -19 -148 -139
7088a39J31k9j19K21j01J63nj51Q0p3n0OJ54j96R7q3N5J77j56o1Q6k6j27J56j4
$$ -139 -8 -37 -156 65 -36 127 122 -29 51 -22 -72 -66 88 -108 -11 -94 -39 138 -18 -79 7 -19 -146 10 -4
7113dO2p9J04j02M7p9J36j00m6J36j1l5Nj51l5J72q6l7J51J39j37nj74J66k19
$$ -4 58 -21 83 -19 28 -51 85 -15 -61 75 64 29 34 -117 -152 20 -66 -103 48 187 50 45 -129 37 -182
7138a82J82M7q5K6P7K3q2o9P1r3N6m8M4Q7l28K87O9j00J06k66J84j50Q8Q2J1j26
$$ -182 0 47 -38 -12 65 88 6 -63 8 -85 -29 -77 -33 54 -274 13 82 -18 88 -178 6 -144 -56 26 37 -89
7164h9O6J4M8m3o5Q1K0j61QM0K65r0j34R7j87N1P7k9j4J71j25k69L02j13K20j52
$$ -89 -23 -9 39 -4 -69 12 32 -129 -121 -81 184 94 -40 57 -130 -79 -2 -31 -45 126 1 -268 34 -79 141 -11
7190a1o3K1J27k34n5J3J99no4J15L1J8j81K62j4r0L8m5j8j00j32P8Q0K0Rn1O1
$$ -11 -74 -53 74 -160 -215 -202 -3 -8 -72 43 74 92 -89 173 159 69 107 62 44 -56 -188 -110 -30 -10 -1 -52 9
7217IM1m0r4N9J17Pj08r5J37j30L6mJ17j13M4J2j17Q0m7Q7K1P7j53L07l07P5p6
$$ 9 50 10 -84 -25 92 99 -9 -104 33 -97 -61 -65 52 -61 -17 -5 -122 -42 -89 -2 19 96 -57 250 -57 18 -58
7244e8K89k12O6k08J2J56k1J71k01J14j82J26j00J03M4j53J71J53j77o2j35J08
$$ -58 231 19 85 -123 -111 45 24 195 -6 108 -74 52 -48 55 99 -54 117 270 93 31 -104 4
7266DqJ69k7j38m9R0q9P7r3J52j78J90j35l4J12n0J11j09L9n8O6o2n0J16j55J24
$$ 4 -4 165 138 0 -49 41 -48 29 -64 88 -90 100 -35 -69 43 -7 104 -5 34 -24 42 -20 -70 46 -109 15
7292A5O7Jm0P2j9k05J61m9O3j28K2l4O0j20K87j52oj15J60jr8k5J11k0r2m8J00
$$ 15 82 83 43 115 96 -109 52 3 66 -62 -40 -74 -14 -134 153 1 -5 -120 40 39 -59 -84 27 7 -85 -133 -33
7319c3K97l09K6K6lJ19J34l17J7M0J5j07J36Mo0j17J36L0l3Q1m5K5m3rp7K85k30
$$ -33 264 -45 -19 7 4 123 257 -60 -43 -3 12 -95 41 45 -15 -132 4 34 1 82 37 62 19 10 -67 218 -12
7346a2J64k31J26Mk58L56j57J48j72j5M3K5J15j15l0M7j48J2J08R0m0j50J14K3
$$ -12 152 -79 47 51 -207 149 -8 140 -32 -47 -4 21 136 21 -9 38 -110 -98 10 100 60 -90 24 47
7370D7om8k2Q8m8O4K9j68m1J15J04M5oj84K0q0J35j3k5LJ53l64K78P8j91L7M6
$$ 47 41 -7 -29 59 11 75 104 -64 -105 10 114 159 153 -31 -11 -91 44 31 6 9 162 -202 76 154 -37 0 46
7397D6J0l3q9l0J33N2j13N1j1p1N0r4R0n8N2j55J37J26j19K4M9M9j10k5rK4n5
$$ 46 56 23 -66 -96 37 89 -24 27 16 -55 -5 -99 -9 -67 -15 -170 -33 93 -26 -2 47 96 -14 -39 -48 -24 -79
7424g9M8L1N8K3p6j69k7Q3k1Q0J17j67K76j53J0O4j61j3Q5j48P4jq1K33j67k8
$$ -79 -31 0 58 81 5 -164 -191 -108 -129 -49 68 -99 177 24 34 98 -63 -76 9 -139 -65 -66 -147 86 -81 -109
7450a09O0R3K6l6j58M8P3J69k44J01L0N1j6j66N7J29m9l9lJ12j02P9o3jj62J32
$$ -109 -49 44 70 34 -124 -76 -3 166 -78 23 53 104 88 -78 -21 108 59 20 17 129 27 106 43 42 -120 12
7476A2J19j48L5QlJ5k8nJ37Nj03r7J86Q2k67Q0J6J42kj85k2K2J5Q9k51J67jk35
$$ 12 131 -17 18 26 23 38 10 5 142 147 44 -53 133 215 -52 28 44 186 184 -1 -23 -1 14 103 -148 19 18 -217
7504b17K79n8L9q0q5J53j18P9o3K9k8q4R0J69j43j46K33n2N3o8l5l3N2Q3k07K78
$$ -217 62 4 43 -37 -122 31 -87 -8 -71 -42 -70 -154 -64 105 -38 -184 49 -3 50 -18 -53 -86 -34 49 -158 120
7530A20nq4J61j65j7K16k77J88ol2j56J11O6O6k60R3j10J87Mj15o9K38j98p9P6
$$ 120 115 31 192 27 10 226 -51 137 131 99 -57 54 120 186 -74 19 -91 96 100 -15 -84 154 -44 -123 -47
7555d7qJ89l12K12J05p6l9j2J76k5r8j81j2J50P0j51M5K4rj17K14l1n4NjJ04j14
$$ -47 -55 134 -178 34 139 63 24 12 188 163 65 -116 -128 22 92 -59 -14 10 1 -116 98 67 13 18 17 121 7
7582Gm2N3j03J58n2J1r9K46jn2j40o9K17q3P5k18q0L43j19N9K7o2j38J54q6n6
$$ 7 -35 18 -85 73 21 32 -67 179 178 126 -14 -83 134 51 126 -92 -172 171 52 111 138 76 -62 92 6 -50
7608e0j17J17l7o6K33Qj42jo4J67k42L64k61K95q2l18K15J93j13q3PM0j1L9J3
$$ -50 -167 -50 -87 -153 80 88 -54 -55 -119 48 -194 170 -91 204 122 -196 19 212 99 16 23 63 52 91 104
7633A04J53k85j08K63j31J52j69q3o3J46J26k52K19P2l17Q5N5L3R6k01J31J1O1
$$ 104 257 -28 -136 127 -4 148 -21 -104 -167 -21 105 -147 72 144 -173 -88 -33 0 96 -105 26 37 98
7656I8j19j37K48q9k00K20J7j16J18p9J38n2j8R7j55J10Kk26M5J63j64j1K34k01
$$ 98 -21 -158 90 1 -199 21 38 -78 40 -39 99 47 29 126 -29 81 83 -143 -98 65 -99 -110 124 -77
7680g7K07l2k9J4J7p2q9O2J76k61J43mJ3Mj69N9R2j38j08K44J2k19n0J91J59j46
$$ -77 130 98 69 83 100 28 -61 1 177 -84 59 55 68 72 -97 -38 54 -84 -192 52 64 -155 -205 -14 145 -1
7706aQ8j78K02l7j05qR7n4q4l6J61k5p3l8R3o8nM6J43k2k06p4K40pk29k0K25K4
$$ -1 87 -91 111 74 -31 -39 58 4 -80 -116 45 20 -53 -91 2 -66 -71 -25 118 96 -110 -184 56 49 -180 -200 25 49
7734D9k01J82l9K92k53j38P6K34j24l9r4p2J79j47K41j06j28J33j19J07q6P3l6
$$ 49 -152 30 -9 283 30 -108 -32 202 78 39 -55 -127 52 -95 146 40 -88 45 -74 33 -53 20 -16
7757a6R3n7j4J2J06o5M8o7r4K2J33J29l87J67J49k01lJ43o9J64k95J41m3j23m7
$$ -16 77 20 6 18 124 59 107 40 -54 -32 101 230 -157 10 159 -42 -45 98 29 193 -102 39 -4 -127 -174
7782a74K11J00j05o2n1O8K7j1L9J00J5k51o0M0l2J61j16J62j13K3Ml9Nm0l3K22
$$ -174 37 137 32 -30 -81 -13 14 3 42 142 157 -94 -154 -114 -146 15 -101 61 -52 -29 -25 -64 -59 -99 -132 90
7808I0n7j42q7K29j21M7N4L4L4j14J49Pj13Jn9Q8j72J29j72J61L0J12k21J88j90
$$ 90 33 -109 -196 33 -88 -41 13 47 81 -33 116 123 10 11 -48 40 -132 -3 -175 -14 16 128 -93 95 -95
7833i5Qn8j3J61j07N8n6L4J66j45m2L2J44J4j82M5J5Nj01M4J07q6N3j53O0O8j5
$$ -95 -87 -145 -158 3 -104 -46 -102 -68 98 -47 -89 -57 87 101 -81 -36 -21 -16 -117 -73 34 -52 1 -152 -92 -24 -39
7860c9j1J32nk45R6nJ81j37J23j02J37j94q0R7QN0MpQN5k84J11M8J20j43M1Q8
$$ -39 -50 82 77 -168 -72 -77 104 -33 90 -12 125 -69 -149 -52 -44 6 10 3 11 66 -218 -107 -59 61 -82 -41 47
7887D7N1j35N3n2j63K15Q9j8r5m9p3J05o9m4O4J51k68n9J34J32Pj0j34K99j44
$$ 47 98 -37 16 -36 -199 16 105 87 -8 -57 -130 -25 -94 -138 -74 77 -191 -250 -116 16 23 13 -121 178 34
7912C4l3P1n7M9j65J50j07K72k46R8P6q1j11N0o5J88m3j06n7J4J63j88n7J8N7
$$ 34 1 72 15 64 -101 49 -58 214 -32 66 142 61 -50 0 -65 123 80 -26 -83 -69 94 -94 -151 -133 -76
7937g6R4j69O2M1J03p3L7m4n5J9K3Q9M7O4k80J85Q6r3r8P5J73l33J5J80m3N5l47
$$ -76 18 -151 -89 -48 55 -18 19 -25 -80 -61 -38 51 98 162 -118 67 153 60 -38 37 210 -123 -108 72 29 84 -263
7964b63K42J17p9k2j04J20p5j44J19J65l6kj25J91m7o7j04J38L8k66J81J25j19
$$ -263 -21 96 17 -5 -109 11 -64 -208 -89 76 40 38 -87 104 57 -10 -114 24 62 -204 -23 102 -17
7987a7K1p8J14q9j73J75l8j22l7L41J12p6k44n4J47j0k6P4M1l1J31k35R8K3l2
$$ -17 4 -74 40 -49 -222 -47 -85 -207 -244 97 209 133 -111 -165 -18 -28 -54 20 61 30 161 -74 24 47 15
8012A5j42J43oJ7r4J13O1q7j41K37q7J33k01M5RK5j5m2K6m4Rn1J06k3j20J24J49
$$ 15 -127 16 10 27 -67 46 107 20 -121 116 29 162 -39 6 15 40 25 -17 9 -35 -26 -77 29 6 -114 10 159
8039A59j26j32J33N5LOj01r9j6K65l39R0K71k30J86k61o4K43o2J2J08J52k63N5
$$ 159 33 -99 34 89 92 98 -3 -102 -118 147 -192 -102 169 -61 125 -136 -200 43 -19 -7 101 253 -10 45
8063D5p4P3j77l2K29o1mr7P3N4m6j69J59J1m4N7%P1j78O4K56j93Q7J3qj07j55
$$ 45 -29 44 -133 -165 64 3 -1 -98 -25 29 -17 -186 -27 -16 -60 -3 -3 68 -110 -46 210 17 104 117 109 2 -153
8090a53JJ68K7M1l93J58J36J28p3p7J08p4o3O4o7K41k99K43j36j1j7j36K48j3
$$ -153 -152 16 43 84 -309 -151 -15 113 40 -37 71 -3 -66 -2 -69 172 -127 116 -20 -31 -48 -184 64 51
8114E1j33M6N6N7m3Lk25J95J6r0k3J87K3l40J24j48L77k11J58l68K58J21j83M1
$$ 51 -82 -36 20 77 34 37 -188 7 23 -67 -90 97 120 -220 -96 -244 133 -78 80 -288 -30 91 -92 -51
8138e1J5N2o8k1J48l4k39K79p7j33K4K1J06J1rN4L5j9j84l8K07o7r9Q6oJ72p3
$$ -51 -36 16 -52 -73 75 41 -198 81 4 -129 -105 -84 22 33 24 78 113 94 -90 -128 79 12 -87 -1 -7 165 92
8165I2o3J04J3k60J58J35k28K0J04J90q1p2k05J75K7j36k51K63R1P9j30j58K35
$$ 92 29 133 146 -114 44 179 -49 -29 75 265 184 112 -93 82 109 -27 -278 -15 76 155 25 -133 102
8188A02l5K7j34
$$ 102 67 94 -40
8191d0
$$ Imaginary data points
##PAGE= N=2
##DATA TABLE= (X++(I..I)), XYDATA
0@%%%%%%Qj6J6k4L2m0N6p2R6j20J44j76K16k65L21l90M63n45O40p52Q80j017J175
$$ 0 0 0 0 0 0 0 8 -8 8 -16 16 -24 32 -40 56 -64 80 -96 120 -145 176 -214 249 -296 344 -408 472 -545 630
29F30j354J550j768K012k283K582k912L274l673M109m586N113n686O309o990P739
$$ 630 -724 826 -942 1070 -1213 1369 -1543 1731 -1942 2167 -2419 2694 -2992 3317 -3673 4066
45D066q556R444j0417J1484j2651J3931j5344J6908j8643K0580k2756K5216k8028
$$ 4066 -4490 4954 -5463 6021 -6630 7301 -8043 8865 -9778 10802 -11954 13262 -14766
58a4766L1273l5063L9563m5007N1750o0352P1757q7678J11605j51979K37043o89426
$$ -14766 16507 -18556 21007 -24000 27750 -32602 39155 -48523 63082 -88897 148146 -541280
70e41280O63232P72462j436163L69668J30943K58855q9832l41555L1888K45816
$$ -541280 121952 894414 -541749 -172081 -41138 217717 127885 -213670 -181782 64034
80F4034K81863m70480k25049N46410j27821J65089m99182r7394R72441n44092
$$ 64034 345897 -124583 -349632 196778 68957 234046 -265136 -362530 609911 65819
90F5819m35478L50931J16584L38258p52831o1774R02120m29191l82303K78763
$$ 65819 -369659 -18728 97856 436114 -316717 -378491 523629 94438 -287865 -9102
100i102J58326j45112l5420J68212m42453L84596L41428q23337L02786L22123
$$ -9102 149224 4112 -31308 136904 -305549 79047 420475 -402862 -100076 222047
110B22047k33299Q4265l79277L34217L10558n64289P1537K44599L855j63135l4558
$$ 222047 -11252 73013 -306264 27953 338511 -225778 -154241 90358 94213 -68922 -103480
121a03480J96493j94171J45062M9532k67558J95031j4325J12524j22181l23478
$$ -103480 93013 -101158 43904 93436 -174122 20909 6584 119108 -3073 -326551
131c26551N97140r1596m87232L54976N5839q0480k1780n8861P9963K960Q7766
$$ -326551 270589 178993 -308239 46737 102576 22096 316 -58545 21418 24378 112144
142A12144j60586p1336K30107m0684j5600k13433O1061M52494l94873k51110L86281
$$ 112144 -48442 -119778 110329 69645 54045 -159388 -98327 354167 -40706 -291816 94465
153I4465P4882j40233k33105J44127K75529k09871j32725M8180J40358N5938j84840
$$ 94465 169347 29114 -203991 -59864 215665 5794 -126931 -78751 61607 117545 -67295
164f7295n5832O6009K30830p4158m11270K64983L13398k54244k09118P5143L30306
$$ -67295 -123127 -57118 173712 99554 -311716 -46733 266665 12421 -196697 -121554 208752
175B08752o4383l87654J37765K85514o2087k42493o023K37976O476j24230j05299
$$ 208752 144369 -243285 -105520 179994 117907 -124586 -130609 107367 113843 -10387 -115686
186a15686O4654K44908j27857k35412J11228K06595p235k92638N325L35873o2604
$$ -115686 -51032 193876 66019 -169393 -58165 148430 141195 -151443 -146118 189755 127151
197A27151k68334K8961K21905J6593k15558j6432J52026M5482r7798j06034R3512
$$ 127151 -141183 -112222 109683 126276 -89282 -105714 46312 91794 -6004 -112038 -18526
208a8526J04837o3525r5811r443J41503K9760j77501j0416J60023J9715j44094
$$ -18526 86311 22786 -73025 -82468 59035 88795 -88706 -99122 60901 80616 -63478
219f3478l1230J45068J6197j15047m033P6525J4758n1107j1210L0198O595J848
$$ -63478 -94708 50360 66557 -48490 -52523 24002 38760 -12347 -23557 6641 13236 15084
231A5084j1101j7417K0804K0715j7522k0481J3356J9717j2758j1559J1667o050
$$ 15084 3983 -13434 7370 28085 10563 -9918 3438 23155 10397 -1162 10505 4455
243D455p693K4402m725m0144R608N0304j2383p0153J5923Q0286k4817p9808J4341
$$ 4455 -3238 21164 16439 -23705 -14097 36207 23824 -46329 -30406 49880 25063 -54745 -40404
256d0404P9108o54q7182p471Q1338K1135o9450n0036P2327O8137p0323p4235N2072
$$ -40404 38704 38050 -49132 -56603 24735 45870 -23580 -73616 -1289 66848 -3475 -77710 -25638
269b5638R7562l7047j19640L9447J23142k2643j21848N79J35198J0740j30226
$$ -25638 71924 34877 -84763 -45316 77826 55183 -66665 -66086 69112 79852 -50374
280e0374k0752J15402M9327j11316o7385J08285P2734q5952r1494O6648J13638
$$ -50374 -71126 44276 93603 -17713 -85098 23187 95921 9969 -81525 -14877 98761
291I8761o5022j16325M7998J12959k2242j27165Q252J27767k337j16299k2933
$$ 98761 33739 -82586 -34588 78371 56129 -71036 -62784 64983 62646 -53653 -76586
302g6586J11163M0137j13277m5831R7085N7412q2042p6286P8359Q0968o7601q0268
$$ -76586 34577 74714 -38563 -84394 12691 70103 -11939 -88225 -9866 71102 3501 -76767
314g6767M8159R2194l7424r5137L4000Q8887j5679q5307J863R1156L720q2935
$$ -76767 -28608 63586 26162 -68975 -34975 53912 38233 -47074 -45211 45945 49665 -33270
326c3270r079P4226K4573p2697k9161P0872K9798o0436l5454N3444M1160n2195
$$ -33270 -42349 31877 56450 -16247 -45408 25464 55262 -5174 -40628 12816 53976 1781
338A781m1083M4505M0642l8360m6185L3958M4781l2742m4749K4538M5222k2664
$$ 1781 -39302 5203 45845 7485 -38700 -4742 40039 7297 -37452 -12914 32308 9644
350I644m9218K0931M6673j8910m6963J3628M8625j0881n1110J0625N0885p201
$$ 9644 -39574 -18643 28030 9120 -37843 -24215 24410 13529 -37581 -26956 23929 16728
362A6728m9482L174N2450K524n2939m432N4455J1115n2060j6995N5854K4120n5672
$$ 16728 -32754 -29580 22870 25394 -27545 -31977 22478 33593 -18467 -35462 20392 44512 -11160
375a1160k7145N4903L5538n3739m1597N4758M4541n0209m9205M3314N6004m1259
$$ -11160 -38305 16598 52136 -1603 -43200 11558 56099 5890 -43315 -1 56003 14744
387A4744o0098L4815N8527k3609o6111J2460P0793q993p1122m010P0506J6061
$$ 14744 -45354 -10539 47988 24379 -41732 -29272 41521 32528 -38594 -42604 27902 43963
399D3963p7987k2756P6888K7767p2138m0146P2357M6660p1312m6541O1402N3105
$$ 43963 -34024 -56780 20108 47875 -24263 -64409 7948 54608 -16704 -63245 -1843 51262
411E1262m9576o1244M6042O3998l3798o3537J9042P3455q639p5496K257P4380
$$ 51262 1686 -59558 -13516 50482 16684 -46853 -27811 45644 37005 -38491 -36234 38146
423C8146J4224p8153k3439Q5106K3319p7698k8982O8954M0825p0303m2442O4271
$$ 38146 52370 -25783 -49222 35884 59203 -18495 -47477 21477 62302 -8001 -50443 13828
435A3828L8922n0460m6272L9644M9404l4206m8903J7524N2864p690o2811N246
$$ 13828 52750 2290 -43982 -4338 45066 10860 -38043 -20519 32345 24655 -38156 -32910
447c2910N9588j79n6545j3473O3368J4801o7563q840N9677J2470n4616j5224N4707
$$ -32910 26678 26499 -30046 -43519 19849 34650 -32913 -41753 17924 30394 -24222 -39446 15261
460A5261J2482m4490j2737L6439K2095l4962k0634L2481K0029j8968k8766J5893
$$ 15261 27743 -16747 -29484 6955 29050 -5912 -26546 5935 25964 6996 -21770 -5877
472e877M0985j9622m2089J9571M5417j7338n2490K1096N2852k2376n2437J6676
$$ -5877 35108 15486 -26603 -7032 38385 21047 -31443 -10347 42505 20129 -32308 -15632
484a5632N6741j9396n8902K1742M8029j4206m5025n52M8063M913m8414j2568M3333
$$ -15632 41109 21713 -37189 -15447 32582 18376 -26649 -27201 20862 25775 -22639 -35207 8126
497H126K4239m4724l4949M5299M2158m2242n3568M4526O1958m8191n8977M3747
$$ 8126 32365 -12359 -47308 -2009 40149 -2093 -55661 -11135 50823 2632 -56345 -12598
509a2598N9851l2373o4424K9528O6426k3083o0104J1688N9554K106n7961j1674
$$ -12598 47253 14880 -49544 -20016 46410 23327 -36777 -25089 34465 36571 -21390 -33064
521c3064N4360K6911n3239l9837N6126M5441n3430n0745M6082N8720m4261o4297
$$ -33064 21296 48207 -5032 -44869 11257 56698 3268 -47477 -1395 57325 13064 -51233
533e1233M1932O1228l7007o0055K7514N6306k0812n2313Q134M8138K527m9138
$$ -51233 -9301 51927 14920 -45135 -17621 38685 17873 -34440 -26306 21832 24359 -24779
545b4779r599M4916J5630l9220k6615L8560L4780m0311l5805L9948L7409l7119
$$ -24779 -34378 10538 26168 -13052 -39667 -1107 33673 -6638 -42443 -2495 34914 -2205
557b205l6460L6422L5631l2103l2205K9112L2371k5361k8648K3116K5757j5262
$$ -2205 -38665 -2243 33388 1285 -30920 -1808 30563 5202 -23446 -330 25427 10165
569A0165k4810R228K7898n530k9643K075L1921R49l6001l555L8878L997m2888
$$ 10165 -14645 -5417 22481 16951 -12692 -10617 21304 22253 -13748 -17303 21575 25572 -17316
582a7316o743M4929O364m8558p268M6855P708m6558j1524M3859J4284m1537j9219
$$ -17316 -24059 20870 27234 -21324 -28592 18263 25971 -20587 -32111 11748 26032 -15505 -34724
595c4724L7166K4590l2960l0878K8726L7326k2822m3925J9165N1215j4157n5084
$$ -34724 2442 27032 -5928 -36806 -8080 29246 6424 -37501 -18336 32879 18722 -36362
607c6362J1145N9338n374o0425J725O2119M115n9641q539N7025J5841n2445k2167
$$ -36362 -25217 34121 28747 -31678 -29953 32166 36281 -23360 -31899 25126 40967 -11478 -33645
620c3645M7386K9308m1850l5923L4805M2051k9046m8853K2262N2693j7505n7019
$$ -33645 13741 43049 1199 -34724 81 42132 13086 -35767 -13505 39188 21683 -35336
632c5336J0990N7369o586n8422N64N5567L977n4123r131M9656J2546m4190j8062
$$ -35336 -24346 33023 26437 -31985 -31421 24146 28123 -26000 -35131 14525 27071 -17119 -35181
645c5181L8988K3021l4221k6194K9833K9857k3950l2478K0935L5946j7215l5795
$$ -35181 3807 26828 -7393 -33587 -3754 26103 2153 -30325 -9390 26556 9341 -26454
657b6454J5180L7403j1376l6907J0859L6663q303l4333O174L4129m035l2411J983
$$ -26454 -11274 26129 14753 -22154 -11295 25368 17065 -17268 -11094 23035 19000 -13411 -11428
670a1428L0680O39l0078l984K9089O021k9601r852K8477J2821l0511j6484K9861
$$ -11428 19252 19891 -10187 -14171 14918 20939 -8662 -18514 9963 22784 -7727 -24211 5650
683E650J7764l0234k2076K9487K4303l0190k6685K7979K8632k5531l1750K3361
$$ 5650 23414 -6820 -28896 591 24894 -5296 -31981 -4002 24630 -901 -32651 -9290
695i290L4028j9223l5614J5099L9013j0416l9653O439M1317Q97m2064n547M4552
$$ -9290 24738 5515 -30099 -15000 24013 13597 -26056 -19617 21700 22597 -19467 -25014 19538
708A9538J0564m2612j4975M1770K1415m0235k5374L8130K9244l4140l3384K9938
$$ 19538 30102 -12510 -27485 14285 35700 -4535 -29909 8221 37465 3325 -30059 -121
720a21L6211k5882l8973J9480M0916j4851m3758Q944M3181m478m3823k348M3099
$$ -121 36090 10208 -28765 -9285 31631 16780 -26978 -18034 25147 20669 -23154 -25502 17597
733A7597O284m2794j1311L9842J5522l8299j9506L5993K1937l2057k4789K8478
$$ 17597 23881 -18913 -30224 9618 25140 -13159 -32665 3328 25265 -6792 -31581 -3103
745c103K8346k5181k9088K2335L0958j7409l1448J4742L3127j0565l2555P968
$$ -3103 25243 62 -29026 -6691 24267 6858 -24590 -9848 23279 12714 -19841 -11873
757a1873L3556l910l2808J852L2860J061l1708m205L1695O272l1314q683K9800
$$ -11873 21683 17773 -15035 -13183 19677 20738 -10970 -15175 16520 22792 -8522 -17205 12595
770A2595J0575k9108j4157K7480J5601k7084j8836K4769K0465k4038k3502K1409
$$ 12595 23170 -5938 -20095 7385 22986 -4098 -22934 1835 22300 -1738 -25240 -3831
782c831K5131j9982k7938J7069K9761j5045l1247J1631L3194q278l4280N683L5276
$$ -3831 21300 1318 -26620 -9551 20210 5165 -26082 -14451 18743 10465 -23815 -18132 17144
795A7144j244l4937k203L6201O684l4998r431L4723J4075l2294j7413L1442K1268
$$ 17144 15900 -19037 -21240 14961 21645 -13353 -22784 11939 26014 -6280 -23693 7749 29017
808B9017k8829k3614K5980K6970k2721k9411J9172L1344j6029l3075J1472L3995
$$ 29017 188 -23426 2554 29524 6803 -22608 -3436 27908 11879 -21196 -9724 24271
820B4271q432l5394L424L4881k94l5611m210L4297O891l3716j1065L1652J3916
$$ 24271 15839 -19555 -16131 18750 18456 -17155 -21365 12932 19823 -13893 -24958 6694 20610
833B0610l0407j6953K8126J9390k5988k1525K3452K4232k0462k5627J8429K7325
$$ 20610 -9797 -26750 1376 20766 -5222 -26747 -3295 20937 475 -25152 -6723 20602
845B0602j4530k7823J2271K9807q769k9467O542L0751l082l0371R58L0256K794
$$ 20602 6072 -21751 -9480 20327 11558 -17909 -11367 19384 16302 -14069 -13111 17145 19939
858A9939k9841n267K9447P756k8580j0180K6583J2790k5907j6313K4438J7320
$$ 19939 -9902 -15169 14278 22034 -6546 -16726 9857 22647 -3260 -19573 4865 22185
870B2185k3037k0407K0173K2230j9077k4864J6254K5405j3926k7699J0910K8750
$$ 22185 -852 -21259 -1086 21144 2067 -22797 -6543 18862 4936 -22763 -11853 16897
882A6897q769k9573N432L0425k201l0653l82L0658M134k9567p125K9991J0825
$$ 16897 8128 -21445 -16013 14412 12211 -18442 -18824 11834 15968 -13599 -20724 9267 20092
895B0092k8471j2523K7001J6629k4647j8743K3885K1151k0954k2475J8159K5129
$$ 20092 -8379 -20902 6099 22728 -1919 -20662 3223 24374 3420 -19055 -896 24233
907B4233j5444k6621J2818K7209r696k8448O101K8945m242k9082N8K8473K347
$$ 24233 8789 -17832 -5014 22195 12499 -15949 -9848 19097 14855 -14227 -14169 14304 16651
920A6651k9419n382K7773P558k7031j1431K5776J3175k5054j5425K2599J7652
$$ 16651 -12768 -18150 9623 17181 -9850 -21281 4495 17670 -7384 -22809 -210 17442
932A7442k0743j9859J9401K1418j6734k2638J4413K5233j1670k5764R854K7077
$$ 17442 -3301 -23160 -3759 17659 925 -21713 -7300 17933 6263 -19501 -9647 17430
944A7430o390k7053M172K8624j131k7844j209K7860M914k7606o954K6838R438
$$ 17430 11040 -16013 -11841 16783 15652 -12192 -13401 14459 19373 -8233 -15187 11651 21089
957B1089k5163j2818K3612J5376k2754j7683J9996J9486j8361k2252J5480K2955
$$ 21089 -4074 -16892 6720 22096 -658 -18341 1655 21141 2780 -19472 -3992 18963
969A8963j3617k4771J0121K5793q463k6922N531K6236k506k6643m83K6647K854
$$ 18963 5346 -19425 -9304 16489 8026 -18896 -13365 12871 10365 -16278 -16761 9886 12740
982A2740k5688n273K5009Q384k3803j0217K2973J2776k0641j4492K0030J7401
$$ 12740 -12948 -18221 6788 15172 -8631 -18848 4125 16901 -3740 -18232 1798 19199
994A9199j8367j7524J6339J9723j3699k0969J2252K2395j0371k2396Q025K3049
$$ 19199 832 -16692 -353 19370 5671 -15298 -3046 19349 8978 -13418 -5393 17656
1006A7656o305k3367L557K2993j258k3494j460K2944K552k2972n512K1576P612
$$ 17656 11351 -12016 -8459 14534 13276 -10218 -11678 11266 13818 -9154 -14666 6910 14522
1019A4522k1894j0378K1059J1599k0322j3948J9162J5545j8043j7379J6310J9328
$$ 14522 -7372 -17750 3309 14908 -5414 -19362 -200 15345 -2698 -20077 -3767 15561
1031A5561j4694k0617J3201K2407j0257k3018Q182K4659m781k5167K791K6436
$$ 15561 867 -19750 -6549 15858 5601 -17417 -9235 15424 10643 -14524 -11733 14703
1043A4703M81k6119l051K6451O457k5685r113K5064J2038k3904j4640K2170J6710
$$ 14703 15184 -10935 -13986 12465 18922 -6763 -15876 9188 21226 -2678 -17318 4852 21562
1056B1562k0247j9192J7481K0506j5096k2894J1827K3638r667k4847N707K4950
$$ 21562 1315 -17877 -396 20110 5014 -17880 -6053 17585 7918 -16929 -11222 13728
1068A3728l249k5379k43K4720K857k4506n592K3715P801k2410r833K0917J1961
$$ 13728 10479 -14900 -15143 9577 12434 -12072 -17664 6051 13852 -8558 -18391 2526 14487
1081A4487j8753j3318J7586J4992j5034j5397J3251J7075j0939j7201R903J8024
$$ 14487 -4266 -17584 2 14994 -40 -15437 -2186 14889 3950 -13251 -3348 14676
1093A4676p178j8322N923J9004m440j8798L123J8597j376j8825k25J8808N98j8606
$$ 14676 7498 -10824 -4901 14103 9663 -9135 -6012 12585 11209 -7616 -7841 10967 11565 -7041
1107g041k659J7941L510j8162n214J6979O335j7165q471J6468R249j6185j0992
$$ -7041 -9700 8241 11751 -6411 -11625 5354 11689 -5476 -13947 2521 11770 -4415 -15407
1120a5407J4580J2947j3961j4980J3122J6358j1662j7575J0194J9866q315k0912
$$ -15407 -827 12120 -1841 -16821 -3699 12659 997 -16578 -6384 13482 5167 -15745
1132a5745P013K2103l845k2620J921K4026O90k3189l394K3566O953k3076r245
$$ -15745 -8732 13371 9526 -13094 -11173 12853 13543 -9646 -13040 10526 17479 -5597 -14842
1145a4842K2208J2451k0989j5073J9241J7144j7099j9560J4384K1327j2628k3223
$$ -14842 7366 19817 -1172 -16245 2996 20140 3041 -16519 -2135 19192 6564 -16659
1157a6659R723K3216o857k4188K818K4219o13k4445k700K3227N343k2270q418
$$ -16659 -6936 16280 9423 -14765 -11947 12272 11659 -12786 -15486 7741 13084 -9186 -17604
1170a7604K0997J0362j8898j2732J7394J4536j5407j5076J3138J6647j0524j7038
$$ -17604 3393 13755 -5143 -17875 -481 14055 -1352 -16428 -3290 13357 2833 -14205
1182a4205R219J7812o879j6963N179J7393k753j7096K124J6482k35j5919q45J5617
$$ -14205 -4986 12826 5947 -11016 -5837 11556 8803 -8293 -6169 10313 10078 -5841 -6686 8931
1196H931J832j5359k831J4577L632j4423m876J3987M990j3977o469J2964P064
$$ 8931 10763 -4596 -7427 7150 10782 -3641 -8517 5470 10460 -3517 -9986 2978 10042
1209A0042j3112q539J2222R363j2336j0702J1386J1963j1146j3050J0035J4224
$$ 10042 -3070 -11609 613 9976 -2360 -13062 -1676 10287 -859 -13909 -3874 10350
1221A0350q661j5700P735J7199o109j7633M526J8877j874j9534L88K0381K335
$$ 10350 1689 -14011 -6276 10923 4814 -12819 -8293 10584 8710 -10824 -10436 9945 12280
1234A2280j9887m374K0255P155j9247r336J8391J2289j7408j4518J6026J6096
$$ 12280 -7607 -11981 8274 15429 -3818 -13154 5237 17526 118 -14400 1626 17722
1246A7722j3637j8265J1116J9663r187k1253O540K1304m079k2182O29K2038J296
$$ 17722 4085 -14180 -3064 16599 7412 -13841 -7301 14003 9924 -12258 -11629 10409 11705
1259A1705k1860m469K0594O622j9598r190J8098J0982j6457j2493J4388J4273
$$ 11705 -10155 -14624 5970 12592 -7006 -16196 1902 12884 -3573 -16066 -1678 12595
1271A2595j2495j5107J0755J6037q027j6178O455J6957m308j6232K814J6109n17
$$ 12595 100 -15007 -4252 11785 3758 -12420 -5965 10992 6684 -9548 -6734 9375 8858
1284H858j5567m40J5428J878j4353k917J3802L918j3273m761J2721N085j2011
$$ 8858 -6709 -7149 8279 10157 -4196 -7113 6689 10607 -2666 -7427 5294 10379 -1632
1297a632o413J1719O330j1684p266J0319Q347j0711r389R746R648r643j0793Q641
$$ -1632 -8045 3674 10004 -1680 -8946 1373 9720 -991 -10380 -634 9014 -629 -11422 -2781
1311b781J1737q298j2616P022J3515n715j4751M795J5835l313j5779J514J6729
$$ -2781 8956 658 -11958 -4936 8579 2864 -11887 -7092 8743 5430 -10349 -8835 7894
1324G894R49j7236k000J7441M311j6399o317J6606Q793j5791j0203J4712J2463
$$ 7894 8843 -8393 -10393 7048 11359 -5040 -11357 5249 14042 -1749 -11952 2760 15223
1337A5223j3174j4245J1912J5362j0029j6533P248J8048n904j8727L341J8335
$$ 15223 2049 -12196 -284 15078 5049 -11484 -4236 13812 7908 -10819 -7478 10857
1349A0857r36j9072j823J8772K973j7915n690J6597P691j6035r481J4562J0362
$$ 10857 9921 -9151 -10974 7798 10771 -7144 -12834 3763 11454 -4581 -14062 500 10862
1362A0862j2651j2084J1195J3458j0038j3105P727J4275n739j4694N024J4676
$$ 10862 -1789 -13873 -2678 10780 742 -12363 -4636 9639 3900 -10794 -5770 8906
1374H906k889j3903J304J4381L74j3879o86J3119K408j2519l463J2745L787j1727
$$ 8906 6017 -7886 -6582 7799 8173 -5706 -6392 6727 9135 -3384 -6847 5898 9685 -2042
1388b042m654J0837N718j0875o682J0547O641r880p907Q822Q683r352r256Q101
$$ -2042 -6696 4141 9859 -1016 -7698 2849 9490 -390 -8297 525 9208 -144 -9400 -1299
1402a299R813p568j1502O732J2218o444j2739M732J3692l408j4575K576J4962
$$ -1299 8514 946 -10556 -3824 8394 1950 -10789 -6057 7635 4227 -10348 -7772 7190
1415G190o75j5011j316J5981K847j5316m342J5128O859j4166q696J4145J0170
$$ 7190 6515 -8496 -9812 6169 9016 -6300 -10642 4486 11345 -2821 -11517 2628 12798
1428A2798j2356j1374J1063J3353r412j4476P890J5182n835j6120L840J6268k078
$$ 12798 442 -10932 131 13484 4072 -10404 -2514 12668 6833 -9287 -5447 10821 8743
1441H743j6291m71J5884K229j6265m019J4959N231j4020p516J2842Q530j2130
$$ 8743 -7548 -8019 7865 10094 -6171 -10190 4769 10000 -4020 -11536 1306 9836 -2294
1454b294r719J0645J0346r094j1256P781J1704o411j1700M983J2307l668j2103
$$ -2294 -12013 -1368 8978 -116 -11372 -3591 8113 1702 -9998 -5015 7292 3624 -8479
1467h479K995J2235j414j1585M93J1763O75j0988j334J1044K281j0508k905J0533
$$ -8479 -5484 6751 5337 -6248 -5755 6008 6683 -4305 -5639 5405 7686 -2822 -5727 4806
1481D806L631j0105m219R711N057r709n765R031O364q871p802Q404Q213q411r306
$$ 4806 8437 -1668 -5887 3824 8881 -828 -6593 2438 8802 -69 -7871 533 8746 335 -8971
1496h971P256R984o742j1198N537J1906m657j2947L371J3443j955j4286O69J4662
$$ -8971 -1715 8269 1527 -9671 -4134 7772 3115 -9832 -6461 6982 5027 -9259 -8590 6072
1510F072R42j4395k786J4771M763j4095o091J3532Q111j2065r875J1669J1534
$$ 6072 7014 -7381 -10167 4604 9367 -4728 -10819 2713 10824 -1241 -11116 553 12087
1523A2087r925j2335Q085J4051o437j4710N131J5121l264j4998P37J5274Q28j5012
$$ 12087 2162 -10173 -2088 11963 5526 -9184 -4053 11068 7804 -7194 -6457 8817 9645 -5367
1537e367k792J3760M546j3401o516J2285P185j1300q343R319R575r012j0108P393
$$ -5367 -8159 5601 10147 -3254 -9770 2515 9700 -1600 -9943 -624 8951 -61 -10169 -2776
1551b776R952n653j0980M962J0708l638j0500K724J0441j613j0054J116J0028
$$ -2776 7176 1523 -9457 -4495 6213 2575 -7925 -5201 5240 3627 -6427 -5311 4717
1564D717k05r039o99R637J488r184j389Q640K659q581l005Q875L565q754l968
$$ 4717 4512 -4527 -5226 4411 5899 -3285 -4674 3966 6625 -1956 -4961 3914 7479 -1275 -5243
1579e243Q402M976q658n423Q330N571p886p088P313P792p398q523O187R133n378
$$ -5243 3159 8135 -523 -5946 2384 7955 69 -7019 294 8086 688 -7835 -1648 7485 2107
1594B107j0862M506J1233l594j1902J669J2861m68j3583o43J3361K663j3454m234
$$ 2107 -8755 -4249 6984 3390 -8512 -6843 6018 5550 -8033 -8676 4685 7348 -6106 -10340
1608a0340J3693N836j2652p185J1696R383j0486j0308R619J1545p518j2447N957
$$ -10340 3353 9189 -3463 -10648 1048 10431 -55 -10363 -744 10801 3283 -9164 -3207
1621c207J3840m442j3845K608J3897k51j4537j155J4059K683j3153m645J2161
$$ -3207 10633 6191 -7654 -5046 8851 8600 -5937 -7092 6967 9650 -3503 -8148 4013
1634D013N859j1592p169R918P826q845r012P474R076o250r755M609R870l680r858
$$ 4013 9872 -1720 -8889 1029 8855 10 -9002 -1528 7548 1298 -8457 -3848 6022 2342 -7516
1649g516K468R690j350r431M53R472J37q805l05Q566R27p931j154Q151J616p412
$$ -7516 -5048 4642 3292 -6139 -5686 3786 3923 -4882 -5187 3379 4306 -3625 -4779 3372 4988 -2424
1665b424j881P385K700p360k767P400L281o994m196P404M737p323n368P047N947
$$ -2424 -4305 3080 5780 -1580 -4347 3053 6334 -660 -4856 2548 7285 -38 -5406 1641 7588
1680G588o907p096O192Q084o446q998N508R262m459j0707L485J0997k501j1646
$$ 7588 681 -6415 -223 7861 1415 -7583 -2075 7187 2728 -7979 -4494 6503 4002 -7644
1694g644Q48J1860N76j2086k175J2099L806j1693n327J1403P005j0674q113R718
$$ -7644 -6796 5064 5640 -6446 -8621 3478 7284 -4409 -9736 1667 8672 -2002 -10115 -397
1708c97R777q020j0991P400J1973n633j2122M003J3024k291j3105R46J2802J115
$$ -397 9380 1360 -9631 -2231 9742 4109 -8013 -4010 9014 6723 -6382 -5436 7366 8481
1722H481j2501l039J2281L987j1222n465R951O605r422p519P936P880o782r000
$$ 8481 -4020 -7059 5222 9209 -2013 -7478 2473 9078 -344 -7863 73 7953 1171 -7829
1736g829N469R116m675r011K804Q958j756r336J277Q581o10p840m47P738J492
$$ -7829 -2360 6756 2081 -6930 -4126 4832 3076 -6260 -4983 3598 2988 -4852 -5299 2439 3931
1751C931p891q78O966J597o376j859O900J839o331j728O277K856o543k888O909
$$ 3931 -3960 -4838 2128 3725 -2651 -4510 2390 4229 -2102 -3830 2447 5303 -1240 -4128 2781
1766B781K990o254l904O465M683o793m939O227N805n954p147N778P478n470q201
$$ 2781 5771 -483 -4387 2078 6761 -32 -4971 1256 7061 1107 -6040 -262 7216 1746 -6455
1781f455L894R144l226j0575K459J0441j294j0711q85J1572J643j1598l013J0826
$$ -6455 -2561 6583 3357 -7218 -4759 5682 4388 -6323 -7208 4364 6007 -5591 -8604 2222
1795B222N235j0877o369J0474P433q842q739P592J0708o662j0781N375J1342l082
$$ 2222 7457 -3420 -9789 685 8118 -724 -9463 -1871 8837 2175 -8606 -3231 8111 5029
1809E029j2208K110J2487p05j1352j517J1704L058j1480l841J0235N187r150o795
$$ 5029 -7179 -5069 7418 6713 -4639 -6156 5548 8606 -2874 -6715 3520 8707 -443 -7238
1823g238Q589O936p427p806N785Q368n080q569L595Q198k703q288J199Q362j075
$$ -7238 1351 8287 860 -6946 -1161 7207 2127 -6442 -2847 5351 2648 -5640 -4441 3921 2846
1838B846p809L56O820Q45o902j134O720J316n976j622N975K120n853j693N542
$$ 2846 -4963 -4607 2213 3058 -3844 -4978 1742 3058 -2918 -4540 1435 3555 -2298 -3991 1551
1853A551K143m907k433N381K754n455k457N411L230n284l911N757M207n715m765
$$ 1551 3694 -1213 -3646 1735 4489 -966 -3423 1988 5218 -66 -3977 1780 5987 272 -4493
1868d493N205N961n434o561M944O908m010q431L280Q733k797r461J300R957l52
$$ -4493 712 6673 1239 -5322 -378 6530 2520 -5911 -2631 6102 3305 -6156 -4856 5101 4749
1883D749j0462r78J0446J922j0049l643R617N263r343o286Q469P863p371q979
$$ 4749 -5713 -6691 3755 5677 -4372 -8015 1602 6865 -2478 -8764 -295 7568 197 -8782
1897h782O601J0123n213j0558L957J1231k188j1187Q87J1244P21j0758k282J0638
$$ -8782 -2181 7942 2729 -7829 -3872 7359 5171 -6016 -5129 6115 6836 -3922 -6204 4434
1911D434L663r810m843R046N769q205o579O891P285n932q074M689Q209l868q362
$$ 4434 8097 -1713 -6556 2490 8259 54 -6525 366 7651 1719 -6355 -1666 6543 2675 -5687
1926e687K556P906j560q000K42P705Np166q94O768J406o292j723N789K092n439
$$ -5687 -3131 4775 3215 -4785 -4543 3162 3167 -3999 -4893 1875 3281 -3011 -4734 1055 3147 -2292
1942b292k144N119K483m462k701M775K759m282k900M664L124m408l131M586L376
$$ -2292 -4436 683 3166 -1296 -3997 778 3537 -745 -3645 1019 4143 -265 -3396 1190 4566
1957D566m287l475M225M258m350m753M238N099l531o250L371O398k871p477K110
$$ 4566 279 -3196 1029 5287 937 -3816 422 5521 1990 -4260 -889 5509 2638 -4839 -2729
1972b729P791j498q602N62Q327N28q780j688Q813K454q472m059Q294N396q117
$$ -2729 5062 3564 -5038 -4476 3851 4379 -4401 -6089 2724 5178 -3294 -7353 941 6337 -1780
1987a780o207P272P046n794q347N395R290m197r441K984J0054j248j0460M85J0164
$$ -1780 -7987 -715 6331 537 -7810 -2415 6875 2678 -6763 -3779 6275 5027 -5433 -4948 5216
2002E216J136r450k700R582L626q680m676P593N880o873o708O148O897n028p411
$$ 5216 6352 -3098 -5798 3784 7410 -1270 -5946 1647 7527 654 -6054 94 6991 1963 -5448
2017e448L597P803l226p969K070P574j265p630L51P170mo732q63O188J853o518
$$ -5448 -1851 5952 2726 -5243 -3173 4401 3136 -4494 -4143 3027 3023 -3709 -4572 1616 3469 -3049
2033c049j738N609K494m989k942M969K888m384k867M274L314l916l346M108L571
$$ -3049 -4787 822 3316 -1673 -4615 354 3242 -1142 -4009 265 3579 -337 -3683 425 3996
2048C996l659l421L149M216l021m351L405M309k893m924K561N380k410n757J794
$$ 3996 337 -3084 65 4281 1260 -3091 314 4623 1730 -3194 -633 4747 2337 -3420 -1626
2063a626O029j406o694P46O999m87p125r22P158J949q033k103P095L227p178m088
$$ -1626 4403 2997 -3697 -2951 4048 3561 -3564 -4486 2672 4621 -3412 -5515 1580 4807 -2371 -6459
2079f459O773M857o018n946N413O981m842p314M021P682k333q202J552Q832o33
$$ -6459 314 5171 -847 -6793 -1380 5601 759 -6555 -2534 5148 2815 -5387 -3835 4997 4364
2094D364q703j62Q599J763q325k574P984L488p416m211O784N114o233n593N095
$$ 4364 -4339 -4501 4098 5861 -2464 -5038 2946 6434 -982 -5193 1591 6705 472 -5121 -26
2109b6O152m202o934L392O743k514o932J586O750r21p218L13O718L98o800j065
$$ -26 6126 1924 -5010 -1618 5125 2611 -4321 -2735 4015 3094 -4124 -3811 2907 3305 -3495 -4560
2125d560O326J429n934j929N540K323m978k768N069K977m602l156M384L574l759
$$ -4560 1766 3195 -2739 -4668 872 3195 -1783 -4551 518 3495 -1107 -4263 121 3695 -64
2140f4l735L556M335l444m085L094M655k490m907K302N222j906n417J592N646
$$ -64 -3799 -243 4092 648 -3437 -343 4312 1822 -3085 -783 4439 2533 -2884 -1292 4354
2155D354j269n827O26N659L3o288m89O194O25o169j566N672K529n858l333N556
$$ 4354 3085 -2742 -2116 3543 3576 -2712 -3201 2993 3618 -2551 -4117 1555 4084 -1774 -5107 449
2171D49L879n449m748N236N054m576n554L858O199l095o776K961O766j853o742
$$ 449 4328 -1121 -5869 -633 4421 -155 -5709 -1851 4348 1253 -5523 -2562 4204 2351 -4391
2186d391Q27P415o4p104p35P285J810p085k181O719K970n849m070N601M786n239
$$ -4391 -3564 3851 3787 -3317 -4052 3233 5043 -2042 -4223 2496 5466 -383 -4453 1148 5934 695
2202F95n220M655N305l914n954L131N932k260o209J367O272r91o532L55O078L90
$$ 695 -4525 130 5435 1521 -4433 -1302 4630 2370 -3839 -2472 3800 2809 -3723 -3368 2710 3100
2218C100o150j417O233J495n693k011N112K640n073k960N212L053m438l670M381
$$ 3100 -3050 -4467 1766 3261 -2432 -4443 669 3309 -1764 -4724 488 3541 -897 -4567 -186
2233a86M192l836m281L523M599k656m751K546N167k308m997J480N387p09n563
$$ -186 4006 170 -4111 -588 4011 1355 -3396 -850 4317 2009 -2988 -1508 3879 3170 -2393
2248b393L89N679j34n487p57N662R04n502j764N113K328n402k906N081L125m863
$$ -2393 -2004 3675 3541 -1946 -2703 2959 3863 -1639 -3403 1710 4038 -1364 -4270 811 3936 -927
2264i27l780M272M240l893m708L336M900k733n340K383N743k030n788J202O106
$$ -927 -4707 -435 3805 -88 -4796 -1460 3440 707 -4633 -2250 3493 1463 -4325 -3123 2983
2279B983k76o163l3O174P63n783j234N999J829n545k344N389L053m984l561M649
$$ 2983 2707 -3456 -3489 2685 3448 -2335 -3569 2430 4259 -1286 -3630 1759 4812 -172 -3733 916
2295I16L986m322m289L522N046l438n154K743N121j898n829J405N633r94n879
$$ 916 4902 580 -3709 -187 4859 1421 -3733 -990 4131 2233 -3596 -2191 3442 2448 -3431
2310c431K15N902J36n903p46N506J391n381k237N502K535n234l106M994L439m270
$$ -3431 -3216 2686 2822 -3081 -3827 1679 3070 -2311 -4548 954 3489 -1745 -4851 143 3582 -688
2326f88l829L940M612l438m905L195N261k605n182K133N535j460n538R63N764
$$ -688 -4517 -577 4035 597 -4308 -1113 4148 1543 -3639 -1506 4029 2569 -2969 -2006 3758
2341C758l04n488n79N650P96n343j537N205K070n272k644M875K993m598l566L893
$$ 3758 3454 -2034 -2613 3037 3833 -1510 -3047 2158 4228 -1044 -3688 1187 4180 -418 -3984 -91
2357i1L995l671m509L162M464k654m806J874N154j580n185J108N123n47m943l2
$$ -91 3904 233 -4276 -1114 3350 696 -4110 -2236 2918 1338 -3847 -2739 2384 1837 -3106 -3138
2373c138N173M40m786p33M837J225m759j366M554K165m232k635M266K919l807
$$ -3138 2035 2475 -2311 -3044 1793 3018 -1741 -3107 1447 3612 -620 -3255 1011 3930 123
2388A23l042L674L357l438l529K798M070k581m610K508M556k173m718J247N080
$$ 123 -2919 755 4112 674 -2855 -57 4013 1432 -3178 -670 3886 1713 -3005 -1758 3322
2403C322j157n142K26N274Q6n468p62N371J138n295j858N033K628m907l031M725
$$ 3322 2165 -2977 -2751 2523 2609 -2859 -3621 1750 2888 -2407 -4265 768 3396 -1511 -4542 183
2419A83L280l866m051L527M864l383m605K571N374k043n454J702N612o89n677
$$ 183 3463 -403 -4454 -927 3937 554 -4051 -1480 3894 1851 -3603 -1901 3711 3022 -2655
2434b655l2O162K89n792q62N483J547n086k360N069K722m738l314L869L876l952
$$ -2655 -2687 3475 3764 -2028 -2890 2593 4140 -946 -3306 1763 4485 -253 -3567 302 4178 226
2450B26m056L262M061k538m662J945N037k147m538J038M492m88m596o1M704L79
$$ 226 -3830 -568 3493 955 -3707 -1762 3275 1128 -3410 -2372 2120 1632 -2964 -3025 1679 2058
2466B058m499p24M617J051m263j282M057J762l565k069L693K410l605k370L407
$$ 2058 -2441 -3165 1452 2503 -1760 -3042 1015 2777 -788 -2857 836 3246 -359 -2729 678
2481F78K695k995k862K902L231k730l534K481L784k372l808J714L907j235m440
$$ 678 3373 378 -2484 418 3649 919 -2615 -134 3650 1278 -2530 -816 3091 1856 -2584
2496b584Q54M631r73m645K13M620L63m907q72M800J272m842j967M636K513m640
$$ -2584 -1730 2901 1928 -2717 -2504 2116 2479 -2428 -3300 1500 2772 -2070 -4037 599 3112 -1528
2512a528k731M067L473l678l954L442M456k803m837K513N235j685n359J218N634
$$ -1528 -4259 -192 3281 -397 -4351 -909 3547 744 -4093 -1580 3655 1970 -3389 -2171 3463
2527C463l60n669k35N922P99n504j552N133K192m621k885M384L144l922l642L453
$$ 3463 3103 -2566 -2801 3121 3920 -1584 -3136 1997 4189 -432 -3317 1067 4211 289 -3353 100
2543A00L802l015m309K246M384k140m516J711M405j076m550K96M502j06m222m87
$$ 100 3902 887 -3422 -1176 3208 1068 -3448 -1737 2668 1592 -2958 -2662 1840 1734 -2488 -2975
2559b975M161P86l952r04L838J248l409j640L403J792k916j996K931K356k612
$$ -2975 1186 1972 -1980 -2884 954 2202 -1207 -2847 556 2348 -568 -2564 367 2723 111
2574A11k682K611L017k292k987K358L042k130l167J799L370j630l639J354L869
$$ 111 -2571 40 3057 765 -2222 136 3178 1048 -2119 -320 3050 1420 -2219 -865 3004
2589C004j306l763N49M010k63m483n1M135O65m608r28M231J435m397k308M469
$$ 3004 1698 -2065 -1516 2494 2231 -2252 -2303 1832 2497 -2111 -3039 1192 2627 -1770 -4078 391
2605C91K582m032l035L571L855l458l895L001M364k358m721K007N007j126n061
$$ 391 2973 -1059 -4094 -523 3332 -126 -4021 -1020 3344 986 -3735 -1728 3279 2153 -2908
2620b908P63N003J40n122o51N069J565m909j828M446K585m294l154M152L136l609
$$ -2908 -2145 2858 2998 -2124 -2775 2294 3859 -1050 -2878 1568 4153 -141 -3295 857 3993 384
2636C84l549K931L895k533l980J683M064j323m337Q64M045n42l985j59L933M27
$$ 384 -3165 -234 3661 1128 -2852 -1169 2895 1572 -2765 -1901 2144 1602 -2383 -2542 1391 1818
2652A818l686j109L871J113l699j344L574J611l210j816L027K229l008j796K736
$$ 1818 -1868 -2977 894 2007 -1692 -3036 538 2149 -1061 -2877 150 2379 -629 -2425 311
2667C11K112k182k319K085K605j741l069K092L034j604l308J374L488j369l529
$$ 311 2423 241 -2078 7 2612 871 -2198 -106 2928 1324 -1984 -610 2878 1509 -2020
2682b020R60L706o78l781J75L740J15m116l87L803R08l957j523L790J803l729
$$ -2020 -1060 2646 1968 -1813 -1638 2102 2217 -1899 -2286 1517 2425 -1532 -3055 735 2538 -1191
2698a191k400L791K629l323l317L220L574k799l949K480M261j828m493J412M539
$$ -1191 -3591 200 2829 -494 -3811 -591 2983 184 -3765 -1285 2976 1148 -3345 -1933 2606
2713B606m93m655L06M600O26m579r93M465J620m136k292L985K619l456k987K985
$$ 2606 2113 -2542 -2236 2364 2990 -1589 -2582 1883 3503 -633 -2925 1060 3679 223 -2764 221
2729B21L485k856l765K258L753j748m001J311L956j133l925O54L817m26l530m16
$$ 221 3706 850 -2915 -657 3096 1348 -2653 -1342 2614 1481 -2444 -1790 2027 1601 -1929 -2345
2745b345L515N02l501q29L365J168l147j363K911J686k700j929K868J897k573
$$ -2345 1170 1672 -1829 -2658 707 1875 -1272 -2635 276 1962 -738 -2667 201 2098 -475
2760d75j920K434K318k119k352K307K255j905k461J665K789j175l228J355L036
$$ -475 -2395 39 2357 238 -2114 193 2448 543 -1918 -253 2536 1361 -1867 -512 2524
2775B524q65l435O75L464l91l647k88M017K88l966p36L611J397l909j623L429
$$ 2524 1659 -1776 -1101 2363 1972 -1675 -1963 2054 2342 -1624 -2360 1251 2648 -1261 -2884 545
2791E45K004l302k769L334K856k971l172K575L595k099l967J672M071j025l999
$$ 545 2549 -753 -3522 -188 2668 -303 -3475 -900 2695 596 -3371 -1699 2372 1347 -2652
2806b652N26M297pm236l15M371R02m126j311L795K093l637k213L217K575k756
$$ -2652 -2126 2171 2164 -2072 -2387 1984 2886 -1240 -2551 1244 3337 -300 -2513 704 3279 523
2822E23l148K792L046k068l540J706L456j366l524P57L573n38l658J97L327K19
$$ 523 -2625 167 3213 1145 -2395 -689 2767 1401 -2123 -1366 2207 1669 -1989 -1792 1535 1754
2838A754l396o39L216P67l151r84K931J104k687j343K696J499k492j796K539K064
$$ 1754 -1642 -2281 935 1702 -1449 -2433 498 1602 -1085 -2428 268 1767 -725 -2521 18 2082
2854B082k450j933K106K327j998k089J778K409j370k650J324K829j062k983P60
$$ 2082 -368 -2301 -195 2132 134 -1955 -177 2232 862 -1788 -464 2365 1303 -1680 -920
2869i20L221m12l270J05L646j40l467n18L261Q63l269j314L023J818l421k083
$$ -920 2301 1889 -1381 -1276 2370 2230 -1237 -1755 1506 2369 -900 -2214 809 2627 -794 -2877
2885b877L021K375k820k757K423L115k330l214J681L545j265l650P94M075n74
$$ -2877 144 2519 -301 -3058 -635 2480 150 -3064 -1383 2162 897 -2753 -1959 2116 1542
2900A542l780K7L721P91m001o26L598J334l267j626L123K023k654k567K712K356
$$ 1542 -2238 -2211 1510 2301 -1700 -2326 1272 2606 -661 -2287 836 2859 205 -2362 350 2706
2916B706k211k536J848K795j387l263J276L191j093l085N15K937jl355j9K929
$$ 2706 495 -2041 -193 2602 1215 -2048 -772 2419 1326 -1759 -1244 1693 1692 -1663 -1682 1247
2932A247L26l067l74K743M40k521r09K503J025k577j148K453J487k235j620K256
$$ 1247 1573 -1494 -1868 875 1315 -1206 -2115 388 1413 -1164 -2312 141 1628 -607 -2227 29
2948B9J859k173j782K077J914j538k355J649K486j435k449J112K865q11k995P54
$$ 29 1888 -285 -2067 10 1924 386 -1969 -320 2166 731 -1718 -606 2259 1448 -1547 -793
2964g93K907j96l312Q7L154N07l467p41L328Q74l210j561K956J978k974k265K633
$$ -793 2114 1918 -1394 -1307 1847 2354 -1113 -1854 1474 2348 -862 -2423 533 2511 -463 -2728 -95
2981i5K403k186l008J929L269j608l429R93L713q93l450K64L495K98l427n07L320
$$ -95 2308 122 -2886 -957 2312 704 -2725 -1732 1981 1088 -2362 -2098 1397 1695 -1732 -2239 1081
2998A081J097l098j383L155J584k903j659K528K126k146k282J963K412j497k624
$$ 1081 2178 -920 -2303 852 2436 -467 -2126 402 2528 382 -1900 63 2475 978 -1646
3013a646J310K726j293k691Q81K527n44k590L70K517K1k832k49K495M47k714m66
$$ -1646 -336 2390 1097 -1594 -713 1814 1270 -1320 -950 1567 1588 -1244 -1493 1002 1449 -1265 -1731
3030a731K290O46k274q63K301R75k012j357J852J454j838j553K002J780j740k024
$$ -1731 559 1205 -1069 -1932 369 1344 -668 -2025 -173 1281 -557 -2110 -108 1672 -68 -2092
3046b092J804K137j392k315J432K531j164k614Q94K784o16k818L28L015m9l176
$$ -2092 -288 1849 457 -1858 -426 2105 941 -1673 -779 2005 1389 -1429 -1101 1914 1865 -1311
3062a311r7L001Q00l052j321L062J531l121j743K444K182k367k697K272K779k100
$$ -1311 -1408 1593 2393 -659 -1980 1082 2613 -508 -2251 193 2375 8 -2689 -417 2362 262
3078B62k898J454L108j085l235N96L135J08l189m63L386O33l228p52K863J359
$$ 262 -2636 -1182 1926 841 -2394 -1798 1337 1445 -1744 -2207 1179 1812 -1416 -2168 695 2054
3094B054k698j721K607J878k204j977K316J957j720k125J344K170q96k271R23
$$ 2054 -644 -2365 242 2120 -84 -2061 255 2212 492 -1633 -289 1881 985 -1286 -363
3109c63K095n09k318L84K243j14k451K7K108K09k270j25J821M12k101n46K044
$$ -363 1732 1223 -1095 -711 1532 1418 -1033 -1006 1102 1311 -959 -1084 737 1149 -952 -1498 546
3126E46P08k237o13J962O78j900j095J981J031j510j406J630J751j606j864J639
$$ 546 1254 -983 -1596 366 1044 -856 -1951 30 1061 -449 -1855 -225 1526 -80 -1944 -305
3142c05J877j130k172J028K541q94k477P01K738l41k828j5L157K82l176n48K823
$$ -305 1572 442 -1730 -702 1839 945 -1532 -831 1907 1566 -1262 -1277 1880 2162 -1014 -1562 1261
3159A261J064k990j094K533J658k569k090K288K232j968k537J652K666j355l055
$$ 1261 2325 -665 -1759 774 2432 -137 -2227 61 2293 325 -2212 -560 2106 751 -2304
3174b304R44L077n83l202J60L147m4k995l39L031P76k601j254K486J504k053j790
$$ -2304 -1360 1717 1134 -2068 -1908 1239 1195 -1800 -2139 892 1668 -933 -2187 299 1803 -250 -2040
3191b040K025K099j717k154J536K256j257k047Q45K206q48k099O60K185l96k171
$$ -2040 -15 2084 367 -1787 -251 2005 748 -1299 -454 1752 904 -1195 -535 1650 1254 -917
3207i17J70K126k02j908q8J870J13j930l08J776M18j820m42J510Q15j944q02J817
$$ -917 -747 1379 1177 -731 -819 1051 1164 -766 -1074 702 1120 -700 -1142 368 1183 -761 -1563 254
3225B54R52j726j156J753J123j670j303J563J649j502j855J592K001j377k063
$$ 254 1206 -520 -1676 77 1200 -470 -1773 -210 1439 -63 -1918 -326 1675 298 -1765
3240a765J045K646q46k501M54K696k00k728j90L011M91k818j009K824J339k692
$$ -1765 -720 1926 1080 -1421 -967 1729 1529 -1199 -1389 1622 2113 -705 -1714 1110 2449 -243
3256b43j692K438J840k162k311J895K419j631k581J121K759p69l203N20L107k72
$$ -243 -1935 503 2343 181 -2130 -235 2184 553 -2028 -907 1852 1083 -2120 -1600 1507 1235
3272A235k885m26L070M66k573j168K730J304k348j457K160J728j991j766J819
$$ 1235 -1650 -2076 994 1460 -1113 -2281 449 1753 -595 -2052 108 1836 -155 -1921 -102
3287a02J873j367j898R17K100o62k024N87K196o72j792K98J869l6j884k49J754
$$ -102 1771 404 -1494 -577 1523 861 -1163 -576 1620 948 -844 -546 1323 1287 -597 -846 908
3304I08K11j536l49J483K81j406p25J748K84j486n07J508M81j676o33J510Q65
$$ 908 1119 -417 -766 717 998 -408 -1133 615 899 -587 -1094 414 895 -781 -1414 96 961
3321I61j677q29J699J061j793j073J350J578j184j776J186J995r88k228J073K428
$$ 961 -716 -1545 154 1215 -578 -1651 -301 1277 93 -1683 -497 1498 510 -1718 -645 1783
3337A783o75k501L15K583J84k799l64K634P21k522r98K563J389k552j533J935
$$ 1783 1108 -1393 -1078 1505 1689 -1110 -1474 1160 1881 -641 -1639 924 2313 -239 -1772 163
3353A63K211k008k373J715K432j294k783Q82K755n89k857p1K903K47k714m81K519
$$ 163 2374 366 -2007 -292 2140 846 -1937 -1055 1700 1111 -1746 -1817 1086 1333 -1381 -1862 657
3370F57R14k429r27J954J331j920j516J716J615j178j861R21K280p59k140P21
$$ 657 1571 -858 -1785 169 1500 -420 -1936 -220 1395 217 -1644 -723 1557 798 -1342 -621
3386f21K040m44j988M17J797o9j790Q9J730K6j689k00J503L32j453l91J307L05
$$ -621 1419 975 -1013 -596 1201 1132 -658 -569 1161 1187 -502 -702 801 1133 -320 -711 596 901
3404I01j219l61J154N74j339p93J406O26j499r71J593R15j491j010J446J194j466
$$ 901 -318 -679 475 1049 -290 -1083 323 949 -550 -1521 72 987 -504 -1514 -68 1126 -340
3421c40j291J217J643j219j665J066K055r04k118R12K220o18k195pK643M57k718
$$ -340 -1631 -414 1229 10 -1655 -589 1466 562 -1556 -644 1576 958 -1237 -1244 1399 1856 -862
3438h62n72K425J274k600j514K446J652k047k053J718K368j586k555J406K506
$$ -862 -1434 991 2265 -335 -1849 597 2249 202 -1851 -133 2235 649 -1906 -500 2006
3453B006j196k354M03K588k18k701j99K622O15k662q87K494Q91k218j133J987
$$ 2006 810 -1544 -1141 1447 1229 -1472 -1671 951 1566 -1096 -1983 511 1402 -816 -1949 38
3469C8J337j567j590J482J728j063j835Q45J950n49j961M84J897k66j662M4J759
$$ 38 1375 -192 -1782 -300 1428 365 -1470 -625 1325 776 -1185 -701 1196 930 -732 -688 1071
3486A071P3j581k09J412L27j429l68J418K33j254k12J195L11j339l86J199L92
$$ 1071 1144 -437 -646 766 1093 -336 -704 714 947 -307 -519 676 987 -352 -738 461 853
3503H53j285o02J275P63j425n26R79O75j001r86J086J210j298j405J315J648j249
$$ 853 -432 -1034 241 1004 -421 -947 32 707 -294 -1280 -194 1016 -282 -1687 -372 1276 27
3520B7j501P54J991o37k180O31K256k20k218j38K564K01k298p34K294J220k255
$$ 27 -1474 -720 1271 634 -1546 -915 1341 1121 -1097 -1235 1329 1530 -768 -1502 792 2012 -243
3537b43j399K014J859j934j887J363K289j424k211Q74K512r08k478N38K225K14
$$ -243 -1642 372 2231 297 -1590 -227 2062 638 -1573 -699 1813 905 -1573 -1035 1190 1404
3553A404k692l84K530O60k403r60K081J195j920j270J530J553j346j676J118J774
$$ 1404 -1288 -1672 858 1518 -885 -1845 236 1431 -489 -1759 -229 1324 -22 -1698 -580 1194
3569A194p17j996Q84J846n08j762L07J728o5j655Q5J535O6j335j19J293K43j254
$$ 1194 477 -1519 -635 1211 703 -1059 -752 976 911 -744 -659 876 942 -393 -512 781 1024 -230
3587b30l76J294K63j137l71J058L96j108m71J157M48j321m50J076O02r81j057
$$ -230 -606 688 951 -186 -557 501 897 -211 -682 475 923 -398 -848 228 830 -151 -1208
3604a208J241O70q64j211J040J502j138j424R54J521p46j870P34K074o33j996
$$ -1208 33 703 -161 -1372 -332 1170 32 -1392 -438 1083 337 -1533 -799 1275 642 -1354
3620a354L31K250j39k154j9K033O12k131o89J899J249j858j526J802J607j495
$$ -1354 -1023 1227 1088 -1066 -1085 948 1560 -571 -1260 639 1888 30 -1496 306 1913 418
3636D18j938J207K262j130k312O81K403k95k743M21K083J46k263o28K321P24j956
$$ 418 -1520 -313 1949 819 -1493 -812 1591 1296 -1447 -1026 1057 1203 -1060 -1688 633 1357 -599
3653e99j257J796J374j584j477J360J781j400j527Q91J715o38j665L83J901j78
$$ -599 -1856 -60 1314 -270 -1747 -387 1394 -6 -1533 -642 1073 435 -1230 -847 1054 876
3669H76j784J29J606P8j648O4J369M22j488k19J132M89j227l98J107L33q31p15
$$ 876 -908 -779 827 905 -743 -679 690 1112 -376 -595 537 1026 -201 -599 508 841 10 -705
3687g05J181N14j032n83P89O80j097p86J085O79p47j049R45J073r80j323R18J444
$$ -705 476 990 -42 -625 164 844 -253 -1039 46 725 -22 -1071 -126 947 -33 -1356 -438 1006
3705A006j084j138N96J389m14j553K58J748l1j960J01K102J14j767o32K053O29
$$ 1006 -78 -1216 -620 769 355 -1198 -940 808 777 -1183 -1082 1020 1134 -633 -1265 788 1417
3722A417j967p33J735J306j680j483J590J446j128j839J106J858p35k102L61K119
$$ 1417 -550 -1283 452 1758 78 -1405 185 1631 503 -1336 -230 1628 893 -1209 -848 1271
3738A271j50k049k69K137L52k037n82J935Q82k192q99J588J333j678j191J221
$$ 1271 1121 -928 -1197 940 1292 -745 -1327 608 1490 -702 -1601 -13 1320 -358 -1549 -328
3754c28J488j189j509R52J751p71j704O14J559j35j582J62J595k9j549J06J203
$$ -328 1160 -29 -1538 -586 1165 394 -1310 -696 863 728 -854 -692 903 874 -675 -569 634
3771F34N90j635k24J164M34j047o18J164O32j189m15Q36N49p59q11Q71N20p07
$$ 634 1224 -411 -635 529 963 -84 -702 462 1094 -95 -510 326 875 116 -695 176 696 -11
3789a1q87P78R77q07j097Q67R31o88j193P88J091o30j361N43J437j19j523r4J677
$$ -11 -898 -120 857 50 -1047 -180 751 63 -1130 -342 749 119 -1242 -699 738 619 -904 -998 679
3808F79J81j703j45J765K88j514o52J594Q66j589j009J593J118j198j434J153
$$ 679 860 -843 -988 777 1065 -449 -1101 493 1359 -230 -1239 354 1472 274 -1160 -7
3824gJ376q36j397N67J688p20j579J82J767Nj855j59J754L63j861m93J740N83
$$ -7 1369 533 -864 -297 1391 671 -908 -726 1041 1046 -809 -968 786 1149 -712 -1205 535 1118
3842A118j605j018J576J027j295j203J265J186j085j393Q76J490n92j498L79J735
$$ 1118 -487 -1505 71 1098 -197 -1400 -135 1051 -34 -1427 -551 939 347 -1151 -772 963
3858I63l47j413k5J601jj374l45J485M67j330k89J207N82j134r41J200P06r37
$$ 963 616 -797 -822 779 778 -596 -941 544 1011 -319 -608 599 1181 47 -894 306 1012 75
3876G5p44Q49O99m75j399R81J001p82j059O63J099o59j049K52J308o10j098L14
$$ 75 -669 180 879 404 -995 -14 987 205 -854 -191 908 249 -800 -548 760 150 -948 -634
3894f34J181j4j457K11J128N5j358K8J275M00j275m80J357N29j371o04J219J080
$$ -634 547 533 -924 -713 415 470 -888 -860 415 815 -460 -940 417 946 -425 -1029 190 1270
3912A270j238j009J199R51q02j310Q38J362o46j336M07J338m1j628l6J640Q2j706
$$ 1270 32 -977 222 1173 371 -939 -101 1261 615 -721 -314 1024 983 -645 -681 959 1041 -665
3930f65%J298L97j549o17J436O66j198r98J214Q16j064r02R25J060q28j268Q82
$$ -665 -665 633 1030 -519 -1136 300 966 -232 -1230 -16 800 -264 -1166 -241 819 -9 -1277 -395
3948c95J265n91j155L05J363l26j313J33J401j1j154j74J252K31j067o79J424
$$ -395 870 279 -876 -571 792 466 -847 -714 687 676 -478 -652 600 831 -236 -915 509
3965E09N06j136q10J311P69j256n75O49R97o76j054P67J062q13j270N84J397m97
$$ 509 1015 -121 -931 380 1149 -107 -682 -33 964 288 -766 1 1063 250 -1020 -436 961 464
3983D64j312K70J166j63j287N3J388R5j469j60J325K12j217k67R62P47j142o85
$$ 464 -848 -578 588 425 -862 -809 579 674 -795 -955 370 582 -635 -902 60 807 -335 -1020
4001a020J144Q28j152o13Q45J052q43j087P12J010n24j059M20J328l71j273K09
$$ -1020 124 952 -200 -813 32 1084 241 -846 -134 876 352 -707 -287 1041 670 -603 -394
4018c94J139J9j253j25J295K03j409k39J255J05r60o67J378L97r94q20R28R35
$$ -394 745 764 -489 -614 681 884 -525 -764 491 596 -364 -1031 347 744 -250 -1070 -142 793
4036G93j001p91P64R67o83j041N59J229n47j356N95J038j74j107J79J303r7j240
$$ 793 -208 -999 -235 732 49 -992 -433 796 249 -1107 -512 526 352 -755 -576 727 630 -610
4054f10r7J318J78r85n47J248O58j417o89J219Q51j050r59J018R95p62j196P31
$$ -610 -707 611 789 -196 -743 505 1163 -254 -943 276 1127 77 -882 136 1131 369 -827 -96
4072i6J034p00j121M93J180l28j372K74J238n5j239k60J366K87j362l00J326N98
$$ -96 938 238 -883 -390 790 462 -910 -636 602 547 -692 -952 414 701 -661 -961 365 963
4090I63j330o45R75Q22r28p81R22Q44p75q84N11J157n92j119O56J055j60j218
$$ 963 -367 -1012 -37 785 -143 -924 -2 842 67 -817 -306 851 259 -860 -204 851 691 -527
4108e27K83R75J86j359KJ124J84j221k46J183J43r94l05R36N92j172n93R27N77
$$ -527 -244 731 917 -442 -440 684 868 -353 -599 584 727 -267 -572 364 956 -216 -809 118 695
4127F95r93o59R71P40r85p40Q48P14o31r83P03J162o21r62L29J137l97j170K34
$$ 695 -298 -957 14 754 -231 -971 -123 591 -40 -1023 -320 842 221 -741 -412 725 328 -842 -608
4146f08J189J81j347n8J175L21j158l85R77P10j120p43J369O50j053q82Q20J088
$$ -608 581 762 -585 -643 532 853 -305 -690 287 997 -123 -866 503 1153 100 -782 38 1126
4164A126r51r83N18J281o08j261L54J392k77j435M5J439O3j391l05J342K47j187
$$ 1126 175 -808 -290 991 383 -878 -524 868 591 -844 -799 640 703 -688 -993 349 596 -591
4182e91n45J122Q55j194o27P96R00r63o96O13R27k90j005L59J092m00j053M03
$$ -591 -1136 -14 841 -353 -980 -184 716 -247 -943 -330 597 307 -698 -339 753 353 -700 -297
4200b97R29J24j041o1P38L56j190q4R45J70p85k40Q69L55r01n72Q42K89n46o39
$$ -297 632 756 -285 -346 392 748 -442 -526 419 589 -196 -436 433 788 -113 -685 157 446 -100 -739
4220g39P80O11p29q07R21L43n01q70P19Q69o39q05L39J019m23j021M36J039k31
$$ -739 41 652 -77 -884 37 380 -121 -991 -272 597 -42 -847 -508 511 88 -933 -497 542 311
4239C11r01j70J368r9j037j38J148L33j253l13J249O55j231o04Q49J030r86r42
$$ 311 -590 -760 608 509 -528 -666 482 815 -438 -751 498 1153 -78 -682 167 1197 211 -731
4257g31P22R73n82j246P20J182k83j486L37J117o3j282j44J274K75j259m14J199
$$ -731 -9 964 382 -864 -144 1038 755 -731 -394 723 660 -622 -766 508 783 -476 -890 309
4275C09L70j104o38R88P43q66p36M82J144o62r35M89J062m49j006L41J071j14
$$ 309 679 -425 -1063 -75 668 -198 -934 -452 692 30 -905 -416 646 197 -809 -468 603 489
4293D89r01n8J102J4j012m1R71J54q96k29O08M77p29l43Q50J72o16n39O67N73
$$ 489 -412 -470 632 646 -366 -407 564 718 -178 -407 201 678 -51 -394 456 628 12 -527 140 713
4313G13p73l08N99L04o76n31N49O40o09o64N50Q16m67q26M45P68k75r26O9J132
$$ 713 -60 -368 231 535 -141 -672 -123 517 -92 -756 -206 610 143 -683 -238 530 255 -671 -602 530
4333E30j7j274J22J015L27j123l00J255L38j228m49J080N72q85o46R91O35p04
$$ 530 513 -761 -639 376 703 -420 -720 535 873 -355 -804 276 848 -37 -683 308 943 239
$$ [...]
8191E7
##END NTUPLES=NMR FID
##END=
