##TITLE=1H_IG-160hexyne390
 CDCl3
 8 sc, 
 18.1.2022
##JCAMPDX= 6.0         $$ Bruker NMR JCAMP-DX V2.0
##DATA TYPE= NMR FID
##DATA CLASS= NTUPLES
##ORIGIN= UXNMR, Bruker Analytische Messtechnik GmbH
##OWNER= root
$$ XWIN-NMR		Version 3.5
$$ Tue Jan 18 10:52:21 2022 Russian Standard Time (UT+4h)  she@DPX200
##.OBSERVE FREQUENCY= 200.131
##.OBSERVE NUCLEUS= ^1H
##.DELAY= (6, 6)
##.ACQUISITION MODE= SIMULTANEOUS
##.ACQUISITION SCHEME= undefined
##.AVERAGES= 8
##.DIGITISER RES= 18
##SPECTROMETER/DATA SYSTEM= spect
##.PULSE SEQUENCE= zg30
##.SOLVENT NAME= CDCl3
##.SHIFT REFERENCE= (INTERNAL, CDCl3, 0, 15.7039)
##AUDIT TRAIL= $$ (NUMBER, WHEN, WHO, WHERE, WHAT)
$$ ##TITLE= Audit trail, XWIN-NMR		Version 3.5
$$ ##JCAMPDX= 5.01
$$ ##ORIGIN= Bruker BioSpin GmbH
$$ ##OWNER= she
$$ F:/spectra/data/she/nmr/H-F/1/audita.txt
$$ ##AUDIT TRAIL=  $$ (NUMBER, WHEN, WHO, WHERE, WHAT)
(   1,<2022-01-18 10:51:13.95 +0400>,<she>,<DPX200>,
      <created by zg, POWCHK disabled, PULCHK disabled
       configuration hash MD5:
       00 E9 B6 7A A2 85 ED C7 34 08 36 98 17 FE 4E 26
       data hash MD5: 16K
       EF CA 7E 28 1C 60 DD C4 DF EF 01 3E FE 1A 40 92>)
$$ ##END=
$$ 
$$ hash MD5
$$ A3 D8 32 D0 C6 D6 FE 37 95 9D 9C B5 30 5A B3 0E
##$RELAX= 
##$RELAX= 
##$RELAX= 
##$RELAX= 
##$RELAX= 
##$RELAX= 
$$ Bruker specific parameters
$$ --------------------------
##$DU= <F:/spectra>
##$EXPNO= 1
##$NAME= <H-F>
##$PROCNO= 1
##$TYPE= <nmr>
##$USER= <she>
##$AMP= (0..31)
100 100 100 100 100 100 100 100 100 100 100 100 100 100 100 100 100 100 
100 100 100 100 100 100 100 100 100 100 100 100 100 100 
##$AQSEQ= 0
##$AQ_mod= 1
##$AUNM= <au_zg>
##$AUTOPOS= <>
##$BF1= 200.13
##$BF2= 200.13
##$BF3= 200.13
##$BF4= 200.13
##$BF5= 200.13
##$BF6= 200.13
##$BF7= 200.13
##$BF8= 200.13
##$BYTORDA= 1
##$CFDGTYP= 0
##$CFRGTYP= 5
##$CHEMSTR= <none>
##$CNST= (0..31)
1 1 145 1 1 1 1 1 1 1 1 1 1 1 1 1 1 1 1 1 1 1 1 1 1 1 1 1 1 1 1 1 
##$CPDPRG= <>
##$CPDPRG1= <>
##$CPDPRG2= <>
##$CPDPRG3= <>
##$CPDPRG4= <mlev>
##$CPDPRG5= <mlev>
##$CPDPRG6= <mlev>
##$CPDPRG7= <mlev>
##$CPDPRG8= <mlev>
##$CPDPRGB= <>
##$CPDPRGT= <>
##$D= (0..31)
0 1.2 0 0 0 0 0 0 0 0.06 0 0.03 0 0 0 0 0.0002 0 0 0 0 0 0 0 0 0 0 0 0 
0 0 0 
##$DATE= 1642488673
##$DBL= (0..7)
120 120 120 120 120 120 120 120 
##$DBP= (0..7)
150 150 150 150 150 150 150 150 
##$DBP07= 0
##$DBPNAM0= <>
##$DBPNAM1= <>
##$DBPNAM2= <>
##$DBPNAM3= <>
##$DBPNAM4= <>
##$DBPNAM5= <>
##$DBPNAM6= <>
##$DBPNAM7= <>
##$DBPOAL= (0..7)
0.5 0.5 0.5 0.5 0.5 0.5 0.5 0.5 
##$DBPOFFS= (0..7)
0 0 0 0 0 0 0 0 
##$DE= 6
##$DECBNUC= <off>
##$DECIM= 32
##$DECNUC= <off>
##$DECSTAT= 4
##$DIGMOD= 1
##$DIGTYP= 9
##$DL= (0..7)
0 120 120 120 120 120 120 120 
##$DP= (0..7)
150 150 150 150 150 150 150 150 
##$DP07= 0
##$DPNAME0= <>
##$DPNAME1= <>
##$DPNAME2= <>
##$DPNAME3= <>
##$DPNAME4= <>
##$DPNAME5= <>
##$DPNAME6= <>
##$DPNAME7= <>
##$DPOAL= (0..7)
0.5 0.5 0.5 0.5 0.5 0.5 0.5 0.5 
##$DPOFFS= (0..7)
0 0 0 0 0 0 0 0 
##$DQDMODE= 0
##$DR= 18
##$DS= 0
##$DSLIST= <SSSSSSSSSSSSSSS>
$$ [...]
##$SUBNAM2= <"">
##$SUBNAM3= <"">
##$SUBNAM4= <"">
##$SUBNAM5= <"">
##$SUBNAM6= <"">
##$SUBNAM7= <"">
##$SUBNAM8= <"">
##$SUBNAM9= <"">
##$SW= 18.0517599122864
##$SWIBOX= (0..15)
0 0 2 0 0 0 0 0 0 0 0 0 0 0 0 0 
##$SW_h= 3612.71676300578
##$TD= 16384
##$TD0= 1
##$TE= 0
##$TE2= 300
##$TE3= 300
##$TEG= 300
##$TL= (0..7)
0 120 120 120 120 120 120 120 
##$TP= (0..7)
150 150 150 150 150 150 150 150 
##$TP07= 0
##$TPNAME0= <>
##$TPNAME1= <>
##$TPNAME2= <>
##$TPNAME3= <>
##$TPNAME4= <>
##$TPNAME5= <>
##$TPNAME6= <>
##$TPNAME7= <>
##$TPOAL= (0..7)
0.5 0.5 0.5 0.5 0.5 0.5 0.5 0.5 
##$TPOFFS= (0..7)
0 0 0 0 0 0 0 0 
##$TUNHIN= 0
##$TUNHOUT= 0
##$TUNXOUT= 0
##$USERA1= <user>
##$USERA2= <user>
##$USERA3= <user>
##$USERA4= <user>
##$USERA5= <user>
##$V9= 5
##$VALIST= <valist>
##$VCLIST= <CCCCCCCCCCCCCCC>
##$VD= 0
##$VDLIST= <DDDDDDDDDDDDDDD>
##$VPLIST= <PPPPPPPPPPPPPPP>
##$VTLIST= <TTTTTTTTTTTTTTT>
##$WBST= 1024
##$WBSW= 4
##$XGAIN= (0..3)
0 0 0 0 
##$XL= 0
##$YL= 0
##$YMAX_a= 229596
##$YMIN_a= -260758
##$ZGOPTNS= <>
##$ZL1= 120
##$ZL2= 120
##$ZL3= 120
##$ZL4= 120
##$ABSF1= 10
##$ABSF2= 0
##$ABSG= 5
##$ABSL= 3
##$ALPHA= 0
##$AQORDER= 0
##$ASSFAC= 0
##$ASSFACI= 0
##$ASSFACX= 0
##$ASSWID= 0
##$AUNMP= <proc_1d>
##$AZFE= 0.1
##$AZFW= 0.1
##$BCFW= 1
##$BC_mod= 2
##$BYTORDP= 1
##$COROFFS= 0
##$CY= 11.3945322036743
##$DATMOD= 1
##$DC= 2
##$DFILT= <>
##$DTYPP= 0
##$F1P= 2.36226072786647
##$F2P= -0.459571619588291
##$FCOR= 0.5
##$FTSIZE= 0
##$FT_mod= 4
##$GAMMA= 1
##$GB= 0.15
##$INTBC= 1
##$INTSCL= 1
##$ISEN= 128
##$LB= 0.24
##$LEV0= 0
##$LPBIN= 0
##$MAXI= 10000
##$MC2= 0
##$MEAN= 0
##$ME_mod= 0
##$MI= 1.114404
##$NCOEF= 0
##$NC_proc= 0
##$NLEV= 6
##$NOISF1= 3.799351
##$NOISF2= 2.8
##$NSP= 1
##$NTH_PI= 0
##$NZP= 0
##$OFFSET= 15.70392
##$PC= 1
##$PHC0= -15961.81
##$PHC1= 29.60078
##$PH_mod= 1
##$PKNL= yes
##$PPARMOD= 0
##$PSCAL= 0
##$PSIGN= 0
##$REVERSE= no
##$SF= 200.130013532006
##$SI= 16384
##$SIGF1= 3
##$SIGF2= 2
##$SINO= 400
##$SIOLD= 16384
##$SREGLST= <1H.CDCl3>
##$SSB= 0
##$STSI= 0
##$STSR= 0
##$SW_p= 3612.71676300578
##$SYMM= 0
##$S_DEV= 0
##$TDeff= 0
##$TDoff= 0
##$TI= <>
##$TILT= no
##$TM1= 0
##$TM2= 0
##$TOPLEV= 0
##$USERP1= <user>
##$USERP2= <user>
##$USERP3= <user>
##$USERP4= <user>
##$USERP5= <user>
##$WDW= 1
##$XDIM= 8192
##$YMAX_p= 0
##$YMIN_p= 0
$$ End of Bruker specific parameters
$$ ---------------------------------
##NTUPLES= NMR FID
##VAR_NAME=  TIME,          FID/REAL,        FID/IMAG
##SYMBOL=    X,             R,               I
##VAR_TYPE=  INDEPENDENT,   DEPENDENT,       DEPENDENT
##VAR_FORM=  AFFN,          ASDF,            ASDF
##VAR_DIM=   8192,          8192,            8192
##UNITS=     SECONDS,       ARBITRARY UNITS, ARBITRARY UNITS
##FACTOR=    0.0002768,     1,               1
##FIRST=     0,             0,               0
##LAST=      2.2672688,     0,               0
##MIN=       0,             -260758,         0
##MAX=       2.2672688,     229596,          0
$$ Real data points
##PAGE= N=1
##DATA TABLE= (X++(R..R)), XYDATA
0@%%%%%%%%%%%%%%%%Kj0J6j6J6j6J6j6K1k9L2l2L7m5N0n6O2o9P8q6R7j08J17j30
40f9J46j63J79j94K14k35K58k85L12l43L78m17M61n10N68o33P10q03R13j050J223
61F60j451J755k176K803l796N537r094J8665q3191j69537M30862q6532l65263
74b60758L46769R8303l91925J81215K32728l22037J1440K72774j88663j06959
84a27113K21447n0211j40429J14634L9612r2073O713N1334K589n2423j0044R1991
96E6027l7015j09510J29981M6133j97506R3535J62055k30386r124K62616j87123
107b0317j43061L05732p6681k61068K71276O6631l22129J68024J96679l06438
117a21352K9303K73388k22113j00393K77267j00866j82423K15681J5050j98167
$$ plain form
0 0 0 0 0 0 0 0 0 0 0 0 0 0 0 0 0 0 2 -8 8 -8 8 -8 8 -8 13 -16 16 -16 21 -24 26 -30 32 -37 41 -45 52 -56 61 -69
40 -69 77 -86 93 -101 113 -122 136 -149 163 -180 198 -219 242 -268 300 -333 377 -426 487 -563 660
61 660 -791 964 -1212 1591 -2205 3332 -5762 12903 -70288 -239825 191037 104505 -260758
74 -260758 86011 184314 -207611 -26396 206332 -115705 -104265 168509 -20154 -127113
84 -127113 94334 44123 -96306 18328 57940 -34133 -27420 23914 26503 -25920 -35964 56027
96 56027 19012 -90498 39483 85616 -111890 -18355 143700 -86686 -95810 166806 -20317
107 -20317 -163378 142354 65673 -195395 75881 142512 -179617 -11593 185086 -121352
117 -121352 -92049 181339 -40774 -141167 136100 35234 -147189 68492 83542 -114625
127a14625J18353Q9425j54381K4576J04895p8659l2211O8057p388l6455M875K8890
139A5352M851n1016J6870O7085p1830l6149J18741m5908j06295J34070J8949j63701
151i8981J02627R9724j84016L2167J67694j57128n5287J99274r0249j31936J84227
162F8116m302j74701J28796P4085j73145N2586J22537j32438j9362J30472p0446
173B198o5644J02071j0603p5828N3632K6950n3419O928L2301j3515j9248Q749
185e428K3584j5881k9411M0515J3670o3175K8924N5786p6068p701R2164o0384
197c405n6027J07011j9616r8328R2856L3384j19232N2860Q1338j11092n91J08936
209F8094p6618n0685J08437k7546q2424Q1947K0071q7928M0309N1742o8750j318
$$ plain form
127 -114625 3728 93153 -61228 -36652 68243 -10416 -42627 25430 18042 -18413 -13538 15352
139 15352 20203 -30813 -13943 53142 -18688 -54837 63904 17996 -88299 45771 64720 -98981
151 -98981 3646 103370 -80646 -48479 119215 -37913 -93200 106074 15825 -116111 68116
162 68116 63814 -110887 17909 91994 -81151 -28565 93972 -38466 -57828 72644 2198
173 2198 -63446 38625 28022 -47806 5826 32776 -20643 -13715 18586 5071 -14177 -5428
185 -5428 18156 2275 -27136 13379 27049 -36126 -7202 48584 -27484 -35185 56979 -3405
197 -3405 -59432 47579 27963 -70365 22491 55875 -63357 -10497 70841 -40251 -40842 68094
209 68094 -8524 -59209 49228 21682 -60742 21205 41276 -46652 -6343 45399 -23351 -24669
221b4669N9533l4768k9019M4523k83l5058J5895K1509k0301j2912K3249O530k9346
234a5117N830L2679k6508k2455M6212n336m9186M0527K5976o2863J6647N5360
246D1766n7042j7399P1486l2703m9740O7966K264o9124M5680L6145o9136J2238
258a7599N7900n0487k1036O1190k0398m3363M6401J0310m8410K0244L1229l6344
270a0363o920L6097j3454k5093K4964J0397k8275L848K5639j6503j7834K6566
282I069M415l0926J3316K5388l0036q471L7687j5405k9957L6066P511m2680K0770
295c253L0089m1475k805M3882k6595k6133M3935l368m1046L0424J9995m2618Q463
308a0505L5480l0941j3995L8238j0861k9218K8265J0052l2467J0071K4260k3565
$$ plain form
221 -24669 34864 96 -28923 15600 15317 -19741 -3846 17663 -2638 -15550 7699 14229 -15117
234 -15117 -9287 23392 -3116 -25571 20641 15305 -33881 6646 32622 -30241 -13594 41766
246 41766 -15276 -32675 38811 6108 -43632 24334 26598 -42526 3154 39299 -29837 -17599
258 -17599 40301 -10186 -31222 29968 9570 -33793 12608 22918 -25492 -5248 25981 -10363
270 -10363 -17283 18814 5360 -19733 5231 15628 -12647 -8799 16840 337 -17497 9069
282 9069 13484 -17442 -4126 21262 -8774 -17245 20442 5037 -24920 11146 18657 -24023 -3253
295 -3253 26836 -14639 -17444 26438 -157 -26290 17645 14277 -26769 3655 23650 -18968 -10505
308 -10505 24975 -5966 -19961 18277 7416 -21802 6463 16515 -15952 -5881 18379 -5186
320e186q996K7128o868k1725J8537J0573k3697K695K1872j4815j3708K2816R03
333I529k4078J3359J7010k4332k683K7088j4356j9027K7191K037k9380J7185J8757
346A8300k9888P47K9682k0422j6132L0981m530k7480K2501J2011k9603P621K3424
359A7212k2233q086K6027q579j9028J9490N983k1520O884J5990j5285o562J7926
372H219l304j5577J1519R384j6790l76J7713r859j2947J8385K430k1174J1007
385a370J5352k1767j715K3971j4341j5121K5011j550k4328J8122J2036k6198N876
398f022K1707k0329p335K4314r098j6902J9424L177j9749R326J2040j5378j786
411f611J4417o070r507R876M060j0903P13J0736n623r082J1133M111j5295M877
$$ plain form
320 -5186 -14182 12946 6078 -15647 2890 13463 -10234 -7539 14333 -482 -14190 8626 9529
333 9529 -14549 -1190 15820 -8512 -11195 15893 1537 -17490 9701 11738 -17642 -457 18300
346 18300 -11588 -10841 18841 -1581 -17713 13268 8738 -18742 3759 15770 -13833 -6212 17212
359 17212 -5021 -13107 12920 4341 -14687 4803 10786 -10734 -3850 12140 -3145 -9707 8219
372 8219 4915 -10662 857 10241 -6549 -6925 10788 929 -12018 6367 8797 -12377 -1370
385 -1370 13982 -7785 -9500 14471 130 -14991 10020 8470 -15858 2264 14300 -11898 -6022
398 -6022 15685 -4644 -11979 12335 3237 -13665 5759 8936 -10813 -1487 10553 -4825 -6611
411 -6611 7806 1736 -7771 2105 6165 -4738 -4025 6711 1088 -7994 3139 7250 -8045 -3168
425c168J4350j5139n811K0899q207j6990K0892L284k4453J4036J5358k5383K440
438g892K3881j9415r913K6058q690j8988K1491L017k2093J2263J1782j8819J992
451e326J4946j1104n491J2111k519p703N300L293m322k113L860K771o448j036
465c781R975n429r273J3827J049j7466J2087J0927k2018M596K0680k0653o505
478a1984K6742j3312j7660K6782k047k5303K0724R554k7115J0624J7996k2991
490g990j09K1086j4943q081J8674o158j1273J2704J35r507O212K035m767K231
504B49n32J89K503n584K248O890j0179p5J3482j1639o569J9339q327j5254K1678
519H419n47k3168J8903R759k7476J1217J9533k6457O55K5874k0380r776K7081
$$ plain form
425 -3168 11182 -3957 -9768 11131 2924 -14066 6826 10110 -14343 -307 15051 -10332 -7892
438 -7892 15989 -3426 -13339 12719 4029 -14959 6532 9549 -12544 -281 11501 -7318 -5326
451 -5326 9620 -1484 -6975 5136 2617 -5086 214 3507 -815 -2928 932 3703 -2745 -3781
465 -3781 6194 765 -8508 5319 6368 -11098 989 11916 -10102 -5506 15174 -5479 -11984
478 -11984 14758 1446 -16214 10568 8521 -16782 3942 13496 -13619 -2995 15001 -7990
490 -7990 -8099 12987 -1956 -10037 8637 2479 -8794 3910 4045 -5462 750 2785 -1982 249
504 249 -283 -94 2409 -3175 -927 5963 -4216 -4291 9191 -2448 -9017 10322 1995 -13259 8419
519 8419 7872 -15296 3607 13366 -14110 -2893 16640 -9817 -9162 16712 -3668 -13444 13637
532A3637j1102j7267K3344j537k0144J6436N566j8452R027Q662j3918L759P839
545E850r136K012M815o491L597J921p079O775J390j0601R218M329j5436Q889J0220
560A0273j9116M745J7344j9654k663K3275j6005j1612K5917q624j9654K4193P64
573I183k4642J8418R756k5399J0301J6164k2145K027J8825j6372m267J7852j0187
586d86p405J4574n567p470J0926l567n735Q781m099m034R032n882m041J1463p070
601e80o615J4757o143j1336J7090k313j6892J6905M036k1424J3367J1528k3228
614a0848O827J8222k1427j292K2369j6319r118K2986r157j4843K0225j773j7437
627a1585J5188M086j6873R568P354j4163N047P911j0848K698O677q497K515N173
$$ plain form
532 13637 2535 -14732 8612 7075 -13069 3367 8933 -9519 -492 8170 -5748 -1989 5850
545 5850 -3286 -1274 3541 -2950 647 2568 -4511 2264 3654 -6947 2271 6600 -8836 53 10273
560 10273 -8843 -4098 13246 -6408 -9071 14204 -1801 -13413 12504 3880 -15774 8419 9183
573 9183 -15459 2959 12715 -12684 -2383 13781 -8364 -6337 12488 -3884 -8151 9701 -486
586 -486 -7891 6683 1116 -6354 4572 1005 -4730 4051 -48 -4082 4950 -932 -4973 6490 -580
601 -580 -7195 7562 1419 -9917 7173 4860 -12032 4873 8909 -12515 852 12380 -10848
614 -10848 -4021 14201 -7226 -8518 13851 -2468 -11586 11400 2243 -12600 7625 5852 -11585
627 -11585 3603 7689 -9184 384 7738 -6425 -1378 6533 -4315 -1617 5060 -3437 -922 4251
641D251q093L675M812r585M669O490j2031M100J0074j3990J184J4590j3958m001
655g813J8450j1126j0340K0108n575j6209J8649J576j9932J4087Q632k0474P517
668b450J3853j7823O21J6162j2913m919J5421p357p951J2457k791q277Q793l66
682B460o685O044k48m648N220j659l609O432l165m530Q761l262p460J0846j125
697C372j1485J1246L215j5068Q995Q789j6662M175J3966j5350k140J7143j1144
710i48q348J7314n114j2749J4487J115j4309R635N845j2956M391Q031r629L16
724b919P633n852j562N495l129j125L001k425P57J668l774K657K360o249L109
739c55M992q341J383Q576q826k347J1708o888p126J2985k699j1408J1610K703
$$ plain form
641 4251 -3842 -167 4645 -4940 -271 6219 -5812 -1712 8362 -5628 -4444 10146 -3812 -7813
655 -7813 10637 -489 -10829 9279 3704 -12505 6144 7720 -12212 1875 10507 -9967 -2450
668 -2450 11403 -6420 -5799 10363 -2550 -7469 7952 595 -7356 5101 2310 -5967 2826 2460
682 2460 -4225 1819 1571 -3077 2143 484 -3125 3307 142 -4388 4373 1111 -6349 4497 3372
697 3372 -8113 3133 6348 -8720 275 9064 -7598 -3423 10543 -4807 -6947 10196 -948
710 -948 -9296 8018 2904 -9845 4642 5757 -8552 1083 6928 -6028 -1637 6394 -3235 -2919
724 -2919 4714 -1138 -2700 2795 -334 -1459 1542 -883 -126 1542 -2232 425 2785 -3464 -355
739 -355 4637 -3704 -2321 6255 -2571 -4918 6790 -98 -7224 5761 3062 -8346 3264 5967
753E967j3786P784P758j3447K523J1033j0572k590J1725o165o152R936j678p409
767e073O633J524o414L201K632m022R25J719j552N65l63k96K024k264r36M379
783B682k799l252O325j390o296O726J718q843N068N611r746J570Q967q412k815
798d886J0622n100o777J0017p48r112P331L321r264L540N970p392j62O610m388
813d18k654N398j382l283L010N36k218P37P17j58m61o72J679L0k812K289J979
830B317m591J220M586n070j301O729l744m474P456q84p200O314K732q477L475
845i12N963p832j94P806n428l615P749k089n750N952J146o176L180L272m889M15
861a402L742k631j318K679m72j493P67O91k87r79L74J641j661j261L258q19l504
$$ plain form
753 5967 -7819 -35 7723 -5724 -3201 7832 -2740 -5330 6395 230 -5922 4014 2336 -5073
767 -5073 1560 3084 -3330 -129 2503 -1519 -594 1125 -427 138 -225 -521 1503 -761 -1697 2682
783 2682 -117 -3369 2956 1566 -4730 1996 3714 -5129 -61 5550 -4196 -2626 6341 -2071 -4886
798 -4886 5736 636 -6141 3876 3128 -5984 1347 4668 -4596 -1056 4914 -2478 -2640 3970 -418
813 -418 -3072 2326 944 -2339 671 1207 -1011 -274 443 285 -176 -848 831 861 -1951 338 2317
830 2317 -2274 -1054 3532 -1538 -2839 3890 146 -4328 3128 2244 -4956 1358 4090 -4387 -912
845 -912 5051 -2781 -2975 4831 -597 -4212 3537 1448 -4302 1650 2796 -3380 -200 3072 -1817 -1402
861 -1402 2340 -291 -1609 1070 598 -895 -128 563 276 -703 -329 1312 -349 -1610 1648 829 -2675
878b675L727J287n349K646M001n993J74O312m926k943P338k422n711O655Q38p233
894d274M446L843p075J388N760n402j552O069k822l475M867k91l931K820J348
909A719l038Q39J622j376k61O34J45p5r29P02J264k243QL083k527j820M533j456
927H24m097M902P54o018L844L509o785J522N868o000j440P137l917m135O937j148
943A757n827N400J530o151L083L327n173Q13L888l481p20L293j796j136K080q36
959E1n57R74q97N27N95j844J334J271l135J308K773m061K08M585m073j826O034
976C267k885m220O454o53o213N560K023p224L576M439o972J024N997n607j401
991b835O366l569l143N654j522l859M336p8l609K965N25k852K127L14k158K071
$$ plain form
878 -2675 1052 2339 -3010 -364 3637 -2356 -2182 4130 -796 -3739 3599 1177 -4534 2121 2959 -4274
894 -4274 172 4015 -3060 -1672 4088 -1314 -2866 3203 381 -3094 1773 1482 -2449 371 1719
909 1719 -1319 -480 1142 -234 -495 139 284 209 -720 -18 1246 -997 -989 2094 -433 -2253 2280 824
927 824 -3273 1629 2383 -3635 209 3718 -3067 -1545 4323 -1677 -3117 4020 103 -4032 2905 1757
943 1757 -4070 1330 2860 -3291 -208 3119 -2054 -1241 2647 -834 -1554 1739 -57 -1193 887 51
959 51 -506 468 -429 98 693 -1151 183 1454 -1681 -373 2400 -1661 -1453 3132 -941 -2767 3267
976 3267 382 -3838 2616 1963 -4250 1310 3333 -3891 -315 4124 -2848 -1824 4173 -1434 -2835
991 -2835 3531 -38 -3181 2473 951 -2908 1428 1350 -2259 706 1231 -1621 506 820 -1338 733
1007G33k16k032K646n41k665L426j84l903L851J019n291L476K889o251K107M981
1023D045o349m0O618n288k518P395l363m722P070r43o154N773J362o589L934L031
1039C262o065K061L854m988O41L899l868q7L496l137k06L146k985r2L234l290
1055a125j63L841l620q22M884l648k082N899k937l841O465j436n601O209O52o930
1071d255N021K955p485L112M911p020Q20O186n769j317O586m082k905O164k323
1086E99l779N265r52m016M334j30l878L669K27l746L416M23l927L444P90m485
1102b746L474J584n273L149K847n953K263M373o209P51N845n759j163O864m540
1117d93l166P180k760m861O713p25n969N584J181o334M061K678o040K490L580
$$ plain form
1007 733 517 -1515 1131 590 -2075 1351 1167 -2736 1115 2134 -3157 319 3208 -3043 -936 4045
1023 4045 -2304 -2344 4274 -1014 -3532 3863 500 -4222 2848 1905 -4249 1524 2886 -3703 231 3262
1039 3262 -2803 -742 3112 -1876 -1235 2664 -1204 -1291 2205 -932 -1138 2008 -977 -1069 2165 -1125
1055 -1125 -1288 2553 -1067 -1889 2995 -653 -2735 3164 227 -3614 2851 1415 -4186 2023 2675 -4255
1071 -4255 766 3721 -3764 -652 4259 -2761 -1941 4245 -1524 -2841 3745 -337 -3242 2922 599
1086 599 -3180 2085 1133 -2883 1451 1321 -2557 1112 1339 -2407 1009 1432 -2495 949 1739 -2746
1102 -2746 728 2312 -2961 188 3035 -2918 -655 3718 -2491 -1740 4105 -1654 -2817 4047 -493
1117 -493 -3659 3521 761 -4100 2613 1888 -4081 1503 2684 -3650 411 3089 -2951 -461 3119
1132C119n324J156L957m472K22L987l780l45L966l386p29M111l184j210M484k956
1148c84j988N001k501l051N422j619m293N461k51n467M961J424o304L864L130
1163C405o521K299M579o080N28N515n074j150N833l735k471N624k342l359N027
1178B078j107l776M286j53l900L597M98l898L086R73l949K714J452m130K348K104
1194B223m396J836K924m566J035L866m495j00M740l979j468N337l042k850N465
1209B530j716m034N072k31m814M229J188n085L077K336m911J878L105m409P86
1224i99L517l751q8L621l066p29L576k511j192L541k060j629L549j641k096L603
1240A645j143k653L589n12l253L432L23l839L016J333m252K304K360m337J270
$$ plain form
1132 3119 -2205 -1049 2908 -1564 -1342 2645 -1135 -1480 2486 -900 -1629 2482 -702 -1912 2572 -384
1148 -384 -2372 2629 128 -2923 2499 880 -3413 2048 1797 -3670 1291 2715 -3589 275 3405
1163 3405 -3116 -817 3762 -2318 -1790 3725 -1349 -2499 3334 -401 -2872 2752 410 -2949 2078
1178 2078 971 -2805 1481 1328 -2572 1025 1523 -2375 711 1684 -2265 449 1901 -2229 119 2223
1194 2223 -2173 -337 2587 -1979 -944 2922 -1573 -1673 3067 -912 -2380 2957 -85 -2935 2530
1209 2530 814 -3220 1852 1621 -3193 1036 2224 -2861 216 2552 -2359 -481 2624 -1785 -999
1224 -999 2518 -1233 -1321 2300 -766 -1495 2081 -430 -1622 1919 -141 -1770 1779 138 -1958 1645
1240 1645 502 -2151 1438 926 -2327 1105 1428 -2411 605 1938 -2314 -10 2350 -1987 -717
1255g17L305m048Q7L943l367j090M217k431k107M115j373k816L657l47l200L006
1271H34N14l252K283J108l112J656J482k877J157J725k699P88J924k566M64K173
1287A602k507Q5K518k410m34K924k177j130L266j680j930L396r31k687L208N0
1303A163l295K695J078l558J854J992l443Q61K635k967j34K945k234r60K868j457
1319D3j446K539p85j658K117l30j648J773q4j598J604L0j637J553J79j814J580
1336D18M38k135J507R36k485J212J593k665O09K294k573k19K828k120j135L066
1352A569j331j971K902l97k521K387N35k705J634J254k513Q27J646k081K00J713
1368A148j577k26J580j171l80J404r51l87J292r18l84J370r79n41J624r73q98
$$ plain form
1255 -717 2588 -1460 -1373 2570 -797 -1887 2330 -101 -2208 1907 534 -2282 1375 1028 -2172 834
1271 834 1348 -1904 379 1487 -1625 31 1513 -1364 -207 1518 -1181 -393 1531 -1035 -571 1602
1287 1602 -905 -820 1698 -712 -1146 1778 -399 -1529 1737 57 -1873 1523 592 -2095 1113 1163
1303 1163 -2132 563 1641 -1917 -63 1929 -1514 -653 1982 -985 -1119 1826 -408 -1368 1500 43
1319 43 -1403 1136 351 -1307 810 480 -1168 605 521 -1077 527 557 -1080 473 652 -1162 418
1336 418 856 -1279 228 1164 -1321 -109 1484 -1181 -572 1722 -851 -1070 1758 -362 -1497 1569
1352 1569 238 -1733 1169 772 -1749 638 1173 -1532 102 1356 -1157 -330 1316 -765 -565 1148
1368 1148 -429 -655 925 -246 -626 778 -173 -560 732 -186 -570 800 -179 -720 904 -69 -967
1385i67J923p62j434K104k71k035K026M53k497J586J270k679Q80K000k492J9K459
1402A583j975q37K573j229j482K331m60j795J844J69j812J313N44j607Q74O71
1418G05j359O38O28j203N84N95j214O34O81j399O28R75j639M25J435j756l4J947
1436A271j627p10K336j215j437K444n12k069K198K95k433J655J075k483R46J633
1452A367k220K39J882j718l66J882j221o86J685q32p90J457n93q08J327n00q34
1469g29J351m91r43J470m12j230J617j41j643J628L32k029J408R49k295R42J584
1486A368k287K67K124k019m86K417j492j167K420q36j661K162j75j919J745L67
1502H28j955J300P20j829R13R04j670O56J008j581N07J088j542L48J272j593J90
$$ plain form
1385 -967 956 194 -1240 864 593 -1442 584 1037 -1460 126 1396 -1283 -403 1597 -895 -876 1583
1402 1583 -392 -1229 1344 115 -1367 964 504 -1291 553 722 -1090 223 767 -840 34 705
1418 705 -654 -16 612 -591 -7 588 -626 8 689 -710 -82 893 -746 -321 1114 -642 -676 1271
1436 1271 -356 -1066 1270 55 -1382 1062 550 -1519 679 974 -1459 196 1271 -1212 -266 1367
1452 1367 -853 -614 1268 -450 -816 1066 -155 -841 844 12 -778 679 86 -722 605 105 -729
1469 -729 622 131 -812 658 246 -984 633 492 -1151 477 809 -1220 188 1137 -1158 -216 1368
1486 1368 -919 -652 1472 -547 -1033 1384 -108 -1275 1145 309 -1352 810 635 -1284 461 828
1502 828 -1127 173 893 -936 -23 881 -789 -133 875 -706 -199 889 -653 -305 967 -626 -436
1519d36J522j629j18J838j548n53K131j298j112K325q36j694K307k21k159K050
1535E69M58k447J573J129k495R60J671k328K95K002j944l05K133j503p66K079
1551A081j053j071J927o77j256J787l93j397J672j62j532J612N5j720J551L50
1567G74j947J424P64k190J174J247k351P65J788k337J77K251k125m89K586j691
1583a80j169K678j076j769K532l71k181K189K88k348J677Q56k336J154J243k159
1599i72O68J474j912K67J608j717kJ677j539k52J793j410n16J953j277q77K157
1616A123j049j327K302o54j837K295p9k321K098N74k641J659J272k755J049J881
1632A590k623L17K320k235m18K518j686j013K463j117j394K235n81j622J949j53
$$ plain form
1519 -436 1086 -543 -661 1177 -371 -924 1207 -91 -1203 1122 286 -1408 899 678 -1481 569
1535 569 1027 -1420 153 1282 -1213 -253 1418 -910 -615 1387 -557 -862 1271 -232 -998 1081
1551 1081 28 -1043 884 207 -1049 738 345 -1052 620 458 -1074 538 593 -1127 424 774
1567 774 -1173 251 1015 -1175 -1 1246 -1105 -340 1448 -889 -712 1539 -586 -1075 1511 -180
1583 -180 -1349 1329 253 -1516 1016 645 -1536 653 941 -1407 270 1126 -1210 -56 1187 -972
1599 -972 -304 1170 -742 -475 1133 -584 -586 1091 -448 -700 1093 -317 -833 1120 -157 -1034 1123
1616 1123 74 -1253 1049 395 -1442 853 774 -1547 551 1125 -1516 143 1415 -1340 -291 1590
1632 1590 -1033 -716 1604 -631 -1049 1469 -217 -1230 1233 116 -1278 957 376 -1246 703 550
1648E50j716J680J44j753J451L78j797J305O24j918J155R26k071R25J344k174
1664i47N28J809k157j6K265j928o87K568j477j375K655q45j964K484j36k331K048
1681D94N85k477J507J122k375R22J485k138M23J652j830J9J736j562k55J747j343
1698b88m73J767j158p15J855r90j004J952p32j388K014l57j775J928J74k163J694
1715C41P66k380J232J365k404O39J884k208k9K190j782o78K297j255j158K172
1731I92p04j497J942k27j652J638J60j704J344M42j680J102O43j677R13Q30j699
1748h34P31J054j719M78J365j739J32J694j641l02J959j384q36K131r80j314K100
1765H95m44j748J903J60k014J511P22k068J015J170j960N10J451j690L5J578j375
$$ plain form
1648 550 -1166 514 658 -1095 356 734 -1063 242 866 -1052 103 1029 -1042 -117 1227 -947
1664 -947 -419 1390 -767 -783 1482 -446 -1133 1435 -42 -1417 1238 393 -1571 913 777 -1554 494
1681 494 1079 -1398 109 1231 -1144 -222 1263 -875 -452 1200 -630 -611 1125 -437 -692 1055 -288
1698 -288 -761 1006 -152 -867 988 -2 -1006 946 214 -1174 840 483 -1292 636 810 -1353 341
1715 341 1107 -1273 -41 1324 -1080 -441 1443 -765 -794 1396 -386 -1064 1233 -22 -1180 992
1731 992 288 -1209 733 506 -1146 492 652 -1052 292 734 -946 156 799 -878 35 865 -834
1748 -834 -103 951 -768 -290 1075 -664 -532 1162 -479 -781 1178 -206 -1042 1089 109 -1205 895
1765 895 451 -1297 606 766 -1248 263 985 -1083 -68 1102 -858 -348 1103 -587 -552 1026 -349
1782c49l27J600j075n83J541q08p61J467n99r08J435m06j069J408k01j285J384
1799D64Q0j521J277M43j713J044Q61j824O84J274j781K14J628j597k74J812j217
1816a46p85J839p58j158J691k87j385J434J20j459J112M38j415Q04O59j347N48
1833i5Q14j255L43R06j162J57J018j099l6J173j044k65J316q98n67J434o83q93
1851h36J495l76j203J406J8j428J181M43j557Q60Q30j539M77J116j390P0J271
1868H38j121k82J338q68n43J270n59p39J174l12q59J053j01r15R21O7r92Q32K37
1887D39j046O92M41j111N57O46j146L64Q53j116R0J056j017k01J212q16n32J275
1905F40n43q26J243k18j060J109J23j178Q66M21j202O06O59j140L24Q19j007P0
$$ plain form
1782 -349 -676 924 -151 -734 807 -1 -762 705 106 -802 633 227 -842 566 365 -920 464
1799 464 544 -977 300 743 -970 74 935 -889 -205 1069 -712 -498 1130 -467 -741 1071 -146
1816 -146 -931 908 150 -1008 683 396 -989 445 565 -894 218 656 -759 45 704 -643 -95
1833 -95 719 -536 -193 713 -449 -292 726 -373 -409 764 -280 -545 771 -127 -694 740 57 -836
1851 -836 659 283 -920 486 504 -924 257 700 -857 3 833 -706 -229 887 -503 -433 838
1868 838 -283 -565 773 -95 -638 632 73 -666 508 196 -663 390 289 -626 295 362 -630 202 439
1887 439 -607 85 526 -585 -28 618 -528 -164 689 -427 -337 719 -298 -499 713 -103 -635 640
1905 640 97 -729 514 296 -764 345 468 -710 156 577 -625 -19 640 -500 -176 643 -364 -294
1923b94Q96q39j44R27o75k98R09n17m22R01m01n39Q88k65o55Q71j26p71Q35M9
1943C30r18P47K96j018N77N59j075L51Q09j041N6J007r03k61J120o71n61J109
1961E13l52p81R99p9r12Q33J79r36O06L76q84L98M82q00K39N46p17J37N69o64
1981b48N3O32o45l6P02o13j72Q14n77l39R10m43n65R60k39p98R25N0r94P78L51
2002E06j069N14O46j038K03Q65q95j14R48o69l65R37m32n27Q37j86o21P10n6o02
2022d08N84M7o02N20R5o02M86J51o54M82K32p32M32L81q22L24O09q95J42Q16q35
2043b49j53J001o97m44J068m27p07J008j20q95Q20K05r59N87M36r12L32N81p83
2062c08J19O31o51k2O22n21j13O02m56j52N94m25j97O44m18k95P21l54m53Q00
$$ plain form
1923 -294 602 -237 -381 546 -129 -427 482 -35 -457 444 43 -496 392 127 -528 343 217 -554 281 330
1943 330 -588 159 455 -563 14 573 -502 -151 658 -383 -327 680 -223 -484 636 -35 -596 513
1961 513 161 -620 379 300 -612 221 400 -536 70 446 -438 -40 442 -358 -119 427 -290 -153 416 -248
1981 -248 -195 437 -208 -244 458 -155 -327 487 -90 -429 481 38 -527 433 194 -604 321 371 -623 155 506
2002 506 -563 -49 597 -441 -238 627 -268 -382 566 -103 -468 469 37 -490 347 161 -460 250 194 -408
2022 -408 176 223 -379 141 236 -366 120 271 -383 99 331 -401 31 412 -410 -86 523 -372 -230 586 -249
2043 -249 -402 599 -98 -542 526 99 -608 400 280 -615 205 410 -549 38 474 -438 -106 475 -308
2062 -308 -189 442 -209 -231 391 -130 -243 359 -97 -249 345 -80 -277 367 -51 -346 375 21 -432 368
2082C68k33o52Q32k9q56P72K33r95N90N19j042L45P56r66N3Q95p83k29R50n67
2102c9m32Q99l37n76P89j27o07O43J5o35N56J01o26M92J48o36M30K60o87L82L72
2123C85p43K92N23p91J63O86p71n3Q50o78k95R44n10n24R59k73p41Q90k6q57P55
2144A85K14r11N58M06q83L59N38q17J96O15p26M6O59o37p7O95n46j79P19m81l03
2165c70P58l76m13P68k66n48P71j20o92P34N6q05O45K78r04M79N01r20K97O67
2185E40q68N1Q26p67j51Q88n91l87Q99l87n42Q64k10o65P70k5p18O61J10p42N58
2206A14K45p87M61L56p74L51M59p70K32N79p68J08O84p31n5Q07o51k52Q71n02
2226b3m65R25l19o54Q67q4q03P69J38q84O07L70r09M13N34q53J98O75p61PP25
$$ plain form
2082 368 135 -517 315 286 -570 202 435 -560 30 549 -493 -148 608 -358 -305 590 -193 -422 528 -39
2102 -39 -471 428 91 -485 304 177 -430 213 228 -407 149 250 -376 116 264 -372 58 318 -369 13 385
2123 385 -358 -66 457 -334 -171 515 -256 -309 541 -137 -432 512 2 -522 437 164 -577 313 287 -570 185
2144 185 399 -512 46 452 -431 -72 466 -351 -155 460 -266 -220 439 -198 -275 420 -126 -305 414 -67 -370
2165 -370 388 12 -401 367 101 -447 324 204 -488 246 302 -503 142 420 -484 -5 496 -424 -127 540
2185 540 -328 -277 549 -218 -369 519 -72 -459 440 53 -489 375 165 -500 270 245 -473 188 298 -444 114
2206 114 359 -428 33 389 -385 -34 425 -345 -113 466 -302 -194 490 -241 -296 511 -140 -392 479 -23
2226 -23 -488 437 118 -536 331 247 -556 213 351 -533 74 444 -465 -52 482 -371 -173 502 -259 -252 473
2247D73o34j59P63n18k82P52l94l86P50l00m86P44j86n88P24n5o90O78J15q09
2267d88O03K82q58M57M95r06K74O74q50L7Q11p34j87Q88n59l96Q87l54n65Q14
2287C25j38o67P04L5p05N73J87p20M63K91p17L57M01p17K43M85o72J22N83o52
2307b19k7P03o03j95P82m98l60Q16l34n41Q11j53o84P33P1p88N96K72q31M45M33
2328D29p91K55N55p28Q3O33o08r3O74n01k14O76l87l27O79k85m18O53j59n05O02
2349B23k7o01N62R9o48M64K59p11L63L98p16K09N48o85K9O59n76j73P27m42l37
2370c76P19k93m46O86j38n53N96L2o09M86J78o35L94K67o16K80L76n98J49M56
2390C55n58L4N25m96q9N67m27j92N94l20l16N99j98m36N83o7n37N23Q9n88M14
$$ plain form
2247 473 -161 -320 443 -75 -357 395 1 -385 365 65 -421 323 137 -451 273 218 -472 206 321 -488
2267 -488 115 397 -461 -4 491 -415 -141 533 -317 -280 531 -203 -390 498 -61 -457 430 76 -489 325
2287 325 187 -480 224 259 -446 127 314 -406 57 348 -369 -12 389 -328 -85 400 -272 -150 433 -219
2307 -219 -246 457 -146 -341 441 -57 -417 399 65 -476 335 182 -502 231 302 -486 110 382 -449 -4 429
2328 429 -362 -107 448 -280 -197 436 -172 -265 409 -92 -306 370 -17 -344 335 50 -368 285 126 -379 223
2349 223 196 -405 157 256 -392 72 331 -380 -17 381 -335 -126 422 -263 -234 425 -151 -324 403 -39 -376
2370 -376 343 50 -396 290 152 -401 195 227 -382 104 282 -353 41 308 -308 -28 348 -250 -101 355
2390 355 -203 -169 356 -140 -229 338 -89 -281 313 -7 -323 276 78 -358 225 158 -379 144 233 -355 59
2411E9K30o07K91L68o05J54M55n37RN18m51j31N70l46k50N55k46l35N38j34m17
2432c12M99k1m70M30P8n08L51J99n21K66K88n23J75L60m92O5M44m38q6N18l76
2453g4j84N22k69k76N16j69l77N03n4m51M33Q2n05L53K02n17K46L06n06J36L78
2474B95m62J7M44m11q2M69l16j99N01k45k92M92j35l67M50k7m17L94P5m66L28
2495D6J60m62K63K28m52J66L03m42Q2L74m02k4M38l65j21M66k84k19M93k09l15
2516b76M68q0m13M42K9m62L60J54m89K64K53m81J54L40m33M8L80l82n1M26l13
2537f2j33M21k41k00M16j76k62M22j10l26M15l1l97L80N1m28L27J51m69K56K51
2558B55m77J56L44m61M6M21l96p0M52l26j65M59k30k66M52j40l18M05l2l72L57
$$ plain form
2411 59 289 -318 -27 341 -264 -110 345 -192 -183 335 -116 -247 323 -23 -273 282 36 -299 239 105 -312
2432 -312 187 166 -304 126 204 -304 47 246 -275 -9 279 -244 -69 291 -201 -136 308 -130 -216 302 -74
2453 -74 -258 264 -5 -281 235 66 -311 192 138 -313 120 202 -303 50 252 -265 -19 287 -219 -83 295
2474 295 -167 -150 294 -117 -199 270 -46 -245 256 11 -281 211 76 -291 159 132 -285 109 184 -282 46
2495 46 206 -256 7 235 -217 -51 252 -190 -108 266 -136 -160 278 -87 -208 258 -26 -245 248 39 -276
2516 -276 192 112 -301 141 170 -292 68 222 -267 -3 250 -231 -77 263 -170 -122 258 -124 -175 251 -62
2537 -62 -195 226 -15 -215 201 25 -237 185 75 -251 164 133 -264 116 167 -261 66 217 -252 4 255
2558 255 -222 -66 278 -183 -137 284 -112 -182 270 -56 -221 238 8 -258 194 54 -264 141 109 -263 94
2579I4N6l92K90J31m14K45K02m19J79K66m20J08L37m08J3M11l73r5M56l16j77
2600b26M74k28k90M85j28l62M39k9m27L86R5m65L06J75m48K21K62m53J45L30m31
2621a69N5L75l80k5M00l45r6M32k79j95M64k20k75M64j27l48M16Jm23L71R0m54
2643b68L03J93m71K22K92m65J02L70m41J5M27l86q7M49l09j74M52k18k52M51j44
2664F1l23M19n9l73M11J8m20L50J16m67L07K03m94K23K94m88J38L60m39K8M31
2685B96m03p9M56l14j93M81k19k93M61j22l56M33k2l96L79N8m33L20J54m49K35
2706fK38m54J63L22m58Q5L78m10k4M43l73j11M82l03k16N03k40k87M82j32l76
2727b94M55rm44L94R5m78L18K01m93K37K80m85J39L63m37K0L95l75o1M52l36j52
$$ plain form
2579 94 150 -242 48 179 -235 10 212 -207 -28 238 -182 -74 263 -145 -132 279 -94 -189 267 -49 -226
2600 -226 248 20 -270 215 87 -275 164 135 -292 94 189 -276 30 205 -243 -22 240 -213 -68 262 -169
2621 -169 -114 261 -119 -144 256 -89 -185 247 -32 -227 237 17 -258 206 79 -269 147 148 -275 96 186 -268
2643 -268 35 228 -243 -21 271 -194 -92 278 -163 -148 279 -107 -194 255 -54 -228 224 6 -246 205 61
2664 61 -262 157 98 -275 136 154 -266 84 200 -267 40 243 -251 -28 266 -222 -84 276 -163 -135 296
2685 296 -107 -186 270 -44 -237 244 25 -268 193 71 -285 148 126 -270 109 167 -266 54 208 -241 -6
2706 -6 232 -222 -59 263 -195 -110 268 -142 -166 277 -96 -207 275 -28 -244 259 19 -268 214 82 -294
2727 -294 161 152 -292 102 197 -281 37 238 -255 -18 262 -223 -84 279 -158 -138 257 -118 -179 273 -63 -215
2749b15M54k48k20M42j65l20M56q9l65M02J7m23L64J23m80K87K31m88K06K95m63
2770a99R0L89m30qM43l79j13M67k87k11M80k09k95M64j19l58M23j1m14L81P1m51
2792b76L22J63m63K46K51m55J46L30m30M0M02l94m3M25l26j47M53k45k35M55j57
2813F2l13M24n6l82L80M3m08L15J36m42K45K36m57J64L12m29N8L87m13k8M37l55
2835h4j26M51k58k13M51j67l12M40r7l51M01K2m23L41J13m15K49J95m28J84K65
2856B38m22J04L32l92J6L71l36p4M03k90j54M15k03k35M13j33l13M01k7l77L57
2877I4P5m25K91J87m56K06K81m36J00L31l81nL89l29q7M02k63j80M14j86k44L97
2899A75j05k89L50j9l43L18O7l75K86J12l87K15J96l77J29K67l78P9L15l55j1
$$ plain form
2749 -215 239 -9 -229 213 48 -272 184 95 -270 132 149 -274 90 213 -267 20 251 -237 -31 264 -199
2770 -199 -109 280 -150 -158 285 -94 -207 260 -27 -238 242 33 -262 202 83 -275 148 137 -277 104 175 -276
2792 -276 46 209 -254 -8 243 -212 -66 264 -166 -126 276 -118 -161 264 -62 -209 244 -1 -236 219 62
2813 62 -251 173 117 -265 115 158 -250 65 201 -241 4 240 -217 -53 259 -170 -112 275 -138 -166 271 -84
2835 -84 -210 241 -17 -230 221 54 -258 182 85 -266 135 157 -266 75 188 -227 22 217 -211 -27 238
2856 238 -184 -80 252 -140 -124 247 -89 -163 240 -50 -204 211 8 -227 186 53 -260 141 114 -263 94
2877 94 169 -256 35 222 -234 -28 253 -183 -83 248 -133 -138 251 -78 -165 237 -26 -206 208 22 -222 175
2899 175 70 -219 131 112 -231 87 154 -221 65 177 -210 5 201 -176 -47 220 -158 -79 236 -119 -130
2920a30L63l02j20M06k22k20M15j38k99L95l6l59L46N4l81K65J50l81J82K26l88
2941a74J13K86l41K6L11l04m9L31k50j11L41k06j61L55j28k40L37p1k79L14Nl28
2963b23L01P3l54K30J64l82J66K47l78Q2K97l36rL54k84j00L63k17j74L49j20
2984D9k50L38m9k93K94K8l15K52Q9l22J87J52l26J40K08l20N8K73l03lL08k74
3006g9n5L24k21j33L42j70j97L51j06k61L30k4k98K73O9l34K33J37l58J73J95
3027A91l28Q4K50k99J0K88k80n1L12k06j32L24j51j83L02q5k30K77j3k66K50M3
3049A07k77K10R7k93J50J67k97J11K04k99M2K58k61j4K75k30r1L25j99j60L30
3070A55j14k25L09n2k72K89K6l13K40J16l33J70J65l10J09K13k96M5K57k65k1
$$ plain form
2920 -130 233 -69 -189 217 -5 -225 190 52 -247 148 112 -247 99 153 -228 37 187 -194 -12 214 -174
2941 -174 -61 225 -116 -90 221 -83 -132 199 -51 -162 179 -27 -188 167 39 -201 136 65 -214 100 105 -223
2963 -223 78 151 -203 27 191 -191 -25 222 -156 -74 223 -113 -122 232 -52 -152 211 -6 -180 169 49
2984 49 -201 137 88 -205 89 117 -198 54 143 -179 8 160 -166 -26 182 -138 -80 193 -110 -113 195 -79
3006 -79 -134 190 -31 -164 178 8 -189 162 56 -205 125 101 -197 76 145 -189 44 181 -177 -4 191
3027 191 -137 -53 197 -102 -92 196 -84 -135 177 -29 -161 163 12 -171 131 46 -184 93 80 -186 64 107
3049 107 -170 40 137 -156 -6 161 -136 -25 179 -120 -78 180 -81 -95 180 -50 -141 184 -15 -175 155
3070 155 41 -184 125 73 -199 90 116 -197 43 159 -174 -4 161 -149 -40 173 -123 -78 179 -86 -107
3091a07K82k20p8K78j68j19K68j18j64K72o5k15K62k4k47K36M0k82K22R4l01J49
3113eJ64l01J00K25l01K6K81k63o8L27k18j43L21j30j94K97n7k40K65nk49K24
3135E6O2k70J75J10k74J40J38k57R3J81k55N0K04k27JK27k05m3K51j94q4K63j31
3158A1j71K82p5k28K75rk74K46O2k94J83J36k86J06K04k91N1K47k55k6K60k00
3180d6p9K72j61j19K61j08j58K47o6j94K43l4k05K11J4k29K08M7k58J75J10k68
3202a37J21J54k57P4K01k55QK59k35o5K94j88j23K83j11j84K65m5k24K47J2k43
3224a49J79R2k62J49J18k36Q2J64k27L7J93k06kK16j96l6K17j79o8K36j34j18
3246a30K59j13j65K40m4k04K49mk50K05P5k91J95J29k90J13J86k62M0K21k28k3
$$ plain form
3091 -107 175 -45 -123 155 -13 -132 136 18 -146 126 61 -154 108 84 -163 73 113 -169 53 147 -154 -5
3113 -5 159 -142 -42 183 -118 -92 189 -74 -142 185 -33 -176 145 15 -179 118 61 -179 86 81 -168 56
3135 56 118 -152 23 133 -141 -1 137 -120 -27 154 -101 -51 153 -74 -73 154 -51 -94 157 -37 -121 142 11
3158 11 -160 122 47 -181 94 85 -189 57 119 -175 8 144 -142 -36 168 -123 -72 175 -80 -106 154 -46
3180 -46 -125 147 -14 -133 128 20 -138 109 43 -151 92 58 -147 64 78 -151 57 104 -154 21 131 -137
3202 -137 -16 138 -119 -45 156 -99 -91 168 -67 -132 162 -26 -149 134 23 -161 104 59 -165 82 94 -149
3224 -149 30 122 -140 9 127 -109 -27 137 -90 -53 140 -66 -68 148 -48 -84 133 -46 -114 122 -12 -130
3246 -130 129 16 -149 91 47 -157 92 88 -162 43 118 -173 22 151 -139 -26 160 -102 -62 159 -69 -92
3268i2K45j84q2K48j36j24K36q0j64K24l7j83K07oj99J73M8k30J58Q6k29J18J24
3291A21k44R6J63k44M7K17k44oK58k02r7K81j48j50K74p6k05K63k8k30K15M1k40
3314a38J68R9k50J28J21k30Q0J58k01J4J71j69j2J98j83m2K13j49p7K17j17j15
3336a16K16p2j73K37l6k14K14M1k45J74J05k67J28J65k72O6K08k32kK34k05n6
3358a02K42j47j10K28r0j44K16n3j73J97kj78J71K0j95J47O5k08J25R3k14J08
3380dJ17k15O1J74k18J7K13k01m8K45j61j03K50j15j57K45m3k04K14K3k19J65
3402C6P9k35J26J20k35Q4J60k17L1J75j86oJ79j48m3J93j35o9K01j11j08J98p4
3425A5j39K04m0j70K11j5k02J73N3k21J32J25k42Q9J56k14L0K02k10k1K17j47
$$ plain form
3268 -92 153 -31 -113 135 -1 -125 111 31 -133 91 54 -129 78 72 -127 46 94 -136 22 108 -121 -3 121
3291 121 -123 -27 136 -108 -61 156 -88 -94 164 -38 -135 146 -2 -152 122 46 -159 104 76 -154 61 102 -138
3314 -138 30 129 -121 7 128 -102 -22 136 -65 -51 120 -49 -61 137 -46 -88 125 -24 -101 116 -1 -116
3336 -116 100 28 -145 92 56 -158 56 97 -148 26 131 -136 -8 157 -115 -49 159 -73 -75 159 -46 -102
3358 -102 140 -7 -117 111 21 -123 93 40 -133 64 62 -116 55 75 -120 27 92 -116 9 102 -112 -4
3380 -4 113 -102 -41 133 -85 -68 145 -56 -104 141 -20 -123 127 12 -145 100 57 -147 67 90 -129 36
3402 36 115 -120 6 126 -109 -25 135 -82 -51 124 -62 -68 111 -37 -80 113 -22 -91 110 -1 -109 89 15
3425 15 -124 80 40 -130 81 66 -136 37 90 -131 1 126 -116 -27 129 -85 -55 147 -63 -84 133 -14
3447a4r6K26j00j50K28n5j60J85pj80J59M6j83J20O6j89J01R0j83Q0J16j80M5
3470c5J43j70J0J72j62l1K03j54p2K29j23j33K28o7j63J97J9k24J76N9k16J18
3492DJ12k06P1J44j92K5J48j46k3J66j29m8J64r5q0J76q7q9J58n0j24J70l2j53
3516a16J76J0j69J18P5k03J18J01j99O3J56j97J3J82j79l6K10j39r2K14r3j09
3538i6J76l9j54J72Qj64J29L7j66J15N9j65Q6R1j71O4J13j75L9J33j44oJ64j33
3562b7l9J78j20q2J92q2j22K00m1j61J65J2j73J35O8k03J13J06k12P2J24j60J3
3585d4J56j46l7J60j20m9J67r1q2J59n8j11J56l1j29J55mj42J23L6j65J21O0j65
3609h1P3R8j52L8J36j62J0J42j30l1J64j04q2J68p0j01J55l7j35J53Kj58J33L7
$$ plain form
3447 -14 -110 116 16 -134 94 39 -121 64 57 -123 36 82 -101 19 85 -104 -3 87 -96 -16 100 -80 -35
3470 -35 108 -62 -52 120 -42 -73 130 -24 -96 133 10 -123 105 38 -125 72 91 -133 43 102 -114 4
3492 4 116 -90 -19 125 -67 -42 106 -40 -63 103 -26 -74 90 -5 -85 91 4 -85 73 23 -101 69 37 -116
3516 -116 60 70 -99 19 94 -109 9 110 -89 -26 130 -67 -54 128 -51 -87 123 -16 -108 106 13 -96
3538 -96 80 41 -113 59 67 -97 32 69 -97 18 77 -88 -2 89 -82 -18 95 -80 -41 92 -52 -58 106 -27
3562 -27 -66 112 -8 -90 102 20 -102 98 57 -104 61 73 -100 35 103 -100 13 119 -93 -21 103 -57 -44
3585 -44 112 -34 -71 89 -31 -80 87 -4 -86 73 15 -96 60 29 -100 55 51 -91 32 68 -97 24 84 -81
3609 -81 -8 90 -62 -24 112 -50 -40 102 -28 -59 105 1 -81 87 17 -84 71 34 -101 52 54 -104 29 66
3633F6j75J19O2j62P8J00j59L6J29j44%J44j22l7J56j13n0J53p9p9J53m8j14J41
3657E5qj38J31J9j55J15N9j57P4R6j73N8J15j52NJ54j47j2J55j21n3J69q9q9J63
3682G4n4j07J41rj42J35J9j42J09N5j59Q9P9j50N4J01j54K2J42j44%J26j09m3
3706f7J67j18o2J63p6j01J52k8j28J57j0j36J11M4j53Q9P1j56P0R7j48L2J18j42
3730e4QJ36j15k6J35r1o6J55p1q7J53n1j16J43j3j24J18J4j31J06M7j56R1Q2j69
3755h2N3J20j49RJ40j30k5J56j12m4J50q5q1J41m1j08J37k5j11J20J7j32J03L4
3779E5j19P9O1j47P1Q7j39L6R7j29J6J28j31j7J28r1n3J54p8r0J52n7j00J32Q
3804E3j46J26L3j53J02O3j56O7R0j43L0J16j26PJ28j25j0J37j11l6J30p3o4J36
$$ plain form
3633 66 -109 10 72 -90 -12 88 -71 -35 94 -50 -50 94 -28 -65 91 -22 -72 81 2 -77 76 28 -86 55
3657 55 47 -91 40 59 -96 19 78 -79 -5 91 -82 -24 91 -61 -56 98 -49 -61 94 -27 -80 89 0 -89 74
3682 74 20 -87 54 45 -97 38 57 -85 24 79 -80 9 88 -62 -8 93 -61 -39 103 -41 -41 85 -24 -67
3706 -67 100 -18 -80 83 7 -94 58 30 -98 59 49 -87 24 68 -85 4 75 -81 -11 86 -62 -30 88 -54
3730 -54 -46 90 -25 -51 84 -7 -73 82 11 -76 77 26 -90 53 40 -84 34 48 -83 23 70 -86 5 87 -82
3755 -82 -29 91 -58 -49 91 -39 -64 92 -20 -64 86 1 -80 61 20 -88 49 24 -87 33 50 -82 21 55
3779 55 -64 15 76 -71 0 87 -52 -16 81 -48 -32 96 -35 -52 76 -15 -68 86 8 -82 70 13 -87 45 53
3804 53 -93 33 66 -87 15 78 -78 -11 79 -64 -34 82 -44 -37 91 -34 -44 93 -18 -54 76 3 -61 75
3828G5n9r1J32k6j06J32j9j16J26J7j48J04M6j40P3Q6j62N2J13j43QJ28j14k6
3852e8J39q9o5J46m6j09J38k8r0R2J3j20J01K0j10P9M7j24P6O8j34M7Q2j23K4
3877b4J14j29kJ26j27k1J50j08m4J38p2r1J61l9j25J48jj53J16M4j40Q4O1j26
3901f0M0J17j42K8R5j20jJ20q8l5J18p4o0J22n0p7J24m2p7J07j3j00J09j2j10
3926h1R9K9j35J00O3j51O0R7j38L7J04j32JJ37j12m6J59q6q0J47n0r5J24j6j11
3951g6J08J6j22Q9L5j09O4O3j18M7O1j12M3Q0j09J1J00j10pJ15r1l6J28q0o2J38
3977F6n6q8J25j5j17J09K2j28Q9O8j45O1Q9j38L5R8j02j3J04p8l7J17q1m0J06
4002E1m9n5R1k7p0R7j0r0R2oq5P0J7r5P4M5j07N0O8j17L9Q5j07OR4q6l1J22p3
$$ plain form
3828 75 16 -75 57 31 -75 57 38 -78 48 65 -83 21 67 -73 0 86 -76 -24 89 -54 -46 82 -32 -58
3852 -58 81 -8 -73 73 27 -82 56 28 -62 30 43 -77 24 44 -66 13 60 -64 12 80 -54 -7 75 -48 -24
3877 -24 90 -39 -41 85 -42 -63 87 -21 -65 73 1 -90 71 32 -93 55 54 -99 17 61 -79 5 66 -60
3901 -60 -20 97 -45 -17 78 -42 -43 77 -11 -46 72 -2 -62 60 10 -67 57 15 -62 45 32 -68 41 29 -81
3926 -81 18 47 -88 12 75 -76 -16 81 -57 -20 84 -48 -47 90 -22 -68 91 5 -75 72 22 -73 51 35 -76
3951 -76 32 48 -74 15 50 -59 5 68 -50 -3 58 -54 -11 69 -40 -29 71 -39 -46 69 -22 -58 70 -10 -72 66
3977 66 10 -78 47 32 -85 24 46 -82 7 75 -70 -9 80 -58 -23 75 -27 -40 64 -14 -51 66 -15 -55 51
4002 51 2 -53 38 11 -59 38 28 -62 30 24 -61 9 26 -69 5 50 -57 -7 61 -56 -17 68 -39 -33 61 -25 -56 66 -7
4031go1J39n3q1J09j7q1R3lr7Q2L3r8M5N7j08M0O6j02K3P5r1J2P1p4oR2p3l3J04
4061E6n4o4J02k7p6R2pq5Q7J6j10R4J3q6N7N6j12L0P2q6J6R1r7j0R6p2l1R7n2
4090Fo6R3k0p0R4j2p8P1J9q5M6M8r0M1M5q8J6P8p8KQ6r0kQ2o6j6R0n8n1R2k7o1
4122d9R6k4p6Q8mq3P4J7r4N3M8r5K8P3r1RP9q1jP4o5k6R0m9m8Q3l0m5Q6k6o4O8
4154A5Np0N9K2q0M6M8r0L8O8q8J1P3q2jQ4o5k6Q3n3n8J16m4o8R3j6p0P5jp8O7
4185A3K4q6M9L5q8M8N3q9L1N1p4JP6n5k5Q7n4k9Q0m4m2P2%q5Q1ko7O2J7q6N8L3
4217D5q2K5N5p9J5P1q1J2O8q0mP7o5k2Q1l9n7Q9k7p0Q6J2q7P5J0p1N0M2q4K8N5
4248D8p7J2O1o8PO5o9qO9o1pP6n4l6Q4l2o2Q6j9o8Q6oq1O9K0q7N7M3j05M6P1j04
$$ plain form
4031 -7 -68 71 18 -63 46 29 -52 41 38 -59 23 56 -42 3 60 -48 -8 58 -44 -21 54 -37 -25 46 -28 -34 58 -15 -48 56
4061 56 2 -62 40 13 -63 29 22 -63 24 40 -70 24 37 -49 8 64 -48 -18 54 -32 -16 75 -22 -32 64 -8 -39 58 6
4090 6 -60 33 13 -57 37 25 -53 18 37 -48 -2 46 -44 -3 42 -46 -30 48 -30 -28 58 -32 -34 48 -18 -34 56 -2 -53 39 12 -49
4122 -49 47 23 -53 35 31 -52 22 39 -55 -2 46 -49 -21 52 -39 -30 49 -32 -33 41 -24 -50 40 -9 -57 26 -4 -49 37 11 -53 15
4154 15 20 -50 9 31 -49 -3 45 -45 -7 61 -27 -16 57 -25 -26 58 -7 -33 50 -3 -61 55 11 -57 36 20 -50 25 24 -54 13
4185 13 37 -49 0 35 -53 -5 48 -41 -10 41 -33 -32 44 -11 -36 51 -3 -32 48 4 -38 34 34 -51 30 28 -39 23 40 -46 12 45
4217 45 -37 -12 43 -36 -21 50 -31 -19 49 -31 -35 42 -23 -45 36 -3 -60 29 2 -68 18 30 -57 18 28 -43 7 49 -35 -7 48
4248 48 -29 -17 44 -24 -17 48 -21 -29 40 -21 -28 48 -6 -42 42 10 -52 34 15 -53 33 27 -54 15 35 -52 5 48 -57 -11 60 -44
4280d4K4P0q1mR5p4k6R2n6m3R2l0o3Q6rr0R1mp2P6Ko8M5L3p7L0M8p9K3O0q3J9
4312a7N9o4j0P0o1j8Q8o1j9R0m7n7Q2j0p5P7Qr5Q5J9r4O2L9q8L5N6p6OO6n9j2
4343b1O7o5j9P7n0k7Q3m6l6O9k9m9P6j5o5O5Mo8N7J9r0O5M2r7M4O1r7L0P0p9k
4374b6Q3o5l3J02n9m5R0l1n3O8kq4P0J5o9N6J8p1M6K1p3L7K8p4L4N4p1J4N3o0
4404b7JP0n8k2Q3m9l9Q7l7n5R1l0n7P0Pp5O5J2p3L9M6p8J7N1o9QO0n3oN9m9j4
4436b5N8m1l1P1l8l6P0k4m0N4j3n2P5%p1N9J5p4M8L1p8M2M5p6J5O6o7j3P8o4k3
4467c9Q9n3l5P0k3m6N3Jn3N2j3m3M0Rn1L7K4m9K6L3o4K5L8n8K1M2n6mO2n7oP0
4499D2n7j1O0j9n4O6nn8O5Nq3N4M1q1M4L3p2J7N3o3KN0m5j1N5m5jM0l7j3M1k0
$$ plain form
4280 -44 -20 50 -31 -35 60 -14 -40 52 -4 -47 45 15 -48 38 29 -61 30 26 -46 30 32 -36 9 42 -35 -5 43 -36 -13 47 -36 -17
4312 -17 42 -22 -32 38 -23 -41 47 -14 -33 57 10 -47 35 25 -50 27 35 -60 25 44 -50 12 51 -37 -2 54 -22 -16 50 -9 -21
4343 -21 46 -19 -38 39 -11 -38 45 -1 -37 32 3 -46 30 15 -50 15 19 -49 8 27 -63 2 44 -53 -9 52 -45 -15 55 -24 -26
4374 -26 57 -8 -41 61 2 -43 47 16 -37 31 29 -55 15 30 -39 17 35 -36 10 31 -42 -5 23 -51 -17 37 -34 -20 33 -27
4404 -27 -26 44 -14 -36 47 -2 -41 46 9 -46 45 15 -42 28 35 -40 25 37 -36 3 49 -29 -12 39 -30 -22 38 -15 -21 38 -11 -25
4436 -25 33 -8 -39 32 -6 -42 28 4 -36 18 5 -47 28 28 -43 16 31 -43 5 36 -42 0 45 -31 -16 50 -17 -30 48 -16 -39
4467 -39 50 -3 -38 32 9 -37 16 17 -36 16 3 -40 0 9 -42 -5 19 -30 -4 29 -35 -10 28 -30 -9 33 -23 -27 35 -22 -28 42
4499 42 -15 -26 34 15 -39 27 22 -36 29 34 -49 5 46 -35 9 42 -30 -13 40 -23 -21 29 -16 -27 28 -17 -18 22 -15 -28 13 -7
4531gk4N7k6l7P3j8m8N8Mp2M7K2n4K7L4o9K1N2n4lO2o1rP1m9j9N7l6l5N1mm8N4
4564A7km9L5Om1K2L3n3L0K8n0J6L9n7RM4m1%N1m9mO1m9k4O1k0m3M8rm2N3kn1M3
4598A0On0L3K7m7J1M1n2J1L9m6%M7m2j5N3k9j6L7j7l7O0j5l5L7Rm7M6Km4L1J3
4630B1m6K6L9n7MM0m2OM8m6jM3l8k5O2l2m0O1j2m6M5J2n3K7J2l1K8J8m7K6J8k9
4662iqM5m3ML4l3pN4l9k4N2j7l0N2j8l3M1om2M7On0L5K2n4J9L2m7NM8o2QM6m9
4696b1%M9l5j8N5l1l5N5j9k9L9J1m9N1rl6L4J1m2K0K9m9K4L2n0KM2m3j0M7l1j4
4728b0M6k5k4L8rm2N1rm3M9Jm7L5Rn2M0L5p9L8M4n5RM6m3j4N8m3j1N2k2l3M6k6
4761@k0M8qm7M7j1l2L4J0n2M8Jn2L3L1n8K0M4o4J8M1m5oM4m4mM9k9k8N4j0m9N4
$$ plain form
4531 -7 -31 26 0 -37 36 18 -30 28 32 -40 7 29 -25 2 36 -33 -12 40 -14 -17 45 -16 -25 46 -3 -22 35 -1 -36 15 11 -37 17
4564 17 15 -34 1 7 -34 -12 21 -32 -2 26 -24 -8 31 -26 -17 27 -14 -14 37 -12 -16 45 -4 -28 33 13 -30 18 9 -33 20 18 -33 10
4598 10 16 -34 -1 26 -21 -10 31 -21 -10 29 -17 -17 30 -12 -27 26 -3 -19 18 1 -36 24 9 -26 11 20 -27 19 21 -23 8 21
4630 21 -25 1 40 -17 -13 27 -15 -9 39 -7 -8 35 -3 -28 34 2 -38 23 11 -35 10 22 -31 -4 8 -23 5 23 -24 2 20 -9
4662 -9 -17 28 -15 -11 23 -10 -17 37 -2 -26 26 9 -21 31 13 -20 21 15 -27 20 26 -24 11 33 -21 -2 30 -17 -12 36 -26 -18 28 -21
4696 -21 -21 28 -7 -25 30 -1 -36 19 0 -29 10 21 -28 23 14 -22 12 23 -19 1 30 -19 5 37 -13 -11 31 -12 -22 25 -6 -20
4728 -20 26 1 -23 15 6 -36 15 6 -37 12 13 -34 1 10 -42 -2 33 -46 -8 36 -19 -10 36 -7 -21 37 -6 -17 35 13 -20 26 0
4761 0 -20 28 20 -27 20 9 -23 11 21 -31 17 18 -34 -1 30 -28 -8 36 -28 -10 31 -14 -20 24 -20 -24 25 -4 -32 22 12 -37 17
4794A7%n1N1Lm2K7K4m5K2L5o1J6L0m2J6L3l9qN2m1j7M8l0j3M2j9l7M9j5l7M7j0
4826Ek8L3J0n0K7K8n5K5M0n3J1M6n4KN9m6j2M3k8k7N4j4l9M9j9l2M0Om4L9ol6
4858b6L1J5l8J7K4n2K6K7m8J4M8n5J2M5m7j6P0m2l0O3l4k9M9k0k5M1Rn2M8nm7
4889b7L7K4n4K2L6m9KL7l8PK3k0j4L7l2j6M7l1k1M2j7j9L4Jl9L0J7m9M7Mm6K7
4921BL1m4J1L1m5J1M5m4qM9l3j9N7k9l0M0j6k0K5kl1L3%l7K6Pk6J4J5l8J9K3l9
4954b2J8K4m0J3L0l4ML2k6j9M8k5l1N2j1m2N3Rn4M1J4n8M2Mm8K4K1l0JK6k3j3
4986b0L5j5j2K5k2k3N2k8j0M0k1k0K4jk7M7ql6M1ok7L3Km0K9J6m3K4K6l1kJ8k1
5019aj1L8k0k4L5qk3L2j2k0L3j5k0J7J0k3J5Lk3J5Qk0PJ8k3jK6l0QL5l3lK8k6
$$ plain form
4794 17 17 -34 17 20 -22 5 29 -16 6 41 -20 -4 26 -16 0 33 -6 -14 38 -3 -20 28 -2 -15 27 8 -29 20 5 -32 15 5
4826 5 -23 10 20 -30 -3 25 -30 -5 35 -18 -7 39 -15 -13 46 0 -12 31 3 -24 30 16 -23 26 7 -25 15 21 -23 16 10 -26
4858 -26 5 20 -18 -1 23 -29 -3 24 -24 -10 38 -17 -5 40 -7 -23 47 5 -25 38 4 -25 24 4 -21 20 29 -23 25 20 -27
4889 -27 10 34 -20 2 38 -11 -9 28 -10 -3 20 0 -14 23 -9 -25 22 -9 -30 12 -5 -24 10 11 -28 2 19 -30 17 21 -25 2
4921 2 33 -11 0 31 -14 -3 42 -2 -10 39 6 -13 44 15 -15 25 9 -11 14 12 -19 14 14 -23 3 10 -16 -2 13 -25 -6 17 -22
4954 -22 -4 20 -20 -7 23 -11 -7 25 -1 -20 28 3 -28 24 13 -29 24 33 -21 20 34 -24 18 22 -26 -2 19 -11 -10 16 -7 -20
4986 -20 15 0 -12 13 -9 -32 20 -8 -18 22 1 -19 5 4 -23 24 16 -20 21 15 -12 21 23 -17 12 28 -15 9 35 4 2 20 -1
5019 -1 -12 26 6 -18 17 9 -14 18 6 -14 19 4 -16 1 11 -12 3 6 -17 -2 6 -14 -7 11 -12 -13 13 -17 -9 26 -7 -10 18 -8
5053hj5M0rl1M4nl1K9Ml3K7lk4J5J9l1J1J4j9%J7k6OJ8j7JJ9qk0K0lrJ5lj6K2
5089A0oj5K7lj5J1J1k5K2Ol7J8J7k6JJ8k1lL7k0k5K2Lk8K8jk9K4Rk3J2Pj7nRj2
5125a9PJ4lJJ5k3J0Qk4K6Rl3NL7k2j0K6j9j8L0qk6L3lk5K6J3m7J8K4m1J4K8l5
5159a2%K5k7lK0pj1J5kj3J6qJ0Njk2L3pj8K3lk9K6J0k9J0K6l5K5Nl1J5K1k7rL1
5195B2k6j5L1kl4L4nk4J0J2j6J4Pj9MJ8k1%K4j8jK2k0ROj7jK2j4j1K8j3j0J9L
5230A8k7J8Pl5M3j4j9K5Ol2J3J7l0kK9k3lL0k8j1K7ol1L6rj5L1mk2K6j0j2J4R
5264A6k1K3lk0K4jj6J1J3l4RL2l7KK5l2kK4j1j9K8j9oK1Km4N0j6j1K0pj0PJ1k0
5299a1KL0k7PJ9k6%K7k0j0L0j8rK5j2rJ8qj1K1j3j3J9ol1K4J2k6PJ9k9J0Nj6N
$$ plain form
5053 -8 -23 17 8 -23 21 16 -15 14 18 -15 12 9 -15 0 19 -12 -1 13 -6 -6 11 -15 -9 9 -8 -7 12 4 -16 4 1 -8 7 4 -12 10
5089 10 4 -11 16 13 -2 9 20 -5 17 23 -14 4 21 -5 -4 14 -7 -10 27 7 -18 4 7 -21 7 6 -23 1 10 -13 -1 6 -11 -16 -7 -19
5125 -19 -12 2 -1 0 15 -8 2 10 -14 12 21 -12 -7 30 8 -2 24 5 -13 17 9 -17 16 13 -12 14 27 -20 -2 22 -19 -5 23 -12
5159 -12 -12 13 -14 -17 3 -4 -15 0 -2 -15 1 -7 3 8 7 -15 18 11 -7 16 13 -16 10 20 -9 1 27 -8 17 22 -9 6 27 0 -9 22
5195 22 -4 -19 12 10 -24 10 5 -19 -9 3 -13 1 8 -11 -7 11 -10 -10 14 -4 -5 17 -3 6 12 -5 -6 16 2 -9 19 6 -4 15 18
5230 18 -9 9 16 -19 24 10 -9 16 22 -10 3 20 -10 -12 17 -6 -9 21 -7 -18 9 3 -28 8 -1 -16 15 11 -11 15 5 -7 7 16
5264 16 -5 18 15 -5 19 18 2 13 26 -8 1 33 -4 -2 23 -9 -11 13 2 -17 11 -8 -14 7 9 -35 15 -1 -12 8 1 -9 -2 9 -11
5299 -11 -9 21 -6 1 20 -6 -6 21 1 -9 21 3 -6 19 7 -2 16 8 -3 18 5 -8 11 5 -26 -2 10 -16 -9 10 -19 -9 -4 -20 -15
5334a5J9j7mK1k1lL9j1l3L5jj9K4mk4K3KrlJ5k2J6Rk0NJ2k0NK4k6J0Pk1kK4j5
5370@j2L1l0qJ9Rl2L4J0l1K1nj5J4Pk4J1Rj6NJ4j9J7%j5JK1oqK0j6oK3k7nL2j6
5407GnRnk0K1mk0J3J3k0Q%k2J7L1l2%K0k2jJ7Jj0K1j5j6K4Mk0QMj3J8Kk1J8Jj7
5445fLRrPkp%KoJ0Jj6JK3kj4J6j5NJ1j1j4K1prJ4Ok2K1Mk1J7Lj1KJ7rj3J9k0R
5486GljjOpLMj1oJ6rj0ROj4J2%j7K1j1%%Rj0KRkj3K7j0rJ6j8RPKqQOj1mNj0Ro
5531BJ1kOpj4J2j7PKmlOnPkrKJ7j0qJ3lrK5j8oPQqJ2Nj7jKkJJ3j1MMnqJ4rj5J2
5577alpJ1k%RppJ2rj1RllJ5Lj4PMmJOJj3PnPJ2j7NJ3j0lJ8lk9K7oj5J1%j2K3o
5621A1j4jJ2nj0J3k2RJ2j3lJ2opJ1pMK5k0kNoM%qQMJ2k3J1n%PjoJMoPloqPRj4
$$ plain form
5334 -15 4 -13 -17 4 -17 -20 19 8 -25 10 9 -10 14 10 -14 9 11 2 -1 14 -8 8 17 -3 2 14 -6 -1 23 -3 7 14 -7 -9 15 0
5370 0 -12 19 -11 -19 0 9 -23 11 21 -10 11 6 -9 5 12 -12 -1 8 -8 -3 11 -8 9 9 -6 -5 16 10 2 22 6 0 23 -4 -9 23 7
5407 7 2 11 6 -14 7 3 -17 -4 9 -11 -3 -3 -25 -8 23 -9 -9 11 -11 -12 5 6 -4 17 2 -14 10 14 -6 2 6 -7 11 13 -8 10 11 -6
5445 -6 -3 6 -3 4 2 -5 -5 -3 -9 1 2 -14 -13 10 8 -6 10 -5 0 11 0 -14 7 0 -9 5 11 -11 10 14 -7 10 13 2 4 21 12 -1 18 -2 7
5486 7 4 3 2 8 1 4 8 -3 -9 7 -2 -12 -3 3 -11 1 1 -16 5 -6 -6 -6 3 -7 -5 4 2 -11 16 6 -3 13 -5 4 11 13 5 13 19 8 4 9 -1 8 2
5531 2 13 11 17 10 -4 8 -9 -2 0 -4 -7 -1 -6 1 -1 -10 -8 9 -1 -9 4 1 -8 17 -1 -7 0 8 0 12 17 0 -1 1 -1 0 13 2 6 10 5 -3 11 2 -13 -1
5577 -1 -4 -11 0 -2 -2 7 0 -7 5 -4 -15 -6 -9 -12 3 6 -8 -1 3 -1 0 6 7 -6 1 -4 3 15 -2 3 16 6 3 21 18 -11 16 10 -5 6 6 -6 17 11
5621 11 -3 -4 8 3 -7 6 -16 -7 5 -8 -11 1 -5 -12 -1 -8 -4 21 1 -1 4 -2 2 2 -6 2 6 18 -5 6 1 1 8 7 1 2 6 0 7 4 -2 -10 -3 6 -8
5666hJ1Pj4%n%J2Kj3NjnMJkPkQqJ3pjnoK4mopQmlJ3j4JPpnMKj3OLj6J8J1j5kP
5714Aj1mJ6llLjLMmkRj1PlJRpmjJ2lnPklKQk0RLj3jPoKJ%rJ9j0j0KJ3j6J6kpM
5763cmLJ0knjJ0n%OoKOj1J0Rk2J2Lj%Nj7OnMpMpoJ7nj2J2qkLKnkJ5oMklORrMj
5813ENrPKjpRj5J6joJ0j4JkOqNLomOpPmnMkllJ3j0kJ0nM%NnMlK%joJ5Kj5PPj0
5864AORj1LMqJMkqJ1j4J2Jj6pK1kj6J1knLQj2QlkLNrJ3Lj0J2Kj5jJ2lkNj7J0l
5909@kMJnNPonMn%JKnPnqJ3Lk5J9J2j4MLj5POlP%mOJ1j3nJ3lj0O%kMjKrPj2mJ1
5959Dj1MJRj4MjpJ1nmJ2pJKlOJKj5J3j2J1%PrMl%J4kj0Rj0lKRk6K8mj3J4j1Pj4
6004iOqOnKMJjOoJ%MQjoLlqNRoOkjPlkOkmJ1k1PJOqnQj1PmjlJ5j8LNmMJ5j4%J1
$$ plain form
5666 -8 3 10 -4 -4 -9 -9 3 5 -8 -3 -4 -9 -5 -4 -6 1 -1 7 -1 12 5 4 -1 -7 17 13 7 0 8 4 1 14 0 1 8 1 -4 0 2 -11 -5 -2 -18 0 11 -4 -6 1
5714 1 -10 -14 2 -1 -4 -1 -2 1 5 1 -1 8 -3 4 1 2 11 4 0 -1 11 8 3 10 8 5 7 15 -5 4 7 -6 -7 0 -6 -4 -3 -3 -12 7 -3 -13 -11 2 -14 2 0 -7 -3
5763 -3 -7 -4 6 4 -1 -2 8 3 3 9 3 5 11 0 10 19 -3 9 12 11 11 16 -1 5 0 4 -3 1 -6 -12 5 0 -12 0 -8 -10 -7 -5 -10 -12 3 -3 1 -1 -4 2 11 2 6 5
5813 5 10 1 8 10 9 2 11 -4 12 11 5 15 1 2 0 6 -2 3 6 0 -4 2 -5 2 -2 -7 -3 -5 -8 -11 2 -8 -10 0 -5 -1 -1 4 -1 3 0 2 2 1 -5 10 12 -3 4 11 1
5864 1 7 16 5 8 12 4 5 9 7 -1 10 -4 8 9 -7 -14 7 5 -11 0 -2 -7 -4 4 -8 0 -3 -5 -2 3 -6 7 10 0 12 14 -1 -2 10 7 5 10 -7 3 0
5909 0 -2 2 3 -2 3 10 4 -1 3 -2 -2 -1 1 -4 3 -2 -10 3 6 -19 0 12 -2 2 5 -10 -3 3 0 7 7 3 9 20 7 2 15 12 2 8 8 6 10 9 11 2 9 -3 -7 4
5959 4 -7 -3 -2 7 -7 -3 -4 -11 0 -5 -9 3 -4 -3 -1 -4 2 3 5 -10 3 -9 2 2 9 0 4 1 1 15 13 3 12 2 -1 1 10 -16 12 8 -5 9 -2 5 -9
6004 -9 -3 -11 -5 -10 -8 -4 -3 -4 2 -4 -3 -3 1 9 8 2 5 2 -6 -1 8 2 8 6 5 12 9 7 13 11 7 18 -3 4 5 11 3 -2 6 -5 2 -2 -3 -6 9 -9 -6 -1 -5 -1 14 0 0 11
6058A1j1PLq%LrNmPnJ6j4Q%Qk0J3onPOpqJ7j1kQj1KpP%J2j7KOokJ2j0NmJ0rOJ
6105FpQj2QjOpJ4pqjJ8k1QOj0%Op%J0mmOPj8kJ0j1J0Jj4KQmOLj5J9%kj1RmlRo
6152AmJ2nmJ4pjjMrRKlmNj3PjNo%%oJ4k3J5Qj7oJ6nKmPoLJlJ0Lj0J2j2%LMJlQ
6201A3loJ1j2qJ9j0jMnj1K0MrKjj3JOj1OLmLjj1J4PqNJk%J5momPkkkj0K5j6MR
6247A7njrNkQNk2J1J0k2QnpQkOj1J6lj3PjMKj1j0K4Mj1PJpRNpmJ0r%KkoJ1pKO
6294A1j1j3K3j4LNpjPKk0J6pnJ0MpJJ4k2J0QoMMrJJ7orMoRl%%J6pj0K1j1j1Oj
6338A0j1J5lk2J1Lj2oJ3pOQmnnKJQlLJ0jj3NMpPQj3MJ1nNKk7J1JmJ0nmROj8oJ9
6384A1k2LJ8j3oKPj2PLnLllJ2JJqJ0mnJ7j4LJ2k0OQljRk0NJ5jpQj1%MnqJ1%jj0
$$ plain form
6058 11 0 7 10 2 2 5 -4 1 -3 4 -1 15 1 9 9 17 -3 10 4 -1 6 12 5 -3 14 3 1 9 -2 0 -7 0 0 12 -5 -3 3 -3 -5 7 -3 2 -2 8 -1 5 6
6105 6 -1 7 -5 3 2 8 1 15 8 0 -1 17 -4 4 10 0 0 6 -1 -1 9 5 1 7 14 -4 -6 4 -7 3 4 -10 -8 0 -4 2 5 -10 9 9 7 -4 5 1 -2 7 1
6152 1 -3 9 4 0 14 7 6 5 9 0 9 11 8 4 9 -4 3 2 7 1 1 1 -5 9 -14 1 9 -8 -14 2 -3 -1 -5 2 -4 -1 0 -3 7 10 0 12 0 0 3 7 8 5 13
6201 13 10 4 15 3 -5 14 4 3 7 2 -9 11 15 6 8 7 -6 -5 1 -10 -4 -1 -5 -2 -3 -14 0 7 -1 4 5 3 3 18 14 8 4 11 9 7 5 -5 20 4 8 17
6247 17 12 11 2 7 5 13 18 -4 7 17 -5 3 -2 -9 -1 -3 3 -8 8 5 -8 -1 -2 2 4 -7 -17 7 11 0 7 8 1 10 15 8 4 14 5 5 7 5 -1 10 3 5 11
6294 11 0 -13 10 -4 -1 4 -3 -4 3 5 -15 1 -6 -11 -1 3 -4 -3 11 -11 -1 7 1 5 9 0 1 18 12 3 7 1 10 7 7 7 23 16 6 27 16 5 11 10
6338 10 -1 14 11 -11 0 3 -9 -15 -2 -9 -3 5 1 -4 -9 -7 -6 2 -1 2 12 11 -2 3 7 0 7 15 2 6 17 12 17 19 -8 3 4 0 10 5 1 10 16 -2 -8 11
6384 11 -11 -8 10 -3 -9 -7 0 -12 -5 -2 -7 -4 -7 -10 2 3 4 -4 6 2 -3 14 0 3 15 -5 1 9 6 5 14 -6 -1 14 13 6 14 3 3 7 2 -6 5 5 4 -6
6430fJLMopR%j2OJ4j5nK4j2oJ7j6J0kknJ4lJ0j2l%RRj7J1qj8J3Pj1J0J2j3j2K0
6471A2k1jJ1poP%Nkp%J2%j1J0Pj6J2Qj4MOKlJ4j4mQj8J7plMLkjLmj1J7j0mJ0r
6515cJKJj1oJ4j5J3JKjjl%PKoJ7j3KK2j6j3J1Lj6QJ3k5J9Nj9RKj4J3Jj5LNmJJ0
6558Fj2OjnKLqRoMrJ9nj0JQj2J2Jk%KNnJ3j6KQoQJr%Kj2QJ2j5LjKj8J7j0j3J9
6604b%j3PMOpQj8NJ5j1J5JkKLolOnQNj4mJ2j1QOj0pkJ5j1NjjlPj4lJ3j0OmJOL
6651Ej6jQKLmJoJ2Oj5J4Kj4K0kj6jJ5k2J6Oj4pJ3j1kPNrJ0Jj7J0rjQOj5J9j3n
6693a1Nj3ONMkJ3%j8J7J1j7%QJj1J8j6MJ5j1j0J0mkJlKJQj2J1j4nJ3pkkk%lMn
6736a3kK2j2j1J5MqJ1Jj4J7lj1J2koJ4j2kONopJ4mj3J4kpMj0J%%KqRqNJ%NNj3
$$ plain form
6430 -6 -5 -2 2 -4 -11 -2 -2 -14 -8 6 -9 -14 10 -2 -8 9 -7 3 1 -1 -6 8 5 15 3 0 0 9 18 1 12 4 -14 -1 6 -5 5 17 4 -8 12
6471 12 -9 -10 1 -6 -12 -5 -5 0 -2 -9 -9 3 3 -8 2 9 -7 5 13 -1 3 9 11 8 22 8 4 12 -6 11 4 1 5 8 6 5 8 4 -7 10 0 -4 6 -3
6515 -3 -2 0 1 -10 -16 -2 -17 -4 -3 -1 -2 -3 -6 -6 1 3 -3 14 1 3 25 9 -4 7 10 -6 2 15 -10 9 14 -5 4 6 -8 5 6 -9 -6 -1 -5 -4 6
6558 6 -6 0 -1 -6 -4 -1 -9 0 -6 -2 -11 8 3 -7 -6 2 -10 2 3 1 1 3 8 3 16 0 2 10 4 12 13 4 4 6 -6 2 14 -1 2 1 3 -15 2 -8 -21 -2
6604 -2 -2 -15 -8 -4 2 -5 3 -15 -10 5 -6 9 10 8 10 13 7 4 10 5 13 18 4 0 12 1 9 15 5 -2 -4 11 0 5 4 3 0 7 -7 -10 3 -7 -1 -5 -4 2 5
6651 5 -11 -12 -4 -2 1 -3 -2 -8 4 10 -5 9 11 -3 17 15 -1 -2 13 -9 7 13 -1 -8 5 -6 -8 -1 4 -5 5 6 -11 -1 -10 -11 -3 3 -12 7 -6 -11
6693 -11 -6 -19 -13 -8 -4 -6 7 7 -11 6 17 0 0 8 9 -2 16 0 4 19 8 -2 8 4 2 3 0 2 3 11 -1 10 -4 -9 4 -3 -5 -7 -9 -9 -12 -8 -13
6736 -13 -15 7 -5 -16 -1 3 -5 6 7 -7 10 7 -4 8 6 0 14 2 0 6 11 5 -2 12 8 -5 9 7 0 4 -6 -5 -5 -5 -3 -11 -2 -10 -5 -4 -4 1 6 -7
6780gJ1J1j9NJ0j4OJ2lj6J6pKK2k9oK5j2oJ7j1j3K2qj7K0jk2QJ8k6PjmoJ2rPP
6819Aj2pJ6jkOnNJloJ2nnNjkPRj5PMmoPj6MJ6j8J1J3k0oJ7oj5J5oj2J4oMRoj3
6864a5J1Qj8J3%qJ1Nj0J3oj6J3QrjJ4j2PLJj1J%j5K9j4j1J7mj4J1%j7J2Lj9K1
6902A%j3JOoKMkmJ7j6MLMlJ2j4KJ7lokMkJ5rj7P%rJJ4j2mJ3j5LJ0j4nJ8jj5K1
6946GmrMOk4J3J1nJjPlJ3j3lJ4rj1K9l0J0Pj2RJ1j6lJ6j6oLQpPQk4J1J4k5J6o
6987bmlK0j9OJ2j2OnLmJ5Lj8J5j1nJ2%j4J0%%J6j3j2J5mlPmj7J7rjO%r%JjmK3
7030A3j8mJ2kj4J7Jj7J4MoJ1Oj8J4jrlJ9j2LllnKJoJ8lrLrnJ6lk3J6ojRrnJ2m
7074goMJ1omOj3KJ9koJ2Lj4J0Jj1J6lj1RJj3J9j5MkRpp%mj0J4j0RJ4j7rJ6pj1
$$ plain form
6780 -7 4 15 -4 1 11 -3 3 15 12 -4 12 5 7 29 0 -6 19 7 1 18 7 -6 16 8 -9 11 10 -12 -4 14 -12 -5 -6 -10 -16 -4 -13 -6 1
6819 1 -11 -18 -2 -3 -5 1 -4 1 2 -1 -7 5 0 -5 0 -1 -3 4 13 -2 5 9 5 -1 6 -10 -6 10 -8 3 16 -4 -10 7 1 -14 1 -5 -17 -3 -9 -5 4 -2 -15
6864 -15 -4 4 -14 -1 -1 -9 2 7 -3 10 4 -12 1 9 0 -1 13 1 8 11 12 1 2 2 -13 16 2 -9 8 4 -10 1 1 -16 -4 -1 -20 1
6902 1 1 -12 -11 -5 -11 -9 -5 -7 -11 6 -10 -6 -3 1 -2 10 -4 -2 15 12 6 4 8 6 21 12 -5 2 2 -7 -6 8 -4 -8 5 -10 -7 3 -11 -16 2 1 -14 7
6946 7 3 -6 -2 4 -20 -7 4 -1 0 -1 6 3 16 3 0 14 5 -6 23 -7 3 10 -2 7 18 2 -1 15 -1 -7 -4 4 -3 4 12 -12 -1 13 -12 4 -2
6987 -2 -6 -9 11 -8 -2 10 -2 4 -1 2 -2 13 16 -2 13 2 -3 9 9 -5 5 5 5 21 8 -4 11 7 4 11 7 -10 7 -2 -3 3 3 -6 -6 -5 -6 -10 13
7030 13 -5 -9 3 1 -13 4 5 -12 2 6 0 11 17 -1 13 12 3 0 19 7 10 7 4 -1 1 2 -4 14 11 2 5 -4 -9 7 4 -19 -3 -9 -10 -1 -10 -15 -3 -7
7074 -7 -13 -9 2 -4 -8 -2 -15 -13 6 4 -2 10 13 -1 9 10 -1 15 12 1 10 11 -2 17 2 6 4 13 6 -1 -1 -5 -15 -1 -11 -2 12 -5 -14 2 -5 -16
7116a6J2J%oRj3J0Rk8K9%j8J8jlmJ0joJ0j5J6Mj5mOnjK2k5J2j1Nj0J6k2PmJNN
7157aPj9JQj0J1JqkJ4kmRjmPo%RlqJ0jLrJ1j1KQj2%Oj8NK%oJ0oj2J2n%J0j3%Q
7204gJJMLj0J5jpQLj4J0%pNNj3OK1j8J0j4Mj2J5qJQrkQj1jKMojj0OJ3qlNOk4K1
7250ajqQRmkJ5j1mLQj2OQj0Mjj3J3Ok2J5JrpJ5j2nJ1njJ4k7J3K8l7jK0j3oJ6j0
7292iKJ1Lk3K1Pj6QPk0J9mj9J4Rj7NJ5k5J0J0r%J0j8nJ7j1pK4j1nMnj2J2J0j4
7330a2RJ0j9K0j0KkRj6PRkKRj9PJ2j6J3mjpJ4pj1J5Jk4J2Qk2J5J2k5MJ2j0j0R
7369fnjK0j8J0Jj2nJ8Lj1PMj2K2j4JOolK0qNk4J3rPJ2k6K0Jj6pK4j3nJ3j2nPN
7410Aj8NJ0j2MJ1k2J5KqJ5Lj2J0MnljLnK5rj2Prj1K7qj3J2Mj7J8lj7J8kj3Qkj5
$$ plain form
7116 -16 -4 -3 -3 -9 0 -13 -3 6 -22 7 7 -11 7 6 3 -1 9 8 2 12 -3 13 17 2 -2 4 -1 -2 20 -5 7 -4 1 -9 7 -15 -8 -12 -11 -6 -1
7157 -1 6 -13 -12 -4 -14 -3 -2 -10 -12 2 0 -4 5 4 0 7 1 1 10 7 -1 9 8 11 2 13 2 4 12 0 0 6 -12 -7 -5 -5 -11 -1 -7 -19 -7 -12 -12 -2 -15 -15 -7
7204 -7 -6 -5 -1 2 -8 7 6 -1 7 10 -4 6 6 -1 4 9 -4 2 23 5 15 1 5 -7 8 0 1 9 0 -2 6 -5 -6 -4 0 -6 -7 -17 -11 2 -6 -9 -4 2 -22 -1
7250 -1 -2 -10 -2 7 3 1 16 5 1 4 12 0 6 14 4 8 7 -6 7 13 -9 6 7 -2 -9 6 -6 -11 0 -5 -6 8 -19 -6 22 -15 -16 4 -9 -15 1 -9
7292 -9 -7 4 7 -16 5 12 -4 4 11 -9 10 6 -13 1 10 -7 -2 13 -12 -2 8 -1 -1 9 -9 -14 3 -8 -15 9 -2 -7 -3 -8 -20 -8 2 -12
7330 -12 -3 7 -12 8 -2 0 -2 7 -9 -2 7 5 7 16 -3 4 16 0 13 9 8 1 15 8 -3 12 13 -11 1 9 -13 2 14 -11 -7 5 -5 -15 -6
7369 -6 -11 -12 8 -10 0 1 -11 -16 2 5 -6 1 5 -7 15 1 2 8 2 -1 19 11 16 -8 5 -4 3 15 -11 9 10 -6 -13 11 -2 -7 6 -6 -11 -4 1
7410 1 -17 -12 -2 -14 -10 1 -21 -6 -4 -12 3 6 -6 4 8 3 0 -1 2 -3 22 13 1 8 -1 -12 15 7 -6 6 10 -7 11 8 -9 9 7 -6 2 0 -15
7451a5J2J0j3lJ4j2mMJmK2j5kJ7qj2KK2j1J0loM%mJ0j1lJ1oj8J9J5l0QOnj7J8
7490Cj7RQrmJJj3K1j1rK4KllNJnJ9j6kOq%J4rkJ6j8RKoj2J3j2LOLpmmqK2Jk6J4
7536eOj0%J8j5kRqJJ2Qk2K4qqJ1pJLNqQKrOPj2kkkKJ2j1j1J9mk2K4j5qJ6j7NM
7580elKJ0nj1RJoJ8Nj5RjklQoKJ0j2NPnj0J3j0qJ7roK4k1lJ3k0LJ2qoLJ0j3J2
7623Ep%mJ7j9J2J0k5QK2k1LKNlK%%J3rj9J5KlkLoNMj7KPlnJ0rkQjnJ2j9KOojK2
7670A1j2nJ1llKJ1k3J7KpNJ1j0nJ0jj1J1j0MPo%jlnK3j9mLKoKqMRj0pLMkQkNQ
7716A0mLrJ0j6RJ1npNjoJ5kj4NJ2j6J6kj7Pjpj0J5j1LQ%Ljj1oJ3j0%K1k3kJ6%
7758AkJ0lj0QoOLLj3kNlPQj0JK0k6QkjmOnJOj1oPjnJ3plQkj0J0qpQRj1J6LrlJ0
$$ plain form
7451 -15 -3 7 -6 -9 5 -7 -11 -7 -6 -10 12 -3 -5 12 4 -8 -6 16 5 15 12 6 10 10 6 16 5 2 13 7 -11 8 23 -7 1 7 2 -15 3
7490 3 -14 -5 3 -6 -10 -9 -8 -21 0 -11 -20 4 6 3 0 5 6 1 20 4 2 8 0 0 14 5 3 19 1 10 12 6 -6 7 -5 -2 4 7 0 -4 -8 -16 6 7 -19 -5
7536 -5 1 -9 -9 9 -6 -8 1 -7 -6 6 14 -8 16 8 0 11 4 5 8 13 5 13 15 6 12 19 7 5 3 1 3 15 4 -7 12 8 -14 10 -5 -13 3 -14 -9 -5
7580 -5 -8 -6 4 -1 -12 -3 -2 -8 10 15 0 9 8 6 3 11 5 7 17 5 10 17 12 2 15 5 -3 14 5 -1 23 2 -1 12 -8 -5 7 -1 -7 -4 6 -7 5
7623 5 -2 -2 -6 11 -8 4 14 -11 -3 19 -2 1 3 8 5 7 7 7 20 11 -8 7 9 6 4 7 1 6 10 -7 -5 2 -1 -6 4 -5 -7 1 0 -5 7 -12 -10 -4 -10 -11 11
7670 11 -1 -6 5 2 -1 1 12 -11 6 8 1 6 17 7 2 12 11 0 11 1 5 12 6 6 5 2 -3 20 1 -3 0 2 -4 -2 -10 -6 3 -7 -14 -11 -7 -9 -1 -3 2 10
7716 10 6 9 0 10 -6 3 14 9 2 7 6 0 15 13 -1 4 16 0 16 14 -3 4 3 -4 -14 1 -10 -7 1 1 4 3 -8 -14 -1 -11 -11 10 -13 -15 1 1
7758 1 -1 9 6 -4 4 -2 4 7 10 -3 -5 0 -3 4 12 2 3 23 -3 5 3 2 -2 4 -1 0 6 -5 -11 -4 -5 -10 3 -4 -7 1 -1 -11 -1 -9 -16 -8 1 -10 6 9 0 -3 7
7807GooK1k6J0KOj3J3J2k5J5lj0KRoJolOkj4NL%%N%j7J5%lJ3j6MJ4Kj1J7pj7J3
7850DMj0J0Nj1OkpPJ1k0kJ0oJJ7k1mJ6rpRj4JPkj4J0%j0J1NlJMoJ2Nk3J3OnJL
7894COj1J6j3lJ7j1nNkj3J6mj5MJ3pNrkJRj7MJ3j1oJ4r%J2mm%KnK1oJOLk1J7l
7938GmJJ3j8RnlO%ojKj1QPj1JJ1%j9PpoJ4jj0K0rrPOqLNkMJ9j8OPjklojPoKRj7
7988cLQmjk%j4NJ3j3KNj3J6Oj9OLjM%JoRp%NJLJoP%l%OpJR%j0kOmkJ2j6kNpoK
8040ikkjMjJ2lm%Rj5OJ4j2LQmmLj5J2RoKOkj1RkkJ0j0lRqjOpLRomKjk1J9Lj2j
8089a1J4j2MRj2OM%k%KpJ1%lOMk1J8joJ2loQoj5RQmj1Ro%Lj1%LMrJ5j4Nkk%MJ1
8137El%%mMJ1j6LQkj0J4lqJ4%%Jj2mQQj8J2qrN%rNPqJ1Lk0J3onQKp%LnJ5Oj4o
$$ plain form
7807 7 1 -5 16 -10 0 2 8 -5 8 20 -5 10 7 -3 -1 8 2 3 -3 -6 0 -2 -16 -11 -8 -8 -8 -3 -3 -20 -5 -5 -8 5 -11 -7 7 9 -2 15 8 -9 4
7850 4 8 -2 8 13 2 8 6 -1 6 17 -3 -5 5 -1 0 17 -4 -8 8 -1 -8 1 -13 -12 -5 -7 -21 -11 -11 -21 -10 -5 -8 -7 -3 -9 3 8 -15 -2 4 -1 0 3
7894 3 9 -2 14 1 -2 15 4 -1 4 2 -11 5 1 -14 -10 3 -4 1 -8 -10 -9 0 -17 -13 0 -11 -17 -3 -12 -12 0 -4 -8 -8 -6 -11 10 4 5 11 14 -7 10 7
7938 7 3 4 17 -1 8 3 0 6 6 0 -1 1 -10 -2 5 -6 -5 6 6 -13 -6 -13 -19 -5 -6 -16 4 -5 -14 -7 -1 -9 -6 -1 -3 1 20 2 8 15 14 12 9 3 2 9 3 5 14 -3
7988 -3 0 8 4 3 1 1 -13 -8 5 -8 -6 -1 -14 2 8 -11 -5 -2 -3 1 1 2 -4 5 -2 -2 3 4 7 8 2 9 9 6 6 12 5 6 15 15 5 3 9 5 3 15 -1 -3 2 -5 -11 -9
8040 -9 -11 -13 -14 -10 -11 1 -2 -6 -6 3 -12 -6 8 -4 -1 7 3 -1 2 -13 -1 8 2 4 10 8 -3 6 4 2 12 2 -1 8 0 -1 5 -2 1 10 4 0 2 1 -20 -1 2 -10 -11
8089 -11 3 -9 -5 4 -8 -2 2 2 0 0 2 -5 6 6 3 9 13 -8 10 9 3 15 12 6 14 8 -7 2 10 6 -5 4 -2 -2 1 -10 -10 -7 -3 -12 3 -11 -6 -8 -10 -10 -6 5
8137 5 2 2 2 -2 2 13 -3 0 8 6 -4 10 7 -1 13 13 13 14 2 -2 6 14 -4 8 0 -9 -4 -4 -13 -8 -1 -9 2 5 -15 -2 -8 -13 -5 -3 -10 -10 -7 -12 3 9 -5 -11
8185a1J5nj0J6jp
$$ plain form
8185 -11 4 -1 -11 5 4 -3
8191c
$$ Imaginary data points
##PAGE= N=2
##DATA TABLE= (X++(I..I)), XYDATA
0@%%%%%%%%%%%qJ6j6J6k4L2m0M8n6P2q2R6j18J37j59J83k10K43k83L28l74M24
33B25m80N43o11O87p72Q66r64J071j192J326j472J627j796J984k191K415k659
50a393K930l229L557l923M331m786N305n899O582p380Q328r475J0894j2709J5119
65H252j8482K3538l2073M9995j46884J97512J25443m66042K62344K25993l83037
76a53441L7743L43695k85091j02549L11428j09148k02647K28933J5307j85454
86a01224R1848R0053j13875m723O6462l747m7317q801O8559l786j09581Q2539
98F407Q8394j71456J6728J96544j69849r6844K64012r0411k21472K63732L8458
109A24243l05307J85500J77651l19589N4857K78842k56147q8370L12025j38152
$$ plain form
0 0 0 0 0 0 0 0 0 0 0 0 0 -8 8 -8 8 -16 16 -24 24 -32 40 -42 54 -64 73 -86 97 -113 130 -153 175 -199 225
33 225 -255 288 -323 364 -408 458 -506 565 -627 699 -773 854 -942 1042 -1149 1266 -1393
50 -1393 1537 -1692 1865 -2058 2273 -2513 2792 -3107 3475 -3905 4423 -5052 5842 -6867 8252
65 8252 -10230 13308 -18765 31230 -115654 81858 207301 -258741 3603 229596 -153441
76 -153441 -115698 227997 -57094 -159643 151785 42637 -160010 68923 84230 -101224
86 -101224 -9376 80677 -33198 -37921 28541 24794 -22523 -31324 37235 33449 -76132 6407
98 6407 94801 -76655 -59927 136617 -33232 -130076 133936 43525 -177947 85785 124243
109 124243 -181064 4436 182087 -137502 -82645 196197 -59950 -148320 163705 25553
119B5553j98438K70113m776k45381J74144J00869k22665O1527J50099j49538k7805
130f6298J36973o0935o7125P9384O397n1493R875K8155J992l7805Q06O2803m1999
143G30n8976R9853l18j22193R3375P0703j59625M1963J43315j52977l8281J89615
155A07184j00911j20716J91821j8787j78215J48268O7731j93207P3224J32525
165A08917j63432r001J58129j01815p3390J41671l0968j03015R4623K5543r4467
176d7205L7834N1508n8053o598M3439j3142k3517J0937J9766r874k7896K6738
188C937K5210n3957N078O4585n4150l6281Q9997k6246q0694Q9042K0988j10608
200f3099N9636P1408j13888J0200J07841q8215m3704J18235m1533q5097R9826
$$ plain form
119 25553 -172885 97228 92452 -152929 21215 122084 -100581 -39054 111045 -38493 -66298
130 -66298 70675 9740 -57385 21999 28396 -23097 -13222 14933 16925 -20880 -20074 42729 730
143 730 -58246 41607 41289 -80904 12471 83174 -76451 -34488 108827 -44150 -82431 107184
155 107184 6273 -114443 77378 58591 -119624 28644 96375 -96832 -23608 108917
165 108917 -54515 -63516 94613 -7202 -80592 61079 30111 -72904 21719 47262 -47205
176 -47205 -9371 42137 -15916 -22514 20925 7783 -15734 -4797 14969 5095 -22801 3937
188 3937 29147 -24810 -19732 44853 -9297 -45578 44419 18173 -62521 26521 47509 -63099
200 -63099 -3463 67945 -45943 -35743 72098 -16117 -59821 58414 16881 -68216 31610
211C1610J1157j01991N9945N3484r1301J2713P3623n9508k6280O8194j9782m5450
223c3586M2859J3067m1252R958K7964j8916j6508K1452R938k6037j499L2042j5417
236D065k9814L7453J0466n0687K3178M0855n4626n965O3347l8748l9420O8609
248B8713p804o4981N3788K7810p3323K3430N6053o1556j2271O7706l4057m1494
260c7986N9765n36n5265L6190K7612n0374O251M1536l0463j9167L8020m219l1464
273b0100K0370J7875k7501l098K7596j0409k2397K1987J1829k9724M140K9608
285B0176k2294j8233L5500l141l5905K6866K0204m1653O707L8735l2895j7629
297b3562M5345j2584l7221L7502J2028m5145J8110L2268l8885n841M1362k1198
$$ plain form
211 31610 42767 -59224 721 54205 -37096 -24383 49240 -10268 -36548 31646 11864 -33586
223 -33586 9273 22340 -18912 -8954 19010 94 -16414 5038 14976 -11061 -12560 19482 4065
236 4065 -25749 11704 22170 -28517 -5339 35516 -19110 -25075 38272 -476 -39896 28713
248 28713 20909 -44072 9716 37526 -35797 -12367 43686 -17870 -30141 37565 3508 -37986
260 -37986 21779 21243 -34022 2168 29780 -20594 -14343 27193 -3270 -22437 15583 11364 -20100
273 -20100 270 18145 -9356 -12454 15142 4733 -17664 4323 16152 -13572 -9432 20176
285 20176 -2118 -20351 15149 12008 -23897 2969 23173 -18480 -11773 26962 -5933 -23562
297 -23562 21783 9199 -28022 9480 21508 -23637 -5527 26741 -12144 -17985 23377 2179
309B179k5919L6762J247l5523K1003K0360l2116M55K9651j7975j7082K6612P64
322A0418k5366J3431J6634k2002l978K3630r079j8512J9509P742k4453O322K1587
335A5883j9585j0561K6992n914k4405K1768J1315k9894P842K5571k4849r656L1595
348A6102j1196k4305K7296O102l1036J4476K0849k7740k094K8060j6050j6441
360a5977K5631o09k3649J5071J2854k1613P98J9497j1799j1514J7317J503j7304
373i794P717J2897j4599n174J7882m727j6110J4587Q301k0739M244J9391j7125
386c249r258K4193o488k0849K0827P338k6277J0423J9420k3648l227K5534j4092
399F47j5337K3857j206k1818J5401J0364k0831L648J6569j3299o854J5610k630
$$ plain form
309 2179 -23740 13022 14269 -21254 -251 20109 -12007 -11552 18099 124 -16958 9654 10418
322 10418 -14948 -1517 15117 -6885 -10863 12767 3688 -14824 4685 12427 -12026 -5704 15883
335 15883 -3702 -14263 12729 6815 -17590 4178 15493 -14401 -6559 19012 -5837 -15493 16102
348 16102 4906 -19399 7897 13999 -17037 -2561 18288 -9452 -11546 16514 464 -15977
360 -15977 9654 9045 -14604 467 13321 -8292 -7494 12003 204 -11310 6007 7510 -9794
373 -9794 -2077 10820 -3779 -8953 8929 4202 -11908 2679 10980 -9759 -5515 13876 -3249
386 -3249 -12507 11686 5198 -15651 5176 12514 -13763 -3340 16080 -7568 -10795 14739 647
399 647 -14690 9167 7961 -13857 1544 11908 -8923 -5275 11294 -2005 -8859 6751 4121
412D121j2195Q434O710j0611j625J0942l084j0198Q360P120j3606m5J5694j0170
426a53j1030J8964q51k0306J5240J1123k4197N502K1435k1018p035K6423j1709
439B388j8082K4416N15k4109J6380J1557k3422N321J7927j6917m758J7997p504
452A709j0472J2587R55j0254M580N174n011k273L762K457m791k434Q387j655j0460
467g739R766O104j6702N333J5589j8040l884K3066j3257j4932K5468l407k4052
480a6687K1534Q518k8127J2343J8755k5901P93K4271j8398r455K3864q472j5440
493a2402J8442M48j6031J0733N543j2095L992N787o332Q80K146j808K310k950
507a337r09P144o266m473J2884n648j1370J6592l50j9007J5930Q415k4322J0199
$$ plain form
412 4121 -8074 360 7070 -3541 -5166 5776 2692 -7506 854 7974 -5632 -5677 10017 -153
426 -153 -11183 7781 6930 -13376 1864 12987 -11210 -5708 15727 -5291 -12326 14097 2388
439 2388 -15694 8722 9237 -14872 1508 13065 -10357 -5036 12891 -4026 -8784 9213 1709
452 1709 -8763 3824 4779 -5475 -895 4279 -732 -3005 757 3214 -1577 -4011 4376 2721 -7739
467 -7739 2027 8131 -8571 -3238 12351 -5689 -9573 13493 236 -14696 10772 7365 -16687
480 -16687 4847 13365 -14762 -2419 16336 -9565 -8772 15499 -2899 -12354 11510 3038 -12402
493 -12402 6040 6488 -9543 1190 6733 -5362 -1370 4417 -1915 -1035 1111 -697 1613 -1337
507 -1337 -2246 4898 -1368 -5841 7043 1395 -9975 6617 6267 -12740 3190 11605 -12717 -2518
521b518J8086k5043N80K5568k0385j0275K8414j1500j9261K5849r61k3992J8959
534C521Q199k3679J0242J3632j9237K481J4576j3023k070J1942p704k773Q005
547D112n347n41N211o411K476N303r781L833Q747j3456J937J4397j5074l467K0051
562A1990j3005j1240K3366o986j9170K2737J798k4861J7808J1158k6617R696J8667
575A5341k3963N14K2581j7920p408K2374j0427j2338J8925l750j3669J3996N02
588D758j2138R616J774r477P390P85p549P701q59p748R767j296j0406J1981P04
603E003j4609J2543N351j8723J0246J1731k0920M854J8125j9891k694K2649j5388
616a723j0678K3905q250j7113K1516k07k0575J6208O891k0588R570J1538j7703
$$ plain form
521 -2518 15568 -9475 -8895 16673 -3712 -13987 14427 2927 -16334 9515 8554 -15438 3521
534 3521 11720 -11959 -1717 11915 -7322 -4841 9735 -3288 -5358 6584 -1120 -3893 4112
547 4112 -1235 -1776 3435 -2976 -500 4803 -4978 -1145 7602 -5854 -3917 10480 -4594 -8061 11990
562 11990 -1015 -12255 11111 4125 -15045 7692 9490 -15371 2437 13595 -13022 -3326 15341
575 15341 -8622 -8108 14473 -3447 -10855 11519 1092 -11246 7679 3929 -9740 4256 4758
588 4758 -7380 2236 4010 -5467 1923 2708 -4841 2860 2001 -5747 4020 2724 -7682 4299 5003
603 5003 -9606 2937 8288 -10435 -189 11542 -9378 -4524 13601 -6290 -8984 13665 -1723
616 -1723 -12401 11504 3254 -13859 7657 7450 -13125 3083 9974 -10614 -1044 10494 -7209
629g209L405J3125j3338q29J2129r185k553R873o651k179P950o263r37P597p525
644b590l91R270r178j718J2441r748n274J5769q034j0451J7703l652j5883J6986
658E250K747j9870J3165R732k1046O859J5527j8898m55J8660j3972p012J8548
671I235p649j1290J5605j689j2630J1125K443j1356O754M035q685L959L430o260
685b973L394J742n300M662N43o416O524J082r161P557L844j2325O494Q306j4329
700f356K900J3149j3891k674J6723j0561q831J7679m895j3843J5511J660j6314
713i743J0797P349j5682M899J0772j2430m69J1329p911l876R444l741m768O390
727B360j248l530L704j064j316K647k678K71L712m850Q3O342o106k252R284n334
$$ plain form
629 -7209 -3804 9321 -4017 -4846 7283 -1902 -4455 5418 -1233 -3412 4538 -1725 -2662 4935 -2590
644 -2590 -2981 6289 -2889 -4607 7834 -1914 -7188 8581 547 -9904 7799 4147 -11736 5250
658 5250 7997 -11873 1292 11024 -10022 -3163 12364 -6534 -6989 11671 -2301 -9313 9235
671 9235 1586 -9704 5901 4212 -8418 2707 5150 -6206 548 4583 -4102 -143 3287 -2973
685 -2973 421 2163 -3137 1525 2068 -4348 2176 3258 -5903 1654 5498 -6827 -333 7973 -6356
700 -6356 -3456 9693 -4198 -6872 9851 -710 -9541 8138 3243 -10600 4911 6571 -9743
713 -9743 1054 8403 -7279 -2380 8392 -4038 -4507 6822 -1089 -4965 4479 738 -4030 2360
727 2360 1112 -2418 1286 222 -1094 1553 -1125 -854 2858 -1992 -1909 4433 -1673 -3925 5359 25
743B5o169J1128k252j0349J0714K524j3257P702P699j3776K761J1666j1536k771
757e891J3256p216p244J2115k122r581Q871K178r366M762M602p167J235M759m145
772i54n88L070j659l57P70q19J440q44j880L575p16m341M827J253o893M217M512
789D613q392J634P910p943k284J0136n345o410J0286j231r397Q194L208j0323
803e344M445O638q997K45Q156o021l121P552k474m857N371M40m580K555J825k836
819a003L56J412o15l65l40R44O02k387R87K721l608o00M988l237l332O344j184
836A683o108N979K024p912L819N397p972L83P798o106l300Q434k881o096P126
851B268P29p235M416L608o547J230M992m418j365M594j792k568K901K60k131P75
$$ plain form
743 25 -6144 4984 2732 -7617 3097 5621 -7636 66 7765 -6011 -3250 8416 -3120 -5891
757 -5891 7365 149 -7095 5020 2898 -6683 2188 4366 -5000 -238 4364 -2803 -1568 3191 -954
772 -954 -1542 1528 -131 -488 282 -537 903 59 -1821 1754 1038 -3303 1524 2777 -4116 101 4613
789 4613 -3779 -2145 5765 -2178 -4462 5674 329 -6081 4205 2974 -6423 1771 4979 -5344
803 -5344 -899 5739 -3258 -3013 5143 -878 -3999 3553 1079 -3778 1593 2033 -2547 8 1833 -1003
819 -1003 -647 765 150 -215 -555 389 991 -1396 -409 2312 -1296 -1896 3092 -145 -3477 2867 1683
836 1683 -4425 1554 3578 -4334 -515 4882 -3090 -2707 5091 -1015 -4315 4119 1238 -4858 2268
851 2268 2997 -4238 178 3786 -2761 -1531 3461 -957 -2322 2272 480 -2088 813 1073 -1058 -283
867b83R72n14p32J92J354q90j647K515M10l645K290K695m822N73N104m559k175
884c162O614k666n026O572L30p045M878L549p501J955N961o226j274O894l728
899A25l856O202q01n065M225J574m723J829K707l218q6K426j330q29J099K9k41
916F7n03K26J243j441q55K850j185k756L720L59m711L329K749n880J549N210n697
933a726j148O847m028l979P108j348o092N898J580o906L599L927o281R47N083
948C481m571j227M911k457k384L736p55k355K245nj436J156k99l44J003j324K32
965c93J852k394j58L296k811j570M738k182l608N459m60n625N022K005o892L343
981c78M497o948Q46O338n739j834P046l649l981O555j267n159N122P69n194L331
$$ plain form
867 -283 689 175 -557 -365 989 99 -1548 967 1377 -2268 22 2717 -2105 -1532 3572 -987 -3162
884 -3162 3452 786 -4240 2332 2662 -4383 495 4044 -3457 -1502 4459 -1767 -3041 3853 125
899 125 -3731 2471 1670 -3395 830 2404 -2319 -490 2217 -1001 -1087 1339 9 -820 279 308 67
916 67 -436 -210 1033 -408 -1263 1587 402 -2354 1366 1725 -2986 343 3092 -2788 -1239 3971 -1726
933 -1726 -2874 3973 -55 -4034 3074 1726 -4366 1532 3112 -3794 -195 3732 -2549 -1602 3481
948 3481 -1090 -2317 2594 137 -2247 1489 734 -1621 624 619 -817 339 40 -304 699 -625 -393
965 -393 1459 -935 -1093 2203 -608 -2178 2560 378 -3230 2229 1769 -3856 1166 3171 -3721 -378
981 -378 4119 -2829 -1983 4355 -1384 -3218 3828 179 -3802 2753 1486 -3673 1449 2218 -2976 355
997C55J949m396J824K200l320J039J766k533J079J150k423J604R54l044K135J518
1013A857m092K112K842n025J227M567n282n28O176m562k804P073k819n021O931
1028B652m45o621N698K051p213L701M071o777J475N237n537m42N435l984j681
1043b380M943k615k143M162j819k047L607j628j860L577j794k005M041j850k720
1058b531M734j438l954N231l61n418N132J397o656M161L467p189K360N434o831
1073b462P7O782n567k198P234l672m069O805j578n197N702K18n467M286J466n154
1089b794L031K098m618K202K274m207J816K383m178J693K707m476J446L463m867
1104b027P76M575n020l97N738m610k073O657l550l878O936j834n521O438K21o624
$$ plain form
997 355 2304 -2092 -268 1932 -1388 -349 1417 -1116 -37 1113 -1310 294 1248 -1796 339 1857
1013 1857 -2235 -123 2719 -2306 -1079 3488 -1794 -2322 3854 -708 -3512 3561 742 -4279 2652
1028 2652 2207 -4414 1284 3335 -3878 -177 3894 -2883 -1408 3829 -1708 -2150 3285 -699 -2380
1043 -2380 2563 -52 -2195 1967 148 -1899 1708 80 -1780 1797 3 -2002 2039 189 -2531
1058 -2531 2203 765 -3189 2042 1681 -3737 1395 2792 -3864 297 3764 -3425 -1065 4369 -2462
1073 -2462 -2385 4397 -1170 -3368 3866 194 -3875 2930 1352 -3845 1857 2075 -3392 894 2360 -2794
1089 -2794 237 2335 -2283 -81 2193 -2014 -198 2185 -1993 -300 2407 -2069 -623 2840 -2027
1104 -2027 -1251 3324 -1696 -2093 3645 -965 -3038 3619 69 -3809 3127 1293 -4228 2210 2431 -4193
1120d193N227K250o974L514L899o582J647M926n611j9N291m387j272N133l186
1135c37k028M737k307k395M392j749k658M254j382l010M298r39l653M419k17m516
1151c091M359Q72n393L863K281o037K847L840o213J328N205n711m67O119m636
1166h34k212O381l105l652O036j481m568N214Qm958M133J196m901L056J962m572
1182b297K147K432m214J493K710l953R85L041l847M78L511l753j83M101l538j101
1198a988M699l013k242N093k101l463N146q47m534M692O28n243L759K086n457
1213b785K476L284n155J095M078m448k12M433l524j258M401k552j975M116j698
1228B76k412L754j038k677L424n01k904L158pl183K950N33l508K652J215l821
$$ plain form
1120 -4193 1034 3284 -3690 -176 3723 -2859 -1212 3714 -1897 -1916 3375 -1012 -2284 2849 -337
1135 -337 -2365 2372 65 -2330 2062 313 -2345 1909 527 -2483 1815 876 -2777 1642 1425 -3091
1151 -3091 1268 2140 -3253 610 2891 -3146 -299 3541 -2672 -1344 3861 -1850 -2317 3802 -834
1166 -834 -3046 3335 230 -3422 2614 1133 -3435 1779 1787 -3171 962 2158 -2743 313 2275 -2297
1182 -2297 -150 2282 -1932 -439 2271 -1682 -697 2344 -1503 -1025 2486 -1267 -1450 2651 -887 -1988
1198 -1988 2711 -302 -2544 2549 448 -3015 2131 1284 -3250 1442 2070 -3173 586 2672 -2785
1213 -2785 -309 2975 -2180 -1085 2993 -1455 -1667 2766 -758 -2016 2385 -167 -2142 1974 276
1228 276 -2136 1618 580 -2097 1327 826 -2078 1080 1073 -2110 840 1373 -2135 517 1732 -2089
1244b089K166K024m040J467K880m010N17L653l645o14M206k930j759M389j910
1259C05k770M200p66l465L603L82l813K805J337l790J872K022l481J029K420l027
1275a137L30K560k551j65K586k172n13K599j903q25K673j650j202K822j371j674
1291a593K958r32k264K995k82k881K787N85l374K272J512l578J454K399l438M40
1307i40L039k916n95L321k117j493L250j215k093K834l20k363K233L24k314J649
1323B84P05k115J223Q53j904R58R25j832Q52J031j902P70J294k079N64J729k207
1340h51J18K267k114n76K738j725j406K961j014k195K834r5k761K321Q61k963
1356a600J527J651k788O49K135k296j78K266j638p60K106j030j037J762n64j066
$$ plain form
1244 -2089 77 2101 -1939 -472 2408 -1602 -1085 2568 -1077 -1691 2515 -415 -2174 2215 305
1259 305 -2465 1735 969 -2496 1107 1489 -2324 481 1818 -1972 -100 1922 -1559 -530 1890 -1137
1275 -1137 -807 1753 -798 -963 1623 -549 -1062 1537 -366 -1191 1482 -168 -1370 1452 81 -1593
1291 -1593 1365 433 -1831 1164 882 -1999 788 1373 -2001 271 1783 -1795 -341 2058 -1380 -940
1307 -940 2099 -817 -1412 1909 -208 -1701 1549 334 -1759 1075 755 -1608 625 949 -1365 284
1323 284 989 -1126 97 950 -954 4 929 -903 -51 980 -922 -152 1142 -937 -373 1356 -851
1340 -851 -733 1534 -580 -1156 1582 -143 -1549 1412 398 -1797 1037 942 -1819 502 1363 -1600
1356 -1600 -73 1578 -1210 -561 1574 -722 -900 1366 -272 -1032 1074 44 -993 769 205 -861
1372h61J446l49j000J285l09r58J293l25j091J450k02j421J581J04j869J559O83
1389A016k278J220J401k482O06K072k322k22K558j834j106K723j088j803K492
1404I53k36k196J967N19k261J301J054k023O74J273j641K25J269j291J1J132j076
1421c46j7J056j051JJ108j144o4J339j226l55J718j181q43K028q38j473K160k48
1439F24k071J982N10k456J474J305k539P36J930k280m7K246j742p52K248j096
1455G2j215K005n22j388J622j04j394J311R2j283J096J75j227J044K01j289J085
1472B81L28j525J099O48j805R52J103k023N66J669k031j7K138j771p33K419j254
1489D4j422K434n67j956K158J70k240J666P98k252J084J248k058N42J472j758
$$ plain form
1372 -861 585 236 -764 521 212 -746 547 222 -869 581 379 -1042 539 643 -1226 333 1016
1389 1016 -1262 -42 1359 -1123 -517 1555 -767 -989 1569 -265 -1371 1352 264 -1539 953
1404 953 717 -1479 488 1007 -1254 47 1101 -922 -248 1025 -616 -391 878 -413 -402 730 -346
1421 -346 -363 693 -358 -357 751 -393 -457 882 -344 -699 1019 -162 -1005 1023 185 -1288 872 624
1439 624 -1447 535 1045 -1411 63 1368 -1171 -435 1495 -785 -832 1414 -328 -1080 1168 72
1455 72 -1143 862 340 -1048 574 470 -924 387 479 -804 292 467 -760 284 485 -804 281
1472 281 609 -916 183 831 -974 -22 1081 -942 -376 1293 -738 -755 1383 -388 -1121 1298 44
1489 44 -1378 1056 489 -1467 691 861 -1379 287 1085 -1167 -83 1165 -893 -351 1121 -637
1505f37J36J522j469j18J499j261k86J507j141m22J578j082o27J750j004r24J924
1522I45p67j362K046l90j815J994J68k222J732Q15k457J246J451k470O11J965
1538A490k247j01K308j810p42K374j251j261K260o86j592J995j85j735J677K02
1554F96j784J408M62j792J171O86j805R96R00j867Q09J182j948N83J526k007K11
1571e73J925j949k96K295j702q87K530j272j523K604o67k060K413M1k434J994
1587D39P40k593J441J341k500P67J776k241J83J983j852l10K033j464o68J972
1603A047j118r00J903q56j096J861o34j304J891m08j594J912q0j949J849L99k304
1620a381J631R69k551J208J605k613N89K164k427j47K572k019q76K734j418j496
$$ plain form
1505 -637 -501 1021 -448 -566 933 -328 -614 893 -248 -670 908 -174 -801 949 -55 -979 945
1522 945 178 -1184 862 472 -1343 651 819 -1403 329 1144 -1313 -67 1384 -1086 -475 1490
1538 1490 -757 -858 1450 -360 -1102 1272 21 -1240 1020 334 -1258 737 552 -1183 494 696
1554 696 -1088 320 782 -1010 161 847 -958 38 938 -929 -120 1062 -886 -303 1223 -784 -573
1571 -573 1352 -597 -893 1402 -300 -1187 1343 71 -1452 1152 485 -1575 838 879 -1555 439
1587 439 1179 -1414 27 1368 -1132 -365 1411 -830 -647 1336 -516 -826 1207 -257 -925 1047
1603 1047 -71 -971 932 76 -1020 841 207 -1097 794 386 -1208 704 624 -1325 524 923 -1381
1620 -1381 250 1219 -1332 -124 1481 -1132 -543 1621 -806 -953 1619 -400 -1276 1458 40 -1456
1636a456K628p33j927K305r1k121J875M21k142J434P95k042J042J023j924P44
1652a69J184j830N30J361j808K94J595j788k3J917j715m86K245j478j035K443
1668A237j039j640K476m19k188K272K99k545J839J012k664J207J613k508N20J980
1684A452k157r9K143j729n67K122j286r01K006r03j104J858o07j258J749l73j409
1701a063J701j45j609J645J68j872J524N83k109J262J099k265Q23J624k248K49
1717f33K073j999m04K346j547j069K428r68j579K253l46j902J914K31k024J471
1733B45O90j999J066R75j849O84J180j700L84J297j560J62J409j467o2J555j371
1750c61l46J739j231o91J899r72j123J991n78j538J918o6j910J697M89k129J291
$$ plain form
1636 -1456 1172 439 -1488 817 726 -1395 480 901 -1241 193 988 -1054 -12 1011 -913 -169
1652 -169 1015 -815 -285 1076 -732 -438 1157 -631 -654 1263 -452 -938 1307 -171 -1206 1237
1668 1237 198 -1442 1034 615 -1573 699 998 -1547 292 1304 -1360 -153 1460 -1048 -528 1452
1684 1452 -705 -804 1339 -390 -957 1165 -121 -1022 984 81 -1023 835 228 -1030 719 346 -1063
1701 -1063 638 493 -1116 529 697 -1175 349 932 -1177 85 1184 -1081 -258 1366 -882 -633
1717 -633 1440 -559 -963 1383 -164 -1233 1195 227 -1352 901 555 -1347 567 798 -1226 245
1733 245 935 -1064 2 977 -872 -188 992 -708 -324 973 -587 -425 984 -483 -545 1010 -361
1750 -361 -707 1032 -199 -890 1009 37 -1086 905 327 -1211 707 641 -1269 428 917 -1212 79
1767G9J044k154P53J503j980J70J780j654l48J882j228p71J815q00j043J649m17
1784B80j213J465j35j269J271Q9j332J151K67j406J025M89j498Q74P66j616O59
1801a33J087j655L28J424j583r4J701j363n86J888r96j059J874n25j412J698j7
1818E77j636J364M49j695R71Q18j612N68J046j416K21J166j215m7J213j036k48
1835e12J219q61m05J223p02n93J264n52q07J302l42j050J293o0j293J198K96j477
1853h59R57O89j575O44J038j527K41J322j324j93J442j016n63J476o74q58J367
1870E87l29j033J200m1j116R82K25j128P80M02j103N77N65j077M15O93j057K66
1888a92Q31j001O6R71r50j72J121q24m14J190o00p02J228l53r61J171qj169R97
$$ plain form
1767 79 1123 -1031 -278 1225 -755 -585 1195 -459 -807 1075 -153 -924 891 91 -952 697 280
1784 280 -933 532 397 -872 399 488 -844 307 574 -832 193 682 -816 58 824 -792 -133
1801 -133 954 -701 -373 1051 -532 -626 1075 -288 -874 1014 18 -1041 833 308 -1104 594 577
1818 577 -1059 305 754 -941 30 848 -764 -196 850 -566 -345 821 -394 -441 772 -264 -512
1835 -512 707 -154 -559 664 -38 -631 633 81 -726 576 234 -816 477 417 -876 322 618 -859
1853 -859 98 787 -788 -144 894 -633 -392 930 -394 -587 855 -161 -724 752 78 -780 587
1870 587 258 -775 425 384 -732 250 475 -653 127 529 -574 3 568 -509 -94 599 -458 -192
1888 -192 639 -362 -296 675 -275 -447 674 -150 -564 626 26 -676 552 199 -762 409 401 -768 229
1907B29L31j262P29O37j252M26Q77j151J18J022r73j79J092p61m02J070n27n67
1925e43R92l11o74Q90j35p44P92J0p94P13J42q58O29K98r15N23M81r67L66O71
1945E66r70J52Q72r20j01J049p70m25J133n31o92J107k22r01R64J00j046P66L90
1964E21j073N12O00r77K39P27q45L9P52o75j27P48n50k19P33m64k92P22l94l71
1984c94P55l12m90P93k18o37Q21o1q25P81J82r59O24M85j054M00P27j002Q8R35
2004F39q48k46J040o09n17J014l23p10Q85m5q05P00J70p98N19K90p31L65L54o59
2024c15K71L77o29K14M30o44J81N14o71Q2O61p17m4Q05o70k66R45n31n45J023
2044D71k97p85R47K5r89P92L15j030N30N80r79K28P59q36m5Q15o18k43P71m28
$$ plain form
1907 229 560 -702 27 664 -588 -162 715 -436 -318 704 -269 -448 644 -117 -519 551 24 -543
1925 -543 449 138 -536 354 219 -525 267 277 -517 196 338 -520 109 407 -508 15 496 -471 -105 566
1945 566 -404 -252 620 -300 -401 648 -122 -547 586 55 -637 470 248 -653 311 411 -635 131 521
1964 521 -552 -40 560 -417 -178 549 -296 -257 495 -180 -307 441 -109 -328 405 -59 -351 371 -23 -394
1984 -394 361 49 -441 352 134 -503 318 257 -568 213 395 -564 60 545 -509 -109 618 -384 -296 639
2004 639 -209 -455 585 -24 -541 473 150 -560 325 280 -525 175 345 -453 66 356 -375 -10 344 -315
2024 -315 -44 333 -296 -82 348 -296 -115 399 -272 -190 471 -246 -290 515 -155 -421 524 -7 -552 471
2044 471 174 -611 336 361 -628 164 479 -551 -21 559 -420 -192 567 -269 -314 501 -117 -360 411 -17
2064a7l53P00k81m00O18j99m12N98j48m73O03j10n22O22k2o57O46J31q17N91L41
2085D39r23M33N91r50K03Q16q92r6R84p20l80J024m73n98R42j94p50Q13L7q05
2105d99O33K19p73M51L30p12L13L96o55K19M39o27J52M97o28Q0N91o36m1P10n95
2126a36k06Q04n01m07Q94l53o23Q92j15q21Q19J37r41O50L97r77M41N86r20J94
2146a86P29q07k3Q00o73j86Q05n21l25P84l83m07P38k75m80P14j59n71O81m9o47
2167d41O33Q9p42N71K65q24M69M25q61L17O13q57J22P73p80j05Q67o31l54R30
2187D79m55n45R22k44p03Q43k7p90O95J79q33N36L52q34L96M65q08K61N52p37
2207b96J20O31o84mO85o38j18P54n47k76Q19m59m27Q54l19n93Q44j33p48P88Q5
$$ plain form
2064 -17 -370 330 49 -351 267 68 -344 254 106 -367 236 126 -396 226 204 -453 193 324 -493 98 439
2085 439 -484 -51 540 -410 -207 609 -283 -379 605 -115 -495 529 56 -542 400 206 -544 269 306 -499
2105 -499 134 353 -420 31 361 -351 -38 358 -297 -78 361 -266 -114 383 -245 -165 426 -210 -251 459 -136
2126 -136 -342 462 -39 -446 448 95 -528 364 249 -572 247 384 -557 93 490 -487 -46 540 -380 -186
2146 -186 543 -264 -287 513 -160 -346 459 -62 -387 397 14 -393 345 70 -410 304 145 -426 255 206 -441
2167 -441 192 281 -461 110 375 -449 20 445 -416 -99 514 -343 -221 552 -228 -333 534 -97 -451 479
2187 479 24 -521 401 157 -546 297 270 -520 175 354 -479 57 409 -425 -29 436 -372 -111 441 -296
2207 -296 -176 455 -229 -233 452 -186 -304 450 -97 -373 446 -13 -440 414 95 -498 346 213 -535 253 338
2228C38q78O65L17r39M79N29r21K52O99q33J8Q01p08j92Q54n36l69Q32l69m86
2248d47P75j95n72O98n3o39O32O5o94N76J79p56N02L07p85L91M63q21K75O19q32
2269c12R3P57p50j28Q68o16l55R04m06n63Q91k08p01P91J3p85O52K20q24M81L80
2290D02p86L07M90p24J56N77o49J8O28n75j01O80n19k17P11m22l47P40l03m94
2310d28P57j68o34P38Pp64O38K19q32M91M24q44K99N71p96J06O90o75j00P46n33
2331h8k76P61l77m01P17k51m86O67r7n58N95J3n93N01J57o46M22K66o67L23L93
2352C75o72J90N22o51L9O30o11j04O98m88k84P22l30m46P10j56n71O33L7o60N24
2373A07K00o91M03L26o69K58M40o22J14N05n64LN52m85j14N73l87k27N95k97l41
$$ plain form
2228 338 -540 125 442 -497 -18 511 -410 -158 541 -292 -274 527 -181 -373 481 -55 -424 408 39 -447
2248 -447 328 133 -439 259 206 -433 199 264 -430 146 325 -431 71 378 -407 -16 447 -374 -99 520 -312
2269 -312 -219 538 -212 -340 528 -88 -443 461 55 -508 383 175 -526 265 278 -507 145 365 -459 22 402
2290 402 -384 -77 413 -311 -155 422 -227 -209 419 -156 -257 423 -96 -313 398 -24 -371 369 66 -428
2310 -428 329 161 -473 265 272 -492 146 365 -467 24 448 -396 -97 474 -322 -216 474 -201 -301 445 -88
2331 -88 -364 397 20 -381 336 85 -401 266 169 -389 206 219 -374 127 284 -362 60 326 -341 -18 375
2352 375 -297 -107 415 -236 -197 433 -178 -282 416 -72 -356 366 36 -410 300 144 -427 206 243 -417 107
2373 107 307 -384 19 345 -324 -66 374 -248 -134 371 -193 -190 362 -123 -237 336 -51 -278 317 20 -321
2394c21O05j94m31N62o1n14N15O1n73M28K13o13L12L46o11J75M45n59K7N43m89
2415a34j16N76l73k53N93k55l58N66j41m43N15%m98M32J13n19L40K15n28K50L16
2436B98n30J41M01m95M1M70m50o7N02l84j71N18k81k86N29j62l80M96o1m37M34
2457A26P3n02L63J87n22K77K74n10J53L86m85L7M53m20q6M96l44k01N08k31k97
2478b65M92j40l84M64k2m39L98Q6m69L23J82m79K20K88m77J46L40m44O5L72l87
2499a30m3M37l36j36M69k88k20M79j92l04M55r4l83M40km38L74J34m88K86K38
2520B58m87J70L41m72O4M11m08n9M52l34j58M56k38k35M39j55l11M23o2l41L63
2541A17J2l86L31R7m22K92J72m49K29K46m47J48L24m25L5M09m09n5M68l46j71
$$ plain form
2394 -321 284 90 -341 221 160 -354 161 222 -351 77 290 -323 -11 335 -276 -101 344 -215 -188 355 -134
2415 -134 -250 326 -47 -300 293 38 -320 246 105 -338 177 177 -321 111 224 -295 45 260 -268 -18 298
2436 298 -232 -91 310 -185 -144 326 -124 -191 311 -73 -244 274 -7 -293 236 74 -306 190 129 -308 126
2457 126 199 -303 60 247 -275 2 276 -234 -81 305 -180 -143 310 -110 -196 300 -44 -245 263 32 -265
2478 -265 227 87 -297 167 145 -294 104 190 -279 44 226 -253 -33 255 -222 -76 264 -180 -115 257 -130
2499 -130 -173 264 -72 -208 261 -27 -247 232 40 -264 191 97 -286 154 152 -286 88 222 -266 20 258
2520 258 -229 -59 282 -190 -126 285 -123 -182 270 -64 -222 234 -4 -239 200 45 -266 157 95 -246 117
2541 117 129 -257 74 171 -251 41 213 -236 -7 239 -208 -60 264 -161 -126 283 -126 -181 287 -59 -230
2562b30M92k51k71M71j27l55M24j9m11L83O5m15K93J55m34K11K38m25J56K93m08
2583a65N7L50l67oL75l32r3M28k77j90M55k12k79M47j02l67M42k0m23L91P5m55
2605b68L17J90m85K32K78m62J16L53m27K5M00l67p9M32l24j31M38k49k19M37j78
2626B9k78M27r6l46M11j3m00L58J01m52L02J90m64K04K96m59J04L75m39J8M17
2647B85l82r0M55l10j87M68k07k97M48j07l50M29l5m00L93M8m23L30J38m63K75
2668A8K12m62J95K90m55J17L67m44J6M35l91q7M76l19k06M90k25k94M84j25l72
2689b80M40j9m22L92O9m53L16J73m58K22K67m51J33L36m34N2L78l86l2M23l48
2710h2j18M55k78k25M77j92l03M74j09l77M34om32L95Q6m68L18K06n10K31L05
$$ plain form
2562 -230 262 11 -260 211 84 -271 153 134 -277 106 171 -244 49 204 -230 -19 219 -206 -50 243 -165
2583 -165 -108 242 -125 -131 244 -88 -181 247 -30 -220 235 23 -256 191 89 -278 164 144 -279 112 187 -268
2605 -268 49 239 -246 -14 264 -198 -82 271 -156 -131 269 -98 -177 255 -69 -200 238 -11 -230 207 29
2626 29 -249 178 82 -264 147 134 -266 92 193 -259 43 233 -231 -27 269 -190 -86 289 -150 -132 285
2647 285 -97 -187 268 -42 -229 239 32 -265 183 76 -274 155 120 -280 113 161 -262 68 206 -257 18
2668 18 230 -232 -37 253 -202 -85 282 -162 -146 289 -102 -189 287 -32 -238 252 27 -267 217 92 -280
2689 -280 160 141 -281 111 180 -273 43 216 -242 -20 247 -204 -71 265 -169 -117 261 -125 -157 266 -82
2710 -82 -200 255 -23 -248 229 37 -266 208 99 -278 156 150 -282 113 199 -269 49 255 -255 -24 281
2731B81m95J31L68m53M1M14l98p1M45l18j67M56k22k66M68j40l37M39o7l76L97
2752A30L0m32L48J27m61K74K20m67J84L15m57R5L71m17j4M37l74j11M66k89k21
2773b46M87j93l17M59r6l64M19%m27L68J04m50K95J98m80K25K77m56J25L48m24
2794a48K3L94l76p3M51l20j56M59k47k51M48j38l15M19m3l90L88M0m17L22J41
2815B11m50K55K31m40J50L06m39P0L66l77m5M22l34j20M33k57k16M51j75l04M45
2836A83q6l61L91J6m06L35J19m33K56K13m46J79K86m31R8L49l78qL75l20r8M08
2858B41k67j63M13k03k35M02j12l20L91l2l61L50O0m17K97J58m31K22K41m23J23
2879f6L20m02J6L90l42r3M21k70j87M32j79k71M09j00l13L75j2l65L29P4l73K53
$$ plain form
2731 281 -214 -83 285 -168 -127 287 -111 -182 263 -55 -222 234 12 -254 214 74 -263 176 109 -267 130
2752 130 160 -272 76 203 -258 16 236 -231 -47 268 -189 -94 277 -140 -154 283 -91 -202 264 -25 -246
2773 -246 241 48 -269 190 94 -270 149 149 -278 90 194 -256 39 237 -243 -18 259 -197 -72 276 -148
2794 -148 -125 269 -107 -180 271 -49 -205 254 7 -244 204 66 -249 170 127 -263 125 165 -252 70 211
2815 211 -239 16 247 -193 -43 263 -176 -106 260 -117 -162 260 -74 -194 239 -18 -234 217 42 -262 183
2836 183 97 -264 127 143 -263 72 191 -242 14 227 -219 -40 246 -185 -87 262 -116 -124 251 -69 -167 241
2858 241 -26 -189 224 21 -214 188 76 -244 147 115 -246 104 164 -253 44 202 -229 -7 234 -189 -66
2879 -66 254 -148 -132 258 -84 -177 244 -26 -213 219 40 -231 178 78 -235 140 128 -237 92 166 -207 46
2901D6J48l80J93K02l84J36K48l49M9L20l35k5L53k91j11L91k28j93M03j60k64
2922b31L90o0l43L46M4l77K92J30m00K13K29m01J20K79l62K9L34l06o3L44k36
2943b9j40L62j80j96L45j07k49L21l5l01L04K5l26K68Q9l35K12J47l58J66K13
2964A96l61R8K91l46QL32l01p5L77k44j57L72j58k34L51o3l02L19K7l28K60J01
2986A63l50J97J84l46J18K29l28N7K61k82nK92k49p8L27k14j40L27j54j95L36
3007A50q7k66L31k0l14K88N4l30K22J38l54J76J98l38R2K75l30J1L19k84n7L23
3029A97k21j31L21j51k03L33q5k54L01k1k73K55M3k83J96J15k94J39J66k88Q7
3050e1K27k88K1K70k59j5K69k11j02L11j82j48L15j23k14L08m2k75K92J7l14K50
$$ plain form
2901 46 194 -186 7 209 -175 -39 209 -140 -91 229 -106 -131 222 -69 -180 211 -17 -210 193 33 -231
2922 -231 159 99 -244 102 146 -231 61 191 -209 4 233 -168 -48 231 -131 -102 232 -74 -137 207 -29
2943 -29 -169 193 13 -183 162 55 -194 127 92 -209 95 120 -206 62 151 -184 28 175 -183 -17 196
2964 196 -165 -67 224 -122 -114 218 -83 -158 219 -25 -182 190 32 -202 149 86 -216 103 130 -198 62 163
2986 163 -187 10 194 -152 -34 195 -133 -76 185 -97 -102 190 -59 -137 190 -24 -164 163 9 -186 150
3007 150 63 -203 128 108 -206 82 136 -194 28 166 -188 -12 186 -152 -60 215 -115 -104 215 -69 -126 197
3029 197 -24 -155 166 15 -188 145 60 -194 107 86 -187 68 111 -172 24 139 -155 -16 150 -138 -51
3050 -51 176 -112 -91 179 -80 -95 174 -37 -139 172 -10 -158 157 34 -180 128 86 -189 103 120 -194 56
3072E6R7l31J87J68l35J23K28l13K6K80k64l2K90k33q9L04j69j45K89j05j84K61
3094A09n3k04K29Pk44K20M5k64J93J14k89J47J55k84Q8K06k81L5K64k79k7L10
3116A97k32j13L23j56j94L07p8k47K84Rk92K44Q5l07J86J31l04J37J76k79P9J90
3138A46k44K7K24k16k0K25j86o2K54j62j13K57j17j45K52q0k00K66k7k43K33M7
3160A16k85J97J22l08J35J96l08O8K35k52k5K81k24q7K88j59j47K80q6k08K68
3181I7m2k07K33lk30K01O0k44J68Q5k42J33J30k61J09J75k68P4J88k53K5K35k23
3204f0m9K65j84j14K80j29j68K73o0k27K56Qk64K13P4k64J47J43k68R3J96k60
3226i9L1K21k16k5K26j80n5K21j44r5K45j30j22K26p5j58K17k7k01K22pk26K12
$$ plain form
3072 56 153 -178 9 177 -158 -35 193 -120 -94 186 -78 -110 180 -53 -142 162 -7 -152 137 32 -152 109
3094 109 56 -148 81 88 -156 64 109 -155 38 152 -137 10 165 -119 -31 175 -106 -71 193 -86 -113 197
3116 197 -35 -148 175 19 -175 132 54 -193 91 100 -192 52 137 -170 16 147 -157 -20 156 -123 -44 146
3138 146 -98 -71 153 -63 -83 142 -44 -106 148 -14 -127 130 13 -132 120 40 -160 106 79 -164 69 116
3160 116 -169 28 150 -158 -23 173 -135 -67 168 -84 -109 172 -52 -139 149 -10 -157 123 37 -171 97
3181 97 55 -152 81 78 -152 49 109 -135 33 118 -124 9 139 -122 -13 162 -106 -32 156 -97 -72 163 -60
3204 -60 -109 156 -28 -142 138 9 -159 114 54 -173 83 91 -173 40 114 -150 -3 140 -128 -35 161 -99
3226 -99 -68 153 -63 -88 138 -42 -97 124 -20 -115 130 0 -122 104 29 -129 88 61 -140 82 75 -151 61
3249F1N6k72J68J21k63J09J65k52M2K32k56lK52k08p9K79j50j47K65p8j91K35
3271H6j1k14K09L0k26J60O6k18J31J03k26J08J20k13O2J69k22K9K03k10j2K15
3293A39j86o5K56j61j28K69j01j82K67m5k28K38L0k68K00R6k70J26J53k52P3J83
3315A44k29J9K03j86l5K29j67p6K17j20j04K08q9j31K23o8j71K12j8j94J96K3
3337H6k26J67Q8k48J29J39k61R0J78k32RK46k10o7K57j65j12K52j03j52K36n1
3359E0j97K20Ok13J91M0k28J51Q9k10J08J11k05O4J46k25N9J74j95j0K04j81l7
3382h8K25j62q5K24j13j37K31n1j89K21Mk23K05M6k44J45J31k58R5J78k46M3J93
3405A45k01k4K16j55p2K23j26j04J98p5j30J97n1j54J83k0j66J71J3j77J41N3
$$ plain form
3249 61 117 -155 13 134 -129 -20 145 -107 -65 167 -89 -92 160 -48 -127 152 2 -145 120 42 -149 86
3271 86 75 -139 70 100 -126 34 100 -118 13 116 -110 -2 118 -95 -33 136 -86 -57 146 -64 -76 139
3293 139 -47 -112 144 -17 -145 124 23 -159 108 63 -165 73 103 -165 35 131 -139 -13 140 -112 -39 144
3315 144 -85 -66 137 -49 -84 145 -22 -98 119 -1 -105 103 14 -117 106 38 -133 79 61 -133 63 86
3337 86 -140 27 115 -133 -4 135 -126 -36 142 -90 -81 165 -45 -112 145 -20 -132 120 17 -135 101 50
3359 50 -147 73 79 -134 57 97 -131 20 109 -101 7 118 -87 -23 123 -102 -43 131 -64 -74 130 -51 -88
3382 -88 137 -25 -110 114 1 -136 95 44 -145 76 80 -143 62 108 -136 9 140 -118 -23 155 -91 -48 145
3405 145 -56 -80 136 -19 -91 132 6 -98 100 25 -105 92 41 -113 70 50 -116 55 68 -109 32 85
3427H5k03J23J03k19R1J61k27L2J96k11k0K38j77q6K49j28j24K20n8j70K15j1
3449G9k04J71N5k14J36Q8k04R6J08j90M3J48j81K5J49j48j3J65j43l1J66j29o1
3472h9J86q7j28K12n6j70K12j1j97J75N1k17J39J02k32R1J46k09L9J88k01j6J94
3495A22j47n6J84j01j00J79n7j15J52k5j32J48qj47J51J5j65J21N7j73J00R2j93
3518i8P4J30j84L1J66j83k2K23j57p9K12j03j31K17m9j67J81Qk00J71L9j74J15
3541B0Q0j94P7J21j77M3J24j55J4J39j39k0J64j27m4J58r7p5J70p9j02J80m1j38
3565i8J53J1j76J56M2j95J12Q9j92P6J35j86J5J75j52l7J87j28p8J82r7r3J70
3588G1m9j20J50k7j27J46Jj47J27M1j62R7P2j65P2J11j59L7J34j60KJ64j49l5
$$ plain form
3427 85 -118 5 108 -111 -20 141 -86 -54 142 -69 -89 149 -28 -114 135 7 -117 103 45 -125 90 79
3449 79 -125 46 101 -113 23 111 -93 3 111 -79 -36 112 -69 -44 105 -43 -56 109 -34 -65 101 -28 -89
3472 -89 97 10 -118 94 38 -132 80 69 -128 47 98 -119 20 122 -110 -19 127 -82 -43 145 -56 -72 122
3495 122 -25 -81 103 2 -98 81 24 -91 61 36 -96 52 44 -103 48 63 -102 19 76 -97 3 95 -98
3518 -98 -24 106 -78 -47 119 -64 -86 137 -20 -99 113 10 -121 96 47 -120 61 69 -131 40 79 -95 20
3541 20 100 -94 -17 104 -73 -30 94 -61 -47 92 -47 -67 97 -30 -74 84 -13 -88 82 3 -99 81 40 -98
3565 -98 55 66 -110 46 88 -107 5 94 -98 -22 113 -73 -58 117 -35 -72 115 -13 -91 91 -6 -99 71
3588 71 22 -98 52 25 -102 44 45 -102 25 66 -96 1 73 -92 -20 91 -68 -31 103 -57 -55 109 -40 -75
3612g5J86j21o6J71q5j00J63m0j32J53lj44J27L2j60J06P3j69O1J05j53L4J26
3635H9j48lJ59j30m5J58r3p3J65o8j01J64m7j30J63qj52J32K8j53J13N1j57Q7
3659AQ9j67N9J12j53K4J35j51qJ68j43m3J59q2r4J65n8j15J54j2j41J36J6j54
3683a03J17O0j52O9Q4j57O4J04j43QJ43j41LJ38j19m7J54q5q0J51n2r8J49l3j22
3708h8J38Jj35J10M4j59R7P3j71Q4R6j56L5J12j39lJ48j25k7J43q9o5J55o8r5
3733h4J48m5j09J35%j26J16K5j42R6N7j44P2Q3j44M8J01j47K1J31j37oJ42j17
3757b6m9J57q9r2J72n7j08J40k0j22J37Rj46J10M6j53R0P3j37M8R9j40K6J18j29
3782d3RJ20j14j8J27r3n8J54q7o8J37n0j02J40j3j31J28J9j50J08O0j68Q2R0j55
$$ plain form
3612 -75 111 -10 -76 95 10 -90 73 33 -99 54 51 -93 34 66 -94 12 85 -84 -23 82 -71 -37 89
3635 89 -59 -62 97 -33 -78 80 -13 -86 79 11 -90 74 27 -103 60 52 -100 32 60 -93 20 71 -86 1
3659 1 90 -77 -18 94 -59 -35 100 -51 -59 109 -34 -77 82 0 -94 71 13 -102 52 40 -101 35 51 -103
3683 -103 14 74 -78 -9 75 -82 -18 86 -57 -49 94 -47 -44 94 -25 -72 82 -3 -83 68 16 -82 67 34 -88
3708 -88 50 51 -84 26 70 -89 8 81 -90 -6 90 -66 -31 81 -58 -61 87 -38 -65 78 -11 -76 79 11 -84
3733 -84 64 19 -90 45 45 -81 35 60 -82 14 71 -73 -1 82 -62 -14 87 -60 -39 92 -45 -51 91 -26
3757 -26 -75 82 -7 -99 73 16 -92 48 28 -94 43 52 -94 16 62 -91 -1 72 -65 -17 82 -58 -32 86 -43
3782 -43 -34 86 -28 -46 81 -12 -70 84 -3 -71 66 16 -86 54 41 -90 38 57 -93 15 75 -93 -11 79 -76
3807g6L7J20j33mJ39j16k8J50q8p5J48p9p1J34k9j02J26k1j02J08Oj23J06L1j40
3832h2R2M9j37Q8P5j42L6J13j49PJ44j34k8J52j00o8J55o5r7J67m3j29J34Qj32
3857h6J03L8j36Q1O8j34N9P7j27L8R1j10QJ14j15j3J16r4l2J28q8n1J34p4o8J29
3883E6m4j05J33Mj46J30L0j46P9P8j47N7J02j54L4J29j34kJ20j01m1J37p6o1J30
3908F2m6p3J14k5r4J04j4j00R3K2j04Q0K8j08O6N1j19N8P6j35L8J10j30kJ36j21
3934c3l7J39q6o1J43n2r5J42l5j07J11K2j35J01N5j49Q3O7j35M9Q3j02J3Q1q7
3959b5j5R9p9k0R6p2l7J04n3n4J11n0q1J18k2j01J07J2j23J04K6j15O3P5j24M2
3985a4R2j36J0J27j04k4J21p8m9J18n2o0J08l6q2J08k8p8R0J1r8P2K4j02P4M5
$$ plain form
3807 -76 -39 81 -52 -56 83 -33 -61 89 1 -74 74 -5 -76 58 29 -73 53 32 -70 38 44 -79 27 58 -82
3832 -82 10 59 -78 10 85 -57 -21 92 -57 -50 94 -40 -68 84 -16 -84 71 6 -91 76 33 -96 38 46 -86
3857 -86 17 55 -81 0 68 -66 -7 70 -57 -19 72 -38 -30 84 -31 -44 72 -22 -54 74 -14 -65 69 -5 -73 56
3883 56 12 -93 40 44 -102 28 58 -88 -9 69 -78 -21 81 -73 -39 90 -44 -46 74 -27 -68 69 -7 -68 62
3908 62 16 -57 57 32 -62 42 28 -72 21 43 -61 19 47 -61 5 56 -63 -5 71 -64 -26 84 -46 -48 88 -33
3934 -33 -70 69 -17 -78 65 13 -82 60 25 -82 29 51 -84 17 72 -77 6 73 -62 -13 70 -32 -19 62 -25
3959 -25 -40 59 -20 -40 56 -16 -53 51 -2 -56 55 5 -76 42 20 -81 26 38 -85 19 45 -70 -7 68 -56 -14
3985 -14 78 -58 -48 79 -25 -49 72 -6 -55 63 11 -49 59 23 -59 49 21 -57 33 44 -54 18 42 -60 14 59
4011E9j11N3N8j10L9P2j09K0J03j09rJ03p0n5J19n8o7J27k6r3J06lj11R1L8j18
4037f1O3N8j16N1O9j05K0Q6r7rJ00p6l0Q8n0m0R6m8n2Q7k6o1P9rq4R0Lp9O9L0
4067D6j00N9L4r0L6P3r5PJ02r6j9R5o7k5R9o0m7R2l2o9R3kq9P4J6r0O2K9p8K6
4097a6N4p7K2N9p7lP2p2pQ9p2j8Q4m9l5Q5l0o6Q7j1p5Q8qq2O3L9j05O5L9p9L7
4128AN4r5K0P3q3JP6p8j6R5n6l9Q5k5p3Q6jp0N6K1p8N7J5o8L8M5r5M3N8p6NP4
4160E0p6nQ0o5j8R2n9m7R5l6o7Q7j7o8Q1lp6P3J8r6N2N0r3L8O5r5J0P6o6k5R6
4191E1o3l4Q3n3l0Q4l4n0Q3j2p9Q0J7q6N3K3p3L9M1p8M0L6p5J9P0p2oP3o4j9Q0
4222D4o3j8Q4n4m5R1l6o1Q1%p7P6J8r6N8L6r0M5N0q4L2O6q1rQ0o3j8P4n5j6Q0
$$ plain form
4011 59 -52 1 59 -51 -12 60 -49 -29 74 -35 -44 59 -11 -66 53 -5 -72 55 29 -64 42 39 -72 19 57 -61
4037 -61 2 60 -56 -5 64 -41 -21 65 -32 -41 59 -17 -47 41 -9 -49 47 -1 -53 34 8 -53 26 17 -67 23 26 -53 16 46
4067 46 -54 5 39 -51 -15 58 -37 -30 72 -24 -43 52 -15 -40 59 -1 -48 44 12 -57 36 34 -55 19 35 -55 7 36 -42 -16
4097 -16 38 -39 -17 42 -35 -38 34 -38 -45 44 -28 -46 38 -11 -46 39 9 -57 30 19 -56 32 24 -58 5 44 -61 4 43 -36 1
4128 1 55 -40 -20 53 -30 -29 47 -31 -47 48 -8 -47 38 13 -60 26 25 -45 11 32 -46 11 26 -42 -4 41 -54 -11 47 -29 -24 50
4160 50 -26 -31 49 -16 -34 58 -1 -48 47 11 -56 31 14 -54 27 24 -52 21 39 -57 -5 45 -48 -10 55 -40 -30 46 -20 -45 51
4191 51 -12 -46 37 -16 -46 38 4 -46 37 25 -54 26 43 -43 10 33 -40 -1 40 -38 2 38 -37 -18 52 -20 -26 47 -17 -36 44
4222 44 -19 -37 47 -7 -52 39 3 -58 23 23 -54 22 40 -56 2 38 -52 -7 43 -41 -9 57 -24 -33 47 -16 -34 40 -15 -31 49
4253D9l8m5P5k2o2P4j0p4O5J6o8O2kp1O1J9p4L9N0q6K3Q1r2JP9o9k4J07n8n5R6
4284D7l8o3R4j5q0Q8oq1P0K0p2L8M5q7K8N2p3K3N4o5nO6n7j4P1n9k4Q3n5k8P7
4315C4k8n5Q7l4o5Q9mq0O7K4r0N0M6r0M3O2j00J9P7q1j1R3o2l7R1m5m5R1m1m6
4345d1O6j8m9O5j5n9O2J0o6N4K0p9L8L7o2K3N3q1L0N3p9PP8p4j3R1p0l3R9l6o2
4376e1R1k2p3P9J2q0N2M3j03M2N3p5K3M0n0J8M7n8j7O9o5KO5o3k4Q6n8k2P3m0
$$ plain form
4253 49 11 -34 41 19 -43 31 21 -53 12 28 -40 22 20 -51 10 29 -45 -6 44 -42 -19 62 -30 -29 50 -19 -43 64 6 -49 47
4284 47 9 -54 40 25 -55 33 27 -54 16 36 -36 2 47 -40 -12 40 -33 -10 44 -21 -26 40 -17 -31 40 -19 -43 40 -15 -43 34
4315 34 6 -49 38 4 -61 28 24 -56 11 35 -55 -5 41 -49 -6 56 -44 -25 52 -29 -40 53 -9 -46 45 0 -45 46 5 -41
4345 -41 25 7 -42 23 8 -51 11 21 -45 9 29 -50 -12 25 -37 -14 39 -42 -12 41 -38 -31 47 -27 -40 51 -19 -52 47 11 -51
4376 -51 40 18 -55 24 36 -44 8 51 -52 -10 43 -32 -9 31 -19 -1 46 -12 -29 40 -25 -23 42 -21 -45 41 -17 -39 34 -6
$$ [...]
8191A5
##END NTUPLES=NMR FID
##END=
