##TITLE=1H_IG-160cyclo90
 CDCl3
 8 sc, 
 16.02.2022
##JCAMPDX= 6.0         $$ Bruker NMR JCAMP-DX V2.0
##DATA TYPE= NMR FID
##DATA CLASS= NTUPLES
##ORIGIN= UXNMR, Bruker Analytische Messtechnik GmbH
##OWNER= root
$$ XWIN-NMR		Version 3.5
$$ Wed Feb 16 12:12:58 2022 Russian Standard Time (UT+4h)  she@DPX200
##.OBSERVE FREQUENCY= 200.131346
##.OBSERVE NUCLEUS= ^1H
##.DELAY= (6, 6)
##.ACQUISITION MODE= SIMULTANEOUS
##.ACQUISITION SCHEME= undefined
##.AVERAGES= 8
##.DIGITISER RES= 18
##SPECTROMETER/DATA SYSTEM= spect
##.PULSE SEQUENCE= zg30
##.SOLVENT NAME= CDCl3
##.SHIFT REFERENCE= (INTERNAL, CDCl3, 0, 15.7039)
##AUDIT TRAIL= $$ (NUMBER, WHEN, WHO, WHERE, WHAT)
$$ ##TITLE= Audit trail, XWIN-NMR		Version 3.5
$$ ##JCAMPDX= 5.01
$$ ##ORIGIN= Bruker BioSpin GmbH
$$ ##OWNER= she
$$ F:/spectra/data/she/nmr/H-F/1/audita.txt
$$ ##AUDIT TRAIL=  $$ (NUMBER, WHEN, WHO, WHERE, WHAT)
(   1,<2022-02-16 12:09:36.45 +0400>,<she>,<DPX200>,
      <created by zg, POWCHK disabled, PULCHK disabled
       configuration hash MD5:
       00 E9 B6 7A A2 85 ED C7 34 08 36 98 17 FE 4E 26
       data hash MD5: 16K
       4A 64 E5 69 5A 4B C8 D6 0B F4 E4 F6 26 BB 73 A0>)
$$ ##END=
$$ 
$$ hash MD5
$$ 4E FC 89 85 D0 28 B4 F2 BD C2 56 BF 54 88 41 14
##$RELAX= 
##$RELAX= 
##$RELAX= 
##$RELAX= 
##$RELAX= 
##$RELAX= 
$$ Bruker specific parameters
$$ --------------------------
##$DU= <F:/spectra>
##$EXPNO= 1
##$NAME= <H-F>
##$PROCNO= 1
##$TYPE= <nmr>
##$USER= <she>
##$AMP= (0..31)
100 100 100 100 100 100 100 100 100 100 100 100 100 100 100 100 100 100 
100 100 100 100 100 100 100 100 100 100 100 100 100 100 
##$AQSEQ= 0
##$AQ_mod= 1
##$AUNM= <au_zg>
##$AUTOPOS= <>
##$BF1= 200.13
##$BF2= 200.13
##$BF3= 200.13
##$BF4= 200.13
##$BF5= 200.13
##$BF6= 200.13
##$BF7= 200.13
##$BF8= 200.13
##$BYTORDA= 1
##$CFDGTYP= 0
##$CFRGTYP= 5
##$CHEMSTR= <none>
##$CNST= (0..31)
1 1 145 1 1 1 1 1 1 1 1 1 1 1 1 1 1 1 1 1 1 1 1 1 1 1 1 1 1 1 1 1 
##$CPDPRG= <>
##$CPDPRG1= <>
##$CPDPRG2= <>
##$CPDPRG3= <>
##$CPDPRG4= <mlev>
##$CPDPRG5= <mlev>
##$CPDPRG6= <mlev>
##$CPDPRG7= <mlev>
##$CPDPRG8= <mlev>
##$CPDPRGB= <>
##$CPDPRGT= <>
##$D= (0..31)
0 1.2 0 0 0 0 0 0 0 0.06 0 0.03 0 0 0 0 0.0002 0 0 0 0 0 0 0 0 0 0 0 0 
0 0 0 
##$DATE= 1644998975
##$DBL= (0..7)
120 120 120 120 120 120 120 120 
##$DBP= (0..7)
150 150 150 150 150 150 150 150 
##$DBP07= 0
##$DBPNAM0= <>
##$DBPNAM1= <>
##$DBPNAM2= <>
##$DBPNAM3= <>
##$DBPNAM4= <>
##$DBPNAM5= <>
##$DBPNAM6= <>
##$DBPNAM7= <>
##$DBPOAL= (0..7)
0.5 0.5 0.5 0.5 0.5 0.5 0.5 0.5 
##$DBPOFFS= (0..7)
0 0 0 0 0 0 0 0 
##$DE= 6
##$DECBNUC= <off>
##$DECIM= 32
##$DECNUC= <off>
##$DECSTAT= 4
##$DIGMOD= 1
##$DIGTYP= 9
##$DL= (0..7)
0 120 120 120 120 120 120 120 
##$DP= (0..7)
150 150 150 150 150 150 150 150 
##$DP07= 0
##$DPNAME0= <>
##$DPNAME1= <>
##$DPNAME2= <>
##$DPNAME3= <>
##$DPNAME4= <>
##$DPNAME5= <>
##$DPNAME6= <>
##$DPNAME7= <>
##$DPOAL= (0..7)
0.5 0.5 0.5 0.5 0.5 0.5 0.5 0.5 
##$DPOFFS= (0..7)
0 0 0 0 0 0 0 0 
##$DQDMODE= 0
##$DR= 18
##$DS= 0
##$DSLIST= <SSSSSSSSSSSSSSS>
$$ [...]
##$SUBNAM2= <"">
##$SUBNAM3= <"">
##$SUBNAM4= <"">
##$SUBNAM5= <"">
##$SUBNAM6= <"">
##$SUBNAM7= <"">
##$SUBNAM8= <"">
##$SUBNAM9= <"">
##$SW= 18.0517287032376
##$SWIBOX= (0..15)
0 0 2 0 0 0 0 0 0 0 0 0 0 0 0 0 
##$SW_h= 3612.71676300578
##$TD= 16384
##$TD0= 1
##$TE= 0
##$TE2= 300
##$TE3= 300
##$TEG= 300
##$TL= (0..7)
0 120 120 120 120 120 120 120 
##$TP= (0..7)
150 150 150 150 150 150 150 150 
##$TP07= 0
##$TPNAME0= <>
##$TPNAME1= <>
##$TPNAME2= <>
##$TPNAME3= <>
##$TPNAME4= <>
##$TPNAME5= <>
##$TPNAME6= <>
##$TPNAME7= <>
##$TPOAL= (0..7)
0.5 0.5 0.5 0.5 0.5 0.5 0.5 0.5 
##$TPOFFS= (0..7)
0 0 0 0 0 0 0 0 
##$TUNHIN= 0
##$TUNHOUT= 0
##$TUNXOUT= 0
##$USERA1= <user>
##$USERA2= <user>
##$USERA3= <user>
##$USERA4= <user>
##$USERA5= <user>
##$V9= 5
##$VALIST= <valist>
##$VCLIST= <CCCCCCCCCCCCCCC>
##$VD= 0
##$VDLIST= <DDDDDDDDDDDDDDD>
##$VPLIST= <PPPPPPPPPPPPPPP>
##$VTLIST= <TTTTTTTTTTTTTTT>
##$WBST= 1024
##$WBSW= 4
##$XGAIN= (0..3)
0 0 0 0 
##$XL= 0
##$YL= 0
##$YMAX_a= 1017303
##$YMIN_a= -982757
##$ZGOPTNS= <>
##$ZL1= 120
##$ZL2= 120
##$ZL3= 120
##$ZL4= 120
##$ABSF1= 10
##$ABSF2= 0
##$ABSG= 5
##$ABSL= 3
##$ALPHA= 0
##$AQORDER= 0
##$ASSFAC= 0
##$ASSFACI= 0
##$ASSFACX= 0
##$ASSWID= 0
##$AUNMP= <proc_1d>
##$AZFE= 0.1
##$AZFW= 0.1
##$BCFW= 1
##$BC_mod= 2
##$BYTORDP= 1
##$COROFFS= 0
##$CY= 11.3945322036743
##$DATMOD= 1
##$DC= 2
##$DFILT= <>
##$DTYPP= 0
##$F1P= 2.36226072786647
##$F2P= -0.459571619588291
##$FCOR= 0.5
##$FTSIZE= 0
##$FT_mod= 4
##$GAMMA= 1
##$GB= 0.15
##$INTBC= 1
##$INTSCL= 1
##$ISEN= 128
##$LB= 0.24
##$LEV0= 0
##$LPBIN= 0
##$MAXI= 10000
##$MC2= 0
##$MEAN= 0
##$ME_mod= 0
##$MI= 1.114404
##$NCOEF= 0
##$NC_proc= 0
##$NLEV= 6
##$NOISF1= 3.799351
##$NOISF2= 2.8
##$NSP= 1
##$NTH_PI= 0
##$NZP= 0
##$OFFSET= 15.70392
##$PC= 1
##$PHC0= -16387.02
##$PHC1= 11.20078
##$PH_mod= 1
##$PKNL= yes
##$PPARMOD= 0
##$PSCAL= 0
##$PSIGN= 0
##$REVERSE= no
##$SF= 200.130013532006
##$SI= 16384
##$SIGF1= 3
##$SIGF2= 2
##$SINO= 400
##$SIOLD= 16384
##$SREGLST= <1H.CDCl3>
##$SSB= 0
##$STSI= 0
##$STSR= 0
##$SW_p= 3612.71676300578
##$SYMM= 0
##$S_DEV= 0
##$TDeff= 0
##$TDoff= 0
##$TI= <>
##$TILT= no
##$TM1= 0
##$TM2= 0
##$TOPLEV= 0
##$USERP1= <user>
##$USERP2= <user>
##$USERP3= <user>
##$USERP4= <user>
##$USERP5= <user>
##$WDW= 1
##$XDIM= 8192
##$YMAX_p= 0
##$YMIN_p= 0
$$ End of Bruker specific parameters
$$ ---------------------------------
##NTUPLES= NMR FID
##VAR_NAME=  TIME,          FID/REAL,        FID/IMAG
##SYMBOL=    X,             R,               I
##VAR_TYPE=  INDEPENDENT,   DEPENDENT,       DEPENDENT
##VAR_FORM=  AFFN,          ASDF,            ASDF
##VAR_DIM=   8192,          8192,            8192
##UNITS=     SECONDS,       ARBITRARY UNITS, ARBITRARY UNITS
##FACTOR=    0.0002768,     1,               1
##FIRST=     0,             0,               0
##LAST=      2.2672688,     0,               0
##MIN=       0,             -982757,         0
##MAX=       2.2672688,     1017303,         0
$$ Real data points
##PAGE= N=1
##DATA TABLE= (X++(R..R)), XYDATA
$$ [...]
2960d883O429K652p773J038P256m548n110O969J748p667J937O743n113m186P098
$$ -4883 1546 4198 -3575 -2537 4719 171 -4939 2030 3778 -3889 -1952 4791 -322 -4508 2590
2975B590P92p475K878N948n739l197P209l57p039L842N117o300k046P391j556
$$ 2590 3382 -4093 -1215 4733 -1006 -4203 3006 2649 -4390 -548 4569 -1731 -3777 3614 2058
2990B058o629M833M263o740j082P303k518o154N457L447p101p1P073l364n455
$$ 2058 -4571 262 4525 -2215 -3297 4006 1488 -4666 791 4238 -2863 -2934 4139 775 -4680
3005d680O041K503p152R68O764m254m613O489J427p176K083O159n203l695O970
$$ -4680 1361 3864 -3288 -2320 4444 190 -4423 2066 3493 -3683 -1600 4559 -644 -4339 2631
3020B631L53p173L207N634n930k763P307o64p020M119M990o499j923P428j689
$$ 2631 2984 -4189 -982 4652 -1278 -4041 3266 2602 -4418 -299 4691 -1808 -3731 3697 2008
3035B008o582M794M197o849r49P301k620n976N561L313p073J37P045l604n244
$$ 2008 -4574 220 4417 -2432 -3381 3920 1300 -4676 885 4198 -2875 -2738 4307 703 -4541
3050d541O115K258p234J182O707m541m496O661J352p322K244O195n128l755O987
$$ -4541 1574 3832 -3402 -2220 4487 -54 -4550 2111 3463 -3859 -1615 4580 -548 -4303 2684
3065B684L76p093L009N648n804k770P087p11o659L815M801o186j785P025j706
$$ 2684 3060 -4033 -1024 4624 -1180 -3950 3137 2426 -4233 -418 4383 -1803 -3588 3437 1731
3080A731o106M642L956o553o61O911k733n632N461K911o856L99O606l600m873
$$ 1731 -4375 267 4223 -2330 -2991 3920 1187 -4445 1016 3927 -2929 -2530 4076 476 -4397
3095d397N986J998o886J379O263m452m072O310J070o858K366N667n150l186O617
$$ -4397 1589 3587 -3299 -1920 4343 -109 -4181 2129 3199 -3659 -1293 4374 -776 -3962 2655
3110B655j14o500L232M994n683k241O844j095o289M157M316o204j309O846k082
$$ 2655 2541 -3959 -727 4267 -1416 -3657 3187 2092 -4197 -40 4276 -1928 -3237 3609 1527
3125A527n883M903L503o630l12O755k901n346N467K720o739N82O426l620m651
$$ 1527 -4356 547 4050 -2580 -2892 3863 962 -4384 1083 3803 -2936 -2354 4072 452 -4199
3140d199N841J728o670J464O047m453l848O292Q33o723K437N526n072l069O619
$$ -4199 1642 3370 -3300 -1836 4211 -242 -4090 2202 3035 -3688 -1251 4275 -797 -3866 2753
3155B753r9o536L217M976n620k278O705r50o274L934M304o050j337O635j855n720
$$ 2753 2654 -3882 -665 4311 -1309 -3587 3118 2168 -4106 -172 4132 -1918 -3255 3380 1525 -4195
3171d195M614L487o283l53O462k786n039N167K572o462N96O139l600m407N738
$$ -4195 419 3906 -2377 -2730 3732 946 -4093 1074 3646 -2816 -2220 3919 319 -4088 1650
3186A650J593o523J582N774m342l657O135O99o431K463N177m998k763O311l41
$$ 1650 3243 -3280 -1698 4076 -266 -3923 2212 2911 -3520 -1057 4120 -878 -3641 2670 2329
3201B329o141L256M582n457j929O383j187n756M025L790n856r06O350k174n316
$$ 2329 -3812 -556 4026 -1431 -3360 3023 1836 -3920 105 3895 -1961 -2867 3483 1309 -4007
3216d007M667L001o164m6O254l008m742N245K277o387R10N940l781m136N707J404
$$ -4007 660 3661 -2503 -2549 3705 697 -4045 1200 3477 -2910 -2000 3940 159 -3977 1730 3134
3232C134o377J736N525m461l355O067M01o259K630M971n034k499O240m94o017
$$ 3134 -3243 -1507 4018 -443 -3798 2269 2670 -3589 -959 4012 -1022 -3521 2719 2225 -3792
3247c792L448M345n568j573O296j459n669M155L692o014p62O328k275n187M784
$$ -3792 -344 4001 -1567 -3140 3156 1697 -3972 183 3875 -2139 -2901 3427 1152 -4035 749
3262G49K892o185J19O103l037m634N314K027o219R96N684l780l852N665J120o172
$$ 749 3641 -2544 -2425 3678 641 -3993 1321 3348 -2871 -1875 3809 29 -3823 1842 2962 -3210
3278c210J817N373m495l099N978J82o082K722M738n002k357O147o80n771L428
$$ -3210 -1393 3980 -515 -3614 2364 2546 -3536 -814 3924 -1078 -3435 2712 2032 -3739 -311
3293c11M076n378j504O182j557n335M125L412n755n65N917k278m865M764K493
$$ -311 3765 -1613 -3117 3065 1508 -3827 298 3710 -2045 -2610 3307 1029 -3836 928 3421
3308C421n882K74N757l113m251N197J661n950J206N428l912l530N602Q50n943
$$ 3421 -2461 -2187 3570 457 -3794 1403 3064 -2886 -1680 3748 -164 -3694 1908 2758 -3185
3323c185K007N013m490k824N814ln815K797M506n072j975N970q48n530L474L854
$$ -3185 -1178 3835 -655 -3479 2335 2332 -3483 -686 3820 -1252 -3227 2743 1895 -3635 -161 3693
3339C693n391j205N995j682n181M145L149n691l61N919k544m686M762K446n953
$$ 3693 -1698 -2903 3092 1410 -3771 374 3523 -2168 -2529 3390 846 -3840 922 3368 -2585
3354b585M64N726l185m153N189J669o038J255N380l887l448N505Q51n884J943
$$ -2585 -2121 3605 420 -3733 1456 3125 -2913 -1658 3722 -165 -3613 1892 2743 -3141 -1198
3369a198M922m356k845N781M4n665K642M419m834k134N832p88n353L382L656n119
$$ -1198 3724 -632 -3477 2304 2348 -3317 -675 3744 -1090 -3224 2608 1820 -3533 -151 3505 -1614
3385a614j230N737j495n039L962L079n388m63N688k344m519M531K244n522L50
$$ -1614 -2844 2893 1398 -3641 321 3400 -1988 -2451 3237 893 -3626 905 3149 -2373 -2023
3400b023N445l080l869M944J429n616J264N031l755l129N250N99n585K117M543
$$ -2023 3422 342 -3527 1417 2846 -2770 -1506 3525 -230 -3359 1891 2490 -3095 -978 3565
3415C565m306k479N529k53n402K923L952m777j702N594j038n083L525L445n260
$$ 3565 -741 -3220 2309 2056 -3346 -423 3529 -1248 -2950 2644 1606 -3477 48 3493 -1767
3430a767q55N673j857m704M077K735n387j51N457k590m176M610J942n556P57N219
$$ -1767 -2622 3051 1194 -3510 567 3302 -2085 -2236 3221 631 -3545 1065 3007 -2549 -1792 3427
3446C427l275l644N013J204n591J510M862l817l076N328M16n493K278M369m321
$$ 3427 152 -3492 1521 2725 -2866 -1356 3506 -311 -3387 1941 2357 -3136 -858 3511 -810
3461h10k309N433k88n303K874L890m750j593N518j073m971L488L205n024p94N425
$$ -810 -3119 2314 2026 -3277 -403 3487 -1263 -2856 2662 1589 -3382 106 3311 -1713 -2507 2918
3477B918j839m460L959K527n180n3N263k549l922M444J781n304P06M976l192l352
$$ 2918 1079 -3381 578 3105 -2075 -2128 3135 586 -3336 1108 2889 -2415 -1709 3267 75 -3277
3493c277M773J045n295J546M521l723k667M985K71n149K283M014m224k011N201
$$ -3277 1496 2541 -2754 -1208 3313 -410 -3077 1908 2179 -2970 -687 3327 -897 -2908 2293
3508B293n37m879K867L494m608j259N235j317m534L554K848m919n09N209k041
$$ 2293 1756 -3123 -256 3238 -1370 -2629 2606 1289 -3245 309 3157 -1762 -2271 2938 897
3523H97m195M060K170n130L61M972k733l702M458J517n219J070M746l331l057
$$ 897 -3298 762 2932 -2198 -1837 3135 402 -3300 1158 2675 -2544 -1474 3272 -59 -3116
3538c116M717Q46n260J732M377l873k495N068M5n090K498L769m231j801N147p05
$$ -3116 1601 2447 -2813 -1081 3296 -577 -3072 1996 2041 -3049 -551 3218 -1013 -2814 2333 1628
3554A628m782L077L245m580j076N133j399m443L526K742m861m27N055j988m071
$$ 1628 -3154 -77 3168 -1412 -2488 2645 1246 -3197 329 3071 -1790 -2217 2838 850 -3221
3569c221L962K101m968L24M768k567l568M317J419m955R41M540l207k980M636
$$ -3221 741 2842 -2126 -1802 2966 399 -3169 1148 2567 -2388 -1447 3093 -114 -3094 1542
3584A542P16m956J666M193l703k371M828Km772K347L657m153j598M886p03m560
$$ 1542 2258 -2698 -1032 3161 -542 -2913 1915 1917 -2855 -508 3149 -1004 -2602 2284 1581 -2979
3600b979K895L143m504r07M847j366m234L476K527m656k94M819k029l816L900
$$ -2979 -84 3059 -1445 -2352 2495 1129 -3105 371 2898 -1758 -2052 2767 738 -3078 822
3615H22J938m830L79M609k647l364M277J327m939J096M383l223k837M574O29m870
$$ 822 2760 -2070 -1691 2918 271 -3093 1184 2511 -2428 -1332 3051 -172 -3009 1565 2194 -2676
3631b676J754L993l643k267M772l8m750K373L524m048j592M836o63m507K858L103
$$ -2676 -922 3071 -572 -2839 1933 1895 -2855 -482 3042 -1006 -2598 2238 1575 -2932 -74 3029
3647C029m415r00M813j389m170L421K516m667l17M797j991l799L824J952m747
$$ 3029 -1386 -2286 2527 1138 -3032 389 2905 -1762 -2079 2718 727 -3072 752 2704 -2043
3662b043L72M508k578l275M175J243m818J129M225l121k717M469N05m685J734
$$ -2043 -1671 2837 259 -3016 1159 2402 -2416 -1287 2938 -183 -2900 1569 2074 -2611 -877
3677h77L829l576k087M650j71m515K308L430l926j530M726q86m255K862K914m328
$$ -877 2952 -624 -2711 1939 1768 -2747 -439 2991 -935 -2465 2261 1375 -2880 -18 2896 -1432
3693a432p48M655j490l914L301K354m480q6M504k075l567L807J763m669M66M414
$$ -1432 -2180 2475 985 -2929 372 2726 -1754 -1840 2664 589 -2978 829 2592 -2077 -1611 2803
3709B803k626l168M182J077m604J192M048l147k513M383L94m587J791L722l597
$$ 2803 177 -2991 1191 2268 -2336 -1144 2904 -243 -2756 1627 2021 -2566 -775 2947 -650
3724f50j984M549k02m434K355L289l925j378M613q90m233K954K760m200p65M641
$$ -650 -2634 1915 1713 -2721 -366 2923 -1002 -2380 2233 1343 -2890 64 2824 -1376 -2141 2500
3740B500j577l844L455K194m478q4M526k191l416L755J590m490O23M147k589k941
$$ 2500 923 -2921 534 2728 -1750 -1834 2692 501 -2915 840 2430 -2060 -1437 2710 121 -2820
3756b820M066R63m506J189L902l103k360M271K72m372J843L456l480j809M420
$$ -2820 1246 2209 -2297 -1108 2794 -309 -2669 1602 1874 -2498 -655 2801 -679 -2488 1932
3771A932l28m278K420L074l912j137M415r47l955K854K525m072n49M342j582l624
$$ 1932 1604 -2674 -254 2820 -1092 -2229 2186 1239 -2716 138 2663 -1409 -1958 2384 802 -2822
3787b822L370J941m248J59M125k110l183L639J428m321O63M005k609k790M014
$$ -2822 548 2489 -1759 -1600 2525 415 -2768 871 2299 -2022 -1359 2646 37 -2753 1261
3802A261Q20m401J314L745l073k235M193J86m265J836L379l506j602M290n04m014
$$ 1261 2081 -2320 -1006 2739 -334 -2569 1624 1810 -2455 -619 2760 -746 -2348 1942 1438 -2576
3818b576K377K889l810j005M299j055l807K882K445m105m20M224j599l535L317
$$ -2576 -199 2690 -1120 -2125 2174 1119 -2688 194 2639 -1466 -1886 2338 739 -2796 521
3833E21J917m181J53M119k165l075L646J289m247P09L936k631k608L924O75m231
$$ 521 2438 -1743 -1590 2529 364 -2711 935 2224 -2023 -1314 2622 -9 -2617 1307 1982 -2249
3849b249J375L543l051k083M076O2m085J945L113l393j585M210n05l968K430K715
$$ -2249 -874 2669 -382 -2465 1611 1673 -2412 -467 2646 -747 -2332 1878 1373 -2595 -165 2550
3865B550l633r76M231j050l715K837K278l922m07M083j588l315L215J730m030
$$ 2550 -1083 -2059 2172 1122 -2593 244 2522 -1400 -1807 2276 688 -2627 588 2318 -1712
3880a712K14L924k081k936L491J200m064P85L656k540k408L748N97m068J345L372
$$ -1712 -1498 2426 345 -2591 900 2100 -1964 -1179 2477 -63 -2471 1277 1874 -2194 -849 2523
3896B523k948j886L883L9l955J852L040l323j302L914n27l745K317K597l599q45
$$ 2523 -425 -2311 1572 1611 -2344 -492 2548 -775 -2077 1837 1310 -2435 -118 2479 -1120 -1965
3912a965M044j211l431K816K134l820k87L972j670l150L219J570l885K78L768
$$ -1965 2079 868 -2563 253 2387 -1433 -1720 2252 582 -2568 651 2221 -1664 -1386 2382
3927B382k184k749L532J032l922P99L560k548k285L686N79l952J316L288k960
$$ 2382 198 -2551 981 2013 -1909 -1110 2450 -98 -2383 1303 1882 -2070 -754 2534 -426
3942d26j885L931p0l807J803K921l232j353L877n11l679K307K593l559q69L983
$$ -426 -2311 1620 1550 -2257 -454 2467 -765 -2118 1759 1248 -2431 -124 2469 -1090 -1959 2024
3958B024j036l471K749K079l762l17L890j522l100L017J659l816K09L680j992
$$ 2024 988 -2483 266 2345 -1417 -1734 2156 634 -2466 551 2210 -1606 -1397 2283 291
3973B91k693L287J109l854P94L462k433k296L507N81l790J301L115k783j881L757
$$ 291 -2402 885 1994 -1860 -1066 2396 -37 -2333 1174 1755 -2035 -734 2381 -402 -2283 1474
3989A474ll678J785K816l047j367L733n15l450K167K424l322q42L726j032l213
$$ 1474 1471 -2207 -422 2394 -653 -2020 1713 1198 -2252 -85 2339 -983 -1825 1901 869 -2344
4005b344K592J938l548j63L629j517k938K948J467l646L39L518k033k596L262
$$ -2344 248 2186 -1362 -1525 2104 587 -2351 597 2064 -1582 -1243 2275 242 -2354 908
4020I08R30l652P69L333k387k136L487M17l663J287L062k789j698L643m2l558
$$ 908 1838 -1814 -1045 2288 -99 -2235 1252 1669 -1994 -707 2355 -434 -2132 1511 1469 -2089
4036b089J760K625l120j134L684o83l324K266K271l386o54L746j160l077K522
$$ -2089 -329 2296 -824 -1958 1726 1043 -2281 -15 2256 -1130 -1784 1962 802 -2275 247
4051B47J925l451k73L625j583k792K893J431l573L01L412j889k519L126J001l550
$$ 247 2172 -1279 -1552 2073 490 -2302 591 2022 -1551 -1250 2162 273 -2246 880 1881 -1669
4067a669O88L178k272k058L275M75l505J192K922k672j638L458q4l342J652K593
$$ -1669 -981 2197 -75 -2133 1142 1617 -1888 -696 2226 -446 -2084 1374 1290 -2052 -400 2193
4083B193k922j135L508n69l166K008K222l104o91L418r73k975K458J761l313p4
$$ 2193 -729 -1864 1644 1075 -2091 -83 2139 -965 -1656 1762 789 -2186 272 2033 -1280 -1354
4099a354L287j441k593K698J247l342L90L147j909k299L031P78l395R24K948k289
$$ -1354 1933 492 -2101 597 1844 -1498 -1108 2039 130 -2169 862 1640 -1755 -831 2117 -172
4115a72j905L263K74l371J361K703k617j451L346j84l247J728K418k914r72L335
$$ -172 -2077 1186 1460 -1911 -550 2153 -464 -1915 1431 1247 -2000 -272 2146 -768 -1740 1595
4131A595n96l063K107J967l053m63L338j150k841K545J586l233q2L332j627k512
$$ 1595 999 -2064 43 2010 -1043 -1506 1832 682 -2159 386 1972 -1261 -1343 1989 362 -2150
4147b150K750J257l434M89L136j928k239L004Q02l366Q73K867k179j861L062L73
$$ -2150 600 1857 -1577 -1088 2048 120 -2119 885 1687 -1679 -806 2061 -118 -1979 1083 1456
4163A456l328J295K619k548j381L159r3l107J722K267k842r36L303o62k982K173
$$ 1456 -1872 -577 2042 -506 -1887 1272 1179 -1928 -206 2061 -781 -1717 1586 924 -2058 115
4179A15J932l086m74L325j126k750K463J509l140p1L183j493k380K643J110l171
$$ 115 2047 -1039 -1513 1812 686 -2064 399 1908 -1232 -1303 1880 387 -1993 650 1760 -1411
4195a411M17K916j872k030K857O53l162Q86K733k265j633L087J05l099J425K420
$$ -1411 -994 1922 50 -1980 877 1530 -1632 -746 1987 -278 -1911 1176 1281 -1818 -393 2027
4211B027k577j186L164l59k978J766K136k753q73L154p13k796K147J766l000l09
$$ 2027 -550 -1736 1428 1069 -1909 -143 1993 -760 -1633 1521 808 -1988 159 1925 -1075 -1384
4227a384L135j170k576K445J379l095R3L051j657k188K700Q96l156O55K861k104
$$ -1384 1751 581 -1995 450 1829 -1266 -1173 1878 221 -1967 733 1629 -1527 -872 1989 -115
4243a15j809K873N21l174J015K684k265j591L073R4l093J354K465k631j181L204
$$ -115 -1924 949 1470 -1704 -689 1995 -270 -1861 1212 1306 -1787 -433 2032 -599 -1780 1424
4259A424l76k891J691K066k750p24L152p46k738K056J660k854l01L001j170k459
$$ 1424 1048 -1843 -152 1914 -836 -1560 1592 846 -1892 164 1824 -1030 -1331 1670 500 -1959
4275a959K390J388l109J74K942j584k178K648Q83l065N67K814j895j849K746M79
$$ -1959 431 1819 -1290 -1116 1826 242 -1936 712 1595 -1470 -903 1911 16 -1833 913 1392
4291A392l022R70K492k207j408K906m5k784J387K213k444j061K998m62k706J754
$$ 1392 -1630 -660 1832 -375 -1783 1123 1078 -1706 -319 1894 -550 -1611 1387 925 -1781 -27
4307b7J916k713o20L109r22k669K097J621k884k03K938j163k397K349J211k925
$$ -27 1889 -824 -1444 1665 743 -1926 171 1792 -1092 -1295 1643 480 -1917 432 1643 -1282
4323a282K49K852j654k004K555P87k918O51K549j932j610K761L31k928J038K481
$$ -1282 -1033 1819 165 -1839 716 1503 -1415 -764 1785 -147 -1757 1004 1335 -1593 -555 1926
4339A926k282j372K930o9k829J422K166k549r67K952l74k738J723J869k593o14
$$ 1926 -356 -1728 1202 1133 -1696 -274 1892 -657 -1624 1328 954 -1784 -61 1808 -785 -1399
4355a399K928q11k523J994J511k741j95K869j214k261K321J119k854K82K669j515
$$ -1399 1529 718 -1805 189 1700 -1041 -1236 1633 419 -1842 479 1598 -1256 -974 1695 180
4371A80j973K549O85k837O32K608j958j598K625M16k841J000K357k167j296K713
$$ 180 -1793 756 1441 -1396 -764 1844 -114 -1712 913 1329 -1512 -512 1845 -322 -1618 1095
4387A095M1k810J399K110k372r87K881n19k490J681J731k590m61K760q51k404
$$ 1095 1136 -1674 -275 1835 -537 -1524 1357 838 -1652 29 1760 -830 -1291 1469 618 -1786
4403a786K018J376k686j12K790j263k116K292J065k821L31K636j577j886K436
$$ -1786 232 1608 -1078 -1190 1600 337 -1779 513 1578 -1243 -912 1724 147 -1739 697
4418F97O89k805O66K404j741j583K569L27k709J006K239k109j184K687j33k635
$$ 697 1386 -1419 -753 1651 -90 -1673 896 1223 -1486 -480 1759 -350 -1534 1153 1020 -1615
4434a615J438J945k361q36K713m64k522J673J737k471n25K767q72k404K032J414
$$ -1615 -177 1768 -593 -1429 1284 820 -1702 -29 1708 -763 -1288 1479 607 -1797 235 1649
4450A649k655j30K667j192k049K149J023k652K71K519j486j803K395O24k694O99
$$ 1649 -1006 -1136 1531 339 -1710 439 1462 -1190 -919 1600 114 -1689 706 1330 -1364 -665
4466f65K350j822j456K581J98k655J032K214k136j165K632n8k586J306J973k284
$$ -665 1685 -137 -1593 988 1186 -1469 -437 1777 -359 -1524 1108 1050 -1536 -230 1743 -541
4482e41q44K628m59k373J527J704k392m69K548p34k307J979J227k509k1K526j208
$$ -541 -1385 1243 784 -1589 -62 1642 -750 -1219 1329 595 -1712 267 1494 -1015 -1036 1490 282
4499B82j973K183R19k545K97K444j537j684K351N50k637P52K231j734j529K558
$$ 282 -1691 492 1411 -1134 -837 1607 70 -1614 737 1287 -1350 -598 1633 -101 -1630 928
4515I28K05k518R52K053j989j084K529j16k446J303J786k197p41K557m70k418
$$ 928 1133 -1385 -433 1620 -369 -1453 1076 960 -1486 -183 1603 -594 -1335 1222 752 -1666
4531a666J738J476k417l41K592q14k212J907J255k509m5K511j181j946K112R39
$$ -1666 72 1548 -869 -1210 1382 568 -1644 263 1518 -991 -1036 1475 294 -1652 460 1399
4547A399k524K92K379j465j656K255N36k463O38K228j773j323K414K11k552J016
$$ 1399 -1125 -833 1546 81 -1575 680 1216 -1247 -609 1619 -154 -1477 937 1148 -1404 -388
4563c88K057k072j047K532j60k497J385J747k161p18K498m65k260J605J459k337
$$ -388 1669 -403 -1450 1082 922 -1575 -190 1557 -604 -1322 1176 711 -1549 56 1515 -822
4579h22l42K488q31k039J787J157k408mK463j175j770J979Q85k445L49K229j406
$$ -822 -1164 1324 493 -1546 241 1398 -1010 -1014 1449 274 -1496 483 1368 -1077 -728 1501 95
4596I5j589K247M76k527P35K188j795j271K358J30k447J058J907j938r85K403
$$ 95 -1494 753 1229 -1298 -563 1625 -170 -1441 917 1047 -1400 -342 1565 -373 -1358 1045
4612A045j62k420J384J745k185o92K497n83k172J574J437k299k69K406q56k035
$$ 1045 883 -1537 -153 1592 -593 -1285 1212 629 -1543 31 1468 -831 -1100 1306 450 -1585
4628a585J821J216k481J18K363j209j827K038Q55k439L09K322j448j633K244N13
$$ -1585 236 1452 -1029 -911 1452 243 -1584 454 1309 -1130 -821 1501 53 -1580 664 1177
4644A177k450P06K115j680j315K323J75k345R64J900j933j009K375j86k281J311
$$ 1177 -1273 -567 1548 -132 -1447 876 1051 -1294 -330 1570 -363 -1372 1003 817 -1464 -153
4660a53J655k123o17K434n60k082J568J316k207l29K411q64j988J760J176k291
$$ -153 1502 -621 -1238 1196 636 -1446 122 1438 -769 -1098 1313 449 -1539 221 1397 -894
4676h94K8K232j121j716J961P83k312L31K117j351j445K061M64k349O99J903j595
$$ -894 -866 1366 245 -1471 490 1273 -1039 -708 1409 58 -1387 674 1138 -1211 -512 1391 -204
4693b04j204K251J16k310J033J801j877r44K352j95k191J225J644k081o09K363
$$ -204 -1408 843 959 -1351 -318 1483 -394 -1338 1014 819 -1372 -147 1497 -584 -1193 1170
4709A170n59k083J517J332k112l02K241p65j909J775J016k245Q4K188j084j679
$$ 1170 611 -1472 45 1377 -735 -1037 1204 439 -1470 305 1321 -924 -840 1348 264 -1415
4725a415J930P34k354M30K061j388j444K069M28k255P03J935j612j239K242J08
$$ -1415 515 1249 -1105 -675 1386 -2 -1446 623 1051 -1204 -501 1434 -178 -1417 825 933
4741I33k223R72J756j741r99K203j20k147J183J572j949n42K129m04j979J436
$$ 933 -1290 -318 1438 -303 -1302 901 781 -1366 -183 1389 -560 -1102 1027 623 -1356 80
4757H0J324k125l08K265q00j868J684J017k165MK194j061j650J777Q42k223L58
$$ 80 1404 -721 -1029 1236 436 -1432 252 1269 -896 -892 1302 241 -1409 368 1210 -1013 -655
4774f55J976j286j360J960M27k170O14J878j559j100J978J98k138R42J669j753
$$ -655 1321 35 -1325 635 1062 -1108 -494 1384 -175 -1275 703 901 -1237 -295 1374 -379
4790c79q25K168k17k064J220J490j932n61K188m90j961J384J307j976l08K108
$$ -379 -1204 964 747 -1317 -97 1393 -539 -1100 1088 598 -1363 21 1328 -648 -956 1152
4806A152o89j807J578J038k068j3K158j157j548J793O83k104L21J953j283j323
$$ 1152 463 -1344 234 1272 -796 -809 1349 192 -1356 437 1120 -984 -663 1290 7 -1316
4822a316J920L85k109N76J837j462j117K033J55k140R25J682j668q55K068j92
$$ -1316 604 989 -1120 -544 1293 -169 -1286 747 902 -1238 -313 1369 -299 -1154 914 722
4838G22k014J188J408j770n85K063n25j780J387J221k026k01K086q15j653J604
$$ 722 -1292 -104 1304 -466 -1051 1012 487 -1293 94 1315 -711 -912 1174 359 -1294 310
4854C10Q85k003KK032j031j536J809O53k157L55K001j300j322J937L71k064O02
$$ 310 1195 -808 -806 1226 195 -1341 468 1121 -1036 -681 1320 20 -1302 635 1006 -1058 -456
4871d56J759j491j033J967J08k048R19J562j637p32J986k57j840J142J347j792
$$ -456 1303 -188 -1221 746 854 -1194 -275 1287 -350 -1082 904 647 -1193 -51 1296 -496
4887d96n07K098n68j822J394J126j898k11K063q23j640J563Q61j966R4J974j035
$$ -496 -1003 1095 527 -1295 99 1225 -673 -884 1179 356 -1284 279 1140 -826 -732 1242 207
4904B07j454J727O20k021L14J879j288j267J895L13j993O39J679j466r32J898
$$ 207 -1247 480 1100 -921 -607 1272 -16 -1283 612 925 -1068 -429 1250 -216 -1148 750
4920G50L0j954R15J567j661p31K004k28j932J188J320j788m47J978n35j723J328
$$ 750 780 -1174 -259 1308 -353 -1084 920 692 -1240 -52 1268 -520 -967 1011 476 -1247 81
4937H1J088j812k04J971p88j556J529P78j914J12J843j018j363J700N64j994L49
$$ 81 1169 -643 -847 1124 336 -1220 309 1087 -827 -715 1128 110 -1253 447 1011 -983 -634
4954f34J858j308j109J821L06k034P00J641j333j070J926j2j855Q67J473j583
$$ -634 1224 -84 -1193 628 934 -1100 -400 1241 -92 -1162 764 752 -1103 -236 1237 -346
4970c46o91J902k13j768J068J258j702m62J958n42j718J350J074j807j85J822
$$ -346 -1037 865 652 -1116 -48 1210 -492 -954 1004 462 -1256 94 1168 -639 -824 998
4986I98p29j513J525P80j861R9J838j016j363J690N27j867L42J709j157j141J700
$$ 998 269 -1244 281 1061 -800 -701 1137 121 -1242 448 975 -892 -550 1159 2 -1139 561
5003E61L11j889O34J522j315r28J858Oj817Q77J433j584p28J928k36j755J044
$$ 561 872 -1017 -383 1139 -176 -1104 754 760 -1057 -180 1253 -331 -1059 869 633 -1122 -78
5020g8J267j674m83J878m02j712J250J099j792j75J843p22j486J410Q38j859R5
$$ -78 1189 -485 -968 910 508 -1204 46 1145 -647 -822 1021 299 -1187 223 1061 -798 -703
5037g03J842r76j360J573N86j880L82J690j132j160J702K95j827N91J552j343
$$ -703 1139 163 -1197 376 962 -918 -536 1154 22 -1138 564 859 -968 -377 1175 -168
5053a68r60J884k3j811Q72J452j599o72J854k04j793J142J233j674m61J883m57
$$ -168 -1128 756 733 -1078 -206 1246 -353 -1025 829 625 -1168 -26 1207 -467 -928 955 498
5070D98j698J269J018j741j13J799p30j517J485P56j810R9J781r55j285J598M84
$$ 498 -1200 69 1087 -654 -767 1032 302 -1215 270 1026 -784 -685 1096 141 -1144 454 938
5087I38j828L34J667j194j015J666K68j814O36J521j413q70J834L3j833R48J231
$$ 938 -890 -556 1111 -83 -1098 568 836 -978 -342 1179 -234 -1104 730 763 -1070 -122 1109
5104A109j495o15J814k66j621J032J154j613l61J819n43j546J293R76j797j15
$$ 1109 -386 -1001 813 547 -1074 -42 1112 -501 -862 957 414 -1132 161 1137 -660 -775
5120g75J797q02j358J466O82j733R4J730r46j243J545M71j781L92J584j156j079
$$ -775 1022 220 -1138 328 1010 -723 -629 1101 155 -1088 457 928 -853 -461 1123 -33 -1112
5137a112J711J93j782O88J464j344q99J820l1j759Q71J337j489o16J774k92j651
$$ -1112 599 792 -990 -302 1162 -182 -1081 739 708 -1051 -180 1157 -332 -948 826 534 -1117
5154a117J106J134j652l39J794m58j611J288R23j700j46J803p57j402J389P44
$$ -1117 -11 1123 -529 -868 926 468 -1143 145 1068 -632 -778 1025 268 -1134 255 999
5170I99j805K14J706r84j275J615M60j792L86J616j188r98J642J98j764O43J512
$$ 999 -806 -592 1114 130 -1145 470 930 -862 -476 1140 -48 -1046 596 794 -970 -327 1185
5187A185j388q35J737l8j608P02J393j530n59J763l05j626J098J092j618l22J818
$$ 1185 -203 -1038 699 661 -947 -245 1148 -382 -941 822 517 -1109 -11 1081 -537 -859 959
5204I59n70j544J269Q78j672J8J658p75j347J426O69j725K29J573r48j167J534
$$ 959 389 -1155 114 992 -680 -662 996 221 -1126 300 969 -756 -527 1046 98 -1069 465
5221D65M21j752M37J528j211r15J603J51j693O79J415j364p64J719r1j654Q70
$$ 465 886 -866 -429 1099 -112 -1027 576 727 -966 -287 1128 -236 -1000 719 628 -1026 -156
5238a56J222j481n59J796l41j547J112J020j656j68J670n64j466J352Q19j673
$$ -156 1066 -415 -974 822 481 -1066 46 1066 -590 -758 912 348 -1118 234 1053 -620
5254f20r2J659p10j302J395N73j641J73J644j010j163J619K59j611M38J480j240
$$ -620 -712 947 237 -1065 330 903 -738 -565 1079 69 -1094 525 784 -827 -389 1091 -149
5271a49q50J627P1j675P28J293j278p11J692k02j566R26J131j449m86J721l93
$$ -149 -999 628 699 -976 -248 1045 -233 -944 748 546 -1020 -94 1037 -412 -898 823 430
5288D30j473J091R07j502k15J664o08j369J240Q05j643L3J557p19j260J401N27
$$ 430 -1043 48 955 -547 -762 902 294 -1075 165 970 -673 -640 917 198 -1062 339 866
5305H66j617K63J507r84j072J520L11j619M54J385j145q76J577Q3j555O76J226
$$ 866 -751 -488 1019 35 -1037 483 794 -825 -371 1014 -131 -1007 570 653 -902 -226 1000
5322A000j279o00J548j13j589R18J111j383m50J618l58j460J101Q87j490j61J514
$$ 1000 -279 -879 669 556 -1033 -115 996 -387 -837 781 423 -1037 64 951 -539 -700 814
5339H14n17j295J210P42j574j3J545p58j150J358M71j585K37J504j026r31J425
$$ 814 297 -998 212 954 -620 -633 912 154 -996 362 833 -752 -515 989 -37 -968 457
5356D57K49j555N00J371j099r09J563O5j582P60J154j241o30J583j70j469Q39
$$ 457 706 -849 -349 1022 -77 -986 577 642 -940 -180 974 -267 -897 686 516 -953 -114
5373a14J142j515k68J563l48j443J033R32j503j70J536n06j307J148O94j530M7
$$ -114 1028 -487 -755 808 460 -983 50 982 -521 -691 845 339 -968 180 874 -656 -609
5390f09J544q12j157J347M79j498K64J434r69j017J438K58j508M17J341j095q02
$$ -609 935 123 -1034 313 792 -706 -442 992 23 -994 444 702 -806 -389 952 -143 -945
5407i45J514P3j530O87J192j311n31J545j38j475Q61J078j444l21J491l06j406
$$ -945 569 642 -888 -201 991 -320 -851 694 556 -919 -58 1020 -424 -745 746 440 -966
5424i66R97R08j467j70J526n50j247J176P16j526kJ577q40j154J376M47j559K87
$$ -966 31 939 -528 -698 828 278 -969 207 923 -603 -605 972 132 -1022 354 801 -758 -471
5442d71J432r47r83J412K94j577M90J320j112p50J448N7j498P05J111j246n49
$$ -471 961 14 -969 443 737 -840 -350 970 -142 -892 556 613 -885 -180 931 -315 -864
5459h64J513r0j450Q36J008j337l95J570l67j340R99Q96j521j40J540n83j224
$$ -864 649 559 -891 -55 953 -384 -779 791 424 -916 83 979 -542 -682 858 275 -949
5476i49J170O61j499N6J445p69j095J297M88j511K65J381r66q96J382K82j582
$$ -949 221 882 -617 -561 884 115 -980 317 805 -706 -441 940 -26 -922 460 742 -840
5493h40N11J244j125o95J458N9j453O63J102j137n40J467j41j453Q27R95j280
$$ -840 -329 915 -210 -905 553 612 -841 -178 924 -213 -753 714 573 -880 -53 942 -338
5510c38l92J476l43j361J025Q29j378k18J514n19j273J159O08j357O5J420q18
$$ -338 -730 746 403 -958 67 896 -482 -700 814 295 -978 181 789 -568 -503 917 99
5527I9j102J317M39j454K83J295q72r37J369K66j486M83J202j012p62J410J15
$$ 99 -1003 314 753 -701 -418 877 5 -932 437 703 -783 -300 902 -110 -872 538 653
5544F53j454O24J045j084o04J438p1j412P76R64j218l47J422l13j303R60Q07j353
$$ 653 -801 -177 868 -216 -820 618 547 -865 -89 875 -343 -690 732 419 -884 76 883 -470
5562d70j58J425n26j211J129O19j352l5J436p42j073J233N17j488K61J306q32
$$ -470 -628 797 271 -940 189 808 -544 -579 857 115 -958 275 792 -696 -435 871 39
5579C9r40J272K85j388L79J247r48p91J342Q2j383N76J143j182n46J423p3j400
$$ 39 -901 371 656 -732 -353 894 -54 -845 497 579 -804 -228 915 -267 -813 610 537 -863
5597h63P63J009j236m10J493l91j259R30Q30j286k13J365m75j219J089O60j371
$$ -863 -100 909 -327 -737 756 365 -894 36 866 -420 -633 732 257 -962 127 787 -584
5614e84M0J407p06j081J163N00j380K35J304q56r34J298K74j385L42J276r78p46
$$ -584 -544 863 157 -924 239 739 -641 -406 898 42 -892 406 680 -705 -363 913 -65 -811
5632h11J306P1j356N54J135j136n54J421j17j330P01R85j250l31J386l08j262
$$ -811 495 566 -790 -236 899 -237 -791 630 513 -817 -116 869 -381 -712 674 366 -896
5649h96R28Q50j316j80J359n49j099J080O32j409M6J358o85r92J113N15j424K65
$$ -896 32 882 -434 -614 745 196 -903 177 809 -600 -554 804 119 -873 240 755 -669 -404
5667d04J255q36q95J321K09j378M11J162r01p33J304Q1j354N54J017j093n16J397
$$ -404 851 15 -880 441 650 -728 -317 845 -56 -789 515 596 -758 -204 813 -280 -796 601
5685F01j27j244P16Q90j142l85J403k83j280R17P54j284q5J257m22j150J005N90
$$ 601 474 -770 -54 836 -306 -691 712 429 -851 66 820 -464 -549 708 286 -864 141 731
5703G31j256M5J224o02r68J076M51j347K37J227q22q24J216K39j295M11J088r37
$$ 731 -525 -480 744 142 -826 250 701 -646 -409 818 -4 -828 388 627 -668 -257 831 -106
5721a06o91J353k4j276N49J045j086m85J364k13j163O49Q56j140k70J305l57j126
$$ -106 -797 556 532 -744 -195 850 -236 -721 643 430 -733 -84 772 -368 -638 667 310 -816
5739h16Q54P60j293j24J281m22j010R69M98j229M1J223n96r27J062M34j330K46
$$ -816 38 798 -495 -619 662 240 -770 199 697 -532 -491 732 136 -791 271 705 -625 -379
5757c79J144p71p17J169J89j323M13J101r09o45J195O7j271N95R51j023n58J316
$$ -379 765 -6 -723 446 635 -688 -275 826 -83 -728 467 534 -737 -142 809 -214 -772 544
5775E44j24j233P43Q97j172l15J247k82j109R04O49j207j01J239m87j038J007
$$ 544 420 -813 -70 827 -345 -660 587 305 -804 100 749 -458 -559 680 193 -845 162
5792A62N69j259Q5J213o53q35R45M14j237K22J155p78p71J117K51j267M28J055
$$ 162 731 -528 -443 770 117 -718 227 641 -596 -374 781 3 -768 349 600 -667 -239 816
5810H16r37o05J214J1j222O00Q94r82m79J194j01j221P45Q27j097k99J223k83
$$ 816 -121 -726 488 499 -723 -123 771 -211 -690 504 403 -818 -73 754 -343 -642 581 298
5828B98j100Q84O62j192l3J157m80r58R24N49j165rJ230o61q81J048L68j226K77
$$ 298 -802 82 744 -448 -481 676 196 -762 162 711 -454 -463 767 106 -775 273 641 -585 -308
5847c08J035o64q31J158J95j219L50J082r45o12J250k2j233O32Q56r88m39J236
$$ -308 727 63 -768 390 585 -634 -284 798 -147 -759 491 469 -764 -132 724 -264 -703 533
5865E33j54j125P31P73j093k58J226l33j009P13P00j113j01J132m07j016R61M96
$$ 533 379 -746 -15 758 -335 -593 633 300 -709 4 704 -409 -510 622 215 -801 160 656
5883F56j185J39J101o31q35J001L93j203K11J075p79o71J071J96j154L10R88q35
$$ 656 -529 -390 711 80 -755 246 639 -564 -353 722 -57 -728 343 539 -615 -305 683 -152
5901a52n29J095M3j161N01R13r43m02J117q9j123O96P59r91l58J226l23r82P71
$$ -152 -681 414 457 -704 -203 710 -233 -635 482 393 -730 -34 725 -266 -624 602 279 -703 68
5920F8O00r99j64J138m61r12Q80N37j128K9J151o40q99J063L77j126J27J049o76
$$ 68 668 -331 -495 643 182 -730 150 687 -441 -412 739 99 -800 263 640 -486 -359 690 14
5939A4o84J026J67j116L01J087r08n31J030R1j123M52R42r34m45J095n4j032O02
$$ 14 -670 356 523 -593 -292 795 -113 -644 386 477 -646 -194 748 -186 -631 464 410 -622 -20
5958b0P65j017l12J186l46r51P24O98j133n7J095m22r33Q41N39j140P9J051n82
$$ -20 745 -272 -584 602 256 -695 29 727 -406 -463 632 210 -723 118 657 -483 -404 647 65
5977F5p69R36L76j129J77J025p26o57J032J71j102L30R88q16n80J083Qj038M86
$$ 65 -704 232 608 -521 -344 681 -45 -702 330 501 -601 -271 717 -99 -679 404 412 -626 -140
5996a40Q42r03m54J119q4j037O31P17r68k45J059l04r13P56N96j066r9J099m38
$$ -140 702 -201 -655 464 380 -657 -26 691 -277 -522 537 233 -680 76 672 -394 -493 606 168
6015A68q38Q52M26j083K0J055n45p52Q98L88j110K16R75o88o48J075Q5j123L74
$$ 168 -670 182 608 -475 -455 600 55 -697 201 589 -521 -305 670 -18 -666 409 494 -629 -255
6034b55R72q30n36J115j5j092M94Q32q78m17J114j54j027O93O73r83k15J040l06
$$ -255 717 -113 -649 466 451 -641 -147 685 -193 -610 504 350 -677 16 689 -294 -509 531 225
6053B25r02P63N63j022r1J052m11q74Q48M73j078kJ082n41q13R74L21j103J88
$$ 225 -677 86 649 -373 -464 588 177 -697 151 624 -454 -456 626 85 -728 246 567 -536 -348
6072c48J057p85n23R12K10j086L70Q65q33m57J020K6j012M98P47q47m27J110j48
$$ -348 709 -76 -599 313 523 -563 -193 672 -161 -618 402 428 -584 -86 661 -186 -613 497 349
6091C49r91O37O35q98k50J035k23r68P30N45j018k6R82l69q51P98M50j001N9R87
$$ 349 -642 -5 630 -268 -518 517 294 -674 56 601 -417 -443 539 170 -681 117 567 -434 -375 612
6111F12n57p59Q76L90j037K00Q95o80n53R63J26r97L18Q89q13m92J010k5r21L79
$$ 612 55 -704 172 562 -475 -275 620 -60 -613 350 476 -521 -203 686 -127 -619 391 366 -555 -176
6131a76Q17p97m23J051j53r53N92O64r59j38R52k04r10P07N58r99j63J033l62
$$ -176 641 -156 -579 472 319 -634 -42 622 -337 -475 477 273 -637 70 628 -371 -534 499 137
6150A37q32Q36M19j060J43R36n53p29R49L03j003J95Q69o42o00R63Q1r12L37Q05
$$ 137 -695 141 560 -500 -357 579 26 -703 246 549 -454 -259 610 -32 -632 331 412 -500 -163 642
6170F42p40m95J013n8r14M36P56q09l73R95j27r19N94O38r72k01J003k70q18O89
$$ 642 -98 -593 420 362 -552 -116 640 -169 -542 453 326 -593 1 639 -333 -534 469 199 -619 70
6190G0N51r99nR55m47p62Q00L56r25M1R20m79p36R20K04r38K17Q46o29n45R14
$$ 70 621 -378 -383 572 125 -637 163 519 -406 -365 555 76 -660 260 464 -474 -257 589 -40 -585 329
6211C29J05r59L66P60p43m14R39O0j048M97P36q24l20R71j17r28N66O17q42k52
$$ 329 434 -525 -159 601 -142 -556 383 443 -605 -108 628 -196 -516 455 338 -590 -24 593 -249 -501
6231e01R78l40p60P10M99r40l3R10l91p43P27L76q66K3Q82m81o50Q19K53r09J81
$$ -501 477 137 -623 87 586 -354 -387 523 132 -611 116 492 -374 -351 531 50 -600 219 472 -437 -256
6252b56Q43o29m93Q49R7r08L52P39o94m07Q89m1q65M35P05p82k66Q62j30q97N66
$$ -256 587 -42 -535 314 411 -497 -145 594 -100 -507 382 341 -524 -89 616 -166 -432 430 300 -597 -31
6273c1O51q69j78Q82k92p42O29M85q37r1Q66l52p36P41M29r72J01Q78m91o95Q36
$$ -31 620 -249 -427 455 163 -579 50 535 -302 -393 473 121 -615 126 555 -417 -316 562 71 -624 212
6294B12K54r34K95P39n86n24Q96N6r10L80P05p19l42Q60m6q61M37O28p22k70Q45
$$ 212 466 -468 -173 566 -20 -544 352 408 -502 -122 583 -136 -478 382 336 -525 -88 540 -182 -452 393
6315C93j02q49N38N84q40j39Q92k73p81O61M67r00m0Q61m07o44P42L48q73M7Q28
$$ 393 291 -558 -20 564 -276 -415 477 204 -577 84 551 -349 -389 472 65 -579 163 511 -362 -315 513
6336E13m13o61P62K50q79K15Q01o20n04Q34R7r10L78O99o95l54Q44l0q80M44O68
$$ 513 100 -561 201 451 -428 -213 588 -32 -536 298 395 -515 -137 562 -133 -487 357 327 -553 -109 559
6357E59p41k94Q95j51q55N19N97q11j50R05l57p21O73M52q20n0Q86m45n55O37
$$ 559 -182 -476 419 268 -587 -68 529 -282 -432 473 116 -605 68 520 -300 -350 536 91 -464 173
6377A73L59r09J14Q25n07n56P73K16q64J54P59n24m72P69P8q29K46P39o40m18
$$ 173 532 -377 -263 562 55 -501 272 488 -376 -222 537 13 -459 310 388 -441 -195 544 -96 -514
6397e14P98L5q12M07O15p45k22Q54j72q07N87M90p67j53Q06j92o96N48M91q63
$$ -514 284 319 -493 -86 529 -216 -438 416 244 -563 24 514 -253 -406 400 208 -488 60 551 -312
6417c12k2Q25l82o40O68L60q59P3Q19n11n54P17K43q06J65P50n90m88P63J59p77
$$ -312 -334 491 109 -531 137 497 -362 -289 530 19 -535 182 425 -381 -216 534 -56 -544 219 378 -399
6438c99K34O96o29m07Q13n8p16L18O92p67k01P48j16o80N14M02o40j71P88k58
$$ -399 -165 531 -98 -505 308 250 -466 -148 544 -223 -424 324 208 -472 42 444 -196 -367 421 163
6458A63o81N81M22p72j10Q80l33o50O23L61p83K9P17m16n59P30K23p95J24P19
$$ 163 -518 63 485 -287 -397 483 150 -500 123 484 -299 -270 447 31 -528 202 425 -370 -246 473
6478D73m65n00P51J25p92K38O94o43l47Q28q9p07L46N71o43k14P61j26p47N20
$$ 473 8 -492 259 384 -408 -170 524 -119 -466 362 273 -434 -88 483 -160 -374 387 261 -486 34
6498C4M67p20j66Q61k50p25N59M46p97m9Q33l59o24O07L21p78L2P93m32n47O87
$$ 34 501 -219 -385 476 226 -499 60 506 -291 -340 493 134 -490 117 438 -340 -308 485 53 -494 193
6519A93K12p81J50P15m93n04P43J47q36K85O40n23m19P66Op87L78N99p12j62P56
$$ 193 405 -376 -226 489 -4 -508 235 382 -454 -169 471 -52 -471 295 301 -486 -108 491 -221 -383 373
6540C73q4p52M89N05p54j77P88k13o33N28L43p29lQ15m00n86O14L08p89J06P84
$$ 373 289 -463 26 531 -223 -400 388 175 -458 70 413 -316 -319 496 96 -490 124 432 -357 -251 533
6561E33n62m97P07K42p89J42P07n43m24P27P6p39K87O49n99l83P54J8p71L61O04
$$ 533 -29 -526 181 423 -366 -224 483 -60 -484 243 319 -420 -133 516 -83 -466 288 306 -465 -104 500
6582E00o75j88P54j43p31M79N37p71j09P22k40o31N29M27p04r6P98l27o03O52
$$ 500 -175 -363 391 248 -483 -4 533 -238 -347 375 135 -496 33 460 -244 -340 458 131 -472 180
6602A80K44q14J31P10l88o06P04K33p28J39O37m67m69P51J05p55K37O23n49l64
$$ 180 424 -390 -259 451 63 -543 161 394 -334 -195 442 -25 -494 257 362 -393 -156 467 -82 -446
6622d46P36kp40M12N81p00k59Q14j64o77M06N15o30k14P75k38o11M78M00p15m
$$ -446 290 288 -452 -40 541 -159 -418 396 232 -445 -39 476 -154 -368 407 169 -442 36 436 -279 -283
6643b83P10l61n10N48K94p55J05P36m73m65O48J81p95K34O32m53m37O95Q4p22
$$ -283 427 66 -444 104 398 -357 -252 484 11 -454 194 375 -420 -186 446 -7 -444 251 335 -387
6663c87K88N55n80k72P04rp25L55N65n90k03N99o0o49M14M16o25j78P47j93o40
$$ -387 -99 456 -124 -396 308 299 -426 -71 494 -96 -299 300 240 -409 5 421 -204 -382 365 172 -468
6684d68N46L18o97j2O92k98n78O21L13p73R2O00k77n00N83J96o53J74N76m72l58
$$ -468 78 396 -301 -313 379 81 -497 124 437 -336 -244 356 79 -421 162 358 -295 -121 455 -17 -375
6705c75O83J1o99K97N32n74k65P14n5o79L67M89n80k23P02j61n84M25M22o74j57
$$ -375 308 319 -380 -83 449 -125 -390 324 269 -410 -43 446 -134 -357 345 184 -400 25 447 -227 -384
6726c84P30j97n74M88L29o05p8O67k81n77N80L06o88O0O62m38m31O08J49o79K17
$$ -384 346 149 -425 63 392 -213 -291 376 95 -482 98 404 -284 -224 438 0 -431 177 326 -353 -136
6747a36N21m12l58O13J17o98K20N94n53k87O46J0p14L78M59n56k08O69p3o57M45
$$ -136 385 -27 -385 228 345 -353 -133 461 -92 -379 267 277 -437 -59 400 -156 -364 305 232 -425 20
6768B0L81n84j85P32k08o01M84L47o55m7O55k07n56M81K71n92O0N79k74n12N89
$$ 20 401 -183 -368 364 156 -445 39 386 -269 -316 339 132 -424 57 328 -264 -204 375 101 -411 178
6789A78J68o37J54N25l79m46O08J21o42K25N91n29l02N69O8o71L01M82n10k59
$$ 178 346 -291 -137 388 9 -437 171 292 -350 -125 466 -63 -365 204 272 -399 -98 384 -126 -385
6809c85O77j08o15M36M05n96j27O31j64n63M38L71o30m0O21k46n14N12K65o74
$$ -385 292 184 -431 5 410 -186 -313 318 154 -409 29 400 -230 -270 351 105 -409 103 368 -306
6829c06Q1N95l11m49N47K21p11J55N71m55l43O02R4o59K45N19m53k83N39M9o43
$$ -306 -225 370 59 -390 157 378 -333 -178 393 -62 -405 197 291 -368 -123 396 -57 -340 199 248 -395
6850c95L17N04o02j37O19j17n89L98M01n70j33N88j52n47M98L22o42l6N99k20
$$ -395 -78 426 -176 -313 306 189 -400 -2 399 -171 -304 284 132 -415 83 405 -237 -273 326 106
6870A06n19M81L06o31L7N83l41l46N01J19n99J58N02m12k89N90Q6o91K12N31m45
$$ 106 -413 68 374 -257 -220 363 22 -324 177 296 -303 -145 357 -55 -344 246 332 -359 -147 384 -61
6891f1l08N91Ln27K40M25m48k58N94o5n34L03M14n38j40N77j05n56M51K78n38
$$ -61 -369 222 225 -302 -62 363 -85 -343 251 186 -348 -45 369 -169 -309 268 163 -393 58 336 -202
6912b02o8N79k47m09M66K12o07L9N68k85m25N20K16o61J70M78l46m18O26J7n34
$$ -202 -270 309 62 -347 119 331 -276 -237 331 46 -379 141 357 -304 -134 344 -2 -420 206 223 -311
6933c11K01N14m30l99O66j2o27K96N13n33k68O20l1n57L34M00n09j65O31j65n46
$$ -311 -110 404 -26 -425 241 229 -398 -102 411 -122 -390 230 199 -358 -24 376 -133 -298 333 168 -378
6954c78L76L34n90K0N91k63m27M17L24o49M4N84l09m16M87J19n15Q2N09k99l90
$$ -378 -2 332 -258 -238 353 90 -337 80 404 -245 -201 383 74 -342 145 264 -251 -169 340 41 -349
6975c49N54P7n98K15M65m09k79N34n3m70K04M55m32j72M88rn70L15M06n73p6N11
$$ -349 205 282 -316 -101 364 -45 -324 210 157 -313 -109 346 -86 -258 230 221 -349 -34 372 -201 -277 234
6997B34q5m60L36K96m91p6N89k09m94M47K33n66N8N46l20m16N17J16n51J40N24
$$ 234 149 -311 25 321 -170 -246 343 134 -360 87 320 -246 -188 358 38 -378 139 255 -296 -156 368
7018C68m55k73N34R1n65J75M99m53k20N10L7n37K05M08m54j78N87p1n52L32L39
$$ 368 -87 -360 174 265 -300 -125 374 -79 -299 211 248 -289 -84 324 -130 -308 279 208 -344 -12 327
7039C27m58j17N69k07m74L92L43n97k4O05k75m56M75K31n93L2N26l20l09M06K56
$$ 327 -131 -248 321 114 -360 32 375 -222 -246 359 84 -372 103 334 -259 -227 299 -21 -330 76 332
7060C32o04J26N04l79k89M71O7n21J49M93m56j82N27l4m93K58L37l95k29N46l3
$$ 332 -272 -146 358 -21 -310 161 228 -293 -144 349 -107 -289 238 204 -289 -31 306 -89 -318 228 195
7081A95m93L25K87m67r2N50j69n16M13L07n05n7N16k43m03M32J86m92M1M64k57
$$ 195 -298 27 314 -153 -245 305 136 -380 33 340 -165 -222 294 51 -352 80 266 -226 -185 279 22
7102B2l95M77J36n14J22M79l56l22N11L9n01K31M55m35k73N02J9m91K67L80m41
$$ 22 -373 104 240 -274 -152 327 -29 -351 160 199 -302 -71 384 -51 -324 178 197 -294 -27 353 -88
7123h8k08N42r7m65L74L06n10r6N51j97m35L31L35n09m6N10k04m47M52J71m73
$$ -88 -296 246 149 -316 58 364 -146 -242 309 112 -323 8 343 -166 -212 298 94 -353 99 270 -203
7144b03J5M68k67l62M84J00n11J42M35k89l12M41P5m49J33M23l75k73N18Lm99
$$ -203 -188 280 13 -349 135 235 -276 -134 301 12 -300 141 216 -233 -100 323 -52 -325 193 196 -303
7165c03K58L75m18j65M92j37m05K20L98m17j26M69q7m19L32K31n38P2M35j88l75
$$ -303 -45 330 -88 -253 239 102 -303 -83 315 -102 -228 241 154 -265 67 298 -240 -168 267 79 -296
7186b96L74K24n17J7M68k68l15M21J57m55J25L58l44k46M22R5m63J45M33l67k43
$$ -296 78 302 -215 -198 270 2 -313 108 265 -190 -65 293 -51 -297 125 220 -243 -98 335 -32 -275
7207b75M36R1n23J78L74l62j52M06Mm70K61L27m63n6M42j19l69L17K17m14k9M15
$$ -275 161 252 -271 -93 281 -81 -233 173 177 -293 -32 295 -168 -224 218 99 -270 47 264 -150 -179 236
7229B36j52m08L82J88m48L1M37k30l71M57J23m75J27L72k93l04M83R3m47J55K94
$$ 236 84 -324 58 246 -202 -171 266 36 -335 122 245 -230 -103 269 -24 -328 155 248 -199 -44 250
7250B50k99j97M62m7m12J65L46l43j59M50n3m73L12K91m22j37N04j03m29K82K38
$$ 250 -49 -246 216 169 -243 -78 268 -75 -234 216 163 -310 2 293 -129 -266 238 135 -294 -12 226
7271B26l98l8N05k39l17K73K49m82M1M03j88l02M07J27m25P1L34k45k57L94P6
$$ 226 -172 -210 295 56 -261 12 261 -221 -180 223 35 -267 140 267 -158 -87 247 2 -255 139 215
7292B15m09J24L58k99k74N20q7m14J56M04m10j35M31j1l98J82L14l46j45M32l5
$$ 215 -194 -70 288 -11 -285 235 148 -266 -110 294 -116 -251 180 169 -229 -47 267 -79 -224 208 173
7313A73m48K92J93l92k0L86j39l08L00K12m32L0M05j97k78L18J46m09P5L50k00
$$ 173 -275 17 210 -182 -202 184 45 -263 37 249 -183 -153 252 55 -223 95 241 -168 -93 257 57
7334E7l60M87L5m52J51L60l22k11L96K3m22K06L40l82j63M01L1m70K52K89m38
$$ 57 -303 184 219 -233 -82 278 -44 -255 141 164 -258 -52 288 -94 -257 144 175 -295 -43 246 -192
7355a92%M20j01l65K64K17m33L3L90j29l40K83K10m25j3M28k01k89L35J32m23
$$ -192 -192 228 127 -238 26 243 -190 -157 233 104 -236 47 257 -168 -181 247 46 -243 92 224 -199
7376a99P6L90k64k45K95J48m58J99L43l64j84M28pl91J80K64k37k20M57o5l37
$$ -199 -123 267 3 -242 53 201 -257 -58 285 -79 -263 165 158 -233 -53 211 -26 -246 211 146 -191
7397a91J74K11k62j67M15m2m11K53K47l46K5L16j37l44K77J80l18LL58j77l06
$$ -191 -17 194 -68 -235 180 138 -273 -20 227 -119 -94 222 85 -259 18 198 -120 -117 241 64 -242
7418b42L49R2m02N7L51k04k32L16K13n02J11K95k08k43L71L1l87J70L06l04j43
$$ -242 107 199 -203 -146 205 1 -231 85 298 -204 -93 202 -6 -249 122 153 -234 -64 242 -62 -205
7439b05M32o2m02J78K95l00j26L62m3l87K60K27l41q8M26j43l31K45K38l97QL98
$$ -205 227 165 -237 -59 236 -64 -190 172 129 -258 2 229 -112 -200 226 83 -248 -3 235 -162 -154 244
7461B44j59l05K83J99m17R5K92k34k38L47P3l57R8L29k57k17L21K1l07J82K20
$$ 244 85 -220 63 262 -155 -60 232 -2 -240 107 180 -177 -79 250 -7 -224 97 118 -189 -7 213
7482B13k88j02L17J9m17K28K84l16j46L97n4l76J84L00k72j66M17j71l24L04J59
$$ 213 -75 -177 140 159 -258 -30 254 -62 -208 189 135 -241 -57 243 -29 -195 222 51 -273 31 190
7503A90l18n5M13j61l41L79Q1l61L2L11j03l40L96ll27R8L25k13k31L47M3l67
$$ 190 -128 -183 230 69 -272 107 188 -173 -141 170 67 -273 123 120 -207 -109 216 3 -228 119 162 -205
7525b05J48K49k43j29L15Pl44K29K13l22j17M08p5k87J85J77l06r0L80n2l98K93
$$ -205 -57 192 -51 -180 135 142 -202 27 240 -82 -199 209 134 -153 32 209 -97 -187 193 141 -257 36
7547C6K18l75m9L70j50k75K30K23l74k7L58k00k10L26O3l74J07L35k50j93K98
$$ 36 254 -121 -170 200 50 -225 5 228 -146 -173 185 -15 -225 101 164 -210 -103 232 -18 -211 87
7568H7R8l82J26J88j57j65L10M5l12J51K15k72j14L67n5l32J54K64k98j44L66
$$ 87 185 -197 -71 117 -40 -205 105 150 -162 -11 204 -68 -182 185 130 -202 -48 216 -82 -226 140
7589A40k3l20K26J87l03r1L63j09k55K02J67k62p4M00k24k47L31N2k94nL53k26
$$ 140 117 -203 23 210 -93 -184 179 70 -185 17 184 -78 -152 248 24 -223 108 160 -134 -139 214 -12
7611a2j86K88N7l06R9K65k42j55K95L4k98R4K48k47r3K92q9k26J67J97k62p6K95
$$ -12 -198 90 147 -159 -60 205 -37 -192 103 137 -161 -67 181 -66 -159 133 44 -182 -15 182 -80 -156 139
7634A39p2k61K01J73k53l4L32j77l00K49K07l34M0K43j11k60K38J06l14R6L02
$$ 139 67 -194 7 180 -73 -107 225 48 -252 -3 204 -130 -90 153 42 -218 20 126 -188 -92 210
7655B10j84j92L54m8k90M3L41j99k49L24L9l62J55K05j64j54K65j6k15J35K27
$$ 210 26 -166 188 140 -150 -107 234 35 -214 110 149 -213 -58 147 -17 -171 94 78 -137 -2 225
7676B25k89r6L16j04k39J68K21k87r0L10j2l26K20J44k64J1K73r5k36K01J60l40
$$ 225 -64 -160 156 52 -187 -19 202 -85 -175 135 123 -203 17 161 -103 -92 181 86 -150 51 211 -129
7698a29k1L30j69j46J99J48l06K9K72k30j74K86N2l17J23J98j57j56K90k1k76
$$ -129 -150 180 11 -135 64 212 -94 -65 207 -23 -197 89 141 -176 -53 145 -12 -168 122 101 -175
7719a75P8K35k07j18K98j6k74J55K38k82p4K39l1k29K10J10k78j7K60o2j92J43
$$ -175 -97 138 -69 -187 111 95 -179 -24 214 -68 -142 97 66 -163 47 157 -121 -138 122 60 -132 11
7741A1J95l49M2L21k38j95L17N5k77L0K74k01j75K83M0k70Q9K17k38r5K53kk45
$$ 11 206 -143 -101 220 -18 -213 104 159 -118 -88 186 -15 -190 93 133 -137 -48 169 -69 -164 89 87 -158
7764a58R2K34k66l7K14Lk57J72J80k42p0K63p3j68J18J51k58qK64n5k43J60J50
$$ -158 -66 168 -98 -135 79 82 -175 -3 177 -65 -135 128 55 -113 5 156 -102 -110 154 99 -144 16 166
7787A66k69m5L60j97j69K27M2j99J8K05j83j40K12J20k76O5K35j90j61K31N5k88
$$ 166 -103 -148 212 15 -154 73 115 -84 -66 139 -44 -184 28 148 -128 -63 172 -18 -179 52 107 -181
7809a81J10K44k43n9K16J4k60J65J53k35n1K53n5k35K29J39k90n4K49p7k13J85
$$ -181 -71 173 -70 -129 87 101 -159 6 159 -76 -127 126 71 -164 65 204 -86 -140 109 32 -181 4
7831DJ49k72J9K75j82j58K15P6j95qK36j79j65K51O0l02J01K53j87j93L01J0k06
$$ 4 153 -119 -100 175 -7 -165 50 126 -69 -77 159 -20 -185 66 126 -176 -75 178 -9 -202 99 109 -97
7854i7M1K03j51j47K23J7k54J20J95j93o7K56r8k05J14K11k24l3K46j20j79J57
$$ -97 -56 147 -4 -151 72 89 -165 -45 150 -43 -110 146 48 -157 -43 168 -56 -89 157 37 -142 15
7876A5J64k54k2K30q3k10J84N0j49jK20j30j75J78Q9k89J42J87j44j30K08P9k91
$$ 15 179 -75 -97 133 50 -160 24 74 -75 -76 144 14 -161 17 106 -183 -41 146 2 -128 80 159 -132
7899a32J07J79j45j30J93L1k82J58J96k22r0K34J2k42J43J49k02j15L15n7k66
$$ -132 -25 154 9 -121 72 103 -179 -21 175 -47 -137 97 109 -133 10 159 -43 -158 157 100 -166
7920a66J78J45k58l7K24j4l10K78J13k88L4K30j53j47J79P7k11M0K02j23j12J57
$$ -166 12 157 -101 -138 86 72 -238 40 153 -135 -101 129 -24 -171 8 85 -126 -86 116 -7 -119 38
7942C8N7j72P3J28j25j22K27m5k11J49J67j78j27J93J6j99J07J40j99n2K12j3
$$ 38 95 -77 -4 124 -1 -123 104 59 -152 -3 164 -14 -141 52 68 -131 -24 116 -83 -135 77 64
7964F4k29J47J35k16k4K44q7j78K40Oj50p1K33o4j99J44J14k30L0K44j35j56K35
$$ 64 -165 -18 117 -99 -123 121 34 -144 96 102 -48 -119 114 50 -149 -5 109 -121 -91 153 18 -138 97
7987I7k0j85RL28j65k42K43L8k20J20J82k41m8J84Rj94K5J95j06r2J51L9k58J43
$$ 97 77 -108 -99 229 64 -178 65 103 -117 3 185 -56 -104 80 89 -105 -80 115 9 -83 68 107 -151 -8
8011hJ36j79l0J72m1j77J62O4j96K1J62m7j81J85O9j77K9J42q8j91K68Pj77L3
$$ -8 128 -51 -81 91 50 -127 35 99 -97 -76 86 39 -142 43 112 -65 -36 106 18 -173 95 102 -75 -42
8035d2J93j11j83K42M0k71Q1J73j08j42K57m5j59Q1J15j63q1K03l2j87J08J42
$$ -42 151 40 -143 99 139 -132 -51 122 14 -128 129 84 -75 6 121 -42 -123 80 48 -139 -31 111
8057A11j88n6K12m4j54J07J31j89k2J90j04r4J42Q8k12k2J72l6j54K07J8j37Q
$$ 111 -77 -133 79 35 -119 -12 119 -70 -92 98 -6 -100 42 130 -82 -104 68 32 -122 85 103 -34 -26
8080b6J64j22j15J34N7k07P1P7lj29J69L6j98L0J94j91j10K35Ok23R9J95j79k7
$$ -26 138 16 -99 35 92 -115 -44 33 30 -99 70 106 -92 -62 132 -59 -169 66 72 -151 -52 143 -36 -63
8104f3J40l1j41P4J21j82J3J69l8j80J55R1j98L4O7O8j55N4J21j90M4J22j28p6
$$ -63 77 46 -95 -21 100 -82 -69 100 62 -118 37 128 -70 -36 31 99 -56 -2 119 -71 -27 95 -33 -109
8128a09J40J12k20nK21r7j75J67kj45M0J90j31j62K09rj49P8J64j50o6J85k1k08
$$ -109 31 143 -77 -82 139 42 -133 34 32 -113 -73 117 -14 -176 33 24 -125 -47 117 -33 -99 86 65 -143
8152a43O1K18j75l4J63j10j7R3J00k45lJ63j5j53J41M6j13k7J53n8j90K05K4j57
$$ -143 -82 136 -39 -73 90 -20 -37 56 156 -89 -92 71 56 -97 44 90 -23 -50 103 45 -145 60 84 -73
8176g3l5J99p3j68J93l2j46O5J81j41m4J25K2j73J8
$$ -73 -108 91 18 -150 43 11 -135 -70 111 -30 -74 51 73 -100 -82
8191h2
$$ Imaginary data points
##PAGE= N=2
##DATA TABLE= (X++(I..I)), XYDATA
0@%%%%%%%%%%%%%%%Kk%%%%%MqPoQj7K5k7K9l8N0n7O4p3Q9j07J21j36J55j81K09
$$ 0 0 0 0 0 0 0 0 0 0 0 0 0 0 0 0 2 0 0 0 0 0 0 4 -4 3 -3 5 -12 13 -14 15 -23 27 -30 34 -39 50 -57 64 -72 83 -98 111
43A11k33K57k90L29l67M03m43M92n44N95o47P02p61Q22q73R13r43R52r17P96n23
$$ 111 -122 135 -155 174 -193 210 -233 259 -285 310 -337 365 -396 426 -447 466 -477 475 -442 354 -169
64a69l1J173l693R994l0497J91950Q23433j321485n15762J624114k76040j435630
$$ -169 -200 973 -2720 7274 -23223 168727 992160 -329325 -845087 779027 502987 -932643
76i32643R15220R71529j370036l03319J445489m05709j223954R84027P06199j296835
$$ -932643 -17423 954106 -415930 -719249 726240 320531 -903423 80604 786803 -510032
86e10032m7753J314755n87983r90130J084808M66195j304225J74607J213996p67631
$$ -510032 -557785 756970 168987 -821143 263665 729860 -574365 -399758 814238 46607
96D6607q59819J162393K88619j307298L14211J140135q46257p24966J175165J73955
$$ 46607 -813212 349181 637800 -669498 -355287 784848 -61409 -786375 388790 562745
106E62745j214109M14931R98478q61937n49369J101440j611j073816N17626P76325
$$ 562745 -651364 -236433 762045 -99892 -649261 452179 450568 -623248 -105622 670703
116F70703r07902l20450J044187k19439r30899O92498N89187r83281q7887J052004
$$ 670703 -237199 -557649 486538 267099 -663800 28698 617885 -365396 -453283 598721
126E98721m18018q47223Q44210M51206j068929N0805J039190n53759p89550R07998
$$ 598721 180703 -666520 177690 628896 -440033 -389228 649962 96203 -693347 214651
136B14651L45808j067512J54722R77019o06514o62501R17963K23538r91915K69449
$$ 214651 560459 -507053 -352331 624688 18174 -644327 273636 497174 -494741 -225292
146b25292Q49840o72949n06780R08884M6978r35776M02740P24335p70612l57833
$$ -225292 624548 -48401 -555181 353703 400681 -535095 -132355 591980 -178632 -536465
156e36465R45170r9981r01693N41373O59815q48057k51106R80404j99733q81923
$$ -536465 408705 308724 -592969 -51596 608219 -239838 -490944 489460 289727 -592196
166e92196O10925N90720q85849j82639R47897k70968q14780O37083M93844q56035
$$ -592196 18729 609449 -276400 -459039 488858 217890 -596890 40193 534037 -321998
176c21998p6274Q77027l35576o86140O69850L57866q23589N5484P87807m42299
$$ -321998 -398272 478755 143179 -542961 126889 484755 -338834 -283350 504457 62158
186F2158n68833P11089K09058q21428J81297P24508n37056m68047P61042J07368
$$ 62158 -506675 204414 413472 -407956 -226659 497849 -39207 -507254 253788 361156
196C61156q02175K82055O71988n87041l79167P63051J6182p57291L38811N74483
$$ 361156 -441019 -158964 513024 -74017 -453184 309867 326049 -431242 -92431 482052
206D82052o12956k77787P23379q5007o72317M07384M60744o23463j41266O93987
$$ 482052 -130904 -408691 314688 229681 -442636 -35252 425492 -197971 -339237 354750
216C54750j94574n84409M91774L46239o60469k0834O71268l13721n29710N64802
$$ 354750 160176 -424233 67541 413780 -246689 -267523 403745 90024 -439686 125116
226A25116K50590o96595P6519O58448l91590m70185O18754J81705o93603J56721
$$ 125116 375706 -320889 -244370 414078 22488 -447697 171057 352762 -340841 -184120
236a84120O21181m44185l99007O30663R1127o70929K26598N46521m96868l07776
$$ -184120 437061 -7124 -406131 224532 315659 -355270 -128672 417849 -79019 -386795
246c86795O36518q569o30680L17798M78236n45082k05786O54056j03445n99822
$$ -386795 249723 241154 -389526 -71728 406508 -138574 -344360 309696 206251 -393571
256c93571L97263M12316n96860j31599O54564j86695n72782M49784L51441o17837
$$ -393571 3692 416008 -180852 -312451 342113 155418 -417364 32420 383861 -233976
266b33976n9033O41032k41588n14366M89378K83019o10093J8185N97838l02208
$$ -233976 -293009 348023 106435 -407931 81447 364466 -245627 -227442 370396 68188
276F8188m44881N10284J88369o02520R8471N42410l67776l65030N40783J00460
$$ 68188 -376693 133591 321960 -280560 -182089 360321 -7455 -372485 168298 268758
286B68758n85521J88158M98971m22001k87277N65509J9416n70200K54133M43804
$$ 268758 -316763 -128605 370366 -51635 -338912 226597 246013 -324187 -70054 373750
296C73750m68658k22791N64585n5371n38924L07646L82899m88309j42111N54717
$$ 373750 -94908 -317699 246886 191515 -347409 -39763 343136 -145173 -287284 267433
306B67433j21551m82922L60709L09041n02227n8656N27787k00527m30122M04215
$$ 267433 145882 -337040 23669 332710 -169517 -228173 299614 99087 -331035 73180
316G3180K24669n19273K2851N01931k70601l71081M51278J55155n20836J02402
$$ 73180 297849 -221424 -198573 303358 32757 -338324 112954 268109 -252727 -150325
326a50325M76866l25332l14013M78253Q4780n17270J60906M32389l72851k56557
$$ -150325 326541 1209 -312804 165449 250229 -267041 -106135 326254 -46597 -303154
336c03154M87386J5367m94573K21673L84387m02992j82653M94244n1875m60466
$$ -303154 184232 199599 -294974 -73301 311086 -91906 -274559 219685 167810 -292656
346b92656K79770L26383m34981j14935M86761j24594m30617L25855K66863m58410
$$ -292656 -12886 313497 -121484 -236419 250342 125748 -304869 20986 287849 -170561
356a70561m9793M79059j80118l89141L69253K15808m64980J3335M60983k29962
$$ -170561 -220354 258705 78587 -310554 58699 274507 -190473 -177138 283845 53883
366E3883l45496L94195J52215m67592O9156M25236k78744k92466M13886Q8243
$$ 53883 -291613 102582 254797 -212795 -143639 281597 2853 -289613 124273 212516
376B12516m54041J33245L89615l16616k28931M31038K3752m36704J90192L43289
$$ 212516 -241525 -108280 281335 -35281 -264212 166826 190578 -246126 -55934 287355
386B87355l56896j72029M34462m3664m16811K39963K95206l83618j09481M35477
$$ 287355 -69541 -241570 192892 149228 -267583 -27620 267586 -116032 -225513 209964
396B09964r8439l81603K86812K46002l98885m7911M22057j55437l44788L18902
$$ 209964 111525 -270078 16734 262736 -136149 -184060 237997 82560 -262228 56674
406E6674J84516m10803J0718L98581k07763k98389L50159J27627m08406P4091
$$ 56674 241190 -169613 -158895 239686 31923 -266466 83693 211320 -197086 -122995
416a22995L75008k50572k47977L73273O9577m04247J25285L40479k92078k02488
$$ -122995 252013 1441 -246536 126737 196314 -207933 -82648 257831 -34247 -236735
426b36735L83877J2600l91917J73334L05305l19137j48288L91712l7179l67060
$$ -236735 147142 159742 -232175 -58841 246464 -72673 -220961 170751 133572 -233488
436b33488K17988K63593l41001r6194L85355r1640l41720K52239K14038l58446
$$ -233488 -15500 248093 -92908 -189102 196253 104613 -237107 15132 229170 -129276
446a29276m3949L75095j38940l06681K87472J69120l64557J1297L61843j81896
$$ -129276 -173225 201870 62930 -243751 43721 212841 -151716 -140419 221424 39528
456C9528k69788L12932J18369l69529N7936L36771k23575k31268L30304O7986
$$ 39528 -230260 82672 201041 -168488 -110552 226219 2644 -228624 101680 169666
466A69666l62974J06776L10309k53684j83282L44083K0238l48519J50886K75733
$$ 169666 -193308 -86532 223777 -29907 -213189 130894 151132 -197387 -46501 229232
476B29232k82643j38810L46422l1734l33253J88734K37435l05412r1429L47747
$$ 229232 -53411 -192221 154201 122467 -210786 -22052 215383 -90029 -181458 166289
486A66289p5918l08350K26896K01321l19487m3135L41962j19808k81799K54884
$$ 166289 90371 -217979 8917 210238 -109249 -152384 189578 69770 -212029 42855
496D2855J56069l31233J506L25325j61845k48157K78544J11289l30536N0048L06855
$$ 42855 198924 -132309 -130803 194522 32677 -215480 63064 174353 -156183 -106135 200720
507B00720j95188k07799K97596O5925l26065R2756K79966k28608j70699L07327
$$ 200720 5532 -202267 95329 161254 -164811 -72055 207911 -20697 -191396 115931
517A15931J8887l18474J31935K51774k53880j28514L15753k2259l00942J70195
$$ 115931 134818 -183656 -51721 200053 -53827 -182341 133412 111153 -189789 -19594
527a9594K20515k72788q5631L13759o6065k80736J99527J80105k88243m2557L04331
$$ -19594 200921 -71867 -157498 156261 90196 -190540 8987 189092 -99151 -141708 162623
538A62623j07090k52226K28247J41086k94039M030K93529j43096k20875K51619
$$ 162623 55533 -196693 31554 172640 -121399 -117369 176160 33064 -187811 63808
548F3808R9836k98627M4117K75147j78740j90550K67335N8519k96358Q3104K54491
$$ 63808 163644 -134983 -90866 184281 5541 -185009 82326 140845 -155513 -72409 182082
559A82082k04788j53120K79403J9992k84786J20039K27048k27544j15286K81459
$$ 182082 -22706 -175826 103577 123569 -161217 -41178 185870 -41674 -156960 124499
569A24499k2597k70734J50903J93800k46271p6104K80560o0343k50246J81818
$$ 124499 101902 -168832 -17929 175871 -70400 -146504 134056 73713 -176533 5285
579E285J63568k57943l6348K77049r4985k29031K05620J29295k67781j480K65350
$$ 5285 168853 -89090 -125438 151611 56626 -172405 33215 162510 -105271 -106751 158599
590A58599j28446k04308K24149R3626k68608L6557K49846j55656j71037K39350
$$ 158599 30153 -174155 49994 143620 -124988 -88431 161415 5759 -165278 74072
600G4072N6193k63101P3013K26876j82500j37980K47166J5833k56003J06172K01835
$$ 74072 130265 -132836 -59823 167053 -15447 -153427 93739 109572 -146431 -40259 161576
611A61576k05046j02770K54230j9872k42733J38802J77093k21959o7278K55051
$$ 161576 -43470 -146240 107990 88118 -154615 -15813 161280 -60679 -127957 127094
621A27094n5218k27009J64189J45478k35203l2900K47686q8852k04672J86441
$$ 127094 71876 -155133 9056 154534 -80669 -113569 134117 45265 -159407 27034
631B7034J12811k39702M816K37466j18093j77237K05093P8689k41581L8840K21908
$$ 27034 139845 -99857 -95041 142425 24332 -152905 52188 130877 -110704 -71864 150044
642A50044j46966j51793K18402M4512k41231P0459K05999j69847j23577K29618
$$ 150044 3078 -148715 69687 114199 -127032 -56573 149426 -20421 -143998 85620
652H5620J4140k34054J00139J86565j87860r4441K32659j8105k23225J24158J60494
$$ 85620 99760 -134294 -34155 152410 -35450 -129891 102768 84663 -138562 -14404 146090
663A46090k02381o3532K30323m9045k05776J48155J33655k11022k9670K25992
$$ 146090 -56291 -119823 110500 61455 -144321 3834 137489 -73533 -103203 122789
673A22789p8084j86109J68740J04692k18634N81K16746j06135j66409J84294P5931
$$ 122789 44705 -141404 27336 132028 -86606 -86025 130721 24586 -141823 42471 118402
684A18402k20989L0021K05446j28112j41869J96616M8008k16972N7894J88501
$$ 118402 -102587 -72566 132880 4768 -137101 59515 107523 -109449 -51555 136946
694A36946j47627j16049K02081J7043k10067Q2963J67385j64674q7949K05764
$$ 136946 -10681 -126730 75351 92394 -117673 -34710 132675 -31999 -119948 85816
704H5816j2207j98826J09151J46512j78493n8256K07475m1260j86301J31658J21931
$$ 85816 73609 -125217 -16066 130446 -48047 -106303 101172 59912 -126389 5269 127200
715A27200j90797l0334K03634o9307j70582J50358R6530j96405j161J96396r2813
$$ 127200 -63597 -93931 109703 40396 -130186 20172 116702 -79703 -80864 115532 22719
726B2719j49398J65648O9572j97473K6940J83720j15994j27201J76363M0178j96357
$$ 22719 -126679 38969 108541 -88932 -61992 121728 5734 -121467 54896 95074 -101283
737a01283N4053J68732j36335j02614J85944J2896j90936Q0330J52975j52917
$$ -101283 -47230 121502 -14833 -117447 68497 81393 -109543 -29213 123762 -29155
747b9155p7844J90671j3966j83307J01780J32794j66081n3317J89690l9115j70534
$$ -29155 -106999 83672 69706 -113601 -11821 120973 -45108 -98425 91265 52150 -118384
758a18384J20486J11458j72939k7066J85656o1473j53980J36096Q8246j77553
$$ -118384 2102 113560 -59379 -86445 99211 37738 -116242 19854 108100 -69453
768f9453k081J77479q4022j36992J48938O3790j79872K2535J68043j03454j17304
$$ -69453 -71534 105945 21923 -115069 33869 97659 -82213 -59678 108365 4911 -112393
779a12393J59930M0596j77896M5981J55697j20097r6685J66008J6004j73183O6825
$$ -112393 47537 88133 -89763 -43782 111915 -8182 -104867 61141 77145 -96038 -29213
790b9213J38960j34258p4140J68518q049j63848Q7354J21100j44883m9532J69105
$$ -29213 109747 -24511 -98651 69867 61818 -102030 -14676 106424 -38459 -87991 81114
801H1114l1872j52437J06091J00803j54705k5829J66234n5240j39876J22045P9932
$$ 81114 49242 -103195 2896 103699 -51006 -76835 89399 34159 -105717 16328 96260
812I6260j60609k396J61389p5119j24170J35174N9191j62482J9875J52472r3171
$$ 96260 -64349 -66745 94644 19525 -104645 30529 89720 -72762 -52887 99585 6414
823F414j06927J44049L6415j61604M1285J40265j09492q7069J50999J3781j56990
$$ 6414 -100513 43536 79951 -81653 -40368 99897 -9595 -96664 54335 68116 -88874
834h8874O2743J26686j23133o6165J55283q560j50524Q1228J10766j34764m5995
$$ -88874 -26131 100555 -22578 -88743 66540 57980 -92544 -11316 99450 -35314 -81309
845h1309J55892k9753j41485R7380R3712j42093k4750J53548m8949j28686J11200
$$ -81309 74583 44830 -96655 725 94437 -47656 -72406 81142 32193 -96493 14707
856A4707P4821j46300l646J47236o7512j14214J22029N4208j48091J7248J38815
$$ 14707 89528 -56772 -60418 86818 19306 -94908 27121 81329 -66762 -49514 89301
867H9301q4464r7324J31353L3695j46788L7842J28449r9385p9584J37651J2774
$$ 89301 4837 -92487 38866 72561 -74227 -36385 92064 -7321 -86905 50746 63520
878F3520j43294N6097J15247j11952o1011J40326p355j36243P2904J00283j20714
$$ 63520 -79774 -23677 91570 -20382 -81393 58933 51578 -84665 -11761 88522 -32192
889c2192m1186J40272k6309j26399Q7520Q3669j27421k1656J37284m5065j15323
$$ -32192 -73378 66894 40585 -85814 1706 85375 -42046 -63702 73582 28517 -86806
900h6806J00440O6059j32337j994J32813o2109j02318J11466M8474j34188J6711
$$ -86806 13634 79693 -52644 -54638 78175 16066 -86252 25214 73688 -60500 -43789
911d3789J25867p7084q8282J19243L0285j33557L3986J16155r0137p2334J24402
$$ -43789 82078 4994 -83288 35955 66240 -67317 -33331 82824 -7313 -79647 44755
922D4755J1805j29536N0950J04575j01016n4939J27581o747j23666O6762R1058
$$ 44755 56560 -72976 -22026 82549 -18467 -73406 54175 47428 -76238 -9476 81582
933H1582j10674l7482J28286k4751j16379Q0668P7014j17696k0185J27085m0969
$$ 81582 -29092 -66574 61712 36961 -79418 1250 78264 -39432 -59617 67468 26499
944B6499j06828R2463O2099j21805k998J22803n6157r5274J01765M5415j23282
$$ 26499 -80329 12134 74233 -47572 -50570 72233 16076 -79198 22567 67982 -55300
955e5300J4043J15809p0159q1437J09278K8279j22372L1254J07051q2639o6598
$$ -55300 -41257 74552 4393 -77044 32234 60513 -61859 -30605 76446 -6193 -72791
966g2791J14834J1102j19871M6679R6938r3376n1887J17733n087j15163O0251
$$ -72791 42043 53145 -66726 -20047 76891 -16485 -68372 49361 44274 -70889 -10638
977a0638Q5609j00974l6696J18213k0200j07582P1975P2316j06184k0500J15396
$$ -10638 74971 -26003 -62699 55514 35314 -72268 -293 72023 -34161 -54661 60735
988F0735l5428r7617Q2323N6982j09623l663J10720n0072q5932R1622M1381j11128
$$ 60735 25307 -72310 10013 66995 -42628 -46291 64429 14357 -71575 20047 61428 -49700
1000d9700J2749J04647o3078p3748R8409K6115j10743K7139R6978p3858o1097
$$ -49700 -36951 67696 4618 -69130 29279 55394 -55349 -28210 68768 -5090 -66187
1011f6187J02559J1339j07507M0544Q7347q2382m6808J04646l943j01967N3600
$$ -66187 36372 47711 -59796 -19252 68095 -14287 -61095 43551 39608 -62359 -8759
1022h759P5513q9919l1565J04897j9552r5311O5767O3039r6528j6233J04356l4192
$$ -8759 66754 -23165 -54730 50167 30615 -64696 1071 64110 -32418 -48651 55705 21513
1034B1513q7859P6783N0870j01206j910J02200m7305p9377Q5416L7952j03584
$$ 21513 -66346 10437 61307 -39899 -41809 60391 13086 -66291 19125 57077 -46507
1045d6507J1884R7361n8922o8769R1922K4064j03085K5941R0382o9500n6223R6690
$$ -46507 -34623 62738 3816 -64953 26969 51033 -52052 -26111 64271 -5229 -61452 35238
1057C5238R385j00879L9591Q1562p9110m3321R9859n113r7483N1951P2242q6719
$$ 35238 44623 -56256 -16665 64897 -14213 -57534 42325 37212 -60271 -8320 63922 -22797
1069b2797l0457J01198j8138r2030O2232O1935r1490j7657R9357l0111q4208P0199
$$ -22797 -53254 47944 29806 -62224 8 61943 -29547 -47204 52153 22042 -62166 8033
1081H033M9666r3619m157R4659m1595p3770P7027L5877r3696R989Q8340n2574
$$ 8033 57699 -35920 -40077 54582 12987 -60783 16244 52121 -41575 -31586 56754 4180
1093D180o2176Q2575K1787r2739K3148Q0985o2349n0630Q6364Q497r0103L4949
$$ 4180 -57996 24579 46366 -46373 -23225 57760 -4589 -55219 31145 39642 -50461 -15512
1105a5512P2646o9803l8396Q7912m226q4974M5558O2229p5383k5027Q7012j7645
$$ -15512 57134 -12669 -51065 36847 32621 -52353 -6795 55434 -19949 -44976 42036 24391
1117B4391p7886N5562N0114p9883j0844Q4895l0870o9564O4944L7907q3372K779
$$ 24391 -53495 2067 52181 -27702 -38546 46349 15479 -54085 10859 48766 -34606 -31827
1129c1827Q2215m2755o1535P2748K6394q5716J4831P8512n2869n3177P8346J5429
$$ -31827 50388 7633 -53902 18846 45240 -40476 -25645 52867 -2 -53179 25167 40596
1141D0596q5785K5998P3143o1107m3355Q1990L800q3443L6640O5553o8215l2548
$$ 40596 -45189 -19191 53952 -7155 -50510 31480 35280 -48163 -11523 54030 -14185 -46733
1153d6733Q3867q088q0026M6636N7483p4550k1605Q4891j9141p5721N5508M9236
$$ -46733 37134 29046 -50980 -4344 53139 -21411 -43016 41875 22734 -52987 2521 51757
1165E1757p8958j1354Q4253k8875p0179O2135M0188q1115j318Q1073l7524o2473
$$ 51757 -27201 -38555 45698 16823 -53356 8779 48967 -32148 -33466 47607 10083 -52390
1177e2390O7067K9822q0661R284P5542m5356n2851P0519J8412p8802J9904O8585
$$ -52390 14677 44499 -36162 -26878 48664 3308 -49543 20976 39388 -39414 -19510 49075
1189D9075n3100m2417P3068O667p6060L0095O1011n9448l1929P4552m265p1948
$$ 49075 -4025 -46442 26626 33293 -42767 -12672 48339 -11109 -43038 31514 27249 -44699
1201d4699L9119N2657o4208k1106P3913j4958o6012M6944M2432o7293r355P1151
$$ -44699 -5580 47077 -17131 -38237 35676 20718 -45294 1650 44082 -23211 -32566 38585
1213C8585k5456n8227N3950L1503o9042K683O7588l5734m9891O0295K0329p0322
$$ 38585 13129 -45098 8852 40355 -28687 -26004 41584 5850 -44041 16254 36583 -33739
1225c3739J3925O3494m5089m1865O5539R844p0479K4315N8799n2837l3195O9085
$$ -33739 -19814 43680 -1409 -43274 22265 32109 -38370 -14055 44744 -8093 -41288 27797
1237B7797q0o8901L3547N2623n8839k4004P0324j0031o5496M1545M5223o3506
$$ 27797 27717 -41184 -7637 44986 -13853 -37857 32467 22436 -43060 -1515 43708 -19798
1249a9798j4460P0447j9641o0941M9129L7356o7078m969O9589k8378n5970N5221
$$ -19798 -34258 36189 16548 -44393 4736 42092 -24986 -29955 39634 11256 -44714 10507
1261A0507K9377o9388L753O7339l6136m9900N9747K1088o9510J2373O3231m2399
$$ 10507 39884 -29504 -25751 41588 5452 -44448 15299 36387 -33123 -20750 42481 82
1273H2m2299O2493J2187o7711K0606N7254m8088l3641O3767K439o4618K8663N0205
$$ 82 -42217 20276 32463 -35248 -14642 42612 -5476 -39117 24650 27089 -37529 -8866 41339
1286D1339n2847k4357O4297o820o0648L6297M2841n6695j5106O3803j5903n5700
$$ 41339 -11508 -35865 28432 21612 -39036 -2739 40102 -16593 -31699 32104 16201 -39499
1298c9499M2692L4566n9191n790O1500k4228m9312M8005K5656n9987L775N7857
$$ -39499 3193 37759 -21432 -27222 34278 10050 -39262 8743 34399 -25588 -21813 36044
1310C6044l1765m1924N2248J6260n9826J2928N3248l9011l4318N5464P119n9075
$$ 36044 4279 -37645 14603 30863 -28963 -16035 37213 -1798 -36116 19348 26467 -32608
1322c2608K1507M8603m5186k6583N8142j466n7270K9305M3242n0092j8959N9298
$$ -32608 -11101 37502 -7684 -34267 23875 22409 -34861 -5556 37686 -12406 -31365 27933
1334B7933r744n4552L5911L6905n3715j1024N8819j7396n0312M1745L0163n6168
$$ 27933 18189 -36363 -452 36453 -17262 -28286 30533 13137 -37175 4570 34733 -21435
1346b1435k837N7612k4810m5456M6783K2818n7886N019N5265l1757m0100N0851
$$ -21435 -24272 33340 8530 -36926 9857 32675 -25211 -20192 35073 3316 -36784 14067
1358A4067J5445n8301J2588N2039l7393l3774N3673Q067n7119J9534M7540m2190
$$ 14067 29512 -28789 -16201 35838 -1555 -35329 18344 26411 -30708 -11174 36366 -5824
1370e824k7054N4848M90n4901K5762M2023m5876j9858N5215o899n1557L1828L6025
$$ -5824 -32878 21970 22460 -32441 -6679 35344 -10532 -30390 24825 17926 -33631 -1803 34222
1383C4222m8826j2219N4630j4183m7478L7056K9248n1117m577N2930k1261m2437
$$ 34222 -14604 -26823 27807 13624 -33854 3202 32450 -18667 -23244 29686 8425 -34012
1395c4012M1550K2137n2054L269N0319k7355l6684M5209J4674n1937J0600M6602
$$ -34012 7538 29675 -22379 -19110 31209 3854 -32830 12379 27053 -24884 -14284 32318
1407C2318l3247l0356M7657O916n1059J7707M2167l8173k3566M9560n21m9026
$$ 32318 -929 -31285 16372 23288 -27771 -10064 32103 -6070 -29636 19924 19403 -29623
1419b9623K4522L7233m2416j6455N0394q060m6410L0490L1308m5699r163M9859
$$ -29623 -5101 32132 -10284 -26739 23655 15595 -30815 -325 30983 -14716 -23879 25980
1431B5980j5068m2489L5616K5154m7672j787M8521k1526l7755L9861J8436m8736
$$ 25980 10912 -31577 4039 29193 -18479 -20266 28255 6729 -31026 8835 27271 -21465
1443b1465N174M5988k7518l2795M3069J1678m8734J1829M2814l2460k6962M5541
$$ -21465 -16291 29697 2179 -30616 12453 24131 -24603 -12774 30040 -2420 -29382 16159
1455A6159N074m7582J8100L8854l6676k0918M6642j871m5636K3818L3738m0134
$$ 16159 21233 -26349 -8249 30605 -6071 -26989 19653 17782 -27854 -4036 29702 -10432
1467a0432j4464M6835q153m2761K8869K8712m2403p970M6235j4112l9174L3026
$$ -10432 -24896 21939 13786 -28975 -106 28606 -13797 -21767 24468 10356 -28818 4208
1479D208K3019m4086j795M4544j9881l5008L6553J7061m4661M525M2373k4837
$$ 4208 27227 -16859 -18654 25890 6009 -28999 7554 24615 -20046 -15521 26852 2015
1491B015k9923L9449J0940m4391J0770L9065k9652k4586M1258M404m3479J6383
$$ 2015 -27908 11541 22481 -21910 -11140 27925 -1727 -26313 14945 19349 -24130 -7747
1503g747L5260l3613j8942M2551j569m1547K1805L1037l6493j3068M2794p584
$$ -7747 27513 -6100 -25042 17509 15940 -25607 -3802 27235 -9258 -22326 20468 12884
1515A2884l8844K6286K5864l9037o915M1935j3623l5319L0611K0310m0448l94
$$ 12884 -25960 326 26190 -12847 -19762 22173 8550 -26769 3842 24152 -16296 -16690
1527a6690M0733j9132l1090L4427J4482m1247N533L8377k4104k6842L6810Q783
$$ -16690 24043 4911 -26179 8248 22730 -18517 -12984 25393 1289 -25553 11257 20040
1539B0040m1238J0946L5632k8066k2069L8734L419l9914J6036L2187l1229j6852
$$ 20040 -21198 -10252 25380 -2686 -24755 13979 17398 -22516 -6480 25707 -5522 -22374
1551b2374L9303k215l8194K0540K7916l4183j1525L9534p733l5689K4995K3579
$$ -22374 16929 14714 -23480 -2940 24976 -9207 -20732 18802 11069 -24620 375 23954
1563B3954l6213n810L9176j2873l2702K8825J8693l7759n82L7720j7745k9365
$$ 23954 -12259 -18069 21107 8234 -24468 4357 23050 -14709 -15291 22429 4684 -24681
1575b4681L1581J3789l8197M531L5741k1571k4918L3666Q751l7417R618L2722
$$ -24681 6900 20689 -17508 -12977 22764 1193 -23725 9941 18692 -18725 -9107 23615
1587B3615k5306k0238L4995L014l6487J4455K9132k8817j5228L6036k347l4766
$$ 23615 -1691 -21929 13066 16080 -20407 -5952 23180 -5637 -20865 15171 12824 -21942
1599b1942J9302K5551l1335j0077L6261p321l2518K2924K1344l3254n421L5403
$$ -21942 -2640 22911 -8424 -18501 17760 10439 -22079 845 22189 -11065 -16486 18917
1611A8917j1914k9620K5918J6777l3931j42L3945j6107k5707K8855J1784l4293
$$ 18917 7003 -22617 3301 20078 -13853 -13995 19950 3843 -21864 6991 18775 -15518
1623a5518N147L1755k0677k1774L1132O345l4543J0199K9416k4667j7509L3133
$$ -15518 -10371 21384 707 -21067 10065 16410 -18133 -7934 21482 -3185 -20694 12439
1635A2439J584l3729J4909K6771k7520j3250L4040l196l2307J8600K3094k9898
$$ 12439 14023 -19706 -4797 21974 -5546 -18796 15244 12048 -20259 -1659 21435 -8463
1647h463q757L3721p841k9928K2239J9035l1249l630L3235j2247k7017K5596J4647
$$ -8463 -17220 16501 8660 -21268 971 20006 -11243 -14873 18362 6115 -20902 4694 19341
1660A9341l2671J204L1990j6819k4152K8215J0329l3376N477L0584k0090k0851
$$ 19341 -13330 -12126 19864 3045 -21107 7108 17437 -15939 -10462 20122 32 -20819
1672b0819K9998O654l2680R302K8215k2476j7051L0456K230l1325J2656K4644
$$ -20819 9179 15833 -16847 -7545 20670 -1806 -18857 11599 13829 -17496 -4840 19804
1684A9804k4597j2782L0430k278k9114J6496K1021k6460p806L0413o793k6851
$$ 19804 -4793 -17575 12855 10577 -18537 -2041 18980 -7480 -15286 15127 8334 -18517
1696a8517K0008J7084k8341l501K9731j1117k4471K2598J3233k8991Q22K8377
$$ -18517 1491 18575 -9766 -13267 16464 5347 -19124 3474 16707 -12284 -11462 16915
1708A6915j4321k1096K4650R197k8594N064K6041j7724j7163K5969M140k8147
$$ 16915 2594 -18502 6148 15345 -13249 -8185 17856 132 -17031 8938 13078 -15069
1720a5069R574K3021k1109j2823K7472p50k7138J4292K0466k4134q535K8652n228
$$ -15069 -5495 17526 -3583 -16406 11066 10316 -16822 -2530 17936 -6198 -14733 13919 8691
1733H691k6192J7894J7503k6502n072K8734q952k4523K0419J4622k7391j243K8014
$$ 8691 -17501 393 17896 -8606 -13678 15056 6104 -18419 2000 16622 -10769 -12012 16002
1746A6002j1939k1812K2660J1006k7831K652K6418j5637j8873K4579O683k8126
$$ 16002 4063 -17749 4911 15917 -11914 -9262 17156 1519 -17354 7225 13908 -14218
1758a4218O735K4728j8863j5742K6584L144k7891J0370K3219k1193j2893K7396
$$ -14218 -7483 17245 -1618 -17360 9224 12368 -15523 -5153 18066 -3127 -16020 11376
1770A1376j19k7135J2756K0637k2619r872K6773l164k5046J5145J7433k3212n765
$$ 11376 11257 -15878 -3122 17515 -5104 -14976 11797 8633 -16413 -1268 16165 -7047 -12812
1783a2812K5915o612k2232J7666J3434k4064j621K4627j0702j9555J9919R574
$$ -12812 13103 6491 -15741 1925 15359 -8705 -10326 14301 3599 -15956 3963 13537
1795A3537k4746K320K3536j3753j6661K1880O412k4579N715K1933j6008j3949
$$ 13537 -11209 -8889 14647 894 -15767 6113 12525 -12054 -6339 15594 -414 -14363
1807a4363K2547K803k3864Q526J9180j8000j0374K2790j116k2095J2137J6215
$$ -14363 8184 10987 -12877 -4351 14829 -3171 -13545 9245 8129 -13966 -1829 14386
1819A4386j9939o102K3348n294k0558J5607J2997k2275k426K3353r267j9296J8447
$$ 14386 -5553 -11655 11693 6399 -14159 1448 14445 -7830 -10256 13097 3830 -15466 2981
1832B981J0386k3603Q82K3364j1843j7503K0484P981k3896L703K2083j4217j5197
$$ 2981 13367 -10236 -9354 14010 2167 -15336 5148 13129 -10767 -7064 15019 802 -14395
1845a4395K1296M490k3654O711J9996j6609j1955K2437J019k2803J0332J8048
$$ -14395 6901 11391 -12263 -5552 14444 -2165 -14120 8317 9336 -13467 -3135 14913
1857A4913j8838q712K3353k414k2270J3071J5830k0823o163K3375n129k1019J4887
$$ 14913 -3925 -12637 10716 8302 -13968 -897 14933 -5890 -12053 11322 6193 -14826 61
1870F1J3828k1297l334K2782p260j8681J6373J0716k1126l24K1029j0110j6030
$$ 61 13889 -7408 -10742 12040 4780 -13901 2472 13188 -7938 -8262 12767 2657 -13373
1883a3373J7499O935k1067L362J9070j2713j2808J9155L488k0575O841J7555j5120
$$ -13373 4126 11061 -10006 -6644 12426 -287 -13095 6060 9548 -11027 -4186 13369 -1751
1896a751j0060K0063L23k0213R133J5483j6748p606K0058k297j8895J1407J3302
$$ -1751 -11811 8252 8575 -11638 -2505 12978 -3770 -11376 8682 6385 -12510 -1103 12199
1909A2199j7522m439J9834n000j6925J3495J0186j8474j191J8913q453j5084J5656
$$ 12199 -5323 -9762 10072 5072 -11853 1642 11828 -6646 -7837 11076 2623 -12461 3195
1922C195P132j9431K254J8428j1113j3033J7778M896j9910M948J7782j3358j1363
$$ 3195 10327 -9104 -6850 11578 465 -12568 5210 10106 -9804 -4856 12926 -432 -11795
1935a1795J8663K249j9874O939J6186j4866r208J9072q7j8842R355J4342j6023
$$ -11795 6868 9117 -10757 -3818 12368 -2498 -11706 7366 7279 -11563 -2208 12134 -3889
1948c889o199J9187k894j7647J1597J1801j7409l595J8958n917j6380J3662R670
$$ -3889 -10088 9099 6205 -11442 155 11956 -5453 -9048 9910 3993 -12387 1275 10945
1961A0945j8321q35J8878p956j4750J5237P711j8577J309J7916r875j3123J5811
$$ 10945 -7376 -8211 10667 2711 -12039 3198 10909 -7668 -6359 11557 1682 -11441 4370
1974D370N064j8303L497J6137j1460j0470J6475K425j7313O283J4442j3070p744
$$ 4370 9434 -8869 -5372 10765 -695 -11165 5310 7735 -9578 -3295 11147 -1923 -9667
1987i667J6999o18j6638Q616J2322j4852n293J7113l176j5836J0819J0621j5840
$$ -9667 7332 6714 -9924 -1308 11014 -3838 -9131 7982 4806 -11030 -211 10410 -5430
2000e430k780J7319n288j4423J2451Q482j6379m60J6380p677j2760J3585N723
$$ -5430 -8210 9109 3821 -10602 1849 10331 -6048 -6508 9872 2195 -10565 3020 8743
2013H743j6592K260J5299r782j0373J5052L277j6468N062J4312j1873q423J5999
$$ 8743 -7849 -5589 9710 -72 -10445 4607 7884 -8584 -3522 10790 -1083 -9506 6493
2026F493O76j6487O993J2966j3638o603J6599j456j5854R013J1645j4370m391
$$ 6493 7169 -9318 -2325 10641 -2997 -9600 6999 5543 -10311 -1298 10347 -4023 -8414
2039h414J6564l320j4751J0567R540j5153k199J5899n757j3325J2024P267j5775
$$ -8414 8150 4830 -9921 646 10186 -4967 -7166 8733 2976 -10349 1675 8942 -6833
2052f833M42J5463p765j1445J3541N222j5880K747J4728r726j0071J4375K960
$$ -6833 -6391 9072 1307 -10138 3403 8625 -7255 -4508 10220 494 -9577 4798 7758
2065G758j6069M550J3514j1150q218J4919R13j5165O582J2047j2022n942J5085
$$ 7758 -8311 -3761 9753 -1397 -9615 5304 6217 -8948 -2366 9681 -2341 -8283 6802
2078F802j305j4298Q274J0082j3252l740J4802l836j3130J0049Q169j4022j242
$$ 6802 5497 -8801 -527 9555 -3697 -7437 7365 3529 -9601 448 8617 -5405 -6647
2091f647J4813n747j1677J1616O323j4515P64J4112p673j0503J2486M151j4665
$$ -6647 8166 2419 -9258 2358 8681 -5834 -5070 9042 1369 -9134 3352 7503 -7162
2104g162K724J3060r153q526J3237K193j4031M924J1860j0475o501J3749k17j3664
$$ -7162 -4438 8622 -531 -9057 4180 6373 -7658 -2734 9126 -1349 -7850 5899 5682 -7982
2118g982O743J0205j2006m614J4040k418j2935Q619Q812j2765k440J4183m077
$$ -7982 -1239 8966 -3040 -7654 6386 3968 -8967 -348 8464 -4301 -6741 7442 3365
2131C365j1981R983P311j3431p99J3591n966j0975J0919N394j3655J130J3015
$$ 3365 -8616 1367 8678 -4753 -5552 8039 2073 -8902 2017 7411 -6244 -5114 7901
2144G901p386r311J2086L610j3577L351J2131q999p763J2744J495j3671M895J1060
$$ 7901 515 -8796 3290 6900 -6677 -3326 8805 -194 -7957 4787 6282 -7389 -2494 8566
2158H566j0496o156J3231l12j3001O566J0011j1179m292J3421j969j2162P873
$$ 8566 -1930 -8086 5145 4833 -8168 -1602 8409 -2770 -7062 6359 4390 -7772 101
2171A01Q297j1993k586J2970l920j1251R172O569j2465n16J2845n609r862J0608
$$ 101 8398 -3595 -6181 6789 2869 -8382 790 7359 -5106 -5622 7223 1614 -8248 2360
2185B360M986j2801J387J2217p254q720J1229L057j2935K968J1202q543p069J1865
$$ 2360 7346 -5455 -4068 8149 895 -7825 3404 6461 -6474 -3506 7696 -847 -7916 3949
2199C949J337j2263M789J0123r483n190J2040n32j1766O326Q536j0728l500J2228
$$ 3949 5286 -6977 -2188 7935 -1548 -6738 5302 4770 -6996 -670 7866 -2862 -6362 5866
2213E866k698j1102Q028P144j1470j477J2419m343r961R279N754j1999J37J1903
$$ 5866 3168 -7934 94 7238 -4232 -5709 6710 2367 -7594 1685 7439 -4560 -4423 7480
2227G480o035r104J0105L941j2242J767J1200p292p572J1067K313j1949L732J0415
$$ 7480 1445 -7659 2446 6387 -5855 -4088 7112 -180 -7752 3315 5628 -6321 -2589 7826
2241G826q650o055J1745K97j1991N357R249j0108m611J2234j460j1565O946Q373
$$ 7826 -824 -6879 4866 5163 -6828 -1471 7778 -2330 -6941 5293 3833 -7732 -786 7587
2255G587j0819k993J2420k729j0844Q096P018j1490j549J1944m417r921Q863N382
$$ 7587 -3232 -6225 6195 3466 -7378 718 7736 -3754 -5303 6641 2224 -7697 1166 6548
2269F548j1605K53J1483n788q550J0151L798j1690K142J0863p297p314J0758J990
$$ 6548 -5057 -4804 6679 891 -7659 2492 6290 -5400 -3258 7605 308 -7006 3752 5742
2283E742j1925L599R865q497n999J1272M95j1370N102Q934r127m300J1364j109
$$ 5742 -6183 -2584 7281 -1216 -7215 4057 4552 -6818 -1716 7218 -1909 -6209 5155 4046
2297D046j0559O266P331r823k695J0961k970r658P569N918j0604o82J0962m525
$$ 4046 -6513 -247 7084 -2739 -5434 5527 2557 -7101 468 6386 -4218 -4900 6062 1537
2311A537q524Q965M414j0997J045J0568o183p690R697K855j1272K334R934p273
$$ 1537 -6987 1978 6392 -4605 -3560 7008 825 -6865 2832 5687 -5585 -3251 6683 -590
2325e90o406J0354J418j0838M051R007q195m811J0681l62j0586N550P739r539
$$ -590 -6996 3358 4776 -6062 -2011 6996 -1199 -6010 4671 4309 -6277 -727 7012 -2527
2339b527l222J0915k228j0115P120O760j0309j677J1292l526r484Q301N654j0885
$$ -2527 -5749 5166 2938 -7177 -57 6703 -3606 -5283 6009 2483 -7001 1300 6954 -3931
2353c931n00J0958m741q900Q804M343j0942Q13J0403n841p468R503K985j0708
$$ -3931 -4431 6527 1786 -7114 1690 6033 -4909 -4096 6307 466 -7002 2501 5486 -5222
2367e222K401R765p095o185J0154J149j0738L835Q761q275m951J0518j70j0533
$$ -5222 -2821 6944 -151 -6336 3818 4967 -5771 -1936 6825 -1450 -6401 4117 3947 -6586
2381f586N294Q054q965l563J0772j436r878O236O773r409k275J0303k927q921
$$ -6586 -1292 6762 -2203 -5766 5006 3570 -6308 -72 6701 -2708 -4983 5320 2393 -6528
2395f528P054N287r765l92R912m342p692Q363L700r997J379R499o033o575R118
$$ -6528 526 5813 -3952 -4344 5568 1226 -6466 1897 5597 -4400 -3021 6478 445 -6130 2988
2410B988K077j0350K744Q892p226n549R878P29j0115M220Q264q058m062J0012
$$ 2988 5065 -5285 -2541 6351 -875 -6424 3454 4183 -5932 -1712 6552 -1506 -5568 4444
2424D444o41r640N366O941q859k806J0078k306r074O680N724r512j078J0261l718
$$ 4444 3803 -5837 -471 6470 -2389 -5195 4883 2577 -6497 183 5907 -3605 -4683 5578 1860
2439A860q304P979M585j0187L70J0037n176p700Q752L307j0519J525R664o260
$$ 1860 -6444 1535 6120 -4067 -3697 6340 1164 -6536 2216 5523 -4996 -3471 6193 -67
2453f7o561R348K170j0237K896Q994p043n415R713P59j0034M057P869q048m146
$$ -67 -6628 2720 4890 -5347 -2451 6543 -500 -5915 3798 4557 -5477 -1420 6449 -1599 -5745
2468e745R959q85r612N506O920q698k562J0122k181q946O614N883r432j340R908
$$ -5745 4214 3329 -6283 -777 6143 -2555 -5117 5005 2824 -6122 492 6375 -3057 -4397 5511
2483E511l567q238P313M496r609J01R405m619o991Q078L203r491J694Q784n931
$$ 5511 1944 -6294 1019 5515 -4094 -3993 5412 793 -6198 1880 5083 -4408 -2714 6070 139
2498A39n789Q786J343r469L088P951p211m586R285L0r340M592P251p967l189R605
$$ 139 -5650 3136 4479 -4990 -1902 6049 -1162 -5748 3537 3567 -5773 -1181 6070 -1897 -5086 4519
2514D519j307q900N631O196q641k083R509k751q287O595M944r011n82R322l864
$$ 4519 3212 -5688 -57 6139 -2502 -4585 4924 2173 -6114 481 5425 -3586 -4168 5154 1290
2529A290p365P666L806r286Q03Q985n244o487Q319K355r612K122Q465o316n530
$$ 1290 -6075 1591 5397 -3889 -3086 5899 655 -5832 2487 4842 -4770 -2648 5817 -499 -6029
2544f029Q919J292r448L323Q044p109m354R199O0r219M412O993p885l293R264
$$ -6029 2890 4182 -5266 -1943 6101 -1008 -5362 3837 3897 -5322 -910 6083 -1802 -5095 4169
2559D169j296q725N489N927q272j866R300k554p908O546M842q775n94R097l916
$$ 4169 2873 -5852 -363 5564 -2708 -4574 4726 2172 -5736 810 5652 -3123 -3717 5380 1464
2574A464p294P257L643r199P21Q726m990o215Q031K384q947K026Q087n792n154
$$ 1464 -5830 1427 5070 -4129 -3408 5318 328 -5887 2144 4528 -4419 -2393 5694 -98 -5252
2589e252Q356J044q927L193P211o767m084Q702l26q522M462O468p600k602Q996
$$ -5252 3104 4148 -4779 -1586 5625 -1142 -5226 3476 3150 -5372 -910 5558 -2042 -4644 4352
2604D352j712q019N619N412q339j400Q892k998p566O583M229q672j06Q722m056
$$ 4352 2640 -5379 240 5652 -2687 -4087 4805 1807 -5759 824 5053 -3619 -3725 4997 941
2619I41o693P452L170q842J289Q323n311n674P966J760q974K533P601o364m593
$$ 941 -5752 1700 4870 -3972 -2683 5640 329 -5345 2621 4381 -4593 -2060 5541 -823 -5416
2634e416Q489N76q835L799P069p069l561Q905o29q594M825O206p861k505Q929
$$ -5416 3073 3649 -5186 -1387 5682 -1387 -4948 3957 3328 -5266 -441 5765 -2096 -4601 4328
2649D328j896q101N728N254q277j230Q881k975p259O618M123q552Q8Q530m244
$$ 4328 2432 -5669 59 5313 -2964 -4194 4687 1712 -5547 1071 5194 -3358 -3270 5260 1016
2664A016o491P305K851q805J226Q181n273n598P932J805q728K525P587o080m490
$$ 1016 -5475 1830 4681 -4124 -2898 5283 10 -5588 2344 4149 -4579 -2054 5533 -547 -5037
2679e037Q261N82q582L581O682o823l493Q409p00q094M620N828p421k126Q546
$$ -5037 3224 3806 -4776 -1195 5487 -1336 -4829 3580 2880 -5214 -594 5234 -2187 -4313 4233
2694D233j971p452N659M791p963r58Q456l280o930O510L716q394L00Q179m263
$$ 4233 2262 -5190 469 5260 -2703 -3661 4795 1515 -5415 1095 4811 -3583 -3283 4896 633
2709F33o127P245K674q412J547P721n157n166P683J429q469K647P032o172m067
$$ 633 -5494 1751 4425 -3987 -2440 5281 124 -5042 2641 4070 -4399 -1752 5280 -892 -4959
2724d959Q062R9q161L877O385o947k994Q511r84p977M934N611p708j937Q595k307
$$ -4959 3103 3202 -4959 -1082 5303 -1644 -4638 3873 2889 -5088 -154 5457 -2251 -4188 4407 2100
2740B100p613N888M724q177q00Q529l251o809O587L731q290L95Q114m337o001
$$ 2100 -5513 375 5099 -3078 -3878 4651 1400 -5409 1178 4909 -3381 -2986 5128 791 -5210
2755e210P217K420q503J643P569n361n036P797J357q547K909P110o161m116Q264
$$ -5210 2007 4427 -4076 -2433 5136 -225 -5261 2536 3893 -4654 -1745 5365 -796 -4912 3352
2770C352J69q321L821O395o877l147Q232q75p831M610N502p212j903Q101j915
$$ 3352 3521 -4800 -979 5416 -1461 -4608 3624 2749 -5082 -472 5030 -2182 -4085 4016 2101
2785B101p109N510M416p605o47P903l242o394O310L265q052N33P797m421n576
$$ 2101 -5008 502 4918 -2687 -3334 4569 1327 -5067 1243 4508 -3544 -3011 4786 365 -5211
2800e211P120K160q060J774P351n306m642P494J084q021K776O591o053l700P736
$$ -5211 1909 4069 -3991 -2217 5134 -172 -4814 2680 3764 -4257 -1481 5110 -943 -4643 3093
2815C093k15p604L856N759o708k329P989j558p110N070M766p516j182Q077k788
$$ 3093 2878 -4726 -870 4889 -1819 -4148 3841 2283 -4827 243 5009 -2507 -3689 4388 1600
2830A600o912O139L932q080q6Q095l763o293O904L036q216R72P734m650n392P213
$$ 1600 -5312 827 4759 -3321 -3407 4688 925 -5368 1536 4572 -3644 -2672 5062 412 -4980 2233
2846B233J921q246J973P186n572m398P624P14q061L299O490o388l345Q035l57
$$ 2233 4154 -4092 -2119 5067 -505 -4903 2721 3435 -4626 -1327 5163 -1225 -4570 3465 3108
2861C108p884M203N862p099k527Q294j545p587N035N109p461j481Q177k378o812
$$ 3108 -4776 -573 5289 -1810 -4337 3957 2412 -5175 -140 4969 -2492 -3973 4204 1826 -4986
2876d986N657M107p572m16P701l352o050O306K837p708R35P130m422n055O964
$$ -4986 671 4778 -2794 -3210 4491 1139 -4911 1395 4232 -3476 -2541 4589 167 -4888 2076
2891B076J645p768K145O827n390m153P440O00p772L167O172o149l264P614m52
$$ 2076 3721 -4047 -1902 4925 -465 -4618 2822 3422 -4350 -1183 4989 -1160 -4424 3190 2738
2906B738p412M012N423o592k126P604j541o755M928M376p068q40P426k862o131
$$ 2738 -4674 -662 4761 -1831 -3957 3647 2106 -4649 279 4655 -2413 -3253 4173 1311 -4820
2921d820N801L315p534K98P468m009n509O747K350p803J439P184m849m842P176
$$ -4820 981 4296 -3238 -2940 4528 519 -4990 1757 4107 -3696 -2257 4927 78 -4764 2412
2936B412J425p878K297O690n627l965P478K85p606L416N917o164k923P592p55
$$ 2412 3837 -4041 -1744 4946 -681 -4646 2832 3117 -4489 -1073 4844 -1320 -4243 3349 2594
2951B594p191M322N121o852j822P747j946o869N191M327p289q64P760k830o350
$$ 2594 -4597 -275 4846 -2006 -3828 3919 1973 -4896 295 4622 -2667 -3531 4229 1399 -4951
2966d951N941L506p456J6P446l579n655O300K494p492J053O887m417m738O699
$$ -4951 990 4496 -2960 -2944 4502 923 -4732 1568 4062 -3430 -2377 4510 93 -4645 2054
2981B054J367p242K104O353n263l737P126K53p153L202N615o006k748P320q53
$$ 2054 3421 -3821 -1717 4636 -627 -4364 2762 3015 -4138 -936 4679 -1327 -4075 3245 2392
2996B392o901M140M872o412j835P412j734o469M878M102o814p78P149k688n828
$$ 2392 -4509 -369 4503 -1909 -3744 3668 1934 -4535 343 4445 -2369 -3147 4002 1314 -4514
3011d514N484L106p065K91O915l730n047O236K069p306J546O556m661m321O815
$$ -4514 970 4076 -2989 -2698 4217 487 -4560 1676 3745 -3561 -2015 4541 -120 -4441 2374
3026B374J060p405K508O108n414l612P213R4p158L273N605n992k683P358q44o860
$$ 2374 3434 -3971 -1463 4645 -769 -4381 2832 2926 -4232 -959 4646 -1346 -4029 3329 2485 -4375
3042d375M196M741o462j639P286j959o320M983L864o902n50P142k948n769N804
$$ -4375 -179 4562 -1900 -3539 3747 1788 -4532 451 4315 -2587 -3137 4005 1057 -4712 1092
3057A092L052p228M69P001l767n195O293K081p283J473O481m568m318O600J091
$$ 1092 4144 -3084 -2615 4386 619 -4576 1717 3798 -3485 -2012 4469 -99 -4417 2183 3274
3072C274p116K344N959n239l237O787k6o741L248N206n876k302O923j081o371
$$ 3274 -3842 -1498 4461 -778 -4015 2772 2746 -3995 -747 4459 -1417 -3719 3204 2123 -4248
3087d248M117M358o282j268O944k063n889M923L548o659l19O808k956n367N567
$$ -4248 -131 4227 -2055 -3323 3621 1558 -4331 592 4140 -2519 -2838 3970 1014 -4353 1214
3102A214K614o860O96O415l767m582N976J672o831J720N970m629l659O495N28
$$ 1214 3828 -3032 -2336 4079 312 -4270 1706 3378 -3453 -1733 4237 -392 -4051 2444 2972
3117B972o709K658N459n378k857O687m04o484L512M835n865j993O812j274o195
$$ 2972 -3737 -1079 4380 -998 -3855 2832 2428 -4056 -544 4291 -1574 -3567 3245 1971 -4224
3132d224M372M064o258j110O759k156n743M917L321o539j78O652l110n114N544
$$ -4224 148 4212 -2046 -3156 3603 1447 -4296 621 3942 -2597 -2775 3877 767 -4347 1197
3147A197K474o689P74O369l854m462O055J490o798J726N946m591l724O337O74
$$ 1197 3671 -3018 -2244 4125 271 -4191 1864 3354 -3444 -1718 4228 -363 -4087 2250 2924
3162B924o683K597N369n049k937O488j63o440L348M744n666j996O602j270n921
$$ 2924 -3759 -1162 4207 -842 -3779 2709 2546 -3894 -546 4198 -1468 -3464 3138 1868 -4053
3177d053M121L906o030r58O506k180n437M851L050o257o5O322l044m865N431K221
$$ -4053 68 3974 -2056 -3014 3492 1312 -4125 726 3776 -2481 -2546 3776 732 -4133 1298 3519
3193C519o473Q76O001l835m098N779J310o435J832N594m554l335O125L85o246
$$ 3519 -2954 -2078 3923 88 -4010 1769 3079 -3356 -1524 4070 -484 -3819 2306 2691 -3555
3208c555K686M970n179k383O261o36o025L575M296n635j599O450j548n667M218
$$ -3555 -869 4101 -1078 -3461 2800 2164 -3861 -286 4010 -1625 -3224 3226 1678 -3989 229
3223B29L647n986o93O367k366n266M890K836o266J86O174l222m575N432J919o305
$$ 229 3876 -2110 -2803 3564 1198 -4068 822 3658 -2608 -2422 3752 530 -4045 1387 3306 -2999
3239b999J085N857l944l873N845J051o402K052N340m637l183O212J79o238K903
$$ -2999 -1914 3943 -1 -3874 1971 3022 -3380 -1328 4012 -625 -3808 2404 2583 -3655 -752
3254g52M761n168k276O334q07n950L645M188n657j440O324j611n554M290L436
$$ -752 4009 -1159 -3435 2899 2092 -3858 -213 3975 -1682 -3122 3202 1591 -3963 327 3763
3269C763n957n11O105k426m945M819K625o085L94N901l173m375N289J753o159
$$ 3763 -2194 -2705 3400 974 -3971 848 3473 -2612 -2218 3683 510 -3865 1424 3177 -2982
3284b982J205N650m028l647N742Q80o088K039N171m629k850N920m1n882K882M473
$$ -2982 -1777 3873 -155 -3802 1940 2820 -3268 -1229 3942 -687 -3537 2383 2342 -3540 -658 3815
3300C815n031k045O028r53n510L591L858n524j104N967j715n153M307L085n816
$$ 3815 -1216 -3261 2767 1814 -3696 -105 3753 -1771 -2875 3092 1377 -3776 531 3616 -2200
3315b200k39N887k663m589M913K201n953O14N592l338m007N294J530o091J563
$$ -2200 -2439 3448 785 -3804 1109 3310 -2643 -2029 3563 225 -3782 1512 3042 -3049 -1486
3330a486N217m001l403N729O32n969K241M861m683k533N864k66n811L084M290
$$ -1486 3731 -270 -3673 2056 2688 -3281 -1040 3821 -862 -3395 2469 2203 -3608 -524 3766
3345C766n091j817N977j005n535L765L633n503j001O027j915n071M289L009n770
$$ 3766 -1325 -3142 2835 1830 -3705 60 3693 -1810 -2811 3216 1301 -3770 519 3528 -2242
3360b242k12N779k485m664M807K285n887O07N588l216m038N190J471n889J394
$$ -2242 -2454 3325 840 -3824 983 3268 -2619 -2012 3576 360 -3678 1512 2983 -2906 -1512
3375a512N147l869l296N502O13n764K159M723m438k540N581j43n529K874M152
$$ -1512 3635 -234 -3530 1972 2585 -3179 -1020 3703 -735 -3275 2306 2163 -3366 -492 3660
3390C660m937j710N654r52n232L448L558n230r37N652j777m833M206K758n528
$$ 3660 -1277 -2987 2667 1715 -3517 -69 3489 -1741 -2678 2974 1197 -3636 570 3328 -2200
3405b200n2N496k543m221M565K015n600P34N220l347l553N050J137n555J554M786
$$ -2200 -2252 3244 701 -3520 1045 3060 -2540 -1806 3414 67 -3486 1564 2701 -2854 -1300 3486
3421C486l860k930N347K76n514K456M275m501k208N581m74n338L076L849m921
$$ 3486 -374 -3304 2043 2319 -3195 -739 3536 -965 -3173 2408 1934 -3404 -328 3521 -1400
3436a400j400N612j352m958L715L227n273o28N534k050m518M240K487n498J66
$$ -1400 -2800 2812 1460 -3498 217 3444 -1829 -2457 3077 1027 -3491 749 3236 -2262 -2096
3451b096N391k772m077M715J731n528R07N119l387l470N071J089n615J713M656
$$ -2096 3295 523 -3554 1161 2892 -2636 -1729 3390 3 -3467 1604 2693 -2922 -1209 3447
3466C447l881k800N250K95n408K355M192m368k081N365n49n063K969L657m724
$$ 3447 -434 -3234 2016 2311 -3097 -742 3450 -918 -2999 2366 1817 -3246 -277 3380 -1344
3481a344j356N349j252m774L620K950m998n27N232j995m279M108K244n151K31
$$ -1344 -2700 2649 1397 -3377 243 3193 -1805 -2332 2900 905 -3374 734 2978 -2173 -1942
3496a942N095k772l654M481J543n264J063M689l318l121M819P86n264J877M278
$$ -1942 3153 381 -3273 1208 2751 -2513 -1450 3239 -79 -3200 1619 2405 -2859 -982 3296
3511C296l867k437N063kn092K506L826m398j639N155q07m827L135L309m741r96
$$ 3296 -571 -3008 2055 2053 -3039 -533 3293 -1105 -2744 2411 1604 -3223 -88 3221 -1520 -2516
3527b516N253j579m419L630K732m932k99N122k222m106M289J913n092M42M890
$$ -2516 2737 1158 -3261 369 3101 -1831 -2130 2992 770 -3336 953 2866 -2226 -1784 3106
3542C106k815l582M618J236n079J160M568l368l004M908M76n065J946M162l914
$$ 3106 291 -3291 1327 2563 -2516 -1356 3212 -156 -3160 1748 2224 -2841 -895 3267 -647
3557f47k316M961k2m939K437L779m343j573N021p93m697L099L169m561r78N055
$$ -647 -2963 1998 1976 -2963 -526 3253 -1090 -2663 2358 1565 -3132 -33 3136 -1425 -2403 2652
3573B652j545m240L514K589m810k12M883k178l820L968J904m903N25M701k806
$$ 2652 1107 -3133 381 2970 -1840 -2052 2831 653 -3167 801 2705 -2198 -1673 3028 222
3588B22l326M396J159m879J149M390l334k698M608M35m828J823M019l811k070
$$ 222 -3104 1292 2451 -2428 -1279 3111 -223 -2921 1687 2122 -2706 -883 3136 -675 -2745
3603b745M747k15m651K455L490m165j492M917r51m453L109K908m466q02M897j545
$$ -2745 2002 1787 -2864 -409 3081 -1084 -2576 2341 1390 -3063 46 2954 -1512 -2314 2583 1038
3619A038m143L622K359m751r3M773k168l661L950J734m801N19M616k792l263M318
$$ 1038 -3105 517 2876 -1875 -1968 2805 637 -3024 926 2660 -2141 -1622 2994 202 -3061 1257
3635A257J153m876J251M302l319k708M630M38m891J916L904l734k116M784j95
$$ 1257 2410 -2466 -1215 3087 -232 -2940 1690 2128 -2763 -847 3057 -677 -2793 1991 1796
3650A796m715K512L422m107j455M849r20m403L059K948m433q19M858j558m046
$$ 1796 -2919 -407 3015 -1092 -2547 2302 1382 -3021 38 2986 -1447 -2266 2592 1034 -3012
3665c012L532K243m555o5M616k192l585L920J654m693N71M382k647l153M244J069
$$ -3012 520 2763 -1792 -1857 2759 567 -3018 902 2556 -2137 -1566 2816 169 -2984 1260 2329
3681B329m683J242M101l277k490M452K47m531J819L785l712j867M563l21m390
$$ 2329 -2354 -1112 2989 -288 -2778 1674 1921 -2610 -791 2994 -718 -2585 1978 1657 -2733
3696b733K445L234m038j278M701j027m194L052K660m360n34M543j649l779L489
$$ -2733 -288 2946 -1092 -2370 2331 1304 -2890 162 2822 -1538 -2072 2471 822 -2957 532
3711E32K185m539K9M540k265l448L903J513m629P03M367k807k934M137R14m598
$$ 532 2717 -1822 -1793 2747 482 -2966 937 2450 -2179 -1476 2891 84 -2850 1287 2201 -2397
3727b397J354L991l299k395M436K42m591K033L523l660j779M552m07m405K582
$$ -2397 -1043 2948 -351 -2746 1690 1932 -2659 -626 2897 -763 -2542 2010 1603 -2802 -220
3742b20L116m064j136M537j059l994K943K639m280n02M561j716l651L448K005
$$ -220 2896 -1168 -2304 2233 1174 -2820 123 2762 -1518 -2020 2541 825 -2826 622 2627
3757B627m404J55M290k261l270L825J412m497P90M042k759k635L980P90m440J386
$$ 2627 -1777 -1622 2668 407 -2863 962 2374 -2123 -1333 2709 -50 -2685 1295 2085 -2355 -969
3773i69L773l207k223M278J23m309J978L348l609j586M337m88m070K503K882l959
$$ -969 2804 -403 -2626 1652 1775 -2534 -556 2792 -817 -2403 1934 1446 -2624 -121 2761 -1198
3789a198r52M412j170l862L028K331m131l01M315j793l424L363J788m237K50M152
$$ -1198 -2150 2262 1092 -2770 258 2589 -1542 -1843 2472 679 -2745 618 2406 -1831 -1581 2571
3805B571k209l088L749J191m354Q83L970k792k532L943O51m323J460L622l214
$$ 2571 362 -2726 1023 2214 -2140 -1257 2713 -79 -2611 1332 1983 -2340 -880 2742 -472
3820d72k025M200L4m241K025L207l536j546M307n18m038K493K791l882q81M297
$$ -472 -2497 1703 1737 -2504 -479 2728 -808 -2354 1953 1435 -2603 -110 2681 -1201 -2082 2215
3836B215j165l724K955K238m022l28M183j713l309L353J715m205L22M026k259
$$ 2215 1050 -2674 281 2519 -1503 -1831 2352 639 -2670 683 2398 -1807 -1485 2541 282
3851B82k922L691J075m146Q72L738k739k395L936M94m182J445L495l186j872M041
$$ 282 -2640 1051 2126 -2020 -1148 2590 -149 -2544 1392 1886 -2296 -851 2644 -542 -2414 1627
3867A627k3m068K000L084l541j364M200o40l812K525K570l708q07M114j226l480
$$ 1627 1604 -2464 -464 2620 -921 -2285 1915 1275 -2537 -12 2558 -1150 -1957 2157 931 -2549
3883b549K940K053l891k29L961j737l149L288J594m105M11L885k271k721L546
$$ -2549 391 2444 -1447 -1676 2285 548 -2601 687 2281 -1824 -1413 2472 201 -2520 1026
$$ [...]
8191A02
##END NTUPLES=NMR FID
##END=
