##TITLE=1H_IG-160benz90
 CDCl3
 8 sc, 
 17.1.2022
##JCAMPDX= 6.0         $$ Bruker NMR JCAMP-DX V2.0
##DATA TYPE= NMR FID
##DATA CLASS= NTUPLES
##ORIGIN= UXNMR, Bruker Analytische Messtechnik GmbH
##OWNER= root
$$ XWIN-NMR		Version 3.5
$$ Mon Jan 17 16:45:04 2022 Russian Standard Time (UT+4h)  she@DPX200
##.OBSERVE FREQUENCY= 200.131346
##.OBSERVE NUCLEUS= ^1H
##.DELAY= (6, 6)
##.ACQUISITION MODE= SIMULTANEOUS
##.ACQUISITION SCHEME= undefined
##.AVERAGES= 8
##.DIGITISER RES= 18
##SPECTROMETER/DATA SYSTEM= spect
##.PULSE SEQUENCE= zg30
##.SOLVENT NAME= CDCl3
##.SHIFT REFERENCE= (INTERNAL, CDCl3, 0, 15.7039)
##AUDIT TRAIL= $$ (NUMBER, WHEN, WHO, WHERE, WHAT)
$$ ##TITLE= Audit trail, XWIN-NMR		Version 3.5
$$ ##JCAMPDX= 5.01
$$ ##ORIGIN= Bruker BioSpin GmbH
$$ ##OWNER= she
$$ F:/spectra/data/she/nmr/H-F/1/audita.txt
$$ ##AUDIT TRAIL=  $$ (NUMBER, WHEN, WHO, WHERE, WHAT)
(   1,<2022-01-17 16:44:04.81 +0400>,<she>,<DPX200>,
      <created by zg, POWCHK disabled, PULCHK disabled
       configuration hash MD5:
       00 E9 B6 7A A2 85 ED C7 34 08 36 98 17 FE 4E 26
       data hash MD5: 16K
       ED 5C 12 68 40 25 56 9E D7 39 A4 F3 54 02 94 62>)
$$ ##END=
$$ 
$$ hash MD5
$$ 1F A5 26 4D 1F C7 7C D0 7C 23 B6 D5 DB 9F 35 5F
##$RELAX= 
##$RELAX= 
##$RELAX= 
##$RELAX= 
##$RELAX= 
##$RELAX= 
$$ Bruker specific parameters
$$ --------------------------
##$DU= <F:/spectra>
##$EXPNO= 1
##$NAME= <H-F>
##$PROCNO= 1
##$TYPE= <nmr>
##$USER= <she>
##$AMP= (0..31)
100 100 100 100 100 100 100 100 100 100 100 100 100 100 100 100 100 100 
100 100 100 100 100 100 100 100 100 100 100 100 100 100 
##$AQSEQ= 0
##$AQ_mod= 1
##$AUNM= <au_zg>
##$AUTOPOS= <>
##$BF1= 200.13
##$BF2= 200.13
##$BF3= 200.13
##$BF4= 200.13
##$BF5= 200.13
##$BF6= 200.13
##$BF7= 200.13
##$BF8= 200.13
##$BYTORDA= 1
##$CFDGTYP= 0
##$CFRGTYP= 5
##$CHEMSTR= <none>
##$CNST= (0..31)
1 1 145 1 1 1 1 1 1 1 1 1 1 1 1 1 1 1 1 1 1 1 1 1 1 1 1 1 1 1 1 1 
##$CPDPRG= <>
##$CPDPRG1= <>
##$CPDPRG2= <>
##$CPDPRG3= <>
##$CPDPRG4= <mlev>
##$CPDPRG5= <mlev>
##$CPDPRG6= <mlev>
##$CPDPRG7= <mlev>
##$CPDPRG8= <mlev>
##$CPDPRGB= <>
##$CPDPRGT= <>
##$D= (0..31)
0 1.2 0 0 0 0 0 0 0 0.06 0 0.03 0 0 0 0 0.0002 0 0 0 0 0 0 0 0 0 0 0 0 
0 0 0 
##$DATE= 1642423444
##$DBL= (0..7)
120 120 120 120 120 120 120 120 
##$DBP= (0..7)
150 150 150 150 150 150 150 150 
##$DBP07= 0
##$DBPNAM0= <>
##$DBPNAM1= <>
##$DBPNAM2= <>
##$DBPNAM3= <>
##$DBPNAM4= <>
##$DBPNAM5= <>
##$DBPNAM6= <>
##$DBPNAM7= <>
##$DBPOAL= (0..7)
0.5 0.5 0.5 0.5 0.5 0.5 0.5 0.5 
##$DBPOFFS= (0..7)
0 0 0 0 0 0 0 0 
##$DE= 6
##$DECBNUC= <off>
##$DECIM= 32
##$DECNUC= <off>
##$DECSTAT= 4
##$DIGMOD= 1
##$DIGTYP= 9
##$DL= (0..7)
0 120 120 120 120 120 120 120 
##$DP= (0..7)
150 150 150 150 150 150 150 150 
##$DP07= 0
##$DPNAME0= <>
##$DPNAME1= <>
##$DPNAME2= <>
##$DPNAME3= <>
##$DPNAME4= <>
##$DPNAME5= <>
##$DPNAME6= <>
##$DPNAME7= <>
##$DPOAL= (0..7)
0.5 0.5 0.5 0.5 0.5 0.5 0.5 0.5 
##$DPOFFS= (0..7)
0 0 0 0 0 0 0 0 
##$DQDMODE= 0
##$DR= 18
##$DS= 0
##$DSLIST= <SSSSSSSSSSSSSSS>
$$ [...]
##$SUBNAM2= <"">
##$SUBNAM3= <"">
##$SUBNAM4= <"">
##$SUBNAM5= <"">
##$SUBNAM6= <"">
##$SUBNAM7= <"">
##$SUBNAM8= <"">
##$SUBNAM9= <"">
##$SW= 18.0517287032376
##$SWIBOX= (0..15)
0 0 2 0 0 0 0 0 0 0 0 0 0 0 0 0 
##$SW_h= 3612.71676300578
##$TD= 16384
##$TD0= 1
##$TE= 0
##$TE2= 300
##$TE3= 300
##$TEG= 300
##$TL= (0..7)
0 120 120 120 120 120 120 120 
##$TP= (0..7)
150 150 150 150 150 150 150 150 
##$TP07= 0
##$TPNAME0= <>
##$TPNAME1= <>
##$TPNAME2= <>
##$TPNAME3= <>
##$TPNAME4= <>
##$TPNAME5= <>
##$TPNAME6= <>
##$TPNAME7= <>
##$TPOAL= (0..7)
0.5 0.5 0.5 0.5 0.5 0.5 0.5 0.5 
##$TPOFFS= (0..7)
0 0 0 0 0 0 0 0 
##$TUNHIN= 0
##$TUNHOUT= 0
##$TUNXOUT= 0
##$USERA1= <user>
##$USERA2= <user>
##$USERA3= <user>
##$USERA4= <user>
##$USERA5= <user>
##$V9= 5
##$VALIST= <valist>
##$VCLIST= <CCCCCCCCCCCCCCC>
##$VD= 0
##$VDLIST= <DDDDDDDDDDDDDDD>
##$VPLIST= <PPPPPPPPPPPPPPP>
##$VTLIST= <TTTTTTTTTTTTTTT>
##$WBST= 1024
##$WBSW= 4
##$XGAIN= (0..3)
0 0 0 0 
##$XL= 0
##$YL= 0
##$YMAX_a= 122044
##$YMIN_a= -120510
##$ZGOPTNS= <>
##$ZL1= 120
##$ZL2= 120
##$ZL3= 120
##$ZL4= 120
##$ABSF1= 10
##$ABSF2= 0
##$ABSG= 5
##$ABSL= 3
##$ALPHA= 0
##$AQORDER= 0
##$ASSFAC= 0
##$ASSFACI= 0
##$ASSFACX= 0
##$ASSWID= 0
##$AUNMP= <proc_1d>
##$AZFE= 0.1
##$AZFW= 0.1
##$BCFW= 1
##$BC_mod= 2
##$BYTORDP= 1
##$COROFFS= 0
##$CY= 11.3945322036743
##$DATMOD= 1
##$DC= 2
##$DFILT= <>
##$DTYPP= 0
##$F1P= 2.36226072786647
##$F2P= -0.459571619588291
##$FCOR= 0.5
##$FTSIZE= 0
##$FT_mod= 4
##$GAMMA= 1
##$GB= 0.15
##$INTBC= 1
##$INTSCL= 1
##$ISEN= 128
##$LB= 0.24
##$LEV0= 0
##$LPBIN= 0
##$MAXI= 10000
##$MC2= 0
##$MEAN= 0
##$ME_mod= 0
##$MI= 1.114404
##$NCOEF= 0
##$NC_proc= 0
##$NLEV= 6
##$NOISF1= 3.799351
##$NOISF2= 2.8
##$NSP= 1
##$NTH_PI= 0
##$NZP= 0
##$OFFSET= 15.70392
##$PC= 1
##$PHC0= -15947.27
##$PHC1= 13.20078
##$PH_mod= 1
##$PKNL= yes
##$PPARMOD= 0
##$PSCAL= 0
##$PSIGN= 0
##$REVERSE= no
##$SF= 200.130013532006
##$SI= 16384
##$SIGF1= 3
##$SIGF2= 2
##$SINO= 400
##$SIOLD= 16384
##$SREGLST= <1H.CDCl3>
##$SSB= 0
##$STSI= 0
##$STSR= 0
##$SW_p= 3612.71676300578
##$SYMM= 0
##$S_DEV= 0
##$TDeff= 0
##$TDoff= 0
##$TI= <>
##$TILT= no
##$TM1= 0
##$TM2= 0
##$TOPLEV= 0
##$USERP1= <user>
##$USERP2= <user>
##$USERP3= <user>
##$USERP4= <user>
##$USERP5= <user>
##$WDW= 1
##$XDIM= 8192
##$YMAX_p= 0
##$YMIN_p= 0
$$ End of Bruker specific parameters
$$ ---------------------------------
##NTUPLES= NMR FID
##VAR_NAME=  TIME,          FID/REAL,        FID/IMAG
##SYMBOL=    X,             R,               I
##VAR_TYPE=  INDEPENDENT,   DEPENDENT,       DEPENDENT
##VAR_FORM=  AFFN,          ASDF,            ASDF
##VAR_DIM=   8192,          8192,            8192
##UNITS=     SECONDS,       ARBITRARY UNITS, ARBITRARY UNITS
##FACTOR=    0.0002768,     1,               1
##FIRST=     0,             0,               0
##LAST=      2.2672688,     0,               0
##MIN=       0,             -120510,         0
##MAX=       2.2672688,     122044,          0
$$ Real data points
##PAGE= N=1
##DATA TABLE= (X++(R..R)), XYDATA
0 0 0 0 0 0 0 0 0 0 0 0 0 0 0 0 0 0 0 0 0 0 0 0 0 0 4 -5 8 -8 8 -8 8 -8 11 -16 16 -16 16 -22 24 -24 30 -32 37 -40 45
45 45 -49 55 -61 68 -75 82 -90 99 -109 120 -133 146 -161 182 -201 227 -257 293 -337 393 -467
66 -467 566 -688 750 932 77683 122044 61620 -43861 -116510 -93641 2305 96960 112187
79 112187 38621 -65712 -115696 -73495 27252 104528 98094 13218 -80806 -109759 -50581 47928
91 47928 107461 80365 -10316 -92050 -99343 -27420 65837 105557 60692 -32269 -98542 -85608
103 -85608 -4403 79483 99296 39632 -51031 -100304 -69028 17055 88882 89044 18009 -66738
115 -66738 -97263 -49620 37076 93054 73961 -3850 -77462 -88308 -28627 53009 91327 56300
127 56300 -23123 -83086 -75958 -8318 65073 85577 37488 -39881 -84542 -61150 10785 73385
139 73385 76703 18644 -53775 -82515 -44937 28247 78181 65129 101 -64475 -76970 -27763
151 -27763 43273 79206 51383 -17351 -71666 -68069 -9950 55544 75911 35309 -33021 -74255
163 -74255 -55675 7139 63549 68612 18774 -45528 -72791 -41529 22593 67966 58451 2283
175 2283 -55102 -67823 -26106 36017 68717 46031 -13257 -61352 -59871 -10458 46823 66155
187 66155 32359 -27011 -64318 -49873 4386 54775 60970 18235 -38798 -64369 -38086 18461
199 18461 59807 52922 3766 -47989 -60996 -25069 30561 61411 42833 -9904 -54354 -54920 -11448
212 -11448 40798 59919 30828 -22633 -57506 -46016 2154 48162 55214 17985 -33285 -57523
224 -57523 -35473 14747 52773 48234 5148 -41695 -54862 -23990 25847 54718 39543 -7175
236 -7175 -47877 -49959 -11962 35323 54074 29361 -18645 -51455 -42862 -17 42604 50889 18283
249 18283 -28724 -52503 -33996 11580 47555 45182 6637 -36910 -50615 -23702 21932 49740
261 49740 37517 -4632 -42816 -46458 -12852 30764 49475 28434 -15181 -46367 -40238 -1957
273 -1957 37675 46929 18519 -24542 -47711 -32460 8688 42623 42204 7990 -32373 -46607 -23419
286 -23419 18351 45239 35726 -2366 -38343 -43404 -13624 26826 45578 27653 -12251 -42148
298 -42148 -38091 -3581 33581 43686 18671 -21123 -43837 -31221 6306 38546 39717 9034
310 9034 -28653 -43212 -23034 15439 41361 33961 -612 -34490 -40542 -14014 23537 42024 26704
323 26704 -9884 -38344 -35927 -4757 30025 40615 18552 -18223 -40243 -29850 4375 34892
335 34892 37283 9759 -25388 -40040 -22527 12916 37855 32300 875 -31107 -37975 -14350 20602
348 20602 38854 25831 -7774 -34964 -33986 -5786 26877 37848 18414 -15646 -37005 -28537 2724
361 2724 31635 35021 10326 -22438 -37098 -21930 10695 34602 30656 2167 -27905 -35469 -14522
374 -14522 17888 35808 24895 -5880 -31776 -32080 -6684 23893 35205 18176 -13286 -33973
386 -33973 -27276 1210 28536 32853 10806 -19712 -34304 -21318 8637 31531 29044 3287 -24924
399 -24924 -33026 -14576 15398 32892 23910 -4114 -28685 -30162 -7471 21064 32608 17940 -10993
412 -10993 -30982 -25996 -236 25535 30703 11219 -17065 -31565 -20691 6631 28499 27423 4385
425 4385 -22033 -30680 -14681 12926 30045 22960 -2424 -25717 -28276 -8210 18285 30023 17606
438 17606 -8782 -28013 -24685 -1604 22584 28576 11632 -14454 -28871 -20038 4752 25599 25821
451 25821 5351 -19243 -28305 -14599 10624 27207 21882 -898 -22817 -26383 -8793 15677 27509
464 27509 17194 -6813 -25255 -23329 -2739 19874 26452 11778 -12161 -26257 -19222 3123 22847
477 22847 24177 6120 -16701 -26054 -14407 8643 24670 20802 346 -20217 -24502 -9105 13435
490 13435 25136 16596 -5115 -22613 -21901 -3641 17385 24392 11792 -10127 -23833 -18370 1751
503 1751 20357 22568 6654 -14476 -23937 -14120 6880 22272 19703 1378 -17928 -22797 -9342
516 -9342 11459 23008 16023 -3722 -20386 -20612 -4308 15304 22586 11705 -8431 -21732 -17541
529 -17541 670 18245 21122 7016 -12574 -22005 -13716 5472 20163 18619 2179 -15885 -21190
542 -21190 -9462 9751 21104 15451 -2571 -18451 -19468 -4857 13515 20965 11539 -7036 -19899
555 -19899 -16748 -230 16379 19828 7340 -10926 -20410 -13434 4258 18464 17790 2863 -14252
568 -14252 -19883 -9499 8387 19501 14909 -1567 -16699 -18393 -5320 11915 19565 11464 -5746
581 -5746 -18312 -16128 -1034 14816 18719 7546 -9576 -18972 -13087 3195 16851 16928 3444 -12711
595 -12711 -18673 -9625 7072 18076 14510 -664 -15250 -17549 -5724 10595 18371 11358 -4663
608 -4663 -16886 -15519 -1727 13379 17730 7816 -8261 -17698 -12846 2245 15470 16228 3966 -11379
622 -11379 -17575 -9627 5941 16723 14024 109 -13822 -16640 -6089 9245 17140 11223 -3637
635 -3637 -15524 -14946 -2384 12010 16764 8014 -7089 -16471 -12582 1353 14157 15555 4470 -10095
649 -10095 -16545 -9670 4877 15488 13617 844 -12506 -15789 -6377 8067 16009 11063 -2692
662 -2692 -14237 -14338 -2930 10740 15764 8093 -6006 -15245 -12212 565 12809 14736 4842 -8874
676 -8874 -15450 -9603 3878 14209 13106 1481 -11290 -14946 -6597 6962 14902 10847 -1849 -13000
690 -13000 -13692 -3404 9550 14831 8174 -4937 -14072 -11861 -146 11612 14029 5170 -7738 -14414
704 -14414 -9488 2992 13029 12568 2033 -10056 -14058 -6768 5869 13758 10566 -1049 -11782
717 -11782 -13049 -3847 8362 13861 8185 -4000 -12943 -11480 -819 10412 13280 5490 -6640 -13411
731 -13411 -9410 2101 11894 12136 2643 -8912 -13286 -6962 4876 12778 10398 -288 -10680 -12500
745 -12500 -4272 7300 13005 8224 -3089 -11886 -11131 -1469 9292 12568 5734 -5629 -12471 -9287
759 -9287 1309 10806 11619 3099 -7854 -12488 -7086 3942 11783 10140 383 -9613 -11912 -4631 6304
774 6304 12187 8265 -2245 -10915 -10804 -2026 8311 11971 6003 -4711 -11641 -9197 579 9842 11199
789 11199 3557 -6870 -11775 -7202 3084 10863 9891 1004 -8643 -11357 -4943 5369 11365 8197
803 8197 -1506 -9959 -10400 -2489 7357 11296 6153 -3863 -10763 -9010 -32 8924 10723 3899 -5980
818 -5980 -11045 -7215 2378 10027 9620 1511 -7750 -10788 -5161 4552 10612 8117 -870 -9115 -10031 -2891
834 -2891 6487 10654 6235 -3141 -9978 -8787 -572 8052 10191 4129 -5191 -10338 -7152 1730 9188
849 9188 9255 1901 -6909 -10177 -5247 3861 9846 7915 -348 -8270 -9559 -3130 5732 10017 6234 -2489
865 -2489 -9196 -8490 -975 7276 9676 4300 -4489 -9655 -7040 1189 8414 8878 2208 -6174 -9599 -5295
881 -5295 3207 9119 7676 77 -7539 -9103 -3344 5036 9359 6146 -1954 -8458 -8166 -1311 6561
896 6561 9161 4391 -3856 -8986 -6866 734 7725 8513 2480 -5490 -9041 -5307 2657 8470 7462
911 7462 473 -6845 -8676 -3533 4401 8764 6081 -1476 -7804 -7877 -1633 5870 8636 4472 -3268 -8363
927 -8363 -6733 273 7018 8112 2695 -4851 -8504 -5315 2102 7812 7234 865 -6157 -8221 -3693
942 -3693 3776 8193 6041 -945 -7128 -7603 -1975 5219 8213 4615 -2665 -7767 -6625 -176 6364
957 6364 7779 2968 -4195 -7984 -5375 1533 7170 7036 1266 -5509 -7846 -3889 3152 7620 5965
972 5965 -474 -6486 -7303 -2263 4566 7700 4670 -2090 -7137 -6465 -605 5720 7438 3220 -3565 -7467
988 -7467 -5377 1027 6574 6846 1634 -4850 -7413 -4052 2534 7066 5942 53 -5857 -7061 -2609
1003 -2609 3919 7266 4774 -1531 -6578 -6338 -1041 5063 7069 3417 -2958 -6924 -5353 505 5942
1018 5942 6585 1980 -4207 -6970 -4138 1990 6498 5803 470 -5207 -6696 -2817 3306 6758 4796
1033 4796 -1002 -5968 -6150 -1408 4441 6696 3616 -2371 -6430 -5341 12 5332 6332 2282 -3615
1048 -3615 -6559 -4277 1435 5951 5677 862 -4635 -6379 -3029 2741 6269 4776 -540 -5396 -5896
1063 -5896 -1694 3873 6296 3691 -1862 -5881 -5181 -326 4780 6013 2459 -3062 -6078 -4244 992
1078 992 5406 5471 1175 -4067 -6028 -3192 2226 5795 4719 -146 -4883 -5674 -1963 3325 5887 3752
1094 3752 -1386 -5394 -5068 -700 4228 5724 2666 -2551 -5659 -4242 586 4931 5278 1436 -3564
1109 -3564 -5635 -3229 1786 5325 4596 196 -4354 -5370 -2129 2847 5488 3760 -997 -4930 -4895 -968
1125 -968 3739 5394 2754 -2108 -5240 -4201 195 4414 5061 1691 -3079 -5322 -3354 1337 4916
1140 4916 4532 542 -3883 -5134 -2319 2383 5126 3782 -579 -4465 -4731 -1230 3279 5092 2876
1155 2876 -1670 -4825 -4118 -125 3971 4829 1865 -2634 -4955 -3348 960 4465 4375 798 -3436 -4872
1171 -4872 -2456 1939 4724 3746 -264 -4052 -4570 -1460 2834 4793 2958 -1281 -4452 -4057 -435 3565
1187 3565 4622 2051 -2200 -4636 -3365 605 4095 4249 1064 -3008 -4598 -2543 1577 4402 3687
1202 3687 49 -3655 -4369 -1631 2453 4495 2982 -944 -4091 -3935 -682 3145 4379 2150 -1843
1217 -1843 -4322 -3358 294 3713 4101 1257 -2648 -4350 -2638 1217 4060 3640 327 -3274 -4195 -1808
1233 -1808 2078 4247 3034 -599 -3754 -3834 -894 2812 4195 2285 -1490 -4049 -3352 5 3369 3964
1249 3964 1439 -2296 -4134 -2688 891 3759 3571 551 -2937 -4055 -1935 1724 3985 3035 -340
1264 -340 -3431 -3750 -1107 2456 4007 2380 -1172 -3770 -3346 -250 3065 3883 1610 -1950 -3931 -2761
1280 -2761 618 3485 3559 792 -2621 -3915 -2066 1423 3759 3082 -79 -3156 -3713 -1300 2123 3834
1296 3834 2463 -887 -3519 -3333 -501 2734 3744 1752 -1640 -3718 -2815 332 3210 3502 1000 -2297
1312 -2297 -3735 -2189 1114 3513 3098 204 -2842 -3594 -1487 1828 3660 2563 -570 -3251 -3305 -730
1328 -730 2427 3616 1923 -1329 -3503 -2879 38 2901 3415 1201 -1985 -3572 -2307 801 3240 3084
1344 3084 447 -2541 -3493 -1663 1495 3429 2627 -282 -2952 -3247 -939 2123 3459 2042 -1018 -3239
1360 -3239 -2871 -197 2614 3335 1399 -1660 -3379 -2391 513 2978 3055 688 -2236 -3352 -1795 1194
1376 1194 3193 2631 -51 -2681 -3174 -1134 1787 3269 2114 -739 -2986 -2854 -454 2302 3183 1529
1392 1529 -1370 -3145 -2409 256 2708 2974 870 -1925 -3166 -1889 909 2947 2629 208 -2375 -3049
1408 -3049 -1282 1509 3061 2172 -461 -2713 -2802 -645 2014 3029 1619 -1105 -2927 -2424 25 2434
1424 2434 2862 1012 -1664 -2997 -1938 642 2703 2583 391 -2113 -2916 -1387 1254 2873 2189 -239
1440 -239 -2472 -2707 -780 1776 2893 1701 -849 -2707 -2387 -166 2191 2768 1140 -1414 -2814 -1964
1456 -1964 454 2498 2534 523 -1897 -2787 -1470 1018 2677 2183 -74 -2264 -2644 -916 1541 2737
1472 2737 1740 -654 -2524 -2356 -313 1984 2672 1232 -1201 -2649 -1987 285 2315 2494 693 -1672
1488 -1672 -2667 -1532 839 2524 2186 100 -2068 -2563 -1006 1344 2606 1782 -486 -2360 -2358 -465 1790
1505 1790 2579 1317 -1018 -2525 -2026 100 2125 2441 784 -1510 -2586 -1595 661 2374 2182 246
1521 246 -1895 -2503 -1108 1186 2502 1835 -312 -2199 -2322 -577 1626 2512 1394 -859 -2394 -2037
1537 -2037 -42 1965 2393 888 -1331 -2482 -1673 488 2226 2165 361 -1741 -2447 -1217 991 2378
1553 2378 1864 -161 -2059 -2291 -703 1459 2428 1461 -676 -2276 -2046 -180 1829 2359 1010 -1155
1569 -1155 -2372 -1694 358 2109 2165 501 -1577 -2373 -1285 850 2276 1885 -21 -1896 -2271 -828
1585 -828 1291 2339 1528 -536 -2153 -2065 -320 1670 2304 1104 -1004 -2279 -1738 189 1971 2162 638
1602 638 -1401 -2305 -1366 687 2179 1930 122 -1770 -2232 -909 1146 2264 1584 -372 -2019 -2046 -431
1619 -431 1522 2239 1175 -856 -2185 -1776 52 1831 2128 714 -1277 -2240 -1414 526 2045 1916 250
1636 250 -1621 -2187 -1017 982 2175 1642 -227 -1884 -2044 -556 1382 2203 1262 -691 -2071 -1799 -79
1653 -79 1695 2122 843 -1106 -2150 -1484 393 1939 1930 382 -1487 -2147 -1113 809 2069 1666 -85
1670 -85 -1759 -2038 -692 1204 2118 1342 -534 -1957 -1834 -247 1547 2070 948 -945 -2075 -1554 229
1687 229 1803 1949 528 -1306 -2086 -1206 649 1978 1716 81 -1608 -2010 -806 1052 2052 1412 -361
1704 -361 -1844 -1847 -363 1397 2025 1030 -808 -1982 -1595 56 1657 1912 635 -1160 -2025 -1273 495
1721 495 1860 1724 215 -1475 -1969 -907 896 1965 1468 -209 -1707 -1829 -492 1248 1972 1142 -624
1738 -624 -1870 -1623 -69 1532 1903 752 -1001 -1950 -1335 353 1733 1722 322 -1323 -1928 -983 755
1755 755 1854 1481 -89 -1589 -1811 -595 1110 1901 1173 -494 -1759 -1615 -173 1401 1853 831 -859
1772 -859 -1844 -1346 243 1636 1712 436 -1195 -1854 -1031 609 1766 1499 30 -1468 -1778 -656 985
1789 985 1827 1205 -380 -1658 -1614 -285 1267 1786 858 -768 -1768 -1365 128 1504 1672 496 -1080
1806 -1080 -1785 -1066 515 1666 1490 113 -1342 -1717 -710 880 1763 1234 -270 -1545 -1574 -355 1177
1823 1177 1751 929 -638 -1685 -1374 29 1409 1648 564 -977 -1723 -1111 402 1567 1476 179 -1267
1840 -1267 -1686 -782 751 1671 1245 -187 -1464 -1561 -417 1071 1675 951 -540 -1589 -1376 -47 1317
1857 1317 1630 646 -869 -1652 -1119 326 1503 1485 281 -1140 -1648 -826 662 1600 1267 -88 -1373
1874 -1373 -1563 -504 961 1637 994 -451 -1543 -1393 -154 1209 1596 705 -756 -1601 -1175 215 1412
1891 1412 1478 373 -1055 -1610 -883 550 1535 1302 19 -1264 -1522 -562 857 1589 1057 -310 -1438
1908 -1438 -1393 -252 1103 1565 771 -660 -1548 -1197 96 1305 1459 446 -929 -1574 -961 417 1441
1925 1441 1311 112 -1169 -1513 -659 725 1523 1095 -201 -1344 -1401 -338 991 1526 844 -511 -1454
1942 -1454 -1215 -9 1220 1456 547 -803 -1487 -995 310 1354 1314 218 -1048 -1480 -728 602 1444
1959 1444 1133 -99 -1240 -1385 -442 871 1461 879 -403 -1367 -1250 -115 1100 1417 610 -683 -1432
1976 -1432 -1030 205 1270 1327 322 -940 -1425 -775 506 1379 1159 23 -1123 -1360 -504 755 1405
1993 1405 928 -295 -1287 -1244 -209 989 1372 661 -571 -1374 -1057 91 1156 1289 395 -827 -1380 -843
2011 -843 378 1287 1158 97 -1024 -1333 -578 662 1347 979 -178 -1177 -1222 -294 894 1357 740 -456
2029 -456 -1273 -1055 17 1077 1277 477 -714 -1310 -861 291 1199 1152 174 -938 -1299 -627 543 1273
2047 1273 976 -110 -1103 -1209 -357 782 1288 765 -366 -1203 -1072 -74 982 1259 535 -605 -1248 -882
2065 -882 203 1120 1146 266 -826 -1245 -662 455 1206 1000 -5 -1002 -1188 -417 685 1217 795 -284
2083 -284 -1132 -1072 -165 868 1192 564 -522 -1200 -911 101 1025 1116 320 -740 -1206 -711 364 1122 995
2102 995 70 -899 -1137 -456 593 1183 825 -178 -1032 -1045 -216 791 1164 604 -428 -1109 -898 29 937
2121 937 1079 365 -650 -1153 -728 264 1039 974 119 -831 -1115 -502 500 1089 816 -124 -958 -1026 -285 700
2141 700 1097 630 -351 -1033 -895 -33 854 1058 411 -559 -1070 -723 219 984 954 184 -747 -1052 -528 420
2161 420 1034 811 -54 -888 -1013 -326 616 1050 635 -290 -990 -901 -91 775 1022 448 -494 -1036 -742 134
2181 134 914 951 236 -667 -1030 -555 360 1001 824 8 -808 -965 -348 562 1026 673 -215 -925 -892 -138 715
2202 715 1003 479 -433 -989 -761 72 847 921 268 -620 -1009 -596 284 939 831 60 -767 -976 -400 481
2222 481 980 694 -149 -882 -891 -190 668 992 530 -357 -943 -767 21 802 945 331 -542 -973 -635 223 888
2243 888 849 121 -700 -966 -456 420 946 715 -94 -839 -913 -269 577 952 563 -295 -916 -805 -56 739 934
2264 934 386 -468 -956 -671 140 850 856 191 -626 -945 -489 353 923 755 -12 -756 -893 -319 527 959 608
2285 608 -221 -868 -823 -125 667 916 413 -414 -922 -697 69 784 860 240 -574 -927 -555 267 870 762 59
2306 59 -708 -889 -351 452 910 624 -155 -806 -806 -168 626 911 477 -325 -863 -691 25 732 846 287 -501
2327 -501 -889 -556 215 808 768 100 -648 -877 -418 385 867 637 -94 -753 -815 -225 543 868 494 -264 -815
2348 -815 -708 -27 673 843 334 -437 -842 -588 166 774 768 150 -581 -835 -412 342 819 649 -43 -695 -785
2369 -785 -256 488 822 492 -225 -776 -709 -88 599 807 343 -391 -827 -595 95 700 736 179 -530 -817 -459
2390 -459 268 769 663 6 -632 -765 -270 428 794 535 -161 -719 -690 -112 562 784 375 -341 -756 -587
2410 -587 63 656 713 197 -478 -786 -456 210 709 632 35 -586 -749 -311 367 746 517 -129 -675 -685 -157
2431 -157 496 749 400 -276 -723 -578 17 613 715 259 -398 -725 -461 187 670 644 97 -531 -724 -334
2451 -334 324 719 534 -80 -633 -674 -177 446 720 396 -249 -705 -600 -21 559 681 260 -372 -718 -477
2471 -477 124 633 624 119 -480 -696 -347 289 684 543 -25 -569 -642 -207 407 699 422 -181 -645 -575 -59
2492 -59 517 674 304 -325 -688 -485 80 594 612 132 -452 -683 -375 237 644 539 -9 -548 -641 -233 374
2513 374 671 427 -152 -620 -576 -78 486 659 316 -269 -632 -474 68 564 614 173 -413 -655 -381 203 621
2534 621 545 36 -513 -628 -255 334 648 437 -126 -592 -581 -116 438 638 317 -263 -634 -495 34 539 611
2555 611 194 -380 -643 -387 169 593 553 55 -479 -613 -253 306 634 467 -75 -546 -573 -141 418 639 338
2576 338 -226 -607 -502 3 503 593 214 -351 -632 -412 120 569 536 79 -455 -621 -301 268 610 460 -53
2597 -53 -529 -565 -164 381 615 363 -183 -580 -504 -19 476 600 241 -305 -606 -412 101 543 541 113 -406 -603
2619 -603 -309 218 572 468 -15 -493 -577 -196 327 581 363 -160 -557 -509 -75 423 570 254 -258 -576 -423
2640 -423 73 506 537 142 -367 -571 -323 189 554 470 26 -447 -544 -205 302 574 384 -105 -506 -498 -96 380
2662 380 552 275 -223 -548 -426 27 464 508 161 -329 -557 -326 137 510 457 44 -404 -527 -230 261 534
2683 534 383 -67 -468 -477 -112 351 540 292 -175 -501 -403 11 425 501 183 -278 -509 -333 112 466 427 60
2705 60 -370 -507 -238 215 498 366 -63 -428 -458 -123 311 492 280 -152 -472 -401 -13 386 475 180 -256
2726 -256 -471 -307 112 435 431 88 -340 -474 -230 201 476 362 -29 -393 -423 -121 286 471 259 -134 -441
2747 -441 -384 -26 354 443 166 -231 -459 -314 71 401 394 72 -312 -456 -236 181 441 338 -18 -372 -423 -123
2769 -123 271 463 284 -124 -414 -373 -33 334 436 184 -210 -430 -309 62 387 397 82 -295 -438 -238 146
2790 146 416 324 -19 -360 -415 -146 227 426 261 -115 -408 -377 -61 301 418 182 -196 -426 -305 40 370
2811 370 394 108 -260 -421 -224 144 391 342 12 -323 -401 -157 220 420 274 -73 -379 -364 -64 286 405
2832 405 189 -166 -420 -318 11 335 383 116 -254 -416 -249 107 377 330 19 -319 -414 -169 213 412 285
2853 285 -56 -357 -355 -58 289 421 218 -147 -398 -309 10 340 382 122 -218 -408 -250 99 378 344 36 -295
2875 -295 -400 -185 167 377 277 -49 -348 -371 -102 248 388 221 -132 -390 -318 -16 315 382 151 -201 -394
2896 -394 -253 87 368 357 61 -263 -384 -173 159 392 291 -30 -322 -375 -107 223 388 226 -116 -361 -330
2917 -330 -34 282 370 150 -195 -390 -273 61 341 342 83 -256 -375 -196 139 368 313 7 -292 -356 -121 218
2939 218 391 243 -78 -330 -306 -30 287 382 169 -154 -368 -279 25 322 350 91 -233 -372 -214 108 341
2960 341 292 5 -292 -362 -145 181 359 245 -67 -328 -308 -50 238 360 189 -125 -338 -267 15 301 329 118
2982 118 -207 -354 -212 95 339 309 31 -252 -341 -153 167 347 247 -43 -306 -317 -79 212 345 178 -127
3003 -127 -337 -289 -12 278 332 108 -189 -339 -222 77 302 296 55 -228 -325 -149 155 328 245 -23 -270 -294
3025 -294 -77 216 333 203 -95 -294 -259 -3 249 313 121 -175 -321 -219 55 275 278 43 -228 -323 -167 115
3047 115 293 217 -28 -273 -300 -97 179 309 175 -94 -276 -251 -14 228 300 124 -151 -306 -213 47 266 282
3069 282 51 -201 -299 -149 117 290 225 -16 -262 -289 -98 174 277 177 -104 -279 -241 -35 228 284 112 -144
3091 -144 -301 -199 54 253 259 56 -186 -281 -135 116 280 223 -6 -231 -268 -78 169 296 184 -64 -262 -236
3113 -236 -10 229 282 111 -132 -285 -202 45 247 256 52 -190 -290 -157 103 261 209 -4 -236 -271 -85 157
3135 157 280 170 -75 -272 -243 -23 203 279 124 -122 -265 -191 44 261 274 74 -179 -271 -152 108 268 213
3157 213 -7 -218 -277 -94 144 283 178 -67 -263 -257 -45 193 261 122 -120 -276 -217 11 231 249 66 -174
3179 -174 -279 -155 82 253 231 23 -201 -259 -95 155 277 195 -40 -241 -239 -36 197 278 142 -93 -269 -203
3201 -203 1 216 255 84 -152 -264 -174 44 234 223 30 -206 -268 -123 107 252 193 -25 -235 -238 -66 166
3223 166 262 157 -70 -240 -206 -9 215 251 117 -127 -245 -166 48 230 235 49 -165 -243 -123 106 248 202 -10
3246 -10 -204 -238 -89 140 244 157 -73 -228 -216 -35 175 243 107 -109 -239 -177 27 213 237 68 -149 -233 -132
3269 -132 86 235 208 19 -171 -211 -73 131 240 169 -43 -208 -198 -28 160 230 112 -93 -222 -181 6 180
3291 180 209 66 -126 -231 -151 51 191 185 13 -163 -216 -97 114 212 161 -22 -176 -191 -39 141 226 121 -65
3314 -65 -198 -169 5 163 212 96 -104 -207 -126 45 189 186 34 -143 -203 -94 80 196 150 -24 -180 -196 -52
3337 -52 108 200 109 -67 -185 -168 -17 147 199 83 -96 -186 -135 35 170 170 41 -126 -184 -84 71 178 155 -9
3361 -9 -135 -164 -49 103 181 115 -46 -166 -145 -12 133 166 71 -84 -173 -126 23 163 148 38 -111 -177 -101 50
3385 50 170 140 7 -124 -149 -48 109 171 113 -34 -144 -131 2 130 171 80 -65 -146 -103 25 143 156 44 -102
3409 -102 -162 -85 55 142 111 -7 -120 -150 -56 76 140 91 -27 -138 -134 -30 110 150 62 -73 -153 -110 25 145 151
3434 151 47 -95 -145 -71 55 144 133 9 -115 -138 -46 95 156 96 -25 -133 -128 -12 113 139 67 -73 -144 -112 20
3459 20 124 129 33 -87 -149 -84 41 129 122 -14 -118 -150 -64 71 140 87 -30 -131 -128 -12 112 147 72 -50 -137 -103
3485 -103 22 127 142 52 -81 -146 -88 40 141 123 15 -119 -149 -74 65 132 93 -35 -137 -138 -32 79 146 68
3509 68 -51 -127 -124 -8 112 135 44 -82 -127 -85 39 138 135 30 -99 -137 -57 62 138 118 -2 -120 -126 -32 84 141
3535 141 95 -40 -133 -131 -11 92 119 50 -69 -151 -112 7 128 130 22 -90 -148 -72 44 133 107 5 -95 -120 -45
3560 -45 75 143 106 -15 -117 -111 -7 88 139 74 -57 -139 -84 10 123 127 37 -80 -135 -73 35 113 104 3 -109 -140 -63
3587 -63 56 120 87 -3 -108 -113 -33 84 133 71 -44 -112 -95 -9 95 128 48 -49 -113 -69 32 109 105 25 -74 -107 -49 49
3615 49 116 90 -12 -88 -101 -36 64 113 60 -34 -103 -95 -7 66 85 30 -55 -108 -88 13 87 88 18 -66 -97 -54 41 90 83 -4
3645 -4 -76 -87 -27 51 108 63 -19 -79 -77 -12 59 87 37 -49 -88 -51 5 73 82 13 -64 -91 -52 17 75 64 -20 -86 -86 -32 43 91
3677 91 59 -28 -79 -74 -7 67 80 36 -36 -75 -53 10 75 73 8 -55 -73 -43 33 77 63 -6 -62 -73 -28 37 68 31 -31 -72 -74 -12
3709 -12 47 61 25 -45 -73 -56 -6 57 61 2 -54 -74 -26 26 81 54 -15 -46 -72 -15 49 71 44 -15 -65 -53 5 58 78 30 -33
3740 -33 -68 -49 5 58 53 2 -45 -66 -44 15 59 50 -6 -60 -78 -32 27 63 17 -29 -71 -62 1 57 66 31 -41 -65 -32 22 59 58 10
3773 10 -46 -69 -20 34 73 55 -5 -56 -65 -15 35 66 30 -20 -75 -61 -6 46 62 22 -52 -71 -55 12 59 52 1 -52 -69 -40 30
3804 30 62 45 -9 -48 -61 -8 46 78 38 -18 -59 -51 4 58 70 30 -38 -60 -30 22 63 50 -3 -51 -64 -41 27 57 42 -15 -59
3835 -59 -70 -27 36 59 32 -29 -65 -60 3 42 61 20 -41 -57 -38 20 58 66 21 -45 -46 -14 37 71 53 10 -56 -55 -12 31 63 34
3867 34 -17 -51 -42 -4 33 47 9 -37 -58 -38 3 42 45 3 -37 -54 -26 15 46 33 2 -45 -53 -5 31 47 25 -7 -45 -31 6 43
3899 43 56 26 -19 -43 -34 4 53 34 4 -30 -54 -22 11 39 35 -21 -46 -43 -4 21 31 17 -25 -45 -36 8 34 24 21 -30 -41 -24 9
3932 9 23 25 -3 -25 -25 -9 32 31 17 -4 -35 -27 3 23 42 19 -20 -37 -12 17 21 18 -6 -32 -37 -20 13 28 18 -26 -38 -38 -7 22 22
3967 22 4 -17 -33 -29 1 25 25 -3 -23 -23 3 28 32 19 9 -23 -13 8 38 39 15 -22 -35 -15 14 28 30 13 -33 -41 -30 26 26 15
4001 15 -18 -39 -28 -9 9 34 12 -25 -34 -27 -6 30 30 9 -22 -38 -22 24 43 34 7 -25 -35 -7 28 46 29 -3 -31 -26 -3 31 43
4034 43 19 -17 -48 -36 6 47 32 10 -38 -51 -24 16 44 41 2 -49 -52 -13 27 52 34 -12 -42 -40 -2 38 51 30 -9 -35 -29 11
4066 11 50 59 22 -34 -49 -17 27 59 42 -11 -39 -53 -12 29 55 28 -17 -48 -54 -2 40 44 26 -24 -56 -45 3 44 42 13 -40 -52
4098 -52 -29 26 63 52 3 -32 -45 -14 34 61 47 -7 -44 -35 -12 40 61 28 -20 -59 -53 -6 46 50 4 -49 -61 -47 14 49 50 -3
4130 -3 -53 -64 -28 30 49 33 -10 -57 -58 -9 46 65 31 -19 -52 -35 5 55 51 19 -24 -51 -25 24 60 49 -3 -42 -52 -28 31 55
4162 55 34 -21 -70 -56 -25 33 47 9 -42 -74 -45 -3 39 39 6 -40 -65 -42 12 51 58 -2 -46 -50 -17 40 58 44 -22 -50 -46 -1
4194 -1 55 61 37 -35 -58 -43 5 59 55 15 -47 -68 -51 17 51 31 -10 -61 -57 -16 33 54 39 -25 -58 -54 3 55 54 29 -31 -59 -35
4227 -35 22 64 76 19 -45 -54 -29 40 80 55 -10 -54 -56 -13 42 72 36 -28 -74 -58 -11 48 64 11 -59 -82 -58 19 62 58 7 -53
4259 -53 -76 -34 35 77 54 -14 -58 -57 -15 49 86 47 -16 -62 -54 0 70 78 35 -37 -76 -51 16 71 70 6 -60 -84 -44 31 77 53
4291 53 -22 -79 -92 -35 46 76 36 -33 -80 -69 -3 76 76 31 -54 -92 -66 18 76 84 16 -53 -83 -52 40 94 66 5 -67 -82 -30
4322 -30 43 95 61 -31 -92 -81 -22 69 71 31 -56 -111 -83 6 79 88 13 -73 -107 -67 27 92 93 16 -66 -90 -37 61 108 80 -14 -89
4354 -89 -86 -14 80 100 58 -39 -95 -77 8 90 102 33 -59 -114 -84 32 96 101 5 -78 -112 -56 43 97 71 -21 -105 -112 -37 70 105
4385 105 58 -49 -110 -91 -5 94 117 42 -53 -104 -76 21 101 106 38 -64 -104 -49 49 123 105 -7 -83 -106 -41 66 114 71
4413 71 -40 -106 -103 -16 71 105 43 -60 -118 -94 1 97 107 28 -72 -114 -63 34 118 104 10 -84 -110 -35 57 122 92 -6 -100
4442 -100 -107 -10 92 135 62 -42 -110 -94 2 95 101 29 -74 -127 -82 21 101 111 7 -89 -121 -60 51 111 85 -15 -107
4469 -107 -99 -25 76 134 75 -39 -108 -91 1 99 121 48 -50 -110 -77 33 122 113 29 -79 -111 -57 49 113 105 -11 -91 -128
4497 -128 -42 76 115 62 -38 -117 -109 1 89 121 48 -65 -124 -94 20 111 120 31 -69 -122 -60 56 122 116 0 -93 -115
4524 -115 -28 87 130 82 -34 -123 -106 -11 94 130 67 -64 -132 -107 5 99 108 28 -95 -131 -74 48 120 91 3 -114
4550 -114 -124 -57 65 131 87 -12 -120 -104 -13 98 138 71 -50 -124 -88 15 122 138 38 -87 -129 -78 54 130 108
4575 108 0 -105 -136 -48 63 125 80 -34 -138 -121 -23 93 134 69 -72 -138 -108 6 114 129 43 -79 -145 -76 36
4600 36 146 124 18 -95 -131 -52 74 148 105 -16 -125 -126 -22 104 148 74 -56 -132 -117 1 116 138 42 -94 -160
4625 -160 -111 31 129 126 4 -113 -156 -68 56 150 107 -20 -127 -144 -33 89 153 95 -50 -139 -120 -6 127 165 73
4650 73 -81 -154 -98 33 140 132 28 -110 -162 -71 60 152 119 -20 -143 -153 -43 92 142 94 -60 -156 -140 -8 117
4675 117 151 75 -68 -149 -110 22 142 157 49 -98 -160 -85 53 176 152 12 -119 -153 -50 92 164 111 -33 -151
4699 -151 -150 -32 119 170 86 -58 -151 -128 3 128 139 43 -103 -185 -101 43 159 137 9 -117 -165 -71 75 171 126
4724 126 -26 -153 -150 -31 113 170 102 -43 -150 -125 -6 136 172 67 -85 -174 -113 35 150 150 19 -111 -176 -96
4748 -96 74 165 126 -15 -145 -171 -46 97 159 92 -46 -160 -146 -11 125 176 76 -84 -171 -123 19 144 172 56
4772 56 -108 -164 -80 56 171 145 9 -130 -163 -64 96 159 108 -39 -158 -142 -27 106 163 74 -70 -164 -132 4
4796 4 142 155 44 -108 -174 -102 55 151 146 19 -126 -169 -66 94 177 127 -17 -144 -148 -25 124 174 94 -52 -163
4821 -163 -132 3 136 154 50 -108 -168 -112 36 158 143 10 -125 -168 -72 63 154 115 -37 -160 -158 -42 98 177
4845 177 94 -51 -163 -128 11 140 176 70 -83 -158 -104 51 156 145 23 -124 -166 -72 74 172 128 -12 -149
4868 -149 -160 -44 107 154 90 -57 -166 -141 -10 134 162 56 -104 -173 -117 25 149 149 23 -124 -168 -81 66 168
4892 168 140 -7 -135 -156 -39 107 183 105 -42 -156 -136 -4 135 172 75 -93 -170 -122 29 144 148 26 -116 -177
4916 -177 -99 54 170 138 -13 -147 -168 -62 90 171 112 -52 -165 -148 -31 118 179 80 -79 -161 -128 30 162
4939 162 170 52 -111 -171 -98 50 177 146 10 -135 -172 -71 95 183 117 -33 -168 -181 -30 111 168 74 -76 -172
4963 -172 -147 1 157 177 55 -102 -197 -119 44 177 159 15 -133 -174 -69 93 196 136 -3 -136 -163 -41 117
4986 117 196 105 -60 -174 -145 5 152 172 69 -100 -186 -125 26 152 157 12 -151 -202 -104 70 171 135 -22 -159
5010 -159 -170 -46 115 192 114 -63 -174 -160 -4 151 190 85 -90 -178 -123 45 174 185 30 -121 -188 -99 77
5033 77 182 152 -8 -155 -179 -62 105 179 112 -46 -178 -177 -32 138 190 77 -88 -175 -134 22 162 184 53 -111
5057 -111 -190 -113 73 192 164 9 -153 -171 -63 119 194 133 -37 -161 -160 -30 142 202 92 -90 -181 -150 5 156
5081 156 172 48 -122 -189 -118 52 171 151 20 -140 -193 -77 86 187 142 -27 -164 -163 -40 136 196 119 -58
5104 -58 -176 -147 22 168 187 74 -99 -179 -115 45 180 167 22 -136 -192 -90 80 185 136 -21 -164 -180 -55
5127 -55 119 182 106 -64 -178 -161 -9 144 184 78 -91 -185 -117 43 181 168 40 -130 -175 -76 89 187 144 -14
5151 -14 -150 -166 -41 122 201 113 -59 -179 -166 -16 133 178 65 -106 -195 -133 35 160 164 27 -135 -192 -96 76
5175 76 179 140 -4 -154 -169 -49 108 197 125 -32 -165 -148 -16 148 190 83 -79 -180 -136 34 176 181 44
5198 44 -115 -184 -101 66 178 145 -7 -168 -187 -66 97 186 111 -45 -183 -179 -32 128 191 90 -83 -177 -147 16
5222 16 161 177 57 -119 -191 -110 74 184 174 16 -137 -190 -71 109 205 132 -24 -174 -177 -33 131 196 97 -81
5246 -81 -196 -157 3 154 187 55 -132 -214 -124 45 177 157 15 -156 -188 -82 87 191 150 -26 -170 -163 -36
5269 -36 137 214 122 -64 -177 -145 3 168 208 72 -100 -197 -129 48 187 176 28 -143 -206 -94 94 184 145 -15
5293 -15 -168 -188 -65 120 202 115 -63 -189 -178 -13 155 195 87 -94 -194 -126 34 191 182 49 -118 -192 -87
5316 -87 84 193 154 2 -159 -186 -56 112 203 127 -49 -184 -172 -21 134 187 90 -98 -203 -156 7 167 185
5339 185 46 -116 -202 -125 64 189 164 11 -154 -188 -64 113 207 137 -20 -168 -164 -23 143 212 104 -62 -180
5362 -180 -151 9 164 188 61 -107 -204 -123 55 183 163 14 -156 -205 -90 78 184 138 -33 -174 -179 -43 125
5385 125 198 112 -60 -178 -166 4 155 193 77 -106 -186 -124 41 184 183 41 -126 -189 -102 78 185 141 -6 -171
5409 -171 -183 -54 110 189 112 -66 -189 -171 -23 135 184 80 -96 -192 -134 29 169 176 40 -116 -181 -98 79 191
5433 191 150 -6 -155 -176 -54 126 196 125 -32 -170 -155 -12 135 188 81 -91 -190 -147 21 166 181 48 -124
5456 -124 -200 -110 65 172 147 -2 -152 -194 -69 85 196 125 -34 -168 -165 -24 140 196 100 -70 -190 -144 20
5479 20 164 171 57 -104 -183 -114 52 183 159 8 -141 -184 -87 84 180 130 -39 -184 -176 -44 121 185 92 -71 -188
5504 -188 -151 -4 148 174 60 -105 -193 -124 45 172 171 18 -136 -175 -79 89 189 145 -32 -157 -165 -40 125 199
5528 199 119 -59 -174 -153 -4 151 170 68 -93 -190 -136 32 162 167 29 -132 -188 -98 66 184 147 -16 -154
5551 -154 -183 -55 124 183 118 -55 -170 -153 -9 155 192 85 -94 -185 -122 40 165 165 48 -118 -181 -106 76 179
5575 179 136 7 -151 -183 -65 93 184 124 -52 -175 -165 -27 122 187 88 -82 -192 -145 18 146 177 58 -100
5598 -100 -178 -102 57 183 165 20 -139 -193 -81 108 200 131 -23 -147 -166 -30 118 205 102 -69 -183 -151 -5
5621 -5 153 177 55 -126 -194 -127 39 166 159 21 -129 -192 -91 82 184 138 -15 -169 -171 -44 109 200 108 -40
5645 -40 -175 -153 2 139 190 84 -91 -188 -128 33 172 175 35 -124 -188 -112 60 171 147 -4 -162 -188 -71 92
5669 92 173 111 -42 -178 -164 -34 136 188 91 -84 -188 -128 24 147 179 54 -117 -180 -100 53 183 163 19 -137
5693 -137 -172 -67 91 193 133 -33 -161 -172 -33 126 178 98 -73 -190 -152 -7 132 163 48 -113 -190 -114 49
5716 49 166 160 18 -122 -175 -83 81 177 141 -8 -144 -158 -38 125 191 109 -47 -171 -138 6 152 184 72 -87
5740 -87 -169 -117 26 158 155 28 -124 -175 -95 60 166 129 -19 -152 -173 -49 105 173 100 -48 -163 -148 -10 137
5764 137 178 77 -70 -160 -108 38 160 171 56 -92 -159 -88 70 165 148 3 -128 -162 -51 89 162 114 -40 -166
5788 -166 -144 -17 123 158 81 -75 -172 -127 7 138 152 40 -100 -161 -100 52 165 148 15 -121 -155 -68 95 170
5812 170 130 -17 -135 -134 -15 123 172 92 -65 -160 -141 13 141 169 45 -98 -175 -108 30 149 139 9 -122 -173
5836 -173 -78 72 163 124 -25 -147 -159 -38 98 175 106 -42 -151 -137 2 130 158 57 -82 -164 -101 32 164
5859 164 166 38 -111 -154 -80 68 166 130 0 -149 -163 -49 90 158 103 -48 -166 -140 -14 122 156 76 -88 -175
5883 -175 -128 20 142 147 35 -99 -175 -92 63 165 145 1 -127 -160 -46 94 169 112 -25 -150 -139 -20 124
5906 124 172 79 -65 -173 -136 12 129 151 45 -107 -177 -97 42 157 133 8 -123 -162 -65 70 166 114 -15 -163
5930 -163 -150 -21 122 167 98 -55 -143 -125 1 149 175 68 -81 -155 -109 37 154 151 16 -118 -159 -80 64 154
5954 154 126 -17 -153 -168 -56 89 153 96 -51 -159 -148 -25 127 156 66 -78 -160 -110 24 153 161 36 -102 -157
5978 -157 -89 59 162 142 7 -128 -164 -54 85 156 109 -35 -148 -144 -32 110 157 76 -72 -166 -119 3 135 144
6002 144 45 -98 -173 -103 32 142 133 7 -116 -163 -67 81 155 118 -17 -130 -140 -30 111 167 96 -45 -150 -125
6026 -125 -9 133 157 62 -77 -158 -106 41 144 139 22 -107 -158 -82 59 148 111 -28 -129 -148 -52 89 148 88 -43
6051 -43 -143 -138 -9 119 148 71 -67 -146 -109 30 143 158 36 -90 -150 -79 49 146 120 -1 -128 -158 -55 76
6075 76 142 109 -40 -149 -132 -30 94 135 67 -68 -146 -117 13 126 132 46 -95 -147 -86 47 143 123 24 -110 -138 -59
6101 -59 78 160 116 -15 -114 -118 -25 102 147 76 -59 -144 -121 8 129 138 37 -78 -140 -103 36 127 126 14 -110 -139
6127 -139 -77 63 137 107 -21 -137 -142 -32 98 147 85 -63 -145 -117 -3 124 146 59 -74 -137 -86 40 147 142 29
6152 29 -86 -151 -71 62 142 105 -17 -129 -138 -48 90 145 80 -47 -142 -141 -10 110 145 57 -73 -145 -103 26 135 139
6178 139 34 -99 -131 -74 57 139 117 5 -120 -139 -44 90 152 101 -29 -134 -124 -10 103 144 61 -75 -156 -125
6202 -125 8 117 129 31 -99 -150 -85 39 143 106 -5 -125 -146 -53 75 149 92 -30 -120 -130 -26 107 146 83
6226 83 -53 -147 -117 13 124 136 48 -87 -143 -88 47 142 120 8 -116 -150 -61 67 138 107 -25 -143 -152 -36 79
6251 79 132 77 -63 -156 -124 -5 99 132 50 -77 -145 -107 29 141 134 25 -102 -136 -60 70 141 113 -3 -121 -140
6276 -140 -42 97 146 91 -36 -142 -118 -18 100 139 56 -69 -150 -115 19 126 126 24 -98 -150 -84 49 141 97 1
6301 1 -121 -137 -50 73 153 104 -26 -133 -115 -17 98 141 78 -58 -140 -97 21 115 141 32 -85 -135 -78 40 137 112
6327 112 5 -106 -137 -65 68 134 93 -27 -133 -136 -26 86 137 73 -64 -141 -114 2 113 136 52 -73 -144 -82 46
6352 46 141 133 21 -93 -137 -65 72 149 110 -13 -128 -127 -39 91 144 88 -46 -129 -106 -17 96 122 33 -83 -157 -91 15
6379 15 106 116 28 -98 -138 -74 46 128 96 -6 -119 -111 -29 90 142 93 -30 -122 -101 -3 104 142 65 -49 -134 -105 23
6406 23 122 120 25 -86 -128 -74 50 121 105 -10 -116 -139 -46 73 126 80 -33 -123 -111 -12 86 127 66 -56 -133 -102 22
6433 22 120 118 40 -68 -128 -62 59 129 112 -4 -108 -126 -41 68 124 79 -27 -128 -114 -24 92 122 58 -59 -137 -108
6459 -108 1 108 105 31 -89 -139 -83 39 110 106 14 -108 -114 -49 64 132 96 -16 -113 -114 -11 111 144 76 -38 -114 -97
6486 -97 8 110 132 43 -82 -129 -77 29 119 100 1 -108 -134 -66 53 128 82 -14 -123 -116 -34 87 136 73 -40 -119
6512 -119 -95 3 114 129 56 -65 -126 -83 35 130 127 16 -82 -131 -62 62 139 94 -14 -118 -128 -33 80 126 68 -38
6538 -38 -122 -114 -17 99 123 41 -76 -128 -90 12 112 120 19 -79 -138 -70 58 119 117 3 -98 -121 -31 76 141 87 -30
6565 -30 -109 -109 -5 106 138 59 -45 -133 -94 16 96 108 20 -96 -148 -90 30 111 103 -6 -111 -135 -54 56 122 84 -23
6592 -23 -118 -124 -27 85 131 65 -54 -138 -92 9 107 127 38 -76 -128 -81 38 125 110 12 -92 -126 -69 60 123 84 -20
6619 -20 -127 -135 -38 75 113 61 -56 -129 -117 -10 95 122 38 -81 -143 -90 33 113 118 17 -87 -123 -61 59 119 97
6645 97 -16 -110 -121 -28 80 126 78 -43 -120 -100 -2 111 116 52 -61 -135 -86 18 100 96 12 -90 -140 -70 38 115 89
6672 89 -13 -110 -126 -42 73 126 69 -36 -127 -103 0 90 116 58 -46 -108 -75 25 113 119 23 -73 -128 -61 37 117 92 -7
6700 -7 -104 -121 -47 58 107 63 -33 -118 -111 -21 94 118 48 -56 -128 -95 4 108 108 29 -81 -112 -66 34 130 89 5 -84 -106
6729 -106 -42 66 119 82 -25 -111 -102 -27 85 117 58 -57 -123 -85 7 97 100 32 -75 -124 -76 25 105 89 -1 -97 -124 -47
6757 -47 66 123 77 -27 -105 -104 -18 87 121 63 -41 -106 -87 6 100 114 32 -68 -112 -56 47 119 100 5 -87 -118 -53 45
6785 45 113 85 -22 -109 -114 -20 75 124 53 -48 -126 -89 -3 104 104 36 -61 -125 -65 37 115 111 27 -79 -112 -44 71 120 93
6814 93 1 -98 -99 -14 88 117 72 -44 -118 -93 2 91 105 38 -72 -123 -90 24 106 98 3 -98 -131 -62 51 111 108 -4
6842 -4 -110 -115 -32 84 121 76 -32 -108 -93 -4 99 128 58 -55 -112 -78 30 109 108 22 -85 -131 -66 52 112 90 -12
6869 -12 -97 -116 -36 64 116 65 -44 -119 -115 -22 94 119 58 -63 -122 -88 18 111 119 35 -76 -110 -54 44 118 97 11 -94
6897 -94 -117 -18 73 120 84 -18 -111 -105 -13 80 118 47 -51 -123 -93 4 101 106 26 -77 -127 -70 36 113 91 6 -95 -114 -49
6926 -49 67 118 88 -18 -98 -98 -8 86 123 59 -42 -101 -83 14 100 117 41 -76 -120 -66 37 112 105 8 -94 -111 -58 54
6954 54 101 83 -12 -98 -108 -30 64 107 68 -38 -116 -94 -2 90 109 44 -48 -102 -73 37 107 113 32 -74 -101 -42 53 120 94
6983 94 -10 -91 -97 -24 81 118 73 -32 -110 -96 0 84 112 43 -60 -111 -74 8 107 102 14 -77 -110 -48 45 113 89 2 -90
7012 -90 -106 -27 77 120 82 -12 -86 -86 -5 98 112 55 -49 -116 -77 21 102 103 36 -75 -120 -66 41 104 83 -13 -98 -110 -30
7041 -30 60 103 64 -22 -105 -104 -15 79 109 44 -56 -107 -73 15 90 101 39 -53 -104 -54 45 113 92 6 -78 -98 -34 63 118 78
7071 78 -17 -101 -85 -9 66 104 41 -60 -115 -83 4 96 98 26 -80 -108 -47 30 100 91 15 -80 -114 -39 62 109 71 -30 -99
7100 -99 -88 -14 91 118 64 -30 -100 -83 6 88 109 30 -67 -107 -65 35 104 87 9 -88 -113 -40 49 96 63 -24 -118 -117 -28 71
7130 71 119 53 -49 -106 -82 11 87 109 36 -58 -110 -55 27 113 100 15 -76 -106 -46 51 111 87 -22 -105 -100 -25 72 108 64 -45
7160 -45 -108 -101 -5 83 91 36 -67 -112 -83 20 95 93 5 -83 -108 -54 49 106 87 -8 -102 -100 -24 70 118 61 -27 -92 -92 5 97
7191 97 117 50 -53 -116 -74 24 87 91 15 -91 -119 -62 41 106 90 -9 -96 -119 -47 50 103 62 -27 -102 -92 -15 79 115 49
7220 49 -43 -101 -72 10 87 106 44 -58 -93 -51 43 113 101 22 -75 -100 -38 55 99 72 -18 -93 -100 -27 76 102 44 -54 -114 -93
7250 -93 4 92 101 34 -64 -111 -80 12 85 89 18 -69 -90 -46 52 122 93 -3 -78 -89 -18 75 117 65 -32 -82 -70 0 95 106 48
7281 48 -52 -105 -72 23 89 93 11 -72 -108 -41 35 92 75 -15 -94 -96 -23 54 94 50 -23 -86 -69 2 85 108 50 -35 -85 -60 35
7312 35 93 100 27 -56 -87 -49 39 107 84 -4 -81 -90 -36 45 101 60 -29 -95 -96 -14 65 91 32 -46 -99 -75 9 80 92 17 -65 -116
7344 -116 -59 42 101 72 5 -72 -83 -33 59 103 67 -18 -83 -89 -6 79 98 51 -34 -84 -78 11 73 78 21 -71 -103 -65 25 82 66
7375 66 2 -85 -97 -34 41 94 61 -23 -83 -84 -14 67 96 52 -36 -91 -68 15 82 90 33 -50 -85 -59 27 95 93 11 -69 -90 -39 35
7407 35 92 59 -22 -94 -93 -26 68 84 33 -44 -96 -74 5 73 88 35 -47 -96 -58 29 92 80 17 -62 -85 -34 47 96 81 2 -81
7438 -81 -92 -22 64 88 49 -30 -90 -70 3 62 98 39 -57 -92 -62 22 81 76 15 -66 -101 -52 38 94 75 -8 -74 -88 -19 49 100
7469 100 54 -22 -88 -78 -13 81 101 58 -37 -97 -59 20 85 89 21 -61 -96 -44 26 88 73 -6 -71 -95 -38 46 84 51 -30 -95
7499 -95 -86 -25 48 88 33 -48 -90 -78 6 79 84 29 -66 -97 -52 25 84 83 13 -71 -84 -21 44 102 71 -14 -80 -80 -11 65 91 44
7531 44 -40 -98 -79 -5 74 83 21 -54 -107 -72 14 73 65 1 -72 -108 -56 34 79 63 -22 -76 -78 -12 49 88 62 -23 -74 -61 6 68
7563 68 93 40 -37 -81 -57 22 78 73 17 -67 -95 -53 26 86 70 3 -77 -85 -36 50 80 49 -30 -85 -78 -3 66 85 37 -38 -73 -56
7595 -56 18 84 87 23 -46 -91 -48 42 77 82 4 -55 -75 -30 58 90 57 -20 -80 -67 -13 54 81 33 -39 -90 -65 5 72 77 22 -63
7627 -63 -84 -41 22 89 56 1 -63 -67 -28 44 85 54 -8 -66 -72 -17 64 94 39 -32 -82 -50 12 74 85 20 -48 -79 -50 18 65
7658 65 52 6 -65 -93 -39 26 64 45 -23 -79 -73 -20 51 78 41 -33 -83 -73 2 63 82 25 -42 -75 -45 36 81 74 11 -46 -75
7689 -75 -30 41 78 57 -6 -76 -69 -15 54 81 45 -26 -71 -70 -5 52 63 12 -55 -86 -56 20 68 69 1 -56 -80 -44 23 76 54 0
7721 0 -67 -70 -6 52 90 44 -31 -70 -67 -9 53 80 25 -37 -76 -44 21 74 68 16 -66 -89 -52 12 72 54 -7 -74 -87 -21 40 72
7753 72 46 -31 -79 -74 -7 62 89 30 -36 -82 -53 25 71 83 12 -41 -75 -38 38 85 76 -2 -66 -75 -20 44 80 52 -30 -76 -78 -7
7785 -7 53 73 22 -44 -95 -66 -6 65 61 9 -49 -83 -45 26 82 58 -2 -62 -73 -27 35 87 60 -13 -63 -56 -22 58 84 51 -23 -80
7817 -80 -53 -3 67 77 24 -38 -72 -48 27 71 60 -3 -70 -88 -38 44 78 58 -14 -64 -81 -19 46 88 46 -19 -69 -70 -9 56 76
7848 76 29 -39 -86 -47 16 84 76 8 -53 -77 -36 29 76 64 -6 -67 -77 -20 43 76 48 -22 -76 -77 -9 52 69 30 -39 -88 -57
7879 -57 14 66 71 25 -54 -71 -34 35 71 62 15 -66 -63 -25 47 80 47 -6 -59 -49 0 56 74 41 -28 -81 -62 11 57 69 17 -52
7911 -52 -74 -52 15 66 64 -2 -64 -84 -21 45 67 38 -22 -69 -53 -5 50 75 42 -22 -72 -51 11 68 70 23 -48 -66 -36 34 84
7942 84 76 5 -42 -69 -25 38 64 45 -3 -70 -65 -9 56 74 32 -31 -75 -56 7 60 64 22 -43 -68 -45 24 72 69 11 -41 -64 -24
7974 -24 39 78 61 -2 -60 -68 -6 53 82 44 -18 -72 -51 9 65 71 31 -48 -80 -60 5 63 48 3 -59 -75 -35 22 67 40 -15
8005 -15 -60 -70 -11 45 79 43 -17 -69 -49 13 72 77 31 -36 -72 -42 29 78 68 16 -48 -62 -29 45 73 62 -10 -61 -86 -29 35
8036 35 66 37 -36 -68 -68 -6 57 69 29 -41 -84 -53 9 64 67 8 -51 -66 -24 35 85 59 -1 -55 -66 -20 45 79 52 -15 -62
8067 -62 -61 -5 67 72 30 -31 -75 -57 6 66 64 14 -58 -85 -44 30 79 56 -5 -70 -74 -30 46 82 50 -22 -73 -60 -5 57 81 37
8099 37 -29 -71 -56 16 72 72 31 -55 -78 -32 38 78 69 9 -50 -80 -35 46 69 55 -26 -77 -72 -20 46 65 30 -45 -84 -68 1 60
8131 60 73 20 -48 -81 -41 18 74 60 12 -44 -63 -24 36 85 53 -5 -58 -59 -14 57 82 34 -24 -73 -65 -5 56 79 18 -42 -69
8162 -69 -52 16 58 61 17 -68 -87 -38 32 72 60 -2 -73 -68 -10 52 77 56 -22 -68 -56 1 53 70 33 -46 -77 -50 17
8191A7
$$ Imaginary data points
##PAGE= N=2
##DATA TABLE= (X++(I..I)), XYDATA
0 0 0 0 0 0 0 0 0 0 0 0 0 0 0 0 0 -8 8 -8 8 -8 9 -16 16 -17 24 -24 32 -33 40 -48 51 -58 66 -76 89 -97 110
37 110 -122 138 -153 171 -189 211 -233 257 -284 314 -346 379 -419 461 -509 561 -618 683 -759
56 -759 843 -939 1052 -1182 1343 -1538 1787 -2113 2560 -3217 4287 -6302 11523 -55077 -101052
71 -101052 18695 99946 114807 27593 -72376 -120510 -66583 34759 111695 95232 6463 -89508
83 -89508 -110530 -45625 57035 111155 77780 -18784 -97802 -99320 -20438 72763 108030 55862
95 55862 -39507 -103224 -83312 2320 85933 99756 34200 -58541 -103474 -65563 24738 94274
107 94274 88009 11235 -73536 -98800 -44762 44179 96956 71737 -10248 -83170 -88931 -23778
119 -23778 59622 94525 53542 -29678 -88184 -75507 -2705 71219 87298 33480 -46270 -88082
131 -88082 -59038 16723 78200 76477 13693 -59283 -84069 -41348 33895 81299 63235 -5173
143 -5173 -68826 -76902 -23376 48437 80930 48323 -22669 -74950 -66748 -5215 59924 76579 31822
156 31822 -37931 -76817 -53915 11910 67665 68769 14750 -50554 -74760 -38782 27804 71383
168 71383 57320 -2398 -59471 -68318 -22457 40768 70685 43740 -17841 -64503 -59069 -6467
180 -6467 50744 66865 29332 -31290 -66410 -48025 8672 58000 60495 14477 -42759 -65304
192 -65304 -35342 22645 62095 51550 -169 -51402 -61167 -21847 34707 63125 40685 -14208
204 -14208 -57314 -54120 -7585 44556 60582 27962 -26642 -59487 -44432 5981 51194 55071
216 55071 14838 -36916 -58726 -33269 18546 55104 47221 1635 -44893 -55148 -21113 29548
228 29548 56209 37632 -10927 -50398 -49203 -8595 38569 54556 26724 -22276 -53199 -41296
240 -41296 3595 45352 50525 15148 -32118 -53384 -31708 15145 49580 44072 3367 -39759
252 -39759 -50830 -21114 25262 51193 35917 -8009 -45238 -45963 -9856 33862 50196 26194
264 26194 -18526 -48161 -39004 1306 40325 46818 15742 -27690 -48672 -30506 11926 44542
276 44542 41279 5015 -35024 -46815 -21029 21408 46532 34196 -5466 -40528 -42914 -10900
288 -10900 29608 46209 25653 -15267 -43777 -37053 -694 36023 43683 16239 -24030 -44832
300 -44832 -29531 9292 40445 38992 6335 -31162 -43522 -20899 18299 42660 32670 -3407
312 -3407 -36539 -40187 -11581 26089 42660 24949 -12596 -39882 -35054 -2163 32290 40696 16388
325 16388 -20902 -41257 -28388 7118 36715 36712 7292 -27770 -40422 -20598 15599 39122 31136
338 31136 -1763 -33059 -37683 -12063 23022 39482 24209 -10333 -36425 -33198 -3388 28968
350 28968 37985 16468 -18083 -37992 -27281 5197 33326 34625 8153 -24654 -37584 -20286
362 -20286 13136 35891 29715 -258 -29858 -35380 -12480 20213 36539 23456 -8281 -33245
374 -33245 -31430 -4457 25938 35393 16389 -15590 -34934 -26128 3514 30179 32525 8802 -21806
387 -21806 -34817 -19830 10924 32812 28269 1109 -26775 -33051 -12762 17571 33688 22695
399 22695 -6352 -30175 -29686 -5408 23058 32917 16308 -13228 -32004 -25014 1945 27153 30481
412 30481 9391 -19054 -32122 -19385 8768 29775 26795 2359 -23801 -30763 -13021 15005
424 15005 30868 21890 -4498 -27143 -27930 -6342 20167 30425 16227 -10838 -29078 -23880 390
437 390 24176 28496 9958 -16391 -29492 -18869 6743 26827 25297 3512 -20907 -28491 -13174
450 -13174 12504 28067 21040 -2748 -24214 -26183 -7146 17475 27995 15945 -8739 -26294
462 -26294 -22656 -932 21369 26441 10309 -13920 -26923 -18257 4941 24078 23822 4454 -18305
475 -18305 -26286 -13125 10405 25484 20041 -1376 -21540 -24381 -7654 15061 25631 15572 -6856
488 -6856 -23688 -21428 -2029 18838 24507 10483 -11789 -24540 -17528 3440 21543 22276 5145
501 5145 -15956 -24179 -12944 8527 23090 19041 -189 -19145 -22693 -8022 12944 23469 15101
514 15101 -5287 -21339 -20190 -2880 16615 22732 10572 -9940 -22418 -16831 2192 19360 20927
527 20927 5675 -13970 -22363 -12746 6958 21008 18132 753 -17136 -21218 -8267 11214 21637
540 21637 14590 -4080 -19385 -19053 -3473 14752 21094 10490 -8396 -20505 -16127 1149 17449
553 17449 19709 6140 -12255 -20758 -12535 5665 19245 17311 1538 -15357 -19897 -8454 9670
566 9670 19999 14241 -2883 -17617 -18177 -4141 13111 19807 10550 -7084 -18981 -15581 276
579 276 15812 18612 6438 -10776 -19312 -12321 4466 17606 16594 2278 -13782 -18761 -8643
592 -8643 8351 18601 13866 -1954 -16113 -17287 -4585 11677 18551 10516 -5848 -17499 -15068
605 -15068 -576 14320 17698 6852 -9416 -18093 -12176 3423 16214 15946 2901 -12382 -17704
618 -17704 -8784 7096 17255 13508 -1039 -14683 -16510 -5071 10321 17413 10465 -4785 -16170
631 -16170 -14534 -1260 12947 16751 7064 -8173 -16829 -11918 2505 14852 15270 3461 -11052
644 -11052 -16662 -8865 5970 15995 13144 -200 -13320 -15714 -5477 9061 16314 10428 -3765
657 -3765 -14890 -14028 -1939 11641 15824 7270 -7024 -15653 -11668 1600 13530 14568 3905 -9797
671 -9797 -15634 -8893 4930 14751 12683 462 -12055 -14848 -5719 7922 15184 10240 -2847 -13611
685 -13611 -13440 -2477 10403 14938 7434 -5951 -14524 -11392 836 12334 13892 4310 -8652 -14654
699 -14654 -8861 3963 13572 12245 1109 -10841 -14074 -6003 6804 14115 10057 -2006 -12424
712 -12424 -12836 -2960 9235 13990 7493 -4953 -13366 -11029 127 11114 13183 4674 -7508 -13669
726 -13669 -8831 3057 12459 11837 1730 -9692 -13308 -6231 5759 13123 9922 -1190 -11302 -12331
740 -12331 -3466 8110 13174 7620 -3968 -12358 -10796 -604 9991 12565 5034 -6465 -12775 -8794
754 -8794 2192 11382 11397 2282 -8594 -12556 -6420 4797 12158 9737 -445 -10226 -11778 -3869 7095
769 7095 12369 7692 -3093 -11367 -10486 -1218 8971 11955 5340 -5496 -11924 -8767 1395 10402
783 10402 11043 2804 -7608 -11912 -6643 3898 11283 9593 223 -9270 -11311 -4261 6143 11599
797 11599 7717 -2309 -10436 -10176 -1752 8019 11353 5550 -4619 -11079 -8619 738 9466 10593 3211
812 3211 -6667 -11187 -6694 3118 10411 9337 806 -8340 -10787 -4547 5276 10855 7696 -1616 -9592
827 -9592 -9860 -2225 7130 10756 5720 -3858 -10320 -8470 143 8602 10140 3516 -5844 -10520 -6709
842 -6709 2441 9596 9038 1243 -7490 -10211 -4711 4514 10107 7564 -1027 -8744 -9423 -2522 6335 10115
858 10115 5767 -3168 -9532 -8220 -322 7802 9646 3735 -5119 -9854 -6651 1823 8828 8707 1607
873 1607 -6735 -9672 -4809 3851 9398 7385 -545 -7992 -9012 -2774 5617 9498 5754 -2585 -8814
888 -8814 -7935 -706 7056 9147 3891 -4444 -9193 -6529 1341 8106 8344 1888 -6028 -9117 -4862 3251
904 3251 8737 7188 -114 -7286 -8608 -3009 4956 8920 5711 -2045 -8161 -7700 -1078 6362 8673
919 8673 4010 -3841 -8594 -6425 860 7439 8017 2176 -5379 -8591 -4903 2698 8115 6994 302
934 302 -6595 -8192 -3205 4307 8366 5693 -1527 -7501 -7439 -1426 5703 8231 4153 -3227 -8003 -6352
950 -6352 366 6755 7715 2504 -4707 -8121 -5015 2103 7493 6860 725 -5953 -7829 -3439 3693 7819
966 7819 5665 -996 -6843 -7178 -1778 5029 7783 4295 -2610 -7392 -6244 -85 6130 7388 2755
981 2755 -4064 -7591 -5030 1568 6861 6664 1136 -5281 -7436 -3662 3054 7282 5684 -472 -6233
996 -6233 -6983 -2139 4384 7357 4431 -2037 -6857 -6157 -549 5466 7078 3036 -3422 -7116 -5096 1007
1012 1007 6267 6491 1507 -4646 -7040 -3806 2476 6733 5582 -13 -5574 -6645 -2405 3768 6882
1027 6882 4493 -1491 -6254 -6001 -956 4837 6720 3238 -2841 -6619 -5096 498 5666 6265 1860
1042 1860 -4040 -6658 -3960 1908 6208 5528 431 -5000 -6379 -2679 3176 6436 4545 -983 -5689
1057 -5689 -5808 -1283 4255 6338 3354 -2319 -6085 -4977 105 5084 5952 2084 -3460 -6182 -3983
1072 -3983 1414 5657 5337 765 -4421 -6031 -2834 2647 5972 4502 -564 -5155 -5596 -1581 3694
1087 3694 5972 3495 -1808 -5615 -4926 -291 4578 5734 2318 -2957 -5784 -4000 1013 5174 5183 1071
1103 1071 -3896 -5680 -2953 2168 5507 4434 -180 -4629 -5327 -1790 3212 5578 3507 -1387 -5131
1118 -5131 -4763 -574 4059 5391 2458 -2480 -5365 -4001 596 4682 5008 1359 -3420 -5374 -3068
1133 -3068 1722 5093 4378 182 -4166 -5113 -2017 2739 5228 3574 -953 -4700 -4652 -896 3594 5128
1149 5128 2612 -2032 -4978 -3944 239 4230 4785 1560 -2945 -5026 -3122 1310 4656 4253 464
1164 464 -3714 -4856 -2173 2302 4851 3558 -602 -4263 -4469 -1148 3143 4849 2719 -1613 -4602
1179 -4602 -3910 -82 3819 4607 1773 -2525 -4720 -3182 941 4280 4166 756 -3281 -4625 -2305 1893
1195 1893 4522 3540 -271 -3864 -4311 -1355 2746 4559 2774 -1251 -4250 -3828 -368 3411 4378 1897
1211 1897 -2148 -4421 -3172 619 3914 4022 973 -2893 -4367 -2390 1546 4208 3515 37 -3496
1226 -3496 -4154 -1548 2353 4301 2845 -913 -3913 -3756 -628 3041 4201 2049 -1781 -4131 -3195 303
1242 303 3574 3920 1188 -2544 -4165 -2488 1194 3902 3463 280 -3167 -4008 -1698 2026 4058 2867
1258 2867 -622 -3617 -3665 -831 2716 4042 2161 -1455 -3884 -3193 58 3260 3833 1358 -2200 -3972
1274 -3972 -2571 906 3625 3457 512 -2855 -3897 -1861 1694 3850 2914 -342 -3329 -3632 -1052 2365
1290 2365 3869 2288 -1160 -3654 -3221 -212 2948 3735 1537 -1905 -3797 -2651 607 3367 3422 738
1306 738 -2529 -3749 -1995 1371 3616 2972 -59 -3033 -3557 -1248 2066 3704 2388 -849 -3388 -3215
1322 -3215 -473 2646 3628 1717 -1573 -3576 -2739 304 3073 3377 975 -2226 -3615 -2143 1070 3378
1338 3378 2992 206 -2722 -3465 -1439 1750 3517 2483 -541 -3113 -3183 -698 2330 3477 1844 -1264
1354 -1264 -3343 -2754 45 2789 3303 1167 -1895 -3439 -2221 766 3112 2967 449 -2435 -3339 -1602
1370 -1602 1431 3296 2521 -278 -2832 -3116 -922 2005 3314 1957 -969 -3102 -2760 -221 2494 3182
1386 3182 1336 -1590 -3212 -2269 496 2850 2918 670 -2127 -3186 -1697 1145 3065 2529 -34 -2550
1402 -2550 -3025 -1083 1718 3109 2036 -689 -2836 -2717 -415 2197 3044 1466 -1298 -2999 -2306 240
1418 240 2564 2833 834 -1842 -3017 -1788 880 2819 2507 187 -2272 -2902 -1197 1464 2928 2075
1434 2075 -443 -2575 -2655 -595 1948 2903 1552 -1050 -2798 -2301 36 2345 2737 957 -1594 -2866
1450 -2866 -1841 643 2606 2465 348 -2040 -2782 -1318 1221 2749 2081 -257 -2378 -2596 -733 1727
1466 1727 2776 1614 -843 -2602 -2275 -123 2128 2665 1072 -1371 -2704 -1877 473 2430 2452 506
1482 506 -1830 -2686 -1389 1031 2606 2088 -86 -2200 -2532 -859 1510 2642 1663 -661 -2461 -2279
1498 -2279 -278 1937 2588 1162 -1200 -2586 -1917 302 2240 2394 632 -1635 -2581 -1461 841 2466
1514 2466 2116 74 -2019 -2482 -956 1334 2546 1715 -488 -2298 -2264 -418 1767 2508 1245 -1000
1530 -1000 -2454 -1938 117 2095 2355 743 -1483 -2505 -1526 666 2310 2112 215 -1873 -2440 -1069
1546 -1069 1153 2434 1761 -328 -2156 -2247 -549 1599 2446 1348 -844 -2330 -1953 0 1961 2346
1562 2346 860 -1302 -2411 -1592 518 2202 2105 345 -1710 -2373 -1159 989 2323 1800 -185 -2015
1578 -2015 -2226 -662 1437 2365 1416 -688 -2227 -1983 -157 1788 2275 965 -1151 -2318 -1642 337
1594 337 2063 2110 485 -1543 -2320 -1225 849 2230 1833 -32 -1864 -2191 -769 1274 2287 1480 -525
1611 -525 -2097 -1979 -288 1646 2233 1047 -999 -2225 -1682 209 1924 2080 582 -1410 -2249 -1307 690
1628 690 2117 1848 100 -1725 -2160 -868 1132 2218 1540 -370 -1975 -1988 -402 1502 2189 1140 -826
1645 -826 -2126 -1725 74 1809 2096 704 -1239 -2174 -1375 547 2015 1881 242 -1586 -2129 -973 954
1662 954 2118 1576 -243 -1856 -1997 -533 1338 2128 1218 -666 -2014 -1751 -68 1662 2063 822 -1072
1679 -1072 -2100 -1449 389 1899 1902 388 -1415 -2078 -1071 809 2035 1640 -63 -1704 -1977 -661 1193
1696 1193 2079 1313 -516 -1922 -1788 -226 1504 2024 917 -919 -2019 -1501 214 1753 1882 497
1712 497 -1279 -2034 -1164 642 1927 1661 75 -1563 -1949 -769 1034 1993 1385 -337 -1785 -1785 -356
1729 -356 1375 1977 1031 -760 -1919 -1543 64 1629 1876 621 -1133 -1969 -1237 490 1804 1677 204
1746 204 -1434 -1912 -865 880 1908 1398 -212 -1671 -1762 -472 1221 1919 1081 -618 -1810 -1556 -56
1763 -56 1502 1837 718 -980 -1879 -1262 365 1697 1679 317 -1288 -1846 -922 757 1816 1434 -99
1780 -99 -1540 -1747 -554 1086 1843 1128 -512 -1720 -1561 -155 1372 1779 770 -869 -1794 -1289 255
1797 255 1589 1654 385 -1178 -1780 -968 637 1727 1430 -9 -1434 -1709 -607 976 1771 1148 -392
1814 -392 -1614 -1533 -235 1260 1734 830 -753 -1721 -1301 151 1486 1622 467 -1079 -1742 -1018 521
1831 521 1627 1419 83 -1351 -1676 -681 865 1693 1169 -311 -1524 -1523 -305 1165 1693 873 -638 -1632
1849 -1632 -1307 63 1399 1608 532 -978 -1680 -1047 423 1552 1422 154 -1257 -1637 -742 764 1644
1866 1644 1205 -211 -1442 -1538 -401 1056 1645 916 -560 -1570 -1340 -35 1285 1576 603 -874 -1635
1883 -1635 -1093 327 1475 1437 249 -1127 -1599 -789 662 1578 1237 -96 -1337 -1509 -467 951 1603
1900 1603 973 -437 -1497 -1356 -134 1183 1546 671 -754 -1570 -1133 205 1371 1419 339 -1022 -1563
1917 -1563 -876 534 1498 1259 26 -1240 -1501 -565 827 1545 1028 -314 -1399 -1350 -235 1078 1522
1934 1522 757 -620 -1496 -1166 94 1269 1443 448 -905 -1515 -918 403 1408 1275 109 -1131 -1468
1951 -1468 -636 705 1466 1060 -223 -1304 -1359 -329 963 1471 805 -513 -1410 -1174 -1 1178 1414
1968 1414 534 -781 -1456 -967 294 1323 1283 227 -1020 -1434 -712 594 1410 1098 -90 -1202 -1348
1985 -1348 -413 860 1427 864 -400 -1319 -1185 -106 1066 1374 592 -667 -1394 -999 179 1222 1270 295
2003 295 -919 -1392 -759 486 1331 1101 7 -1102 -1311 -485 740 1360 907 -283 -1223 -1191 -194 962
2021 962 1346 661 -558 -1321 -1019 91 1127 1260 376 -803 -1346 -804 377 1247 1118 93 -1001 -1293
2039 -1293 -555 648 1299 927 -195 -1146 -1187 -271 862 1299 705 -460 -1236 -1027 7 1033 1237 452
2057 452 -704 -1274 -834 289 1162 1114 175 -901 -1260 -594 531 1230 942 -99 -1069 -1182 -360 753
2075 753 1235 727 -371 -1177 -1045 -83 934 1202 492 -613 -1211 -859 190 1078 1100 240 -795 -1196 -632
2094 -632 445 1169 965 -16 -967 -1126 -404 674 1195 761 -272 -1078 -1017 -142 849 1154 533 -517 -1146
2113 -1146 -856 99 982 1074 293 -715 -1150 -668 346 1076 924 50 -885 -1097 -438 560 1113 770 -192
2132 -192 -1003 -995 -194 766 1108 580 -416 -1062 -859 47 901 1041 352 -629 -1090 -689 284 1011 923 97 -793
2153 -793 -1055 -476 493 1061 770 -138 -925 -982 -255 681 1043 581 -364 -1024 -872 -23 832 1010 375 -557
2173 -557 -1030 -698 210 946 929 169 -717 -1027 -500 425 1014 789 -60 -863 -957 -287 619 1023 614 -298 -967
2194 -967 -862 -73 769 984 411 -511 -1012 -728 145 879 908 209 -664 -1011 -534 352 962 795 7 -810
2214 -810 -961 -341 553 995 642 -217 -907 -864 -131 709 979 472 -409 -955 -736 91 844 924 267 -607 -983
2235 -983 -578 288 916 799 45 -766 -953 -400 473 954 668 -163 -861 -884 -195 642 961 512 -360 -935
2255 -935 -767 16 788 919 325 -538 -961 -622 215 878 832 124 -704 -940 -447 410 935 716 -86 -811
2275 -811 -875 -244 582 943 553 -285 -900 -779 -56 726 900 357 -479 -931 -659 142 826 830 184 -633 -929
2296 -929 -496 344 896 733 -12 -738 -878 -304 511 932 595 -191 -836 -786 -102 675 899 418 -386 -888
2316 -888 -673 78 768 827 225 -568 -903 -532 269 852 728 43 -692 -871 -346 443 879 601 -151 -791
2336 -791 -787 -166 599 866 444 -332 -843 -682 35 711 828 286 -492 -864 -553 221 801 739 89 -633 -835
2357 -835 -390 378 830 604 -112 -738 -784 -208 531 825 461 -298 -815 -689 -15 647 791 300 -442 -825
2377 -825 -553 161 743 722 143 -570 -803 -402 326 793 619 -37 -682 -766 -243 476 808 486 -217 -742 -672
2398 -672 -59 598 771 316 -375 -781 -556 110 689 705 145 -515 -782 -419 277 743 607 -12 -633 -745
2418 -745 -259 421 761 492 -175 -700 -662 -83 544 756 355 -318 -731 -549 73 630 698 197 -465 -739 -430
2439 -430 227 699 613 36 -581 -720 -285 362 735 496 -126 -654 -649 -130 490 716 362 -284 -692 -557 32
2460 32 593 666 220 -417 -712 -436 191 661 607 81 -526 -687 -294 332 701 509 -81 -601 -636 -174 449
2481 449 703 384 -238 -662 -572 -21 552 660 240 -365 -696 -463 131 619 591 105 -491 -669 -324 276 662
2502 662 508 -59 -572 -623 -184 417 682 393 -204 -631 -552 -33 515 651 267 -326 -660 -464 115 589 601
2523 601 129 -448 -653 -346 248 631 512 -20 -549 -629 -228 356 651 414 -170 -615 -566 -69 481 641 285
2544 285 -293 -629 -467 82 558 596 157 -410 -646 -355 222 618 519 18 -511 -617 -227 344 638 423 -122
2565 -122 -581 -556 -87 450 628 302 -274 -617 -491 47 525 571 162 -378 -639 -381 167 587 520 35 -468
2586 -468 -606 -265 305 621 442 -94 -543 -554 -119 418 621 334 -223 -592 -472 19 499 587 202 -354 -615
2607 -615 -385 141 553 517 65 -450 -598 -277 270 593 440 -63 -514 -563 -160 378 586 339 -186 -574 -500
2628 -500 -32 461 558 225 -305 -586 -404 106 531 534 109 -397 -575 -287 240 567 439 -23 -471 -546 -179
2649 -179 330 567 350 -148 -530 -483 -57 422 544 231 -271 -552 -412 69 484 494 126 -353 -542 -310 187
2670 187 530 446 7 -433 -523 -193 294 533 362 -107 -486 -463 -76 392 533 268 -212 -512 -389 38 451
2691 451 488 157 -322 -523 -311 146 474 421 18 -400 -512 -208 250 498 338 -94 -460 -457 -102 345 496
2712 496 259 -188 -484 -382 21 426 468 160 -277 -491 -296 125 451 413 41 -364 -470 -210 225 473 335
2733 335 -64 -417 -434 -111 306 464 250 -167 -453 -380 -3 373 440 151 -249 -466 -309 97 416 389 42
2754 42 -338 -452 -198 208 455 326 -46 -381 -411 -106 294 451 254 -137 -427 -357 -5 358 439 151 -237
2775 -237 -443 -287 90 400 378 55 -303 -435 -218 173 426 318 -36 -367 -419 -122 251 434 246 -136 -419
2796 -419 -358 -32 327 420 163 -208 -422 -286 77 380 379 77 -285 -427 -206 182 414 330 -17 -360 -400 -129
2818 -129 242 415 255 -120 -408 -362 -40 306 401 171 -199 -425 -298 55 358 363 81 -278 -413 -232 149
2839 149 401 325 13 -324 -396 -141 229 405 254 -91 -379 -354 -49 296 405 190 -176 -400 -308 33 349
2860 349 377 107 -248 -411 -230 120 376 325 11 -319 -403 -147 197 385 252 -75 -360 -352 -68 282 389 194
2882 194 -151 -376 -298 24 326 386 128 -221 -392 -242 112 367 318 32 -295 -378 -166 191 389 274 -45
2903 -45 -333 -348 -100 249 387 206 -135 -383 -316 -11 310 361 126 -210 -392 -261 70 356 330 50 -263 -372
2925 -372 -175 169 372 287 -15 -322 -347 -100 227 387 231 -108 -348 -312 -17 287 366 145 -194 -370 -256
2946 -256 61 330 327 61 -246 -374 -201 138 367 284 -5 -310 -345 -117 204 373 223 -79 -345 -316 -34 257
2968 257 355 146 -162 -363 -255 39 320 332 91 -215 -355 -196 120 337 292 9 -278 -347 -131 173 345
2989 345 226 -73 -327 -314 -64 236 343 166 -129 -337 -273 27 288 322 104 -191 -334 -202 104 330 292
3010 292 31 -252 -315 -139 169 326 237 -46 -291 -291 -56 215 332 172 -116 -314 -251 4 265 312 105 -177
3032 -177 -332 -214 68 300 264 34 -233 -320 -144 143 312 220 -39 -271 -287 -68 205 314 163 -98 -291
3053 -291 -248 3 258 292 106 -168 -306 -195 71 284 255 35 -221 -296 -133 142 295 211 -33 -258 -275 -81
3075 -81 178 296 157 -90 -290 -231 7 221 280 96 -155 -303 -201 57 264 262 38 -200 -273 -117 133 292
3097 292 211 -27 -241 -264 -57 185 291 164 -93 -266 -231 -1 218 275 110 -160 -294 -187 50 247 250 25
3119 25 -204 -283 -139 116 274 211 -31 -249 -274 -65 173 279 163 -81 -275 -224 -1 239 273 114 -139 -278
3141 -278 -176 65 268 258 52 -188 -276 -126 116 274 217 -15 -230 -269 -92 148 271 160 -74 -267 -248 -31
3163 -31 196 256 108 -137 -275 -199 47 247 251 66 -181 -266 -133 99 281 226 -7 -218 -244 -81 153 277 182
3186 182 -63 -243 -230 -31 210 273 131 -112 -266 -203 17 226 252 61 -169 -263 -157 67 241 221 15 -208
3208 -208 -260 -114 127 257 181 -43 -243 -237 -58 182 265 133 -88 -240 -185 19 214 251 80 -139 -264 -161
3230 -161 66 237 218 29 -182 -247 -127 107 250 179 -27 -211 -236 -64 149 247 136 -76 -245 -211 -10 183
3252 183 228 90 -124 -252 -172 34 216 222 49 -150 -238 -115 91 233 199 2 -187 -217 -66 142 239 152 -47
3275 -47 -217 -198 -23 171 228 102 -103 -234 -164 18 192 209 53 -136 -241 -130 71 218 177 5 -186 -213
3297 -213 -86 117 219 155 -49 -190 -194 -32 159 214 109 -82 -203 -161 26 174 207 52 -122 -208 -124 53 202
3320 202 171 14 -155 -209 -90 100 198 135 -33 -176 -195 -49 130 190 120 -85 -187 -163 12 154 200 71 -100
3343 -100 -181 -125 59 177 161 30 -141 -182 -79 97 179 140 -22 -147 -177 -54 115 185 104 -50 -170 -151 -2
3366 -2 135 166 61 -82 -181 -117 26 155 146 27 -118 -182 -89 71 164 127 -4 -134 -157 -45 113 172 104 -44 -142
3391 -142 -133 -5 126 163 65 -77 -151 -109 35 148 135 24 -111 -169 -80 59 157 126 -13 -123 -160 -53 78 150
3415 150 92 -46 -140 -127 -9 115 143 62 -76 -154 -104 26 133 137 31 -97 -144 -69 66 156 131 1 -124 -133 -36
3440 -36 97 154 90 -50 -148 -142 -12 113 142 59 -85 -159 -108 17 128 134 20 -97 -146 -74 46 145 124 -2 -116
3465 -116 -127 -45 95 150 88 -33 -119 -123 -7 105 146 69 -65 -145 -105 19 133 140 34 -95 -139 -76 52 137 134 -7
3491 -7 -124 -151 -59 80 146 93 -28 -138 -136 -26 95 145 69 -53 -134 -111 12 136 143 46 -81 -140 -74 48 143 126
3517 126 17 -106 -148 -61 78 150 101 -26 -135 -134 -34 104 137 80 -48 -144 -117 1 116 132 46 -77 -143 -99 31
3542 31 129 126 18 -108 -139 -68 51 137 112 -5 -114 -118 -38 81 148 97 -27 -110 -107 -4 102 130 57 -65 -129 -95 20
3569 20 106 115 21 -91 -132 -77 33 121 110 3 -107 -126 -64 62 132 93 -16 -116 -112 -21 95 127 61 -62 -109 -98 3
3596 3 96 106 34 -67 -107 -65 26 118 103 12 -83 -109 -53 46 113 74 -29 -103 -103 -35 65 99 47 -47 -115 -91 8 96 102 32
3626 32 -55 -110 -69 25 85 96 9 -62 -106 -53 44 105 69 -8 -83 -92 -30 53 106 52 -27 -89 -75 3 85 82 25 -47 -84 -66 18
3657 18 79 87 1 -69 -98 -49 30 77 68 -12 -79 -83 -11 47 77 55 -23 -79 -72 0 73 85 42 -41 -84 -51 24 81 69 5 -54 -85
3689 -85 -37 32 75 55 -11 -72 -80 -22 48 73 41 -31 -77 -77 -3 57 66 26 -44 -76 -48 23 70 67 17 -40 -65 -32 28 81 62 2
3721 2 -49 -64 -10 57 79 48 -19 -72 -60 1 68 78 24 -41 -74 -49 17 62 49 2 -53 -71 -36 32 66 42 -18 -60 -71 -20 52
3752 52 76 34 -23 -67 -47 7 60 66 21 -36 -63 -39 17 61 65 4 -49 -61 -32 42 62 48 -10 -58 -59 -6 51 57 29 -27 -71 -59
3784 -59 -2 49 51 17 -38 -77 -49 13 55 48 7 -61 -62 -21 45 79 52 -9 -61 -45 -11 41 67 25 -28 -65 -48 3 61 60 11 -37
3816 -37 -72 -43 16 54 63 6 -58 -73 -18 33 63 42 -30 -58 -57 -9 41 69 28 -31 -67 -49 5 61 60 30 -29 -50 -34 28 54 53
3848 53 5 -41 -67 -19 30 71 51 -7 -48 -64 -15 29 54 28 -27 -65 -47 -7 45 50 21 -29 -65 -44 8 47 36 0 -37 -55 -26
3879 -26 21 57 35 -11 -52 -44 -5 44 50 33 -20 -43 -36 6 40 47 17 -21 -47 -35 19 42 41 -7 -48 -60 -30 10 49 20 -13 -48 -48
3912 -48 -4 19 42 15 -19 -34 -35 2 42 31 12 -23 -34 -22 11 31 34 -2 -40 -30 -5 9 34 23 -6 -28 -26 4 29 32 20 -11
3944 -11 -34 -25 6 21 24 -5 -31 -33 -31 6 28 14 -18 -34 -39 7 25 32 12 -12 -18 -19 13 36 28 7 -19 -22 1 23 36 21 -8 -27 -22 4
3980 4 23 33 18 -15 -24 -24 6 32 28 5 -30 -41 -11 14 25 11 -5 -34 -36 -7 32 31 12 -16 -33 -27 1 31 37 6 -28 -41 -13 18
4014 18 42 29 2 -35 -43 -11 26 46 26 -11 -36 -37 -13 30 37 13 -34 -49 -40 -1 27 29 6 -37 -44 -31 8 44 26 -11 -41 -55 -24
4047 -24 31 42 25 -17 -44 -35 7 41 53 20 -21 -40 -24 15 49 56 0 -31 -46 -26 21 51 32 -6 -49 -57 -18 22 45 25 -22 -64
4079 -64 -42 -7 41 53 21 -26 -48 -42 9 51 60 20 -32 -50 -22 20 51 51 -19 -44 -53 -12 36 55 31 -13 -54 -52 -6 37 51 22 -25
4112 -25 -47 -33 8 52 56 8 -32 -57 -38 17 48 45 -11 -50 -60 -23 38 60 42 -13 -54 -49 -5 43 60 34 -22 -53 -28 14 59 60
4144 60 10 -42 -65 -25 23 53 33 -9 -40 -58 -25 40 57 33 -19 -55 -52 0 48 52 9 -32 -68 -49 14 54 52 10 -41 -48 -25 34
4176 34 62 52 -5 -52 -57 -7 48 54 38 -23 -52 -41 -1 51 54 16 -27 -65 -40 9 45 50 7 -52 -67 -28 24 65 43 -15 -58 -63 -18
4209 -18 40 66 25 -4 -51 -52 6 55 56 31 -38 -59 -34 21 62 64 7 -58 -53 -24 31 73 45 -5 -59 -68 -15 40 57 26 -31 -64 -58
4242 -58 -3 54 54 14 -42 -71 -37 10 62 57 3 -51 -65 -29 37 78 50 3 -53 -57 -9 60 75 42 -23 -78 -48 6 62 66 26 -45
4274 -45 -74 -37 25 73 71 7 -65 -68 -29 39 77 49 -14 -72 -76 -26 52 76 42 -29 -86 -70 12 78 76 25 -29 -79 -49 23 89 82 22
4307 22 -57 -87 -33 35 89 64 -12 -83 -80 -19 63 87 52 -28 -80 -83 2 77 94 36 -55 -104 -79 17 87 91 9 -58 -90 -52 31 95
4339 95 76 -1 -85 -89 -34 69 97 68 -29 -80 -83 -8 79 109 61 -43 -96 -81 6 86 101 27 -66 -116 -65 28 105 81 -5 -101
4369 -101 -114 -54 46 112 71 -17 -95 -91 -20 79 115 47 -40 -104 -80 1 91 111 39 -61 -113 -70 28 93 106 20 -73 -103 -58
4398 -58 44 101 85 -13 -102 -108 -34 61 104 67 -30 -109 -101 -13 87 109 41 -60 -128 -86 26 103 113 22 -86 -111 -52 44 116
4427 116 92 4 -86 -117 -35 67 120 70 -33 -106 -108 -7 90 121 56 -51 -121 -90 1 98 110 26 -74 -119 -69 37 109
4454 109 92 4 -93 -117 -50 58 116 74 -24 -100 -116 -14 84 122 73 -36 -114 -94 -2 98 121 48 -81 -114 -76 31 118
4481 118 101 16 -88 -116 -61 45 114 88 -17 -104 -110 -27 82 103 50 -43 -130 -105 12 94 112 34 -68 -117 -72 28 113
4508 113 105 5 -91 -119 -54 62 130 87 -13 -105 -118 -35 84 128 67 -42 -115 -115 -11 97 123 41 -65 -132 -94 30
4534 30 116 104 18 -98 -129 -62 53 118 97 -7 -106 -113 -38 79 137 85 -35 -125 -108 -12 105 131 58 -69 -138 -81 22
4561 22 112 121 29 -97 -132 -68 48 125 102 -15 -113 -135 -48 80 142 86 -41 -134 -121 -23 94 123 68 -73 -138 -108 16
4588 16 130 125 32 -82 -130 -66 59 145 117 1 -113 -131 -36 76 137 88 -36 -125 -128 -27 102 132 64 -73 -130 -104
4614 -104 20 124 138 27 -93 -149 -83 43 139 124 -2 -135 -137 -55 78 146 102 -26 -129 -133 -24 113 153 81 -61
4639 -61 -129 -108 19 137 146 51 -93 -152 -99 38 140 126 13 -111 -153 -72 61 144 106 -28 -131 -144 -33 97 162
4664 162 90 -55 -143 -124 -8 124 159 51 -96 -160 -100 30 152 142 13 -113 -159 -80 71 161 129 -6 -134 -139
4688 -139 -47 110 160 96 -48 -152 -144 -16 123 166 73 -78 -164 -123 18 145 149 37 -108 -162 -93 60 152 127 5
4713 5 -141 -151 -65 96 177 116 -28 -141 -149 -32 121 173 77 -71 -161 -130 10 148 156 47 -95 -169 -105 46 151
4738 151 143 9 -128 -169 -86 74 158 119 -26 -149 -153 -37 101 171 92 -53 -160 -135 -1 137 176 75 -80 -165
4762 -165 -105 31 153 155 37 -117 -164 -84 64 156 132 -15 -143 -155 -57 101 171 105 -52 -158 -152 -16 120 164 75
4787 75 -78 -175 -124 22 144 145 29 -108 -177 -97 59 169 139 -3 -139 -165 -59 98 173 119 -28 -147 -141 -15
4811 -15 132 175 80 -70 -167 -130 0 143 147 34 -104 -173 -103 43 165 140 5 -136 -166 -72 91 165 116 -30 -149
4836 -149 -154 -24 127 164 88 -70 -160 -117 19 148 158 49 -108 -170 -100 53 166 136 14 -116 -158 -72 84 174
4860 174 113 -23 -151 -148 -42 115 167 75 -63 -171 -135 2 141 172 61 -103 -166 -109 39 156 136 20 -124
4883 -124 -162 -67 86 172 117 -25 -142 -154 -42 117 166 89 -58 -169 -141 -3 129 163 66 -107 -177 -115 28 158
4907 158 149 23 -119 -167 -93 71 169 130 -26 -145 -162 -57 93 174 106 -59 -162 -141 -1 133 178 72 -81 -166
4931 -166 -116 41 159 161 33 -126 -179 -97 64 164 136 -12 -141 -184 -63 83 166 110 -53 -174 -156 -8 132
4954 132 176 70 -84 -178 -137 19 159 168 35 -115 -181 -98 59 175 151 10 -140 -182 -52 100 191 128 -31 -155
4978 -155 -159 -34 137 180 90 -75 -177 -143 11 144 157 38 -119 -193 -112 52 168 158 13 -143 -180 -78 87
5001 87 193 127 -32 -156 -174 -38 120 185 97 -66 -175 -145 7 152 172 64 -104 -185 -119 48 177 161 26
5024 26 -134 -183 -89 85 191 142 -18 -162 -181 -53 112 182 97 -67 -193 -164 -20 143 174 67 -96 -191 -120 21
5048 21 171 165 38 -126 -183 -95 77 189 145 -12 -158 -179 -64 107 186 109 -49 -180 -166 -20 143 187 77 -78
5072 -78 -195 -128 27 159 177 45 -121 -195 -110 54 184 156 1 -158 -186 -71 105 188 125 -33 -160 -166 -23 143
5096 143 195 91 -74 -186 -124 21 159 180 46 -116 -197 -115 59 175 150 1 -149 -195 -78 98 184 118 -44
5119 -44 -168 -171 -28 130 195 93 -74 -175 -138 9 164 183 57 -111 -189 -117 49 184 164 15 -136 -189 -82
5142 -82 90 186 131 -27 -160 -179 -36 112 194 105 -74 -180 -148 5 151 175 66 -115 -197 -118 34 162 165 15
5166 15 -132 -188 -89 83 183 141 -7 -159 -170 -48 117 184 100 -61 -187 -146 -6 151 166 64 -106 -183 -135 38
5190 38 172 160 33 -129 -187 -93 74 188 137 -17 -169 -184 -53 110 182 106 -48 -192 -172 -22 135 185 81
5213 81 -92 -186 -138 33 172 168 40 -128 -188 -105 68 182 157 -4 -160 -182 -66 105 182 121 -59 -183 -182 -33
5237 -33 134 196 89 -96 -199 -132 22 168 185 40 -137 -209 -111 54 184 148 -3 -159 -200 -82 89 198 128
5260 128 -41 -175 -170 -24 133 195 94 -76 -192 -151 15 162 180 54 -125 -198 -129 44 176 159 3 -160 -204
5283 -204 -92 91 189 143 -35 -179 -187 -49 134 196 109 -65 -191 -157 -1 170 194 67 -127 -197 -127 49 177
5306 177 159 24 -155 -206 -97 82 202 148 -12 -172 -185 -55 123 191 111 -63 -190 -176 -12 138 187 72 -108
5329 -108 -204 -137 18 177 180 36 -129 -213 -107 70 188 151 9 -161 -186 -68 119 199 123 -48 -190 -165 -22
5352 -22 137 191 84 -102 -201 -140 18 173 186 49 -140 -203 -123 58 191 157 -9 -157 -198 -84 83 191 130
5375 130 -48 -183 -189 -35 126 192 93 -70 -193 -161 18 162 198 65 -122 -189 -121 57 192 161 16 -148 -191
5398 -191 -81 87 201 134 -32 -175 -186 -41 116 204 104 -71 -187 -159 5 161 183 73 -107 -200 -129 50
5420 50 171 175 26 -142 -189 -96 77 189 144 -16 -159 -179 -40 118 202 114 -55 -179 -161 -11 145 184 60 -97
5444 -97 -199 -134 23 168 162 27 -143 -201 -111 66 177 149 -21 -166 -175 -65 108 185 119 -59 -179 -171 -21 139
5468 139 182 70 -85 -189 -138 23 158 168 31 -120 -199 -104 66 173 144 -1 -162 -184 -70 103 185 121 -38
5491 -38 -173 -169 -28 131 175 75 -92 -181 -144 20 159 184 52 -114 -190 -111 57 192 160 15 -133 -177 -75 101
5515 101 193 122 -33 -168 -176 -26 126 179 84 -78 -189 -148 11 156 168 48 -110 -180 -116 48 186 156 14 -136
5539 -136 -195 -86 86 179 134 -32 -174 -175 -52 120 194 96 -56 -174 -150 -11 151 197 63 -104 -188 -120 34 165
5563 165 161 33 -146 -186 -94 69 184 139 -23 -160 -175 -46 119 184 104 -58 -179 -165 -12 134 175 77 -88 -188
5587 -188 -137 24 170 168 38 -136 -194 -96 69 181 155 10 -157 -181 -71 100 193 128 -45 -183 -159 -33 127
5610 127 183 85 -90 -191 -147 3 147 167 48 -131 -195 -122 55 183 160 10 -151 -184 -76 97 189 135 -23
5633 -23 -164 -176 -38 130 187 98 -67 -183 -159 -3 144 190 60 -98 -194 -118 38 166 150 22 -126 -180 -90 86
5657 86 177 136 -19 -165 -178 -58 105 187 106 -55 -185 -157 -11 136 179 75 -83 -174 -122 38 172 165 44 -112
5681 -112 -182 -100 71 178 146 -9 -155 -178 -65 98 183 114 -40 -159 -162 -31 133 188 86 -82 -174 -137 14 159
5705 159 167 49 -113 -175 -104 54 169 143 9 -146 -166 -60 89 180 130 -30 -149 -146 -34 128 179 103 -63 -168
5729 -168 -125 2 152 169 49 -104 -173 -112 32 146 144 10 -119 -178 -78 84 174 127 -21 -146 -153 -41 107 170
5753 170 95 -49 -161 -130 0 129 168 63 -90 -171 -116 38 162 152 31 -115 -160 -87 63 173 133 -6 -145
5776 -145 -165 -54 101 154 88 -53 -163 -155 -25 114 157 62 -87 -172 -119 18 146 153 46 -116 -173 -84 61 160 143
5801 143 -2 -120 -155 -50 103 167 106 -39 -156 -154 -17 111 158 78 -73 -160 -122 19 143 163 44 -95 -166 -98
5825 -98 45 157 140 2 -120 -162 -61 81 175 107 -27 -144 -152 -25 119 175 90 -68 -157 -124 11 147 165 51
5849 51 -98 -160 -104 40 161 138 9 -139 -169 -70 71 158 121 -21 -150 -159 -42 110 151 90 -58 -158 -141 -9
5873 -9 128 156 53 -95 -174 -108 31 141 149 22 -109 -177 -86 76 157 125 -9 -137 -155 -45 95 169 110 -40 -162
5898 -162 -141 -20 119 158 61 -90 -179 -122 7 137 140 35 -119 -170 -92 57 157 136 5 -134 -158 -63 91 164
5922 164 117 -33 -155 -147 -28 124 164 74 -67 -161 -129 9 141 150 47 -96 -167 -109 50 150 139 12 -131 -163
5946 -163 -67 71 157 106 -36 -166 -155 -46 101 156 84 -70 -159 -134 -3 132 160 63 -87 -155 -103 41 160 140
5970 140 25 -107 -168 -72 67 155 119 -13 -144 -158 -57 93 171 95 -53 -147 -134 -17 117 156 68 -78 -152 -117
5994 -117 26 138 154 32 -111 -167 -97 50 148 136 0 -132 -155 -55 89 160 107 -15 -142 -141 -25 113 163 90
6018 90 -61 -160 -128 9 129 147 41 -93 -168 -106 37 136 128 7 -113 -153 -70 70 158 111 -14 -137 -152 -38 103
6043 103 164 80 -60 -152 -123 -4 129 153 60 -87 -146 -107 40 144 142 25 -100 -153 -73 64 157 116 4 -130 -160
6068 -160 -50 89 146 82 -40 -137 -139 -19 105 143 65 -83 -156 -110 33 128 137 18 -95 -144 -75 61 153 124 -1
6093 -1 -123 -147 -50 83 144 89 -43 -135 -128 -21 99 154 62 -63 -152 -121 13 123 128 33 -100 -157 -92 40 135 112 3
6120 3 -124 -157 -70 87 148 99 -36 -137 -125 -22 100 147 78 -61 -141 -104 19 127 141 50 -78 -150 -92 40 144
6145 144 125 6 -112 -147 -65 75 151 104 -29 -130 -135 -33 95 142 74 -54 -139 -117 12 129 138 43 -80 -146 -74
6170 -74 29 141 128 11 -111 -142 -59 75 162 115 -13 -122 -129 -40 95 157 90 -37 -139 -127 -8 119 141 66 -81
6195 -81 -153 -108 18 134 128 19 -100 -139 -75 51 147 117 0 -122 -129 -46 92 150 99 -34 -134 -122 -15 111 149
6220 149 64 -67 -140 -95 21 124 135 28 -92 -151 -87 49 150 118 8 -115 -151 -64 75 136 100 -34 -145 -133
6244 -133 -33 103 143 66 -58 -150 -109 13 133 145 48 -83 -139 -84 43 135 119 9 -109 -150 -65 67 143 100 -18
6269 -18 -130 -126 -38 86 145 80 -49 -141 -117 -11 107 135 56 -82 -150 -95 30 131 124 19 -105 -138 -71 54 137 106
6295 106 -12 -118 -129 -34 93 147 91 -43 -125 -117 -5 118 146 60 -79 -138 -110 15 129 123 19 -105 -147 -73 51
6320 51 139 116 -2 -109 -129 -46 81 136 85 -22 -135 -126 -34 93 136 62 -56 -141 -111 12 118 133 40 -89 -139 -86
6346 -86 50 133 113 13 -105 -134 -54 79 141 99 -30 -130 -131 -22 89 137 63 -53 -131 -115 3 102 122 48 -75
6371 -75 -146 -90 34 126 122 13 -97 -127 -61 61 146 102 -12 -110 -125 -26 88 145 73 -46 -133 -101 3 112 135 60
6397 60 -65 -135 -88 23 124 104 17 -102 -136 -64 55 129 100 -11 -116 -115 -30 86 133 93 -49 -118 -111 -6 104 130
6423 130 65 -57 -134 -78 26 122 118 21 -82 -128 -70 53 123 100 -10 -103 -107 -41 96 129 86 -34 -122 -107 -3 97
6449 97 136 57 -69 -120 -95 16 107 110 38 -86 -132 -74 49 135 106 2 -108 -126 -38 81 145 92 -31 -104 -103 4 99
6476 99 130 44 -51 -128 -97 24 111 113 29 -90 -135 -72 46 123 103 4 -111 -132 -48 70 132 89 -18 -111 -122 -28 90
6503 90 131 52 -49 -129 -94 9 111 121 40 -71 -127 -71 37 124 113 8 -104 -132 -54 69 127 93 -29 -119 -118 -32
6529 -32 81 135 66 -50 -134 -106 2 104 128 52 -79 -126 -78 34 124 120 10 -98 -127 -63 60 127 98 -11 -107 -114
6555 -114 -31 81 130 72 -42 -123 -108 -3 112 118 56 -67 -129 -92 24 121 118 15 -91 -131 -75 48 127 89 -4 -108
6581 -108 -129 -36 76 142 90 -39 -112 -115 -4 103 129 68 -58 -120 -91 23 110 117 29 -80 -122 -67 45 122 101 1
6607 1 -115 -130 -48 65 135 79 -25 -117 -114 -27 93 129 53 -58 -130 -104 6 116 111 36 -83 -126 -63 30 128 111 20 -83
6635 -83 -117 -43 68 135 95 -10 -102 -116 -32 96 129 55 -56 -123 -105 4 102 107 31 -68 -121 -81 31 118 109 17 -91 -126
6663 -126 -52 57 124 87 -6 -109 -118 -36 78 121 70 -40 -113 -95 -3 84 129 43 -64 -125 -76 27 112 105 23 -85 -110
6690 -110 -47 52 120 87 -13 -113 -109 -35 64 118 70 -44 -118 -104 -16 97 130 60 -53 -119 -76 25 118 107 30 -75 -115
6717 -115 -50 42 121 102 -11 -98 -122 -35 82 122 80 -37 -112 -93 -20 93 124 42 -56 -122 -85 16 106 107 23 -78 -123
6744 -123 -75 47 100 93 -8 -98 -116 -31 77 123 89 -20 -88 -96 0 100 125 68 -44 -109 -91 20 111 109 25 -75 -127
6771 -127 -75 45 113 90 -5 -91 -117 -41 65 119 73 -32 -107 -95 -21 94 131 64 -60 -119 -84 6 109 106 26 -80 -109
6798 -109 -73 41 105 99 12 -87 -110 -46 67 117 76 -19 -102 -94 -22 75 116 57 -54 -120 -94 14 94 104 17 -80 -126 -75 32
6827 32 116 101 4 -94 -121 -42 66 121 94 -19 -105 -111 -23 86 113 76 -49 -107 -90 9 102 114 48 -55 -116 -72 40 122
6855 122 110 9 -91 -119 -50 66 112 91 -12 -109 -115 -27 80 119 57 -43 -127 -99 -9 95 119 51 -53 -118 -73 33
6881 33 111 113 32 -80 -116 -50 60 130 96 -5 -89 -112 -24 78 131 76 -35 -107 -88 -9 97 128 55 -55 -120 -80 15
6908 15 100 110 26 -83 -118 -66 43 122 96 -2 -92 -117 -34 71 120 82 -17 -97 -98 -10 89 127 58 -34 -114 -86 9 93 114
6937 114 23 -77 -114 -65 42 112 102 1 -96 -105 -36 52 113 74 -20 -102 -108 -16 76 113 69 -50 -114 -87 8 94 108 34 -67
6966 -67 -107 -68 32 110 99 16 -74 -103 -43 52 123 81 -16 -97 -100 -20 83 110 60 -50 -117 -94 1 94 99 33 -70 -119 -74
6995 -74 21 101 103 13 -76 -105 -35 63 121 93 6 -99 -99 -35 71 119 68 -34 -112 -84 -5 83 112 33 -55 -102 -65 23 106 90
7025 90 15 -75 -107 -42 56 99 74 -8 -98 -98 -32 81 111 57 -32 -108 -101 -3 82 99 45 -50 -101 -66 30 111 103 20 -69 -101 -54
7056 -54 48 107 92 2 -86 -104 -33 62 110 54 -26 -105 -94 -3 77 109 46 -61 -117 -83 26 100 86 26 -81 -106 -48 43
7084 43 101 92 -5 -96 -102 -32 66 110 71 -25 -94 -93 -12 78 120 62 -52 -112 -70 24 94 103 23 -77 -102 -68 36 104 83 -1 -88
7115 -88 -100 -41 62 109 81 -21 -92 -95 -17 79 111 56 -46 -105 -82 12 90 102 26 -69 -109 -59 28 112 104 14 -86 -100 -41
7144 -41 55 116 80 -8 -90 -91 -29 87 109 51 -43 -111 -91 3 76 100 32 -70 -116 -65 35 114 99 7 -73 -102 -42 63 124
7173 124 91 -9 -95 -96 -21 77 120 69 -32 -100 -82 -4 85 116 39 -55 -107 -72 25 113 102 21 -74 -104 -46 53 105 84 -15
7202 -15 -99 -107 -18 61 122 63 -28 -105 -94 -3 90 114 47 -51 -106 -76 36 99 107 21 -63 -107 -60 43 113 96 -1 -91 -101 -44
7232 -44 57 108 72 -20 -103 -93 -6 70 102 53 -50 -105 -79 6 95 109 32 -79 -109 -64 32 103 83 -1 -76 -99 -39 64
7260 64 107 74 -12 -82 -91 -7 84 117 63 -33 -92 -87 -2 83 88 22 -53 -102 -64 15 102 81 7 -81 -104 -41 43 102 75 -20 -84 -93
7292 -93 -25 73 105 56 -37 -92 -84 0 86 90 42 -47 -95 -69 15 107 86 8 -65 -101 -44 45 106 78 -3 -80 -86 -19 52 104 59 -26
7324 -26 -99 -84 2 76 98 46 -46 -97 -62 23 87 85 18 -57 -84 -36 53 104 70 1 -77 -87 -28 67 100 55 -24 -90 -76 3 81
7355 81 94 39 -48 -88 -57 23 86 82 14 -59 -85 -43 46 85 70 -7 -88 -97 -32 48 97 57 -31 -80 -83 2 80 103 52 -38 -84 -62
7387 -62 19 100 94 31 -51 -94 -55 35 91 80 4 -71 -94 -36 52 96 65 -14 -77 -76 -3 61 102 42 -26 -94 -77 3 89 87 25 -64
7419 -64 -92 -61 29 88 74 5 -72 -95 -29 52 105 74 -19 -73 -77 -11 70 96 50 -30 -90 -70 1 70 83 39 -46 -97 -60 12 85
7450 85 79 8 -68 -86 -33 35 101 72 -5 -77 -81 -2 73 95 57 -26 -92 -64 6 79 92 38 -44 -88 -64 19 81 89 24 -61 -91 -46
7482 -46 41 98 84 -6 -77 -90 -30 47 88 53 -22 -90 -84 -7 76 102 43 -36 -84 -68 24 87 91 30 -57 -86 -40 40 93 83 1
7513 1 -66 -82 -40 60 96 57 -26 -83 -86 -8 67 94 43 -32 -90 -70 10 67 95 27 -48 -78 -54 31 95 84 9 -66 -83 -38 45
7544 45 89 65 -18 -79 -81 -20 66 94 52 -27 -81 -66 12 75 92 31 -50 -95 -50 20 81 80 14 -64 -83 -42 40 94 74 -21 -74
7575 -74 -81 -20 63 82 54 -24 -82 -76 -6 68 88 26 -48 -84 -53 20 78 78 16 -57 -84 -38 48 89 78 4 -62 -76 -18 47 91 57
7607 57 -23 -82 -76 -21 62 83 39 -45 -83 -60 18 78 70 12 -56 -82 -44 36 86 69 -2 -56 -73 -24 43 81 56 -18 -82 -64 -9
7638 -9 66 81 39 -39 -80 -49 13 71 77 17 -56 -74 -47 30 77 64 11 -58 -66 -35 43 76 39 -23 -81 -77 -19 50 82 45 -37 -76
7670 -76 -57 18 76 88 29 -38 -66 -36 34 84 62 1 -56 -73 -28 50 90 50 -14 -81 -75 -17 61 77 36 -25 -83 -58 8 61 67
7701 67 21 -49 -78 -44 21 72 68 0 -62 -71 -27 56 73 66 -14 -64 -69 -4 62 89 47 -38 -67 -51 2 69 87 27 -44 -76 -52 29
7733 29 75 58 6 -72 -81 -42 38 71 59 -17 -71 -68 -21 52 74 51 -30 -80 -60 2 70 81 31 -41 -77 -46 22 76 76 16 -56 -81
7765 -81 -28 44 82 64 3 -63 -73 -25 54 80 39 -30 -77 -74 -13 63 77 25 -44 -87 -60 29 65 69 15 -57 -86 -45 37 87 78 4
7797 4 -55 -66 -27 49 81 62 -22 -86 -63 -6 58 82 32 -25 -73 -49 17 76 76 13 -49 -81 -55 36 74 65 -5 -61 -93 -35 32 75
7829 75 56 -12 -74 -85 -19 56 75 43 -37 -76 -53 9 69 75 25 -47 -78 -49 25 73 73 10 -69 -82 -32 33 74 58 1 -71 -73 -26
7861 -26 50 80 47 -28 -76 -54 6 63 78 25 -44 -78 -52 5 67 64 13 -52 -69 -37 28 83 56 -13 -62 -74 -15 52 79 42 -10
7892 -10 -75 -61 -1 56 67 27 -39 -78 -53 12 67 66 14 -50 -76 -40 23 70 50 1 -59 -75 -14 39 77 48 -13 -70 -64 -11 58
7923 58 79 32 -42 -73 -53 12 73 64 17 -44 -66 -39 35 68 68 3 -71 -77 -19 53 72 50 -21 -74 -65 -16 55 78 33 -38 -77 -57
7955 -57 0 52 70 27 -41 -71 -39 25 60 63 4 -58 -72 -21 47 84 53 -11 -63 -66 -5 49 72 34 -38 -81 -53 12 58 72 19
7986 19 -62 -75 -40 25 61 64 4 -60 -72 -36 31 71 43 -22 -74 -71 -15 40 69 35 -30 -69 -52 7 58 67 24 -40 -64 -52 23 73
8018 73 51 4 -58 -72 -32 36 74 43 -17 -66 -74 -19 49 61 36 -26 -76 -61 4 62 63 20 -42 -64 -44 25 71 69 11 -47 -74 -36
8050 -36 31 73 62 3 -62 -59 -12 60 84 48 -15 -71 -59 0 62 81 20 -42 -82 -46 18 70 61 12 -52 -76 -39 33 75 52 -1
8081 -1 -64 -75 -22 38 70 47 -27 -70 -58 2 58 77 28 -41 -70 -51 6 60 65 12 -46 -78 -33 29 72 61 -12 -59 -66 -20 39 80
8113 80 49 -31 -68 -68 -6 51 70 31 -39 -90 -61 13 65 74 24 -49 -84 -35 32 78 60 8 -54 -63 -22 45 74 49 -12 -69 -73 -5
8145 -5 53 68 37 -29 -72 -55 -1 77 65 17 -50 -77 -40 22 75 62 8 -61 -73 -35 42 72 69 -14 -75 -68 -17 50 72 44 -26 -67
8177 -67 -55 4 60 67 33 -29 -64 -39 17 72 64 9 -51 -72
8191g2
##END NTUPLES=NMR FID
##END=
