##TITLE=1H_IG-160ac90
 CDCl3
 8 sc, 
 14.1.2022
##JCAMPDX= 6.0         $$ Bruker NMR JCAMP-DX V2.0
##DATA TYPE= NMR FID
##DATA CLASS= NTUPLES
##ORIGIN= UXNMR, Bruker Analytische Messtechnik GmbH
##OWNER= root
$$ XWIN-NMR		Version 3.5
$$ Fri Jan 14 13:48:16 2022 Russian Standard Time (UT+4h)  she@DPX200
##.OBSERVE FREQUENCY= 200.131346
##.OBSERVE NUCLEUS= ^1H
##.DELAY= (6, 6)
##.ACQUISITION MODE= SIMULTANEOUS
##.ACQUISITION SCHEME= undefined
##.AVERAGES= 8
##.DIGITISER RES= 18
##SPECTROMETER/DATA SYSTEM= spect
##.PULSE SEQUENCE= zg30
##.SOLVENT NAME= CDCl3
##.SHIFT REFERENCE= (INTERNAL, CDCl3, 0, 15.7039)
##AUDIT TRAIL= $$ (NUMBER, WHEN, WHO, WHERE, WHAT)
$$ ##TITLE= Audit trail, XWIN-NMR		Version 3.5
$$ ##JCAMPDX= 5.01
$$ ##ORIGIN= Bruker BioSpin GmbH
$$ ##OWNER= she
$$ F:/spectra/data/she/nmr/H-F/1/audita.txt
$$ ##AUDIT TRAIL=  $$ (NUMBER, WHEN, WHO, WHERE, WHAT)
(   1,<2022-01-14 13:47:02.76 +0400>,<she>,<DPX200>,
      <created by zg, POWCHK disabled, PULCHK disabled
       configuration hash MD5:
       00 E9 B6 7A A2 85 ED C7 34 08 36 98 17 FE 4E 26
       data hash MD5: 16K
       45 6C 91 6B 6F 1E 3E 9A 00 5C 74 8A D4 CE F8 C2>)
$$ ##END=
$$ 
$$ hash MD5
$$ D0 C4 41 E6 96 25 6B E0 D0 54 35 79 56 57 3F F2
##$RELAX= 
##$RELAX= 
##$RELAX= 
##$RELAX= 
##$RELAX= 
##$RELAX= 
$$ Bruker specific parameters
$$ --------------------------
##$DU= <F:/spectra>
##$EXPNO= 1
##$NAME= <H-F>
##$PROCNO= 1
##$TYPE= <nmr>
##$USER= <she>
##$AMP= (0..31)
100 100 100 100 100 100 100 100 100 100 100 100 100 100 100 100 100 100 
100 100 100 100 100 100 100 100 100 100 100 100 100 100 
##$AQSEQ= 0
##$AQ_mod= 1
##$AUNM= <au_zg>
##$AUTOPOS= <>
##$BF1= 200.13
##$BF2= 200.13
##$BF3= 200.13
##$BF4= 200.13
##$BF5= 200.13
##$BF6= 200.13
##$BF7= 200.13
##$BF8= 200.13
##$BYTORDA= 1
##$CFDGTYP= 0
##$CFRGTYP= 5
##$CHEMSTR= <none>
##$CNST= (0..31)
1 1 145 1 1 1 1 1 1 1 1 1 1 1 1 1 1 1 1 1 1 1 1 1 1 1 1 1 1 1 1 1 
##$CPDPRG= <>
##$CPDPRG1= <>
##$CPDPRG2= <>
##$CPDPRG3= <>
##$CPDPRG4= <mlev>
##$CPDPRG5= <mlev>
##$CPDPRG6= <mlev>
##$CPDPRG7= <mlev>
##$CPDPRG8= <mlev>
##$CPDPRGB= <>
##$CPDPRGT= <>
##$D= (0..31)
0 1.2 0 0 0 0 0 0 0 0.06 0 0.03 0 0 0 0 0.0002 0 0 0 0 0 0 0 0 0 0 0 0 
0 0 0 
##$DATE= 1642153622
##$DBL= (0..7)
120 120 120 120 120 120 120 120 
##$DBP= (0..7)
150 150 150 150 150 150 150 150 
##$DBP07= 0
##$DBPNAM0= <>
##$DBPNAM1= <>
##$DBPNAM2= <>
##$DBPNAM3= <>
##$DBPNAM4= <>
##$DBPNAM5= <>
##$DBPNAM6= <>
##$DBPNAM7= <>
##$DBPOAL= (0..7)
0.5 0.5 0.5 0.5 0.5 0.5 0.5 0.5 
##$DBPOFFS= (0..7)
0 0 0 0 0 0 0 0 
##$DE= 6
##$DECBNUC= <off>
##$DECIM= 32
##$DECNUC= <off>
##$DECSTAT= 4
##$DIGMOD= 1
##$DIGTYP= 9
##$DL= (0..7)
0 120 120 120 120 120 120 120 
##$DP= (0..7)
150 150 150 150 150 150 150 150 
##$DP07= 0
##$DPNAME0= <>
##$DPNAME1= <>
##$DPNAME2= <>
##$DPNAME3= <>
##$DPNAME4= <>
##$DPNAME5= <>
##$DPNAME6= <>
##$DPNAME7= <>
##$DPOAL= (0..7)
0.5 0.5 0.5 0.5 0.5 0.5 0.5 0.5 
##$DPOFFS= (0..7)
0 0 0 0 0 0 0 0 
##$DQDMODE= 0
##$DR= 18
##$DS= 0
##$DSLIST= <SSSSSSSSSSSSSSS>
$$ [...]
##$SUBNAM2= <"">
##$SUBNAM3= <"">
##$SUBNAM4= <"">
##$SUBNAM5= <"">
##$SUBNAM6= <"">
##$SUBNAM7= <"">
##$SUBNAM8= <"">
##$SUBNAM9= <"">
##$SW= 18.0517287032376
##$SWIBOX= (0..15)
0 0 2 0 0 0 0 0 0 0 0 0 0 0 0 0 
##$SW_h= 3612.71676300578
##$TD= 16384
##$TD0= 1
##$TE= 0
##$TE2= 300
##$TE3= 300
##$TEG= 300
##$TL= (0..7)
0 120 120 120 120 120 120 120 
##$TP= (0..7)
150 150 150 150 150 150 150 150 
##$TP07= 0
##$TPNAME0= <>
##$TPNAME1= <>
##$TPNAME2= <>
##$TPNAME3= <>
##$TPNAME4= <>
##$TPNAME5= <>
##$TPNAME6= <>
##$TPNAME7= <>
##$TPOAL= (0..7)
0.5 0.5 0.5 0.5 0.5 0.5 0.5 0.5 
##$TPOFFS= (0..7)
0 0 0 0 0 0 0 0 
##$TUNHIN= 0
##$TUNHOUT= 0
##$TUNXOUT= 0
##$USERA1= <user>
##$USERA2= <user>
##$USERA3= <user>
##$USERA4= <user>
##$USERA5= <user>
##$V9= 5
##$VALIST= <valist>
##$VCLIST= <CCCCCCCCCCCCCCC>
##$VD= 0
##$VDLIST= <DDDDDDDDDDDDDDD>
##$VPLIST= <PPPPPPPPPPPPPPP>
##$VTLIST= <TTTTTTTTTTTTTTT>
##$WBST= 1024
##$WBSW= 4
##$XGAIN= (0..3)
0 0 0 0 
##$XL= 0
##$YL= 0
##$YMAX_a= 402105
##$YMIN_a= -402626
##$ZGOPTNS= <>
##$ZL1= 120
##$ZL2= 120
##$ZL3= 120
##$ZL4= 120
##$ABSF1= 10
##$ABSF2= 0
##$ABSG= 5
##$ABSL= 3
##$ALPHA= 0
##$AQORDER= 0
##$ASSFAC= 0
##$ASSFACI= 0
##$ASSFACX= 0
##$ASSWID= 0
##$AUNMP= <proc_1d>
##$AZFE= 0.1
##$AZFW= 0.1
##$BCFW= 1
##$BC_mod= 2
##$BYTORDP= 1
##$COROFFS= 0
##$CY= 11.3945322036743
##$DATMOD= 1
##$DC= 2
##$DFILT= <>
##$DTYPP= 0
##$F1P= 2.36226072786647
##$F2P= -0.459571619588291
##$FCOR= 0.5
##$FTSIZE= 0
##$FT_mod= 4
##$GAMMA= 1
##$GB= 0.15
##$INTBC= 1
##$INTSCL= 1
##$ISEN= 128
##$LB= 0.24
##$LEV0= 0
##$LPBIN= 0
##$MAXI= 10000
##$MC2= 0
##$MEAN= 0
##$ME_mod= 0
##$MI= 1.114404
##$NCOEF= 0
##$NC_proc= 0
##$NLEV= 6
##$NOISF1= 3.799351
##$NOISF2= 2.8
##$NSP= 1
##$NTH_PI= 0
##$NZP= 0
##$OFFSET= 15.70392
##$PC= 1
##$PHC0= -15778.87
##$PHC1= 7.80079
##$PH_mod= 1
##$PKNL= yes
##$PPARMOD= 0
##$PSCAL= 0
##$PSIGN= 0
##$REVERSE= no
##$SF= 200.130013532006
##$SI= 16384
##$SIGF1= 3
##$SIGF2= 2
##$SINO= 400
##$SIOLD= 16384
##$SREGLST= <1H.CDCl3>
##$SSB= 0
##$STSI= 0
##$STSR= 0
##$SW_p= 3612.71676300578
##$SYMM= 0
##$S_DEV= 0
##$TDeff= 0
##$TDoff= 0
##$TI= <>
##$TILT= no
##$TM1= 0
##$TM2= 0
##$TOPLEV= 0
##$USERP1= <user>
##$USERP2= <user>
##$USERP3= <user>
##$USERP4= <user>
##$USERP5= <user>
##$WDW= 1
##$XDIM= 8192
##$YMAX_p= 0
##$YMIN_p= 0
$$ End of Bruker specific parameters
$$ ---------------------------------
##NTUPLES= NMR FID
##VAR_NAME=  TIME,          FID/REAL,        FID/IMAG
##SYMBOL=    X,             R,               I
##VAR_TYPE=  INDEPENDENT,   DEPENDENT,       DEPENDENT
##VAR_FORM=  AFFN,          ASDF,            ASDF
##VAR_DIM=   8192,          8192,            8192
##UNITS=     SECONDS,       ARBITRARY UNITS, ARBITRARY UNITS
##FACTOR=    0.0002768,     1,               1
##FIRST=     0,             0,               0
##LAST=      2.2672688,     0,               0
##MIN=       0,             -402626,         0
##MAX=       2.2672688,     402105,          0
$$ Real data points
##PAGE= N=1
##DATA TABLE= (X++(R..R)), XYDATA
0 0 0 0 0 0 0 0 0 0 0 0 0 8 -8 8 -8 8 -8 16 -16 16 -24 27 -32 36 -40 48 -56 64 -75 87 -101 112 -125 141
34 141 -161 181 -203 224 -251 280 -311 344 -378 420 -464 511 -564 621 -683 754 -830 914 -1009
53 -1009 1116 -1236 1370 -1526 1711 -1927 2186 -2504 2903 -3426 4132 -5138 6685 -9322 14630
68 14630 -29161 144118 360410 -313163 -198750 402105 917 -399881 201275 289945 -340323
79 -340323 -118280 397453 -84101 -349960 256819 220545 -366195 -35943 379736 -150486
89 -150486 -302112 297207 151003 -364954 30258 343382 -199062 -237776 312867 78565
99 78565 -347596 96702 295117 -243688 -170972 328098 5918 -329323 157303 249414 -278981
110 -278981 -109926 329264 -52923 -298429 198594 195508 -292027 -47529 311391 -108860
120 -108860 -253088 234988 132837 -299993 18482 289133 -162134 -206894 262812 76019
130 76019 -296714 69839 257963 -194405 -157995 268143 22835 -274338 113753 212839
140 212839 -218503 -100380 266052 -34234 -246453 156904 166388 -238058 -47709 259193
150 259193 -79672 -217140 184595 123795 -242270 -2782 239726 -115952 -178263 203481
160 203481 73984 -238453 46843 213374 -153855 -135562 221212 25437 -233384 89420
170 89420 188522 -181125 -98577 227523 -14059 -217693 121197 154417 -196324 -54134 220926
181 220926 -57678 -189708 152817 111698 -208071 -7215 210906 -97189 -161764 176063
191 176063 74050 -210343 30049 192453 -124217 -127638 185176 33070 -198385 66956
201 66956 161668 -147606 -85631 189474 -10088 -183700 101538 132783 -166890 -50181 190642
212 190642 -43540 -167658 125273 104133 -174832 -16144 180439 -74044 -141048 144314
222 144314 67206 -177528 22720 166139 -106334 -113324 163233 32508 -179579 56022
232 56022 151430 -130115 -86306 171109 805 -169157 83145 125153 -144711 -50915 168842
243 168842 -34628 -150387 110220 94707 -157369 -16150 165096 -65312 -132090 129600
253 129600 67466 -160880 12227 152280 -86763 -106673 138048 36176 -153996 41587
263 41587 131472 -107611 -76674 145971 3276 -147814 70338 112944 -126156 -50615 150385
274 150385 -23492 -137491 90765 91055 -134614 -22937 144443 -49786 -118125 109291 62522
285 62522 -140927 8640 137157 -77489 -98951 126904 36318 -144632 34768 126589 -96387
296 -96387 -77859 133189 11031 -136537 56958 106038 -109433 -49826 133552 -17948 -123932
307 -123932 80211 83435 -121664 -22859 132489 -42321 -110713 95938 62604 -124985 -488
318 -488 123032 -60074 -91083 104449 37474 -122027 24472 108917 -79513 -68748 114255
329 114255 11651 -120455 48032 96861 -95653 -49677 119386 -9231 -113684 65087
339 65087 80030 -104116 -26894 116638 -32321 -99550 82935 57399 -112172 -872 113103
350 113103 -55629 -85725 98023 37412 -115900 19463 105166 -70647 -68989 103359 16672
361 16672 -109883 38425 88924 -82747 -46289 105481 -7197 -101548 58098 72459 -93976
372 -93976 -25896 106373 -26259 -92602 71148 56716 -97715 -7746 99883 -41944 -77312
383 -77312 80307 35926 -97996 14028 90916 -60205 -60986 91258 15709 -99676 33470
394 33470 83323 -74344 -46591 96629 -1317 -94979 48288 69760 -82675 -27432 95968
405 95968 -21411 -84849 64597 52319 -91258 -6629 94981 -40477 -75017 77302 36907
416 36907 -94627 9635 88654 -52819 -61167 82069 19266 -90341 26446 75809 -64697
427 -64697 -42508 85998 -1122 -85497 43921 63695 -75452 -26513 88123 -16634 -79235
438 -79235 55111 51283 -79487 -11150 83943 -31103 -67295 65116 33839 -82342 8163
449 8163 78663 -48068 -55077 76031 17678 -85211 24198 73355 -60092 -43507 80989
460 80989 3056 -81601 37718 61664 -68478 -26364 81423 -15222 -73499 52535 47158
471 47158 -76334 -9230 81113 -30649 -65963 62711 34979 -79047 4006 75783 -41158
482 -41158 -53994 67167 19320 -75795 19251 65175 -52245 -38499 71678 2529 -73265
493 -73265 33843 56822 -61824 -26559 74602 -10022 -68989 43772 46470 -66162 -12692
504 -12692 71722 -23683 -59073 53754 31691 -70109 3709 68876 -38413 -50426 63810
515 63810 19214 -73576 16853 65036 -48660 -40517 67913 6290 -69990 28753 54512 -55898
527 -55898 -25684 68593 -9185 -63915 41486 43354 -63246 -12083 69330 -21811 -58298 49910
539 49910 33397 -65221 -1003 64324 -30570 -47825 53787 20104 -63227 12096 56801 -41013
551 -41013 -36286 59566 6636 -63375 24657 51443 -49873 -26951 62645 -3883 -59989 33285
563 33285 42676 -54072 -15062 61241 -16109 -52902 43234 31097 -59494 -1142 60772 -29359
575 -29359 -46640 52615 20888 -62711 9787 57342 -37620 -38082 55695 9899 -59702 20129
587 20129 48769 -44665 -25728 57630 -3610 -55913 31805 40188 -51777 -14751 58806 -13819
599 -13819 -51486 38461 32066 -53262 -5454 54894 -21865 -43034 43281 20579 -53598 6922
611 6922 50179 -32634 -34049 50062 9317 -55037 17666 46458 -40301 -26645 53017 449
623 449 -52683 25698 39319 -45215 -16035 53175 -11273 -47398 35703 29455 -50981 -3981 53435
636 53435 -22385 -42648 43173 21601 -53381 4406 50540 -28991 -35513 45949 11946 -51167
648 -51167 14068 43285 -36031 -24633 48446 111 -48600 24050 36879 -42033 -16370 49790
660 49790 -7726 -45468 29697 30320 -44033 -7941 47221 -15968 -38385 35434 19942 -45614
672 -45614 3382 44179 -25818 -31706 41859 11285 -47778 12041 41973 -32598 -25851 45039
684 45039 3296 -46107 19813 35430 -37529 -15875 45390 -7452 -41610 28709 27419 -42715
696 -42715 -6372 46228 -16260 -38360 34895 21168 -44782 971 43447 -22258 -31363 37261
708 37261 11924 -42503 9780 37017 -28582 -22520 40015 2566 -41582 17992 32932 -34116
720 -34116 -16226 41817 -4262 -39114 23312 26896 -36087 -8363 39627 -11818 -33212 28816
732 28816 18495 -38523 994 38598 -20551 -28845 35243 11634 -41202 8571 36859 -26525
744 -26525 -23437 37556 4522 -39092 15085 30918 -30602 -15113 38334 -4453 -36287 22955
756 22955 25084 -35709 -7480 39515 -11761 -33509 27754 19626 -36609 -1517 36365 -16341
768 -16341 -27425 29661 11953 -35427 6204 32152 -22718 -20751 33402 4094 -35676 13503
780 13503 29090 -27596 -15511 34816 -1524 -33531 17948 24164 -29708 -8820 33970 -8685
792 -8685 -29459 24058 17244 -33268 -424 33946 -16655 -26075 29623 11703 -35318 5399 32404
805 32404 -21103 -21664 31401 5663 -33759 11526 27461 -25565 -14173 32859 -2600 -31689
817 -31689 18597 22648 -29779 -8135 33666 -8035 -29427 22044 18329 -30437 -3038 31229
829 31229 -12601 -24223 24699 11220 -30301 4387 28082 -18734 -18868 28363 4954 -31061
841 -31061 10162 26232 -22851 -15084 29968 276 -29720 14477 21996 -25404 -8755 29747
853 29747 -6624 -26393 20315 16266 -28889 -1928 30329 -13062 -24257 24939 12188 -30736
865 -30736 2778 28963 -16835 -20086 26418 6458 -29154 8463 24498 -20947 -13766 28013
877 28013 -285 -28057 14235 21252 -24615 -9314 28997 -4681 -26305 17269 17377 -25326 -4453
890 -4453 26938 -9216 -21822 20245 11252 -26063 2053 25252 -14964 -18100 24244 6320 -27619
903 -27619 7123 24179 -18836 -14794 25867 1900 -26368 11368 20257 -21547 -8962 26182
915 26182 -4545 -24051 17020 15753 -25273 -3290 27242 -10019 -22462 20855 12238 -26496
927 -26496 740 25517 -13265 -18386 22100 6819 -25211 6135 21898 -17376 -13095 24126
939 24126 1065 -24843 11183 19471 -20587 -9455 24971 -2624 -23260 13846 16005 -21395
951 -21395 -4964 23504 -7075 -19620 17186 10782 -22946 892 22879 -12503 -17019 21118
963 21118 6848 -24643 5056 22097 -15775 -14172 22467 2808 -23483 9124 18531 -18610
975 -18610 -8808 23271 -3134 -21929 14388 15041 -22046 -4323 24310 -7426 -20659 17246 12075
988 12075 -22744 -780 22552 -10366 -16823 18585 7080 -21950 4234 19748 -14318 -12649
1000 -12649 20812 2393 -22180 8425 18178 -17158 -9799 21684 -809 -20889 11011 14997
1012 14997 -18258 -5477 20797 -5339 -18047 14727 10593 -20474 -329 21075 -10231 -16405
1024 -16405 18408 7528 -22134 3201 20367 -13053 -13594 19532 3619 -20992 7150 17146
1036 17146 -15965 -8910 20706 -1585 -20173 11798 14566 -19070 -5341 21654 -5081 -18953
1048 -18953 14040 11807 -19379 -2089 19845 -7822 -15523 15524 7363 -19248 2520 18049
1060 18049 -11799 -12298 18122 3430 -19965 6313 16947 -14364 -9821 18916 561 -18761
1072 -18761 8771 14056 -15752 -5773 18733 -3987 -16784 12869 10414 -18489 -1212 19442
1084 19442 -8422 -15534 15969 7831 -19639 1684 18517 -10719 -12907 16920 4130 -18828
1096 -18828 5621 15819 -13851 -8721 18433 -580 -18289 9707 13669 -16315 -5788 18990
1108 18990 -3288 -17120 11423 11253 -16622 -2750 17617 -6235 -14092 13466 7004 -17104 1822
1121 1822 16327 -10152 -11490 15953 3834 -17947 4789 15664 -12280 -9581 16813 1157
1133 1157 -17091 7521 12970 -14147 -5494 17016 -3397 -15472 11436 9927 -16639 -1862 17831
1146 17831 -6782 -14676 13859 7933 -17576 747 16870 -9083 -11910 14902 4088 -16718
1158 -16718 4599 14282 -11889 -8296 16209 332 -16536 7773 12913 -13998 -6148 16865 -2020
1171 -2020 -15544 9507 10459 -14393 -2962 15486 -5036 -12707 11572 6766 -15221 892 15087
1184 15087 -8514 -11168 14157 4368 -16416 3604 14563 -10621 -9115 14887 1517 -15293
1196 -15293 6317 11895 -12408 -5438 15380 -2443 -14432 9864 9782 -14931 -2523 16315 -5432
1209 -5432 -13659 11921 7667 -15350 -69 14922 -7319 -10881 12630 4275 -14716 3310 13107
1222 13107 -10046 -8149 14320 1118 -14985 6194 12001 -11884 -6199 14626 -868 -13798
1234 -13798 7508 9739 -12151 -3387 13739 -3765 -11833 10008 6798 -13742 117 13973 -7150
1247 -7150 -10651 12404 4672 -14643 2386 13278 -8770 -8748 12923 2108 -13800 5045 11141
1260 11141 -10892 -5528 13926 -1566 -13332 8338 9336 -13016 -3062 14483 -3855 -12484 9689
1273 9689 7601 -13097 -1027 13245 -5642 -10107 10757 4428 -13029 2346 11911 -8442 -7762
1286 -7762 12427 1759 -13328 4633 11109 -9838 -6302 12666 88 -12393 6062 9052 -10637
1299 -10637 -3440 12392 -3089 -10874 8830 6475 -12310 -388 12759 -5856 -10078 10730 4934
1312 4934 -13046 1394 12182 -7344 -8268 11417 2310 -12434 4218 10211 -9518 -5293 12373
1325 12373 -898 -12091 6906 8863 -11219 -3515 12862 -2619 -11419 8011 7241 -11341 -1399
1338 -1399 11684 -4625 -9101 9260 4213 -11445 1652 10763 -7081 -7428 10845 2292 -12040
1351 -12040 3457 10353 -8355 -6112 11197 488 -11142 5186 8266 -9376 -3278 11139 -2482
1364 -2482 -10006 7683 6334 -11072 -1001 11790 -4718 -9607 9359 5046 -11664 720 11035
1377 11035 -6179 -7655 9894 2455 -10995 3239 9323 -8080 -5305 10912 -42 -11068 5473
1390 5473 8549 -9558 -3957 11332 -1476 -10306 6376 6869 -9498 -1893 10207 -3349 -8364
1403 -8364 7687 4460 -10106 628 10030 -5677 -7432 9387 2962 -10816 2233 9593 -6770
1416 -6770 -6082 9586 1214 -9954 3882 7851 -7953 -3705 10000 -1487 -9480 6406 6456 -9787
1430 -9787 -1745 10714 -3428 -9030 7692 5220 -9991 -272 9845 -4586 -7275 8211 2969
1443 2969 -9680 2098 8699 -6569 -5445 9484 870 -9978 3932 8122 -7689 -4393 9597
1456 9597 -215 -9200 4653 6629 -7847 -2484 9003 -2243 -7828 6402 4593 -8925 -135
1469 -135 9159 -4420 -7150 7895 3383 -9467 1176 8797 -5400 -5922 8281 1636 -8940 3079
1483 3079 7269 -6917 -3653 8958 -953 -8657 5341 6165 -8468 -2139 9526 -2369 -8302 6276
1497 6276 5115 -8579 -792 8700 -3629 -6629 6982 2918 -8487 1498 7821 -5509 -5228 8178
1511 8178 1357 -8874 2864 7517 -6341 -4397 8291 319 -8162 3742 6039 -6733 -2432
1524 -2432 7987 -1741 -7136 5513 4440 -7938 -556 8387 -3546 -6802 6838 3542 -8456
1537 -8456 582 8025 -4493 -5559 7181 1776 -7987 2432 6703 -5991 -3659 8011 -388 -7993
1551 -7993 4366 6031 -7305 -2574 8487 -1448 -7640 5036 4998 -7284 -1206 7671 -2729 -6118
1565 -6118 5910 3030 -7507 850 7230 -4500 -5128 7097 1801 -7948 1983 6972 -5207 -4327
1579 -4327 7179 714 -7302 3004 5605 -5901 -2466 7190 -1359 -6613 4821 4303 -7138 -844
1593 -844 7697 -2867 -6379 5912 3518 -7506 184 7243 -3744 -5136 6306 1785 -7122 2024
1607 2024 6133 -5233 -3485 7177 -1 -7289 3548 5680 -6238 -2712 7435 -830 -6868 4064
1621 4064 4622 -6215 -1331 6711 -2195 -5507 5054 2869 -6652 450 6578 -3739 -4881 6165
1635 6165 1994 -7105 1406 6347 -4401 -4048 6266 835 -6486 2551 5058 -5173 -2300 6464
1649 6464 -1042 -6069 4241 4125 -6402 -1099 7030 -2274 -5941 5084 3422 -6597 -109 6434
1663 6434 -3094 -4648 5426 1741 -6321 1568 5600 -4497 -3456 6350 390 -6666 2795 5373
1677 5373 -5287 -2778 6489 -346 -6095 3277 4250 -5269 -1426 5923 -1673 -5053 4368 2902 -5951
1692 -5951 85 6115 -3094 -4699 5406 2133 -6371 937 5801 -3684 -3802 5460 970 -5802 2075
1707 2075 4665 -4596 -2284 5918 -788 -5731 3726 4009 -5787 -1266 6403 -1782 -5465 4308 3259
1722 3259 -5709 -364 5726 -2534 -4292 4760 1791 -5757 1214 5245 -3948 -3330 5696 634 -6010
1737 -6010 2221 4943 -4463 -2735 5623 -3 -5444 2672 3958 -4638 -1483 5375 -1403 -4715 3926
1752 3926 2758 -5450 -72 5606 -2630 -4373 4707 2190 -5650 530 5287 -3070 -3613 4840 1033
1767 1033 -5306 1835 4335 -4191 -2151 5420 -569 -5245 3166 3815 -5010 -1486 5687 -1136 -5022
1782 -5022 3506 3194 -4982 -600 5134 -2097 -3930 4152 1727 -5074 901 4701 -3252 -3201 4849 974
1798 974 -5341 1519 4622 -3643 -2774 4878 306 -4858 2193 3584 -4003 -1391 4715 -1090 -4192
1813 -4192 3309 2658 -4733 -416 5074 -1987 -4186 3986 2266 -4981 206 4720 -2558 -3239 4160
1828 4160 978 -4580 1482 3844 -3510 -2130 4698 -147 -4806 2465 3708 -4252 -1697 4974 -715
1843 -715 -4484 2828 2901 -4132 -707 4381 -1547 -3496 3382 1794 -4387 408 4338 -2580 -3187 4185
1859 4185 1247 -4752 1044 4174 -2955 -2594 4093 506 -4186 1652 3236 -3338 -1485 4182 -721
1874 -721 -3969 2818 2673 -4267 -669 4641 -1551 -3847 3332 2175 -4240 -50 4108 -1979 -2995
1889 -2995 3512 1127 -4108 1086 3659 -3038 -2168 4250 135 -4370 1970 3446 -3542 -1758 4262
1904 4262 -290 -3975 2161 2782 -3494 -924 3916 -1166 -3324 2965 1808 -4017 199 3997 -2180
1919 -2180 -3008 3600 1313 -4191 624 3781 -2386 -2533 3554 649 -3804 1376 3022 -3045 -1404
1934 -1404 3888 -622 -3690 2495 2569 -3780 -802 4155 -1125 -3587 2787 2171 -3753 -265 3762 -1689
1950 -1689 -2775 3159 1092 -3737 908 3366 -2650 -2119 3736 353 -3966 1480 3274 -2969 -1825
1965 -1825 3736 -4 -3617 1785 2593 -3070 -905 3490 -980 -2998 2601 1742 -3558 -21 3670
1980 3670 -1708 -2930 3092 1486 -3725 316 3472 -1986 -2348 3105 647 -3357 1192 2706 -2683
1995 -2683 -1354 3465 -386 -3404 2061 2474 -3287 -983 3713 -803 -3278 2320 2032 -3227 -298
2010 -298 3263 -1389 -2454 2691 1021 -3263 675 3047 -2212 -2029 3253 541 -3522 1116 2997
2025 2997 -2469 -1740 3189 122 -3111 1456 2217 -2607 -812 3012 -825 -2686 2260 1623 -3173 -136
2041 -136 3307 -1464 -2657 2696 1349 -3241 265 2977 -1731 -1965 2707 514 -2930 1105 2394
2056 2394 -2418 -1200 3139 -338 -3080 1835 2245 -2909 -874 3277 -673 -2828 2001 1726 -2774
2071 -2774 -255 2817 -1247 -2151 2414 883 -2965 622 2756 -2011 -1852 2947 498 -3156 957
2086 957 2621 -2146 -1509 2795 63 -2709 1346 1936 -2383 -633 2801 -828 -2471 2154 1492 -2942
2102 -2942 -98 3029 -1306 -2385 2416 1197 -2883 255 2668 -1591 -1726 2508 379 -2707 1110
2117 1110 2185 -2303 -1081 2937 -330 -2856 1674 2081 -2640 -844 2937 -575 -2550 1809 1540
2132 1540 -2515 -188 2584 -1194 -1939 2295 796 -2775 595 2610 -1846 -1756 2695 538 -2905 839
2148 839 2417 -1940 -1360 2539 13 -2456 1324 1738 -2296 -538 2650 -835 -2335 2047 1405 -2782
2164 -2782 -105 2807 -1221 -2199 2214 1065 -2641 295 2385 -1532 -1512 2352 257 -2516 1096 2039
2180 2039 -2177 -992 2752 -292 -2638 1536 1914 -2379 -753 2634 -531 -2248 1640 1315 -2288
2195 -2288 -69 2329 -1210 -1748 2176 674 -2620 587 2390 -1748 -1597 2460 425 -2587 786
2210 786 2097 -1788 -1111 2300 -122 -2196 1333 1492 -2187 -354 2467 -871 -2110 1950 1233 -2498
2226 -2498 -49 2518 -1094 -1909 1988 877 -2336 358 2089 -1471 -1268 2179 102 -2288 1106
2241 1106 1802 -2038 -853 2494 -294 -2360 1371 1692 -2107 -625 2319 -532 -1955 1535 1083 -2098
2257 -2098 89 2091 -1196 -1525 2057 567 -2354 571 2154 -1554 -1410 2203 375 -2293 764
2272 764 1840 -1652 -898 2102 -247 -1934 1302 1277 -2025 -283 2236 -823 -1950 1768 1139 -2292
2288 -2292 -65 2261 -990 -1704 1805 746 -2088 393 1820 -1376 -1066 1998 67 -2097 1006
2303 1006 1696 -1841 -844 2280 -167 -2157 1201 1549 -1874 -559 2054 -518 -1717 1412 926 -1917
2319 -1917 98 1923 -1100 -1452 1882 584 -2212 450 2026 -1396 -1330 1978 340 -2052 704 1626
2335 1626 -1489 -762 1874 -229 -1782 1218 1206 -1924 -295 2140 -718 -1830 1613 1084 -2063 -72
2351 -72 2038 -882 -1493 1580 640 -1834 373 1634 -1266 -989 1852 58 -1984 925 1604 -1692
2367 -1692 -827 2072 -177 -1931 1042 1330 -1639 -460 1804 -496 -1507 1307 819 -1794 117 1800
2383 1800 -1066 -1305 1781 525 -2023 450 1797 -1254 -1122 1746 272 -1770 645 1394 -1360 -633
2399 -633 1745 -309 -1630 1208 1053 -1818 -206 1937 -725 -1602 1439 900 -1815 -34 1728 -803
2415 -803 -1264 1427 453 -1674 479 1452 -1281 -812 1767 -47 -1786 921 1391 -1527 -647 1834 -167
2432 -167 -1635 975 1143 -1470 -316 1627 -558 -1300 1314 596 -1699 285 1610 -1082 -1128 1633
2448 1633 380 -1796 433 1571 -1143 -967 1571 153 -1599 702 1180 -1345 -395 1625 -449 -1418
2464 -1418 1214 884 -1677 -130 1743 -645 -1432 1296 799 -1640 38 1539 -823 -1041 1386 262
2480 262 -1531 584 1258 -1243 -664 1631 -90 -1625 847 1251 -1433 -588 1677 -242 -1499 965
2496 965 919 -1413 -135 1440 -686 -1095 1284 463 -1571 307 1482 -1023 -1034 1551 328 -1679 461
2513 461 1419 -1129 -777 1471 -33 -1381 774 962 -1306 -271 1513 -497 -1341 1159 831 -1596
2529 -1596 -94 1652 -692 -1292 1259 628 -1499 136 1338 -847 -879 1308 153 -1420 612 1175
2545 1175 -1225 -610 1600 -124 -1552 895 1143 -1398 -444 1536 -299 -1301 954 759 -1320 -31
2561 -31 1363 -732 -1027 1300 399 -1569 372 1442 -1070 -933 1501 224 -1551 508 1228 -1096
2577 -1096 -625 1391 -91 -1307 833 871 -1332 -204 1523 -566 -1277 1225 733 -1556 15 1517
2593 1517 -698 -1135 1226 505 -1411 251 1265 -905 -753 1385 37 -1434 725 1114 -1316 -504
2609 -504 1582 -243 -1466 911 1025 -1350 -343 1449 -405 -1213 1033 624 -1381 111 1359 -860
2625 -860 -962 1399 288 -1579 444 1389 -1079 -864 1470 160 -1506 585 1165 -1142 -531 1440
2641 1440 -234 -1289 936 820 -1405 -111 1527 -637 -1263 1224 711 -1555 24 1500 -736 -1113
2657 -1113 1240 424 -1445 333 1226 -1017 -704 1413 -44 -1467 776 1124 -1340 -526 1597 -207
2673 -207 -1478 906 1025 -1346 -315 1464 -442 -1192 1078 590 -1405 148 1363 -870 -1006 1392
2689 1392 347 -1599 390 1386 -1057 -902 1431 178 -1488 555 1117 -1145 -516 1407 -231 -1307
2705 -1307 941 847 -1417 -171 1543 -572 -1280 1174 750 -1499 -14 1467 -682 -1069 1204 424
2721 424 -1384 340 1224 -984 -725 1411 12 -1464 709 1165 -1277 -581 1531 -155 -1444 802
2737 802 990 -1273 -325 1387 -427 -1166 1030 591 -1384 118 1382 -814 -1004 1337 387 -1530 323
2754 323 1392 -974 -887 1359 196 -1403 513 1105 -1102 -486 1360 -237 -1285 917 845 -1378 -197
2771 -197 1503 -519 -1286 1101 744 -1430 -46 1401 -671 -1030 1170 367 -1369 355 1191 -1018
2787 -1018 -691 1401 8 -1455 693 1145 -1239 -571 1489 -136 -1384 816 931 -1260 -256 1374
2803 1374 -477 -1100 1079 555 -1411 163 1379 -834 -1011 1346 384 -1524 341 1339 -990 -841
2819 -841 1349 131 -1372 591 1016 -1131 -438 1374 -285 -1298 944 869 -1393 -219 1520 -494
2835 -494 -1263 1104 730 -1427 -3 1365 -676 -950 1185 346 -1369 405 1199 -1028 -734 1439 25
2852 25 -1477 690 1161 -1233 -554 1468 -165 -1355 806 878 -1250 -231 1338 -494 -1108 1086 556
2869 556 -1417 159 1400 -830 -1001 1336 386 -1486 328 1292 -935 -800 1286 106 -1286 583
2885 583 1017 -1120 -418 1398 -297 -1286 965 853 -1385 -200 1462 -491 -1204 1042 656 -1332 -6
2902 -6 1305 -666 -933 1169 297 -1362 410 1161 -1040 -679 1389 23 -1413 652 1106 -1135 -536
2919 -536 1373 -131 -1262 775 841 -1200 -197 1328 -505 -1059 1094 540 -1382 138 1341 -782
2935 -782 -973 1230 412 -1413 267 1235 -872 -767 1238 96 -1280 597 968 -1141 -393 1350 -289
2952 -289 -1228 889 839 -1304 -218 1402 -429 -1171 990 652 -1293 45 1252 -687 -857 1170 258
2969 258 -1292 435 1135 -990 -679 1342 46 -1383 602 1090 -1116 -533 1335 -170 -1215 798
2985 798 770 -1186 -150 1262 -518 -1029 1062 528 -1360 110 1338 -757 -982 1208 390 -1384 293
3002 293 1191 -876 -698 1233 50 -1232 616 941 -1106 -402 1349 -244 -1265 872 867 -1291 -254
3019 -254 1390 -423 -1157 976 613 -1261 37 1206 -677 -869 1142 279 -1336 387 1167 -990
3035 -990 -716 1350 101 -1379 570 1079 -1085 -524 1298 -138 -1181 764 783 -1156 -164 1299 -494
3052 -494 -1073 1048 581 -1376 74 1344 -716 -975 1168 412 -1338 254 1160 -841 -721 1184 78
3069 78 -1255 575 977 -1106 -446 1359 -226 -1250 834 877 -1254 -268 1346 -369 -1111 914 649
3086 649 -1213 15 1216 -631 -881 1152 324 -1326 359 1188 -929 -728 1295 144 -1335 487
3102 487 1064 -996 -569 1249 -85 -1192 714 814 -1151 -209 1291 -448 -1084 1024 617 -1319 -1
3119 -1 1323 -606 -1002 1080 459 -1274 171 1162 -785 -743 1179 127 -1258 535 995 -1033 -496
3136 -496 1322 -138 -1280 746 908 -1166 -356 1306 -290 -1147 850 675 -1198 -44 1216 -625
3152 -625 -920 1097 361 -1318 270 1214 -840 -823 1237 237 -1326 417 1102 -961 -591 1225 -52
3169 -52 -1188 688 847 -1121 -252 1288 -360 -1125 936 696 -1289 -90 1350 -536 -1051 1049 513
3186 513 -1280 144 1166 -757 -770 1149 159 -1265 483 1068 -1018 -592 1330 -48 -1322 678
3202 678 991 -1118 -407 1319 -243 -1138 846 713 -1172 -65 1243 -545 -979 1091 470 -1341 193
3219 193 1282 -790 -892 1222 294 -1334 362 1120 -919 -639 1227 -3 -1227 648 906 -1124
3235 -1124 -368 1327 -306 -1207 899 787 -1274 -142 1346 -478 -1068 991 555 -1255 96 1200
3251 1200 -709 -828 1176 233 -1297 441 1126 -989 -651 1329 24 -1325 615 1017 -1101 -450
3267 -450 1291 -200 -1171 798 732 -1197 -103 1279 -547 -1032 1084 501 -1338 133 1281 -751
3283 -751 -911 1194 335 -1301 338 1143 -872 -652 1242 15 -1219 648 939 -1113 -360 1354 -281
3300 -281 -1207 900 799 -1266 -178 1340 -442 -1068 991 544 -1252 113 1208 -736 -809 1188 215
3317 215 -1320 432 1116 -1004 -655 1328 36 -1311 611 995 -1083 -430 1295 -219 -1149 823
3333 823 740 -1202 -87 1269 -544 -1015 1100 521 -1349 132 1298 -740 -917 1182 333 -1306 323
3350 323 1121 -901 -652 1235 -1 -1237 665 948 -1129 -397 1363 -272 -1247 863 817 -1257 -220
3367 -220 1324 -440 -1071 991 571 -1242 97 1222 -728 -833 1200 268 -1337 406 1174 -963
3383 -963 -705 1307 74 -1316 557 1033 -1072 -467 1290 -208 -1189 805 758 -1225 -141 1326 -525
3400 -525 -1091 1073 582 -1344 81 1316 -682 -956 1158 398 -1308 287 1150 -878 -684 1252 45
3417 45 -1292 636 999 -1139 -442 1380 -184 -1268 816 870 -1214 -251 1349 -408 -1110 974 591
3434 591 -1284 58 1235 -717 -886 1191 302 -1339 340 1204 -938 -760 1287 137 -1335 536
3450 536 1049 -1038 -492 1285 -161 -1191 792 804 -1201 -179 1338 -452 -1090 1031 624 -1328 23
3467 23 1312 -649 -967 1137 390 -1296 264 1128 -887 -705 1231 62 -1284 579 1004 -1110 -495
3484 -495 1345 -153 -1273 769 872 -1199 -261 1296 -377 -1067 938 585 -1221 60 1228 -667
3500 -667 -901 1160 370 -1346 311 1211 -898 -763 1255 143 -1293 502 1004 -998 -496 1239 -158
3517 -158 -1177 766 800 -1182 -216 1323 -435 -1123 977 639 -1298 -15 1280 -595 -937 1061 391
3534 391 -1233 248 1131 -823 -674 1197 88 -1259 564 1023 -1064 -498 1325 -123 -1230 721
3550 721 867 -1132 -289 1251 -345 -1076 893 602 -1214 12 1226 -662 -920 1113 374 -1305 255
3567 255 1183 -825 -778 1168 213 -1253 426 1013 -948 -534 1214 -112 -1166 716 809 -1151 -246
3584 -246 1293 -357 -1115 902 688 -1201 -87 1255 -526 -957 1007 446 -1238 193 1130 -799
3600 -799 -728 1172 153 -1254 467 1033 -981 -590 1245 -31 -1245 605 916 -1062 -355 1251 -254
3617 -254 -1076 825 649 -1166 -54 1221 -553 -959 1045 470 -1257 153 1216 -710 -835 1119
3633 1119 259 -1241 355 1022 -895 -569 1164 -33 -1169 621 858 -1089 -362 1255 -262 -1157
3649 -1157 811 740 -1176 -160 1230 -451 -981 948 499 -1173 134 1110 -693 -764 1116 235 -1237
3666 -1237 391 1087 -901 -646 1221 49 -1215 544 925 -990 -395 1167 -224 -1077 765 693 -1135
3683 -1135 -121 1202 -486 -1005 976 530 -1250 75 1188 -645 -842 1059 303 -1185 303 1020
3699 1020 -825 -587 1139 15 -1170 596 902 -1027 -389 1242 -200 -1151 766 766 -1107 -206 1193
3716 1193 -380 -969 881 513 -1149 89 1122 -663 -800 1058 278 -1242 310 1069 -831 -665
3732 -665 1161 99 -1186 492 935 -926 -424 1167 -155 -1068 728 717 -1101 -165 1216 -417 -994
3749 -994 927 574 -1181 15 1172 -572 -862 992 351 -1156 231 1029 -788 -633 1097 57
3765 57 -1174 520 913 -990 -456 1195 -134 -1131 653 777 -1056 -262 1161 -320 -967 846 555
3782 555 -1109 35 1124 -571 -819 1034 346 -1189 248 1098 -736 -708 1087 187 -1162 385 948
3799 948 -881 -482 1124 -105 -1066 646 749 -1058 -239 1169 -339 -1046 828 620 -1139 -75 1150
3816 1150 -490 -894 924 402 -1113 183 1025 -731 -671 1079 145 -1145 418 955 -885 -516 1169
3833 1169 -30 -1122 582 823 -971 -312 1117 -255 -976 773 583 -1084 -44 1102 -515 -858
3849 -858 962 424 -1173 144 1091 -679 -742 1035 222 -1116 358 933 -811 -508 1084 -55 -1062
3866 -1062 581 781 -987 -292 1161 -267 -1015 778 668 -1068 -114 1132 -439 -872 859 416 -1075
3883 -1075 136 1010 -648 -676 1026 185 -1130 378 961 -835 -555 1104 0 -1079 502 820 -926
3900 -926 -343 1074 -223 -955 711 605 -1036 -80 1093 -455 -892 896 447 -1108 93 1076 -599
3917 -599 -745 960 270 -1078 279 921 -755 -538 1014 -5 -1057 524 783 -949 -358 1098 -196
3934 -196 -1013 672 669 -1004 -156 1053 -358 -868 794 435 -1010 75 981 -586 -702 972 252 -1073
3952 -1073 279 953 -733 -595 1029 79 -1048 429 796 -824 -380 1019 -139 -944 633 640 -963
3969 -963 -158 1065 -359 -882 804 497 -1027 11 1012 -502 -758 859 315 -1002 199 895 -664
3986 -664 -545 964 76 -1004 436 802 -830 -397 1033 -81 -979 569 695 -876 -252 984 -258
4003 -258 -853 691 474 -932 -15 957 -483 -714 849 303 -1009 186 919 -620 -611 893 167 -958
4021 -958 334 795 -732 -395 939 -79 -892 540 630 -859 -198 964 -262 -833 684 526 -912
4038 -912 -74 947 -383 -729 735 336 -916 134 832 -565 -548 837 120 -935 337 777 -723
4055 -723 -435 914 -14 -906 452 661 -766 -265 878 -201 -785 598 477 -842 -37 865 -409
4072 -409 -695 761 339 -907 134 863 -514 -600 812 192 -878 275 729 -629 -395 846 -43
4089 -43 -831 465 584 -765 -223 887 -213 -803 569 519 -839 -109 866 -320 -680 657 331 -827
4107 -827 94 792 -489 -525 780 156 -857 258 762 -632 -444 855 45 -829 393 657 -695 -273
4125 -273 819 -149 -724 520 476 -775 -74 809 -333 -682 655 349 -852 36 805 -455 -579 736
4143 736 196 -803 201 680 -557 -405 770 1 -782 373 607 -687 -275 822 -120 -776 498 529
4161 529 -733 -135 805 -236 -648 557 348 -740 31 728 -420 -535 693 192 -812 189 722
4178 722 -540 -456 740 74 -765 285 585 -574 -295 728 -74 -696 449 479 -687 -117 768 -253
4196 -253 -658 574 373 -733 -11 742 -340 -543 600 249 -724 128 646 -465 -405 684 61 -746
4214 -746 301 577 -602 -300 721 -56 -711 391 507 -621 -187 692 -172 -613 484 370 -668 -9
4232 -9 682 -342 -515 609 231 -702 114 655 -428 -437 647 145 -679 206 584 -499 -305 650 -56 -642
4252 -642 369 442 -607 -146 698 -187 -609 473 400 -668 -80 679 -255 -549 538 260 -635 88 603
4271 603 -396 -404 611 106 -664 243 589 -495 -321 682 28 -669 325 521 -552 -229 653 -121 -570
4290 -570 425 351 -589 -39 635 -293 -513 543 248 -675 55 634 -386 -447 587 130 -650 176 544 -447
4310 -447 -300 615 -7 -605 322 450 -561 -193 667 -115 -605 435 404 -610 -102 647 -224 -509 482
4329 482 271 -610 49 580 -366 -398 552 134 -651 195 554 -476 -358 623 26 -637 268 463 -499 -219
4349 -219 607 -93 -553 386 364 -572 -64 615 -249 -496 514 281 -627 48 605 -326 -441 538 165 -603
4369 -603 146 523 -413 -310 577 7 -590 297 452 -519 -208 632 -113 -581 373 387 -550 -125 586 -162
4389 -162 -493 428 266 -565 19 549 -325 -397 540 135 -611 145 543 -381 -349 563 67 -594 220 455 -434
4410 -434 -228 560 -66 -513 348 350 -522 -81 574 -219 -484 444 267 -597 9 556 -274 -419 474 167 -560
4431 -560 111 480 -365 -291 515 25 -542 247 430 -454 -206 579 -47 -541 317 377 -475 -142 556 -137 -465
4452 -465 373 265 -520 14 514 -274 -383 477 158 -582 105 510 -360 -349 502 90 -543 190 423 -403
4472 -403 -200 512 -58 -491 318 339 -474 -82 543 -164 -469 412 281 -524 -6 523 -227 -393 427 158
4492 158 -505 100 461 -332 -281 489 36 -518 214 411 -436 -221 537 -33 -520 272 363 -458 -137 498 -131
4513 -131 -423 343 253 -479 19 497 -261 -375 463 160 -528 103 492 -316 -289 481 86 -486 179 401 -379
4534 -379 -177 488 -57 -452 298 307 -458 -94 513 -163 -429 352 260 -483 -22 488 -213 -363 387 142 -458
4555 -458 104 425 -314 -246 459 41 -483 194 395 -377 -203 491 -10 -455 253 347 -390 -101 470 -113 -364
4576 -364 326 213 -450 9 439 -235 -331 408 147 -466 96 436 -288 -281 418 55 -426 166 337 -338 -162
4597 -162 438 -59 -401 274 267 -408 -79 466 -140 -404 338 246 -411 -16 430 -184 -300 346 125 -414 96
4618 96 375 -273 -230 425 28 -434 176 359 -350 -190 413 -40 -407 205 260 -362 -93 394 -115 -318 315
4639 315 185 -386 41 424 -228 -291 370 133 -434 100 382 -252 -224 373 51 -371 156 305 -301 -127 387
4660 387 -57 -379 252 265 -379 -69 398 -117 -356 292 204 -367 -28 384 -150 -289 327 111 -383 77 360
4681 360 -263 -213 380 38 -395 187 342 -302 -168 393 8 -353 210 275 -312 -69 388 -116 -311 288 178
4702 178 -380 23 387 -200 -295 331 134 -399 46 338 -238 -221 326 35 -375 144 289 -305 -143 372 -58
4723 -58 -339 227 254 -343 -94 379 -91 -340 250 216 -343 -37 361 -145 -260 288 101 -341 67 339 -247
4744 -247 -225 344 58 -372 134 322 -266 -178 345 -17 -349 187 232 -303 -67 340 -108 -286 264 173 -353
4765 -353 7 356 -163 -282 311 151 -356 56 323 -203 -194 310 47 -337 126 264 -245 -134 350 -19 -336
4786 -336 196 253 -320 -112 364 -70 -306 221 190 -296 -17 319 -123 -239 249 110 -315 64 302 -215 -213
4807 -213 323 69 -345 104 290 -237 -140 313 -9 -291 178 195 -268 -57 301 -88 -268 243 158 -297 1
4828 1 333 -144 -271 282 124 -321 28 292 -179 -183 269 46 -303 106 262 -249 -142 314 -25 -320 172
4849 172 236 -277 -104 325 -47 -284 206 173 -274 -29 303 -112 -216 257 108 -302 68 297 -186 -205 287
4870 287 63 -317 94 270 -227 -140 292 -13 -273 143 192 -273 -62 308 -89 -263 239 163 -289 -10 317
4891 317 -135 -231 252 125 -274 20 275 -160 -170 269 66 -275 90 243 -222 -135 293 -15 -288 141 237
4912 237 -251 -105 299 -47 -270 162 161 -269 -32 269 -128 -212 224 79 -307 43 280 -179 -182 261 59 -291
4934 -291 96 247 -197 -145 270 -3 -249 141 188 -234 -38 282 -89 -247 193 164 -284 -31 286 -116 -224
4955 -224 217 126 -274 16 262 -163 -178 232 40 -268 94 213 -193 -129 287 -2 -287 121 200 -227 -98
4976 -98 257 -42 -224 173 144 -225 1 245 -124 -206 227 84 -265 49 246 -182 -175 260 36 -266 88 205
4998 205 -191 -112 241 -33 -223 142 141 -246 -32 250 -84 -228 200 135 -252 -10 272 -106 -185 199 87 -229
5020 -229 50 223 -145 -125 225 19 -239 95 196 -190 -107 257 -22 -242 131 168 -212 -61 241 -67 -189
5041 -189 169 105 -218 25 216 -134 -147 214 56 -246 84 229 -168 -120 234 14 -211 108 173 -166 -73 223
5063 223 -39 -204 154 127 -213 -16 233 -85 -194 178 114 -229 -13 208 -103 -153 186 49 -205 45 185
5084 185 -142 -107 204 -3 -211 102 166 -200 -76 230 -31 -193 124 132 -181 -10 220 -78 -158 180 78 -193
5106 -193 43 200 -147 -126 198 28 -219 82 193 -161 -112 198 -10 -210 82 139 -173 -69 188 -56 -189
5127 -189 143 114 -201 -14 224 -69 -168 171 105 -182 5 183 -109 -147 163 59 -190 42 170 -142 -95 186
5149 186 -15 -201 107 136 -185 -70 191 -41 -183 120 92 -180 -20 147 -99 -131 137 51 -197 35 166
5170 166 -144 -112 179 22 -209 55 163 -131 -87 183 -3 -162 87 113 -160 -55 179 -60 -145 119 85 -182
5192 -182 -12 198 -79 -165 131 75 -186 -8 156 -105 -114 147 19 -178 53 140 -139 -73 178 -36 -170 92
5214 92 116 -154 -39 164 -40 -158 123 93 -154 9 160 -81 -106 161 19 -163 50 143 -114 -104 151 20
5236 20 -164 48 139 -133 -94 150 1 -150 67 103 -142 -51 142 -56 -146 116 91 -157 -20 161 -62 -125 133
5259 133 61 -141 25 143 -92 -87 130 9 -126 68 118 -120 -45 164 -19 -139 95 118 -142 -37 148 -50
5281 -50 -119 89 52 -137 16 128 -78 -106 112 30 -155 19 125 -86 -86 131 19 -153 27 116 -92 -53 103
5304 103 8 -108 51 84 -96 -35 123 -20 -114 94 72 -125 -32 125 -50 -104 91 57 -120 3 94 -68 -65 89
5328 89 -7 -109 40 83 -119 -43 123 -28 -112 58 64 -110 -37 106 -37 -96 78 41 -109 8 115 -48 -78 95
5352 95 32 -118 16 101 -68 -71 93 23 -113 10 65 -58 -65 82 0 -93 32 62 -99 -34 93 -36 -107 69 49
5377 49 -101 -9 87 -45 -92 89 22 -90 8 79 -67 -34 94 -21 -90 45 70 -95 -17 106 -26 -115 49 58 -100
5402 -100 -32 85 -31 -83 60 22 -101 -7 82 -74 -66 81 25 -108 8 78 -66 -65 71 24 -94 20 65 -70
5426 -70 -38 85 -23 -72 50 35 -80 3 97 -44 -90 66 39 -91 -9 86 -44 -72 62 16 -77 32 61 -78 -35
5451 -35 74 -34 -95 54 50 -91 -41 86 -11 -91 57 47 -91 -2 80 -41 -47 59 23 -78 22 69 -64 -46 81
5476 81 9 -81 18 86 -60 -47 64 10 -72 42 52 -71 -19 67 -41 -65 51 28 -102 2 62 -69 -56 75 8
5501 8 -98 28 47 -71 -25 78 -24 -58 59 48 -95 -9 98 -45 -67 77 34 -79 7 80 -43 -45 60 23 -73
5526 -73 23 43 -41 -43 57 -29 -80 31 50 -76 -41 92 -18 -76 47 43 -75 -18 66 -35 -55 61 28 -82 6 66
5552 66 -53 -47 88 5 -89 44 69 -71 -38 86 6 -91 47 54 -101 -8 89 -49 -76 81 25 -117 7 85 -68
5577 -68 -64 99 22 -110 13 92 -55 -38 94 11 -78 43 59 -80 -8 99 -21 -77 72 48 -88 -6 104 -49
5601 -49 -90 79 27 -98 17 83 -68 -68 97 -6 -99 54 97 -109 -55 116 -24 -117 72 76 -131 -23 116 -27
5625 -27 -106 89 51 -130 -9 130 -60 -80 102 19 -117 23 126 -68 -69 112 24 -117 50 96 -87 -57 116
5648 116 -7 -95 51 60 -111 -11 111 -47 -108 82 55 -137 5 107 -66 -84 111 24 -125 44 97 -100 -61
5671 -61 145 2 -145 75 114 -124 -26 167 -16 -140 104 95 -120 -3 142 -64 -105 119 49 -120 30 122 -80
5694 -80 -81 116 17 -151 50 121 -109 -74 130 -15 -140 71 82 -116 -35 134 -17 -104 110 58 -130 -6 149
5717 149 -61 -106 124 58 -152 15 144 -81 -95 148 21 -155 59 117 -132 -60 159 -20 -154 103 113 -157
5739 -157 -41 150 -64 -144 110 73 -163 4 142 -96 -98 134 48 -155 39 138 -105 -84 159 18 -151 65
5761 65 113 -118 -61 155 -23 -148 84 107 -144 -31 162 -52 -129 134 81 -174 -2 153 -101 -127 152 53 -173
5784 -173 30 144 -115 -101 168 22 -191 74 140 -130 -58 182 -30 -175 110 112 -178 -27 190 -60 -147 124
5806 124 86 -167 1 178 -84 -113 161 33 -169 45 151 -103 -108 164 17 -186 67 137 -143 -72 163 -29
5828 -29 -169 104 114 -167 -41 182 -77 -164 136 92 -197 21 210 -106 -140 169 62 -209 48 193 -134 -112
5850 -112 196 13 -193 83 153 -169 -81 201 -39 -196 106 127 -189 -46 197 -65 -172 147 93 -187 -10
5871 -10 177 -89 -126 167 34 -190 57 175 -139 -103 204 22 -209 86 154 -163 -80 218 -30 -184 128 126
5893 126 -192 -30 219 -84 -191 165 81 -223 0 211 -126 -171 182 48 -220 39 185 -147 -126 216 11
5914 11 -221 100 186 -184 -67 232 -35 -207 128 147 -198 -36 218 -65 -182 147 102 -226 -5 212 -109
5935 -109 -163 186 66 -225 44 202 -161 -142 214 27 -227 73 176 -184 -98 220 -25 -228 126 154 -223
5956 -223 -40 223 -81 -204 158 132 -235 -13 241 -103 -182 199 94 -252 61 224 -144 -146 231 23 -237
5977 -237 77 179 -178 -108 224 -13 -241 116 165 -212 -65 234 -70 -216 142 123 -236 -24 231 -99 -183
5998 -183 195 103 -249 39 241 -139 -157 238 68 -251 70 212 -191 -132 249 -4 -250 137 182 -226 -79
6019 -79 259 -61 -237 180 149 -272 -39 266 -98 -225 190 95 -268 28 254 -159 -171 231 55 -278 63
6040 63 225 -197 -132 264 17 -263 114 207 -217 -89 264 -24 -230 160 167 -258 -40 263 -113 -227 220 123
6062 123 -277 3 288 -141 -202 244 78 -284 56 261 -184 -161 268 23 -285 125 236 -224 -111 305 -35
6083 -35 -275 185 193 -261 -53 302 -90 -243 218 162 -263 -5 293 -140 -206 237 82 -300 49 267 -205 -186
6105 -186 276 44 -302 101 253 -234 -129 301 -19 -282 160 199 -261 -73 316 -79 -265 219 158 -307 -14
6126 -14 319 -144 -239 267 115 -303 35 299 -179 -196 290 59 -334 98 278 -245 -148 318 -19 -316 159
6147 159 237 -293 -109 313 -57 -305 198 170 -306 -39 321 -145 -253 271 132 -325 21 315 -173 -227 301
6168 301 71 -339 97 290 -230 -183 309 37 -327 156 253 -281 -111 338 -58 -318 208 208 -329 -55 342
6189 342 -118 -285 242 160 -346 -4 330 -176 -249 299 95 -339 88 310 -221 -187 334 24 -341 150 270
6210 270 -261 -134 356 -48 -320 200 238 -299 -60 342 -92 -289 259 170 -349 -10 346 -163 -271 286 109
6231 109 -355 61 329 -235 -223 327 47 -352 142 288 -281 -139 366 -16 -336 209 248 -336 -80 370 -93
6252 -93 -319 258 195 -348 -16 352 -161 -273 306 127 -355 49 324 -227 -227 335 35 -368 117 286 -279
6273 -279 -162 346 -17 -355 172 246 -323 -102 361 -88 -313 263 200 -351 -29 378 -146 -284 291 136 -363
6294 -363 62 359 -215 -220 354 83 -380 127 303 -274 -175 366 -7 -373 186 264 -337 -113 361 -99 -338
6315 -338 239 197 -361 -37 357 -148 -302 297 151 -369 33 361 -215 -242 340 88 -374 118 321 -269 -188
6336 -188 371 -1 -350 204 279 -321 -96 384 -79 -353 240 216 -369 -36 382 -157 -308 286 138 -382 21
6357 21 349 -204 -255 337 73 -387 95 328 -270 -195 360 22 -383 184 286 -315 -122 380 -65 -343 229
6378 229 236 -351 -51 386 -130 -317 294 169 -395 15 361 -198 -288 325 92 -378 84 326 -260 -229 352
6399 352 17 -376 156 295 -308 -149 381 -43 -370 220 253 -361 -67 370 -126 -315 283 194 -364 17 373
6420 373 -177 -287 322 109 -400 98 346 -265 -232 345 37 -378 164 315 -316 -152 380 -46 -372 219
6440 219 249 -355 -83 377 -115 -326 285 197 -387 -8 366 -167 -279 329 139 -389 70 366 -241 -241 373
6461 373 56 -380 151 329 -302 -167 383 -27 -366 198 283 -340 -93 394 -114 -343 272 198 -380 -41 379
6482 379 -174 -304 316 130 -388 53 362 -231 -255 362 80 -381 124 326 -284 -188 381 -9 -365 207 285
6503 285 -319 -112 401 -58 -344 260 225 -371 -34 390 -148 -327 311 147 -414 35 365 -214 -271 349 91
6524 91 -405 102 337 -280 -200 366 19 -387 183 295 -324 -118 399 -49 -361 248 267 -363 -66 389 -135
6545 -135 -328 297 179 -384 38 391 -212 -287 345 113 -401 96 364 -276 -205 362 33 -386 160 298 -325
6566 -325 -167 378 -54 -359 234 257 -358 -78 406 -117 -335 290 201 -372 3 389 -182 -295 337 130 -400
6587 -400 59 358 -252 -231 375 36 -393 153 305 -335 -187 387 -53 -400 201 286 -350 -101 396 -113 -360
6608 -360 261 206 -389 -44 398 -187 -317 337 141 -393 57 378 -230 -262 374 85 -401 126 332 -281 -194
6629 -194 390 -8 -389 212 280 -360 -115 399 -98 -369 261 231 -397 -38 388 -167 -337 326 151 -409 34
6650 34 381 -220 -288 360 71 -415 127 343 -295 -207 402 15 -403 196 302 -342 -127 416 -61 -394 268
6671 268 256 -370 -59 417 -149 -353 337 173 -424 10 400 -237 -287 367 94 -421 93 373 -289 -226 395
6692 395 17 -400 190 326 -338 -154 421 -61 -400 250 267 -368 -70 417 -117 -358 302 201 -406 4
6712 4 409 -218 -318 351 111 -431 74 372 -282 -248 388 51 -437 169 347 -344 -177 413 -48 -396 245
6733 245 277 -392 -92 417 -139 -365 296 225 -397 -24 423 -216 -324 349 144 -417 60 389 -262 -254 388
6754 388 67 -419 154 348 -333 -174 412 -28 -416 217 288 -384 -126 415 -92 -379 281 243 -402 -29 407
6775 407 -182 -332 333 164 -424 49 415 -233 -272 385 86 -416 148 357 -320 -197 408 -7 -405 223
6795 223 311 -364 -119 410 -93 -372 277 237 -409 -47 414 -164 -333 335 164 -434 19 393 -224 -282 372
6816 372 92 -414 117 368 -306 -222 409 9 -408 214 314 -345 -134 431 -64 -385 262 254 -381 -53 417
6837 417 -153 -344 336 189 -416 32 396 -234 -303 375 106 -443 98 377 -313 -232 398 20 -416 176 312
6858 312 -357 -143 436 -76 -391 258 253 -383 -58 425 -130 -348 309 195 -414 13 407 -216 -284 365 118
6879 118 -417 94 362 -291 -228 395 34 -423 184 327 -362 -157 413 -56 -394 255 256 -391 -73 419 -128
6900 -128 -348 313 206 -424 9 408 -207 -311 367 137 -409 89 392 -269 -245 399 49 -412 166 342
6920 342 -335 -165 415 -35 -410 239 292 -371 -96 418 -120 -372 287 194 -416 -21 409 -208 -308 341 130
6941 130 -417 73 381 -259 -255 394 82 -410 139 366 -315 -179 424 -15 -380 228 283 -371 -107 419 -102
6962 -102 -354 287 206 -402 -35 403 -192 -330 343 147 -437 54 389 -258 -269 380 67 -414 139 340 -300
6983 -300 -179 393 -7 -403 214 305 -360 -106 428 -83 -347 275 250 -386 -23 421 -166 -311 331 145 -408
7004 -408 54 378 -260 -262 370 67 -423 128 357 -312 -207 387 -3 -399 199 299 -364 -119 405 -77 -381
7025 -381 285 242 -397 -23 423 -157 -342 325 184 -404 36 388 -213 -270 367 103 -408 111 357 -289 -208
7046 -208 399 18 -417 180 298 -345 -153 412 -62 -382 254 246 -368 -77 410 -133 -339 322 194 -409 16
7067 16 394 -215 -291 364 115 -408 120 366 -269 -214 400 35 -396 167 319 -318 -130 418 -45 -398 242
7088 242 276 -370 -93 421 -125 -359 287 192 -409 -15 384 -187 -319 349 123 -405 78 365 -270 -242 377
7109 377 48 -400 159 338 -315 -179 403 -37 -385 227 271 -373 -98 431 -124 -351 300 207 -412 -7 410
7130 410 -197 -326 340 144 -427 62 370 -269 -257 386 59 -420 149 325 -323 -164 413 -29 -397 226
7150 226 298 -363 -98 425 -87 -363 282 233 -397 -18 402 -181 -315 330 141 -413 45 372 -241 -264 382
7171 382 41 -435 120 347 -314 -209 400 -15 -406 215 301 -366 -115 420 -96 -362 294 221 -393 -13 414
7192 414 -175 -308 346 162 -425 55 382 -235 -262 391 82 -420 139 344 -320 -208 413 -13 -396 212
7212 212 306 -359 -135 394 -78 -365 260 242 -405 -52 413 -178 -336 326 141 -413 39 400 -234 -279 387
7233 387 91 -423 129 351 -320 -181 396 2 -404 203 304 -358 -128 419 -76 -379 292 238 -397 -60
7253 -60 410 -175 -342 327 175 -404 44 391 -234 -288 369 89 -415 121 374 -297 -209 397 7 -411 190
7274 190 330 -342 -157 422 -54 -384 278 249 -373 -56 423 -146 -339 325 182 -422 18 407 -226 -306 361
7295 361 126 -456 102 381 -301 -226 395 31 -425 194 309 -352 -157 428 -66 -393 266 276 -387 -65 427
7316 427 -144 -369 318 203 -408 17 396 -201 -279 355 107 -411 80 381 -275 -240 404 37 -428 157 310
7337 310 -358 -170 414 -39 -393 244 265 -394 -78 427 -135 -361 315 195 -421 -2 405 -234 -300 370 121
7358 121 -433 104 379 -273 -237 401 45 -417 187 334 -333 -149 413 -37 -390 252 279 -395 -99 411 -116
7379 -116 -354 295 208 -399 0 409 -209 -300 358 124 -423 83 383 -258 -242 390 76 -403 159 340 -296
7400 -296 -173 428 -19 -388 224 299 -345 -85 428 -106 -367 298 223 -404 -16 407 -201 -328 351 138 -413
7421 -413 64 382 -256 -258 365 58 -401 152 348 -318 -187 427 -29 -397 222 291 -352 -116 428 -103 -359
7442 -359 284 229 -374 -37 413 -166 -295 347 163 -408 57 387 -243 -246 387 76 -395 132 350 -304 -207
7463 -207 411 -19 -376 213 286 -354 -114 407 -95 -373 270 222 -376 -23 409 -163 -299 335 147 -403 55
7484 55 387 -227 -251 377 80 -402 131 342 -286 -190 401 5 -381 204 290 -355 -124 390 -82 -370 255
7505 255 230 -372 -38 405 -168 -325 302 159 -396 36 395 -219 -252 356 103 -400 128 360 -281 -194 390
7526 390 8 -394 193 301 -326 -108 405 -67 -357 264 241 -369 -44 399 -160 -324 306 171 -389 32
7546 32 369 -222 -267 360 90 -394 95 350 -277 -207 377 25 -376 179 316 -321 -130 399 -48 -359 242
7567 242 249 -361 -65 398 -145 -300 302 190 -387 26 386 -210 -282 346 106 -403 80 340 -277 -207 362
7588 362 18 -393 170 306 -331 -152 399 -36 -360 234 266 -350 -66 401 -101 -324 289 199 -369 10 377
7609 377 -183 -273 350 110 -380 82 361 -248 -231 368 43 -405 157 312 -317 -183 368 -44 -370 221 261
7630 261 -349 -67 400 -106 -317 288 199 -375 5 383 -193 -297 340 135 -392 79 366 -231 -215 372 58
7651 58 -380 149 317 -295 -145 388 -26 -380 205 285 -325 -79 402 -102 -338 260 220 -370 -14 377 -166
7672 -166 -295 310 152 -386 62 364 -233 -231 364 78 -382 127 340 -277 -165 390 13 -357 216 290 -336
7693 -336 -89 396 -83 -359 267 219 -386 -35 406 -149 -303 309 163 -387 36 370 -225 -247 338 91 -397
7714 -397 108 324 -279 -189 375 15 -379 191 290 -323 -122 405 -70 -342 249 242 -357 -42 402 -138 -303
7735 -303 318 169 -386 41 370 -213 -256 347 102 -393 102 348 -268 -206 373 -6 -388 172 288 -319 -136
7756 -136 387 -71 -363 246 232 -359 -61 393 -118 -320 305 182 -359 13 377 -197 -266 341 106 -386 90
7777 90 345 -260 -207 361 26 -369 168 311 -319 -159 393 -36 -359 207 243 -351 -86 391 -124 -339 279
7798 279 166 -386 10 376 -188 -278 323 126 -381 62 343 -248 -216 369 59 -363 164 299 -303 -145 390
7819 390 -55 -371 212 267 -340 -99 389 -103 -333 284 194 -373 -13 357 -169 -288 301 121 -394 62 364
7840 364 -234 -233 355 62 -395 133 332 -289 -164 368 -17 -361 208 271 -323 -98 373 -84 -341 280 193
7861 193 -358 -9 394 -181 -282 323 124 -369 37 339 -228 -235 347 62 -388 106 294 -286 -182 367 -22
7882 -22 -378 185 270 -316 -120 380 -73 -324 261 212 -335 -27 383 -140 -293 306 152 -366 45 349 -207
7903 -207 -228 351 74 -379 113 332 -269 -192 356 5 -362 169 266 -304 -110 366 -67 -346 239 221 -354
7924 -354 -46 379 -135 -300 283 161 -381 20 345 -184 -250 330 82 -353 97 323 -259 -200 364 22 -359
7945 -359 149 264 -310 -123 357 -48 -338 215 220 -332 -59 357 -137 -312 252 153 -372 3 331 -189 -263
7966 -263 305 119 -365 73 312 -234 -197 335 31 -342 148 277 -268 -112 358 -30 -332 208 240 -338 -87
7987 -87 356 -113 -306 248 163 -350 -17 344 -166 -258 298 105 -357 47 324 -215 -195 326 48 -360 126
8008 126 293 -256 -168 326 -22 -342 177 234 -294 -88 354 -78 -291 235 188 -320 -10 345 -139 -275 276
8029 276 108 -352 42 305 -188 -231 305 48 -336 110 273 -267 -172 335 -20 -329 173 235 -298 -100 342
8050 342 -57 -312 225 191 -308 -32 352 -114 -233 256 140 -329 36 327 -184 -211 299 85 -331 97 292
8071 292 -234 -179 322 16 -325 155 237 -260 -127 319 -54 -311 207 195 -336 -62 329 -116 -279 242 152
8092 152 -314 12 330 -159 -224 286 96 -318 97 299 -216 -175 297 28 -329 143 263 -262 -127 326 -25
8113 -25 -313 184 201 -293 -70 330 -97 -265 232 157 -305 -12 300 -162 -236 267 101 -314 61 290 -208
8134 -208 -191 287 44 -304 141 263 -233 -107 308 -12 -281 191 219 -284 -71 312 -78 -272 225 178 -317
8155 -317 -7 310 -160 -225 251 101 -322 38 283 -211 -209 282 42 -324 111 263 -243 -136 304 -20 -281
8176 -281 160 219 -267 -64 304 -68 -271 226 170 -284 -11 317 -126 -231 252
8191B52
$$ Imaginary data points
##PAGE= N=2
##DATA TABLE= (X++(I..I)), XYDATA
0 0 0 0 0 0 0 0 0 0 0 0 -1 8 -8 10 -16 16 -24 32 -32 40 -48 58 -72 82 -97 113 -134 154 -177 202 -234 267 -304
33 -304 343 -385 434 -490 549 -613 685 -764 850 -941 1043 -1152 1274 -1408 1551 -1708 1883
50 1883 -2076 2285 -2519 2779 -3070 3397 -3768 4191 -4683 5263 -5957 6798 -7849 9212
64 9212 -11042 13650 -17678 24745 -40664 148404 -180292 -317838 389182 87956 -402626
75 -402626 94772 363947 -287171 -204158 375859 21799 -390115 180310 290805 -318957
85 -318957 -134763 387712 -62128 -349705 229799 234949 -343740 -60100 364244 -117985
95 -117985 -300558 265726 161874 -340343 9224 332401 -176666 -239887 295059 91413
105 91413 -339797 78920 298342 -225343 -185263 314276 28688 -323749 130193 254663
115 254663 -253715 -124962 311547 -32116 -291468 177922 198979 -276499 -58713 304238
125 304238 -93694 -255833 219705 145587 -288888 -2601 286112 -136821 -214197 239097
135 239097 92837 -280057 47528 251399 -171980 -161385 250449 33719 -264633 99090
145 99090 212866 -204184 -110143 256665 -16958 -245688 136666 175594 -220519 -64962
155 -64962 248778 -58803 -215664 165221 130010 -228355 -13701 233329 -103855 -179947
165 -179947 193811 82947 -234612 33250 217649 -139766 -147935 210981 43381 -229777
175 -229777 70073 191981 -164209 -107490 215574 -2169 -212095 108923 155459 -186533
185 -186533 -61183 216308 -46703 -192261 141241 121513 -199539 -22392 207904 -79954
195 -79954 -165049 160066 82670 -198162 17906 185904 -111092 -127498 174213 38776 -192667
206 -192667 57823 163231 -138690 -94298 184550 3233 -184901 87290 140149 -155075
216 -155075 -61931 183458 -30142 -165959 112934 107432 -166288 -22863 177481 -66677
226 -66677 -144257 139220 75298 -176942 12215 170866 -96165 -122613 155633 44790 -175711
237 -175711 42763 151869 -117875 -90774 162005 8204 -164877 74924 126449 -138264
247 -138264 -57137 166488 -25525 -153340 100764 102837 -150014 -28252 161645 -51344
257 -51344 -133493 116281 73541 -150829 3047 147413 -77178 -107400 131010 41230 -151703
268 -151703 34693 134566 -101504 -84388 142751 13864 -148609 59101 117860 -116480
278 -116480 -58729 144114 -14005 -135592 82227 93274 -129241 -27801 143620 -44469
288 -44469 -121889 105588 69856 -140171 -683 139981 -67804 -105409 118632 45696 -139266
299 -139266 23917 125202 -86077 -80370 125557 16303 -132996 50800 106977 -104352
309 -104352 -54771 131204 -10223 -125482 71496 89287 -114102 -32348 128016 -30947
319 -30947 -110420 85112 66245 -116983 -6554 119288 -53771 -91698 100119 41485 -121169
330 -121169 18827 112163 -74198 -75582 111001 20776 -120313 38444 99931 -87479 -55181
341 -55181 114035 -2921 -111697 59596 81054 -100842 -30066 116348 -28289 -102623 79381
352 79381 63508 -110435 -9126 114085 -46624 -89792 89956 44077 -110134 11406 102616
363 102616 -62739 -69746 97256 20055 -106920 33794 89782 -78591 -50704 103418 -306
374 -306 -102655 50378 76946 -87236 -33131 102024 -17794 -91441 63238 58425 -92102
385 -92102 -11251 97598 -38352 -78437 78225 39617 -98575 9165 94444 -55669 -67055
396 -67055 88285 23300 -98922 25663 85001 -67720 -50167 92274 3047 -93432 44467
407 44467 70843 -80530 -30416 96187 -17507 -87732 60873 57709 -88740 -13940 94611
418 94611 -32348 -77245 69750 41432 -89071 3838 85820 -47182 -61069 77879 21307
429 21307 -88597 23300 76970 -61686 -46524 84412 4998 -86366 37090 67293 -69525
440 -69525 -32165 84401 -10379 -78101 49763 52233 -76176 -13250 83187 -29023 -69059
451 -69059 64101 37594 -83206 3365 81857 -43520 -60298 72869 24010 -83998 17955
462 17955 73973 -54943 -45454 77467 5670 -80052 35048 62278 -66575 -29078 81264
473 81264 -11097 -75879 48224 52052 -73182 -15890 79950 -23427 -66932 56074 37750
484 37750 -73880 102 72796 -37003 -53501 64011 21135 -74821 16180 67102 -49392
495 -49392 -43007 70402 8486 -74142 27812 59578 -56847 -30478 71233 -5757 -67546
506 -67546 40052 46884 -63964 -14451 71771 -21697 -61608 52770 35986 -70921 -1218
517 -1218 71566 -33868 -54482 60248 24096 -71243 11675 64252 -43827 -41381 64311 8454
529 8454 -68444 26180 55368 -54092 -28599 68436 -5071 -65834 37103 47248 -59446 -17607
541 -17607 66882 -15374 -57809 43640 34996 -60420 -4058 61985 -27433 -48070 51925 22175
553 22175 -63477 9287 59269 -38495 -40452 58069 11824 -63298 19239 52948 -45175 -29789
565 -29789 59566 -565 -58964 30656 43426 -53042 -16673 62137 -14542 -55459 42348 34868
577 34868 -59511 -5658 61980 -24517 -49187 48208 24697 -59601 5340 56007 -33532 -38479
589 -38479 52838 11382 -58674 18305 49599 -43219 -28317 57069 378 -56876 27031 43028
601 43028 -47357 -19278 55831 -8521 -50538 33696 32847 -50041 -7019 53628 -20435 -43513
613 -43513 42705 22398 -54257 4314 52376 -29924 -37710 48140 13946 -54577 13046 47504
625 47504 -36647 -28607 50858 2460 -52004 24276 39723 -44787 -17262 53925 -9513 -49563
637 -49563 33875 33135 -49812 -8809 53618 -17287 -44392 38730 24464 -50181 1161 48774
649 48774 -25981 -35070 43671 12721 -50119 12386 44061 -34139 -27447 47357 4410 -49123
661 -49123 19370 39079 -38103 -19710 47158 -4190 -44203 26628 30135 -41872 -8503 46374
673 46374 -15078 -39167 34921 22198 -46252 358 46307 -23030 -35029 40077 15007 -47111
685 -47111 8559 42096 -29689 -26501 42861 4316 -44941 18679 35627 -36871 -17452 45913
697 45913 -5085 -43644 26431 30724 -41146 -10356 45572 -12078 -38579 30837 22297 -41237
709 -41237 -1027 41035 -19859 -30703 35416 12912 -42110 7953 38444 -26897 -25373 39192
721 39192 6128 -41793 14274 34045 -30725 -18156 39106 -1847 -37592 20998 26723 -34740
733 -34740 -9074 39836 -11059 -34865 28806 20939 -39483 -1571 40307 -18151 -31102 33108
745 33108 14373 -39592 5481 36148 -23642 -23769 35596 5489 -38558 14168 31717 -30310
757 -30310 -16801 38844 -2236 -37658 20457 27362 -33244 -10806 37674 -7719 -32903 23802
769 23802 20300 -33614 -2952 34905 -14978 -27355 29001 12826 -35675 4857 33403 -21246
781 -21246 -22995 32223 7153 -35285 10083 29769 -24604 -17012 32912 77 -32769 16929
793 16929 24179 -29607 -9122 34752 -8368 -30979 23907 19488 -33518 -3221 34948 -13706
805 -13706 -27891 27110 14061 -33693 3045 31607 -19202 -21520 30217 5948 -33366 10964
817 10964 28041 -24996 -15851 32745 20 -32519 15569 24611 -27075 -10965 31842 -4975
829 -4975 -28602 19332 18284 -28426 -3516 30167 -11953 -24232 24312 12283 -30666 2659
841 2659 29534 -17050 -21322 27257 7887 -30836 7332 26698 -20632 -15893 28513 1099 -29017
854 -29017 13911 22054 -25406 -9388 30582 -5707 -28162 19614 18820 -28734 -4850 30821 -10155
867 -10155 -25286 22378 13647 -28718 1074 27701 -15247 -19753 25270 6937 -28936 7498
879 7498 25428 -20055 -15779 27664 2373 -28529 11365 22510 -22022 -11213 27014 -2509
891 -2509 -25159 15240 17070 -23925 -4731 26519 -8794 -22417 20235 12629 -26772 398 26724
904 26724 -13431 -20123 23084 8595 -26967 4904 24060 -17026 -15111 24677 2284 -25961
916 -25961 11149 20574 -21838 -9835 27109 -3444 -25655 15934 17895 -24438 -5893 26857
928 26857 -7277 -22650 18303 12973 -24466 -321 24348 -12182 -18073 21433 7292 -25289
940 -25289 5236 22859 -16418 -14903 23534 3482 -24880 8550 20245 -18198 -10778 23198
952 23198 -1106 -22265 12572 15712 -20747 -5095 23667 -6889 -20607 17329 12334 -23631
964 -23631 -941 24109 -10756 -18740 19745 8734 -23746 3290 21700 -14359 -14147 21654 2940
977 2940 -23359 9036 19098 -18794 -9974 23937 -1597 -23181 12762 16870 -20643 -6571 23372
990 23372 -4993 -20301 14994 12302 -20950 -1449 21530 -9591 -16726 18137 7759 -22185
1002 -22185 3099 20788 -13226 -14421 20048 4606 -21994 6145 18505 -15134 -10550 20199
1014 20199 81 -20078 10348 14819 -18174 -5680 21464 -5065 -19347 14778 12371 -20928
1026 -20928 -2236 21929 -8405 -17532 16839 8848 -20943 1855 19687 -11948 -13462 18944
1038 18944 3792 -21115 6927 17961 -15936 -10266 21021 134 -20937 9915 15843 -17256
1050 -17256 -7125 20248 -2988 -18226 12074 11783 -17969 -2508 19262 -7403 -15681 15448
1062 15448 8108 -19678 1476 19014 -10677 -13799 17171 5337 -19428 4284 16956 -12661
1074 -12661 -10247 17843 964 -18363 8703 14086 -16188 -6013 19605 -3706 -18056 12579
1086 12579 12057 -18374 -3159 19670 -6412 -16220 14283 8774 -18502 756 17905 -10068 -12697
1099 -12697 16664 4195 -18984 5312 16510 -13435 -10013 18200 1285 -18608 7628 14642
1111 14642 -14486 -7185 17697 -1820 -16373 10217 10903 -15793 -2651 17260 -6175 -14359 13452
1124 13452 7903 -17498 485 17316 -8820 -13037 15008 5517 -17528 3304 15522 -11220
1136 -11220 -9541 16123 1077 -16794 7655 13104 -14469 -6110 17780 -2508 -16762 10641
1148 10641 11664 -16239 -3695 17782 -5117 -14867 12420 8234 -16355 286 15992 -8534
1160 -8534 -11652 14500 4428 -16897 3849 15194 -11232 -9831 15921 2109 -16722 5982
1172 5982 13415 -12358 -6899 15435 -1084 -14555 8577 10052 -13827 -3049 15630 -4849 -13566
1185 -13566 11674 8014 -15793 -418 15973 -7369 -12223 13189 5454 -15608 2487 14040
1197 14040 -9674 -8939 14372 1584 -15406 6356 12528 -12794 -6352 16140 -1477 -15475 8973
1210 8973 10990 -14126 -3955 15625 -3794 -13323 10301 7806 -14145 -506 14366 -6919 -10998
1223 -10998 12545 4771 -15120 2624 13909 -9344 -9379 13687 2723 -14662 4360 12123 -10153
1236 -10153 -6759 13393 -188 -13213 7119 9662 -12263 -3464 14340 -3747 -12719 10090 7912
1249 7912 -13954 -1170 14404 -5766 -11374 11181 5593 -13805 1521 12886 -8241 -8653 12833
1262 12833 2063 -14099 5127 11731 -11016 -6401 14202 -406 -13898 7019 10348 -11779
1274 -11779 -4426 13603 -2416 -12038 8494 7503 -12301 -1087 12877 -5572 -10153 10756 4895
1287 4895 -13288 1482 12589 -7464 -8989 11602 3287 -12930 3089 11087 -8640 -6453 11908
1300 11908 174 -12026 6155 8970 -10920 -3569 12926 -2816 -11782 8535 7739 -12284 -1842
1313 -1842 13007 -4532 -10584 9697 5464 -12331 976 11705 -7114 -8010 11316 2266 -12618
1326 -12618 4027 10797 -9336 -6367 12412 475 -12524 5498 9623 -10002 -4434 11897 -1689
1339 -1689 -10750 7187 6847 -10726 -1323 11454 -4518 -9400 9224 5009 -11799 597 11542
1352 11542 -6103 -8505 10091 3405 -11535 2461 10026 -7538 -5949 10630 434 -10911 5250
1365 5250 8450 -9665 -3798 11804 -1897 -11058 7265 7549 -10876 -2222 11730 -3604 -9652
1378 -9652 8305 5204 -10814 414 10482 -5846 -7569 9787 2725 -11344 2831 10131 -7752
1391 -7752 -6443 10782 1251 -11134 4091 8839 -8199 -4484 10182 -764 -9583 5713 6632
1404 6632 -9176 -1988 10402 -3228 -9016 7761 5367 -10430 -384 10516 -4663 -8088 8448
1417 8448 3746 -10086 1400 9187 -6117 -5969 9275 1163 -10080 4061 8248 -8349 -4231
1430 -4231 10582 -873 -10194 5735 7341 -9143 -2811 10222 -2250 -8837 6609 5296 -9239
1443 -9239 -451 9502 -4498 -7304 8309 3252 -10039 1598 9336 -5984 -6427 8927 2139 -9685
1457 -9685 2531 8158 -6445 -4710 8724 105 -8704 4482 6431 -7901 -2452 9345 -2214
1470 -2214 -8430 6336 5439 -8965 -1148 9417 -3420 -7583 7069 3894 -8893 771 8390 -5170
1484 -5170 -5655 8222 1411 -9096 3269 7670 -7129 -4288 9297 -112 -9195 4489 6924 -7682
1498 -7682 -3033 8933 -1505 -7922 5496 4917 -8015 -727 8426 -3606 -6738 7027 3393 -8788
1512 -8788 782 8470 -4736 -6120 7564 2416 -8492 1799 7360 -5420 -4361 7627 367
1525 367 -7799 3757 5988 -6930 -2582 8427 -1545 -7842 5355 5320 -7902 -1517 8503 -2630
1539 -2630 -7022 6026 3792 -7833 351 7588 -4353 -5351 7249 1694 -8269 2442 7240 -6028
1553 -6028 -4420 8137 571 -8312 3349 6497 -6356 -3187 7729 -804 -7124 4465 4703 -6933
1567 -6933 -1131 7618 -2764 -6390 5970 3553 -7762 96 7678 -3721 -5817 6409 2589 -7482
1581 -7482 1202 6671 -4605 -4160 6766 567 -7142 3193 5645 -6178 -2680 7636 -1043 -7276
1595 -7276 4512 5101 -6926 -1719 7609 -2028 -6390 5199 3574 -6940 130 6848 -3749 -4958
1609 -4958 6398 1807 -7454 1838 6694 -5048 -4332 7056 972 -7352 2545 5918 -5331 -3071
1623 -3071 6697 -460 -6316 3765 4325 -6053 -1264 6802 -2160 -5907 5081 3544 -6834 -310
1637 -310 6937 -2991 -5359 5519 2521 -6584 915 5966 -3989 -3779 6018 659 -6466 2724 5260
1652 5260 -5481 -2691 6930 -605 -6699 3800 4829 -6040 -1824 6721 -1589 -5741 4430 3290
1666 3290 -6089 -102 6146 -3127 -4660 5579 1973 -6701 1228 6192 -4179 -4180 6088 1247 -6480
1681 -6480 1901 5317 -4426 -2930 5800 -126 -5671 3115 4111 -5321 -1461 6238 -1640 -5575 4395
1696 4395 3506 -6085 -599 6271 -2397 -4945 4722 2460 -5816 597 5419 -3454 -3604 5438 791
1711 791 -6035 2314 5041 -4914 -2722 6293 -265 -6115 3150 4487 -5174 -1873 5907 -1122 -5177
1726 -5177 3773 3152 -5435 -291 5679 -2670 -4426 4986 2042 -6051 843 5642 -3459 -3948 5205
1741 5205 1407 -5700 1381 4864 -3772 -2807 5194 44 -5250 2752 3862 -4847 -1466 5684 -1332
1756 -1332 -5143 3780 3387 -5347 -851 5625 -1853 -4593 4097 2396 -5243 440 5002 -3113 -3344
1771 -3344 4959 823 -5493 1929 4675 -4173 -2720 5501 181 -5518 2395 4243 -4381 -1948 5225
1786 5225 -802 -4692 3228 2911 -4783 -420 5038 -2136 -4081 4172 2141 -5255 269 5112 -2661
1801 -2661 -3806 4402 1586 -5047 987 4365 -3213 -2567 4517 145 -4612 2273 3546 -4135 -1582
1816 -1582 5062 -792 -4788 3069 3341 -4630 -1052 5014 -1443 -4106 3489 2162 -4540 262 4376
1831 4376 -2565 -3076 4235 1047 -4882 1335 4389 -3460 -2796 4764 516 -4877 1845 3796 -3625
1846 -3625 -1842 4398 -441 -4059 2549 2729 -4001 -728 4505 -1529 -3882 3498 2283 -4612 -102
1861 -102 4603 -2069 -3483 3638 1577 -4280 609 3832 -2587 -2442 3872 381 -4232 1819 3429
1876 3429 -3658 -1751 4583 -454 -4388 2524 3106 -3921 -1164 4309 -1010 -3672 2837 2126 -3954
1891 -3954 -31 4019 -2117 -3020 3777 1209 -4461 942 4038 -2855 -2665 4023 752 -4240 1282
1906 1282 3483 -2928 -1928 3832 -120 -3767 2134 2642 -3593 -821 4136 -1239 -3627 2971 2220
1921 2220 -4015 -368 4098 -1573 -3270 3077 1653 -3807 373 3541 -2284 -2294 3599 421 -3913
1936 -3913 1602 3240 -3235 -1732 4101 -183 -4003 2019 2969 -3367 -1270 3873 -730 -3396 2508
1951 2508 2005 -3577 -107 3674 -1832 -2834 3299 1274 -3976 578 3739 -2287 -2625 3467 963
1966 963 -3795 924 3198 -2502 -1811 3385 -32 -3362 1841 2462 -3167 -922 3719 -871 -3404 2471
1982 2471 2276 -3522 -607 3722 -1182 -3004 2642 1533 -3357 285 3168 -2008 -2116 3176 498
1997 498 -3543 1256 3034 -2754 -1790 3601 74 -3627 1613 2723 -2876 -1198 3362 -573 -2958
2012 -2958 2124 1803 -3071 -179 3268 -1472 -2630 2823 1332 -3499 294 3371 -1850 -2438 2933
2027 2933 951 -3260 720 2767 -2113 -1553 2908 -15 -2956 1586 2237 -2822 -906 3343 -676
2042 -676 -3086 2151 2069 -3062 -550 3209 -1025 -2560 2310 1278 -2907 316 2750 -1811 -1869 2867
2058 2867 459 -3199 1138 2745 -2436 -1600 3184 100 -3139 1381 2340 -2466 -1021 2893 -526
2073 -526 -2563 1897 1559 -2789 -158 2958 -1365 -2385 2566 1208 -3146 234 2977 -1601 -2146 2547
2089 2547 808 -2829 673 2404 -1940 -1323 2697 -88 -2726 1539 2050 -2621 -807 3080 -630
2104 -630 -2803 1926 1840 -2731 -476 2882 -964 -2259 2117 1084 -2696 380 2540 -1756 -1700 2705
2120 2705 393 -2998 1034 2542 -2237 -1503 2860 122 -2843 1234 2115 -2233 -888 2636 -537
2135 -537 -2343 1797 1420 -2624 -113 2787 -1250 -2246 2343 1186 -2875 168 2749 -1411 -1950 2313
2151 2313 715 -2596 694 2176 -1875 -1175 2550 -161 -2580 1477 1921 -2494 -774 2883 -572
2166 -572 -2599 1777 1666 -2520 -369 2587 -951 -2017 1998 915 -2504 437 2367 -1679 -1547 2560
2182 2560 363 -2770 956 2343 -2021 -1357 2582 111 -2527 1123 1851 -2029 -718 2386 -579
2197 -579 -2106 1759 1249 -2467 -46 2572 -1204 -2055 2149 1032 -2595 185 2426 -1332 -1668 2110
2213 2110 529 -2323 766 1918 -1808 -964 2410 -262 -2356 1454 1723 -2293 -657 2592 -555
2228 -555 -2270 1603 1433 -2240 -267 2289 -944 -1736 1884 700 -2311 517 2098 -1634 -1369 2340
2244 2340 287 -2501 843 2083 -1777 -1199 2296 51 -2223 1085 1561 -1883 -498 2163 -676
2259 -676 -1852 1684 1076 -2262 -2 2342 -1079 -1848 1933 933 -2324 199 2144 -1258 -1406 1945
2275 1945 339 -2091 812 1674 -1725 -794 2200 -278 -2161 1314 1574 -2081 -618 2356 -480 -2067
2291 -2067 1438 1252 -2012 -166 2036 -916 -1487 1744 586 -2113 478 1945 -1458 -1319 2128 361
2307 361 -2287 712 1925 -1575 -1065 2046 25 -1935 1010 1359 -1710 -427 1981 -607 -1750 1523
2323 1523 1073 -2100 -77 2184 -958 -1726 1743 849 -2081 196 1897 -1133 -1245 1747 267 -1896
2339 -1896 752 1552 -1612 -777 2073 -207 -2041 1184 1502 -1891 -572 2116 -415 -1800 1266 1094
2355 1094 -1774 -118 1798 -863 -1350 1609 538 -1988 451 1826 -1342 -1255 1944 340 -2056 642
2371 642 1671 -1378 -925 1787 -16 -1709 938 1200 -1593 -354 1862 -613 -1631 1477 955 -1941
2387 -1941 -27 1979 -880 -1505 1544 719 -1811 213 1648 -1032 -1043 1610 168 -1739 789 1395
2403 1395 -1570 -662 1922 -274 -1818 1128 1283 -1680 -494 1831 -391 -1547 1153 884 -1600 -1
2419 -1 1634 -899 -1173 1561 416 -1839 506 1634 -1258 -1032 1727 240 -1775 584 1433 -1249
2435 -1249 -741 1620 -115 -1519 978 990 -1573 -162 1713 -701 -1408 1409 769 -1755 32 1741
2451 1741 -824 -1319 1395 586 -1643 291 1438 -1084 -819 1533 -13 -1578 860 1204 -1465 -524
2467 -524 1758 -253 -1619 1025 1153 -1507 -376 1635 -433 -1331 1176 680 -1509 169 1444 -954
2483 -954 -984 1490 292 -1667 465 1480 -1183 -949 1605 180 -1639 618 1242 -1237 -545 1484
2499 1484 -283 -1315 1004 826 -1464 -81 1592 -686 -1298 1333 740 -1664 68 1607 -821 -1132
2515 -1132 1372 392 -1474 429 1206 -1077 -628 1459 -99 -1469 857 1132 -1421 -485 1668 -299
2531 -299 -1524 1004 977 -1436 -243 1482 -532 -1128 1127 523 -1406 221 1338 -943 -936 1454 255
2548 255 -1626 538 1389 -1165 -798 1522 60 -1470 662 1070 -1180 -417 1400 -346 -1231 1062
2564 1062 741 -1481 -23 1572 -737 -1235 1329 613 -1569 167 1421 -833 -965 1272 271 -1404
2580 -1404 489 1126 -1129 -563 1481 -184 -1447 922 1043 -1418 -364 1605 -363 -1370 1006 858
2596 858 -1361 -131 1407 -599 -1034 1182 418 -1437 363 1330 -1048 -835 1498 145 -1580 577
2612 577 1294 -1179 -725 1451 -33 -1386 738 959 -1252 -269 1420 -496 -1204 1176 638 -1534 85
2629 85 1535 -802 -1179 1322 533 -1535 225 1392 -895 -881 1341 154 -1414 618 1098 -1217 -497
2646 -497 1523 -249 -1444 947 1019 -1435 -341 1587 -397 -1344 1027 785 -1390 -52 1383 -706
2662 -706 -996 1258 344 -1483 405 1333 -1079 -867 1517 167 -1588 580 1298 -1146 -681 1448 -67
2679 -67 -1364 796 929 -1269 -219 1445 -515 -1231 1167 710 -1542 21 1540 -748 -1202 1297
2695 1297 551 -1515 192 1323 -883 -847 1305 140 -1412 616 1100 -1218 -531 1518 -195 -1468
2711 -1468 892 1061 -1384 -387 1543 -339 -1307 988 786 -1349 -45 1359 -686 -980 1247 391
2727 391 -1467 349 1364 -1020 -900 1451 213 -1540 499 1251 -1075 -679 1377 -65 -1326 745
2743 745 911 -1262 -248 1430 -480 -1245 1114 729 -1471 -31 1490 -677 -1157 1204 555 -1442
2759 -1442 184 1278 -848 -823 1272 148 -1373 588 1122 -1175 -544 1481 -156 -1442 843 1043
2775 1043 -1318 -423 1475 -317 -1256 945 723 -1307 1 1325 -704 -975 1240 368 -1474 345
2791 345 1358 -994 -901 1420 232 -1476 504 1197 -1073 -620 1367 -94 -1271 802 874 -1266 -210
2808 -210 1453 -494 -1229 1111 720 -1475 -21 1486 -680 -1133 1193 504 -1408 231 1237 -894
2824 -894 -788 1302 71 -1386 633 1115 -1216 -577 1514 -145 -1445 848 1037 -1298 -365 1437
2840 1437 -348 -1203 988 683 -1309 32 1330 -731 -995 1269 387 -1491 346 1362 -983 -885
2856 -885 1402 191 -1445 506 1140 -1066 -581 1326 -135 -1266 817 859 -1317 -219 1448 -504
2872 -504 -1242 1124 716 -1446 -9 1432 -654 -1071 1153 467 -1347 258 1208 -887 -732 1315 83
2889 83 -1388 658 1125 -1212 -544 1462 -164 -1389 789 954 -1248 -346 1355 -361 -1176 938 633
2906 633 -1314 45 1311 -737 -974 1266 367 -1460 330 1283 -925 -834 1317 214 -1375 460
2922 460 1099 -1017 -551 1302 -141 -1225 822 839 -1278 -196 1402 -469 -1194 1049 695 -1373 -72
2939 -72 1356 -592 -1045 1093 438 -1308 253 1164 -896 -703 1281 48 -1341 609 1067 -1142 -549
2956 -549 1382 -117 -1342 745 935 -1195 -325 1314 -384 -1091 967 573 -1268 89 1263 -720
2972 -720 -921 1212 376 -1397 291 1270 -897 -827 1276 189 -1328 491 1024 -1028 -481 1258 -193
2989 -193 -1197 814 795 -1252 -228 1391 -449 -1199 1023 714 -1325 -44 1319 -611 -955 1084
3005 1084 391 -1276 286 1122 -873 -677 1290 78 -1356 569 1096 -1116 -584 1378 -99 -1321
3021 -1321 713 906 -1164 -281 1275 -382 -1084 938 586 -1280 47 1287 -718 -990 1198 414
3037 414 -1408 247 1276 -863 -822 1226 201 -1278 475 1022 -987 -494 1262 -154 -1237 795
3053 795 872 -1258 -255 1410 -402 -1201 979 719 -1281 -79 1286 -558 -968 1042 423 -1268 233
3070 233 1147 -871 -737 1261 128 -1360 548 1112 -1063 -604 1338 -45 -1268 675 904 -1103
3086 -1103 -315 1267 -340 -1083 926 623 -1266 17 1318 -657 -992 1143 457 -1367 175 1235
3102 1235 -753 -839 1157 258 -1264 415 1032 -965 -547 1248 -135 -1250 760 894 -1190 -320 1360
3119 1360 -308 -1184 872 754 -1220 -139 1271 -492 -956 1031 463 -1240 233 1177 -816 -764 1237
3136 1237 202 -1332 458 1129 -974 -651 1275 24 -1264 595 943 -1057 -369 1246 -304 -1101
3152 -1101 891 653 -1249 -46 1306 -574 -1046 1054 547 -1323 88 1263 -708 -871 1129 266
3168 266 -1261 401 1054 -937 -563 1261 -42 -1241 682 945 -1135 -429 1344 -224 -1222 833
3184 833 798 -1209 -183 1270 -464 -1012 972 495 -1252 154 1188 -759 -843 1207 275 -1374 386
3201 386 1189 -942 -718 1280 78 -1265 572 962 -1033 -414 1255 -255 -1126 835 761 -1250 -151
3218 -151 1357 -503 -1120 1040 619 -1314 42 1278 -658 -895 1112 327 -1267 317 1106 -902
3234 -902 -654 1261 28 -1320 624 1015 -1143 -478 1358 -176 -1248 762 852 -1152 -236 1276 -417
3251 -417 -1031 984 549 -1257 99 1266 -732 -906 1205 339 -1369 331 1204 -873 -747 1221 114
3268 114 -1277 517 975 -1036 -437 1280 -220 -1201 836 776 -1261 -193 1365 -448 -1139 998 645
3285 645 -1292 -2 1281 -620 -911 1110 350 -1264 341 1128 -903 -645 1270 51 -1323 611
3301 611 1053 -1098 -500 1352 -142 -1233 762 829 -1169 -232 1273 -424 -1017 983 539 -1289 119
3318 119 1273 -735 -929 1200 351 -1378 304 1197 -867 -732 1227 110 -1250 545 965 -1038
3334 -1038 -426 1297 -232 -1202 844 818 -1240 -212 1352 -454 -1144 994 646 -1273 -2 1258
3350 1258 -635 -912 1105 338 -1285 321 1120 -930 -689 1293 58 -1343 585 1064 -1090 -534
3366 -534 1346 -125 -1257 745 852 -1158 -244 1286 -441 -1059 1002 583 -1309 87 1311 -693
3382 -693 -956 1178 404 -1354 255 1220 -838 -765 1217 155 -1270 529 1023 -1067 -463 1311 -194
3399 -194 -1249 824 867 -1246 -267 1364 -399 -1186 953 699 -1275 -48 1275 -610 -930 1113 379
3416 379 -1301 321 1174 -895 -731 1299 126 -1360 537 1114 -1062 -588 1325 -82 -1257 720
3432 720 882 -1159 -258 1304 -417 -1097 973 623 -1309 20 1330 -669 -1011 1137 456 -1345 217
3449 217 1237 -815 -797 1210 175 -1271 492 1024 -1035 -488 1304 -146 -1253 781 922 -1204
3465 -1204 -308 1370 -330 -1180 922 699 -1253 -65 1252 -601 -951 1082 400 -1290 266 1184
3481 1184 -872 -791 1275 158 -1359 492 1107 -1017 -581 1290 -77 -1220 682 845 -1122 -275
3497 -275 1261 -365 -1106 954 651 -1288 -19 1315 -624 -1007 1118 467 -1317 193 1204 -781
3513 -781 -772 1164 172 -1240 470 1008 -1008 -535 1284 -120 -1266 738 901 -1193 -348 1314 -301
3530 -301 -1120 870 685 -1178 -59 1233 -547 -932 1063 412 -1279 255 1188 -830 -781 1238 201
3547 201 -1324 441 1078 -940 -583 1227 -15 -1190 621 850 -1091 -312 1254 -339 -1106 920
3563 920 661 -1265 -64 1282 -564 -1016 1018 507 -1252 127 1164 -709 -793 1130 224 -1229 436
3580 436 1030 -958 -557 1260 -64 -1224 652 926 -1067 -379 1277 -207 -1140 794 722 -1148 -118
3597 -118 1217 -497 -959 996 448 -1235 159 1189 -748 -844 1142 277 -1274 330 1102 -875 -659
3614 -659 1198 49 -1185 566 892 -1029 -355 1236 -255 -1109 832 739 -1169 -177 1288 -432 -1054
3631 -1054 960 579 -1189 65 1169 -624 -807 1072 275 -1196 350 1058 -902 -641 1203 44
3647 44 -1257 550 981 -1021 -464 1252 -147 -1148 713 761 -1121 -186 1195 -425 -965 949 526
3664 526 -1205 95 1195 -659 -883 1101 364 -1244 277 1116 -801 -666 1137 77 -1158 501
3680 501 901 -973 -401 1200 -200 -1137 741 782 -1158 -219 1248 -380 -1046 882 592 -1144 -2
3697 -2 1135 -576 -827 1023 328 -1193 289 1084 -823 -674 1187 104 -1225 498 981 -975 -492
3714 -492 1185 -101 -1112 657 757 -1045 -229 1163 -379 -996 890 558 -1202 38 1184 -615
3730 -615 -898 1029 399 -1198 203 1083 -731 -686 1082 138 -1139 463 921 -936 -448 1205 -124
3747 -124 -1136 702 813 -1083 -275 1216 -291 -1046 803 635 -1106 -46 1136 -529 -847 968
3763 968 353 -1169 237 1068 -766 -698 1131 158 -1199 409 985 -893 -553 1130 -29 -1104 593
3780 593 790 -999 -268 1164 -301 -1012 838 610 -1138 -53 1173 -491 -918 959 475 -1162 123
3797 123 1087 -655 -739 1030 192 -1136 384 939 -889 -514 1148 -49 -1138 599 838 -1025 -358
3814 -358 1179 -226 -1051 734 655 -1046 -107 1106 -462 -870 928 414 -1138 152 1089 -668 -758
3831 -758 1070 261 -1169 332 1007 -792 -596 1088 37 -1089 533 807 -950 -326 1129 -238
3847 -238 -1024 750 656 -1088 -141 1169 -430 -951 895 495 -1112 66 1060 -599 -725 985 244
3864 244 -1097 324 970 -818 -559 1119 33 -1116 540 885 -934 -409 1129 -158 -1041 681
3880 681 675 -1005 -154 1077 -420 -877 867 456 -1104 86 1084 -622 -778 989 282 -1136 271
3897 271 991 -749 -604 1026 62 -1041 485 818 -886 -353 1097 -190 -1024 703 697 -1025 -167 1132
3915 1132 -348 -929 808 524 -1039 24 1029 -532 -738 945 267 -1083 270 941 -761 -588
3931 -588 1049 59 -1105 446 870 -877 -459 1067 -88 -996 595 681 -934 -190 1039 -345 -880
3948 -880 787 503 -1045 29 1063 -523 -794 913 345 -1056 174 952 -632 -605 944 135 -1009
3965 -1009 404 803 -832 -411 1035 -115 -1003 598 710 -965 -253 1074 -261 -924 690 527 -967
3982 -967 -56 974 -448 -747 837 329 -995 175 945 -640 -622 959 154 -1028 354 875 -755
3999 -755 -484 974 2 -934 484 695 -832 -248 966 -254 -856 688 517 -951 -77 992 -411
4016 -411 -781 781 408 -956 86 902 -537 -622 851 172 -923 325 791 -701 -421 955 -32
4033 -32 -929 493 713 -796 -288 973 -153 -853 583 561 -836 -98 904 -369 -723 733 354 -929
4051 -929 112 880 -532 -639 832 224 -953 236 819 -643 -491 855 34 -889 420 649 -767
4068 -767 -262 888 -189 -799 601 533 -855 -108 917 -323 -750 692 414 -892 38 836 -451
4085 -451 -587 760 197 -866 260 740 -632 -432 865 26 -873 401 682 -729 -330 867 -105
4102 -105 -813 508 529 -774 -119 821 -307 -682 662 365 -847 63 837 -470 -618 763 260 -886
4120 -886 186 782 -557 -471 784 73 -803 348 628 -652 -278 812 -145 -778 512 536 -781 -164
4138 -164 854 -245 -720 593 384 -797 2 772 -386 -563 683 218 -801 191 721 -541 -447 790
4156 790 75 -813 334 678 -639 -349 785 -42 -732 428 506 -662 -164 774 -236 -669 589 377
4174 377 -769 -15 789 -386 -597 654 279 -793 94 690 -460 -457 686 108 -743 271 594 -597
4192 -597 -308 760 -66 -737 428 524 -692 -198 774 -165 -667 503 422 -674 -52 715 -306 -550 595
4211 595 253 -735 108 670 -475 -447 678 127 -732 213 634 -521 -377 666 14 -689 343 497 -608
4230 -608 -187 683 -177 -602 497 389 -691 -64 719 -287 -548 570 320 -694 43 665 -370 -454
4248 -454 610 140 -675 226 559 -517 -313 672 -33 -675 343 511 -584 -234 704 -122 -630 405
4266 405 421 -615 -94 651 -249 -515 526 263 -658 71 644 -369 -462 601 176 -679 163 622 -439
4285 -439 -365 630 43 -625 303 485 -528 -194 656 -124 -590 422 397 -625 -101 689 -230 -570 485
4304 485 314 -650 17 616 -324 -437 551 151 -627 178 532 -455 -328 633 29 -657 303 534 -526 -245
4324 -245 652 -63 -587 366 410 -527 -104 616 -216 -517 482 270 -635 30 614 -340 -477 561 177 -660
4344 -660 112 568 -415 -366 571 71 -605 248 468 -500 -226 614 -91 -589 403 403 -583 -129 653 -179 -542
4365 -542 455 300 -573 -5 583 -278 -422 515 167 -582 146 531 -421 -331 591 50 -622 234 491 -485
4385 -485 -267 581 -19 -557 313 382 -507 -119 569 -164 -510 445 279 -586 8 585 -274 -446 498 212
4405 212 -599 90 548 -337 -352 522 86 -566 210 442 -446 -209 576 -72 -550 342 375 -528 -156 583 -156
4426 -156 -511 382 302 -531 -25 520 -255 -398 462 158 -552 126 489 -380 -328 534 82 -570 195 480 -409
4447 -409 -271 553 11 -511 285 376 -470 -123 530 -144 -474 387 288 -543 -30 555 -249 -439 454 217 -538
4468 -538 59 497 -326 -338 464 75 -520 194 407 -413 -211 530 -58 -526 297 389 -477 -156 537 -119 -467
4489 -467 348 294 -479 -28 501 -224 -373 428 165 -520 109 487 -339 -342 512 104 -543 160 459 -370 -253
4510 -253 491 -1 -483 252 343 -459 -118 505 -138 -435 361 281 -500 -26 527 -214 -397 405 202 -480 52
4531 52 463 -279 -282 440 71 -475 197 402 -396 -198 500 -33 -479 278 361 -443 -138 490 -99 -427 312
4552 312 266 -446 -30 454 -225 -341 380 150 -489 84 464 -297 -308 461 91 -495 150 426 -332 -223 449
4573 449 8 -425 239 315 -389 -93 454 -131 -413 348 257 -469 -34 461 -191 -350 356 159 -440 52 404
4594 404 -265 -257 391 44 -433 175 364 -348 -194 453 -26 -439 245 321 -387 -119 450 -91 -367 271 227
4615 227 -387 -19 409 -198 -323 364 161 -434 64 404 -274 -286 398 77 -429 127 355 -310 -188 376
4635 376 -10 -391 204 270 -371 -94 425 -118 -371 316 230 -409 -12 419 -172 -311 326 150 -375 68 349
4656 349 -224 -218 378 49 -392 161 317 -339 -158 407 -28 -400 195 287 -343 -113 385 -80 -348 251 213
4677 213 -369 -16 381 -198 -309 341 134 -405 51 384 -234 -273 366 82 -383 119 349 -271 -191 375 -21
4698 -21 -347 216 242 -346 -64 404 -118 -345 279 218 -360 -31 365 -150 -303 295 139 -359 45 336 -235
4719 -235 -229 344 39 -365 136 323 -299 -167 380 -5 -375 171 298 -292 -126 379 -67 -336 243 196 -328
4740 -328 -14 352 -169 -293 305 138 -387 33 349 -210 -269 314 79 -371 91 297 -256 -168 332 -32 -334
4761 -334 182 220 -316 -94 368 -103 -325 239 210 -335 -28 361 -131 -264 265 137 -330 59 303 -202 -203
4782 -203 313 65 -341 105 301 -247 -189 342 15 -346 143 268 -258 -112 337 -61 -285 194 178 -290 -26
4803 -26 327 -138 -273 281 140 -341 32 325 -181 -213 294 78 -310 87 267 -222 -136 302 -20 -303 166
4824 166 230 -281 -89 349 -77 -303 219 189 -308 -26 311 -103 -253 218 113 -304 23 274 -174 -198 286
4845 286 64 -328 95 287 -229 -174 315 32 -295 130 230 -234 -113 301 -23 -281 206 171 -292 -32 312
4866 312 -142 -246 274 139 -307 28 292 -153 -201 254 78 -292 82 239 -199 -137 296 -14 -298 159 207
4887 207 -278 -98 312 -55 -296 191 201 -265 -50 287 -97 -218 228 121 -266 42 286 -163 -181 284 58
4908 58 -308 82 282 -193 -165 276 53 -294 126 210 -227 -104 267 -48 -238 193 160 -271 -27 311 -111
4929 -111 -240 237 136 -281 18 285 -156 -183 243 86 -270 99 248 -201 -101 279 7 -266 143 223 -247
4950 -247 -92 303 -39 -274 169 187 -255 -45 278 -84 -206 193 108 -266 10 250 -156 -187 250 61 -290
4971 -290 73 261 -187 -166 268 22 -274 113 191 -206 -59 255 -52 -220 184 142 -254 -10 273 -118 -195
4992 -195 225 90 -266 29 259 -154 -169 214 29 -242 100 197 -199 -115 257 -16 -244 144 192 -218 -80
5013 -80 273 -51 -223 160 142 -227 -20 245 -94 -170 190 88 -243 53 240 -153 -151 240 41 -259 80 214
5035 214 -180 -95 237 2 -209 118 149 -204 -47 215 -91 -188 182 94 -233 27 253 -140 -166 207 60 -244
5057 -244 39 225 -136 -114 223 13 -198 106 167 -186 -69 244 -32 -216 150 157 -207 -43 231 -48 -190
5078 -190 160 120 -201 -21 206 -114 -140 189 49 -212 60 204 -157 -135 228 17 -214 94 180 -160 -84 218
5100 218 -21 -171 143 129 -193 10 216 -82 -157 193 80 -222 37 226 -118 -149 194 49 -199 53 179
5121 179 -135 -99 185 -8 -194 86 156 -189 -73 205 -22 -207 127 148 -193 -56 194 -54 -161 152 109
5142 109 -171 2 189 -94 -116 193 46 -191 68 177 -151 -100 212 9 -196 90 141 -153 -57 180 -52
5163 -52 -143 141 96 -189 1 189 -92 -148 173 75 -185 17 175 -94 -115 170 57 -174 49 169 -116 -82
5185 -82 180 -3 -169 97 126 -150 -53 186 -15 -166 110 123 -162 -28 186 -58 -151 125 69 -179 22 156
5207 156 -119 -113 172 21 -187 77 149 -127 -94 154 1 -163 99 131 -132 -46 163 -55 -136 135 69 -150 15
5230 15 164 -87 -127 159 69 -160 22 162 -72 -112 132 49 -174 44 116 -117 -62 140 -21 -154 89 103 -142
5253 -142 -63 166 -24 -147 89 112 -137 -20 160 -56 -116 104 42 -135 26 128 -101 -57 140 7 -147 58
5275 58 139 -98 -62 151 -7 -137 81 80 -110 -16 137 -36 -111 99 60 -139 -3 138 -53 -115 112 67 -131
5298 -131 -5 131 -65 -87 98 30 -119 21 112 -82 -49 130 6 -128 65 79 -105 -42 141 -2 -107 71
5320 71 82 -95 -23 114 -30 -77 89 28 -126 26 101 -90 -71 104 16 -128 33 103 -89 -61 116 -9 -105 54
5344 54 62 -92 -21 98 -24 -88 86 51 -118 -2 119 -37 -82 89 45 -98 1 104 -45 -77 55 16 -104 24
5368 24 76 -68 -41 99 -13 -94 57 75 -100 -46 101 -37 -95 65 55 -83 -7 92 -47 -48 93 18 -97 52
5392 52 108 -85 -48 116 22 -95 60 86 -65 -38 100 -4 -111 57 64 -86 -6 94 -34 -81 76 44 -105 -1
5416 -1 78 -39 -81 80 38 -81 6 84 -43 -52 79 25 -82 50 72 -79 -22 101 -2 -86 68 64 -78 -13 97
5441 97 -7 -66 64 49 -93 13 92 -69 -36 108 -11 -95 46 79 -82 -47 92 5 -89 32 67 -66 -30 81
5465 81 -31 -73 62 43 -60 18 85 -32 -52 84 50 -81 8 76 -30 -53 89 41 -67 12 65 -57 -33 86 -32
5490 -32 -76 52 52 -88 -4 86 -46 -72 65 38 -98 1 81 -60 -39 82 -4 -78 44 66 -74 -22 102 -11 -64
5515 -64 46 72 -74 -4 101 -13 -66 64 41 -76 9 69 -29 -47 72 2 -66 20 82 -52 -57 80 13 -88 34
5540 34 62 -68 -31 53 -8 -56 58 43 -73 2 89 -43 -58 90 28 -86 50 106 -51 -48 89 29 -86 51 76
5565 76 -70 -17 91 -32 -98 53 65 -95 -4 120 -41 -95 87 41 -104 11 84 -43 -84 69 27 -91 21
5588 21 72 -69 -51 94 3 -87 60 68 -84 -16 104 -13 -84 74 64 -95 -9 94 -35 -84 92 49 -108 18
5612 18 88 -79 -62 128 18 -116 49 109 -91 -68 123 -22 -116 64 75 -109 -30 119 -44 -95 88 61 -112
5635 -112 0 121 -39 -95 114 51 -103 29 116 -55 -72 108 35 -106 42 89 -97 -43 123 -22 -115 81 77
5658 77 -119 -39 118 -58 -117 88 69 -118 -5 110 -74 -96 112 23 -144 39 122 -101 -74 157 9 -138 69
5681 69 131 -117 -59 144 -21 -110 91 87 -125 -5 138 -66 -111 122 67 -139 11 134 -74 -108 114 24 -145
5704 -145 19 123 -104 -66 116 -7 -119 71 86 -125 -31 143 -44 -126 100 86 -135 -21 151 -52 -104 115
5726 115 70 -139 26 137 -91 -94 158 10 -166 66 126 -121 -80 167 -25 -161 76 105 -130 -37 146 -39
5748 -39 -137 101 73 -139 5 172 -80 -114 129 52 -147 32 166 -89 -96 151 40 -138 60 131 -110 -52 161
5771 161 -10 -144 101 100 -148 -31 173 -51 -159 112 93 -173 -4 165 -91 -135 129 45 -171 33 171 -107
5793 -107 -115 169 12 -194 72 160 -136 -82 167 -8 -166 95 128 -143 -42 184 -43 -158 130 82 -163 11
5815 11 169 -67 -125 157 71 -197 17 167 -105 -127 143 32 -170 59 147 -142 -82 178 -18 -175 97 127
5837 127 -180 -46 186 -51 -176 143 103 -172 -5 212 -82 -143 165 66 -196 48 193 -130 -114 190 27
5858 27 -214 89 160 -156 -92 198 -14 -196 120 132 -179 -55 195 -66 -169 139 90 -190 -6 189 -89 -144
5880 -144 180 65 -187 41 195 -124 -110 190 31 -194 78 173 -141 -76 213 -23 -206 143 154 -198 -45
5901 -45 219 -68 -183 147 100 -222 -13 217 -107 -157 178 73 -219 48 205 -145 -127 212 35 -223 91
5922 91 192 -178 -80 221 -9 -202 127 153 -184 -54 214 -51 -185 168 118 -216 -1 215 -111 -171 183 78
5944 78 -229 21 204 -133 -147 193 29 -241 68 204 -171 -100 231 -11 -239 126 185 -211 -61 261 -49
5965 -49 -217 162 142 -213 -4 245 -103 -177 199 82 -230 27 245 -148 -161 221 33 -240 65 211 -166
5986 -166 -131 231 6 -235 115 148 -205 -73 243 -46 -225 160 142 -239 -32 252 -107 -198 197 109 -242 15
6008 15 239 -119 -178 232 78 -255 73 245 -173 -137 267 19 -252 105 199 -206 -96 271 -33 -262 160
6029 160 171 -242 -48 269 -105 -215 185 124 -251 1 265 -138 -197 229 91 -274 50 248 -161 -137 253
6050 253 37 -252 110 214 -201 -105 283 -29 -262 150 193 -248 -74 285 -79 -259 216 154 -269 -12 289
6071 289 -128 -207 238 98 -297 69 279 -177 -187 279 43 -288 115 268 -214 -144 298 -11 -277 153 214
6092 214 -257 -55 309 -61 -240 208 175 -270 -7 306 -124 -228 256 115 -301 31 266 -184 -197 269 61
6113 61 -313 96 263 -234 -137 305 4 -288 146 235 -257 -97 322 -63 -291 202 195 -291 -51 334 -122 -247
6135 -247 247 141 -313 37 317 -169 -202 287 74 -333 102 284 -218 -177 306 23 -323 135 263 -273 -122
6156 -122 315 -50 -289 195 205 -298 -50 317 -107 -274 238 161 -323 7 334 -152 -238 299 93 -343 79
6177 79 310 -217 -186 315 42 -332 141 277 -270 -132 351 -38 -332 203 232 -323 -79 354 -98 -298 236
6198 236 167 -343 -3 338 -154 -258 301 103 -360 60 312 -206 -210 322 61 -340 139 296 -258 -140 348
6219 348 -13 -316 193 250 -298 -87 356 -83 -297 234 196 -347 -9 351 -153 -273 276 132 -357 54 325
6240 325 -212 -221 327 62 -358 108 301 -260 -180 363 1 -347 188 261 -302 -94 370 -64 -314 237 209 -336
6262 -336 -24 369 -136 -287 306 149 -359 35 344 -199 -246 318 67 -365 108 311 -257 -191 348 1 -351
6283 -351 166 257 -286 -122 355 -61 -343 250 219 -357 -38 361 -138 -290 297 153 -369 43 365 -203 -236
6304 -236 344 103 -357 106 332 -266 -195 381 22 -364 178 284 -322 -117 371 -66 -347 231 232 -360 -50
6325 -50 377 -140 -311 283 166 -364 30 357 -199 -254 335 104 -369 75 333 -237 -189 373 31 -359 181
6346 181 310 -305 -123 394 -49 -354 240 238 -340 -57 381 -132 -319 292 185 -379 9 369 -217 -267 346
6367 346 93 -379 90 351 -237 -211 369 37 -369 160 306 -280 -143 393 -38 -357 227 269 -341 -58 396
6388 396 -107 -321 285 202 -366 -1 372 -187 -280 329 113 -392 54 339 -241 -224 352 46 -384 140 314
6409 314 -286 -168 392 -4 -366 222 257 -338 -76 381 -100 -332 296 190 -374 5 384 -157 -277 333
6429 333 138 -382 68 354 -222 -228 377 48 -377 133 316 -289 -160 378 -17 -370 191 273 -331 -104 382
6450 382 -81 -335 266 220 -364 -34 391 -155 -294 325 151 -384 58 357 -228 -255 367 94 -383 129 338
6471 338 -285 -188 389 4 -383 202 287 -335 -108 385 -75 -358 238 225 -363 -63 391 -150 -325 291 175
6492 175 -371 33 368 -188 -254 346 95 -373 113 351 -262 -202 389 17 -390 178 310 -332 -143 394 -47
6513 -47 -357 244 248 -355 -79 394 -124 -337 301 194 -382 11 381 -201 -277 340 115 -396 82 358 -257
6534 -257 -219 385 39 -399 158 321 -319 -163 411 -27 -371 245 271 -350 -72 401 -118 -346 291 216 -382
6555 -382 -10 398 -183 -292 352 139 -400 77 368 -257 -240 360 58 -393 142 325 -322 -163 400 -26
6575 -26 -374 227 294 -354 -83 414 -91 -346 287 223 -372 -33 409 -158 -285 326 148 -391 48 389 -241
6596 -241 -245 370 75 -407 132 350 -297 -188 393 -6 -382 189 292 -342 -111 408 -90 -362 268 224 -391
6617 -391 -46 408 -154 -328 327 178 -405 37 405 -222 -269 390 110 -400 130 358 -268 -203 402 15 -398
6638 -398 185 317 -339 -137 407 -68 -374 246 263 -370 -57 401 -146 -328 313 187 -397 30 405 -216
6658 -216 -294 374 110 -408 101 365 -272 -230 398 52 -399 183 347 -333 -154 428 -38 -393 252 283 -373
6679 -373 -78 437 -115 -351 303 198 -409 2 419 -190 -312 359 133 -423 90 375 -267 -235 410 66
6699 66 -423 162 346 -316 -163 416 -26 -392 242 292 -343 -87 423 -104 -352 305 229 -391 9 428 -186
6720 -186 -303 351 166 -409 57 404 -257 -267 389 80 -424 152 354 -312 -206 411 -17 -412 222 303 -363
6741 -363 -115 433 -95 -382 290 245 -394 -33 438 -157 -331 340 179 -408 55 409 -231 -268 392 95 -410
6762 -410 141 369 -305 -197 413 2 -399 200 325 -348 -131 426 -68 -380 269 237 -390 -59 432 -145
6782 -145 -337 344 177 -418 30 413 -237 -284 388 124 -417 110 384 -282 -199 419 23 -417 196 321 -350
6803 -350 -144 423 -62 -385 264 249 -384 -49 426 -143 -347 322 187 -428 28 396 -228 -294 357 109 -409
6824 -409 99 385 -277 -258 413 50 -422 193 340 -328 -160 436 -31 -395 259 276 -376 -71 425 -124 -353
6845 -353 312 205 -419 3 413 -205 -310 358 131 -418 99 374 -287 -242 394 34 -413 167 341 -331
6865 -331 -181 433 -39 -407 240 287 -368 -88 444 -107 -339 323 213 -404 2 434 -190 -296 351 131
6885 131 -425 81 385 -278 -259 393 66 -422 159 337 -326 -182 408 -43 -414 243 285 -369 -97 445 -100
6906 -100 -369 297 235 -403 -25 422 -192 -323 355 161 -404 72 397 -250 -252 393 76 -414 150 358 -315
6927 -315 -195 414 5 -403 224 311 -359 -106 425 -89 -372 282 232 -390 -29 416 -176 -326 344 166 -414
6948 -414 60 402 -241 -275 375 78 -406 135 370 -293 -196 424 17 -411 206 311 -357 -116 441 -87 -379
6969 -379 268 252 -396 -48 415 -168 -328 326 161 -407 41 378 -238 -294 362 82 -415 126 361 -299 -199
6990 -199 393 -4 -407 189 312 -336 -129 416 -59 -361 268 255 -376 -38 419 -151 -345 322 186 -421
7010 -421 32 402 -227 -297 343 105 -430 99 360 -296 -218 389 0 -413 180 330 -349 -147 415 -59 -394
7031 -394 238 272 -367 -65 414 -122 -325 311 191 -400 14 396 -202 -293 363 136 -418 83 369 -269 -228
7052 -228 383 47 -394 170 331 -333 -164 407 -36 -398 240 261 -381 -84 404 -125 -363 293 209 -415 -10
7073 -10 399 -195 -308 351 136 -408 84 365 -267 -250 393 59 -416 141 340 -325 -175 411 -21 -389 227
7094 227 278 -368 -112 414 -110 -380 273 213 -389 -35 404 -172 -332 337 135 -409 59 372 -261 -273 376
7115 376 69 -408 146 359 -298 -195 399 -10 -391 205 286 -346 -116 417 -96 -386 263 240 -396 -32 424
7136 424 -166 -342 327 161 -413 55 394 -247 -255 370 67 -418 123 350 -295 -199 397 2 -396 196 315
7157 315 -340 -126 414 -80 -360 273 255 -383 -41 409 -152 -335 331 192 -409 46 410 -225 -278 363 70
7178 70 -414 119 351 -303 -196 398 -2 -403 190 303 -352 -141 428 -78 -394 259 251 -377 -57 417 -153
7199 -153 -332 323 177 -413 44 406 -240 -283 374 91 -412 108 383 -295 -219 411 14 -394 187 307 -335
7220 -335 -134 412 -54 -398 265 248 -384 -66 414 -151 -330 326 174 -417 22 398 -212 -276 371 101 -432
7241 -432 102 374 -294 -210 400 31 -409 191 314 -347 -140 429 -48 -386 274 269 -383 -76 419 -126 -352
7262 -352 299 182 -403 13 399 -201 -297 376 124 -429 96 373 -278 -229 402 44 -416 157 327 -319 -163
7283 -163 422 -40 -388 246 279 -372 -69 450 -122 -356 323 211 -398 -2 425 -199 -301 359 130 -432
7303 -432 87 380 -263 -241 400 42 -416 167 338 -317 -171 410 -44 -402 242 305 -381 -104 419 -123 -350
7324 -350 307 212 -412 -10 416 -198 -311 374 130 -416 75 373 -239 -251 386 74 -417 149 348 -342 -177
7345 -177 419 -40 -394 218 274 -378 -88 416 -123 -367 285 221 -423 -20 429 -189 -317 345 152 -418 63
7366 63 392 -251 -258 396 63 -405 152 351 -327 -173 401 -13 -399 213 294 -354 -116 406 -94 -361 278
7387 278 221 -387 -27 424 -176 -330 338 144 -418 38 398 -226 -262 380 73 -409 139 343 -299 -190 414
7408 414 -1 -387 221 294 -350 -114 424 -87 -363 267 235 -386 -33 417 -179 -328 330 156 -422 34 381
7429 381 -234 -263 359 84 -423 114 348 -313 -202 391 0 -404 191 309 -342 -136 403 -76 -358 257
7449 257 251 -372 -45 422 -137 -322 336 191 -404 32 383 -225 -275 369 95 -404 107 352 -294 -206 395
7470 395 13 -408 181 305 -346 -137 398 -79 -377 260 244 -381 -63 396 -120 -323 312 175 -389 32
7490 32 399 -210 -262 368 119 -405 96 359 -285 -221 391 26 -381 186 318 -315 -128 393 -50 -364 237
7511 237 239 -376 -71 419 -141 -347 318 186 -391 15 392 -207 -288 362 115 -400 113 341 -269 -209 387
7532 387 30 -382 176 308 -341 -128 406 -44 -379 229 253 -368 -77 390 -120 -334 300 187 -368 14
7552 14 385 -210 -281 330 112 -400 63 363 -260 -235 354 35 -398 151 320 -304 -157 383 -34 -365 232
7573 232 266 -370 -85 402 -113 -334 286 199 -375 -3 385 -191 -287 323 113 -405 70 356 -253 -226 370
7594 370 52 -402 139 321 -303 -167 384 -26 -381 214 266 -346 -104 391 -92 -347 282 210 -350 -10 392
7615 392 -185 -280 331 145 -389 64 378 -231 -253 352 73 -389 123 326 -300 -177 373 -18 -384 194 252
7636 252 -348 -117 391 -88 -367 257 215 -376 -37 386 -160 -292 318 157 -391 49 368 -229 -235 359 81
7657 81 -384 123 338 -294 -181 371 0 -381 173 289 -321 -122 379 -83 -350 242 219 -363 -40 386 -158
7678 -158 -322 300 169 -393 21 366 -217 -253 352 90 -384 103 332 -272 -195 385 10 -363 190 287 -323
7699 -323 -122 407 -65 -360 247 243 -352 -57 386 -128 -317 304 173 -384 27 375 -200 -266 321 89 -388
7720 -388 86 344 -257 -221 352 22 -395 144 307 -298 -132 377 -55 -340 238 235 -360 -76 406 -120 -327
7741 -327 308 197 -365 7 395 -186 -278 335 115 -380 81 355 -264 -231 370 32 -392 153 311 -311 -162
7762 -162 396 -42 -374 222 266 -341 -83 394 -111 -341 277 197 -369 3 377 -192 -293 330 134 -381 61
7783 61 375 -248 -233 360 53 -379 144 321 -294 -163 363 -22 -365 202 253 -337 -92 385 -91 -332 256
7804 256 201 -383 -21 374 -179 -309 322 146 -389 55 356 -241 -235 356 68 -390 131 334 -296 -171 391
7825 391 -21 -365 195 264 -336 -98 383 -86 -343 253 207 -369 -41 370 -157 -310 302 156 -377 27 352
7846 352 -223 -259 337 83 -373 101 314 -276 -183 364 -9 -361 182 266 -320 -120 382 -85 -344 265 225
7867 225 -345 -39 378 -149 -296 292 153 -376 23 357 -210 -247 341 77 -387 104 325 -278 -200 362 39
7888 39 -369 151 271 -315 -134 371 -54 -339 235 222 -343 -58 372 -125 -303 302 182 -370 23 362 -190
7909 -190 -267 327 108 -360 78 324 -260 -201 356 34 -370 160 278 -320 -142 371 -47 -347 212 226 -339
7930 -339 -83 369 -111 -316 265 169 -353 4 360 -198 -263 330 108 -352 84 336 -240 -221 353 51 -369
7951 -369 153 283 -275 -152 363 -27 -338 198 250 -306 -83 354 -111 -309 254 191 -357 -30 360 -172 -267
7972 -267 294 111 -353 50 323 -231 -212 325 59 -342 129 289 -272 -145 358 -5 -338 182 255 -293 -96
7993 -96 357 -70 -308 240 189 -326 -24 349 -157 -276 290 134 -336 26 338 -207 -234 303 89 -353 101
8014 101 294 -246 -178 335 5 -323 176 247 -288 -100 333 -55 -308 227 230 -325 -42 352 -110 -271 267
8035 267 162 -338 34 315 -195 -236 295 72 -337 107 298 -226 -185 329 22 -340 145 259 -267 -110 335
8056 335 -46 -331 201 218 -309 -39 335 -106 -267 254 172 -308 25 332 -143 -230 275 103 -323 73 293
8077 293 -208 -185 304 34 -315 132 247 -263 -130 329 -23 -319 189 220 -301 -72 328 -84 -287 238 165
8098 165 -325 0 311 -148 -236 272 107 -321 59 301 -200 -201 315 59 -319 129 276 -232 -123 307 -17
8119 -17 -312 174 211 -274 -88 320 -85 -290 234 156 -301 -35 313 -122 -236 258 119 -324 32 286 -192
8140 -192 -201 288 70 -295 113 274 -225 -147 323 -8 -297 167 228 -265 -80 319 -59 -277 213 179 -292 -16
8162 -16 313 -118 -239 255 125 -300 39 315 -177 -216 279 74 -318 85 276 -224 -166 301 6 -301 145
8183 145 231 -264 -82 324 -59 -273 210 204
8191B04
##END NTUPLES=NMR FID
##END=
