##TITLE=1H_IG-1601hexyne90
 CDCl3
 8 sc, 
 18.1.2022
##JCAMPDX= 6.0         $$ Bruker NMR JCAMP-DX V2.0
##DATA TYPE= NMR FID
##DATA CLASS= NTUPLES
##ORIGIN= UXNMR, Bruker Analytische Messtechnik GmbH
##OWNER= root
$$ XWIN-NMR		Version 3.5
$$ Tue Jan 18 11:00:11 2022 Russian Standard Time (UT+4h)  she@DPX200
##.OBSERVE FREQUENCY= 200.1309
##.OBSERVE NUCLEUS= ^1H
##.DELAY= (6, 6)
##.ACQUISITION MODE= SIMULTANEOUS
##.ACQUISITION SCHEME= undefined
##.AVERAGES= 8
##.DIGITISER RES= 18
##SPECTROMETER/DATA SYSTEM= spect
##.PULSE SEQUENCE= zg30
##.SOLVENT NAME= CDCl3
##.SHIFT REFERENCE= (INTERNAL, CDCl3, 0, 15.7039)
##AUDIT TRAIL= $$ (NUMBER, WHEN, WHO, WHERE, WHAT)
$$ ##TITLE= Audit trail, XWIN-NMR		Version 3.5
$$ ##JCAMPDX= 5.01
$$ ##ORIGIN= Bruker BioSpin GmbH
$$ ##OWNER= she
$$ F:/spectra/data/she/nmr/H-F/1/audita.txt
$$ ##AUDIT TRAIL=  $$ (NUMBER, WHEN, WHO, WHERE, WHAT)
(   1,<2022-01-18 10:58:02.10 +0400>,<she>,<DPX200>,
      <created by zg, POWCHK disabled, PULCHK disabled
       configuration hash MD5:
       00 E9 B6 7A A2 85 ED C7 34 08 36 98 17 FE 4E 26
       data hash MD5: 16K
       85 CA C8 12 2B 0D 34 70 B1 23 08 01 95 29 6B 59>)
$$ ##END=
$$ 
$$ hash MD5
$$ 88 55 2C 63 83 53 5E 7A FA EE 42 33 84 30 CC 9E
##$RELAX= 
##$RELAX= 
##$RELAX= 
##$RELAX= 
##$RELAX= 
##$RELAX= 
$$ Bruker specific parameters
$$ --------------------------
##$DU= <F:/spectra>
##$EXPNO= 1
##$NAME= <H-F>
##$PROCNO= 1
##$TYPE= <nmr>
##$USER= <she>
##$AMP= (0..31)
100 100 100 100 100 100 100 100 100 100 100 100 100 100 100 100 100 100 
100 100 100 100 100 100 100 100 100 100 100 100 100 100 
##$AQSEQ= 0
##$AQ_mod= 1
##$AUNM= <au_zg>
##$AUTOPOS= <>
##$BF1= 200.13
##$BF2= 200.13
##$BF3= 200.13
##$BF4= 200.13
##$BF5= 200.13
##$BF6= 200.13
##$BF7= 200.13
##$BF8= 200.13
##$BYTORDA= 1
##$CFDGTYP= 0
##$CFRGTYP= 5
##$CHEMSTR= <none>
##$CNST= (0..31)
1 1 145 1 1 1 1 1 1 1 1 1 1 1 1 1 1 1 1 1 1 1 1 1 1 1 1 1 1 1 1 1 
##$CPDPRG= <>
##$CPDPRG1= <>
##$CPDPRG2= <>
##$CPDPRG3= <>
##$CPDPRG4= <mlev>
##$CPDPRG5= <mlev>
##$CPDPRG6= <mlev>
##$CPDPRG7= <mlev>
##$CPDPRG8= <mlev>
##$CPDPRGB= <>
##$CPDPRGT= <>
##$D= (0..31)
0 1.2 0 0 0 0 0 0 0 0.06 0 0.03 0 0 0 0 0.0002 0 0 0 0 0 0 0 0 0 0 0 0 
0 0 0 
##$DATE= 1642489081
##$DBL= (0..7)
120 120 120 120 120 120 120 120 
##$DBP= (0..7)
150 150 150 150 150 150 150 150 
##$DBP07= 0
##$DBPNAM0= <>
##$DBPNAM1= <>
##$DBPNAM2= <>
##$DBPNAM3= <>
##$DBPNAM4= <>
##$DBPNAM5= <>
##$DBPNAM6= <>
##$DBPNAM7= <>
##$DBPOAL= (0..7)
0.5 0.5 0.5 0.5 0.5 0.5 0.5 0.5 
##$DBPOFFS= (0..7)
0 0 0 0 0 0 0 0 
##$DE= 6
##$DECBNUC= <off>
##$DECIM= 32
##$DECNUC= <off>
##$DECSTAT= 4
##$DIGMOD= 1
##$DIGTYP= 9
##$DL= (0..7)
0 120 120 120 120 120 120 120 
##$DP= (0..7)
150 150 150 150 150 150 150 150 
##$DP07= 0
##$DPNAME0= <>
##$DPNAME1= <>
##$DPNAME2= <>
##$DPNAME3= <>
##$DPNAME4= <>
##$DPNAME5= <>
##$DPNAME6= <>
##$DPNAME7= <>
##$DPOAL= (0..7)
0.5 0.5 0.5 0.5 0.5 0.5 0.5 0.5 
##$DPOFFS= (0..7)
0 0 0 0 0 0 0 0 
##$DQDMODE= 0
##$DR= 18
##$DS= 0
##$DSLIST= <SSSSSSSSSSSSSSS>
$$ [...]
##$SUBNAM2= <"">
##$SUBNAM3= <"">
##$SUBNAM4= <"">
##$SUBNAM5= <"">
##$SUBNAM6= <"">
##$SUBNAM7= <"">
##$SUBNAM8= <"">
##$SUBNAM9= <"">
##$SW= 18.0517689322627
##$SWIBOX= (0..15)
0 0 2 0 0 0 0 0 0 0 0 0 0 0 0 0 
##$SW_h= 3612.71676300578
##$TD= 16384
##$TD0= 1
##$TE= 0
##$TE2= 300
##$TE3= 300
##$TEG= 300
##$TL= (0..7)
0 120 120 120 120 120 120 120 
##$TP= (0..7)
150 150 150 150 150 150 150 150 
##$TP07= 0
##$TPNAME0= <>
##$TPNAME1= <>
##$TPNAME2= <>
##$TPNAME3= <>
##$TPNAME4= <>
##$TPNAME5= <>
##$TPNAME6= <>
##$TPNAME7= <>
##$TPOAL= (0..7)
0.5 0.5 0.5 0.5 0.5 0.5 0.5 0.5 
##$TPOFFS= (0..7)
0 0 0 0 0 0 0 0 
##$TUNHIN= 0
##$TUNHOUT= 0
##$TUNXOUT= 0
##$USERA1= <user>
##$USERA2= <user>
##$USERA3= <user>
##$USERA4= <user>
##$USERA5= <user>
##$V9= 5
##$VALIST= <valist>
##$VCLIST= <CCCCCCCCCCCCCCC>
##$VD= 0
##$VDLIST= <DDDDDDDDDDDDDDD>
##$VPLIST= <PPPPPPPPPPPPPPP>
##$VTLIST= <TTTTTTTTTTTTTTT>
##$WBST= 1024
##$WBSW= 4
##$XGAIN= (0..3)
0 0 0 0 
##$XL= 0
##$YL= 0
##$YMAX_a= 271372
##$YMIN_a= -268586
##$ZGOPTNS= <>
##$ZL1= 120
##$ZL2= 120
##$ZL3= 120
##$ZL4= 120
##$ABSF1= 10
##$ABSF2= 0
##$ABSG= 5
##$ABSL= 3
##$ALPHA= 0
##$AQORDER= 0
##$ASSFAC= 0
##$ASSFACI= 0
##$ASSFACX= 0
##$ASSWID= 0
##$AUNMP= <proc_1d>
##$AZFE= 0.1
##$AZFW= 0.1
##$BCFW= 1
##$BC_mod= 2
##$BYTORDP= 1
##$COROFFS= 0
##$CY= 11.3945322036743
##$DATMOD= 1
##$DC= 2
##$DFILT= <>
##$DTYPP= 0
##$F1P= 2.36226072786647
##$F2P= -0.459571619588291
##$FCOR= 0.5
##$FTSIZE= 0
##$FT_mod= 4
##$GAMMA= 1
##$GB= 0.15
##$INTBC= 1
##$INTSCL= 1
##$ISEN= 128
##$LB= 0.24
##$LEV0= 0
##$LPBIN= 0
##$MAXI= 10000
##$MC2= 0
##$MEAN= 0
##$ME_mod= 0
##$MI= 1.114404
##$NCOEF= 0
##$NC_proc= 0
##$NLEV= 6
##$NOISF1= 3.799351
##$NOISF2= 2.8
##$NSP= 1
##$NTH_PI= 0
##$NZP= 0
##$OFFSET= 15.70392
##$PC= 1
##$PHC0= -15949.71
##$PHC1= 14.60078
##$PH_mod= 1
##$PKNL= yes
##$PPARMOD= 0
##$PSCAL= 0
##$PSIGN= 0
##$REVERSE= no
##$SF= 200.130013532006
##$SI= 16384
##$SIGF1= 3
##$SIGF2= 2
##$SINO= 400
##$SIOLD= 16384
##$SREGLST= <1H.CDCl3>
##$SSB= 0
##$STSI= 0
##$STSR= 0
##$SW_p= 3612.71676300578
##$SYMM= 0
##$S_DEV= 0
##$TDeff= 0
##$TDoff= 0
##$TI= <>
##$TILT= no
##$TM1= 0
##$TM2= 0
##$TOPLEV= 0
##$USERP1= <user>
##$USERP2= <user>
##$USERP3= <user>
##$USERP4= <user>
##$USERP5= <user>
##$WDW= 1
##$XDIM= 8192
##$YMAX_p= 0
##$YMIN_p= 0
$$ End of Bruker specific parameters
$$ ---------------------------------
##NTUPLES= NMR FID
##VAR_NAME=  TIME,          FID/REAL,        FID/IMAG
##SYMBOL=    X,             R,               I
##VAR_TYPE=  INDEPENDENT,   DEPENDENT,       DEPENDENT
##VAR_FORM=  AFFN,          ASDF,            ASDF
##VAR_DIM=   8192,          8192,            8192
##UNITS=     SECONDS,       ARBITRARY UNITS, ARBITRARY UNITS
##FACTOR=    0.0002768,     1,               1
##FIRST=     0,             0,               0
##LAST=      2.2672688,     0,               0
##MIN=       0,             -268586,         0
##MAX=       2.2672688,     271372,          0
$$ Real data points
##PAGE= N=1
##DATA TABLE= (X++(R..R)), XYDATA
$$ [...]
1064B802j195n385L857L831n846j242O590j772n848M422L827o087j004O391j915
$$ 2802 1607 -3778 79 3910 -1936 -3178 3412 1640 -4208 214 4041 -2046 -3050 3341 1426
1079A426n248M238K996n338k62N038k203l504L770J194m067J179L013k898j070
$$ 1426 -3822 416 3412 -1926 -2188 2850 647 -2857 913 2107 -1960 -781 2232 -666 -1736
1094a736L471j222k743L104Q92l935J473L465l653j697M947q18m905L457L450
$$ -1736 1735 513 -2230 874 1766 -2169 -696 2769 -884 -2581 2366 1548 -3357 100 3550
1109C550n400r19O087k048n270M643L108o190j60O243k793m853N047K325n999
$$ 3550 -1850 -2769 3318 1270 -4000 643 3751 -2439 -2599 3644 851 -4002 1045 3370 -2629
1124b629O26N455l199l614M783J039m977J533L854l456j748M179p07l565K746
$$ -2629 -2003 3452 253 -3361 1422 2461 -2516 -983 2871 -585 -2333 1846 1139 -2426 320
1139C20J823l810M77L562k654k116M055j47m204K574L034m389q53N116j784m445
$$ 320 2143 -1667 -1190 2372 -282 -2398 1657 1510 -2694 -120 2914 -1475 -2328 2788 1004 -3441
1155c441M145K553n574J57N611k907m264M988J839n859J013N256l546l404N107
$$ -3441 704 3257 -2317 -2160 3451 544 -3720 1268 3107 -2752 -1739 3517 -29 -3433 1674
1170A674P97n297J830M153l830j997M645m75m128K599K500l794k78L773j884k577
$$ 1674 2471 -2826 -996 3157 -673 -2670 1975 1500 -2628 -29 2471 -1323 -1601 2172 288 -2289
1186b289L336N88l696J580K843l278j081M036j141l582L158K040m355J66M466
$$ -2289 1047 1635 -2061 -481 2362 -916 -1997 2039 898 -2684 474 2514 -1841 -1675 2791
1201B791k451l339M209J318m947J106M431l267k850M621N46m823J784L830l613
$$ 2791 340 -2999 1210 2528 -2419 -1313 3118 -149 -2999 1622 2168 -2655 -871 2959 -654
1216f54j939M439l43m059K370K677l634o32L772j372k858K866J178l404P58K861
$$ -654 -2593 1846 1503 -2556 -186 2491 -1143 -1775 1997 625 -2233 633 1811 -1593 -835 2026
1232B026k358j468L162l64k976K067J845l165j15L333j721k507L143R45l719R88
$$ 2026 -332 -1800 1362 998 -1978 89 1934 -1231 -1346 1987 266 -2241 902 1847 -1872 -884
1248h84L314k691k009L745J59l859J727L008l206j459L873m72l566K157K421l271
$$ -884 2430 -261 -2270 1475 1634 -2225 -498 2510 -696 -2155 1718 1246 -2320 -163 2258 -1013
1264a013p45L529j017k851K407J510l022J24K809j573j816K471L71k570J068J871
$$ -1013 -1758 1771 754 -2097 310 1820 -1202 -1078 1731 158 -1658 813 1184 -1386 -318 1553
1280A553k128o29K441q03k004J989Q80k542N62K326j857j379K726k5k815J500
$$ 1553 -575 -1204 1237 434 -1570 419 1299 -1243 -681 1645 -212 -1591 1135 1110 -1705 -205
1296b05K160k653r06L165o55k918K030J950k967n55L175r43k666K158J580k793
$$ -205 1955 -698 -1604 1561 906 -2012 18 1968 -999 -1554 1621 678 -1988 170 1750 -1043
1312a043j78K760j121k035K025R24k301K86J983j290j137J781M2j700R41J038
$$ -1043 -1221 1539 418 -1617 408 1332 -969 -683 1300 10 -1127 654 696 -1004 -63 975
1328I75j573m2J598r51j073J677J58j885R49J512j842o24K303n32k186J670J445
$$ 975 -598 -640 958 7 -1066 611 769 -1116 -167 1345 -497 -1121 1182 650 -1536 134 1579
1345A579k438l38K661r43k292K000J368k627j75K658j017k101J931J151k319o
$$ 1579 -859 -1197 1464 521 -1771 229 1597 -1030 -1205 1453 436 -1665 266 1417 -902 -908
1361i08K170r87j504J614O06j751L41J387j050o90J306j75j104Q58N04j213K95
$$ -908 1262 275 -1229 385 991 -760 -419 968 -82 -772 534 359 -745 113 617 -596 -301
1378c01J106j036n63J518k54j537J157J083j820k27K066p82j826J692J083k302
$$ -301 805 -231 -794 724 470 -1067 90 1173 -647 -874 1192 410 -1416 276 1359 -943
1394i43o0K360j036j918J919J032k365O7K294j075j704J831Q11k070K15J804j044
$$ -943 -1003 1357 321 -1597 322 1354 -1011 -944 1350 275 -1429 402 1213 -857 -642 1162 118
1411A18j138J487K63j459N17R95j060k74J140n00p92J026J39j210O51R47j289
$$ 118 -1020 467 730 -729 -212 783 -277 -551 589 89 -703 323 462 -748 -97 850 -439
1428d39k72J620n69j492J422Q97j992J0K101j032j727J856R05k342J50K284j210
$$ -439 -711 909 340 -1152 270 1167 -825 -815 1286 254 -1473 383 1288 -1054 -904 1380 170
1445A70j711J979P94k280L13K082j228j380J826M19j890N53J447j257o76J489
$$ 170 -1541 438 1232 -1048 -735 1347 119 -1261 565 984 -906 -353 1094 -163 -839 650
1461F50k22j271R44N91j310K38J177j011o09J484k25j465J127R71j736j03J951
$$ 650 428 -843 101 692 -618 -380 797 -214 -823 661 436 -1029 98 1069 -667 -770 1181
1478A181q95j619J751Q34k258K23K194j292j662K069O80k392M46K170j455j408
$$ 1181 286 -1333 418 1252 -1006 -783 1411 119 -1543 526 1206 -1186 -740 1430 -25 -1433
1494a433K106L75k177P10J759j531q90J921j63j729J048J066j617j33J597q10
$$ -1433 673 1048 -1129 -419 1340 -191 -1081 840 677 -1052 -4 1062 -555 -688 909 99
1510I9j121J465K22j628P45J257j486m44J862n63j630J499R14k059J61K056j245
$$ 99 -1022 443 665 -963 -218 1039 -447 -891 971 408 -1222 277 1191 -868 -707 1349 104
1527A04j505K030N13k356O36K051j661j273K299J58k355J004J836j847q87K254
$$ 104 -1401 629 1142 -1214 -578 1473 -188 -1461 838 996 -1359 -355 1481 -366 -1253 1001
1543A001k24k057J265J353j898l43J984p25j541J493O51j811L48J548j231q22
$$ 1001 777 -1280 -15 1338 -560 -903 1081 356 -1185 308 959 -852 -504 1044 -187 -1009
1559a009J693j55j627J140J020j736m3J869j009j382J827M62k156O53J891j690
$$ -1009 684 529 -1098 42 1062 -674 -717 1152 143 -1239 588 1050 -1106 -453 1438 -252
1575b52j081K278p5k308J230J716k106o80K455n07k171J578J380k194k71K279
$$ -252 -1333 945 870 -1438 -208 1508 -598 -1278 1177 670 -1501 77 1457 -737 -1008 1271
1591A271q58j762J700Q18k038K55J783j192j096J715Q6j695Q53J164j519k66J692
$$ 1271 413 -1349 351 1169 -869 -614 1169 -23 -1119 596 682 -1013 -160 1004 -515 -781 911
1608I11p09j302J512M97j854N69J642j498r10K075j66k104J251J533k083n32K386
$$ 911 202 -1100 412 909 -945 -376 1266 -232 -1142 933 767 -1337 -86 1447 -636 -1168 1218
1625A218o55k111J713J278k344j09K392j063j828J953Q42k284L13K044j332j277
$$ 1218 563 -1548 165 1443 -901 -1010 1382 319 -1509 444 1286 -998 -685 1359 27 -1250
1641a250J892K29j911P76J377j512m97J721n05j378J298O22j670L68J522j256
$$ -1250 642 871 -1040 -264 1113 -399 -896 825 320 -1058 240 862 -808 -440 1082 -174
1657a74q39J795j20j809J118J322j908l70K171p19j900J672J112k280j9K305j109
$$ -174 -1013 782 662 -1147 -29 1293 -615 -985 1186 467 -1433 239 1351 -929 -948 1357 248
1674B48j763J965Q08k318L45K113j368j366K008L21k082P38J594j528p33J815
$$ 248 -1515 450 1258 -1060 -715 1398 30 -1336 672 993 -1089 -351 1243 -285 -1018 797
1690G97k77j589J127Q82j593O0J534r49r62J535Q8j620Q54J212j569l80J855n93
$$ 797 520 -1069 58 940 -653 -593 941 -8 -970 565 653 -967 -113 1099 -470 -850 1005 412
1708D12j637J481R31k016N4K035j082j547J844O71k183L76J989j335j296J929
$$ 412 -1225 256 1187 -829 -775 1260 178 -1369 475 1146 -1037 -661 1328 -7 -1303 626
1724F26L41k046O71J644j456q48J817j08j686R67J095j511k29J567o32j172J272
$$ 626 967 -1079 -408 1236 -220 -1068 749 641 -1045 -78 1017 -494 -723 844 212 -960 312
1741C12M19j480M34J235j136n73J496k69j404J087Q54j593k6J680q73j289J567
$$ 312 731 -749 -315 920 -216 -789 707 438 -966 121 975 -618 -644 1036 163 -1126 441
1758D41N24j871L79J709j243j112J785K44j894O78J527j388q23J754m4j668Q58
$$ 441 965 -906 -527 1182 -61 -1173 612 856 -1038 -360 1167 -221 -1044 710 666 -1002 -144
1775a44J170j408m07J532m01j242J045O21j326J15J209p89p47J227M1j224O60
$$ -144 1026 -382 -789 743 342 -900 145 766 -560 -445 764 -25 -772 455 496 -728 -68
1792f8Q76j157k38J324n15j075J145M84j465K74J362r97r08J499J69j617O23J323
$$ -68 808 -349 -587 737 222 -853 292 776 -689 -415 947 -50 -958 541 710 -907 -284 1039
1810A039j277p16J608o9j545Q10J118j309m55J494k90j285R25P53j251q0J221
$$ 1039 -238 -954 654 585 -960 -150 968 -341 -796 698 408 -877 48 801 -450 -530 691
1827F91n56q37R72K67j092L51Q64q40l71J067k38r36P65N58j118N4J106o56p84
$$ 691 135 -702 270 537 -555 -204 660 -180 -551 516 278 -658 107 665 -453 -399 707 51 -733
1846g33J074K40j248M02J068r56o23J298j9j316O76R77j157l85J315k36j189Q16
$$ -733 341 581 -667 -265 803 -153 -776 522 503 -813 -137 840 -317 -702 613 377 -812 4
1864DP76j170j67J197m24r14Q60M27j032J37R05o10n33Q70K8q61M50N94p86j44
$$ 4 780 -390 -557 640 216 -698 162 589 -443 -306 599 -11 -544 326 354 -507 -57 537 -249 -393
1884c93Q87l62o89P37L11r51K07Q65o66n46R51O6j006M49Q00q59l83J051j45r83
$$ -393 494 132 -557 180 491 -460 -253 612 -54 -600 351 417 -589 -140 660 -199 -582 469 324 -659
1904f59O39O65r57j91J047l30q49P56M58r56OR26m66o51P78K13q31K21O79n74
$$ -659 -20 645 -312 -503 544 214 -635 121 579 -377 -371 555 89 -562 216 429 -402 -181 498 -76
1924g6l39P31r1o60M71L77o90J5O77l86m78O58J20p39K89N91o19k83Q05j29p74
$$ -76 -415 316 225 -435 36 413 -277 -262 415 29 -449 209 329 -410 -121 470 -149 -432 373 244 -530
1945e30N38N18q13j29Q86l05p47O77M21q67kQ72m20o46P25K90q44J31P66m93n08
$$ -530 8 526 -287 -416 470 165 -582 95 516 -351 -353 519 99 -547 178 468 -376 -245 521 28 -480
1966d80P13J15p06K38N31n07k22N91j52m72M18K17n65J35M94m38k68O27p1o25
$$ -480 233 348 -358 -120 411 -96 -318 273 121 -351 67 284 -281 -146 348 -90 -358 269 198 -427
1986d27M27M28p02o0P71l24o44O60L55q69O2Q50m54o39P50L05q97J14Q28m83n74
$$ -427 0 428 -274 -334 437 113 -531 129 484 -385 -323 527 73 -566 184 489 -408 -294 534 51 -523
2007e23P46J96p95J91O53m88l85O46K8o11K72M12m97q7M89k11l58M60N2n20K73
$$ -523 223 419 -376 -185 468 -20 -405 241 269 -342 -70 342 -155 -242 247 36 -322 138 190 -330 -57
2028e7M10n24j34O67k33n92N61L56p83L9Q04m42o29P54K88r16J40Q52n23o15Q05
$$ -57 353 -171 -305 362 129 -463 98 454 -329 -290 514 72 -557 197 485 -431 -291 561 38 -577 228
2049B28K28q75J80P68n26m75P11J15p30K53N42n11k44N88r3n05L64K68n14O1M59
$$ 228 456 -419 -239 529 3 -472 239 354 -376 -123 419 -92 -336 252 159 -346 18 286 -228 -167 292
2070B92l49k45N29o7n37L95L58o24l4P07l26n82O42K95q14R0Q02m99n63P72J99
$$ 292 -57 -302 227 160 -377 18 376 -248 -282 425 99 -483 159 454 -360 -270 532 33 -530 242 441
2091D41q83K03P85n75m95P91J07q18L08O22n75l17O86o0n86L65L48n44k5N19k72
$$ 441 -442 -239 546 -29 -524 267 374 -444 -136 486 -89 -406 280 220 -366 -1 347 -197 -222 297 25
2112B5l58M83N3n08K33L98n09r4N93k22n04N21K72o91Q0O95m31n10P10J67q03
$$ 25 -333 150 203 -305 -72 326 -183 -277 316 94 -410 111 383 -308 -228 467 36 -474 236 403 -400
2133d00K11P05n68m25P56N7p79L35N92o25k63P39j18o47M33M00o28l7O19k96m35
$$ -400 -189 516 -52 -477 279 336 -443 -108 484 -141 -404 335 217 -430 3 403 -225 -262 357 61 -374
2154c74N24J23n77K10M46m67j89N85j51m99M44K67o18P5O01m01m04O39R0o98K71
$$ -374 150 273 -304 -94 352 -115 -304 281 130 -369 75 342 -276 -201 400 -1 -405 234 324 -374 -103
2175a03N85n91k92P30n5p31M18N10o63j85P48j99o40N29L40o89J6O68l56m74O02
$$ -103 482 -109 -401 329 274 -457 -39 471 -192 -377 371 172 -468 61 401 -288 -272 396 40 -434 168
2196A68J48o71K22N40m91k75O45r0n79M23L11n94J2N92l41m06O00P1o41K80N14
$$ 168 316 -355 -133 407 -84 -359 286 196 -383 40 351 -243 -231 361 20 -386 214 285 -356 -76 438
2217D38n67k33P23j47o69M95M21p19o6P68l13o27O12L15p65O8P09m19m89O49J51
$$ 438 -129 -362 361 214 -455 40 461 -258 -324 444 131 -496 116 431 -334 -266 443 24 -465 184 335
2238C35p17K30N79n25k81O67q2o17M03M18o21n9O36k85m65N34J61o34J99N40m99
$$ 335 -382 -152 427 -98 -379 288 206 -411 -8 410 -211 -270 366 81 -384 150 311 -323 -124 416 -83
2259h3k64O58j03o21M37M14o81o4P44l46n84O50K68p99J19P40m82m99P18J47p77
$$ -83 -347 311 208 -413 24 438 -243 -307 437 91 -493 157 425 -374 -255 485 3 -496 222 369 -408
2280d08K30O36n35l47O99k2o43L61M20n81q9O12k41m70N06J85o12J54N50m58l08
$$ -408 -178 458 -77 -424 275 253 -390 -29 391 -190 -279 333 92 -378 128 313 -299 -145 405 -53 -361
2301c61O22j4o20L51M38n96j31O66k24n59N26K86o87O4O73m24m64O62J29p29K23
$$ -361 261 247 -373 -22 416 -180 -311 355 131 -428 98 384 -303 -239 434 10 -454 208 337 -392 -169
2322a69O19n37l44O91Qo64L36M80n65j73O38j67n27M39K66n69O0N19l47l34N48
$$ -169 450 -87 -431 260 268 -396 -60 420 -145 -318 320 153 -374 65 331 -238 -178 341 -6 -340 208
2343B08L4n59K72M33n19j64O16j57n48M26L41o14l3O26k82m80N33J86o23J24N54
$$ 208 242 -317 -45 388 -131 -295 321 164 -384 42 383 -231 -264 362 80 -400 133 319 -304 -180 374
2364C74m18l37N91N1o29K86M86n23k20O34r4n72L80L50n28p4N59k35m18M54J64
$$ 374 -44 -381 210 261 -368 -82 404 -119 -339 295 201 -371 9 359 -169 -243 316 81 -337 117 281
2385B81n20J02M62l64k58N10k4m91L02L29m80r0N36k04m39M27K44n64L7N32k90
$$ 281 -239 -137 325 -39 -297 213 189 -302 0 329 -151 -241 295 91 -348 79 323 -241 -204 328 38
2406C8m04M86J49n51J31M66l55k66N03ln04K70L77m57j30N30j29m59L44K73m69
$$ 38 -366 120 269 -282 -151 315 -40 -306 197 194 -310 -40 337 -120 -250 280 151 -308 36 309 -160
2427a60l0M79k10l58L80J31m52J19L72l18k08M37l0m29K73K76m09n7M41j91l61
$$ -160 -190 289 79 -279 101 232 -220 -101 271 -47 -255 182 152 -277 -4 272 -137 -194 247 56 -305
2448c05L78J75m67N6M40k75l08M19J11m54J26L80l17j86M04k8l78K53K42l77n8
$$ -305 73 248 -219 -163 277 2 -306 113 224 -230 -104 276 -41 -227 177 149 -229 24 266 -111 -169
2469a69M22j70l50L38J85m27L5M04k39k85L62Q1l97J24L26k93j61L67l8l34K24
$$ -169 253 83 -267 71 256 -171 -136 268 29 -256 106 187 -210 -86 240 -53 -214 153 115 -219 5
2490EK08l31l1L56j74k69L38R0l93J21L33k92j95M01rl89K14K75l38j03L79r4
$$ 5 213 -118 -149 207 33 -236 102 192 -201 -80 253 -39 -234 167 158 -231 -17 258 -80 -183 196 102
2512A02l12K70J61l66M2L50k36k48L58P6l97J17L36k99j90L75ml66J97K41l00
$$ 102 -210 60 221 -145 -103 247 11 -237 121 197 -200 -83 253 -46 -236 139 135 -231 -34 207 -93
2533i3o7L37j24k58K60J19l27O2K96k35j68L58k7l61K31K52l67o6M11j32l60L22
$$ -93 -160 177 53 -205 55 174 -153 -91 205 -30 -198 160 133 -228 3 255 -112 -178 233 101 -259 63
2555F3J92m15K3L83k16k75L57Q2l83J38L07l10j78M09n2l63K25K64l77n4L76j33
$$ 63 255 -160 -137 246 30 -245 112 194 -189 -51 256 -54 -232 177 125 -238 -13 251 -126 -180 196 63
2577F3l06K97J38l58O6L11k29j91L52Ll65K15K63l53p6L96j34l56L42J81m44L6
$$ 63 -243 54 192 -166 -100 211 -18 -209 143 146 -219 -4 259 -94 -170 226 92 -264 78 259 -185 -149
2599a49M36k56l14M11J08m62J23L93l09k23M01jm10K27K75l80o0M04j71l08L49
$$ -149 287 31 -283 128 236 -226 -103 290 -19 -242 159 158 -252 -25 250 -130 -190 214 43 -265 84
2620H4J23m31J11L74k97k16M11Mm08K07L19l73r9M30j30l67L21K08m39K5M22k54
$$ 84 207 -224 -113 261 -36 -252 159 163 -245 -38 281 -92 -191 239 109 -258 63 271 -168 -143 279 25
2642B5l02M14Q6m53J45L84l39k21M49k6m34K45L07l92r6M16j29l42L17J69m23
$$ 25 -277 137 223 -230 -85 299 -40 -261 188 162 -272 -27 280 -112 -208 208 79 -263 54 223 -200
2663b00P4L78k80k17L92ol98K25L15l98r9M54j23m14L57K30m71L2M38k48l20M13
$$ -200 -126 252 -28 -245 147 141 -257 -32 283 -115 -214 240 117 -297 60 290 -181 -149 289 41 -279 134
2685A34R1m58J46L82l54j88M34l8m23K52K84m03o1M31j50l60L51J57m19N0L86
$$ 134 225 -233 -87 295 -59 -247 187 149 -274 -22 262 -141 -202 229 79 -281 70 227 -192 -142 244
2706B44k57k40L96J9m00J94L11l66j14M46j35l77L52J92m55M7M39k74l02M17R8
$$ 244 -13 -253 143 162 -238 -44 267 -99 -213 233 98 -279 73 265 -190 -143 296 22 -280 137 235
2727B35m78J66L82l50k06M51m4m25K63K81m16n5M25j73l36L53J40m20Q1L83k87
$$ 235 -243 -77 305 -45 -251 200 156 -269 -6 275 -141 -196 229 56 -280 73 213 -207 -126 257 -30
2748c0k23M24mm14K19K93l67j06M37j24l75L24K04m24L2M14k52k84L99P8m55J51
$$ -30 -253 171 167 -247 -28 265 -102 -208 229 105 -270 54 258 -166 -134 280 28 -256 143 221 -234 -83
2770h3L86l35k12M47k6m41K53K90m09p4M34j52l69L42J79m42O9L89k59k52M05
$$ -83 303 -32 -244 203 177 -264 -11 279 -130 -204 230 78 -291 51 230 -212 -143 246 -13 -265 140
2791A40L7m17J93L21l62j11M22j06l72L05K14m16OM10k22l01L86R1m26J20L66
$$ 140 177 -240 -47 274 -88 -199 223 117 -255 50 264 -152 -146 264 42 -259 127 218 -208 -88 278
2812B78l11j88M18l3m14K56K54l73p7M28j70l33L20J74m23M1M04k54k87M16N7
$$ 278 -33 -221 197 164 -250 6 260 -113 -190 238 68 -265 55 229 -194 -153 251 -3 -290 126 183
2833A83m19J54L50l33j67M31m8l94K47K62l80m0L90j71k96L41J08m01J04L41k97
$$ 183 -236 -82 268 -65 -232 199 151 -243 4 266 -114 -154 236 65 -231 110 218 -183 -79 262 -35
2854c5j96M02j5l89K11K76l63r1M14j33l38L03J89m11K8L85k35k65L77O6m22J48
$$ -35 -231 171 156 -233 -22 254 -109 -200 214 81 -257 46 235 -176 -148 237 2 -263 114 180 -242 -94
2876i4L61l42j74M35m2l96K37K90l66j05M27j23l47K99J77l81J3L80k14k54L47
$$ -94 267 -75 -249 186 144 -252 -15 275 -91 -196 231 108 -239 60 237 -144 -131 249 35 -219 128
2897A28N2l80J53K93l20j39M01q5l57K82K22l92k3M05j94l09L58J26m30R5L76
$$ 128 180 -200 -47 246 -74 -213 188 103 -254 28 250 -142 -165 240 46 -263 95 221 -209 -114 262
2918B62k79k32L97J4l94J88K99l52j15M25r7l73K91K35m07l1M21j72l16L18J55
$$ 262 -17 -249 148 162 -232 -44 255 -97 -212 213 116 -257 34 269 -138 -169 252 80 -236 82 237
2939B37l96N3L53k49k06L37J6l60J84K55l25q5L66j09l16K94J60l76L6L64k32
$$ 237 -159 -106 247 -2 -208 129 145 -215 -31 224 -101 -186 180 71 -245 49 209 -167 -131 233 1
2960Ak47L65P3m11J40L49l05j95M00j2l76J92K78l47p6L78j04l27K90J68l79J6
$$ 1 -246 119 192 -219 -79 270 -35 -230 170 158 -218 -26 252 -95 -171 207 103 -224 66 234 -145 -129
2982a29L74k10k69L25J03l74Q4L11k44j51K98rk97J77K09l11l2L20j44k50K80
$$ -129 245 35 -234 91 194 -180 -96 215 -29 -180 118 109 -188 -11 198 -113 -145 175 31 -219 61
3003F1J25l55P1L24k47j99L56L0l76J74K80k99j43L73m3l44K26K02l12l9L12j34
$$ 61 186 -169 -98 226 -21 -220 136 166 -210 -36 244 -55 -198 175 132 -212 14 216 -96 -135 177 43
3025D3k36K75R5l36Q4K71k13j85L17Rl34J52K55k59j16L32p9k61K03J48k85lK87
$$ 43 -193 82 177 -159 -75 196 -17 -202 115 124 -210 -58 197 -62 -178 154 75 -186 17 165 -120 -123 164
3048A64j57j83K69M4k96J10K59k52j20L15l4l18K12K04l04o2L37j16k76K47J46
$$ 164 7 -176 93 137 -159 -49 210 -42 -162 153 119 -199 13 217 -87 -149 188 72 -204 43 189
3069A89l18K3K96j88j92K78L2k96J36K25k66q6L16o3k86K15J70k89k1K89j23k23
$$ 189 -129 -106 190 2 -190 88 120 -176 -40 185 -81 -167 149 86 -200 15 185 -104 -125 164 41 -182
3091a82K42P9k68O3K28j82j30K65j9k57J81J49k56l3K96j24k35K41J31l22L8L01
$$ -182 60 139 -129 -66 162 -20 -150 115 96 -161 20 169 -87 -120 176 52 -183 58 189 -133 -95 206
3113B06k02k13K92O0l19R6K72k45j33L07k8k79J74J90k82l0K94j03k31K49R6k95
$$ 206 4 -209 83 143 -176 -80 192 -53 -186 121 93 -186 -12 178 -104 -134 160 57 -174 75 171 -124
3135a24N0K60j93j58K71J5k66J26J91k38n4K61r6j99K24R5l01O8K67j95j82K95
$$ -124 -74 186 -7 -165 106 121 -145 -19 172 -66 -120 141 45 -154 70 165 -136 -68 199 4 -178 117
3157A17K4l09J17K62k67j28L18k8l01J62K16k74n1K94j01k33K24J14k83L9K67
$$ 117 141 -168 -51 211 -56 -184 134 106 -195 -33 183 -91 -142 152 51 -182 42 156 -127 -88 179
3178A79j78j59K66K4k70J11K19k37q7K84p2k40J91J29k59K0K46j59j67K58K4k74
$$ 179 1 -158 108 132 -138 -27 192 -45 -132 152 80 -160 31 160 -99 -79 167 8 -159 99 123 -151
3200a51J13K24k50r8L08o3k83J98J98l02n5L30j11k51K17J38k81J3K75j62j67
$$ -151 -38 186 -64 -162 146 83 -200 -2 196 -106 -161 169 58 -193 24 162 -119 -106 169 7 -160
3221a60K42N3k59Q4K14k09r6K65l9k47J76J47k50l0K65j29j86K12P0k52O7K13
$$ -160 82 135 -124 -40 174 -35 -131 134 95 -152 24 171 -79 -109 156 27 -159 53 123 -129 -62 151
3243A51j91j14K80n0k55J75J62k65k6K99j25k43K55J12l02K4K96j68k08K72O6
$$ 151 -40 -154 126 76 -179 -4 158 -107 -133 166 41 -202 53 165 -137 -113 183 15 -193 79 145
3264A45k84O9K39j86j13K38j2k21J44J36k23j7K28j09j78K06O6k54O8K24j90j25
$$ 145 -139 -70 169 -17 -130 108 96 -125 19 155 -68 -85 143 34 -144 62 128 -126 -58 166 -24 -149
3286a49K56j7k48J43J69k32o7K85r9k21K27J02k70K3K67j51j97K61N5k91R9K51
$$ -149 107 90 -158 -15 154 -78 -145 140 41 -180 47 149 -121 -98 169 18 -179 82 137 -154 -55 196
3308A96k11j39K68Kk58J35J84k23n1K29q1j74J66P6k12N5J88j76j03K32j7k41
$$ 196 -15 -154 114 116 -142 -7 177 -46 -97 132 51 -123 43 119 -93 -38 150 -26 -129 103 86 -155
3330a55J36J74k38n3K65q5k34K24R5k47K2K66j54j86K41O5k68P4K42k09j21K69
$$ -155 -19 155 -83 -136 129 44 -190 34 129 -118 -96 170 16 -170 71 136 -132 -58 184 -25 -146 123
3352A23nk51J24J81k12p2K50o5k08J68R6k16K0K07j43j23K05Nk00J12J46k02m3
$$ 123 118 -133 -9 172 -40 -112 138 73 -135 33 129 -87 -67 140 -3 -126 79 84 -116 -4 142 -60 -103
3375a03K14q1k03K01J02k50K8K39j41j71K33O7k65P4K26j85j25K45j0k23J32J62
$$ -103 111 30 -173 28 130 -120 -92 147 6 -165 68 135 -130 -56 170 -15 -140 105 95 -128 4 166
3397A66k17o8K68p1k18J82J14k38kK18j27j53K06M8k26Q4J66j75o6K14n9j89J57
$$ 166 -51 -119 149 78 -140 42 156 -82 -84 134 7 -146 60 108 -118 -34 132 -43 -109 105 46 -143 14
3420A4J13k20LK19j21j68K23N3k40Q0K03k02r0K46j7k40J38J77k21m8K42p3k02
$$ 14 127 -93 -90 129 8 -160 63 116 -124 -44 159 -43 -133 113 96 -144 -6 171 -50 -98 144 71 -131
3443a31J68J13k20oK22j24j69K02O0k34N7K08j68j08K03kk02J24J27j90j7K08
$$ -131 37 150 -70 -76 146 22 -147 55 115 -119 -62 146 -22 -130 73 71 -131 -7 120 -70 -87 121
3465A21j14j49K00N6k34O1K20j78j31K55jk56J24J87k16p1K64o4k18J65J45k38
$$ 121 7 -142 58 114 -120 -59 161 -17 -148 107 106 -150 -26 161 -55 -126 138 74 -144 21 166 -72
3487g2l2K48r1j90J93P4k36M1K02j37j34J99J5k13J00J53j81n8K15n9j68J52Q8
$$ -72 -104 144 53 -137 56 130 -106 -65 137 0 -134 65 80 -133 -33 120 -61 -119 96 37 -131 21 109
3510A09k05L2J89j25j26K03L3k33R6J87k08p7K35j1k45J51J58k18o5K58q0j99
$$ 109 -96 -64 125 0 -126 77 110 -123 -27 160 -48 -125 110 99 -146 5 163 -55 -120 138 58 -141
3532a41J67J22k18k1K24j17j31J68M2j92M7J55j36p6J90l3j83J36Q9j72jJ99j08
$$ -141 26 148 -70 -91 133 16 -115 53 95 -97 -50 105 -31 -107 83 50 -133 3 92 -80 -81 118 10
3555A0j35J78N3k04O4J81j51j00K01%k12J13J57j89q0K23m0j97J34J31j97l2K13
$$ 10 -125 53 106 -98 -34 147 -4 -104 97 97 -115 -2 155 -34 -114 109 69 -128 6 137 -60 -92 121
3578A21p8j65J46R1j97J5J78j17r9J58J3j69Q1J21j58l6J82p1j38J43Q2j78J3
$$ 121 43 -122 24 115 -82 -67 111 -6 -105 53 66 -103 -22 99 -59 -95 87 16 -122 21 103 -75 -62
3601f2J87j10j16J68K7j82O7J61j57p8J92l0j84J25J17j80l1J92o8j53J36Q6j95
$$ -62 125 15 -101 67 94 -88 -21 140 -17 -95 97 67 -117 8 125 -55 -86 106 38 -115 21 107 -88
3624h8J5J81j05j23J62L9j80P0J33j33o9J58k0j53J11J01j67qJ72p0j34J62N4
$$ -88 -73 108 3 -120 42 81 -99 -29 104 -29 -98 60 40 -113 -2 99 -68 -76 96 26 -108 54 108
3647A08j79M1J67j33r1J65Lj78J07J13j71l3J79n3j56J24P9j67oJ80j10j06J66
$$ 108 -71 -30 137 4 -87 78 81 -97 10 123 -48 -81 98 45 -111 13 92 -75 -81 99 -11 -117 49
3670D9K2j73N9J51j24q7J67qj63R8J00j39m2J83o6j39J46O2j68K6J54j10r6J62
$$ 49 71 -102 -43 108 -16 -103 64 56 -107 -9 91 -48 -90 93 27 -112 34 96 -72 -46 108 -2 -98 64
3694F4K1j70P1J39j46n8J86l0j80J14R3j62l1J86r0j30J45M6j74N1J54j28p4J76
$$ 64 85 -85 -14 125 -21 -79 107 77 -103 11 104 -58 -89 97 7 -123 22 68 -106 -55 99 -29 -103 73
3718G3j5j62Q2J39j58n5J79m6j42J13Q8j60J5J53r2j06J54K1j69O7J38j44p2J92
$$ 73 58 -104 -22 117 -41 -96 83 37 -105 8 96 -64 -49 104 12 -94 60 81 -88 -21 117 -27 -99 93
3742I3k3j79J20J13j76k7J80p7j53J51P3j91J6J73j06j11J74K3j92Q3J43j46o9
$$ 93 70 -109 11 124 -52 -79 101 24 -129 22 95 -96 -80 93 -13 -124 50 73 -119 -36 107 -39 -108
3765a08J90l5j57J31R0j73rJ82q5j26J63M1j88O5J34j34o5J72k6j61J22Q4j69
$$ -108 82 47 -110 21 111 -62 -71 111 26 -100 63 104 -84 -19 115 -19 -84 88 62 -99 23 107 -62
3788f2j7J92q6j48J59P5k07RJ96j22j34J80M1j79M8J75j40q2J71pj70J05J17j68
$$ -62 -79 113 27 -121 38 113 -94 -85 111 -11 -145 35 76 -103 -55 120 -20 -102 69 62 -108 -3 114 -54
3812e4j1J72o6j28J34N4j76M2J58j24j01J75j4j53P8J28j69l2J91p5j55J51Q1
$$ -54 -65 107 41 -87 47 101 -75 -33 125 1 -100 75 61 -92 -14 114 -55 -87 104 29 -126 25 106
3835A06j94L6J66j19j26J76L2j96O4J72j48r4J92%j78R6J23j50m0J71n0j43J36
$$ 106 -88 -52 114 -5 -131 45 77 -119 -55 117 -31 -125 67 67 -111 -15 108 -42 -82 89 39 -104 32
3858C2P0j69K8J48j02q5J53mj64Q5J18j57m6J79m0j59J27Q9j78QJ67r8j20J72
$$ 32 102 -67 -39 109 7 -78 75 71 -93 -8 110 -47 -93 86 46 -113 14 103 -75 -67 100 2 -118 54
3882E4L5j92O1J46j43o6J71j1j84J18J23j66l2J81n0j60J27R3j65OJ60p4j19J49
$$ 54 89 -103 -42 104 -39 -105 66 55 -129 -11 112 -54 -86 95 45 -115 12 105 -60 -54 106 32 -87 62
3906F2K5j54O7R7j06n6J43m4j17J08N7j44MJ44q4j11J46L7j74P0J28j26p4J82
$$ 62 87 -67 0 97 -9 -65 78 34 -83 25 82 -62 -58 86 2 -109 37 74 -100 -30 98 -28 -102 80
3930H0l7j51J02J16j60l1J74m6j52J22R9j83J1J62q5j26J56M5j53L9J23j01o9
$$ 80 43 -108 -6 110 -50 -81 93 47 -105 17 116 -67 -56 106 21 -105 51 96 -57 -18 105 4 -65
3953f5J32k0j21Q4O4j19JJ26r6p7J30J4j46O3J24j39m5J53rj49R2J08j50l0J64
$$ -65 67 47 -74 10 74 -45 -44 82 -14 -91 39 53 -93 -30 94 -45 -90 63 54 -95 -3 105 -45 -75 89
3978H9l0j55J23Q5j72kJ64p7j11J29M3j53L4J42j02p4J39pj39Q2Q1j19pJ05n0
$$ 89 59 -96 27 112 -60 -62 102 25 -86 43 86 -67 -33 109 7 -67 72 65 -74 8 89 -30 -37 68 18
4003A8q4Q9L5j23L1J08j07m5J32j7j32R6Q8j34k9J51l7j38J22P9j50PJ45p9j01
$$ 18 -66 23 58 -65 -34 74 -33 -78 54 37 -95 1 89 -45 -74 77 40 -98 24 103 -47 -40 105 26 -75
4028g5J18N0j54M0J15r2p6J38Jj33O3Q9j06m7J36l5j17R9N4j20LJ13n8r1J16K2
$$ -75 43 93 -61 -21 94 2 -74 64 65 -68 -5 84 -22 -69 67 32 -85 14 68 -52 -49 64 6 -85 31 53
4054E3j28N4R2j04m0J28j3j26R0P9j35rJ47m7j19J11N3j28QJ29q3q6J26J9j34
$$ 53 -75 -21 71 -33 -73 55 42 -84 6 85 -50 -59 88 41 -78 33 86 -42 -34 95 12 -74 52 71 -63
4079f3M2J10j09m5J27k7j12Q3O5j21mJ13n7r1R9N6j28K4J13q0p3J14J0j17N6Q4
$$ -63 -21 89 -20 -65 62 35 -77 6 71 -50 -54 59 2 -89 10 66 -62 -38 75 -5 -78 36 46 -71 -15 69
4105F9r1l4J19k8j06R0P4j25j0J27o4p4Q4M9j29K7J15r3n6J03J4j24N4P9j00l3
$$ 69 -22 -56 63 35 -71 19 93 -32 -42 85 21 -53 31 80 -49 -22 93 0 -56 47 61 -63 -9 70 -30 -63
4131f3J18k8j02P2P1j24KJ16n8p8R5L6j12K9R7q3n6J17nj05O1P6r2j3J01k8j00
$$ -63 55 27 -75 -3 68 -56 -54 62 4 -74 21 57 -55 -26 71 -12 -68 49 44 -61 0 76 -16 -29 72 44 -56
4158e6P6N1j09J5R8n8p0J00J1j19N2R4j04m8J04j0j09P1P9j20j3J12k4j11J04
$$ -56 20 71 -38 -23 75 17 -53 47 58 -61 -9 85 -19 -67 37 27 -82 -11 68 -52 -65 47 23 -88 16
4183A6L7j11K2J03o7p6J07J1r2L6Q2o9m2J01j2r5O4O4j01j1J11n6o8P5L5r9J6
$$ 16 53 -58 -36 67 0 -76 31 42 -50 -14 68 -1 -43 58 46 -49 15 79 -22 -33 78 22 -46 29 64 -35 -19
4210a9Q7p6n8J05nj08O7O7j06k3J23k4j17Q0O5j22J7J19o7p8R8L2j21L6J10r4
$$ -19 68 -8 -66 39 34 -74 -7 60 -46 -69 54 30 -87 -7 58 -64 -47 72 5 -73 25 57 -64 -28 82 -12
4236a2m0J10nj06O3Q1j03k2J04m2q3P7N1j18J7R4o4o7J00Lj02M5P9q4m0J05k7
$$ -12 -52 58 53 -53 10 91 -12 -34 70 28 -55 22 73 -45 -28 66 2 -65 35 38 -64 -19 60 -24 -64 41 14
4263A4j00Q9O5j36K7J01n8q3J08L3j28M4J09p9o8J16Oj21O1R8j11l6J25m3r7Q3
$$ 14 -86 3 68 -68 -41 60 2 -81 27 60 -68 -24 85 6 -62 54 60 -61 0 98 -13 -49 76 33 -64 19
4289A9M8j01J3J01o6p6J03J0j05M5O6r0l3J12l5q7P3N1j05RJ06o3p3J09K2j20
$$ 19 67 -34 -21 80 14 -62 41 51 -54 -9 57 -33 -66 46 11 -76 -3 48 -57 -48 58 -5 -78 31 53 -67
4315f7N1J07j00n9J36j8j23P4R9j22l2J35m6j00Q7O1j16j0J13m5r2R7M2j31L7
$$ -67 -16 91 -9 -68 68 50 -73 1 100 -22 -54 81 35 -65 22 83 -33 -43 70 25 -67 30 72 -59 -22
4340b2J02r8m7J08j5r0O3N5j03oJ18n7q6R3L6j21N5R2r8m2J25k1j11P8Q0j05l4
$$ -22 80 -18 -65 43 28 -62 1 56 -47 -53 65 8 -78 15 51 -70 -15 77 -21 -63 62 41 -70 8 88 -17 -51
4367e1J36m1j10R4O0j32KJ24o8r1J12L2j28L1J08q5n7J05nj01N9O4q8l3J13m1
$$ -51 85 44 -66 28 88 -44 -42 82 14 -77 35 67 -61 -30 78 -7 -64 41 36 -65 -6 58 -30 -63 50 9
4393Iq3R2L3j16M0Q3p1m3J11j5j05O8Q0j09j9J35m2j15J06O5j39%J22o7r4J13
$$ 9 -74 18 51 -65 -25 58 -13 -56 55 40 -65 3 83 -26 -45 90 48 -67 39 104 -35 -35 87 20 -74 39
4419C9K5j17J7J11q3n3R4J2r9M4O9q8k9R3l5o3P8L8r3J7P9o5m4R3j4q4O1P3j10
$$ 39 64 -53 -36 75 -8 -61 33 45 -54 -10 59 -29 -58 35 0 -63 15 53 -40 -23 56 -9 -53 40 26 -58 3 76 -34
4448c4j3J30m3j01R5L7r9nJ19o4q1R4M1j17J0J09q2n9R8Mj10N2P1q5j6Q4k6o0
$$ -34 -47 83 40 -61 34 71 -28 -33 86 22 -59 35 76 -41 -31 78 -4 -63 35 39 -71 -19 52 -33 -49 35 9 -51
4476e1N7K8p7K4O6n9l1Q8j9p7O7M6p7j4Q8l6q6Q8N2j21K5J01p5n2Q5K2j06L1Q0
$$ -51 6 34 -43 -19 47 -12 -43 45 26 -51 16 62 -15 -29 59 23 -63 25 77 -44 -19 82 7 -45 40 62 -44 -13 67
4505F7o7o0R6Qr0L4O5p5k8R3k2q0N7L8q0K0N7m4l1Q0kq0M2O3r1nJ01m4o4P4K8
$$ 67 0 -60 36 44 -46 -12 53 -22 -50 43 21 -59 -2 36 -44 -24 33 -11 -42 38 36 -44 -2 61 -30 -35 66 22 -42 32 60
4536F0q3JQ9n3o2Q9K5j03J5Q8p4m5Q4J1r1M2M9n8l1P5j0o6M8M1q9PP0m8m0P0Q
$$ 60 -23 -22 67 14 -48 41 66 -37 -22 66 -8 -53 31 42 -49 -7 42 -16 -47 28 18 -48 0 41 -48 -41 29 -19 -59 11 19
4567A9p1M4N5o0k1Q7k7o5O2M7j01PQ3m9n8Q0J7r0J8Q1n5m9Q3Qj06M7P0p7l6Q7
$$ 19 -52 -8 47 -13 -34 53 26 -39 23 70 -31 -24 59 10 -48 32 49 -41 -23 58 3 -46 37 45 -61 -14 56 -21 -57 30
4597C0k1o0L6O0q0pO7l0n6P6J6o1J8L9n0j3P4ro6L8N5o6j6P3k2o7N7M1p7NP8n6
$$ 30 9 -51 -15 45 -35 -42 25 -5 -61 15 31 -30 -12 27 -23 -36 38 29 -37 1 56 -10 -26 47 25 -42 15 56 -21 -16 62 6
4629Fn1P3K0q8J9P4o8m4P8J1r5O2M0o0k8Q7l1p7P0L3o5j3P9m3l4O9Qp1L0N9n4
$$ 6 -45 28 48 -40 -21 53 -15 -59 19 30 -65 -3 37 -23 -51 36 5 -72 -2 31 -34 -47 32 -11 -45 24 32 -39 -9 50 -4
4660dl1P8mq5N0M7o3j4O5k5n8O5L3r4J5P9n9n0P7Qp9K0P3p0m6R5kq4N1M7p0mP6
$$ -4 -35 43 39 -46 4 51 -12 -26 39 14 -44 21 54 -40 -25 54 -5 -55 22 30 -49 -29 44 -26 -72 23 21 -63 -12 35 -35 -39 37
4693C7l0p1P5L7o3pQ0n2l9P2Po4K0O2o8l1P3j3n9M4M0o8mP4m5o4Q1Np3K3O6o8
$$ 37 7 -64 11 48 -15 -22 58 6 -33 39 46 -18 2 64 -4 -35 38 25 -34 10 50 -18 -22 52 7 -57 24 29 -44 -21 45 -23
4725b3l5P8Jp8L4O0o9k6R5k5q2O7N3q3qR3l7n6P1K2p8J9P3o1m0Q2j2p2L7N5p2
$$ -23 -58 20 21 -57 -23 37 -32 -58 37 12 -70 -3 50 -33 -41 52 15 -41 30 52 -26 -7 66 5 -35 47 35 -37 0 55 -17
4756a7pO8k2o3M6L7p4QO7n3m1P1lo3K9O2o9j6P2k0p7N9N9r4QP6k2o2O7L6q9J9
$$ -17 -24 44 22 -41 5 42 -32 -24 43 -10 -51 20 17 -46 -17 45 -24 -40 32 12 -65 -6 53 -41 -33 43 21 -41 26 62 -27 -8
4788hO7m8l7O4ko5L3M7o4j7O1j7o4N6M0q5J3P5n9m3P4Kp6L0O2p6qQ4k5p7P0L0
$$ -8 59 11 -26 38 36 -29 4 51 -13 -30 31 14 -50 6 46 -39 -26 49 -10 -53 21 23 -53 -23 39 -37 -45 39 14 -63 7 37
4820C7p1OP6m8n1P8J4p4K4O9n6l7P8Oq9M4N6p4k6Q3k3o1M6L5p6J0O2n6l8N9K0
$$ 37 -34 -28 48 0 -51 27 41 -33 -9 60 4 -33 45 51 -38 6 62 -12 -38 45 22 -39 7 42 -34 -24 38 -18 -56 3 23
4851B3q0M0M6n5j9P8k2p1N7M4q5PQ7o0m4P6K9r9K5Q1n9m3R3qq6N8N8j05oQ9l1
$$ 23 -57 -17 29 -26 -45 33 11 -60 -3 41 -44 -37 50 -10 -54 22 51 -48 -23 58 -1 -44 49 41 -45 13 71 -34 -40 49 18
4882A8o1N0L6p1mP3l9n2P0pp0M6M2n3k3P6k3o8O0L1o7J2P4m2o4Q2J2q7K8P6o1
$$ 18 -43 7 43 -28 -32 41 2 -50 20 13 -57 -11 31 -22 -45 31 8 -60 0 31 -36 -24 50 8 -56 26 38 -49 -21 55 -6
4913fl8R7j5q6N6M5o8j8Q3k3p2N6M1o7j7P9m5n5O5K4q9L5N3n4l4O8j1o7M3N0p3
$$ -6 -44 53 38 -48 8 53 -15 -33 50 27 -45 11 52 -15 -32 47 2 -53 12 36 -53 -18 35 -19 -53 15 4 -63 -20 30 -43
4944d3OO7l9l7O4J9q0L2P0o6l2R0qq7N4O2q6j3P8j9p2O0L9q6%O4k5o8P0J9p2J5
$$ -43 -37 30 -9 -46 18 37 -43 -11 59 -7 -39 51 43 -44 10 72 -14 -27 51 32 -40 20 59 -27 -27 37 12 -56 14 33 -39 -24
4976b4N1m5l4O1kn3K1M1m2mM8j9m0N7J1o2J4N7l7k9N8Ko2L0N2n4k2P4k4o0N2L4
$$ -24 27 -18 -52 9 7 -46 -25 16 -26 -30 18 -1 -41 16 27 -35 -21 36 -1 -30 28 30 -32 -2 50 -4 -26 48 24 -36 16 50
5008E0o2j3P4l6n3M1L1n8OM6l6l6N4Jm8K3L5m6nM9j7m3M9Pm1J2M9l4k5M0%m1L9
$$ 50 -12 -25 49 13 -40 1 32 -26 -20 26 -10 -46 8 9 -39 -16 19 -27 -32 17 0 -43 6 13 -28 -16 33 -1 -26 14 14 -27 12
5041A2L3n5oM4ln6L9L1o1MN0k3m7M3K7n9MN6l8m6O3J2n8J5M5n2j3M1Kl4J9J7l5
$$ 12 45 -10 -16 28 25 -31 8 39 -22 -18 32 9 -38 5 32 -27 -23 33 -5 -51 12 24 -34 -19 26 -26 -39 2 4 -30 -11 6 -29
5074b9QL8nl9N4kl3J0M1m6j3N0j5l6K9L0o0OM0k4l5M8J2n5NM2k5m4O3On5J6M3
$$ -29 -21 17 12 -27 27 25 -8 2 43 -3 -16 34 19 -17 12 42 -18 -12 28 4 -31 17 29 -26 -21 21 -4 -48 15 21 -34 -18 25
5107B5l6l0M3Rm9K3L7l4j1L2pk2K6J0j5lL1l2qM3pm4L1K6n2NM4l4l2N3J0o1MN4
$$ 25 -11 -41 2 11 -38 -15 22 -12 -23 9 2 -20 6 16 1 -2 29 -3 -11 32 25 -19 12 38 -14 -9 35 1 -31 22 32 -29 -25 29
5141B9k3m1L6J3m9kN9l6m1O2Mm8J8M6l5k9M9j5k0K7J7l1NL0j8k3L0J1m6K8L0m6
$$ 29 6 -35 1 14 -35 -37 22 -14 -55 7 11 -37 -19 27 -8 -37 12 -3 -23 4 21 -10 -5 25 7 -16 14 25 -21 7 37 -9
5173ij3N6j8k8K8K2n5KM9m5m2O6Rp5J9N2l1m2O8Mo0RP1m0m2N6Pn9K4M5l7j8O4
$$ -9 -22 34 16 -12 16 38 -17 -15 34 -11 -53 13 22 -53 -34 18 -13 -55 13 17 -43 -34 37 -3 -45 11 18 -41 -17 28 -9 -27 37
5206C7k5m1L7J7l9J5L4m0j5N1rn6M3L1m3j3N8k2n7N2J6o6QO1m8l3N0J9o8L5M8
$$ 37 12 -29 8 25 -14 1 35 -5 -20 31 22 -34 9 40 -3 -16 42 20 -37 15 31 -35 -27 34 -14 -47 3 22 -46 -11 37
5237C7n0m0P0Lo3K8M3m0k9P3j0n1L8K9m6kL7k7j4L7%n0K3M5o3lO1k8m6N7J4o2
$$ 37 -13 -53 17 20 -43 -15 28 -12 -41 32 22 -29 9 38 -8 -10 27 0 -14 23 23 -27 -4 41 -22 -25 36 8 -38 19 33 -29
5269b9kO5m8m2O2J3o7K3N5m8k4O0kp1M1M3n0j6O6j3n4L7L8n6mN8k6l4L7K6o0J6
$$ -29 -31 34 -14 -56 6 19 -48 -25 30 -18 -42 18 16 -55 -14 29 -21 -37 29 16 -38 -1 37 -19 -23 35 9 -25 12 38 -22 -6
5301fL5l4k1M5j6k0J4L2n9OM9l9l3O2J0p1J7O2n6k4N2J4o3K9N0m9j4M7rm4L7L2
$$ -6 29 -5 -26 19 3 -17 -3 29 -30 -24 25 -14 -47 15 25 -46 -29 33 -23 -47 5 19 -44 -15 35 -14 -28 19 10 -34 3 35
5333C5n5MN7l3l5L6K4n1K0L4k5l6M2J0m6J9K9n3PM1k9k7L1Mm7K5M9n5k6O7nn3
$$ 35 -20 -16 41 8 -27 9 33 -18 2 36 11 -25 17 27 -19 0 29 -24 -17 24 -5 -32 -1 3 -44 -19 30 -25 -51 16 11 -42
5365d2K6M4m6qO0j1o7M1L8m6JM5k7l2L8J4m0J6L4m0j6M7nm6K6K8m5j0N1j4l9K4
$$ -42 -16 28 -18 -26 34 23 -44 -3 35 -11 -10 35 8 -24 14 28 -12 4 38 -2 -18 29 24 -22 4 32 -13 -23 28 14 -25 -1
5397aK0l8j0L7j6j8L1qk9J4L2m4%O0k0m5M3K4n0lN1j2m7M3J8l5J1L2l1k2K7Rl7
$$ -1 19 -19 -29 8 -8 -26 5 -3 -32 -18 14 -30 -30 30 10 -35 8 32 -18 -21 30 18 -29 14 32 -3 8 40 9 -13 14 23 -14
5430a4J5J8l1LK0pk1J7J7m8RL6k5l6N0Kn2L1K6k7j2M6k5l1N5ok6kM4k1l1M9Pm4
$$ -14 1 19 -12 -9 11 4 -17 0 17 -31 -22 14 -11 -47 3 5 -47 -16 10 -17 -29 17 -8 -39 16 10 -16 -18 26 5 -26 23 30 -14
5464a4J7M2l9k3L1J7n6J5L2k6j2L4ok8K2jk1LL0k8j6L6ol7K3J7k7j4N4j5k3J9
$$ -14 3 45 6 -17 14 31 -25 -10 22 -4 -16 18 12 -16 6 5 -16 -13 17 -11 -27 9 3 -34 -11 6 -21 -35 19 4 -19 0
5496@K0l4oM9k2l6N0Rm3K0L4l9lM1qn1L5K4l7j7M6j4l4J7J1k6pL0rk2J6Nk7K0
$$ 0 20 -14 -20 29 7 -29 21 30 -13 7 41 2 -1 40 32 -19 16 40 3 -14 32 18 -16 1 12 -14 -21 9 0 -22 -6 -1 -28 -8
5530hLj9jL0j2k0K4L0l7NM0k9l0L3K6m9J5L8l4j7K9Mk6J8K1l1j1K3ok6PK7l8m
$$ -8 -5 -24 -25 5 -7 -27 -3 27 -10 -5 35 6 -24 9 35 -14 1 39 5 -12 17 21 -5 13 34 3 -8 15 9 -17 -10 17 -21 -25
5564b5M9k5k3K1J2l4mL7j2j9J7Pj3JK7l5NK6pj9K6Mj9J2K2j9k4L1Qk8MK6k4mK5
$$ -25 24 -1 -24 -3 9 -25 -29 8 -4 -23 -6 1 -12 -11 16 -19 -14 12 5 -14 12 16 -3 9 31 12 -12 19 27 -1 3 29 5 1 26
5599B6ol2J5J1k3j3L6j3k4K0J8l9KL8j9l1L8%k7kL3j4j7L2jk4J6K2k2LJ8j0j7
$$ 26 20 -12 3 14 -9 -22 14 1 -23 -3 15 -24 -22 16 -3 -34 4 4 -23 -25 8 -6 -23 9 8 -16 0 22 0 3 21 11 -6
5632fK8mj8J6K8l8qK7nl4RK9l4oK2ml0K5J3l0jK3oj9K1Ml1K5J3l2rM9ol6J2L0
$$ -6 22 18 0 16 44 6 -2 25 20 -14 -5 24 -10 -16 6 2 -28 -3 10 -20 -21 2 -4 -23 -2 2 -29 -4 9 -23 -32 17 11 -25 -13 17
5668A7j6j5K7Pl8K2J7k9OL2k9kK7j0k9K1K3m2KK6om5L6Ol1KL6j6k3K5Rl1OK9k2
$$ 17 1 -14 13 20 -18 4 21 -8 -2 30 1 -1 26 16 -13 8 31 -11 -9 17 11 -34 2 8 -23 -21 15 -1 -24 1 10 -21 -15 14 -8
5703hk0L7Jl9K1K3rk6M4ok9L1J4k9JJ6j0k0L3Jk9QL3m3oL1j4l0K4L1m8lL8k6k5
$$ -8 -28 9 10 -29 -8 15 6 -20 24 18 -11 20 34 5 6 22 12 -8 25 26 -3 5 38 -5 -11 20 6 -24 0 31 -17 -20 18 -8 -33
5738c3L3K8n1kM3k5k0K5K4m8OM0j8k2M1Jm5L7K5l1rL7j0l1K8Nk9MK7k3k6N1j5
$$ -33 0 28 -23 -25 18 -7 -27 -2 22 -26 -20 20 2 -20 21 22 -23 14 39 8 -1 36 26 -5 23 28 -1 3 30 7 -19 32 17
5771A7k6RK2m1NK5j5k4K4J2m3J7L8l0l1M8jm1K3K5k9j0N0ql9L1K4m3NM0j0k8K1
$$ 17 -9 0 22 -19 -14 11 -4 -28 -4 8 -35 -18 20 -10 -41 7 6 -35 -12 13 -16 -26 24 16 -23 8 32 -11 -6 34 24 -4 17
5804A7J5k8MK7k5k1K7ml3K1L4m4j5M2j4l2K6K0m4MM0k6l1M3J4n1K1K8m3KL9ll4
$$ 17 32 4 8 35 10 -11 16 12 -21 0 34 -10 -25 17 3 -29 -3 17 -27 -23 17 -9 -40 3 17 -34 -13 15 -28 -26 13 10 -24
5837b4K5K4k8k0N9j0m2M2Ql6kL8k4j9L1Rm2J1L6l9j6K6Pm2L1J4m7PL6k6oK2J1
$$ -24 1 25 -3 -23 36 26 -16 26 34 -2 -4 34 10 -9 22 31 -11 0 36 -3 -19 7 14 -28 3 17 -30 -23 13 -13 -19 3 14
5870A4m8K5K7k4l2M4%l0K2K9l5k0N3lm3L0K5l5pK9j3k3K2J3l1kL7l2mL3j5k2J5
$$ 14 -34 -9 18 -6 -38 6 6 -24 -2 27 -8 -28 25 22 -21 9 34 -1 -8 21 8 -15 7 20 -11 -13 24 -8 -12 21 6 -16 -1
5903aJ0l3LL1j2l2L3J2m1J5L4l0k5M4J5m5K0L8m5j2M2lk9J9L6m1qL4j8k4J9K2
$$ -1 9 -24 -21 10 -2 -34 -1 11 -30 -15 19 -11 -36 8 23 -22 -2 36 -9 -21 21 18 -11 8 44 3 -5 29 11 -13 6 28
5935B8l2pL1j5j9K7kk8J0J1k0kL1k0j2RJ3k7%L6l1rK3J0m1K9K3k6qL7j5l1L4J9
$$ 28 -4 -11 20 5 -14 13 11 -17 -7 4 -16 -18 13 -7 -19 -10 3 -24 -24 12 -19 -28 -5 5 -36 -7 16 -10 -18 19 4 -27 7 26
5969B6l3KK9ml7K3K3l3oM0l2j7K7Jk8J8J2k6oK9%m1L6Jk8J6K2k6j4L3Ll7K8J3
$$ 26 -7 -5 24 20 -17 6 29 -4 -10 30 -2 -19 8 9 -19 -1 11 -15 -21 8 8 -33 3 4 -24 -8 14 -12 -26 7 10 -27 1 14
6003A4k7MK0Jk6K6J0k0pM1j7k2K0J0k4lL1k0k3L2qj9J1K1k2j2K4lk7J7Qm3OK6
$$ 14 -13 -9 11 12 -14 12 22 2 -5 36 19 -3 17 27 3 0 31 11 -12 20 12 -7 4 25 3 -9 15 12 -15 2 10 -33 -27 -1
6037aj2qJ1J1j2%K1j5nK2kj4LL0k8pL7rk6K5lj6pL1rk5K9pk7JL9l0j6M0l0j3K6
$$ -1 -13 -21 -10 1 -11 -11 10 -5 -10 12 10 -4 -1 29 1 -6 31 22 -4 21 18 2 -5 26 17 -8 21 14 -13 -12 27 -3 -19 21 -9 -22 4
6074DPl0nK8j1k8J9K4k9JJ8j1kK2Jj7K0J4k6rL1j3j4K0J2l0mL5ok2J8Ml1QJ6j4
$$ 4 11 -19 -24 4 -7 -35 -16 8 -21 -20 -2 -13 -15 7 8 -9 11 25 -1 -10 21 8 -6 14 26 -4 -8 27 21 -1 17 21 -10 -2 14 0
6110@j9K3Ok4J0K7k8j7J7Pk4K6Ll1NJ2Mj9K3Pk7J3K2j3j1K7Jk1LJ4j4pL1j2k2
$$ 0 -19 4 10 -14 -4 23 -5 -22 -5 2 -22 4 7 -24 -19 -7 -3 -22 1 8 -19 -6 16 3 -8 19 20 -1 2 16 2 -5 26 14 -8
6145hK2Kk4J1J5j5k8K8Nl0J7J1j5j1K3Ll0J6J1k3KL3k0k4L2Lj9QJ5Kj7J5Qk3J2
$$ -8 14 16 -8 3 18 3 -25 3 8 -22 -5 6 -9 -20 3 6 -24 -8 3 -20 -18 15 -5 -29 3 6 -13 -5 10 12 -5 10 18 -5 7
6180GK2k0j6L9k1k4K9Jk2KK6j2j8K7j4k0PK8l3k0M0pk4QL6k9j7L3Kl4K2J2k9J1
$$ 7 29 9 -7 32 11 -13 16 17 -5 -3 23 11 -7 20 6 -14 -7 21 -12 -32 8 1 -23 -15 21 -8 -25 8 10 -24 -2 10 -19 -8
6214hK4j1j6K0Ol4L3J4l0qL1j2oJ2J9k7nJ4rj4J6Rk4mK4j4k1K0mk1J5K0k1mJ5
$$ -8 16 5 -11 9 15 -19 14 28 -2 -10 21 9 3 15 34 7 2 16 7 -7 9 18 -6 -10 14 0 -21 -1 -5 -26 -11 9 -12 -16 -1
6249amj6K4Nk9OL7j2k9K2J6k6J2K2k0j7L9ok9K4J1k9%K3k3j5J8J5k0mJ8j8j5K2
$$ -1 -5 -21 3 8 -21 -15 22 10 -19 3 19 -7 5 27 7 -10 29 23 -6 18 29 0 0 23 0 -15 3 18 -2 -6 12 -6 -21 1
6283AMk8RJ3k1ML1j4k5J8J6k5nK7nk8M5ml3K2K3k4j3L8j9pJ0K1l5OK2j0k0K8j
$$ 1 5 -23 -14 -1 -22 -18 13 -1 -26 -8 8 -17 -22 5 0 -28 17 13 -20 2 25 1 -12 26 7 0 10 31 -4 2 24 14 -6 22 21
6318B1l6J8J4k5qK2nl5K1J4k3kK5nk9L2J5l7JK7j3j9M1jk5OL0k0j6L6kl0J6K9
$$ 21 -15 3 17 -8 -16 6 1 -34 -13 1 -22 -24 1 -4 -33 -1 14 -23 -22 5 -8 -27 14 13 -12 -6 24 4 -12 24 22 -8 8 37
6352C7l0j0K3ml3L0Pk7jK8j9j4K6Nl5J1J8l3rK5qk4K0L2m0KL6j2k3K8Rl6K1K6
$$ 37 7 -3 20 16 -17 13 20 -7 -8 20 1 -13 13 18 -17 -6 12 -21 -30 -5 -13 -37 -17 15 -25 -23 13 1 -22 6 15 -21 0 26
6386B6k4k0L0J3l0PL1k9j1K9ql6K9J7l5NL1k1k5L0%j8MJ0k1j0K1jk5J6J0k6LK8
$$ 26 2 -18 12 25 -5 2 33 4 -7 22 14 -22 7 24 -11 -6 25 4 -21 9 9 -9 -5 5 -16 -26 -5 -6 -31 -15 -5 -31 -28 0
6420@j4j4K5Mk0NK6j4qJ9J3l1J7J9k5qK7%k4J5J3k7nK9rk7K0nrjK3k3j4J7Nk3
$$ 0 -14 -28 -3 1 -19 -14 12 -2 -10 9 22 -9 8 27 2 -6 21 21 -3 12 25 -2 -7 22 13 -14 6 1 -8 -9 14 -9 -23 -6 -1 -24
6456b4J0J9k7lK5Jl3L2Qj3qK1j3j2K5Nl0K1K6l3oL2qj5QRk4LK5j4j4NQk8J4J8
$$ -24 -14 5 -22 -25 0 1 -32 0 8 -5 -13 8 -5 -17 8 13 -17 4 30 -3 -9 23 15 0 8 17 -7 -4 21 7 -7 -2 6 -22 -8 10
6492A0k2rJ6Kk2J3Qkk1J9Lj9J4J5j4%J8j1j1K3jj4LK7k7j1L5pj4J1Kj5PJ9ol0
$$ 10 -12 -21 -5 -3 -25 -12 -4 -6 -27 -8 -5 -24 -10 5 -9 -9 9 -2 -13 10 9 -5 -2 25 -2 -13 22 15 1 12 14 -1 6 25 19 -11
6528a1J8J0k3rK6lk6J8Kj4LRk0NOpqJ3K2k2MPqrK6J1k3KK0k2mK4%j6J1K1l0lK0
$$ -11 7 17 -6 -15 11 8 -18 0 2 -12 -9 0 -20 -15 -9 -16 -24 -11 11 -11 -7 0 -8 -17 9 20 -3 -1 19 -3 -7 17 17 1 12 33 3 0 20
6567B0j3KkOk5NJ7k4nJ6J0l4J4J7j3kLKj6J4J0k1jJ6Oj2J4Kj0kQ%jJ1Lk2J0L1
$$ 20 7 9 7 13 -12 -7 10 -14 -19 -3 7 -27 -13 4 -9 -11 -8 -6 -22 -8 2 -19 -20 -4 2 -10 4 6 -4 -6 2 2 1 12 15 -7 3 34
6605C4k5j1K9rk5K5%k3mK7qj6%MlKJ0k0jOorPJ5j7LJ5mk3K3J4k1PJ6j1j1K7%j5
$$ 34 9 -2 27 18 -7 18 18 -5 -9 18 10 -6 -6 -2 -5 -3 7 -13 -14 -8 -14 -23 -16 -1 -18 -15 0 -4 -27 -4 10 -11 -4 12 1 -10 17 17 2
6644BQMrj0K3kj6J8Ql1jK3j5j5J8rqJJ4j1j4K3Kk7MK3k2qK3lk1K2Kj5J5J2j4o
$$ 2 10 14 5 -5 18 16 0 18 26 -5 -6 17 2 -13 5 -4 -12 -11 3 -8 -22 1 3 -24 -20 3 -19 -27 -4 -7 -28 -6 -4 -19 -4 8 -6 -12
6682a2K6oj4NMOj8L5j1k0K1Rk3kJ9ol0K1jk0OJ8j6j9M0j4j4kK1j3j8K7nk0K2J9
$$ -12 14 8 -6 -1 3 9 -9 26 15 -5 16 25 2 0 19 13 -17 4 3 -17 -11 7 -9 -28 12 -2 -16 -18 3 -10 -28 -1 -6 -26 -4 15
6718A5k6oK9j2j6K8Mk7J3J2mj2J8jk0J5J8k8jK5ok2QRk3pL1j9j7J0Ql1J7K3k1
$$ 15 -11 -17 12 0 -16 12 16 -11 2 14 10 -2 16 15 -5 10 28 0 -1 24 18 -4 4 13 -10 -17 14 -5 -22 -12 -4 -35 -18 5 -16
6753a6j4K8mk1J4J3k0oK5LnJ4J2k7MJ9pj4J6j4mJ0J4l0OJ3j6rK0J5k3j1K8j8j7
$$ -16 -30 -2 -6 -27 -13 0 -20 -26 -1 2 -3 11 23 -4 0 19 12 -2 14 0 -4 6 20 -10 -4 9 -7 -16 4 19 -4 -15 13 -5 -22
6788b2K1%k1lL0j9pK1lk4J1RlpJ7roJ1J7j6lK0j6lJ7Nk0J7J1k4j2K2rmjNj3PJ4
$$ -22 -1 -1 -22 -25 5 -14 -21 0 -3 -27 -16 -7 -10 -17 0 -9 -15 -4 13 -3 -6 14 -2 -5 12 17 -3 14 25 1 -11 11 2 -2 -3 2 -11 -4 10
6827A0rk1J7Pl0PJ6j5rJ9lrQJ2j6nJ7oj1QJ9k2OJ8mj5K4jj2kJ6j6lJ8Lj9QKnn
$$ 10 1 -20 -3 4 -26 -19 -3 -18 -27 -8 -11 -20 -12 0 -16 -21 -4 -10 -21 -13 6 -16 -10 8 4 -11 13 12 0 -2 14 -2 -5 13 16 -3 5 7 2 -3
6867cJ4k2qJ7%k2JK7j7j0K1Kl3J7K0k4jK6j8j2J6K8l5oL5qk0K0J4k3JL3k5mJ1
$$ -3 11 -11 -19 -2 -2 -24 -23 4 -13 -23 -2 0 -33 -16 4 -20 -21 5 -13 -25 -9 19 -16 -22 13 5 -15 5 19 -4 -3 30 5 1 12
6902A2kk1J1J8j9jJ3nk1K0J7k4k0K0j7pJ8Lk7J7J4j7j8K9%j7RJ9j9pL2j7j7L7
$$ 12 10 -11 0 18 -1 -2 11 6 -15 5 22 -2 -22 -2 -19 -26 -8 -5 -32 -15 -1 -18 -36 -7 -7 -24 -15 4 -15 -22 10 -7 -24 13
6936A3j0j5QK0jl0K9%k3J2J8k1j1K7jk3J7Kj5rJ3lj3J0Qj8LJ0kj5J5Jj5K1kj0
$$ 13 3 -12 -4 16 15 -15 14 14 -9 3 21 0 -11 16 15 -8 9 11 -4 -13 0 -3 -16 -6 2 -16 -13 -3 -5 -20 -5 -4 -19 2 0 -10
6972a0oL0qk3K0Oj6jL1k2rJ7J3j2pJ7j3j3J5Lj5OLj2jlOk1J3J3k0pK9k6%K3oj2
$$ -10 -16 14 6 -17 3 9 -7 -8 23 1 -8 9 22 10 3 20 7 -6 9 12 -3 3 6 -6 -7 -10 -4 -25 -12 1 -19 -26 3 -23 -23 0 -6 -18
7010a8OJ6j4pJ7kj7J9J3j5KJ7kk8L3Nj8oJ4kk4L2Nk7%Rjk2J1Oj9NJ1j7kJ7j3n
$$ -18 -12 4 -10 -17 0 -2 -19 0 13 -2 0 17 15 -13 20 25 7 1 15 13 -11 21 26 -1 -1 8 7 -15 -4 2 -17 -12 -1 -18 -20 -3 -16 -21
7048b1J4%k3K2Jj1jK3pj2QK3l0J0L1k3pK2jk0J1J3lk2K0%k3MJ7j5qJ3lj5KJlj1
$$ -21 -7 -7 -30 -8 -7 -18 -19 4 -3 -15 -7 16 -14 -4 27 4 -3 19 18 -2 9 22 19 -3 17 17 -6 -2 15 0 -8 5 2 -13 -11 -10 -13 -24
7086b4K5lk2J3Qj4mJ6j5jRNj9K4J3j9%K3rj8K4Nk5J7J7j8oJ5Jj9KPnj0J1jqLR
$$ -24 1 -2 -24 -11 -3 -17 -21 -5 -20 -21 -12 -7 -26 -2 11 -8 -8 15 6 -12 12 17 -8 9 26 8 2 17 18 -1 1 8 3 -7 4 3 -5 -2 7
7125Gj7oJ9j1qJ0Lj2Ol%kJ1Rrj3J2j%K0j3j1K2kjoQNj0MJ0j1mJ7j2j3MQk5OJ9
$$ 7 -10 -16 3 -8 -16 -6 -3 -15 -9 -12 -12 -14 -3 6 -3 -16 -4 -5 -5 15 2 -9 13 11 10 4 12 17 7 11 21 10 6 23 11 -2 2 10 -15 -9 10
7166A0k3jPJj2QJ2j8pJ7Mj4OqKJ5Qj8ORKrNJ6k4NJ6j0kJ2Mj9NJ8j7rJ6Mk1LK4
$$ 10 -13 -14 -7 -6 -18 -10 2 -16 -23 -6 -2 -16 -10 -18 -16 -1 7 -11 -5 4 6 -3 2 18 -6 -1 15 5 3 15 19 0 5 23 6 -3 13 17 -4 -1 23
7207B3k5j0NJ6k5NK0j1j1J3j2kKJ9k4JJ9j2KJ2JmOMpj1K2qkkJ0k1RJ1Kj1PRk6
$$ 23 -2 -12 -7 9 -16 -11 9 -2 -13 0 -12 -14 -12 7 -17 -16 3 -9 -7 5 6 2 8 12 5 -6 16 8 6 4 14 -7 2 13 15 4 11 20 -6
7246fLK4j9j2J0oj3J4Pk0MJ5mj5J3Rj1pK0j8j0K9%j0OK0j1j0K1%j9QNpJRqj6K8
$$ -6 -3 21 2 -10 0 -6 -19 -5 2 -18 -14 1 -3 -18 -5 4 -7 -14 6 -12 -22 7 7 -3 3 23 12 2 23 23 4 12 17 10 11 20 12 -4 24
7285B4pj4J2Pk3lJ3Lk1QK0k9lJ7jj3J4Nk1LJ6j4j1J7NrkK1nj9K5jj6RJ2rlJ8k
$$ 24 17 3 15 22 -1 -4 9 12 -9 -1 19 -10 -13 4 3 -10 4 9 -12 -9 7 -7 -18 -1 4 -5 -7 14 9 -10 15 14 -2 7 19 10 7 25 23
7324B3j8J1Nl0PK5j2qMKk1OJ0j5j2K3pj7J5J7k7JJ7j0nJ3Pj1j1L2j0j5K0MrOJ9
$$ 23 5 16 21 -9 -2 23 11 3 7 9 -12 -6 4 -11 -23 0 -7 -24 -9 8 -19 -18 -1 -11 -16 -3 4 -7 -18 14 4 -11 9 13 4 10 29
7361B9k6jJ0Oj4RNk0JRnj6K7kj7ROk0qNRk7K7jolJ1nj1J9Pj6MJ3lj9K4J0l4K1
$$ 29 3 2 12 18 4 13 18 -2 -1 8 3 -13 14 12 -5 4 10 -10 -18 -13 -4 -31 -4 -5 -11 -14 -3 -8 -19 0 7 -9 -5 8 5 -14 10 20 -14 7
7401GK1j9j0J8%j3RRk5MJ5jj3JJ4j6KNj6LJ1nl2K5Jj6J4J0j2qJ8Lj5kK3rj7J9
$$ 7 28 9 -1 17 17 4 13 22 -3 1 16 15 2 3 17 1 3 8 -8 -5 6 1 -31 -6 -5 -21 -7 3 -9 -17 1 4 -11 -13 10 1 -16 3
7439CMj8QK0j0kK2nk0J4J2j2k5K1Lk0J4kqpK6k6JJ6Nl1J5Ok3MJ4Ok8J4J8k3j1
$$ 3 7 -11 -3 17 7 5 27 22 2 16 28 16 -9 12 15 -5 9 7 -1 -8 18 -8 -7 9 14 -17 -2 4 -19 -15 -1 5 -23 -9 9 -14 -25
7476b5K1NrJ2mj2OJ1kj6L3rqlK9j5j2K7j8k4J8J6j2j4J4j4%kJ7k2mJ9j4j3K1k
$$ -25 -4 1 -8 4 0 -12 -6 5 3 -13 20 11 3 0 29 14 2 29 11 -13 5 21 9 -5 9 -5 -5 -7 10 -12 -16 3 -11 -24 -3 -5
7512ej1Rjj4K0MnqMJ4j8jK5rk3L1Lk2J4Nj3%K3j4qQQj8kJ3mj4QJ7k1kQj4rJ9p
$$ -5 -16 -7 -8 -22 -2 2 -3 -11 -7 7 -11 -12 13 4 -19 12 15 -7 7 12 -1 -1 22 8 0 8 16 -2 -4 9 5 -9 -1 16 -5 -7 1 -13 -22 -3 -10
7553a0LLoppJ5Pj3LK2k1OQNj1J3Rk0J1Kjj2J4Mj4KK1k1rNMqJ0joqKOj5J1j1%%
$$ -10 -7 -4 -10 -17 -24 -9 -2 -15 -12 10 -11 -5 3 8 -3 10 19 -1 10 12 11 -1 13 17 3 5 26 5 -4 1 5 -3 7 6 0 -8 -6 0 -15 -4 -15 -15 -15
7596a5Lj1JJ0Jj2J2J3j7RJ2rlJ8Jj7QJ3j6LQKj4KJ5k4PJOplJ0ljKj3oJ6Kkqoq
$$ -15 -12 -23 -22 -12 -11 -23 -11 2 -15 -6 6 -3 -6 12 13 -4 4 17 1 4 12 14 0 2 17 -7 0 1 7 0 -3 7 4 3 5 -8 -14 2 4 2 -6 -12 -20
7639b0PlJ0j5J0QnmRJj6K0NoMJ5j2qjJ1nmJ2Nj9K6j1j8J3oj0rK0Pk6J0PppJ1j0
$$ -20 -13 -16 -6 -21 -11 -3 -8 -12 -3 -2 -18 2 7 1 5 20 8 0 -1 10 5 1 13 18 -1 25 14 -4 9 3 -7 -16 4 11 -15 -5 2 -5 -12 -1 -11
7680a1mJ4opkJ0%j0J8j3mJ4J4m%KKj3J5nj2OrNMJ2lpqPkqR%k1MPooKPj5K6lJj8
$$ -11 -15 -1 -7 -14 -16 -6 -6 -16 2 -11 -15 -1 13 9 9 11 13 0 15 10 -2 4 -5 0 4 16 13 6 -2 5 3 -5 4 4 -17 -13 -6 -12 -18 -16 -9 -24 2 -1 0 -18
7726a8J1njQPmKMkmJ9nk1J9jqKLMpNNj6OJ0kk6K6Lk6J9oj2kJ1knjOj0QRj8oPJ4
$$ -18 -7 -12 -13 -5 2 -2 0 4 2 -2 17 12 -9 10 9 1 3 6 10 3 8 13 -3 3 13 11 -15 11 14 -12 7 1 -11 -13 -2 -4 -9 -10 -4 -14 -6 3 -15 -21 -14 0
7772@j8J0J7nj2J9Lj0J1Lk5J4%lMLJ0j5J0Jqj3J0nj3RKrmJ0j0lJ2Qj7LMj3%K4
$$ 0 -18 -8 9 4 -8 11 14 4 15 18 -7 7 7 4 8 11 21 6 16 17 9 -4 6 1 -12 -3 -1 -10 -14 -4 -14 -17 -5 3 -14 -11 -7 -20 -20 4
7812Dpj3jK8j4j6K4j0KORonK0j5nJ1Kj6J3jj0ROLk0KRrj4MLj5K0mllMKmNNj8J2
$$ 4 -3 -16 -17 11 -3 -19 5 -5 -3 3 12 6 1 21 6 1 12 14 -2 11 10 0 9 15 18 -2 0 9 0 -14 -10 -7 -22 -2 -6 -9 -12 -8 -6 -10 -5 0 -18 -6
7856fNnqK1%j7J2QmqK0j6QjJ4j5MMj6RKLrKJnj0Lnj1J9ljmOk%NNk0J2LKpKJ0j9
$$ -6 -1 -6 -14 7 7 -10 2 10 6 -2 18 2 10 9 23 8 12 16 0 9 11 14 5 7 8 3 -7 -4 -9 -20 -1 -4 -5 -9 -3 -5 -5 0 5 -15 -3 0 2 -5 -3 7 -12
7903a2J2PnLjLQpJ7k8%Rjj3J3J3k4J1Nlj4QJKj0KrjMNlj0J7j4KJ5j2nJ2PpqMM
$$ -12 0 7 2 5 4 7 15 8 25 -3 -3 6 5 -8 5 18 -6 5 10 7 -7 1 2 4 -6 -4 -13 -14 -10 -5 -8 -18 -1 -15 -13 2 -10 -15 -3 4 -3 -11 -7 -3
7947c%LJ1j1J0Qj7J2LpJmRj9J4jpoJ0kqJ3qj0JMpoJ4Kk4J5K2l2QJ1Rj4JLoQKJ
$$ -3 -3 0 11 0 10 18 1 13 16 9 10 6 15 -4 10 9 2 -4 6 4 -4 9 1 -9 -8 -4 -11 -17 -3 -1 -25 -10 12 -20 -12 -1 8 -6 -5 -2 -8 0 2 3
7991Cj2K5lnkMLpOMj3LQj2j5K2loJ%ooPpJkLlMOrLJ6kj8NRolJ1mJRJ1j3MMQj2
$$ 3 -9 16 13 8 6 10 13 6 12 16 3 6 14 2 -13 9 6 0 1 1 -5 -11 -4 -11 -10 -12 -9 -12 -8 -2 -11 -8 8 6 -12 -7 2 -4 -7 4 0 1 10 21 8 12 16 24 12
8040A2NmjnRj4ljNj3PPoj2J5oj1J0Lnj0J6rnJ3PMj5QJnJ4plkK0j8J2NrONlj3O
$$ 12 17 13 12 7 16 2 -1 -2 3 -10 -3 4 -2 -14 1 -5 -16 -6 -3 -8 -18 -2 -11 -16 -3 4 8 -7 1 2 -3 11 4 1 -1 19 1 13 18 9 15 20 17 4 10
8085A0J4j4lO%j6JJ5oj4OKj7RJ1j3mJ5j1KqK4mmKm%nJ1Rpjr%J7koNJ0j2nJ8j2
$$ 10 24 10 7 13 13 -3 -2 13 7 -7 -1 1 -16 -7 4 -9 -13 2 -9 -7 -15 9 5 1 3 -1 -1 -6 5 14 7 6 -3 -3 14 12 6 11 21 9 4 22 10
8128A0Jj0J2j3OJj1lJ3nrMOJj7NPj2JJ2mkqQjjJ6qJ0JoqJJ5%LJ0qqKNkKpj2J1
$$ 10 11 1 13 0 6 7 -4 -7 6 1 -8 -4 2 3 -14 -9 -2 -14 -13 -1 -5 -7 -15 -7 -8 -9 7 -1 9 10 4 -4 -3 12 12 15 25 17 9 11 16 14 16 9 -3 8
8174HlopJ0LrMNj1j0J3Jj0Qnkm
$$ 8 5 -1 -8 2 5 -4 0 5 -6 -16 -3 -2 -12 -4 -9 -11 -15
8191a5
$$ Imaginary data points
##PAGE= N=2
##DATA TABLE= (X++(I..I)), XYDATA
0@%%%%%%%%%%%qJ6j6J6k4L2l3M1n6O5p3Q8j05J23j46J73j98K27k65L04l46L94
$$ 0 0 0 0 0 0 0 0 0 0 0 0 -8 8 -8 8 -16 16 -17 24 -32 33 -40 48 -57 66 -80 93 -105 122 -143 161 -185 209
33B09m48N06n70O42p19Q06r00J004j117J238j373J519j679J856k046K255k486
$$ 209 -239 267 -303 339 -380 426 -474 530 -587 651 -722 797 -882 974 -1072 1183 -1303
50a303K738l016L324l664M046m476M961n515O155o906P798q879J0221j1939J4230
$$ -1303 1435 -1581 1743 -1921 2125 -2351 2610 -2905 3250 -3656 4142 -4737 5484 -6455 7775
65G775j7450K2335l0707M8768j51459J57299K34811m44043m509L85942j04497
$$ 7775 -9675 12660 -18047 30721 -120738 36561 271372 -172671 -177180 208762 104265
76A04265l43536K38337K11313k72414j03305K81977j6426k21699P5955J58158
$$ 104265 -239271 -934 210379 -62035 -165340 116637 100211 -121488 -45533 112625
86A12625j10084q2030Q8603M1214n7894k4260J5203M8528M14q4749R047J28555
$$ 112625 2541 -79489 9114 50328 -7566 -31826 -16623 31905 32319 -52430 -43383 85172
98H5172n5538j46213J21546J34548j94620p9054K48375o952k69173J11554K41542
$$ 85172 29634 -116579 4967 139515 -55105 -134159 114216 107264 -161909 -50355 191187
109A91187k10464j71448K82303O5945l10828N0789K89696j58222k23412K34737
$$ 191187 -19277 -190725 91578 157523 -153305 -102516 187180 28958 -194454 40283
119D0283J28559k67342k3932K55207o6685k05111J29142J34608j54240o2187J44872
$$ 40283 168842 -98500 -122432 132775 66090 -139021 -9879 124729 -29511 -91698 53174
130E3174M574j12396K6744P0997l1756l7995J5540K2720Q114k9902k5909N4971
$$ 53174 57748 -54648 -27904 43093 11337 -26658 -11118 11602 19716 -10186 -36095 18876
142A8876K6917q6698n062J13117l5772j20598Q8051J03350j37516o0298J71207
$$ 18876 45793 -40905 -45967 67150 31378 -89220 -1169 102181 -35335 -95633 75574
153G5574j721j79426O9946J57110j31418j08746J72098M2278j85069K8170J68235
$$ 75574 73853 -105573 -35627 121483 -9935 -118681 53417 95695 -89374 -61204 107031
164A07031q9227j26625J30476P1143j45358j3132J35802l4534j07015O4929O9631
$$ 107031 17804 -108821 21655 92798 -52560 -65692 70110 35576 -71439 -6510 63121
175F3121p5079l4074O7727Q306n0803K634L2044o86k0481r932J9910K1145l0854
$$ 63121 -11958 -46032 21695 30001 -20802 -18168 13876 13190 -7291 -17223 2687 23832 -7022
188g022k5478M9443J8491o8055J848Q0045l1334p8552O4336O1685r2481l0893
$$ -7022 -32500 16943 35434 -32621 -30773 49272 17938 -60614 3722 65407 -27074 -57967
200e7967J08567q815j08593M9096R1019q2918n9971J03197K0852j07262J8451
$$ -57967 50600 41785 -66808 -17712 73307 -9611 -69582 33615 54467 -52795 -34344
211c4344R5487n0777p1300P1745M1306p8609j1171P3524j2913n9674K8142M2388
$$ -34344 61143 10366 -60934 10811 52117 -26492 -37663 35861 22948 -36726 -8584 33804
223C3804l4062k6774L2285J5755k7218j1298K2114J1626k0849j4382K4491J5871
$$ 33804 -258 -27032 5253 21008 -6210 -17508 4606 16232 -4617 -18999 5492 21363
235B1363l2271j2710M2075L817m9678J1192N2325k9399m7106M7567L3796o1721
$$ 21363 -10908 -23618 18457 22274 -27404 -16212 36113 6714 -40392 7175 40971 -20750
247b0750j4048O8268r451o6048L2016N4614n0434l6514O1398J4780o3767O941
$$ -20750 -34798 33470 24019 -42029 -10013 44601 -5833 -42347 19051 33831 -29936 -22995
259b2995N8286k4993m6385L7675L1495m3668j5992M3949K566l9960P362L3655
$$ -22995 35291 10298 -36087 1588 33083 -10585 -26577 17372 19938 -20022 -12660 20995
271B0995j3852k7297J7127K1746j8946j7915K0302J5147k2378j2552K5562R158
$$ 20995 7143 -20154 -3027 18719 -227 -18142 2160 17307 -5071 -17623 7939 17097
283A7097k9169l739L2631l711l4208J3136L2997k3270k8153L2605J9525l9703
$$ 17097 -12072 -15811 16820 13109 -21099 -7963 25034 1764 -26389 6216 25741 -13962
295a3962q108M2930n072m1808J7913L6115k8896k6693L6537J4937l9898k336L9139
$$ -13962 -22070 20860 15788 -26020 -8107 28008 -888 -27581 8956 23893 -16005 -18341 20798
308B0798r303l4474J8844K7234k5383j8546K8751R676k9339j680K7646n018k4694
$$ 20798 11495 -22979 -4135 23099 -2284 -20830 7921 17597 -11742 -13422 14224 9206 -15488
321a5488J0096K1029j3883j7283J6677J3635j8909r948K0909O065k2564j529K3794
$$ -15488 -5392 15637 1754 -15529 1148 14783 -4126 -14074 6835 12900 -9664 -11193 12601
334A2601l709k4004R668K2750j5991j9590K1930J4260k6748p094K9457j373k9568
$$ 12601 8892 -15112 -5444 17306 1315 -18275 3655 17915 -8833 -15927 13530 12157 -17411
347a7411J0181K6698j8179k1067K4375J3393k7828m658K8329l934k5913J1277
$$ -17411 -7230 19468 1289 -19778 4597 17990 -9838 -14496 13833 9899 -16014 -4737
359d737K1261j6624j5296J9600R000k0413l294J9565j390j7770M867J5693p433
$$ -4737 16524 -100 -15396 4204 13204 -7209 -10503 9062 7672 -10098 -5231 10462 3029
372C029j3747R579J2026j1697j0253J4105Q011j6710m762J9068K73k0544N370
$$ 3029 -10718 -1139 10887 -810 -11063 3042 11053 -5657 -10419 8649 8922 -11622 -6252
385f252K0359j1665j8015J7720J3316k2534o598K5126j303k4861R246K1698j5997
$$ -6252 14107 2442 -15573 2147 15463 -7071 -13669 11457 10154 -14707 -5461 16237 240
398B40j6058K0536Q945k2286j564K1227m854j7960R408J3520j1823q985J2288
$$ 240 -15818 4718 13663 -8623 -10187 11040 6186 -11774 -2366 11154 -669 -9654 2634
411B634N259j1522k869J0448J731r946j203J0438M68j1785J288J3419m525j4350
$$ 2634 7893 -3629 -6498 3950 5681 -4265 -5468 4970 5438 -6347 -5059 8360 3835 -10515
425a0515R180J3535j4509j0356J9344M700k2413K784K2648j0916j9554J8146J3422
$$ -10515 -1335 12200 -2309 -12665 6679 11379 -11034 -8250 14398 3482 -16072 2074 15496
438A5496k3059n196K4657l594k2658J1350J7614j6682j0669J8809L449j7816K571
$$ 15496 -7563 -12759 11898 8304 -14354 -3004 14610 -2072 -12741 6068 9517 -8299 -5728
451e728J4399o328r958P465N891o464l388M361L010k511m461K194O779l953q638
$$ -5728 8671 2343 -7615 -150 5741 -723 -4111 250 3260 749 -3712 -1518 5261 1308 -7330
466g330P794Q669j2778n952J7361L90j9969P190J9268j5247j4820K1890P056k5392
$$ -7330 464 9133 -3645 -9597 7764 8154 -11815 -4625 14643 -604 -15424 6466 13522 -11870
480a1870K573K4767j2103j9931J9567J1876k3363k368K2882o470j8542J2819J1704
$$ -11870 -9297 15470 3367 -16564 3003 14879 -8484 -10852 12030 5560 -12982 -163 11541
493A1541j5586m284J4619j844j0822N231N789n438j363K937r55J038L45m633L042
$$ 11541 -4045 -8329 6290 4446 -6376 -1145 4644 -794 -2157 780 -175 863 1208 -3425 -383
508c83O137p958m608J2796j56j5612P179J5011j4776j0458K0858K498k3548P270
$$ -383 5754 -2204 -6812 5984 5828 -9784 -2605 12406 -2370 -12828 8030 10528 -13020 -5750
522e750K1744j6650j5507K3374O032k5811M586K3362j3944j6635J9968P393k1439
$$ -5750 15994 -656 -16163 7211 13243 -12568 -7982 15380 1436 -15199 4769 12162 -9277
535i277K099J8364r499j1969J3224M298j2750K403Q755o317k939O481k609l199
$$ -9277 -7178 11186 1687 -10282 2942 7240 -5510 -3107 5648 -669 -3608 2873 264 -2935
549b935N935k295n711P871J948j1537M405J1806j1517q008J7176Q54j9508Q070
$$ -2935 3000 705 -5006 2865 4813 -6724 -2319 9487 -2030 -10038 7138 7992 -11516 -3446
563c446J7431j6546j1047K2253J622k3678Q723K0210j7575j2565K2841K513k3310
$$ -3446 13985 -2561 -13608 8645 10267 -13411 -4688 15522 -2053 -14618 8223 10736 -12574
576a2574P593J9029j5341j1186J9014J971j8015O261J2993j1424n695J2414j637
$$ -12574 -4981 14048 -1293 -12479 6535 8506 -9509 -3248 9745 -1679 -7374 5040 3403
589C403r387O759L638q300K782N890p646m52R256o162o918J1773J149j4407O526
$$ 3403 -5984 775 4413 -3887 -1105 4785 -2861 -3313 5943 -219 -7137 4636 5785 -8622 -2096
604b096J2977j3909p483J8834q40j9736R968J6105j7626q652K1812r34k1483J0386
$$ -2096 10881 -3028 -10511 8323 7483 -12253 -2285 13820 -3806 -12458 9354 8420 -13063 -2677
618b677J6658j7520q550K0688q24j9342R268J4056j4777o357J6276j613j3713
$$ -2677 13981 -3539 -12089 8599 7775 -11567 -2299 11757 -3020 -9377 6899 5286 -8427
631h427P786Q178j0652j517R738m239n677P321m9o934N444L232q655K512Q541
$$ -8427 -641 7537 -3115 -4632 5106 867 -4810 2511 2462 -4472 972 4204 -4451 -1939 6602
646F602q487m850J2723j452j3679Q691J0834j4831m599J8042l483j7357J1445
$$ 6602 -1885 -6735 5988 4536 -9143 -452 10382 -4449 -9048 8994 5511 -11846 -401
659d01J2741j7329n269J9652l315j7941J0947J2690j5963n254J7307k460j4953
$$ -401 12340 -4989 -10258 9394 6079 -11862 -915 11775 -4188 -9442 7865 5405 -9548
672i548Q660R844j1979l469J1998k378r071O238M373p263M52N497l994j721N070
$$ -9548 -888 8956 -3023 -6492 5506 3128 -5943 295 4668 -2595 -2143 3354 -640 -2361 2709
687B709k704l366O095n59p226N390N593r627j389J1891m338j1218J0131P559j4342
$$ 2709 5 -3361 2734 2175 -5051 339 5932 -3695 -5084 6807 2469 -8749 1382 8941 -5401
702e401j606J5799n255j4008J1348R296j5309k795J6164m011j3911R531R189j2618
$$ -5401 -7007 8792 3537 -10471 877 10173 -5136 -7931 8233 4222 -9689 -158 9031 -3587
716c587l329J2857k210j0446O212O432p834k009P136j546m659L344J403l093J393
$$ -3587 -6916 5941 3731 -6715 -503 5929 -1905 -3914 3222 1676 -2983 361 1764 -1329 64
731F4J017k773J882K202m606J74O026l635n514P179L058r717J029J0391n688q781
$$ 64 1081 -1692 190 2392 -2214 -2040 3986 351 -5163 2016 5074 -4643 -3614 6777 1089 -7692
747g692R854N108j2434j18J2744n110j0721R371O743j1825j808J1951k989r967
$$ -7692 2162 7270 -5164 -5282 7462 2352 -8369 1002 7745 -4080 -5888 6063 3074 -6893
761f893O648O493q434k473Q252j008o476L289L852l914j254L066m92j318R27n85
$$ -6893 -245 6248 -2186 -4659 3593 2585 -3891 -602 3250 -664 -1918 1148 656 -662 265 -320
777c20k8J761j787j791L797M24n241J982N459m788m193P260J609q641J866Q496
$$ -320 -348 1413 -374 -2165 1632 2056 -3185 -1203 4256 -532 -4725 2535 4144 -4497 -2631 5865
793E865n391o702Q271L590r783K01R661l936p957O817N004q367j586Q325j630
$$ 5865 474 -6228 2043 5633 -4150 -3949 5712 1776 -6181 636 5640 -2727 -4313 4012 2382
808B382o937L953M699n063k195M949J28l835J108K367j315j005O80L29L59n28
$$ 2382 -4555 -602 4097 -966 -3161 1788 1916 -1919 -811 1556 241 -764 -84 245 604 76
824G6j312J479J592k891j046M171m33m899K521M617m700l220O445R45p203J853
$$ 76 -1236 243 1835 -1056 -2102 2069 1636 -3263 -742 3875 -825 -4045 2400 3345 -3858 -2005
840b005O845m543n244O620K765p654J17P462k900o157M980L986o113j568O129
$$ -2005 4840 297 -4947 1673 4438 -3216 -3099 4363 1463 -4694 286 4272 -1841 -3409 2720
855B720p05n221K353L748l148k080L139P71k462j2J610m5q85m33O51J107j066
$$ 2720 2015 -3206 -853 2895 -253 -2333 806 1577 -885 -897 713 668 -217 -650 1 1108 42
872D2j632J957J586l160q69M154n50m636K424M279m321k968N845R23o463J554
$$ 42 -1590 367 1953 -1207 -2076 2078 1528 -3108 -684 3595 -726 -3694 2151 3074 -3389 -1835
888a835O100l901m689N695K490o578J4O361k406n217M163L335n072j242M995o33
$$ -1835 4265 364 -4325 1370 3860 -2718 -2704 3657 1251 -3966 197 3532 -1540 -2782 2213 1580
904A580m120J947K829k466j435K283M47j564NP34J95j44q98N4J712o52k334J775
$$ 1580 -2540 -593 2236 -230 -1665 618 1065 -499 -494 240 435 291 -607 -553 1159 507 -1827 -52
922e2K317l168j562M384M0m980J991M694m016l409N664J307o399J227O044l643
$$ -52 2265 -903 -2465 1919 1959 -3021 -1030 3664 -352 -3761 1903 3210 -3189 -1962 4082 439
938D39m598N417K361o224J38N891k479m522M052K511m649l93M224j348k977K314
$$ 439 -4159 1258 3619 -2605 -2467 3424 945 -3577 475 2986 -1663 -2056 2168 820 -2157 157
954A57J432k348mJ616q05m43Q42p00p5J342j183j217K453K21l341J386L380l225
$$ 157 1589 -759 -763 853 48 -395 447 -253 -328 1014 -169 -1386 1067 1288 -2053 -667 2713 -512
972e12k465M783O29n527J723N212m063l695N816J349o502J417N915l908m198N581
$$ -512 -2977 1806 2435 -3092 -1369 3843 -220 -3915 1901 3250 -3252 -1835 4080 172 -4026 1555
988A555J704o092R53N279l159l510M373J215m399R38L353k384j586K809k33k142
$$ 1555 3259 -2833 -1880 3399 240 -3270 1103 2318 -2081 -1143 2210 -174 -1760 1049 816 -1326
1004a326J625O96k041R91J412k322N7K788j944k216L617N70m514J638M292l921
$$ -1326 299 995 -1046 -55 1357 -965 -908 1880 -64 -2280 1337 1907 -2607 -969 3323 -598
1020e98k851N599M87o153K278N400m717l398O270O87o550K189N470m530l295N761
$$ -598 -3449 2150 2637 -3516 -1238 4162 -555 -3953 2317 3004 -3546 -1357 4113 -417 -3712 2049
1036B049N48n664K019M257l795k051M344l43l601K216J887l024K36K617k028j109
$$ 2049 2597 -3067 -1048 3209 -586 -2637 1707 1364 -2237 -21 1866 -1158 -922 1695 -333 -1442
1052a442K950r35k647K871J161m020J060L941l403k578N094J85n636K563M776
$$ -1442 1508 573 -2074 797 1958 -2062 -1002 2939 -464 -3042 2052 2237 -3399 -836 3940
1067C940m987k626O403k52o393L183M981n410k463O426n04n982L198M220m954
$$ 3940 -1047 -3673 2730 2478 -3915 -732 4249 -1161 -3624 2802 2298 -3684 -486 3734 -1220
1082a220j651N358j046m414L124K408m095K1L701k146k129L352q5l276K262J945
$$ -1220 -2871 2487 1441 -2973 151 2559 -1536 -1515 2186 40 -2089 1263 1178 -2098 164 2109
1098B109l658K46L879k632k718M441M99n120K182M337m568k276N934n71n876L448
$$ 2109 -1549 -1303 2576 -56 -2774 1667 2166 -2954 -772 3565 -1003 -3279 2655 2084 -3792 -344
1114c44M334n581j700O424j366n720M072L681n721q52N918j996m682M158K393
$$ -344 3990 -1591 -3291 3133 1767 -3953 119 3800 -1921 -2773 3145 1149 -3533 625 3018
1129C018n072K92M573k623k890L987M94m022J808K812l422p06L848j610k973L479
$$ 3018 -2054 -1762 2811 188 -2702 1285 1779 -2243 -435 2377 -1045 -1751 2097 487 -2486 993
1145I93J057m293J386L784l593k055M928m52m969L047L628n016j247N765j573
$$ 993 2050 -2243 -857 2927 -666 -2721 2207 1755 -3214 -167 3461 -1555 -2802 2963 1390
1160A390n104M087L135n596m18N747k383m454M485K162n388N81M869k954l169
$$ 1390 -3714 373 3508 -2088 -2506 3241 858 -3596 889 3051 -2337 -1756 3113 159 -3010
1175c010M390P69m551J623L426l331j428L933q47l314K726J657l662N09L406k517
$$ -3010 1380 2149 -2402 -779 2647 -684 -2112 1821 974 -2340 386 2043 -1619 -1110 2296 -221
1191b21k053L809l2l944K210K935l893r86M567j340m052L444K411m725j23M850
$$ -221 -2274 1535 1503 -2441 -231 2704 -1189 -2175 2392 1052 -3000 444 2855 -1870 -1993 2857
1207B857k271l772M094J753m887O48M468k801k960M169Q07m387J439L465l126
$$ 2857 586 -3186 908 2661 -2226 -1578 2890 89 -2871 1298 2105 -2282 -843 2622 -504
1222e04j690L847m02l458K224K077l266k04L242j624k262K892N69l199J267K507
$$ -504 -2194 1653 1251 -2207 17 2094 -1172 -1376 1866 242 -2020 872 1441 -1758 -491 2016
1238B016k705j022L383q20l027K507J790l546L1L627j894k770L317J128l931Q05
$$ 2016 -689 -1711 1672 852 -2175 332 2122 -1424 -1393 2234 340 -2430 887 2015 -1916 -1111
1254a111L530k549k307L661N16l840J375L090k813j626L531j54l291J784K251
$$ -1111 2419 -130 -2437 1224 1740 -2100 -725 2365 -448 -2074 1457 1303 -1988 -204 2047
1269B047k825p17L028r03k394K105J120k629L69K301j656j292K382j11k293J457
$$ 2047 -778 -1495 1533 630 -1764 341 1461 -1168 -799 1502 -154 -1446 936 825 -1468 -11
1285a1J495k337j70K534j261j925K392P10k886P71K582k135j609K998J57l160
$$ -11 1484 -853 -1023 1511 250 -1675 717 1427 -1459 -688 1894 -241 -1850 1148 1305 -1855
1301a855J363K519k578j292L175j96l005J611K189k563q92K878m90k478J634J527
$$ -1855 -492 2027 -551 -1843 1332 1136 -1869 -258 1931 -632 -1524 1354 864 -1614 20 1547
1317A547k279l05K218q51j606J604N90j816M90J413j311n52J661m55j410J381
$$ 1547 -732 -1037 1181 330 -1276 328 918 -898 -408 1005 -306 -858 803 348 -1062 319
1333C19O59j868M15J776j440j124K140N9k339J130J857k120r15K626l14k549J513
$$ 319 978 -890 -475 1301 -139 -1263 877 936 -1403 -273 1584 -536 -1451 1175 861 -1688 -175
1350a75J887k378p85K721m20k451J543J664k203n68K314n33j891J344J069j761
$$ -175 1712 -666 -1451 1270 850 -1601 -58 1606 -597 -1165 1149 616 -1275 69 1138 -623
1366f23j19J620p41j052J232K44j256N53Q62j103j08J224o73q86J336J71j584
$$ -623 -742 878 137 -915 317 561 -695 -142 720 -383 -491 733 60 -826 510 681 -903
1383i03P14J353j521p01J995k68k020J249J511k045n92K383m91k202J534J506
$$ -903 -189 1164 -357 -1058 937 669 -1351 -102 1409 -636 -1228 1155 664 -1538 -4 1502
1399A502k195m80K401o01k048J514J271j998k97J985o70j500J291P01j533J44
$$ 1502 -693 -1173 1228 627 -1421 93 1364 -634 -931 1054 384 -1116 175 876 -657 -513
1415e13J272q31o40J153j16j016Q10N02j179K89J130j007o48J515j60j613J018
$$ -513 759 -72 -712 441 325 -691 119 621 -558 -269 861 -146 -794 721 561 -1052 -34
1432c4J230j766m67K104n26j989J482J355k154l83K375o82k040J637J297k188
$$ -34 1196 -570 -1037 1067 541 -1448 34 1389 -765 -1148 1227 545 -1495 142 1439 -749
1448g49k38K240q02j774J592Q97j929O3J730r58j098J427K29j454O34R89j192
$$ -749 -987 1253 451 -1323 269 1166 -763 -700 1030 72 -1026 401 630 -824 -190 799 -393
1465c93j91J320o32r49J307K11j520O79J277j476n70J897m02j859J361J256k072
$$ -393 -584 736 104 -845 462 673 -847 -168 1109 -367 -937 960 558 -1301 60 1316 -756
1482g56l30K297p62j981J721J204k301r6K356r77j828J828R23k198J73K036j183
$$ -756 -1086 1211 449 -1532 189 1393 -908 -1004 1352 375 -1453 375 1298 -900 -727 1309 126
1499A26j364J770L86j906O15J450j381o21J657l52j408J188P17j612K68J527j168
$$ 126 -1238 532 918 -988 -373 1077 -304 -925 732 380 -1028 160 877 -735 -467 1060 -108
1516a08q73J747p0j807J071J302j843m10K120p14j843J665J045k257O0K294j200
$$ -108 -981 766 696 -1111 -40 1262 -581 -991 1129 415 -1428 237 1282 -975 -915 1379 179
1533A79j723K079P32k401M54K162j469j402K123L28k233P87J743j657q56K000
$$ 179 -1544 535 1267 -1134 -680 1482 13 -1389 734 1062 -1171 -384 1359 -298 -1154 846
1549H46k16j827J159J131j723j44J758q35j220J536L48j731O76J397j504n71J880
$$ 846 630 -1197 -38 1093 -630 -774 984 149 -1071 465 813 -918 -242 1155 -349 -920 960
1566I60n04j692J458R61k068Q8K103j220j538K047N28k370O81K079j710j238K351
$$ 960 456 -1236 222 1183 -885 -797 1306 86 -1452 595 1123 -1247 -566 1513 -197 -1435 916
1583I16R7k377J067J836j959q37K321l22k099J324J334j945k99J987p53j480J498
$$ 916 1013 -1364 -297 1539 -420 -1257 1064 742 -1357 -33 1301 -644 -943 1044 291 -1189 309
1600C09O07j767M06J498j240p35J668k18j563J166R27j757K9J824j083j339J860
$$ 309 916 -851 -445 1053 -187 -922 746 528 -1035 131 1058 -699 -670 1154 71 -1268 592
1617E92L87k169P20J896j727j063K314n8k330J239J736k082p00K442n04k169J557
$$ 592 979 -1190 -470 1426 -301 -1364 950 892 -1438 -199 1537 -545 -1245 1197 693 -1476 81
1634H1J368k200k48K219q73j710J670P81j992L04J721j214r63J690Jj619R51J046
$$ 81 1449 -751 -999 1220 347 -1363 307 1088 -904 -600 1121 -93 -1056 634 635 -984 -33 1013
1652A013j551j31J653q33j234J588L69j875O32J626j565q88K092j57k101J232
$$ 1013 -538 -669 984 151 -1083 505 874 -1001 -369 1257 -308 -1196 896 739 -1362 -130
1668a30J563k041n78K366n51k108J595J317k215k14K284r01j794J741Q73k127
$$ -130 1433 -608 -1186 1180 629 -1479 116 1433 -782 -996 1288 387 -1407 334 1207 -920
1684i20K27J907j191j202J747K22j780P52J287j417m29J629n21j293J283N58j643
$$ -920 -693 1214 23 -1179 568 790 -990 -238 1049 -368 -797 832 311 -982 301 859 -784
1701g84L93J473j249q48J767q5j811J051J321j790m59K087n84j855J510J154k067
$$ -784 -391 1082 -167 -1015 752 667 -1144 -93 1228 -562 -1021 1066 482 -1373 137 1291 -776
1718g76j47K151q82j703J689Q44k051J81J891j105j286J686L79j819N60J440j282
$$ -776 -923 1228 346 -1357 332 1176 -875 -694 1197 92 -1194 492 871 -948 -388 1052 -230
1735b30o97J612k01j421R79Q36j419jJ415q35r28J384J52j516P08J161j386m66
$$ -230 -927 685 484 -937 42 878 -541 -542 873 38 -890 494 646 -870 -162 999 -387 -853
1753h53J702m45j535J253R44j769o7J847q35j464J575O91j893K33J760j079j209
$$ -853 849 404 -1131 122 1066 -703 -770 1077 242 -1222 353 1044 -849 -616 1144 65 -1144
1770a144J630L96j768M76J458j177q08J521j6j433P63R51j224k59J339m99j010
$$ -1144 486 882 -886 -410 1048 -129 -937 584 568 -865 -102 849 -375 -634 705 206 -804
1787h04J041M18j267L18J094r41n79J287j43j251Q53Q21j346j33J476o65j170
$$ -804 237 655 -612 -294 800 -141 -720 567 424 -827 26 847 -499 -632 844 179 -991
1804i91J282N66j611K32J524r68j069J500L38j632M49J377j094q02J447O4j429
$$ -991 291 857 -754 -522 1002 34 -1035 465 803 -829 -380 997 -97 -899 548 612 -817
1821h17O36J047j137m26J271k45j074Q09N75j077N6J020o33o34J003O1j045N18
$$ -817 -181 866 -271 -697 574 329 -745 64 639 -438 -382 638 5 -629 374 435 -610 -92
1839i2P90r81k69J147l48j010Q99N55j222Q5J199o96q76J159L07j335L61J170
$$ -92 698 -283 -552 595 247 -763 136 691 -531 -446 753 57 -819 340 647 -688 -327 843
1857H43r40p08J281R5j315N48J016j024m82J229j54j089O70O95r83j53J002l87
$$ 843 -97 -805 476 571 -744 -196 820 -204 -686 543 389 -700 -30 665 -318 -471 531 144
1875A44p53P84K89r13K38P48o42l79Q74j10q11N63N24q84n2R44m49p32Q36L11
$$ 144 -609 175 464 -449 -211 537 -105 -484 390 280 -531 32 556 -328 -380 564 115 -617 219 530
1895E30j021J94R43o82o04R84J19j049M13Q36q28m14J038q2r89N54P01q88k38
$$ 530 -491 -297 646 -36 -640 344 463 -586 -173 663 -165 -579 459 377 -612 -58 643 -245 -483
1914d83R72k55q05O31M41q31PP89m23n17O81J23p18K81N41n92j97P10k04n97N50
$$ -483 489 234 -571 60 501 -330 -323 466 43 -474 207 330 -388 -107 434 -158 -355 355 151 -446 104
1935A04L11p34Q0P07m77m61P34Q1q21L47O59o83l49Q81o6q53N01O10q05k10R05
$$ 104 415 -319 -239 468 -9 -470 264 345 -476 -129 530 -153 -502 379 313 -540 -39 571 -234 -444 461
1956D61k29p69N86M80q12p1Q21l25o42O06L18p41O3O36l84l93N81L4n49K95L57
$$ 461 232 -537 49 529 -283 -354 467 142 -500 106 424 -317 -254 382 -2 -395 186 220 -329 -34 323
1977C23n01n0N64k98l95N43Q7o31K67N41n88k62P49j34p19M93N14p80j45Q86k77
$$ 323 -178 -228 336 38 -357 186 273 -358 -91 450 -138 -400 349 215 -504 -11 503 -277 -422 464 187
1998A87p71O23N02q50r2R00l29p01O24L91p92nP50l58n44N91K14o52J31N27l99
$$ 187 -584 39 541 -309 -401 499 170 -531 93 484 -308 -313 437 79 -465 126 340 -312 -181 346 -53
2019e3k58N15o2m39L36K34n13J13M78m02k83O17m6o63M04M91o88j69Q11k38p52
$$ -53 -311 204 142 -297 39 273 -240 -127 351 -51 -334 283 237 -426 -22 469 -219 -388 423 185 -567
2040e67O19M74q57p3R06l34p65O98M28q65l2Q51l53o36O42K92p43P1O73m26m00
$$ -567 52 526 -331 -404 502 168 -597 101 529 -336 -368 483 130 -506 136 428 -315 -244 429 3 -397
2061c97N76P2n75K42L93m49j14N11k07l66M60J06n56K24M70n24k18P02j52o69
$$ -397 179 251 -324 -82 311 -138 -252 259 52 -314 146 252 -304 -80 390 -134 -352 350 198 -471
2081d71M97M53p47j10Q26k94p26O55M14q52OQ56m08o48P04L05q19J02P37m47m90
$$ -471 26 479 -268 -378 448 154 -572 83 497 -355 -349 507 99 -549 155 460 -359 -257 480 33 -457
2102d57O53J26o69K28M96m86j98N63j23m64L90K18n13Q6M80l84k51N59n9n77L94
$$ -457 196 322 -347 -119 377 -109 -307 256 133 -331 59 277 -236 -150 330 -54 -305 254 195 -382 12
2123A2M07o20j06P09k65o22N89L49p74J5P79m06n88O82K56p96J44P16n00m34O88
$$ 12 419 -201 -307 402 137 -485 104 453 -321 -306 473 67 -521 161 417 -379 -235 481 -19 -453 235
2144B35Q3p07L00N32n61k15O39j33n46M21K88n87N9N29l51l29N56nn57L18L98
$$ 235 318 -389 -89 443 -118 -333 306 173 -373 48 336 -251 -192 337 -14 -343 213 208 -349 -31 367
2165C67n48r5O29k38n32N51K48o93R2O73m44m66O76J28p47K39O42n70l69P50j6
$$ 367 -181 -276 353 115 -417 134 382 -311 -219 454 10 -456 220 348 -399 -160 482 -88 -457 293 277
2186B77p24L90N07o29j73P23k17n86N09L13o63K9O35l64m15N67J00o25K75M45
$$ 277 -447 -57 450 -179 -352 371 154 -432 77 390 -273 -244 391 27 -388 179 279 -346 -71 374
2206C74n12j74O30j91n23M97K50o43R9O07m49l75O78L1p16L36N68o39k57P76j35
$$ 374 -138 -312 318 127 -396 101 351 -292 -193 414 -35 -410 268 299 -417 -81 487 -152 -409 367 232
2227B32p13M81M86p19j30P70k55o33N69L28p16M9O74l93m42O20R4o59K60N10n28
$$ 232 -481 0 486 -233 -363 407 152 -481 88 416 -300 -251 423 30 -412 208 302 -357 -97 413 -115
2248a15k27O44j20n63M24L30o24K7N97l52m10O05P3o59K71N32n86k30P43j47p06
$$ -115 -342 302 182 -381 43 373 -251 -224 373 21 -389 216 289 -370 -99 433 -153 -383 360 213 -493
2269d93N21M39p36p7P98l21o48O27L35p74M6P37m10n00O31J59o87K07N44m83k73
$$ -493 28 467 -269 -346 452 131 -517 110 445 -329 -283 454 44 -456 175 334 -353 -146 398 -85 -358
2290c58O25p6n69L94L35n69j6N85k99m42N58J34o31K00N32m91l00O49l8o38L94
$$ -358 267 191 -378 16 351 -218 -234 351 52 -390 168 302 -329 -129 403 -88 -388 261 223 -415 -21
2311b1M27o15j15P04k62n76N63L11p21N0O99l91n03O40J75p07J73N95m75l48O40
$$ -21 406 -209 -324 380 118 -458 105 416 -305 -255 444 53 -450 190 365 -342 -169 426 -49 -397 243
2332B43oo00L20M02n24j13N70k03m49M71J83n69J26N18m19l08N94po02L17M60
$$ 243 237 -363 -43 359 -165 -278 292 89 -360 111 294 -275 -149 369 -50 -358 236 229 -373 -56 404
2353D04n42k01O33j30n62M04L56n88l7O16k77m74N22K06o34J31N73m17l58N87
$$ 404 -138 -339 294 164 -398 6 362 -226 -263 353 76 -398 124 330 -304 -173 400 -17 -375 212
2373B12P1o21K29M78m60k35N70r3m93L59L03n20k4N20k49l49M38J24n16J58M34
$$ 212 283 -338 -109 369 -91 -326 244 151 -342 17 320 -200 -224 296 47 -302 136 260 -256 -98 336
2394C36m04k17N20n3n18L23L62n14j18N67j66m83M05K84n31oN38k73l65M46J31
$$ 336 -68 -285 235 182 -336 -13 349 -165 -283 284 118 -365 40 324 -207 -213 325 52 -313 133 264
2415B64n06J35M35l68k61N00J2n03K27L88m29j61M97j05m15L06K48m41OM30k17
$$ 264 -242 -107 328 -40 -301 199 211 -292 -65 323 -106 -267 230 125 -290 16 264 -177 -171 259 42
2436D2l13L98Q2m32J50L49l40j74M50p9m16K88K80m46n3M68j64m04L63K16m48
$$ 42 -271 127 209 -223 -73 276 -64 -238 212 133 -283 5 285 -161 -214 254 90 -314 49 265 -183
2457a83J5M33k27k87L71O9l91J42L33l37j57M17n9m04K54K74l97q9M42j30l54
$$ -183 -168 265 38 -249 122 191 -200 -58 275 -62 -219 198 139 -265 -11 263 -134 -223 219 89 -265
2478b65L06J78l82K9L65k14k51L60M5l64J41K95l09j19L63p8l22K55J80l71K3
$$ -265 41 219 -163 -134 231 17 -234 126 171 -193 -52 243 -66 -185 178 100 -222 33 213 -158 -135
2499a35L59k13k63L58Q2l95J09L43k68j86L60rl55K03K35l39n7L82j53l12L01
$$ -135 224 11 -252 106 188 -207 -98 245 -23 -209 151 142 -213 -10 225 -114 -171 211 58 -254 47
2520D7J79m11L4L81k15k76L44R9l68J05K99k49j60L32l0l02J97J96l11k5L23j53
$$ 47 226 -185 -151 230 15 -261 83 182 -186 -81 218 -31 -191 141 111 -191 6 202 -109 -134 189 36
2542C6k57L15P7l67J31L04l00j63M00l4l87K31K83l82r7M28j17l42K88J89l91
$$ 36 -221 94 171 -196 -65 239 -61 -224 176 142 -245 -14 269 -113 -210 218 101 -241 47 236 -155
2563a55J6L72k25k41L62M9l94J44L22l15j57L88l9l59K19K44l43m6L61j60k70
$$ -155 -139 233 8 -233 129 178 -216 -72 250 -65 -222 166 127 -232 -13 231 -112 -158 203 43 -227
2584b27L17J03l78J19L10k94j76L94k6l98K48K60l84q0M51j41l90L48K06m40N
$$ -227 90 193 -185 -66 244 -50 -226 168 142 -256 -8 252 -132 -212 239 98 -292 56 262 -178 -173
2605a73M47k27l28L90J06m26J25L27l00j55L82n7l58K57K30l94j6M08k03k98L61
$$ -173 274 47 -281 109 215 -211 -86 241 -59 -214 168 111 -247 10 240 -154 -170 238 35 -263 98
2626I8J14m18J09L68k95k17M10j7m06K33K94l95r1M41j47l62L33K08m52L0M35
$$ 98 212 -206 -97 271 -24 -241 169 152 -254 -21 273 -122 -213 228 81 -281 52 260 -192 -162 273
2647B73k55l02L97J09m53J25L95l33k09M30l4m02K42K59l73m7M01j66l12L47J22
$$ 273 18 -284 113 222 -231 -106 289 -44 -253 177 143 -259 -17 242 -131 -178 223 57 -255 92 214
2668B14m38J14L85l32k01M49k5m46K60L13m11j13M71j37l92L31K16m44K5M22k49
$$ 214 -224 -110 275 -57 -258 191 166 -280 -20 293 -118 -231 240 103 -289 42 258 -186 -161 261 12
2689A2k86M00P9m51J61L63l42j73M35o5l86K51K76m12m5M16j71l27L44J40m18
$$ 12 -274 126 205 -246 -85 278 -64 -237 198 133 -253 -2 274 -138 -183 233 62 -265 79 219 -199
2710a99Q9L75k99k16M20qm30K50K91m03p8M47j43l91L63J99m58L0M41k53l19M12
$$ -199 -110 265 -34 -250 170 162 -268 -18 273 -130 -208 239 96 -295 68 267 -191 -161 280 27 -292 120
2732A20J03m56J47L63l41j77M28n6l88K58K55m05l5M26j79l30L58J23m22J07L69
$$ 120 223 -233 -86 277 -64 -241 187 131 -257 1 256 -149 -184 242 63 -267 91 214 -208 -101 268
2753B68k99k22M18j2m03K22L00l85q8M28j34l63L28J89m45M4M17k55k95M11R2
$$ 268 -31 -253 165 153 -250 -28 272 -113 -201 227 93 -270 58 247 -198 -154 263 8 -287 124 216
2774B16m62J55L58l37j88M42m5m09K74K65m19l9M24j64l42L60J43m26Q8L63k73
$$ 216 -246 -91 267 -70 -258 184 139 -270 4 269 -150 -189 235 71 -271 89 232 -194 -106 257 -16
2795a6k34M06Lm08K13L01l75j01M28j26l61L16J96m18K6L97k34k86L90Q7m31J40
$$ -16 -250 156 159 -249 -36 265 -110 -211 217 91 -270 46 242 -176 -150 247 13 -273 117 204 -227 -87
2817h7L50l25j92M34m3m02K62K60l94o0M28j64l48L45J72m18M5M02k61k64L95
$$ -87 263 -62 -254 180 137 -265 -3 257 -137 -197 231 67 -281 64 236 -182 -137 265 4 -260 135
2838A35N5m13J56L27l28j50M14q4l57K66K05l84JL79j98k77L62R2m15J25L56l00
$$ 135 190 -223 -67 260 -68 -218 196 112 -245 21 226 -158 -157 222 24 -253 109 201 -214 -89 267 -33
2860c3k00M10l9l82K22K76l68p5M08j34l47L20J74m09M3L87k43k66L93Q3m39J37
$$ -33 -233 177 138 -244 -22 254 -114 -189 219 85 -262 58 232 -177 -134 253 10 -256 137 220 -219 -82
2882h2L61l20j99M19j4m10K28K81l61j05M00j16l32L09J52l81N0L56k38k27L63
$$ -82 279 -41 -240 179 165 -245 -17 264 -97 -202 198 82 -250 59 211 -170 -120 236 -2 -229 134
2903A34K3l85J91K96l39j23L99q9l58K81K14l97k8M17k05l12L57J23l93Q7L65
$$ 134 157 -228 -37 259 -80 -203 196 107 -251 30 244 -153 -181 236 31 -281 76 199 -194 -107 258
2924B58k77k16M00Jl99K02K98l51j35M15p1l74K56K41l76n8L81j31l02K94J33
$$ 258 -19 -235 165 166 -233 -31 267 -84 -219 196 125 -249 7 248 -128 -186 195 64 -238 56 189
2945A89l64P8L09k39j88L61j4l49J99K53l44p2L87j46l09L07J68m08K6L93k17
$$ 189 -175 -97 212 -27 -215 146 132 -217 -18 235 -109 -181 206 60 -249 58 226 -182 -156 237 20
2966B0k83L62R7l93J00L44k84j83L70j4l61K06K42l40o3L75j23l20K78J80l68
$$ 20 -263 99 196 -197 -97 247 -37 -220 150 136 -225 -19 223 -117 -180 195 72 -248 30 210 -158
2987a58J1L44j59k55K89Q8l22R6K74k51j24L18n4l08K20K02l34k0L52j67k73L14
$$ -158 -147 197 38 -217 72 160 -162 -66 208 -43 -167 151 97 -211 9 211 -123 -143 209 42 -231 83
3009H3J07l67O2L39k32k26L59M2l78J39K94k77j24L31m8l00J97J93l10j6L13j59
$$ 83 190 -177 -115 224 -8 -234 125 167 -211 -72 222 -55 -179 152 104 -196 1 194 -116 -132 181 22
3031B2k34K88R2l35O5L07k19j85L11K5l10J50K03k41q2L00r0k44K23J28l09M0
$$ 22 -212 76 168 -167 -102 205 -14 -199 112 137 -173 -23 180 -61 -143 157 67 -177 46 174 -135 -95
3053i5K86j87j93K98M0l31J39K64k72j37L33j9l26J83K12k85n0K96r0k67K50J08
$$ -95 191 4 -189 109 149 -182 -43 221 -51 -188 145 126 -200 -17 195 -90 -140 156 66 -201 49 157
3075A57k97N8K70k06j63K94J2k97J40K37k61r8L03o0k67J97J57k70j5K68j38j78
$$ 157 -140 -82 188 -18 -181 113 125 -172 -32 205 -56 -154 149 89 -178 19 176 -94 -109 159 21 -157
3097a57K36N2k64R0K27k34r9K94o3k70K05J77l01m6L36j17k65K40J29l12L1K95
$$ -157 79 131 -133 -43 184 -50 -149 145 82 -188 17 194 -107 -153 183 66 -199 41 170 -142 -111 184
3119A84j62k12K74N3k99J12K34k28j24L08n6k66J82J76k87k3K97j30k09K34Q7
$$ 184 22 -190 84 137 -162 -50 184 -44 -168 140 84 -182 0 176 -111 -134 163 33 -176 58 145
3140A45k85O4K44j85j32K59k2k56J60J70k63l2K95j40k19K55J08l17N1K90j86
$$ 145 -140 -76 168 -17 -149 110 88 -168 -8 162 -101 -133 162 22 -197 58 166 -151 -100 190 4
3161Dk07L00N1l21R9K79k31j36K88j5k76J55J87k61m1K84j19k21K34R7k86N6K53
$$ 4 -203 97 148 -173 -74 205 -26 -162 126 111 -165 -10 177 -84 -125 159 40 -181 53 150 -136 -80 173
3184A73j84j51K58K0k65J26J86k43m5K62r3k09K01J01k66M6K49j81j65K78K4l06
$$ 173 -11 -162 96 116 -149 -23 163 -80 -125 137 44 -165 36 137 -129 -83 166 -15 -180 98 122 -184
3206a84J32K44k58j11L12k2k88J58K00k61o1K90r4k30K03J19k60K8K41j58j59
$$ -184 -52 192 -66 -177 135 113 -175 -17 183 -78 -139 151 57 -173 30 149 -111 -83 158 0 -159
3227a59K46J9k59J20J98k27p7K64o8k24J87J28k47JK53j47j66K39L0k66J13K17
$$ -159 87 106 -153 -33 165 -62 -139 125 57 -167 20 148 -99 -98 155 8 -158 81 111 -155 -42 175
3249A75k37r2L01o3k79J93J97k99m0L17j09k56K27J47k96OK71j38j90K22N8k38
$$ 175 -62 -154 147 84 -195 -2 195 -104 -144 173 64 -192 35 182 -114 -108 163 25 -165 57 115 -123
3271a23Q5J85k01p2K40p4k04J80J20k35kK43j23j72K28M9k60R3K19k11j18K71
$$ -123 -38 147 -54 -126 114 40 -164 16 136 -99 -101 142 19 -153 75 124 -136 -43 176 -35 -153 118
3293A18l0k50J61J83k59o0K99j20k34K29J22k85K8K77j73j83K54P0k70P6K12j80
$$ 118 88 -162 -1 182 -77 -137 162 42 -192 37 159 -126 -98 179 6 -177 77 147 -123 -47 165 -15
3315a5j24K40k9j93J14J36k09rK08j22j44K15L5k38R0K04j99j01K58l5k43J54
$$ -15 -139 101 72 -121 -7 129 -80 -89 119 -3 -147 68 103 -135 -45 159 -40 -141 117 82 -161 -7
3337gJ69k26o2K66q9k21K08J24k70QK61j38j88K27P2k59O2K28j81j30K47ok36
$$ -7 162 -64 -126 140 51 -170 38 162 -108 -100 161 23 -165 62 134 -125 -63 165 -16 -146 101 95 -141
3360a41J30J55j95m5K18p6j73J74N6k07N5J86j75q3K10j6k11J38J61k36m4K58
$$ -141 -11 144 -51 -96 122 46 -127 47 103 -104 -49 137 -38 -121 89 73 -138 0 161 -75 -119 139
3382A39q0k16J92J11k41NK46j40j73K26N8k56Q0J97j70j17K38j2k33J34J56k04
$$ 139 59 -157 35 146 -95 -90 156 16 -157 69 127 -129 -49 148 -22 -139 99 87 -146 -12 144 -60
3404f0n9K41q2j85J74Q5j98K1K04j45j23K08kk04J11J55k05l6K21o7k08J91J11
$$ -60 -119 122 40 -145 29 114 -84 -63 141 -4 -127 81 79 -125 -14 141 -64 -100 121 54 -154 37 148
3427A48k46K0K37j40j73K29N6k54P5K16j82j23K37mk36J25J70k14o4K36n8k08
$$ 148 -98 -78 159 19 -154 75 131 -123 -48 168 -14 -137 100 96 -140 -15 155 -59 -123 113 55 -153
3449a53J72J16k30J0K20j12j55J92N8k32Q0J73j62q4K06l5j97J51J15k10kK20
$$ -153 19 135 -95 -85 135 23 -132 60 118 -114 -34 139 -23 -107 99 64 -133 18 133 -77 -79 141
3471A41j16j72K16O7k62P2K20j86j36K54J6k64J17K05k06j11K51k5k32J47J44
$$ 141 25 -147 69 136 -126 -54 166 -20 -156 98 114 -150 -33 172 -34 -145 106 81 -151 -4 140
3492A40k23k9K24r2j58J74O9k07M8J88j42j02J82J5j98J09J22j75l9K06p9j70
$$ 140 -83 -112 112 20 -138 36 105 -102 -54 134 -8 -110 72 87 -111 -2 120 -55 -94 112 33 -137
3514a37J78Q7k40L9K14j57j34K36L8k67Q8K17j81j35K53qk21J01J70j86o9K11
$$ -137 41 128 -112 -73 141 -16 -150 86 124 -143 -55 162 -19 -154 99 91 -130 -29 141 -45 -114 97
3536I7m0j94J43J19k03mJ96j09j22J81J8j89Q2J52j59o2K00n3j64J31R8j91nJ95
$$ 97 57 -137 6 125 -78 -82 114 5 -117 64 82 -107 -25 127 -32 -94 106 53 -111 20 118 -73 -78 117
3560A17j03j45J78N3k10M6J99j52j17K13K0k21R2J78j78r1K23k9k03J22J34j84
$$ 117 14 -131 47 100 -110 -64 135 -17 -134 79 99 -122 -30 148 -30 -121 102 73 -130 -8 126 -58
3582e8l4J87p7j46J60N0j81N0J42j24p2J74kj76J10J29j86k5J79n8j60J51P2j83
$$ -58 -92 95 18 -128 32 82 -99 -49 93 -31 -103 71 69 -107 3 132 -54 -79 100 42 -118 33 105 -78
3606g8J1J79j11j27J78K8j83P0J32j30p2J91k1j88J27J16j80l1J93o0j60J40Q2
$$ -78 -67 112 1 -126 52 80 -103 -33 99 -31 -103 88 67 -121 6 122 -58 -89 104 44 -116 24 106
3629A06j88K1J62j07j02J49K6j62O7J43j47n7J80m2j64J40Q0j66lJ82r2j43J53
$$ 106 -82 -61 101 -6 -108 41 67 -95 -28 115 -32 -89 91 49 -115 25 105 -61 -64 118 26 -117 36
3652C6N7j95N0J60j38p9J75Lj84R6J31j61l5J84n5j52J30R3j75mJ80r3j17J46
$$ 36 93 -102 -52 108 -30 -109 66 69 -115 -19 112 -49 -84 100 45 -107 23 116 -59 -63 117 24 -93 53
3676E3M3j82N3J47j38q4J76j7j58J03J23j72j1J75o7j52J57N0j83L1J74j31j09
$$ 53 96 -86 -33 114 -24 -108 68 51 -107 -4 119 -53 -64 111 44 -108 49 99 -84 -53 121 -10 -119
3699a19J72K2j73P1J38j55o3J87l5j60J33Q5j72kJ85q6j33J59M1j84N9J44j33
$$ -119 53 75 -98 -27 111 -44 -107 80 45 -115 18 103 -69 -71 114 28 -105 54 95 -89 -30 114 -19
3722a9p4J63Lj69P1J33j62l0J74n9j39J35O9j67K7J54j12j04J73K0j99Q4J37j45
$$ -19 -93 70 73 -96 -25 108 -54 -84 90 31 -108 27 96 -71 -44 110 -2 -106 67 87 -112 -28 109 -36
3746c6o7J84j8j82J13J10j64l7J85o9j40J61O9j84K2J71j18j00J63K5j75O7J29
$$ -36 -103 81 63 -119 -6 104 -60 -97 88 19 -121 40 109 -75 -53 118 0 -100 63 88 -87 -20 109
3769A09j45n3J75m4j55J24R2j72J0J59q9j13J61J8j69O8J38j37p1J91l6j79J16
$$ 109 -36 -89 86 42 -113 11 103 -69 -59 100 11 -102 59 77 -92 -24 114 -23 -94 97 61 -118 -2
3792bJ25j84k8J87o9j57J52P5j82KJ81q7j23J56L1j67N9J43j36o1J63k9j51J09
$$ -2 123 -61 -89 98 29 -128 24 99 -83 -81 100 13 -110 46 77 -90 -31 112 -24 -85 78 49 -102 7
3816GR4j68%J70q3j20J28N3j70M8J58j36p6J68k1j53J05J10j72k1J94q4j57J57
$$ 7 101 -67 -67 103 20 -100 28 81 -89 -41 117 -19 -95 73 52 -101 4 114 -58 -79 115 31 -126 31
3840C1P4j90J6J89j07j35J83L0j88N7J58j33r0J79j9j50Q4J16j54j3J59p3j37
$$ 31 105 -85 -69 120 13 -122 61 91 -97 -40 118 -15 -105 74 55 -95 -11 105 -49 -62 97 24 -113
3863a13J51M5j77N0J39j10r4J74J8j91R7J27j63l5J71n3j41J39P0j66jJ82j13
$$ -113 38 83 -94 -44 95 -15 -109 65 83 -108 -11 116 -47 -82 89 36 -105 34 104 -62 -63 119 6
3886Fj26J84K7j92O3J67j50q1J82qj76J00J22j54m2J63n0j25J15N9j48K1J36r3
$$ 6 -120 64 91 -101 -38 129 -21 -102 80 72 -104 -4 118 -36 -78 85 35 -90 25 84 -64 -43 93 0
3910@q6J33Nj51R4R7j41l1J60n0j35J22P8j66J4J58r8j01J57K7j70O9J35j43o6
$$ 0 -86 47 52 -99 -5 92 -49 -80 80 30 -105 17 95 -71 -57 101 3 -98 59 86 -84 -15 120 -23 -89
3935h9J69j0j69Q7J32j57n7J80m8j47J20Q7j62OJ41p3r5J12K2j27N5R8j04k4J21
$$ -89 80 70 -99 -12 120 -37 -94 86 38 -109 11 98 -64 -58 83 10 -85 27 49 -78 -23 75 -29 -53 68
3960F8m4j13J12L4j16K1J28r2r5J59J8j60M8J38j35o2J59pj63J01J01j35m2J57
$$ 68 24 -89 23 57 -59 -38 90 -2 -97 62 80 -80 -32 106 -29 -91 68 61 -102 -1 100 -35 -77 80
3984H0l7j42J07R4j61j0J58q2r8J22M0j48L7J15r4n2J38l4j18J02O0j31QJ21p4
$$ 80 43 -99 8 102 -59 -69 89 7 -91 31 71 -77 -40 75 -19 -71 67 33 -85 17 77 -54 -46 75 1
4009Ap8J23K2j44N3J29j16o0J40jj54P6J11j33m8J64l9j28Q6R6j45j1J45p2r5
$$ 1 -77 46 68 -76 -23 106 -10 -70 70 69 -85 -9 102 -31 -79 85 46 -82 4 100 -45 -56 89 17 -78
4034g8J12M2j39L8J08r5p4J35oj24O6J00j17l0J30m8r4R1N2j26J2J32q0q0J33
$$ -78 34 76 -63 -25 83 -12 -86 49 43 -81 -15 85 -32 -62 68 20 -74 17 69 -57 -45 87 7 -73 60
4059F0Jj34O2R6j08m6J44k8j30R6O7j10l7J46o0j03J01O0j23PJ23q3p1J15J3j23
$$ 60 61 -73 -11 85 -23 -69 75 47 -83 13 80 -30 -67 79 19 -84 17 77 -46 -39 84 1 -70 45 58 -65
4085f5N2Q6q7n6J29k0j12P3Q3j18j0J14m5j00R6N6j24J2J12p8n3J09Nj19N5Q5
$$ -65 -13 73 -14 -70 59 39 -73 0 83 -35 -45 69 24 -76 20 76 -48 -36 76 -2 -55 54 59 -60 -5 80
4111H0j12j8J16l2j20R0P1j16k0J29o0q7J06L3j12K2J03q6n7J19Oj24N4R1j00
$$ 80 -32 -50 66 34 -86 4 75 -41 -61 68 8 -79 27 60 -52 -30 73 -13 -70 49 55 -69 -15 76 -24
4136b4l7J17k5j14Q7O8j20NJ03m3p3R0L3j18K5J08p9n5R7Mj07O2O3r7k0R8m0q2
$$ -24 -61 56 31 -83 4 72 -48 -43 60 17 -56 34 67 -51 -26 82 3 -52 45 49 -58 4 67 -30 -50 48 8 -74
4164g4J05L6j18J0J04n9p5J14J4j14L8J00j00m7J24qj07O0O7j09j2J14m0r6Q4
$$ -74 31 67 -51 -41 63 4 -71 43 57 -57 -19 81 -19 -66 58 50 -57 3 70 -39 -51 63 23 -73 11
4189A1M8j02JJ03n4o9R1K2j17N1P8r5j7Q5pq9O2M7r0nJ01n6p4R9K9j17L6R9q0
$$ 11 59 -43 -42 61 7 -62 29 51 -66 -15 63 -32 -49 36 29 -60 2 49 -41 -46 55 -1 -75 24 53 -64 -28 71 -9
4218in5J14jj09N7Q1j10j7J18m5q7P1O2j14jJ09o1o3R8Rj04L8Q1q0m6J17j6r9
$$ -9 -64 50 49 -60 -3 78 -32 -49 69 24 -63 8 70 -44 -45 64 3 -60 38 47 -57 -19 62 -18 -64 53 37 -62
4246f2O5O6j00j3R7l7q6R8L0j10J5R4o5n1J06rj05O5P4r9k4J15l0r9Q4N2j10k
$$ -62 3 69 -31 -44 53 16 -70 28 58 -52 -37 57 -8 -59 47 38 -67 -2 72 -27 -51 64 34 -65 19 71 -39 -41
4274d1J17o9q6J15L1j33L5J05q2o4J20Oj22N6R0j02m1J26m0q2P9M6j23K1J09p5
$$ -41 76 7 -79 36 67 -66 -31 74 -8 -72 48 54 -68 -12 78 -24 -65 61 21 -61 18 64 -59 -38 71 -4
4300dn6J01nj05O0P0q7k7J14m4r1R2N5j13J3J11q0o9J12J9j36M5J12r9o7J23O
$$ -4 -60 41 36 -69 -9 61 -26 -53 61 17 -74 18 73 -40 -27 84 4 -65 47 66 -70 -25 87 -12 -79 44 50
4327E0j30O2J03j14m4J36l9j08R8N3j04j0J09n6o4R2J2j16M7Q9r0l8J18k6q9P8
$$ 50 -80 -18 85 -29 -73 63 24 -84 14 67 -37 -47 62 6 -58 34 46 -70 -23 66 -24 -62 56 30 -59 19
4353A9N0j07JJ16p1p5J11J7j18L1J25j06o0J21j0j20N9R4j08l3J21l0j15Q6P1
$$ 19 69 -38 -37 79 8 -67 44 61 -57 -26 99 -7 -67 54 44 -76 -17 77 -31 -64 57 27 -88 -2 69
4378F9j30KJ17m8q4Q9M5j22L2R7q0m1J00oj02O2O0r5%J05o9o8J12K1j16K8J11
$$ 69 -61 -59 58 10 -74 15 60 -62 -30 67 -13 -54 46 40 -62 0 60 -35 -35 70 1 -67 45 66 -50 -22 89
4405H9j01o1J27lj32Q6Q0j07m3J40l6j24R7O2j22j4J24l7r1Q8M0j08J9R4p5m2
$$ 89 -12 -73 54 51 -81 5 85 -22 -65 75 39 -85 12 74 -48 -62 62 25 -66 22 62 -46 -27 67 -8 -50
4431e0Q4pr0P3M3p9pP9l6o0Q2Lr1M2Q8q2m8J00Mj21O5Q0j08j9J06k0j16Q4N9j06
$$ -50 34 27 -63 10 53 -26 -33 46 10 -50 32 35 -56 -14 74 -8 -56 44 48 -73 -8 72 -36 -55 51 31 -85 -1 58 -48
4461d8rJ23n3r5J05L4j03J2Q8o4m7Q0Nq1M7M8p1rQ6m0p0Q2J9q4L3O8p5l6J02k0
$$ -48 -57 66 13 -82 23 57 -46 -34 54 -10 -57 23 28 -53 -6 42 -29 -38 48 8 -62 20 39 -45 -12 56 -19 -55 47 27
4491B7r9P3O1j01j3J01l8q5O7O7j03LR8n6p5Q3L7r7J8R1o5m2P6Oq1M9N3o9k1P8
$$ 27 -72 1 62 -39 -52 49 11 -74 -7 60 -43 -40 58 2 -73 10 47 -50 -32 59 -6 -48 28 34 -47 2 55 -14 -35 43
4521D3l8n5O0K7p5L2N7o7k4P7j3p7N6M8q4nR6l9q3P4M5j01J7Q4n2p1Q2L1r4K6
$$ 43 5 -50 10 37 -38 -6 51 -16 -40 37 24 -53 3 51 -33 -38 58 19 -64 10 55 -46 -29 55 3 -68 14 45 -49 -23
4551b3P7n2n2P7Pp3M0M5o5j4P4k2m8M4K8p4KQ1m8m5P1Lp5M5N5q2j3Q7k3p6N9L5
$$ -23 54 2 -50 27 34 -39 1 46 -19 -33 41 19 -29 15 43 -31 -29 52 4 -41 30 33 -42 3 58 -24 -37 50 27 -49 10 45
4583D5r0OR7n3o5Q1K3q3J9O9o2m7Q6Jp3L6N7n3k2P3k2o9N8L4p2%O6m4m6P4J9p9
$$ 45 -45 -39 58 5 -60 21 44 -39 -20 49 -13 -60 26 27 -46 -10 47 -6 -28 45 23 -46 12 46 -26 -26 40 -4 -50 24 43 -36
4615c6K8N3n5l0P2kq5N2N0p4j5Q8l7p7P8L9q0JQ3n4o4Q1L0r2K6P3o4l4Q9j2p0
$$ -36 -8 45 -10 -40 32 30 -55 -3 47 -27 -42 46 9 -68 10 49 -31 -30 53 -1 -65 16 46 -46 -20 53 -11 -45 44 32 -38
4646c8L5N5p5j4P7j6o6N7L0o5LP4m3n5O6Lo3K4N9n7l9Q2j3o7M2N1q5lP5j8o8O5
$$ -38 -3 52 -23 -37 40 24 -42 15 45 -20 -17 57 14 -41 25 28 -35 -11 48 -9 -48 34 21 -46 -4 47 -38 -41 34 16 -52 13
4678A3L7q3LP0m0n4Q1Np4K7O9o9k0P0mp9O1M5q4nQ1k9o3O0L2q1J3O1l7n9Q2Mp8
$$ 13 50 -33 -30 40 0 -54 27 32 -42 -15 54 -15 -35 35 31 -48 13 58 -26 -31 50 21 -42 18 50 -31 -18 43 6 -53 29 33 -45
4711d5L9M8o3k2P5k1n9M8M5p9pP9l3n5P0J6o9J1P6o7k5Q3mq1L3O5p1l3Q3j5q0
$$ -45 -6 42 -21 -43 32 11 -48 0 45 -34 -41 38 5 -50 20 36 -33 -22 54 -13 -38 45 41 -40 -7 58 -13 -46 37 22 -58
4742e8O6L4p1jP4m2m0N4K1p5J9P0p2k3P8j2p7O5L2o9LO1k3o1O6K2q4K3O8n4l6
$$ -58 8 42 -29 -30 44 2 -38 16 37 -38 -19 51 -21 -44 34 22 -55 10 42 -27 -24 37 14 -47 19 41 -43 -20 48 -6 -42
4773d2P5Op7M3N0p8j9R4k5p6O3M2q4k3J05m1p0Q0J6q0J7P0o0m0Q2Lo4K5N7o6j3
$$ -42 33 39 -38 5 55 -23 -42 52 27 -49 14 56 -28 -51 54 13 -57 23 39 -41 -24 46 -14 -54 28 31 -33 -8 49 -17 -30
4804c0P7k8o6O6K2p6J8O9o6k7P2jp4L9O6q3j5P7j6q3P5L6q3MR1o4n6Q4L1j02Q
$$ -30 47 19 -47 19 41 -35 -17 52 -14 -41 31 30 -44 -5 61 -22 -37 40 24 -59 16 52 -31 -27 64 0 -56 28 59 -43 -35
4835c5R5o7l9O1J0o9L0N9o1j8P5l0n5O4L2p6J3O6n8l7P7Mr4N7M4p0j8Q2j6q4P8
$$ -35 60 -7 -46 15 25 -44 -14 45 -16 -34 41 11 -44 20 52 -24 -11 55 -3 -40 37 41 -53 4 48 -22 -40 42 26 -58 20
4866B0L1r2J3Q3n6m9O3K7p7K0P3n7n2R2jq9M8M6o9j6P5k5n9O1K6o7J6N6l5l6O5
$$ 20 51 -41 -28 55 -1 -50 13 40 -37 -17 56 -1 -53 39 38 -51 -3 43 -26 -42 33 8 -51 10 36 -31 -15 41 6 -30 35
4897C5jp0M1N4p7j2P6k8o7O6L0q5OR2n3n8P6K2j01M1P7p1l8Q2kq0M4M9o7l3R2
$$ 35 34 -36 5 59 -18 -30 46 18 -49 17 47 -38 -32 60 7 -51 25 47 -54 -13 64 -7 -45 37 35 -45 -1 48 -19 -52 40
4928D0j8p3M5N1q2J1P3m8m1O2Pp3M4L9m2k9O7%p4N4L6q0jQ2l8n6N9K5p8K4P1o6
$$ 40 22 -51 -6 45 -37 -26 47 -1 -42 20 27 -46 -2 37 -5 -34 33 33 -41 13 49 -31 -32 50 12 -44 15 40 -38 -14 57 -9
4960il8P9Jp6L2O2o6l5Q6j6o6M6L7o3j0P5l2n5N5J9o5K7O3n9k1O1j0n2L4M4o7
$$ -9 -47 32 33 -43 -11 51 -15 -50 36 20 -46 0 37 -26 -36 39 7 -48 7 26 -39 -12 51 -8 -29 32 22 -30 4 48 -19
4991a9KP2l4n3O0Po5K2N4n6l1O6lo6L1N5o4j1O6j4p1M5M6n4rN4k2l8L4K5n0NM4
$$ -19 -17 55 21 -32 28 35 -30 -8 46 -10 -41 25 22 -44 -13 42 -22 -33 33 19 -52 -7 39 -15 -24 30 8 -30 4 29 -21 -16 28
5024B8m0j9N1Ro0K2L6l4j4M6j4m0M2Rl8J2L7l6l0O9mo7M1K2m7rM5on4M3L2n2j1
$$ 28 -12 -31 20 29 -31 -9 27 -7 -21 25 11 -29 13 22 -16 -4 33 -3 -33 36 32 -35 6 28 -19 -28 17 11 -43 0 32 -20 -31
5057c1N8j7m3M1K7n7KN3k4l6L1J9l5J0L7k9j9L8j6k6K8J6m9K7K9l7k4M7jn3M3
$$ -31 27 10 -33 8 35 -22 -20 33 9 -27 4 23 -12 -2 35 6 -13 25 9 -17 11 27 -22 5 34 -3 -27 20 19 -34 9
5088IK8l7k4N1j8n3L7M3n0j3N0k2l8M8K0n4PM7j7m4M7Om5QM6l0j9L9Nl7J7K8m6
$$ 9 37 0 -24 27 9 -44 -7 36 -14 -27 23 1 -37 11 31 -23 -16 31 14 -30 17 23 -22 -14 32 2 -17 22 27 -10 7 35 -11
5121a1OL5l1k3L5On0K5L7m4j1M8qn5L8M0o0ON2k1m8N0K8n6nN6k8n4O1J8n1NM5
$$ -11 -5 30 -1 -24 11 17 -33 -8 29 -15 -26 22 14 -41 -3 37 -23 -17 35 14 -34 16 44 -12 -17 39 11 -43 18 36 -15 -10 35
5154C5l4k9N5Ln4L5K4l4j4M2j3l6L4J5m3LM6l0k1L7rm5L4K6n1nN8k3n4O4K5o2
$$ 35 1 -28 27 30 -24 11 35 1 -13 29 16 -20 14 29 -14 -11 35 5 -16 21 12 -33 1 27 -24 -29 29 6 -48 16 41 -21
5186b1qP8l9m8N4L0p9J5P2m1l3L6J5n9K2L7l6j7N0j4l6L5K1n3J2M6m6k2N5Lo7
$$ -21 -29 49 10 -38 16 46 -33 -18 54 13 -20 16 31 -28 -6 31 -5 -22 28 14 -22 13 34 -19 -7 39 -7 -29 26 29 -38
5217c8M8K8n0k9O8k0m6L7K6m8nN3k5l4M6K5o0MP3l7n7P6J6p2jO4l6m0O2mn0J7
$$ -38 10 38 -12 -41 27 7 -39 -2 24 -24 -29 24 -1 -35 11 36 -24 -20 53 16 -41 35 51 -21 -22 42 6 -34 28 24 -26 -9
5249iL0k9j5N0k0l4M2Pl8J6L6m7pM8j2n5M5L5n7j5P0k7n8N0L4o8LO9m0m2N7Rn6
$$ -9 21 -8 -23 27 7 -27 15 22 -16 0 36 -11 -18 30 18 -37 8 43 -14 -29 41 14 -44 6 40 -28 -25 44 4 -38 19 28 -28
5282b8J7N3m5l3P0%o0J7M7m8k4N5j0l7K1L3n6JN3k1l0M2Km5K1L6m4j2N8l4m3M7
$$ -28 -11 42 -3 -36 34 34 -26 -9 38 -10 -34 21 11 -26 -5 28 -28 -27 26 5 -25 17 19 -26 -5 31 -13 -25 33 -1 -44 3
5314CL6p4J0O0k0o4P2J3n8LO3l7l8O4J4p8K8L8m6j3N9j1n3K8M3n8oM5k2l7M5Q
$$ 3 39 -35 -25 35 15 -49 23 36 -22 -19 44 7 -31 33 47 -31 -3 35 -11 -24 35 24 -29 -1 42 -16 -22 23 1 -36 9 17
5346A7n1K0L5l0j2M5rl4L2J6n2LO2l3n2P0Jm6J5L7l1l6N8Oo1J7N7m2j7M8j0n0
$$ 17 -34 -14 21 -9 -21 24 15 -19 13 29 -23 -20 42 9 -43 27 28 -18 -3 34 3 -33 25 31 -30 -13 44 2 -15 33 23 -27
5378b7L6K5m6LM3l0k7L8J0n1J7M6l5l0N3j3l9L3J6l2pM4k0l5M8Jm1J7M3m5k4N8
$$ -27 9 34 -12 -9 34 4 -23 15 25 -26 -9 37 2 -28 25 12 -27 6 22 -10 -17 27 7 -28 20 21 -20 -3 40 -5 -29 29
5410B9mm5K8M3o0j7O6j6n5L8K3m6j1N6j4l3L3Pk9LK0k0j0M1j6l4L2J9m0qN4k3
$$ 29 25 -20 8 51 -9 -26 40 24 -31 7 30 -16 -27 29 15 -18 15 22 -7 -4 16 -4 -14 27 11 -23 9 28 -12 -20 34 11
5442A1l8M8Nm4J6L5k4k3L0Kl7K7J6k4j1M6k5l2M0J2m3mL7Km9L2L1n1mM1j2l0L1
$$ 11 -27 21 26 -18 -2 33 9 -14 16 18 -19 8 24 0 -11 35 10 -22 18 30 -13 -17 20 22 -27 5 36 -15 -19 22 10 -20 11
5475A1Qm3K0J3j4j6L6j0j8K3Ml5K1K1k6j6L9Jm3K6L0l6j0L6%l8K6J8m0lN2l2k9
$$ 11 19 -24 -4 9 -5 -21 15 5 -13 10 14 -21 0 21 -5 -21 18 19 -24 2 32 -4 -14 22 22 -16 10 28 -12 -15 37 5 -24
5508b4L4Qm8K1K9k9k3M7km7K0L4l1j2L9kl0J3K6l4PJ4j3j5K1J7l9J7K5j9qK4n
$$ -24 10 18 -30 -9 20 -9 -32 15 13 -34 -14 20 -11 -23 16 14 -16 -3 23 -11 -4 10 -3 -18 3 20 -19 -2 23 4 -4 20 15
5541A5k5J0K6l0j1L1ll1K1J4l1J3J6j2k1K0Pl2J7K6l0j2L8lm0K9J6k9jL1nk8J7
$$ 15 -10 0 26 -4 -15 16 13 -18 3 17 -14 -1 15 3 -18 2 9 -23 -6 20 -10 -22 16 13 -27 2 18 -11 -12 19 14 -14 3
5574CQj1kK1j2j5K7rpKJ4l1mM5l2k3K2J3k7RK6j7j6K0Ok5J0J0j5rK6Om1J6L3l1
$$ 3 11 0 -2 19 7 -8 19 10 3 5 19 -12 -16 29 -3 -26 -4 9 -18 -9 17 0 -16 4 10 -15 -5 5 -10 -19 7 13 -28 -12 21 -10
5610a0JL2j9l0J9L6l6%K0j0j9K4K3m0%K4j6pK4j7j6J9Qk9LL4k3k5M5Ll8OL6l1
$$ -10 -9 23 4 -26 -7 29 -7 -7 13 3 -16 8 31 -9 -9 15 -1 -8 16 -1 -17 2 10 -19 -16 18 -5 -30 15 18 -20 -14 22 -9
5644ij0K6J2l0MK3k8kK4nk7K7Ok5LK8j5k1L3Nl0PM4l7k0K5jm0L3K4l8jL4k0k1
$$ -9 -19 7 19 -11 -7 16 -12 -14 10 5 -22 5 11 -14 -11 17 2 -19 14 19 -11 -4 40 3 -17 8 7 -33 0 24 -14 -15 19 -1 -22
5679b2K1Oj8J3J9l9qL5Km3L0K5l8mM2j8k7L8Mk3rL8j9l7L8nj6ML4j3k5K6%k6K8
$$ -22 -1 5 -13 0 19 -20 -28 7 9 -34 -4 21 -17 -21 21 3 -24 14 18 -5 -14 24 5 -32 6 1 -15 -11 23 10 -15 11 11 -15 13
5714A3K3m5j4L4Ml9L3J0k9LL1l7j2L2Nm1K6K0l3lL6j0l6L1K0l1KL4k0l1K8K2m1
$$ 13 36 -9 -23 11 15 -24 9 19 -10 -7 24 -13 -25 7 12 -29 -3 17 -16 -19 17 7 -29 2 22 -9 -7 27 7 -24 4 26 -15
5747a5J1L0k2k0K9Qm2J7L8m4nL9k6k5L2J6l7KL7k3k0K2J5m1J9K5k3k2M1j3l3L4
$$ -15 -4 26 4 -16 13 21 -21 -4 34 -10 -15 24 -2 -27 5 21 -16 -14 23 0 -20 2 17 -24 -5 20 -3 -25 16 3 -30 4
5779DK0l8LL4nn5M4J6l6J4K8j3m3M1J8n0J5L6k7k0L0Jl8J1L3l7OK9k7j6L4Rk8
$$ 4 24 -14 -11 23 18 -37 7 23 -13 1 29 16 -27 14 32 -18 -3 33 6 -14 16 17 -21 -10 23 -14 -8 21 -6 -22 12 21 -7
5812gJK5k5k1M2mm3K8L2m2KL5j3l2K3K0m8J0M5l0k2L8J8m2OK5j6j9L2Lm5K4K2
$$ -7 -6 19 -6 -27 15 11 -32 -4 28 -14 -12 23 10 -22 1 21 -27 -17 28 -2 -24 14 32 -10 -4 21 5 -14 18 21 -24 0 22
5845B2k5j7M5j8l1K1K3l6JM5l3k0K8J1k9J5J4k3oL2jm2K5K2l8J4K4j8k5L6Ol7
$$ 22 -3 -20 25 7 -24 -3 20 -16 -15 30 -3 -23 5 16 -13 2 16 -7 -13 19 18 -24 1 23 -15 -1 23 5 -20 16 22 -15
5877a5J1M2l8k8M6%l7OM6k6k7M3j0m3J9K1k5kL9k8k7K5K1m1KL6j6j1K7lk0MK7
$$ -15 -4 38 0 -28 18 18 -19 -13 33 7 -20 23 13 -30 -11 10 -15 -17 22 -6 -33 -8 13 -28 -26 10 -6 -17 10 7 -13 -9 18
5910A8l2RL1k1j8L3J5o4K7L2l6k0M1nk7OL6k8j4K8kl4K3J8k9LL4j6k3J3J1k7k
$$ 18 -14 -5 26 5 -13 20 35 -29 -2 30 -6 -26 15 10 -17 -11 25 -3 -17 11 9 -25 -2 16 -13 -10 24 8 -15 -2 9 -18 -20
5943b0L3k5j0L4%k4PK5m0ML1j9j6K4J4l8J3L3k7j5L0Jl4J8L3m8j1M0lm1K7J8k8
$$ -20 13 -12 -22 12 12 -12 -5 20 -20 -16 15 -4 -20 4 18 -20 -7 26 -1 -16 14 15 -19 -1 32 -16 -27 13 10 -31 -4 14 -14
5976a4lK6nj9K0Rk7kK8pk1J9Jk5J8J5k7lL9k2k0J5J4k6K0J8j9j1L2ml3J3L0m0
$$ -14 -17 9 4 -15 5 14 -13 -15 13 6 -15 4 5 -20 -2 13 -14 -17 22 0 -20 -5 9 -17 3 21 2 -9 23 19 -14 -1 29 -11
$$ [...]
8191D
##END NTUPLES=NMR FID
##END=
