##TITLE=1H_IG-1601hexene90
 CDCl3
 8 sc, 
 14.1.2022
##JCAMPDX= 6.0         $$ Bruker NMR JCAMP-DX V2.0
##DATA TYPE= NMR FID
##DATA CLASS= NTUPLES
##ORIGIN= UXNMR, Bruker Analytische Messtechnik GmbH
##OWNER= root
$$ XWIN-NMR		Version 3.5
$$ Fri Jan 14 11:34:53 2022 Russian Standard Time (UT+4h)  she@DPX200
##.OBSERVE FREQUENCY= 200.131346
##.OBSERVE NUCLEUS= ^1H
##.DELAY= (6, 6)
##.ACQUISITION MODE= SIMULTANEOUS
##.ACQUISITION SCHEME= undefined
##.AVERAGES= 8
##.DIGITISER RES= 18
##SPECTROMETER/DATA SYSTEM= spect
##.PULSE SEQUENCE= zg30
##.SOLVENT NAME= CDCl3
##.SHIFT REFERENCE= (INTERNAL, CDCl3, 0, 15.7039)
##AUDIT TRAIL= $$ (NUMBER, WHEN, WHO, WHERE, WHAT)
$$ ##TITLE= Audit trail, XWIN-NMR		Version 3.5
$$ ##JCAMPDX= 5.01
$$ ##ORIGIN= Bruker BioSpin GmbH
$$ ##OWNER= she
$$ F:/spectra/data/she/nmr/H-F/1/audita.txt
$$ ##AUDIT TRAIL=  $$ (NUMBER, WHEN, WHO, WHERE, WHAT)
(   1,<2022-01-14 11:29:23.71 +0400>,<she>,<DPX200>,
      <created by zg, POWCHK disabled, PULCHK disabled
       configuration hash MD5:
       00 E9 B6 7A A2 85 ED C7 34 08 36 98 17 FE 4E 26
       data hash MD5: 16K
       40 2C A1 3D 44 A5 04 82 59 AB 63 4D F2 55 D2 6B>)
$$ ##END=
$$ 
$$ hash MD5
$$ BE D8 C7 4D D2 1C DB CF 42 62 C3 F0 82 FE 6F 3A
##$RELAX= 
##$RELAX= 
##$RELAX= 
##$RELAX= 
##$RELAX= 
##$RELAX= 
$$ Bruker specific parameters
$$ --------------------------
##$DU= <F:/spectra>
##$EXPNO= 1
##$NAME= <H-F>
##$PROCNO= 1
##$TYPE= <nmr>
##$USER= <she>
##$AMP= (0..31)
100 100 100 100 100 100 100 100 100 100 100 100 100 100 100 100 100 100 
100 100 100 100 100 100 100 100 100 100 100 100 100 100 
##$AQSEQ= 0
##$AQ_mod= 1
##$AUNM= <au_zg>
##$AUTOPOS= <>
##$BF1= 200.13
##$BF2= 200.13
##$BF3= 200.13
##$BF4= 200.13
##$BF5= 200.13
##$BF6= 200.13
##$BF7= 200.13
##$BF8= 200.13
##$BYTORDA= 1
##$CFDGTYP= 0
##$CFRGTYP= 5
##$CHEMSTR= <none>
##$CNST= (0..31)
1 1 145 1 1 1 1 1 1 1 1 1 1 1 1 1 1 1 1 1 1 1 1 1 1 1 1 1 1 1 1 1 
##$CPDPRG= <>
##$CPDPRG1= <>
##$CPDPRG2= <>
##$CPDPRG3= <>
##$CPDPRG4= <mlev>
##$CPDPRG5= <mlev>
##$CPDPRG6= <mlev>
##$CPDPRG7= <mlev>
##$CPDPRG8= <mlev>
##$CPDPRGB= <>
##$CPDPRGT= <>
##$D= (0..31)
0 1.2 0 0 0 0 0 0 0 0.06 0 0.03 0 0 0 0 0.0002 0 0 0 0 0 0 0 0 0 0 0 0 
0 0 0 
##$DATE= 1642145363
##$DBL= (0..7)
120 120 120 120 120 120 120 120 
##$DBP= (0..7)
150 150 150 150 150 150 150 150 
##$DBP07= 0
##$DBPNAM0= <>
##$DBPNAM1= <>
##$DBPNAM2= <>
##$DBPNAM3= <>
##$DBPNAM4= <>
##$DBPNAM5= <>
##$DBPNAM6= <>
##$DBPNAM7= <>
##$DBPOAL= (0..7)
0.5 0.5 0.5 0.5 0.5 0.5 0.5 0.5 
##$DBPOFFS= (0..7)
0 0 0 0 0 0 0 0 
##$DE= 6
##$DECBNUC= <off>
##$DECIM= 32
##$DECNUC= <off>
##$DECSTAT= 4
##$DIGMOD= 1
##$DIGTYP= 9
##$DL= (0..7)
0 120 120 120 120 120 120 120 
##$DP= (0..7)
150 150 150 150 150 150 150 150 
##$DP07= 0
##$DPNAME0= <>
##$DPNAME1= <>
##$DPNAME2= <>
##$DPNAME3= <>
##$DPNAME4= <>
##$DPNAME5= <>
##$DPNAME6= <>
##$DPNAME7= <>
##$DPOAL= (0..7)
0.5 0.5 0.5 0.5 0.5 0.5 0.5 0.5 
##$DPOFFS= (0..7)
0 0 0 0 0 0 0 0 
##$DQDMODE= 0
##$DR= 18
##$DS= 0
##$DSLIST= <SSSSSSSSSSSSSSS>
$$ [...]
##$SUBNAM2= <"">
##$SUBNAM3= <"">
##$SUBNAM4= <"">
##$SUBNAM5= <"">
##$SUBNAM6= <"">
##$SUBNAM7= <"">
##$SUBNAM8= <"">
##$SUBNAM9= <"">
##$SW= 18.0517287032376
##$SWIBOX= (0..15)
0 0 2 0 0 0 0 0 0 0 0 0 0 0 0 0 
##$SW_h= 3612.71676300578
##$TD= 16384
##$TD0= 1
##$TE= 0
##$TE2= 300
##$TE3= 300
##$TEG= 300
##$TL= (0..7)
0 120 120 120 120 120 120 120 
##$TP= (0..7)
150 150 150 150 150 150 150 150 
##$TP07= 0
##$TPNAME0= <>
##$TPNAME1= <>
##$TPNAME2= <>
##$TPNAME3= <>
##$TPNAME4= <>
##$TPNAME5= <>
##$TPNAME6= <>
##$TPNAME7= <>
##$TPOAL= (0..7)
0.5 0.5 0.5 0.5 0.5 0.5 0.5 0.5 
##$TPOFFS= (0..7)
0 0 0 0 0 0 0 0 
##$TUNHIN= 0
##$TUNHOUT= 0
##$TUNXOUT= 0
##$USERA1= <user>
##$USERA2= <user>
##$USERA3= <user>
##$USERA4= <user>
##$USERA5= <user>
##$V9= 5
##$VALIST= <valist>
##$VCLIST= <CCCCCCCCCCCCCCC>
##$VD= 0
##$VDLIST= <DDDDDDDDDDDDDDD>
##$VPLIST= <PPPPPPPPPPPPPPP>
##$VTLIST= <TTTTTTTTTTTTTTT>
##$WBST= 1024
##$WBSW= 4
##$XGAIN= (0..3)
0 0 0 0 
##$XL= 0
##$YL= 0
##$YMAX_a= 602022
##$YMIN_a= -560572
##$ZGOPTNS= <>
##$ZL1= 120
##$ZL2= 120
##$ZL3= 120
##$ZL4= 120
##$ABSF1= 10
##$ABSF2= 0
##$ABSG= 5
##$ABSL= 3
##$ALPHA= 0
##$AQORDER= 0
##$ASSFAC= 0
##$ASSFACI= 0
##$ASSFACX= 0
##$ASSWID= 0
##$AUNMP= <proc_1d>
##$AZFE= 0.1
##$AZFW= 0.1
##$BCFW= 1
##$BC_mod= 2
##$BYTORDP= 1
##$COROFFS= 0
##$CY= 11.3945322036743
##$DATMOD= 1
##$DC= 2
##$DFILT= <>
##$DTYPP= 0
##$F1P= 2.36226072786647
##$F2P= -0.459571619588291
##$FCOR= 0.5
##$FTSIZE= 0
##$FT_mod= 4
##$GAMMA= 1
##$GB= 0.15
##$INTBC= 1
##$INTSCL= 1
##$ISEN= 128
##$LB= 0.24
##$LEV0= 0
##$LPBIN= 0
##$MAXI= 10000
##$MC2= 0
##$MEAN= 0
##$ME_mod= 0
##$MI= 1.114404
##$NCOEF= 0
##$NC_proc= 0
##$NLEV= 6
##$NOISF1= 3.799351
##$NOISF2= 2.8
##$NSP= 1
##$NTH_PI= 0
##$NZP= 0
##$OFFSET= 15.70392
##$PC= 1
##$PHC0= -15775.16
##$PHC1= 7.80079
##$PH_mod= 1
##$PKNL= yes
##$PPARMOD= 0
##$PSCAL= 0
##$PSIGN= 0
##$REVERSE= no
##$SF= 200.130013532006
##$SI= 16384
##$SIGF1= 3
##$SIGF2= 2
##$SINO= 400
##$SIOLD= 16384
##$SREGLST= <1H.CDCl3>
##$SSB= 0
##$STSI= 0
##$STSR= 0
##$SW_p= 3612.71676300578
##$SYMM= 0
##$S_DEV= 0
##$TDeff= 0
##$TDoff= 0
##$TI= <>
##$TILT= no
##$TM1= 0
##$TM2= 0
##$TOPLEV= 0
##$USERP1= <user>
##$USERP2= <user>
##$USERP3= <user>
##$USERP4= <user>
##$USERP5= <user>
##$WDW= 1
##$XDIM= 8192
##$YMAX_p= 0
##$YMIN_p= 0
$$ End of Bruker specific parameters
$$ ---------------------------------
##NTUPLES= NMR FID
##VAR_NAME=  TIME,          FID/REAL,        FID/IMAG
##SYMBOL=    X,             R,               I
##VAR_TYPE=  INDEPENDENT,   DEPENDENT,       DEPENDENT
##VAR_FORM=  AFFN,          ASDF,            ASDF
##VAR_DIM=   8192,          8192,            8192
##UNITS=     SECONDS,       ARBITRARY UNITS, ARBITRARY UNITS
##FACTOR=    0.0002768,     1,               1
##FIRST=     0,             0,               0
##LAST=      2.2672688,     0,               0
##MIN=       0,             -560572,         0
##MAX=       2.2672688,     602022,          0
$$ Real data points
##PAGE= N=1
##DATA TABLE= (X++(R..R)), XYDATA
$$ plain form
0 0 0 0 0 0 0 0 0 8 -8 8 -8 13 -16 16 -24 32 -37 45 -53 64 -72 85 -101 117 -133 157 -180 205 -232 264 -297
31 -297 337 -378 425 -477 532 -591 658 -727 805 -890 982 -1083 1193 -1315 1446 -1589 1746
48 1746 -1917 2106 -2318 2555 -2818 3117 -3456 3844 -4296 4825 -5456 6223 -7173 8379
62 8379 -9952 12084 -15108 19665 -27145 41169 -74928 279136 202390 -506277 602022
73 602022 -472000 177091 164582 -423708 510530 -407138 169240 100857 -298972 359658
83 359658 -279654 111888 62520 -171410 181887 -109730 7192 66264 -73207 15830 67173
94 67173 -121546 105889 -14811 -116280 225594 -253620 172284 -1072 -196905 340277
104 340277 -363123 244896 -21948 -224468 399000 -431099 303555 -61170 -206393 398937
$$ packed form
0@%%%%%%%Qj6J6j6K1k9L2m0N6o9Q2r8J17j36J57j86K18k50K90l37L85m37M96n61
31b97O34p15Q03r02J009j123J249j385J532j695J872k065K276k508K761l035L335
48A746l663M023m424M873n373N935o573P300q140R121j0281J1679j3396J5552
62H379j8331K2036k7192L4773m6810O8314j16097L54064p6746p08667J108299
73F02022j074022O49091j2509n88290R34238r17668N76378o8383l99829O58630
83C59658o39312L91542m9368k33930L53297k91617J16922N9072j39471Q9037N1343
94F7173j88719K27435j20700j01469L41874m79214M25904j73356j95833N37182
104C40277p03400O08019k66844k02520O23468q30099P34654l64725j45223O05330
$$ plain form
114 398937 -444994 329504 -98620 -159284 348560 -403387 311433 -116118 -103604 265424
124 265424 -315903 248530 -102109 -58583 171500 -201150 150580 -54668 -37829 87837
134 87837 -81859 35079 18657 -45777 29520 21176 -77176 103489 -77768 2606 93642
145 93642 -168082 182826 -122618 3890 130073 -225881 241868 -166494 23979 133524
155 133524 -246507 271027 -196592 50411 113035 -233216 266790 -203751 70690 80789
165 80789 -194696 231838 -184093 75425 49231 -142817 174422 -139627 59990 28370
175 28370 -90315 106140 -77692 25089 24069 -47941 39563 -9038 -23185 36823 -22301
186 -22301 -14429 54514 -75350 61878 -14583 -49471 103116 -121070 91090 -20912 -64350
$$ packed form
114C98937q43931P74498m28124o0664N07844p51947P14820m27551J2514L69028
124B65424n81327N64433l50639M3526K30083l72650L51730k05248J6839J25666
134H7837j69696J16938j6422o4434P5297q344r8352J80665j81257Q0374R1036
145I3642k61724L50908l05444J26508J26183l55954M67749m08362J90473J09545
155A33524l80031N17534m67619K47003O2624l46251N00006m70541K74441J0099
165H0789k75485M26534m15931K59518k6194j92048L17239l14049J99617l1620
175B8370j18685J96455j83832J02781j020p2010Q7504m8601j4147O0008n9124
186b2301P872O8943j29864J37228p6461l4888J52587k24186K12160j12002m3438
$$ plain form
197 -64350 131311 -152050 115881 -34282 -62716 138605 -164055 129186 -47052 -51174 128578
208 128578 -156985 127246 -52773 -36896 107580 -134231 109993 -47748 -25925 82296
218 82296 -101534 80351 -31614 -22146 58630 -65244 43291 -6399 -26749 40935 -31255
229 -31255 4679 23784 -38535 31065 -4025 -29899 53696 -54287 28516 14174 -56146 78428
241 78428 -69584 30859 23520 -71945 94358 -80435 34590 25952 -77530 99800 -83960
252 -83960 36197 24689 -74948 95428 -79008 33316 22891 -67337 83423 -66420 25047
263 25047 22805 -57794 66822 -48394 12110 25465 -48614 48656 -27507 -3868 30752 -41196
275 -41196 31273 -6546 -20827 37665 -35944 16239 12314 -36542 44736 -32409 4263 27671
$$ packed form
197f4350J95661k83361K67931j50163k8434K01321l02660K93241j76238m122J79752
208A28578k85563K84231j80019J5877J44476k41811K44224j57741K1823J08221
218H2296j83830J81885j11965R468Q0776j23874J08535m9690k0350O7684p2190
229c1255L5934J9105o2319O9600l5090k5874Q3595j07983Q2803j4342p0320J34574
241G8428j48012J00443p339r5465J66303j74793J15025q638j03482J77330j83760
252h3960J20157j1508r9637J70376j74436J12324j0425r0228J50760j49843R1467
263B5047k242q0599J24616j15216O0504J3355p4079R7270p6163K3639L4620p1948
275d1196P2469l7819j4281N8492p3609N2183l925m8856Q1278p7145L6672K3408
$$ plain form
287 27671 -49232 50477 -29811 -4596 38625 -57775 53579 -27236 -10819 45111 -61540 53302
299 53302 -23714 -15190 47679 -60682 49352 -18665 -18549 47139 -55931 42001 -11945 -21499
311 -21499 44473 -48239 32095 -3772 -24380 40606 -38699 20503 5393 -27402 36168 -28404
323 -28404 8250 14863 -30472 31687 -18190 -3665 23923 -33245 27397 -8745 -14457 31868
335 31868 -35520 23469 -633 -23332 38004 -36842 19979 5784 -29708 41795 -36751 16618
347 16618 10454 -33366 42720 -34835 13029 13585 -34239 40637 -30687 8815 15647 -32726 35784
360 35784 -24224 3487 17353 -29703 28779 -15807 -3108 19377 -26132 20724 -6152 -10688
372 -10688 22074 -22807 12701 3639 -18613 25312 -20368 5706 12409 -25959 28665 -18937
$$ packed form
287B7671p6903R9709q0288K5215M3221r6400J11354q0815J6417N5930j06651J14842
299E3302p7016Q524O2869j08361J10034o8017J16O5688j03070R7932n3946r554
311b1499O5972r2712Q0334l5867k0608O4986p9305N9202j5110l2795O3570o4572
323b8404L6654O613m5335O2159m9877J4525K7588n7168O0642l6142n712M6325
335C1868o7388N8989k4102k2699O1336p4846N6821j4195l5492P1503p8546N3369
347A6618o164m3820P6086p7555M7864N56m7824P4876p1324L9502O832m8373O8510
360C5784o0008K7711J3866m7056N8482m4586J2699K2485m5509M6856k6876m536
372a0688L2762m4881L5508r062k2252M3925m5680K6074O703l8368N4624m7602
$$ plain form
384 -18937 441 19147 -31576 31324 -18139 -2862 23219 -34618 32348 -17291 -4573 24434
396 24434 -34525 30930 -15516 -5378 23214 -31178 26592 -11955 -6237 20447 -25205 19303
408 19303 -6133 -8200 17367 -17773 9934 1894 -11904 15254 -10399 -180 11318 -17293
420 -17293 14872 -4493 -9470 20679 -23682 16279 -942 -16359 28314 -29535 18839 63
432 63 -19872 32759 -33386 21200 -859 -19964 33169 -33891 22026 -2406 -17266 29644 -30415
445 -30415 20077 -3253 -13107 22913 -23078 14720 -2149 -9017 14423 -12797 6042 1757 -6522
458 -6522 6149 -1238 -4932 8521 -6763 -215 9576 -16634 17286 -9944 -3392 17681 -26849
471 -26849 26365 -15308 -2858 21555 -33426 33514 -21158 557 20774 -34996 36722 -25415
$$ packed form
384a8937J9378J8706n0723O2900m9463J5277K6081n7837O6966m9639J2718K9007
396B4434n8959O5455m6446J0138K8592n4392N7770l8547N718K6684m5652M4508
408A9303k5436k067K5567l5140K7707q040j3798K7158k5653J0219J1498k8611
420a7293L2165j9365m977L0149m4361L9961j7221j5417M4673n7849M8374j8776
432F3j9935N2631o6145N4586k2059j9105N3133o7060N5917k4432j4860M6910o0059
445c0415N0492k3330r854L6020m5991L7798j6869o868K3440k7220J8839m285q279
458f522J2671p387l694J3453j5284O548R791k6210L3920k7230O552K1073m4530
471b6849N3214m1673J2450K4413n4981O6940n4672K1715K0217n5770P1718o2137
$$ plain form
483 -25415 5244 16205 -31297 34824 -26137 9101 9671 -23369 27775 -22325 10230 3252 -13218
496 -13218 16750 -14002 7545 -921 -3116 3851 -2329 965 -1554 4561 -8501 10695 -8711
509 -8711 1783 8388 -18094 22849 -19676 8394 7751 -23107 31702 -29574 16658 3091 -22822
522 -22822 35358 -35963 24111 -3876 -17716 33076 -36962 28360 -10684 -9596 25516 -31933
534 -31933 27598 -14881 -1038 14577 -21724 21225 -14669 5406 3044 -8421 10255 -9505
546 -9505 7847 -6304 5025 -3133 -332 5586 -11580 15972 -16335 11046 -740 -11899 22482
559 22482 -26772 22284 -9560 -7647 23583 -32504 30843 -18661 -275 19510 -32543 34796
571 34796 -25571 8058 11696 -27023 33069 -28237 14783 2354 -17396 25749 -25517 17732
$$ packed form
483b5415L0659J0961m7502O6121o0961L5238N70l3040N1144n0100L2555o978j6470
496a3218K9968l0752K1547q466k195O967o180L294k519O115j3062J9196j9406
509h711J0494O605k6482M0943m2525K8070o43l0858N4809o1276M6232j3567k5913
522b2822N8180p1321O0074k7987j3840N0792p0038O5322l9044J088L5112n7449
534c1933N9531m2479J3843J5615l6301M2949l5894K0075k362j1465J8676j9760
546i505J7352j4151J1329q158K801N918j7166K7552l2307K7381j1786j1159L4381
559B2482m9254M9056l1844J913L1230n6087O3347m9504J8386J9785n2053O7339
571C4796o0367L3629L638l8719O0092o1306M3020j2429j9750M3145n1266M3249
$$ plain form
583 17732 -5848 -5960 14311 -17408 15621 -10550 4445 1198 -5507 8505 -10456 11329 -10652
596 -10652 7642 -2061 -5550 13333 -18749 19270 -13706 2831 10404 -21724 27003 -23791 12433
609 12433 3726 -19501 29479 -30073 20797 -4565 -13220 26677 -31299 25806 -12153 -4844 19566
622 19566 -27345 26154 -16962 3347 10009 -19064 21528 -17537 9236 305 -8157 12632 -13351
635 -13351 11152 -7298 2946 1282 -5176 8541 -11063 11853 -10117 5342 2013 -10256 16856
648 16856 -19228 15802 -6809 -5449 17120 -24204 23788 -15546 1700 13254 -24332 27651
660 27651 -21909 9007 6810 -20165 26711 -24401 14352 -193 -13197 21514 -22440 16300
672 16300 -5763 -5342 13468 -16482 14293 -8484 1537 4328 -7774 8639 -7728 5946 -3996
$$ packed form
583A7732k3580j12K0271l1719L3029k6171J4995l247o705J4012j8961K1785k1981
596a0652J8294r703l489J8883l2082L8019l2976J6537P573l2128M8727n0794L6224
609A2433q707k3227M8980n9552N0870k5362q655L9897n7976N7105l7959P309K4410
622A9566m6911N3499m3116K0309O662k9073M0592l9065K6773q931q462K0789k5983
635a3351K4503j8450J0244j664o458J3717j9604K2916k1970J5459l329j2269K7112
648A6856l6084L5030k2611J360K2569m1324M7992l9334J7246J1554l7586N1983
660B7651m9560L0916k197k6975M6876n1112L8753j4545j3004L4711m3954L8740
672A6300k2063M21J8810k9950L0775k2777J0021K791j2102J6413j6367J3674r942
$$ plain form
685 -3996 1925 533 -3655 7130 -9963 10772 -8431 2773 5023 -12583 17119 -16454 10078
698 10078 399 -11719 19865 -21792 16429 -5232 -8005 18838 -23414 20149 -10174 -2958 14749
711 14749 -21188 20347 -12897 1772 9016 -15898 17004 -12556 4795 3279 -8959 10857
723 10857 -9138 5251 -1097 -1938 3287 -3446 3155 -3261 3813 -4162 3442 -959 -3017 7392
737 7392 -10272 10069 -6122 -777 8466 -14081 15274 -11112 2679 7262 -15140 18084 -14755
750 -14755 6257 4493 -13648 18056 -16177 8842 1182 -10308 15394 -14965 9582 -1527
762 -1527 -6140 10855 -11359 8056 -2760 -2378 5548 -6129 4547 -2144 132 650 -344 -252 195
777 195 1004 -3036 4878 -5335 3569 261 -4969 8729 -9741 7170 -1554 -5254 10785 -12723
$$ packed form
685c996N921j392m188J0785j7093K0735j9203J1204K250j7606K9702l3573K6532
698A0078r679j2118L1584m1657L8221k1661k773K6843m2252M3563l0323P216J7707
711A4749l5937M1535l3244J4669P244k4914L2902k9560J7351j516j2238J9816
723A0857j9995J4389o348q41N225o733O601o416P074p975P604m401k058J0409
737G392j7664K0341j6191N345R243k2547K9355k6386J3791M583k2402L3224l2839
750a4755K1012j764j8141L1704l4233K5019p660j1490K5702l0359K4547j1109
762a527m613J6995k2214J9415j0816L82P926j1677J0676o691K276N18r94R2M47
777A95Q09m040P914j0213Q904l308n230J3698j8470J6911q724l700J6039k3508
$$ plain form
791 -12723 10221 -3788 -4200 10948 -13896 11944 -5750 -2420 9584 -13172 12037 -6755 -586
804 -586 7222 -10848 10434 -6447 707 4551 -7502 7363 -4740 983 2238 -3812 3468 -1831
818 -1831 75 859 -512 -701 1817 -1881 516 1920 -4312 5417 -4359 1178 3149 -6881 8443
833 8443 -6836 2482 3259 -8175 10360 -8788 3912 2524 -8200 10907 -9702 4982 1447
846 1447 -7204 10176 -9386 5310 391 -5580 8330 -7923 4705 -229 -3774 5825 -5444
859 -5444 3162 -153 -2216 3122 -2406 804 725 -1269 602 831 -2088 2279 -1039 -1305 3706 -4968
875 -4968 4268 -1542 -2300 5795 -7406 6294 -2603 -2406 6837 -8991 7879 -3823 -1773 6830
889 6830 -9441 8656 -4744 -789 5895 -8750 8323 -5023 152 4375 -7006 6917 -4420
$$ packed form
791a2723K2944j4009m12J5148k4844K5840j7694L330J2004k2756K5209j8792O169
804e86P808j8070K1282j6881P154L844j2053J4865j2103N723J255o050P280n299
818a831J906P84j371j89K518l698K397J404o232R729r776N537J971j0030J5324
833H443j5279R318P77j1434J8535j9148J2700j388j0724J9107k0609J4684l535
846A447q651J7380j9562J4696m919n971J3910j6253J2628m934l545R599j1269
859e444Q606l315k063N338n528L210p9j994J871K29k919M367l318k66N011q674
875d968R236n810p58Q095j3201J3700q897J97R243j5828J6870j1702K050Q603
889F830j6271J8097j3400L955O684j4645J7073j3346N175M223j1381J3923j1337
$$ plain form
902 -4420 704 2760 -4679 4640 -2925 577 1391 -2166 1771 -669 -314 551 127 -1268 2097 -1910
918 -1910 479 1792 -3915 4843 -3907 1142 2536 -5771 7169 -5971 2407 2340 -6589 8630 -7639
933 -7639 3856 1408 -6223 8884 -8427 5026 13 -4890 7874 -8041 5452 -1274 -2969
946 -2969 5791 -6366 4856 -1981 -1012 3118 -3804 3165 -1793 443 403 -670 593 -624 1068
961 1068 -1812 2466 -2437 1366 697 -3105 4945 -5352 3789 -609 -3262 6405 -7606 6185 -2460
976 -2460 -2336 6594 -8739 7954 -4437 -635 5491 -8489 8615 -5908 1374 3396 -6808 7835
990 7835 -6319 3019 906 -4062 5652 -5369 3682 -1319 -913 2496 -3141 3105 -2617 1931 -1068
1005 -1068 68 1224 -2622 3799 -4233 3508 -1542 -1371 4292 -6334 6491 -4532 812 3505
$$ packed form
902d420N124K056p439R319p565L502Q14l557L937k440L55Q65m24j395L365m007
918a910K389J313n707Q758q750N049J394q307J2940j3140Q378o7q929J5219j6269
933g639J1495k448p631J5107j7311J3453n013m903J2764j5915J3493o726j695
946b969Q760j2157J1222o837R69M130o922O969m958K236m0j073J263j217J692
961A068k880M278m903L803o69l802Q050j0297R141m398k653R667j4011J3791q645
976b460J24Q930j5333J6693j2391L802O126j3980J7104j4523P282K022j0204J4643
990G835j4154R338k113m968R714j1021R051n001M06L409n637O246n722M548k999
1005a068J136J156l846O421q032P741n050J71N663j0626J2825j1023N344K693
$$ plain form
1019 3505 -7005 8397 -7085 3363 1622 -6208 8854 -8638 5597 -785 -4204 7745 -8704
1032 -8704 6948 -3083 -1431 5257 -7174 6876 -4608 1328 1945 -4290 5270 -4836 3397 -1408
1046 -1408 -613 2332 -3566 4168 -4021 3102 -1375 -942 3340 -5281 5935 -4999 2386 1206 -4881
1061 -4881 7339 -7697 5658 -1675 -3031 7022 -8899 8012 -4570 -358 5205 -8382 8925
1074 8925 -6678 2461 2410 -6311 8149 -7457 4653 -652 -3175 5810 -6635 5608 -3253 303
1088 303 2402 -4324 5087 -4709 3362 -1379 -913 3093 -4670 5310 -4705 2839 -43 -3104 5672
1103 5672 -6869 6136 -3524 -362 4389 -7314 8169 -6532 2823 1847 -6064 8472 -8299
1116 -8299 5618 -1238 -3462 7050 -8402 7242 -3967 -300 4294 -6817 7254 -5650 2587
$$ packed form
1019C505j0510J5402j5482J0448j741p830J5062j7492J4235o382l419J1949j6449
1032h704J5652j0031J652O688j2431J4050j1484N936O17o235R560j0106Q233m805
1046a408P95K945n898P734q189P123m477M33M282q621J1216j0934P385j180o087
1061d881J2220j5036J3355p333j356J0053j5921J6911j2582M212N563j3587J7307
1074H925j5603R139n1q721J4460j5606J2110n305k523Q985j2445J2243q861L556
1088C03K099o726R411r796Q071m741M66M006p763R980j0015P544k882l061Q776
1103E672j2541J3005r660L162M751j1703J5483j4701R355r76p911J4536j6771
1116h299J3917o856k224J0512j5452J5644j1209L667M594j1111J4071j2904Q237
$$ plain form
1129 2587 922 -3938 5681 -5859 4539 -2252 -451 2836 -4525 5104 -4541 2916 -628 -1969
1143 -1969 4176 -5481 5442 -3966 1287 1963 -4889 6584 -6489 4480 -987 -2927 6136 -7587
1157 -7587 6806 -3960 -130 4208 -7028 7771 -6153 2776 1378 -4999 7084 -7020 4956
1170 4956 -1590 -2065 4921 -6270 5834 -3887 1028 1887 -4131 5195 -4947 3492 -1290 -1161 3253
1185 3253 -4579 4798 -3873 1936 510 -2918 4716 -5319 4526 -2414 -457 3396 -5461 6016
1199 6016 -4865 2199 1185 -4306 6205 -6268 4484 -1340 -2182 5057 -6403 5858 -3591 323
1213 323 2912 -5224 5927 -4968 2630 295 -3012 4728 -5115 4100 -2120 -338 2538 -4014 4417
1228 4417 -3739 2134 -100 -1958 3501 -4205 3876 -2527 544 1661 -3487 4442 -4239 2877 -628
$$ packed form
1129B587j665m860R619j1540J0398o791J801L287p361R629r645P457l544j341
1143a969O145r657J0923r408N253O76o852J1473j3073J0969n467j940R063j3723
1157g587J4393j0766L830M338j1236J4799j3924Q929j398o377J2083j4104J1976
1170D956o546m75O986j1191J2104r721M915Q59o018R326j0142Q439m782J29M414
1185C253p832R377q671N809j426l428P634j0035R845o940J957L853q857J1477
1199F016j0881P064j014n491J0511j2473J0752n824q42P239j1460J2261r449L914
1213C23K589q136J1151j0895P598k335l307P740r843R215o220J782K876o552Q431
1228D417q156N873k234j858N459p706Q081o403L071J117n148P929q681P116l505
$$ plain form
1243 -628 -1852 3896 -4889 4506 -2791 234 2458 -4447 5163 -4328 2259 511 -3104 4776 -5008
1258 -5008 3746 -1453 -1243 3470 -4629 4430 -2953 713 1607 -3355 4106 -3664 2290 -409 -1489
1273 -1489 2869 -3456 3144 -2082 581 1040 -2326 3073 -3048 2331 -999 -581 2117 -3131 3409
1288 3409 -2752 1332 558 -2357 3619 -3823 2948 -1156 -1030 2974 -4078 3948 -2636 500 1767
1303 1767 -3537 4173 -3561 1855 366 -2392 3644 -3730 2727 -971 -954 2474 -3149 2917 -1894
1318 -1894 481 963 -1973 2424 -2225 1569 -570 -427 1317 -1888 2088 -1836 1162 -156 -972 1979
1334 1979 -2529 2459 -1635 310 1262 -2579 3175 -2862 1605 163 -2025 3250 -3521 2653 -974
1349 -974 -1038 2686 -3522 3207 -1900 65 1705 -2893 3121 -2381 996 576 -1841 2448 -2314 1556
$$ packed form
1243f28j224N748q785R395p297L025K224o905R610r491O587j748l615P880r784
1258e008Q754n199K10M713q099R059p383L666Q94m962P461p770N954k699j080
1273a489M358o325O600n226K663M59l366N399o121N379l330M18K698n248O540
1288C409o161M084p74k915N976p442O771m104J26M004p052Q026o584L136J267
1303A767n304P710p734N416j489k758O036p374O457l698J7L428n623O066m811
1318a894K375M82k936M397m649L794k139J43J744l205L976l924K998j318q16K951
1334A979m508M988m094J945R52l841N754o037M467j442k188N275o771O174l627
1349i74o4L724o208O729n107J965J640m598O014n502L377m20k417M289m762L870
$$ plain form
1365 1556 -458 -578 1372 -1699 1641 -1213 614 73 -677 1185 -1478 1503 -1185 538 336 -1265
1381 -1265 1962 -2165 1726 -739 -623 1900 -2703 2637 -1768 248 1417 -2669 3104 -2567 1174
1396 1174 583 -2153 3008 -2908 1885 -323 -1271 2403 -2711 2187 -1053 -266 1414 -2000 2011 -1428
1412 -1428 606 280 -956 1324 -1380 1155 -759 235 313 -871 1275 -1485 1338 -831 -19 957
1428 957 -1774 2117 -1856 953 344 -1623 2501 -2601 1867 -485 -1092 2344 -2882 2506 -1313 -292
1444 -292 1770 -2678 2715 -1903 556 909 -1976 2428 -2103 1232 -86 -961 1634 -1793 1521 -910
1460 -910 176 508 -1038 1345 -1374 1142 -692 32 699 -1360 1731 -1691 1153 -235 -882 1834
1476 1834 -2312 2104 -1226 -89 1468 -2437 2687 -2090 828 742 -2070 2748 -2569 1624 -164
$$ packed form
1365A556k014j20J950l071L340k854J827n41p50J862k663K981k688J723k02j601
1381a265L227m127L891k465J16K523m603N340m405K016J169m086N773n671L741
1396A174n91k736N161n916M793k208r48L674n114M898l240P87J680l414M011l439
1412a428K034l26j236K280k704K535j914R94P8j184K146k760K823k169Q12R76
1428I57k731L891l973K809o09j967M124n102M468k352o07L436n226N388l819J021
1444b92K062m448N393m618K459L53k885M404m531L335j318q75K595l427L314k431
1460i10J086L32j546K383k719K516j834P24O67k059L091l422K844j388o47K716
1476A834m146M416l330J137J557l905N124m777K918q6k812M818n317M193j788
$$ plain form
1491 -164 -1281 2309 -2590 2121 -1013 -278 1457 -2103 2146 -1606 702 322 -1176 1671 -1763 1431
1507 1431 -796 10 753 -1380 1688 -1639 1193 -433 -521 1404 -1990 2066 -1580 597 653 -1768
1523 -1768 2468 -2433 1684 -372 -1086 2269 -2768 2467 -1401 -87 1571 -2545 2795 -2162 930
1538 930 567 -1837 2548 -2499 1711 -516 -803 1783 -2266 2092 -1399 344 685 -1535 1940 -1881
1554 -1881 1352 -529 -408 1260 -1837 1963 -1630 869 155 -1207 1988 -2300 1989 -1092 -178 1468
1570 1468 -2410 2674 -2191 1021 480 -1880 2765 -2863 2119 -679 -910 2251 -2920 2717 -1728
1585 -1728 234 1290 -2388 2762 -2352 1250 106 -1385 2197 -2400 1925 -995 -141 1181 -1871
1600 -1871 2066 -1772 1042 -104 -855 1643 -2022 1936 -1359 390 745 -1740 2340 -2319 1660
$$ packed form
1491a64j117L590m899M711l134P35J735l560M249l752K308l80j498K847l434L194
1507A431k227Q06P43k133L068l327K832j626q8J925l394M056l646K177N6k421
1523a768M236m901M117k056p14L355n037N235l868J314J658m116N340m957L092
1538I30l63k404M385n047M210k227k87K586m049M358l491J743L41k220L475l821
1554a881L233j881J21J668l097L800l593K499p14j362L195m288M289l081R14J646
1570A468l878N084m865L212n41k360M645n628M982k798k31L161n171N637m445
1585a728J962J056l678N150n114L602j144j491L582m597M325k920Q54J322l052
1600a871L937l838K814j146p51K498l665L958l295J749L55k485M080m659L979
$$ plain form
1615 1660 -461 -949 2136 -2769 2605 -1652 205 1396 -2579 3041 -2568 1337 283 -1830 2810
1630 2810 -2952 2220 -861 -718 1999 -2707 2561 -1748 499 827 -1840 2311 -2154 1441 -434
1645 -434 -630 1480 -1943 1950 -1478 687 308 -1221 1894 -2078 1787 -975 -136 1292 -2169 2470
1661 2470 -2078 1047 345 -1700 2620 -2750 2087 -735 -830 2193 -2870 2722 -1739 254 1309 -2417
1677 -2417 2806 -2345 1254 173 -1474 2292 -2442 1902 -916 -277 1303 -1942 2038 -1646 897
1692 897 39 -946 1645 -1882 1755 -1136 275 725 -1568 2064 -2021 1428 -390 -826 1839 -2402
1708 -2402 2288 -1482 195 1183 -2250 2642 -2263 1176 247 -1609 2478 -2603 1934 -734 -676 1830
1724 1830 -2409 2276 -1509 341 855 -1724 2104 -1887 1206 -223 -721 1473 -1779 1680 -1178
$$ packed form
1615A660k121m88L085m905N374m257J857J191l975N620n609L905j054k113M640
1630B810n762N172l081J43K717m706N268m309K247L28k667M151m465L595j875
1645d34j96K110l423L893l428K165l79j529L115l972L865k762Q39J428l461M639
1661B470m548L125p02k045M320n370M837k822r5L023n063N592m461J993J055l726
1677b417N223n151L599j081j647L766m734M344k818O39J580l245L980l684K543
1692H97q58r85K591l527L637k891J411M50k293L632m085L449j818m36K665m241
1708b402M690l770J677R88l433M892m905L439r29j856M087n081M537k668N8K506
1724A830m239M685l785J850N14k579L828l991L093j429m98K194l252L459k858
$$ plain form
1739 -1178 405 461 -1198 1670 -1720 1376 -655 -269 1173 -1785 1973 -1620 789 325 -1374 2092
1755 2092 -2203 1669 -642 -637 1715 -2302 2197 -1472 267 983 -1951 2287 -1976 1075 126 -1198
1771 -1198 1931 -2040 1593 -726 -321 1204 -1696 1721 -1290 555 272 -993 1439 -1497 1215
1786 1215 -637 -71 780 -1311 1509 -1356 849 -98 -740 1400 -1725 1560 -975 45 932 -1652
1802 -1652 1948 -1664 852 195 -1223 1870 -1979 1510 -566 -518 1445 -1905 1808 -1163 237 755
1818 755 -1436 1726 -1484 864 -41 -734 1295 -1437 1245 -706 66 572 -1062 1259 -1155 766
1834 766 -213 -427 962 -1275 1246 -905 298 421 -1050 1426 -1425 990 -260 -572 1265 -1605
1850 -1605 1461 -889 30 834 -1452 1637 -1355 662 227 -987 1487 -1511 1110 -378 -375 1041
$$ packed form
1739a178J583N6j659K868l390L096k031L86J442k958L758l593K409m64j699L466
1755B092m295L872k311NK352m017M499l669J739P16k934M238m263L051r49j324
1771a198L129l971L633k319M05J525k900L417l011J845k83j265K432k936K712
1786A215j852N66Q51k091K820k865K205r47o42K140l125L285k535J020Q87k584
1802a652L600l612K516o57j418L093l849L489k076M8J963l350L713k971J400N18
1818G55k191L162l210K348r05o93K029k732K682j951P72N06j634K321k414J921
1834G66r79k14J389k237K521k151J203J23j471K476k851K415j250l12J837k870
1850a605L066k350R19Q04k286L089k992K017m35j214K474k998K621j488LJ416
$$ plain form
1866 1041 -1342 1296 -873 263 409 -918 1161 -1087 756 -260 -309 760 -1047 1017 -780 299
1882 299 205 -710 1027 -1080 854 -390 -209 751 -1105 1168 -884 350 320 -902 1240 -1216 829
1899 829 -197 -503 1064 -1291 1160 -674 10 672 -1109 1252 -993 487 160 -724 1077 -1090
1915 -1090 817 -325 -214 695 -951 948 -692 274 182 -592 824 -852 666 -339 -110 501 -782
1932 -782 866 -737 408 52 -488 836 -951 820 -422 -90 618 -974 1066 -838 342 261 -800
1949 -800 1090 -1050 716 -145 -466 938 -1111 943 -513 -57 604 -948 990 -753 316 178
1965 178 -603 820 -803 576 -239 -166 473 -669 685 -556 294 6 -325 573 -697 664 -428
1982 -428 107 303 -631 841 -785 535 -83 -418 816 -992 865 -468 -91 640 -984 1038 -770
$$ packed form
1866A041k383K638k169J136J46j327K079k248J843j016m9J069j807K064j797J079
1882B99r4r15J737k107J934j244J81R60j856K273k052J234l0j222K142k456K045
1899H29j026l06J567k355K451j834O84O62j781K361k245J480l27q84J801k167
1915a090J907j142J11R09j646J899j640R66r2p74J416j676J518j005K29O11j283
1932g82J648j603J145l56n40J324j787J771j242L32P08j592K040j904J180q1j061
1949h00J890k140J766q61l21J404k049K054j456M56O61j552J938j743J069j38
1965A78p81J423j623J379q15P3O39j142J354j241Q50k88l31Q98j270J361j092
1982d28N35J96r34J472j626J320o18l35J234j808J857j333L77P31j624K022j808
$$ plain form
1999 -770 254 312 -809 1018 -926 539 -22 -498 813 -898 708 -324 -113 477 -688 710 -523
2016 -523 237 61 -333 518 -570 500 -332 97 198 -436 600 -625 518 -229 -158 522 -758 823
2034 823 -623 235 282 -703 943 -899 581 -54 -489 883 -1011 816 -387 -171 668 -918 888
2051 888 -613 137 334 -678 802 -688 393 -32 -298 526 -606 544 -322 111 159 -350 502 -514
2069 -514 457 -249 -1 316 -550 678 -614 376 -8 -410 731 -868 723 -360 -134 626 -906 939
2087 939 -705 195 317 -764 966 -868 512 -16 -471 776 -855 689 -344 -100 463 -671 699
2104 699 -535 255 65 -328 515 -554 499 -326 92 201 -429 602 -606 448 -174 -167 510 -722
2122 -722 749 -537 160 276 -660 847 -802 514 -47 -444 805 -928 761 -374 -119 571 -858
$$ packed form
1999g70J024N8j121J827j944J465n61m76J311j711J606j032K11N90j165J398j233
2016e23P60j76l94Q51j088J070q32M29J01o34J036j225J143p47P1O80j280J581
2034H23j446Q58M7r85J646j842J480o35m35J372j894J827j203K16Q39j586J806
2051H88j501P50J97j012J480j490J081m25k66Q24j132J150q66M33M8n09Q52j016
2069e14R71p06K48L17q66J228j292R90l84m02J141j599J591j083K26P60j532J845
2087I39j644R00J22j081J730j834J380n28m55J247j631J544j033K44N63j134J370
2104F99j234P90j90l93Q43j069J053q25M18J09o30J031j208J054o22PO77j232
2122g22J471j286O97J16r36J507j649J316n61l97J249j733J689j135K55O90j429
$$ plain form
2139 -858 843 -638 254 209 -564 776 -740 540 -180 -189 508 -670 669 -498 225 121 -395 596
2157 596 -644 543 -292 -7 362 -604 704 -633 352 1 -398 669 -785 667 -365 -72 498
2174 498 -770 848 -673 280 186 -605 846 -843 600 -166 -282 665 -838 783 -489 83 337
2191 337 -646 798 -697 407 -51 -317 600 -696 648 -412 89 256 -527 678 -648 460 -142
2208 -142 -197 509 -684 712 -532 197 191 -559 749 -785 559 -200 -255 624 -841 798 -537 102
2226 102 374 -716 863 -752 448 23 -438 763 -828 657 -311 -92 478 -705 730 -564 259
2243 259 101 -450 627 -674 532 -264 -64 378 -593 650 -565 334 -9 -331 598 -726 643 -384
2261 -384 15 375 -689 801 -678 358 52 -480 771 -843 682 -285 -158 577 -798 810 -565
$$ packed form
2139h58J701j481Q92m5p73J340j516J280p20rO97j178J339j167P23j04n16R91
2157E96j240J187q35K85L69r66J308j337R85l51l99J067j454J452j032K93N70
2174D98j268J618j521R53r4p91J451j689J443p66j16R47j503J621j272N72K54
2191C37r83J444j495J104m58k66R17j296J344j060N01J67p83J205j326J108o02
2208a42n5P06j193J396j244P29op50J308j534J344p59n5Q79j465J639j335O39
2226A02K72j090J579j615J200m25m61J201j591J485r68K19N70j183J435j294Q23
2243B59j58n51J077j301J206p96K00M42r71J243j215Q99l43l22R29j324J369j027
2261c84L99L60j064J490j479J036l06n32J251j614J525r67J27P35j375J608j375
$$ plain form
2278 -565 179 257 -577 760 -711 473 -111 -264 549 -685 615 -413 87 198 -485 612 -608 408
2296 408 -153 -167 439 -624 632 -476 178 172 -502 673 -693 495 -149 -234 577 -741 733 -461
2314 -461 96 339 -636 788 -665 395 15 -396 679 -717 619 -273 -55 389 -616 655 -518
2331 -518 249 73 -375 567 -593 490 -252 -55 321 -523 593 -503 263 16 -317 552 -619 519
2349 519 -287 -47 379 -591 661 -527 238 123 -438 640 -645 479 -156 -190 494 -644 599 -400
2367 -400 93 241 -511 614 -550 351 -31 -242 494 -556 509 -313 44 236 -452 543 -475 298
2385 298 -54 -226 436 -509 473 -302 55 224 -444 552 -485 306 -10 -257 473 -552 482 -261 -10
2404 -10 296 -497 547 -446 209 81 -343 518 -537 409 -150 -133 357 -503 478 -334 101 167 -365 471
$$ packed form
2278e65P44P8q34J337j471J184n84j53Q13j234J300j028N00J11o83J097j220J016
2296D08n61j4O06j063J256j108O54oo74J175j366J188o44q5Q11j318J474j194
2314d61N57K43r75J424j453J060l80m11J075j396J336q92K18M44j005J271j173
2331e18P67j76m48R42j160J083p42J97L76q44J116j096P66k47l33Q69j171J138
2349E19q06K40M26r70J252j188P65j15n61J078j285J124o35l4O84j138J243r99
2367d00M93J48p52J125j164R01l82k11P36j050J065q22L57J92o88R95j018P73
2385B98l52j72O62r45R82p75L57J69o68R96j037P91l16k47P30j025J034p43K51
2404a0L06p93J044r93O55j28m24Q61j055R46n59J7M90q60R81q12M35O6n32Q36
$$ plain form
2424 471 -448 298 -86 -163 349 -464 435 -290 72 148 -344 452 -430 297 -83 -155 359 -448 423 -291 65
2445 65 181 -369 471 -423 274 -52 -188 398 -463 418 -245 -1 233 -427 466 -384 177 26 -281 398
2465 398 -445 347 -159 -68 272 -408 427 -316 133 100 -294 404 -409 296 -104 -113 288 -397 392 -275 109
2486 109 112 -276 383 -387 295 -101 -114 293 -401 385 -286 84 120 -300 407 -412 270 -71 -164 332 -444 410
2508 410 -259 41 189 -363 433 -382 228 6 -210 376 -401 340 -166 -49 228 -335 392 -314 156 48
2528 48 -222 329 -351 299 -143 -47 214 -337 356 -282 156 36 -210 349 -398 315 -179 -33 239 -368 415
2549 415 -317 143 94 -273 409 -439 312 -110 -109 319 -412 405 -263 92 156 -302 405 -355 252 -42 -123 297
2571 297 -341 350 -214 64 111 -252 345 -326 220 -78 -103 259 -366 364 -261 83 126 -321 397 -378 254
$$ packed form
2424D71r19P46l84p7N12q13Q99p25L62P6m92P96q82P27l80p2N14q07Q71p14L56
2445F5J16n50Q40q94O97l26j36N86q61Q81o63K44K34o60Q93q50N61j51l07O79
2465C98q43P92n06R1L40o80Q35p43M49l3l94O98q13P05m00rM01o85P89o67L84
2486A09Ll88O59p70O82l96j3M07o94P86o71L70L6m20P07q19O82l41r3M96p76Q54
2508D10o69L00J48n52P96q15O10k22k16N86p77P41n06J17K77n63P27p06M70j08
2528D8k70N51o80O50m42R6K61n51O93o38M38j20k46N59p47P13m94J46K72o07P83
2549D15p32M60m9l67O82q48P51m22JM28p31Q17o68L55O4m58P07p60O07k94q1M20
2571B97o38O91n64K78M7l63N97o71N46k98k5L62o25P30o25L44M3m47P18p75O32
$$ plain form
2592 254 -39 -157 351 -430 385 -231 11 207 -359 434 -355 200 40 -221 357 -387 340 -155 -13 215
2612 215 -324 381 -309 189 5 -193 317 -354 338 -198 15 176 -330 387 -358 213 -8 -201 354 -416
2632 -416 363 -199 -26 219 -388 433 -351 174 47 -251 398 -409 323 -125 -80 276 -384 414 -302 130
2652 130 92 -265 396 -382 291 -130 -74 274 -378 377 -289 119 75 -252 375 -415 299 -142 -72 277 -405
2673 -405 410 -314 146 95 -306 415 -432 326 -103 -116 326 -425 439 -281 97 141 -327 444 -383 264 -63
2694 -63 -149 323 -409 388 -249 73 160 -319 400 -372 242 -61 -165 333 -408 405 -255 52 167 -338 434
2715 434 -376 271 -42 -195 372 -455 404 -262 25 219 -386 452 -388 238 5 -221 402 -427 375 -188
2735 -188 -8 232 -378 437 -346 198 31 -216 378 -404 335 -195 -37 224 -370 409 -354 172 20 -242
$$ packed form
2592B54k93j18N08p81Q15o16K42J96n66P93p89N55j60k61N78p44P27m95J42K28
2612B15n39P05o90M98j84j98N10o71O92n36K13J61n06P17p45N71k21j93N55p70
2632d16P79n62J73K45o07Q21p84N25j27k98O49q07P32m48M5L56o60P98p16M32
2652A30l8l57O61p78O73m21N6L48o52P55o66M08m4l27O27p90P14m41P0L49o82
2673d05Q15p24M60n1m01P21q47P58m29j3M42p51Q64p20L78M4m68P71q27O47l27
2694f3q6M72p32P97o37L22Q7m79P19p72O14l03j04M98p41Q13o60L07J15n05P72
2715D34q10O47l13j53N67q27Q59o66K87J94o05Q38q40O26k33k26O23q29Q02n63
2735a88J80K40o10Q15p83N44j67k47N94p82P39n30J58K61n94P79p63N26j52k62
$$ plain form
2755 -242 385 -416 355 -170 -41 266 -400 442 -336 160 88 -283 418 -416 334 -123 -93 304 -418 434 -302
2776 -302 106 118 -318 421 -413 274 -82 -122 317 -417 386 -282 83 137 -316 396 -394 261 -81 -138 306
2797 306 -408 379 -266 72 139 -309 410 -374 267 -59 -135 339 -405 393 -238 46 190 -344 415 -370 230
2818 230 -14 -203 369 -426 360 -209 -10 234 -374 420 -346 184 44 -253 375 -422 328 -157 -57 250
2838 250 -380 393 -304 140 50 -248 368 -382 295 -135 -67 245 -349 379 -282 126 55 -245 361 -376 290
2859 290 -118 -86 268 -370 402 -293 106 103 -298 387 -404 270 -77 -164 302 -407 365 -246 22 177 -334
2880 -334 393 -340 194 -6 -201 337 -360 316 -165 -8 198 -298 353 -308 177 4 -176 319 -327 296
2900 296 -173 -20 186 -312 347 -310 170 20 -207 335 -378 317 -150 -40 223 -367 378 -297 128 75
$$ packed form
2755b42O27q01P71n25J29L07o66Q42p78M96p2l71P01q34P50m57L0L97p22Q52p36
2776c02M08J2m36P39q34O87l56m0M39p34Q03o68L65N4m53P12p90O55l42n7M44
2797C06p14P87o45L38O7m48P19p84O41l26p6M74p44P98o31K84J44n34P59p85O00
2818B30k44j89N72p95P86n69J99K44o08P94p66N30j40k97O28p97P50m85J00L07
2838B50o30P73o97M44r0k98O16p50O77m30O8L12n94P28o61M08p1l00O06p37O66
2859B90m08L2L54o38P72o95L99lm01O85p91O74l47q7M66p09P72o11K68J55n11
2880c34P27p33N34k00j95N38o97O76m81J57K06m96O51o61M85j73j80M95o46O23
2900B96m69J53K06m98O59o57M80j50k27N42p13O95m67J10K63n90P45o75M25n3
$$ plain form
2920 75 -272 353 -355 275 -88 -99 276 -359 349 -209 57 130 -259 330 -304 206 -15 -127 271 -319 289
2941 289 -161 33 134 -254 308 -301 182 -34 -135 254 -319 303 -191 35 139 -281 348 -324 186 -29
2961 -29 -174 311 -356 293 -153 -1 195 -317 338 -273 133 54 -203 315 -312 242 -92 -63 219 -299 303
2982 303 -215 97 55 -192 293 -294 203 -79 -71 195 -288 288 -233 61 68 -226 286 -312 226 -78 -79 243
3004 243 -321 312 -201 44 121 -248 322 -295 190 -30 -146 270 -308 292 -153 -3 166 -262 321 -258
3024 -258 145 8 -150 273 -295 247 -127 -19 163 -259 273 -229 109 20 -172 235 -282 224 -121 -25 168
3045 168 -262 288 -243 115 48 -175 257 -300 227 -99 -62 210 -278 298 -214 91 79 -225 292 -290 196
3066 196 -39 -106 232 -317 267 -176 38 117 -241 283 -262 144 -40 -122 217 -266 226 -155 11 102 -213
$$ packed form
2920G5l47O25p08O30l63j1L75o35P08n58K66P3l89N89o34N10k21j12L98n90O08
2941B89m50J94J01l88N62o09M83k16j01L89n73O22m94K26J04m20O29o72N10k15
2961b9j45M85o67O49m46J52J96n12O55o11M06p9k57N18o27N54l34K9K82n18O02
2982C03n18L12m2k47M85n87M97k82QK66m83N76n21K94Pk94N12n98N38l04jL22
3004B43n64O33n13K45P7l69N70o17M85k20j16M16n78O00m45J50J69m28N83n79
3024b58M03j37j58M23n68N42l74J08J82m22N32n02L38q9j92M07n17N06l45R6J93
3045A68m30N50n31L58o7k23M32n57N27l26L7K72m88N76n12L05j2l04N17n82M86
3066A96k35o7L38n49N84m43K14P9l58N24n45M06j84q2L39m83M92l81J66R1l15
$$ plain form
3087 -213 266 -242 147 -28 -117 208 -259 230 -161 22 116 -224 281 -249 161 -5 -133 247 -285 253 -133
3108 -133 -11 158 -259 302 -233 99 37 -196 271 -291 207 -97 -65 190 -274 257 -192 69 68 -185 246
3129 246 -245 159 -61 -74 160 -238 230 -187 83 53 -153 243 -260 196 -66 -48 191 -232 258 -199 88
3150 88 72 -184 285 -266 183 -78 -107 209 -286 253 -160 13 116 -244 283 -247 134 7 -143 234 -265
3171 -265 226 -124 -7 135 -218 250 -204 104 10 -122 196 -232 220 -129 16 130 -194 243 -223 134
3191 134 -7 -99 216 -255 229 -150 -11 130 -247 274 -240 131 10 -154 246 -267 212 -111 -43 164 -263
3212 -263 259 -183 66 71 -174 241 -235 173 -46 -56 172 -229 229 -166 55 59 -151 214 -213 174 -62 -34
3234 -34 161 -225 240 -185 86 57 -172 234 -257 180 -72 -73 187 -257 258 -190 43 89 -213 262 -250 155
$$ packed form
3087b13M79n08L89j75q9L25m67M89l91J83R4l40N05n30M10j66j28L80n32N38l86
3108a33J22J69m17N61n35L32o2k33M67n62M98l04L2K55m64N31m49K61jk53M31
3129B46m91M04k20j3K34l98M68m17K70l0k06L96n03M56k62J8K39m23M90m57K87
3150H8j6k56M69n51M49k61k9L16m95N39m13J73J03l60N27n30L81j27j50L77m99
3171b65M91l50J17J42l53M68m54L08r4j32L18m28M52l49J45J14l24M37m66L57
3191A34j41r2L15m71M84l79J39J41l77N21n14L71j21j64M00n13M79l23O8K07m27
3212b63N22m42K49Nk45M15m76M08k19j0K28m01M58l95K21Mk10L65m27L87k36K8
3234c4J95l86M65m25K71k9k29M06m91M37k52jK60m44N15m48K33M6l02M75n12M05
$$ plain form
3256 155 -28 -119 231 -252 229 -125 11 109 -190 240 -196 123 1 -100 198 -213 208 -109 21 100 -180
3277 -180 225 -196 133 -20 -103 184 -242 204 -145 5 109 -216 264 -233 143 -1 -133 240 -282 221
3297 221 -115 -35 163 -254 277 -194 75 62 -174 244 -230 184 -69 -41 152 -208 220 -161 69 40 -150
3318 -150 209 -221 176 -95 -32 122 -225 228 -204 75 27 -155 234 -243 202 -103 -61 181 -250 256 -174
3339 -174 36 84 -191 263 -229 146 -8 -111 216 -262 226 -127 12 127 -196 227 -193 123 1 -101
3359 -101 189 -218 202 -109 20 100 -182 215 -213 136 -33 -115 178 -224 224 -151 7 103 -218 231 -227
3380 -227 139 -6 -144 220 -249 206 -94 -32 159 -214 258 -190 86 49 -169 223 -240 160 -59 -69 172
3401 172 -219 208 -153 63 64 -162 207 -216 158 -66 -63 150 -214 200 -170 59 60 -158 226 -229 170 -58
$$ packed form
3256A55j83r1L50m83M81l54J36R8k99M30m36L19j22j01K98m11M21l17J30P9k80
3277a80M05m21L29j53q3K87m26M46l49J50J04l25M80m97L76j44j32L73n22N03
3297B21l36Q0J98m17N31m71K69j3k36M18m74M14k53K8J93l60M28l81K30k9j90
3318a50L59m30L97k71O3J54l47M53m32K79m8j82L89m77M45l05M2K42m31N06m30
3339a74K10M8k75M54m92L75j54j03L27m78M88l53J39J15l23M23m20L16j22j02
3359a01K90m07M20l11J29Q0k82L97m28L49j69q2K93m02M48l75J58R6l21M49m58
3380b27L66j45j38L64m69M55l00O2J91l73M72m48K76l7k18L92m63M00k19j0K41
3401A72l91M27l61K16Jk26L69m23L74k24LK13l64M14l70K29Jk18L84m55L99k28
$$ plain form
3423 -58 -65 176 -245 224 -169 32 91 -188 258 -222 156 -21 -106 215 -243 200 -105 -7 131 -196 226 -197
3445 -197 97 7 -127 182 -225 160 -86 -22 106 -188 183 -161 81 -9 -108 171 -206 179 -93 0 118 -183
3467 -183 216 -182 93 18 -136 201 -234 191 -66 -34 168 -223 235 -156 61 61 -186 217 -183 144 -13
3488 -13 -77 163 -208 175 -121 11 74 -150 178 -205 125 -46 -61 134 -187 186 -129 43 70 -148 206 -180
3510 -180 131 -25 -76 179 -206 211 -118 13 112 -198 230 -178 115 33 -136 193 -213 173 -79 -43 138
3531 138 -205 195 -143 60 44 -136 173 -199 117 -56 -26 118 -179 172 -149 69 20 -120 179 -190 155
3552 155 -70 -12 130 -198 215 -140 64 56 -161 210 -208 135 -23 -91 183 -197 185 -119 -6 95 -185
3573 -185 202 -176 102 5 -98 157 -187 158 -76 -25 90 -162 179 -154 79 -9 -97 157 -190 156 -80
$$ packed form
3423e8pK41m21M69l93K01N9k79M46m80L78j77q5L21m58M43l05R8J38l27M22m23
3445a97K94r0j34L09m07L85k46O4J28k94L71l44K42r0r9K79l77L85k72R3J18l01
3467a83L99l98K75p5j54L37m35M25k57L2K02l91M58l91K17%k47M03m00L27j57
3488a3o4K40l71L83k96J32O3k24L28l83L30j71j5J95l21L73l15J72K7k18L54l86
3510a80L11j56n1K55l85M17l29J31R9l10M28m08K93q2j69L29m06L86k52L6J81
3531A38l43M00l38K03j6j80L09l72L16j73L0J44k97L51l21K18m9j40K99l69L45
3552A55k25N8J42l28M13l55K04qk17L71m18L43j58o8K74l80L82l04J13J01k80
3573a85L87l78K78r7j03K55l44L45k34N1J15k52L41l33K33q8q8K54l47L46k36
$$ plain form
3594 -80 -15 93 -150 197 -165 77 29 -113 197 -207 165 -85 -16 136 -195 192 -144 67 51 -123 182 -196
3616 -196 129 -38 -71 125 -189 172 -118 37 63 -129 179 -171 114 -24 -68 156 -162 170 -101 26 69
3637 69 -160 188 -161 96 -31 -61 158 -200 164 -96 18 88 -155 198 -172 94 4 -110 173 -199 171
3658 171 -88 -14 106 -183 185 -163 82 25 -109 170 -194 127 -54 -35 110 -167 188 -128 61 50 -100
3679 -100 177 -172 131 -42 -44 133 -178 179 -120 40 58 -147 174 -179 128 -35 -73 135 -181 176 -95
3700 -95 19 63 -158 187 -178 109 -31 -106 150 -187 162 -94 3 81 -161 171 -145 91 -2 -84 169 -170
3722 -170 153 -88 -3 93 -141 166 -147 88 3 -103 162 -183 144 -73 -16 103 -163 167 -156 67 22 -116
3744 -116 162 -186 124 -51 -43 147 -190 190 -136 42 61 -139 185 -178 115 -22 -56 142 -163 169 -109
$$ packed form
3594h0O5J08k43L47l62K42m8j42L10m04L72k50O9J52l31L87l36K11j6j74L05l78
3616a96L25j67l3J96l14L61k90J55K6j92L08l50K85j38m4K24l18L32k71J27M3
3637F9k29L48l49K57j27l0K19l58L64k60J14P0k43L53l70K66r0j14K83l72L70
3658A71k59P4J20k89L68l48K45n7j34K79l64L21j81J9J45k77L55l16J89j1j50
3679a00K77l49L03j73kJ77l11L57k99J60J8k05L21l53L07j63l8K08l16L57k71
3700i5J14M4k21L45l65K87j40p5K56l37L49k56R7P8k42L32l16K36r3q2K53l39
3722a70L23k41Q5R6k34L07l13K35q5j06K65l45L27k17N7J19k66L30l23K23m5j38
3744a16K78l48L10j75QJ90l37L80l26J78J9k00L24l63K93j37l4J98l05L32k78
$$ plain form
3765 -109 39 51 -127 175 -159 121 -33 -49 131 -156 172 -112 40 47 -147 176 -173 102 -39 -90 142 -217
3787 -217 174 -110 4 90 -173 178 -164 100 7 -99 173 -182 161 -81 -10 112 -161 176 -139 61 11
3808 11 -106 147 -149 132 -65 -20 85 -156 170 -127 85 10 -108 154 -189 150 -61 -15 112 -174 178
3829 178 -159 64 13 -135 178 -177 139 -63 -48 138 -176 182 -109 56 71 -130 184 -162 124 -15 -64
3850 -64 147 -160 160 -89 35 53 -143 144 -163 89 -29 -62 130 -169 164 -95 36 57 -144 165 -158
3871 -158 122 -33 -73 139 -198 176 -102 10 84 -172 202 -172 108 5 -103 180 -185 152 -67 -11 128
3892 128 -158 178 -131 60 27 -103 159 -158 117 -67 -22 91 -143 152 -133 66 14 -97 146 -164 131
3913 131 -74 -22 120 -154 178 -137 66 35 -112 179 -170 144 -51 -44 144 -174 184 -123 50 63 -156 186
$$ packed form
3765a09J48J2j78L02l34K80j54j6J80k87L28k84J52Pj94L23l49K75j41n1K32l59
3787b17L91k84J14Q6k63L51l42K64r3j06K72l55L43k42P1J22k73L37l15K00n0
3808A1j17K53k96K81j97M5J05k41L26k97K12p5j18K62l43L39k11M6J27k86L52
3829A78l37K23n1j48L13l55L16k02J5J86l14L58k91J65J5k01L14l46K86j39m9
3850f4K11l07L20k49J24J8j96K87l07K52j18l3J92k99L33k59J31K1k01L09l23
3871a58K80j55m0K12l37L74k78J12P4k56L74l74K80j03j08K83l65L37k19N6J39
3892A28k86L36l09J91l3j30K62l17K75j84M5J13k34K95k85J99n2j11K43l10K95
3913A31k05N2J42k74L32l15K03l1j47K91l49L14j95PJ88l18L58l07J73J3k19L42
$$ plain form
3935 186 -161 127 -11 -72 154 -161 152 -101 6 85 -121 166 -141 84 0 -71 102 -152 137 -87 15
3956 15 57 -121 148 -138 101 -21 -67 133 -166 170 -99 33 92 -133 179 -141 86 4 -88 163 -176 141
3978 141 -66 -30 112 -169 158 -116 51 30 -117 141 -157 98 -26 -39 95 -133 130 -103 42 26 -96
3999 -96 124 -129 102 -51 -20 87 -141 159 -101 53 28 -99 154 -154 117 -42 -35 120 -154 152 -97 27
4021 27 76 -130 141 -131 89 -10 -71 131 -146 100 -74 -15 53 -132 128 -106 70 -11 -63 127 -145 116 -78
4044 -78 1 69 -127 135 -112 57 -5 -74 133 -123 117 -57 -7 92 -118 149 -130 53 9 -87 131 -133 111
4067 111 -42 -36 102 -131 127 -97 30 45 -104 133 -134 79 -40 -54 95 -115 108 -69 21 64 -108 127
4089 127 -101 73 -7 -53 102 -118 109 -57 17 62 -88 114 -108 61 14 -60 110 -125 105 -67 -19 84
$$ packed form
3935A86l47K88j38o1K26l15L13k53J07P9k06K87l07K25q4p1J73k54K89k24J02
3956A5M2j78K69k86K39j22m6K00k99L36k69J32N9k25L12l20K27q2r2K51l39L17
3978A41k07L6J42k81L27k74J67k1j47K58k98K55j24j3J34k28K63k33J45j6j22
3999i6K20k53K31j53L1J07k28L00k60J54k5j27K53l08K71j59PJ55k74L06k49J24
4021B7M9k06K71k72K20r9o1K02k77K46j74N9O8j85K60k34J76q1n2J90k72K61j94
4044g8P9O8j96K62k47J69o2o9K07k56K40j74N0R9k10K67k79J83m4r6K18k64K44
4067A11j53OJ38k33K58k24J27J5j49K37k67K13j19j4J49k10K23j77R0M3j72K35
4089A27k28J74q0m6J55k20K27j66P4M5j50K02k22J69m7p4J70k35K30j72M8J03
$$ plain form
4111 84 -116 133 -115 49 16 -95 101 -132 98 -49 -30 89 -114 131 -95 29 40 -88 134 -110 95
4132 95 -11 -21 97 -97 117 -70 11 38 -78 112 -82 82 -4 -55 78 -112 86 -74 -9 54 -107 110 -112
4155 -112 47 -12 -60 95 -108 107 -74 4 63 -111 126 -93 44 4 -82 117 -108 89 -40 -14 77 -103 116
4178 116 -80 37 28 -82 116 -108 77 -32 -29 82 -110 116 -64 26 45 -106 96 -111 69 -34 -43 90 -117
4201 -117 88 -82 25 54 -88 120 -102 65 -9 -45 109 -120 114 -66 7 63 -100 130 -103 65 23 -61
4223 -61 118 -121 119 -48 -12 67 -113 131 -108 43 17 -97 105 -129 87 -44 -31 71 -120 99 -97 34
4245 34 8 -64 108 -111 90 -28 -13 74 -116 131 -91 56 29 -80 108 -109 87 -27 -48 90 -128 128
4267 128 -82 27 50 -113 134 -123 83 -33 -58 98 -123 108 -76 -13 51 -121 124 -107 50 0 -74 97
$$ packed form
4111H4k00K49k48J64l3j11J96k33K30j47J9J19k03K45k26J24J1j28K22k44K05
4132I5j06j0J18j94K14j87Q1K7j16J90j94J64q6n1J33j90J98j60O5O3j61K17k22
4155a12J59n9m8J55k03K15j81P8N9j74K37k19J37m0q6J99k25J97j29K6R1j80K19
4178A16j96J17rj10J98k24J85j09LJ11j92K26j80R0J9j51K02k07J80j03rJ33k07
4201a17K05j70J07K9j42K08k22J67p4l6J54k29K34j80P3N6j63K30k33J68m2q4
4223f1J79k39K40j67L6P9j80K44k39J51k6j14K02k34K16j31J3J02j91K19j96J31
4245C4k6p2J72k19K01j18J5Q7j90K47k22J47k7j09J88k17J96j14k1J38k18K56
4267A28k10J09K3j63K47k57K06j16k5J56k21K31j84O3O4j72K45k31J57n0p4J71
$$ plain form
4289 97 -113 82 -68 -13 66 -103 125 -95 55 -3 -54 82 -117 90 -57 5 68 -104 112 -105 51 0 -78
4312 -78 98 -135 109 -69 -11 76 -121 119 -107 35 20 -101 128 -136 84 -31 -44 113 -131 102 -81 25
4334 25 31 -76 114 -92 65 -26 -36 70 -101 102 -82 37 37 -67 114 -102 89 -30 -33 66 -120 124 -91
4357 -91 28 36 -101 117 -131 76 -30 -59 99 -139 105 -79 -6 66 -117 117 -88 50 6 -71 120 -119 96
4380 96 -48 -15 62 -97 102 -97 52 -5 -47 95 -110 90 -59 4 32 -91 112 -121 63 2 -59 102 -140
4403 -140 102 -66 -22 65 -131 132 -99 31 13 -91 114 -128 87 -28 -30 95 -104 105 -59 35 38 -76 90
4426 90 -98 72 -35 -6 75 -82 89 -76 56 -8 -61 83 -110 77 -42 -9 82 -115 101 -78 36 26 -94
4449 -94 116 -113 78 -26 -54 112 -124 100 -67 -4 71 -111 124 -98 49 -2 -60 89 -100 83 -35 -9
$$ packed form
4289I7k10J95j50N5P9j69K28k20J50n8n1J36j99K07j47O2O3j72K16k17J56n1p8
4312g8J76k33K44j78N8Q7j97K40k26J42j5j21K29k64K20j15j3J57k44K33j83J06
4334B5Oj07J90k06J57r1j0J06j71K03j84J19%j04J81k16J91j19lR9j86K44k15
4357i1J19Qj37K18k48K07j06k9J58k38K44j84P3P2j83K34k05J38m4p7J91k39K15
4380I6j44L3P7j59J99j99J49n7m2J42k05K00j49O3K8j23K03k33J84o1o1J61k42
4403a40K42j68M4Q7j96K63k31J30j8j04K05k42K15j15kJ25j99K09j64R4Lj14J66
4426I0j88J70j07K9Q1j57J71j65J32o4n3J44j93J87j19L3R1j97K16j79J14j0j20
4449i4K10k29J91j04k8J66k36K24j67O3P5j82K35k22J47n1n8J49j89J83j18K6
$$ plain form
4471 -9 52 -69 82 -80 54 -18 -39 72 -99 83 -72 19 19 -89 102 -116 67 -16 -55 86 -115 106 -66
4494 -66 -4 72 -113 120 -80 33 42 -79 114 -96 64 -23 -15 82 -89 86 -55 16 24 -54 87 -66 57 -21 -12
4519 -12 55 -62 101 -56 26 8 -52 75 -88 64 -41 -21 61 -86 97 -77 13 32 -75 110 -92 70 -5
4542 -5 -34 86 -102 93 -33 0 59 -55 91 -65 29 10 -34 58 -78 62 -27 0 40 -51 77 -68 21 -11 -41
4567 -41 64 -85 66 -39 -1 47 -76 71 -79 38 5 -61 94 -89 72 -26 -26 77 -79 91 -61 23 33
4590 33 -58 81 -64 70 -5 -23 69 -63 69 -27 12 22 -56 65 -68 43 -32 -42 61 -84 59 -49 8 27
4614 27 -52 72 -79 50 -9 -41 78 -90 75 -35 5 56 -79 100 -63 42 11 -56 88 -74 70 -26 -16
4637 -16 62 -83 91 -56 24 17 -53 70 -75 53 -14 -23 43 -77 55 -51 0 18 -61 55 -72 54 -7 -25 60
$$ packed form
4471iO1j21J51j62J34p2k1J11j71J82j55R1%j08J91k18J83q3l9J41k01K21j72
4494f6O2P6j85K33k00J13Rj21J93k10J60q7QR7j71J75j41P1Qp8J41j53J23p8R
4519a2O7j17J63j57Q2j8o0J27j63J52j05K0Q2j47J83j74R0J9j07J85k02J62p5
4542ek9J20j88J95j26L3N9j14J46j56R4j9m4R2j36J40q9K7M0r1J28j45Q9l2l0
4567d1J05j49J51j05L8M8j23J47j50J17l3o6J55j83J61r8%J03j56J70j52Q4J0
4590C3r1J39j45J34p5j8R2j32J32r6L9J0p8J21j33J11p5j0J03j45J43j08N7J9
4614B7p9J24j51J29n9l2J19j68J65j10M0N1j35J79j63J05l1o7J44j62J44r6J0
4637a6P8j45J74j47Q0pp0J23j45J28o7rO6j20J32j06N1J8p9J16j27J26o1j8Q5
$$ plain form
4662 60 -79 82 -56 28 23 -55 73 -76 55 1 -20 61 -84 78 -45 7 43 -64 79 -67 32 13 -57 66
4686 66 -98 50 -47 -23 48 -88 68 -62 19 22 -62 62 -72 38 -25 -23 41 -76 62 -45 25 7 -63 73 -70
4711 -70 46 -14 -13 52 -66 85 -52 37 21 -59 89 -66 50 -14 -35 72 -68 71 -55 8 37 -66 76 -74
4735 -74 39 -5 -60 85 -89 56 -29 -3 40 -86 76 -80 23 7 -48 66 -71 65 -33 -7 56 -58 89 -59
4759 -59 44 1 -33 75 -101 73 -30 -6 53 -81 75 -74 21 4 -60 84 -93 68 -27 -40 65 -85 67
4782 67 -40 29 31 -70 94 -66 49 -14 -20 64 -70 71 -37 18 40 -51 84 -71 44 -8 -36 75 -76 79
4806 79 -56 24 32 -65 89 -75 32 -21 -34 65 -103 75 -52 -13 50 -84 102 -65 36 7 -66 73 -72 79
4830 79 -20 9 56 -65 89 -42 27 25 -50 78 -71 68 -1 -17 48 -78 81 -53 9 13 -53 73 -93 67 -37
$$ packed form
4662F0j39J61j38Q4np8J28j49J31n4k1Q1j45J62j23N2L6j07J43j46R9j9p0J23
4686F6j64J48r7K4P1j36J56j30Q1Lq4J24j34J10o3KO4j17J38j07P0j8p0J36j43
4711g0J16o0JO5j18J51j37Q9j6q0J48j55J16o4k1J07j40J39j26O3K9j03J42j50
4735g4J13m4n5J45j74J45q5K6M3j26J62j56J03j6n5J14j37J36r8K6O3j14J47j48
4759e9J03m3l4J08j76J74j03K4N9j34J56j49R5j7o4J44j77J61r5j3J05j50J52
4782F7j07O9Kj01J64j60J15o3oQ4j34J41j08N5K2r1J35j55J15n2k8J11j51J55
4806G9j35Q0Qr7J54j64J07n3j3R9j68J78j27L9O3j34J86j67J01k9p3J39j45J51
4830G9r9K9M7j21J54j31O9kp5J28j49J39o9j6O5j26J59j34O2Mo6J26j66J60j04
$$ plain form
4855 -37 -15 51 -91 75 -66 20 12 -52 87 -106 73 -26 -35 63 -102 89 -50 11 35 -70 83 -75 48 5 -29
4880 -29 68 -77 79 -35 12 23 -69 74 -67 38 -12 -26 40 -70 63 -33 14 30 -64 79 -78 26 0 -40 64
4905 64 -82 70 -40 -16 37 -78 77 -51 30 12 -66 70 -82 67 -26 -14 63 -63 72 -52 30 20 -42 73
4929 73 -60 54 -18 -6 36 -51 43 -48 29 27 -43 58 -73 49 -20 -5 49 -69 82 -62 19 26 -41 74 -68 67
4955 67 -10 -19 56 -59 81 -53 21 38 -49 76 -49 46 7 -38 55 -66 57 -35 -12 22 -59 58 -52 32 -3 -31
4981 -31 37 -75 55 -43 -6 22 -54 57 -59 48 -12 -16 49 -61 54 -37 9 40 -61 79 -54 28 18 -33 76
5006 76 -69 64 -11 -8 40 -45 53 -27 1 23 -30 35 -63 10 -4 -32 39 -38 58 -27 12 3 -26 57 -54 44 -9 -13 28 -48
5036 -48 44 -40 13 18 -40 76 -68 39 3 -9 45 -67 63 -28 -1 30 -48 70 -42 24 10 -54 57 -61 24 -11
$$ packed form
4855c7K2O6j42J66j41Q6qo4J39j93J79r9rR8j65J91j39O1K4j05J53j58J23m3l4
4880b9R7j45J56j14M7J1r2J43j41J05n0j4O6j10J33r6M7J6r4J43j57J04k6m0J04
4905F4j46J52j10K4N3j15J55j28Q1j8p8J36j52J49r3J2P7j26J35j24Q2j0o2J15
4929G3j33J14p2J2M2q7R4r1P7kp0J01j31J22o9J5N4j18J51j44Q1Po7J15j42J35
4955F7p7rP5j15J40j34P4J7q7J25j25R5l9m5R3j21J23r2K3L4q1J17j10Q4l5k8
4981c1O8j12J30r8L7K8p6J11j16J07o0mO5j10J15r1M6L1j01J40j33Q2j0n1J09
5006G6j45J33p5LM8q5R8q0K8K2n3O5r8P3j4k8P1p7R6q5L9rk9Q3j11R8n3mM1p6
5036d8R2q4N3Nn8J16j44J07l6j2N4j12J30r1K7L1p8J18j12O6j4o4J11j18Q5l5
$$ plain form
5062 -11 -24 39 -61 39 -31 1 -4 -44 33 -45 25 -28 -5 14 -25 51 -45 28 11 -15 50 -49 54 -26 12 43 -49 75 -38
5091 -38 15 20 -38 61 -59 41 -2 -19 54 -67 50 -11 -7 24 -51 41 -47 30 11 -28 40 -37 18 -32 12 12 -44 53 -42 18
5121 18 0 -10 21 -34 51 -19 17 36 -34 75 -45 37 9 -26 68 -51 32 -17 2 53 -51 54 -50 6 32 -47 65
5148 65 -48 31 -8 -18 29 -46 37 -28 7 15 -33 31 -32 26 -15 0 35 -38 49 -9 31 11 -37 54 -38 57 -13 -10 48 -59
5178 -59 74 -15 2 8 -42 53 -49 18 5 -43 50 -43 48 -11 -25 34 -56 48 -42 15 14 -42 42 -42 34 -18 -15 14 -53 47
5208 47 -31 9 0 -22 60 -37 59 -18 4 38 -51 62 -54 11 14 -40 56 -50 31 -25 -29 57 -62 59 -50 -12 23 -63 57
5237 57 -39 15 15 -28 48 -28 45 -22 -3 30 -43 50 -29 7 -9 -21 43 -60 41 -34 13 15 -55 36 -54 39 -9 -32 61 -66
5267 -66 47 -37 -17 38 -84 63 -48 13 9 -54 57 -69 18 5 -13 39 -49 49 -30 15 21 -29 48 -28 43 -18 -5 31
$$ packed form
5062a1j3O3j00J00p0L2nm0P7p8P0n3K3J9l9P6r6P3j7k6O5r9J03q0L8L1r2J24j13
5091c8N3Nn8R9j20J00m3j7P3j21J17o1ML1p5R2q8P7j9l9O8p7N5n0M4%n6R7r5O0
5121A8j8j0L1n5Q5p0L6J9p0J09j20Q2k8l5R4j19Q3m9J9N1j04J05j04N6K6p9J12
5148F5j13P9l9j0M7p5Q3o5L5Qm8O4o3N8m1J5L5p3Q7n8M0k0m8R1r2R5p0LN8j07
5178e9J33q9J7On0R5j02O7j3m8R3r3R1n9j4N9r0J04r0N7jn6Q4q4P6n2LK9o7J00
5208D7p8M0rk2Q2r7R6p7K2L4q9J13j16O5Ln4R6j06Q1n6mQ6j19J21j09L8L5q6J20
5237E7r6N4%m3P6p6P3o7J9L3p3R3p9L6j6j2O4j03J01p5M7Kp0R1r0R3m8k3R3j27
5267f6J13q4K0N5j22J47j11O1mo3J11j26Q7j3j8N2q8R8p9M5On0P7p6P1o1J3L6
$$ plain form
5295 31 -42 54 -19 22 17 -22 46 -50 40 -23 -28 37 -58 55 -45 4 11 -46 60 -54 32 -9 -44 66 -63 47 -31 4
5323 4 42 -64 53 -48 8 6 -19 54 -59 34 -20 -3 27 -33 45 -30 21 -8 -23 39 -35 26 -26 -7 8 -56 42 -54 19
5352 19 -2 -44 46 -61 36 -25 -12 21 -56 62 -40 -4 26 -47 60 -44 43 -9 -34 45 -41 62 -34 1 23 -29 57
5379 57 -37 27 4 -10 54 -38 32 -18 3 22 -30 30 -43 29 -1 -12 26 -54 39 -51 8 -1 -33 57 -51 24 -6 -31 45 -60
5409 -60 48 -30 3 30 -37 58 -27 15 10 -6 39 -49 33 -3 -14 27 -50 28 -23 5 11 -38 33 -27 33 -15 -16 18 -44 27 -39
5440 -39 -6 -7 -33 29 -48 37 -15 -10 24 -53 47 -40 23 16 -25 37 -44 34 -6 -16 60 -40 40 -9 -3 20 -33 28 -24 17 0
5471 0 -29 28 -31 16 -28 -8 5 -25 16 -23 10 7 -19 19 -34 38 -13 1 13 -37 43 -31 11 -1 -17 38 -50 38 -14 2 39
5502 39 -28 37 -15 16 17 -28 44 -32 11 -6 -23 17 -32 24 -24 -7 -13 -31 8 -44 12 -14 -3 18 -23 19 -19 -15 5 7 41 -26
$$ packed form
5295C1p3R6p3M1nl9O8r6R0o3nO5r5J13j00M9Pn7J06j14Q6m1l5J10j29J10p8L5
5323DL8j06J17j01N6kk5P3j13R3n4J7L0o0P8p5N1k9j5O2p4O1n2J9J5o4R8r6P3
5352A9k1m2R0j07R7o1J3L3p7J18j02L6L0p3J07j04Q7n2k5P9q6J03r6L5K2n2Q6
5379E7r4O4k3j4O4r2P0n0K1J9n2O0p3P2l0j1L8q0R3r0N9rl2R0j08P5l0k5P6j05
5409f0J08p8L3K7o7R5q5M2nj6M5q8Q2l6j1M1p7P8n1K8Om9P1o0O0m8jL4o2P1o6
5440c9L3jk6O2p7Q5n2NL4p7J00q7O3pm1O2q1P8m0j0P6j00Q0m9OK3n3O1n2M1j7
5471@k9N7n9M7m4K0J3l0M1l9L3lk6L8n3P2n1J4J2n0Q0p4M2j2j6N5q8Q8n2J6L7
5502C9o7O5n2L1Jm5P2p6M3j7j7M0m9N6m8J7oj8L9n2N6k6J1K1m1M2l8MK0KL4o7
$$ plain form
5534 -26 26 -6 -15 27 -14 50 -11 16 8 -19 56 -29 14 5 -17 26 -36 25 -12 -12 16 -40 26 -16 3 4 -27 18 -23 17 -22 -11 10
5567 10 -38 27 -22 5 -7 -5 37 -25 13 -13 3 19 -22 39 -18 4 15 -15 22 -31 21 -13 3 36 -26 29 -24 8 16 -29 25
5598 25 -29 22 1 -20 29 -38 30 -22 14 7 -26 16 -39 4 11 -11 19 -26 36 -2 2 22 -8 24 -11 9 -6 -12 16 -29 32 -27
5630 -27 3 13 -42 31 -8 10 6 -15 5 -28 29 -21 -26 15 -22 23 -27 -4 -8 -22 48 -20 22 3 -21 27 -25 22 -9 2 15 -37
5662 -37 28 -20 13 -5 -12 33 -20 30 -15 5 15 -22 25 -11 9 0 -14 24 -42 31 -24 3 0 -30 30 -29 14 -3 -24 33 -35 33
5694 33 -19 3 23 -31 35 -32 -5 23 -7 13 -14 34 2 4 19 -17 34 -13 10 8 -20 31 -28 17 -10 -7 16 -13 40 -11 5 0
5726 0 -27 30 -44 21 -8 0 13 -29 25 -23 7 26 -25 46 -31 23 13 -16 33 -26 42 -10 14 6 -7 39 -13 14 -1 -21 26 -36
5758 -36 18 -18 6 8 -28 23 -19 14 2 -17 25 -35 31 -28 -10 -1 -18 31 -10 23 11 -17 31 -19 20 3 -10 27 -18 24 -17
$$ packed form
5534b6N2l2rM2m1O4o1K7qk7P5q5M3rk2M3o2O1l7%K8n6O6m2J9Jl1M5m1M0l9J1K1
5567A0m8O5m9K7j2KM2o2L8k6J6J6m1O1n7K2J1l0L7n3N2l4J6L3o2N5n3L2Qm5N4
5598B5n4N1k1k1M9o7O8n2L6pl3M2n5M3Pk2L0m5O2l8MK0l0L2l5K0j5oK8m5O1n9
5630b7L0J0n5P3l9J8mk1K0l3N7n0nM1l7M5n0K3mj4P0o8M2j9k4M8n2M7l1J1J3n2
5662c7O5m8L3j8pM5n3N0m5K0J0l7M7l6K0rj4L8o6P3n5K7ll0O0n9M3j7k1N7o8O8
5694C3n2K2K0n4O6o7K7K8l0K0k7M8l2KJ5l6N1m7K3kk8N1n9M5k7LK3k9N3n1J6n
5726@k7N7p4O5k9QJ3m2N4m8L0J9n1P1p7N4j0k9M9n9O8n2K4qj3M6n2K7j5k0M7o2
5758c6N4l6K4Kl6N1m2L3j2j9M2o0O6n9J8Rj7M9m1L3j2k8M8n0L9j7j3L7m5M2m1
$$ plain form
5789 -17 8 14 -23 44 -24 16 -2 -15 20 -19 19 -25 -17 18 -16 26 -36 10 -6 -8 25 -22 27 -20 -6 13 -18 21 -18 23 -4 -9
5821 -9 33 -29 31 -24 11 14 -24 33 -15 9 8 -18 23 -31 21 -12 14 34 -30 26 -23 4 -4 -18 34 -25 18 -18 -14 9 -29 30 -14
5854 -14 15 -1 -14 16 -22 8 -5 -3 23 -19 34 -17 10 14 -14 40 -15 16 2 14 52 -15 27 -11 0 26 -21 32 -24 12 -14
5885 -14 -6 14 -33 5 -1 -5 10 -27 13 -26 26 -6 -15 16 -17 21 -14 -8 13 -23 21 -28 29 -5 -11 18 -26 47 -2 13 4 -14 48 -4
5919 -4 2 9 -10 33 -26 15 6 -6 24 -28 16 -18 23 -12 -21 14 -28 1 0 -3 11 -18 21 -15 -4 -4 -13 15 -27 21 -3 -8 15 -29 10
5954 10 -1 19 20 4 29 -20 9 -1 -5 31 -16 10 -8 8 28 -23 18 -13 -6 -2 -20 8 -38 7 -11 -8 16 -25 12 -21 3 -1 -18
5987 -18 12 -7 6 8 7 29 -31 21 -15 14 7 -9 4 -14 30 6 2 12 -6 27 -21 28 4 -20 13 -17 22 -2 -9 14 -26 11 -20
6020 -20 -2 1 -12 -2 -14 10 -14 -18 19 1 17 -12 6 3 0 30 -11 29 1 10 12 -10 28 -8 -8 7 -32 5 -27 1 0 -19 12 -40
$$ packed form
5789a7K5Ol7O7o8M0j8j3L5l9L8m4QL5l4M2o2M6j6kL3m7M9m7J4J9l1L9l9M1k7n
5821iM2o2O0n5L5Ll8N7m8K4jk6M1n4N2l3K6K0o4N6m9K7qj4N2n9M3l6MK3l8N9m4
5854a4K9j6j3L0l8L0j3KK6m2N3n1K7Mk8N4n5L1j4J2L8o7M2l8J1K6m7N3n6L6k6
5885a4QK0m7L8omJ5l7M0l9N2l2rL1l3L8l5OK1l6M4m9N7l4oK9m4P3m9J5rj8O2n2
5919dOPj9M3n9M1rj2L0n2M4l4M1l5rL5m2K9jlJ4k9L9l6J1%rK8m2M8k4nK3m4L9
5954A0j1K0Jj6K5m9K9j0mL6m7K6j8J6K0n1M1l1PMj8K8m6M5j8LK4m1L7l3K4mj7
5987a8L0j9J3KjK2o0N2l6K9pj6J3j8M4k4mJ0j8L3m8M9k4k4L3l0L9k4pK3m0L7l1
6020b0J8Lj3J0j2K4k4mL7j8J6k9J8llL0m1M0k8RKk2L8l6%J5l9L7l2K8jj9L1n2
$$ plain form
6054 -40 -8 -11 -6 4 -27 12 -22 18 6 4 17 -13 18 -1 3 17 -3 14 -1 -2 4 -4 17 -29 9 -7 -5 16 -10 19 -5 14 14 -20 12
6089 12 -17 -5 6 3 23 -19 16 -6 2 4 -25 1 -11 6 6 -7 17 -15 8 -9 -15 1 -14 25 9 30 -1 -6 10 -14 24 -6 -2 9
6123 9 4 9 -6 19 6 3 22 -8 19 -8 -3 7 -19 4 -28 23 -11 -3 14 -33 4 -10 -5 -2 -18 16 -11 -11 -12 -2 32 -5 9 10 -4 24
6159 24 -10 12 -24 12 29 3 17 -10 11 -2 -12 13 -31 11 -10 -3 7 -8 6 -16 6 2 -7 7 -16 9 -18 -19 7 -19 17 -29
6191 -29 12 -2 0 -2 -16 13 1 0 12 -10 25 -3 4 2 -1 17 10 24 7 -4 9 -19 23 -5 -2 -2 -25 12 -40 12 -15 -14 -3 -31 2
6226 2 -18 10 7 -6 10 -2 14 2 6 3 -21 18 -7 7 7 -8 6 -19 23 3 -11 20 -6 2 -19 -6 -10 -19 24 -15 -7 -8 -14 1 -10 14
6262 14 -10 -2 3 -35 12 -19 -7 0 -18 9 -16 0 -16 1 6 -23 22 -10 31 12 -3 16 -20 22 4 14 13 -18 17 -18 -1 -6 -9 16
6296 16 -13 13 -12 -4 10 -14 19 -5 14 1 -25 -5 -13 4 6 -15 9 -12 6 -11 -8 -16 -17 19 -19 -3 0 -11 21 -15 25 0 5 9 -10
$$ packed form
6054d0L2lNJ0l1L9l4M0j2kJ3l0L1j9MJ4k0J7j5jOqK1m6L8j6KK1k6K9k4J9%l4L2
6089A2k9J2J1lK0m2L5k2QKk9K6j2J7%j3K4l2K3j7oJ6j5L9j6K1l1nJ6k4L8l0MJ1
6123InNj5K5j3lJ9l0K7k7NJ0k6K3l2N1l4QJ7m7L7j4NLj6L4k7%jJ0L4l7J4Jj4K8
6159B4l4K2l6L6J7k6J4k7K1j3j0K5m4M2k1PJ0j5J4k2K2mrJ4k3K5k7jK6k6L6m6
6191b9M1j4Kkj4K9j2jJ2k2L5k8PklJ8pJ4j7j1J3k8M2k8L%k3L7n2N2k7JJ1k8L3
6226Bk0K8lj3J6j2J6j2Mlk4L9k5J4%j5J4k5M2k0j4L1k6Qk1J3mrM3l9QjoJ5j1K4
6262A4k4QNl8M7l1J2Pj8K7k5J6j6J7Nk9M5l2M1j9j5J9l6M2j8J0jl1L5l5J7nlK5
6296A6k9K6k5QJ4k4L3k4J9j3k6K0qJ7Kk1K4k1J8j7LqjL6l8J6Lj1L2l6M0k5NMj9
$$ plain form
6331 -10 22 -21 15 5 -3 5 -22 19 -7 -8 12 -28 8 -18 -4 -9 -3 24 -10 7 -10 6 13 -24 11 -26 3 5 5 13 -11 0 -2 -2 2 3 16
6368 16 -2 6 -2 -5 2 -1 31 -10 4 9 -22 18 -11 -2 4 -24 16 -20 5 -15 -26 7 -11 7 -17 1 -2 -5 18 -16 2 11 -11 6 4 15
6404 15 -1 -6 8 -21 31 -17 18 -6 2 7 -15 11 -17 15 7 -20 6 1 9 -13 -6 16 -7 29 -6 -3 9 -20 6 -20 1 -8 -24 8 -2
6439 -2 3 -1 -1 0 -15 3 -14 -7 7 -22 13 -5 15 2 -1 12 -2 19 7 -2 -13 -19 13 -15 16 -2 -8 9 -15 2 -12 -4 5 -19 6 -1 -7
6476 -7 -8 -17 6 -11 -11 -8 -2 4 -5 9 -7 13 -6 9 19 -10 7 -9 -3 2 4 -1 -10 6 1 0 1 -15 -4 0 -4 6 -15 -15 -25 -11 2 -14 10 -14
6516 -14 18 -1 -17 0 6 2 -7 -2 9 1 13 6 22 13 0 18 -7 0 -8 0 13 -2 2 0 -4 1 -3 22 -12 11 4 -2 -5 -2 8 -13 -7 -1 -15 13 -8
6557 -8 -5 -5 3 -2 -13 16 -13 -1 1 13 15 3 24 22 5 10 4 8 -5 12 9 -9 2 -16 12 5 -1 7 -11 -9 -4 2 4 -11 0 -8 0 -14 -9 -2 -24 -15
6599 -15 -9 -6 -4 -2 -8 1 -4 11 11 0 -4 11 5 12 19 8 5 -5 11 -1 6 11 -10 10 -4 -4 13 6 -12 -14 -3 -18 -12 9 -14 -5 -14 1 -2 -10 6 -6
$$ packed form
6331a0L2m3L6j0qQk7M1k6jK0m0L6k6J4nOK7l4J7j7J6Pl7L5l7K9K%Qk4J1k%MJJ3
6368A6j8QqlPlL2m1J4Nl1M0k9ROk8M0l6K5k0j1L3j8J8k4J8llK3l4J8Rk2J7kJ1
6404A5j6nJ4k9N2m8L5k4QNk2K6k8L2qk7K6nQk2PK2k3L6l5LJ2k9K6k6K1rj6L2j0
6439bNm%Jj5J8j7PJ4k9L5j8K0j3lJ3j4K1j2rj1oL2k8L1j8oJ7k4J7j4QRk4K5po
6476gjrK3j7%LOOrJ4j6K0j9J5J0k9J7j6ONKnrJ6njJj6J1MmJ0k1%j0J4J3j6K4k4
6516a4L2j9j6J7OmrNJ1qJ2pJ6rj3J8k5PqQJ3j5MkmNmK5l4K3polLJ0k1OOj4K8k1
6557hL%Qnj1K9k9J2KJ2Kj2K1kj7NoMj3J7lj8J1j8K8poQj8KNOKj5J1qQj4NPk2R
6599a5OLKKoRnJ5%j1mJ5oPPj1lj0J6j2PNk1K0j4%J7pj8kJ1j5OK1k3RrJ5lqJ6j2
$$ plain form
6641 -6 -6 -5 8 3 -6 22 0 -18 12 3 15 5 1 4 -7 16 -2 14 2 -2 9 -7 5 1 12 -4 -14 2 -4 4 -11 -15 -8 -6 3 -9 2 1 5
6680 5 -2 -3 1 -12 -4 14 0 -1 -7 14 3 -3 14 7 27 -6 -13 13 -13 -2 -10 17 -3 -3 12 10 11 -1 -6 0 -2 -9 -4 -3 1 -16 -3 -18 -4 -5 -19
6721 -19 0 -22 3 -17 -4 -10 -20 -4 -14 0 -3 -4 11 -1 3 1 -8 13 -4 10 -2 -8 -7 -19 8 -6 -11 4 -13 -9 -2 11 -16 8 2 -8
6757 -8 1 -6 -6 -7 4 4 -16 2 -6 -4 -6 -5 2 -4 4 -5 -8 13 -7 8 -11 1 7 3 1 5 16 -8 -10 13 -24 14 7 11 -19 -13 -6 -18 -5 -3 -10 -4 -9 -18 -1
6802 -1 -13 -6 4 -2 0 4 5 0 8 -9 -4 -3 -4 13 15 16 0 -15 -8 14 3 4 1 -12 12 6 -19 19 -3 -6 7 1 1 -10 11 3 -27 9 -12 -22 -19
6843 -19 -18 -14 -15 -3 -18 2 -11 -7 3 -4 -5 1 1 11 14 10 8 7 -6 -5 8 1 3 -10 -7 -8 -5 15 -16 -1 11 -11 3 -6 9 -3 -11 -4 -20 -1 3
6884 3 12 -2 -2 -5 -12 -6 -8 -14 -10 -5 7 1 -2 4 3 5 -16 6 -1 9 -10 8 -7 2 2 14 -10 0 5 -1 -10 6 6 -10 3 1 -14 -5 -13 9 -6 3 -7
6927 -7 -2 5 -16 -7 0 0 8 -6 16 -11 12 5 -13 -4 -12 -8 -10 2 5 11 20 8 -6 9 9 14 0 6 13 -5 -10 -10 -6 6 -7 -3 -12 7 -5 -5 -8 -6 0 -13
$$ packed form
6641f%JJ3nrK8k2j8L0rJ2j0mLj1K3j8J6j2mJ1j6J2mJ1j6j0J6oQj5mPKRj2J1jM
6680EpjMj3QJ8j4joK1j1oJ7pK0l3pK6k6J1qK7k0%J5kJj2nOkpNJMj7J3j5J4jj4
6721a9J9k2K5k0J3oj0J6j0J4ljJ5j2MkrK1j7J4j2oJj2K7j4nJ5j7MPJ3k7K4oj0
6757hRp%jJ1%k0J8qKkJPoQrlK1k0J5j9J2OmkMJ1k4kK3l7L8pMl0OPj2J3KpOnrJ7
6802aj2PJ0oKMJnQj7NJjJ7KJj6j5PK2j1Jlj3K4ok5L8k2lJ3o%j1K1ql0L6k1j0L
6843a9JMjJ2j5K0j3MJ0pjO%J0Lmkjj3JJ3pKj3LjLK0l1J5J2k2J4rJ5j2qPj6J9M
6884CRj4%lpOkoMNJ2olOjKk1K2pJ0j9J8j5R%J2k4J0NorJ6%j6J3kj5RqK2j5Rj0
6927gNPk1RP%Qj4K2k7K3pj8RqMkJ2LORj2j4J5%Nj4OPj8n%MJ2j3MrJ9j2%lKOj3
$$ plain form
6971 -13 9 2 -5 -1 -7 0 -2 13 16 -6 29 -5 10 5 9 7 -2 2 6 7 0 -16 3 -2 3 11 3 4 -10 2 -17 -10 2 -9 27 -8 2 -11 -18 12 -8
7012 -8 7 -16 -11 10 -4 -3 -12 -7 16 0 15 4 23 6 10 14 -4 16 5 4 5 -6 3 3 -11 -5 -5 -9 0 -5 -8 -19 1 -6 1 -6 7 -7 0 -8 3
7053 3 -6 -2 0 -8 -10 -13 -15 1 -8 -9 6 -4 11 -11 -1 -11 8 10 -4 8 11 2 12 10 5 -1 7 12 -10 -11 -13 -1 7 -14 -9 -10 -15 -7 -10 -6 -16 -6 -3 -1 16
7098 16 -1 0 -2 6 9 2 3 -4 16 5 -1 -6 -4 2 -9 1 -2 -6 9 -5 6 7 -10 5 6 29 -7 4 -7 -8 5 -14 -1 -13 -11 -24 -8 4 -2
7137 -2 -3 0 -15 8 -11 2 -6 0 4 3 3 4 11 4 2 7 3 -3 -5 1 -1 -6 -8 -6 5 0 4 6 -10 -13 1 -7 0 -21 8 -6 -19 -8 2 4 -26 0 2 9 4 3
7183 3 2 -4 -4 -4 2 1 0 6 0 7 11 -3 15 9 -1 14 -7 -6 -9 -1 -10 -5 -21 -13 4 -8 4 -3 -21 -2 -8 -8 4 6 2 -4 -7 -14 -13 10 12 -1 2 14 0
7228 0 2 -3 -2 4 -11 3 3 0 4 -11 20 -2 -1 11 -2 7 4 -23 0 -17 3 -9 -13 0 -10 8 -9 4 -8 -17 -12 0 -8 -12 11 -2 -9 -4 -3 11
7268 11 0 3 10 -8 0 -13 11 2 2 2 -7 12 -11 1 0 -6 13 -7 -7 -11 -13 -5 3 -14 -9 4 0 -15 -7 -21 -6 -16 -16 -3 -31 -7 -14 -13 -6 -11 1
$$ packed form
6971a3K2ppMoPkJ5Lk2L5l4J5nMkrMMJpj6J9nNQqJj4J2j9PJ2j1L6l5J0j3pL0k0
7012hJ5k3NK1j4JrNK3j6J5j1J9j7MMj8K0j1jJj1R%j4O%mRnlj1K0pPpJ3j4PqJ1
7053CrMKqklkJ6rjJ5j0J5k2J0j0J9Kj4J2LrJ0knoQNk2jkJ2Qk1NjnQlMj0J0LKJ7
7098A6j7JkQLpJpK0j1onKOj1J0lmJ5j4J1Jj7J5JK3l6J1j1jJ3j9J3j2Kj3J6J2o
7137bjLj5K3j9J3qOMj%JPpkNmokOknkKJ1nMKj6lJ4qPk1K9j4j3J1J0Kl0K6KPnj
7183Cjo%%OjjOoPMj4J8oj0J5k1JlQrNj6QJ7j2J2pj8J9o%J2KmolpJK3Kj3LJ2j4
7228@KnJOj5J4%lMj5L1k2JJ2j3Rlk7K3j7K0j2mJ3j0J8j7J3j2rNJ2qmK3j3pNJJ4
7268A1j1LPj8Qj3K4r%%rJ9k3J2joJ9k0%mkQQj7NJ3mj5Qj4J5j0%J3k8K4pJPnJ2
$$ plain form
7309 1 -1 4 4 2 -2 0 8 2 0 1 5 3 -13 -14 7 -3 11 -7 -6 -2 -1 -12 -15 -8 -10 -5 1 -1 8 -4 -9 -3 -11 4 -12 0 0 1 3 -14 3 -13 -15 -9 10 -9
7355 -9 4 16 7 -1 18 5 17 12 -5 -3 12 11 4 7 -4 -13 2 -17 -12 -12 -7 -13 -25 -9 -2 -6 -21 -10 -1 -21 -10 -24 2 -9 -5 -5 -8 -2 -7 5 -4
7396 -4 6 17 -3 2 -2 4 -2 -7 1 -5 3 5 -5 6 4 0 6 -21 -19 -16 -12 -7 -10 14 -11 -19 -5 -5 8 -2 -14 4 -4 1 2 12 -2 7 -5 6 6 -17 12
7439 12 -4 4 -10 -9 12 -14 8 -2 -4 5 -6 1 -9 2 -10 -5 9 -17 -7 -3 6 6 -16 -7 -4 -5 -12 -16 -3 -5 -3 -9 5 -2 -11 -2 -6 -11 1 -2 14 3
7481 3 5 10 -4 -3 13 -2 10 2 1 -10 7 5 -9 17 -7 7 -13 6 4 -3 -6 -4 -1 -20 -9 -5 5 5 21 0 8 -7 -9 7 9 3 2 18 5 16
7521 16 -13 19 5 4 2 7 7 15 0 17 -9 -1 -6 8 -2 -17 3 10 10 -5 -6 0 -17 -11 -1 -7 0 -10 -11 12 4 0 4 0 -7 19 -4 8 8 3 2 12
7563 12 17 -10 -15 -3 -13 -4 22 14 -3 -10 -7 -14 -4 -3 1 -3 -19 2 -7 -9 27 -4 -8 -9 -1 -10 -2 -9 -8 -5 -16 14 -14 0 5 10 23 0 3 0 3 12 -11
7606 -11 -9 -2 4 11 7 0 3 -5 11 -8 -3 -8 9 7 2 3 -14 0 -8 -11 -17 -5 10 -6 -6 -10 1 5 0 0 -13 -12 -3 -5 5 3 -3 7 11 12 5 1 2 0 20 -1
$$ packed form
7309AkN%kmKQokJMkj6jK1j0J4j8JMJj1lPkNOkRj2nOqJ5j6J2%JKj7J7j6kOJ9j9
7355iJ3J2rqJ9j3J2nj7KJ5jpLj1rJ5j9N%Noj2J6Pmj5J1Rk0J1j4K6j1M%lOnJ2r
7396dJ0J1k0NmOonQoQKj0J1kmOk7KLMNlK4k5qJ4%J3j0j2J8qNJJ0j4Rj2J1%k3K9
7439A2j6Qj4JK1k6K2j0kRj1Pj0J1j2NJ4k6J0MR%k2RLjpmJ3kKoJ4prRmnJ2lJ6j1
7481CKNj4JJ6j5J2qjj1J7kj4K6k4J4k0J9kplKLj9J1MJ0%J6k1Qj5kJ6KojJ6j3J1
7521A6k9L2j4jkN%Qj5J7k6QnJ4j0j5K0P%j5jOj7OJ0oPj0jK3qmMmpK6k3J2%njJ0
7563A2Nk7nJ2j0RK6qj7pLpJ0JMmj6K1rkL6l1mjQrQpJLj1L0k8J4NNJ3k3LlLRk3
7606a1KPOPmpLqJ6j9NnJ7knJj7J4qloJ2J5j6%mJ1Mn%j3JRkJ0koJ0MJpmJkK0k1
$$ plain form
7652 -1 -4 -5 -1 -4 -5 -8 -7 5 -1 -12 4 -8 -9 -15 2 0 -13 14 2 -15 -12 -8 3 -1 -3 4 -7 7 0 10 -6 -1 -4 11 16 0 24 5 2 3 5 -3 12
7695 12 5 6 -6 10 5 -1 -1 -9 -1 -15 3 -23 -10 2 -28 -27 -9 -12 -2 -13 7 -13 -7 7 -6 -1 -2 2 5 1 1 -1 9 2 2 -6 4 6 -1 15 10 -12
7737 -12 4 -14 -14 -7 -6 -9 -19 -1 -13 -22 2 3 -4 -23 -6 -4 1 -17 1 -5 0 11 2 -1 -6 5 1 15 -17 5 -2 7 3 9 2 -3 4 17 19 5 -7 4
7779 4 -1 4 1 -3 -10 -13 -4 -16 5 -15 -9 -11 -9 -10 1 3 6 -12 -8 -20 4 -4 3 8 -3 9 -9 7 -6 2 3 19 5 -1 15 10 4 8 7 10 4 16 14 -7
7823 -7 -6 -7 11 -7 -1 0 -12 10 -6 -15 -1 -9 6 -5 -11 -3 -5 -9 -4 5 4 6 -7 3 18 2 2 18 -1 6 -10 15 -3 -1 10 -5 8 13 5 -6
7863 -6 -2 3 11 -3 -7 -16 -7 -7 0 10 -5 -1 -9 -1 -13 -13 6 -14 -2 1 -1 -14 -12 -4 -5 2 3 1 8 4 9 -7 -6 11 -3 0 -1 -1 9 -1 17 -10 -2 -2 0 -2
7909 -2 -3 12 -9 -11 -4 -2 -11 -9 0 -4 -3 -9 -7 0 -7 8 -7 -3 2 -1 -1 -13 -1 0 -2 2 6 18 -3 -4 10 -8 9 -4 8 9 2 -9 -13 -1 1 -7 -4 -20 4
7954 4 -11 -13 9 -40 7 -18 -20 1 -7 -4 -2 2 -5 4 -1 -12 7 3 7 -1 4 10 -10 10 -7 -2 -5 7 1 0 -12 -4 -6 12 18 15 6 3 -5 0 -3 -15 -11 -15 1
$$ packed form
7652aljMljlJJ2oj1J6j2joJ7kj3K7j2j7LMJ1mkPj1J4pJ0j6NlJ5Nj6K4j9lJKqJ5
7695A2pJj2J6no%qQj4J8k6J3J2l0JJ8lJ0j1K0k0OJ4j3NjMLm%kJ0p%qJ0KpJ6nk2
7737a2J6j8%PJlj0J8j2rK4Jpj9J7KNj8J8oNJ1rlnJ1mJ4l2K2pRmOpnPJ3Kj4j2J1
7779DnNlmplRj2K1k0OkKjJ1KLj8Mj2K4qPNj1J2j8J6j3QJJ6j4oJ6noMjLoJ2kk1
7823gJjJ8j8OJj2K2j6rJ4qJ5j1oQkmNRjKj3J0J5j6%J6j9Pj6K5j8KJ1j5J3Nqj1
7863fMNQj4mrR%PJ0j5MqQj2%J9k0J2Lkj3KQjPJkPmNj6JJ7j4Lj%J0j0J8k7Q%Kk
7909bjJ5k1kPKrKRmJoKPpJ5j5MNl%j2J2JkMMJ2k1jJ4j8J7j3J2Jpj1mJ2KqLj6K4
7954Dj5kK2m9M7k5kK1qLKMpRnj1J9mMqNOk0K0j7NlJ2ojj2QkJ8OlrlqNlj2MmJ6
$$ plain form
7999 1 -11 -12 -8 -17 -13 -1 -5 -6 -3 -1 -2 -8 3 2 16 -4 9 13 -5 19 3 7 -9 -8 2 0 5 -13 8 3 -18 -5 -3 0 4 -10 -7 -13 -15 -4 -8 -6 8
8042 8 -5 1 2 -10 -4 5 -6 -3 -3 -8 1 -11 -4 -1 7 9 -7 9 8 14 25 -4 3 2 -15 -3 -1 5 -5 2 -18 1 -21 -25 -12 -20 9 2 -20 -15 0 -11
8084 -11 3 -1 -11 -19 4 -6 -16 0 -9 10 -13 5 7 -14 -10 -1 8 -7 4 6 -5 13 1 -20 -13 3 -9 -13 -4 -21 2 -6 -6 -23 -20 12 6 -11
8122 -11 -1 -10 -7 -12 2 -10 -5 -10 -25 -4 -9 -19 4 6 0 -3 5 -1 -13 -2 -16 19 6 0 -10 13 2 1 -5 -12 5 -12 -10 0 -7 -3 -7 -15 -8 -11 -8 -6
8164 -6 -11 2 -12 -2 -11 -15 0 1 -8 1 2 -7 -1 -6 6 -1 3 12 4 0 11 4 4 -10 0 2 -13
$$ packed form
7999Aj2jMrMJ2mjLKjoJ1jJ4k0J3Mj8K4j6Mj6JJ0kNj8K1nk1J3KLMj4LokJ1mKJ4
8042Hj3OJj2ORj1L%nRj2PLQKj6J6jOJ1k9Pjj7J2KOj0Pk0J9k2mJ3qK9pk2NJ5j1
8084a1J4mj0qK3j0j0J6rJ9k3J8Kk1MRRj5J1Kj1J8j2k1PJ6j2mRj7K3q%j7LL2oj7
8122a1J0rLnJ4j2Nnj5K1nj0K3KolQoj2J1j4L5j3oj0K3j1jopJ7j7KJ0pMmqPlLK
8164fnJ3j4J0rmJ5JrRJrOnJ2pMRqmJ1p%j4J0Kj5
8191a3
$$ Imaginary data points
##PAGE= N=2
##DATA TABLE= (X++(I..I)), XYDATA
$$ plain form
0 0 0 0 0 0 0 0 0 0 -8 8 -16 16 -24 32 -36 48 -56 72 -89 110 -132 159 -191 224 -263 311 -361 420 -487 562
30 562 -643 734 -835 949 -1074 1213 -1365 1532 -1716 1918 -2136 2376 -2638 2924 -3238 3579
46 3579 -3953 4361 -4805 5291 -5824 6411 -7062 7778 -8579 9475 -10484 11630 -12944
59 -12944 14468 -16260 18401 -21015 24285 -28509 34202 -42348 55149 -79475 215409 -475879
71 -475879 269022 71317 -397138 581738 -560572 351223 -42728 -244702 407753 -400001
81 -400001 244774 -20086 -178110 277162 -254485 141566 -3740 -92599 110484 -56774
91 -56774 -25433 81089 -72420 -1656 103871 -176905 172256 -75601 -82618 237771 -318123
102 -318123 277443 -118244 -106000 309371 -408619 357304 -167353 -93848 328532 -446861
$$ packed form
0@%%%%%%%%qJ6k4L2m0N6o8Q4j04J28j61J99k42K91l50M15m87N74o72P81r07J049
30E62j205J377j569J784k023K287k578K897l248L634m054M512n014N562o162O817
46C579p532Q314r166J0096j1115J2235j3473J4840j6357J8054j9959K2114k4574
59a2944K7412l0728L4661l9416M5300n2794O2711p6550R7497j34624K94884o91288
71d75879P44901j97705m68455R78876j142310R11795l93951k01974O52455q07754
81d00001O44775k64860j58024M55272n31647L96051j45306q8859K03083j67258
91e6774L1341J06522j53509P0764J05527k80776L49161k47857p017L20389n55894
102c18123N95566l95687J2244M15371p17990P65923n24657P3505M22380p75393
$$ plain form
112 -446861 402616 -211384 -54821 296425 -424816 396333 -227586 -12968 233322 -354538
122 -354538 340045 -206815 15030 158840 -252797 242645 -147130 16008 93847 -142858
132 -142858 122985 -57757 -12984 52644 -45717 2981 45296 -65950 40855 23508 -97662
143 -97662 143037 -130245 54750 58900 -165802 219040 -190614 84252 63386 -196729 262917
154 262917 -233491 116428 46096 -193592 270972 -249718 138762 19337 -165380 246316
164 246316 -235622 141977 -4405 -123993 197350 -193646 121879 -15529 -82088 135816
174 135816 -131657 79910 -8745 -50121 74527 -60781 22811 15831 -34319 24348 6560
185 6560 -39188 52850 -35776 -8033 59961 -95087 93438 -50097 -21378 93412 -135710
$$ packed form
112d46861Q49477o14000J56563L51246p21241Q21149o23919K14618K46290n87860
122c54538O94583n46860K21845J43810m11637M95442l89775J63138P7839k36705
132a42858K65843j80742M4773O5628r8361M8698M2315j11246J06805j7347j21170
143i7662K40699k73282J84995M150k24702L84842m09654K74866k0866k60115M59646
154B62917m96408L49919p0332k39688M64564n20690L88480j19425j84717M11696
164B46316m81938L77599j46382j19588L21343l90996L15525j37408o6559K17904
174A35816k67473K11567q8655m1376J24648j35308Q3592o980n0150N8667j7788
185F560m5748R2038q8626K7743O7994j55048J88525j43535K8719J14790k29122
$$ plain form
196 -135710 128177 -69851 -19314 106002 -156264 149577 -86997 -8631 101403 -156538
206 -156538 153635 -94848 3288 86012 -140027 140387 -89741 10158 66897 -112745 112939
217 112939 -71489 8329 49940 -81332 76685 -42636 -2983 39220 -51615 37821 -7653
228 -7653 -22172 36374 -28076 2073 27811 -45589 40507 -12857 -26093 58517 -68400 48828
240 48828 -5581 -44426 80417 -86138 57420 -4210 -53070 91594 -95552 62649 -5423
251 -5423 -53997 92481 -95280 61872 -5899 -50373 85255 -86078 54098 -3369 -45304
262 -45304 72960 -70212 40190 3031 -41024 58757 -50551 22087 12909 -38780 44909
273 44909 -29966 2157 24943 -38733 32967 -10818 -17103 37370 -40127 23538 5419 -33695
$$ packed form
196a35710K63887j98028N0537J25316k62266L05841k36574P8366J10034k57941
206a56538L10173k48483R8136Q2724k26039K80414k30128R9899N6739j79642K25684
217A12939j84428P9818M1611j31272J58017j19321L9653M2203r0835Q9436m5474
228g653j4519N8546o4450L0149K5738p3400Q6096n3364j3236Q4610j26917J17228
240D8828n4409l8845J24843j66555J43558o1630m8860J44664j87146J58201o8072
251e423m8574J46478j87761J57152o7771m4474J35628j71333J40176n7467m1935
262d5304J18264j43172J10402l7159m4055R9781j09308P2638r178n1689Q3689
273D4909p4875L2123K2786o3676P1700m3785o285N4473p7497O3665j8119l9114
$$ plain form
285 -33695 48326 -41877 16383 17872 -46259 56257 -42894 10984 26448 -54076 60213 -41982
297 -41982 6601 31656 -57189 59777 -38516 2261 34199 -56193 55195 -32338 -2583 35023
309 35023 -51993 47269 -23722 -8111 34826 -45646 36930 -13370 -14323 34186 -38166 25323
321 25323 -2104 -20914 33460 -30352 13496 9243 -27343 32690 -22784 2220 19764 -33187
333 -33187 31797 -15945 -7683 28701 -37853 30744 -10079 -15590 35394 -40782 29247 -5323
345 -5323 -21197 39291 -41506 26854 -1420 -24481 40180 -39584 23192 2040 -25635 38166
357 38166 -34904 17833 5554 -25410 33758 -27791 10692 9690 -24596 27954 -18949 2143
369 2143 14699 -23968 21833 -9478 -7165 20373 -24021 16269 -523 -16197 26200 -24718
$$ packed form
285c3695Q2021r0203N8260J489o4131J02516r9151N3878J5464q0524J14289j02195
297d1982M8583K5055q8845J16966r8293M0777L1938r0392J11388q7533K9755L7606
309C5023q7016R9262p0991J5611M2937q0472Q2576n0300r53M8509p2352O3489
321B5323k7427j8810N4374o3812M3848m253l6586O0033n5474K5004J7544n2951
333c3187O4984m7742Q262L6384o6554O8597m0823n511N0984p6176P0029l4570
345e323j5874O0488q0797O8360k8274k3061O4661p9764O2776k1152k7675O3801
357C8166p3070N2737j2279l0964N9168o1549L8483j002l4286N2550m6903K1092
369B143J2556l8667M5801l1311K313K7538m4394M0290j6792j5674M2397n0918
$$ plain form
381 -24718 11977 6893 -23774 31272 -25738 9113 12036 -28959 34568 -26326 7339 14754 -31159
394 -31159 35240 -25545 6007 15420 -30227 32839 -22593 4210 14754 -26670 27257 -17068
406 -17068 986 13871 -21486 19254 -8943 -4161 13977 -16109 10064 898 -11218 15681
418 15681 -11869 1306 11092 -19396 19080 -9614 -5547 19979 -27207 23447 -9463 -9525 26003
431 26003 -33054 27364 -10792 -10502 28237 -35532 29401 -12333 -9142 26728 -33898 28353 -12681
444 -12681 -6624 22149 -28295 23542 -10719 -4468 15842 -19539 15131 -5669 -3985 9587 -9190
457 -9190 4075 2356 -6192 5034 662 -7960 12530 -11242 3361 8294 -18888 23175 -18258
470 -18258 4932 12260 -26603 32056 -25611 8979 11999 -29627 36981 -31106 13881 8400 -27611
$$ packed form
381b4718L6695n084l0667N5046n7010L4851K923m0995O3527o0894L3665P415m5913
394c1159O6399o0785L1552R413m5647O3066n5432K6803J0544m1424N3927m4325
406a7068J8054J2885l5357M0740k8197M782J8138l0086K6173r166j2116K6899
418A5681k7550J3175R786l0488L8476k8694M067K5526m7186N0654l2910o2L5528
431B6003n9057O0418l8156K90L8739o3769O4933m1734L191L5870o0626O2251m1034
444a2681O057K8773n0444N1837l4261O251K0310l5381L4670k0800J684J3572j8777
457i190J3265j719q548J1226m372q622K0490k3772J4603M933k7182M2063m1433
470a8258K3190P328l8863N8659n7667L4590L020m1626O6608o8087M4987n481l6011
$$ plain form
483 -27611 36790 -32807 17545 3125 -21524 31298 -29631 18061 -1717 -13197 21615 -21577
495 -21577 14436 -4148 -4938 9810 -9818 6650 -2977 1118 -1694 3481 -4250 2047 3458 -10605
509 -10605 16035 -16472 10176 1695 -15381 25552 -27671 19742 -3677 -15247 30183 -35375
521 -35375 28303 -11009 -10684 29121 -37726 33460 -17848 -3446 22952 -34032 33333 -21749
533 -21749 3967 13536 -25028 27325 -20924 9089 3503 -12708 16422 -14856 10053 -4468
545 -4468 43 2746 -4506 6249 -8427 10436 -10858 8057 -1524 -7627 16584 -21790 20404
558 20404 -11591 -2529 17555 -28135 29970 -21667 5364 13650 -28885 34840 -29273 13847
570 13847 6289 -24231 33992 -32434 20437 -2332 -15598 27534 -30021 23024 -9640 -5300
$$ packed form
483b7611O4401o9597N0352j4420k4649N2822o0929M7692j9778j1480L4812m3192
495b1577L6013j8584p90J4748j9628J6468r627M095k812N175p731O297J411j4063
509a0605K6640l2507K6648q481j7076M0933n3223M7413k3419j1570M5430o5558
521c5375O3678l9312L25L9805o6847P1186n1308J4402K6398n6984O7365n5082
533b1749K5716R569l8564N2353m8249L0013n586j6211K9130l1278K4909j4521
545d468M511K703p252J0755j4676J8863k1294J8915r581o103K4211l8374M2194
558B0404l1995R062K0084m5690N8105n1637K7031Q286m2535O3725o4113M3120
570A3847p558l0520N8223o6426N2871k2769j3266M3132n7555N3045l2664M340
$$ plain form
582 -5300 16904 -22120 20375 -13341 4046 4472 -10199 12539 -12101 9899 -6825 3145 1121
595 1121 -6021 10940 -14488 15088 -11415 3475 7094 -17194 23198 -22389 14068 -296 -14808
608 -14808 26082 -29456 23217 -9092 -8515 23718 -31331 28788 -16863 -333 17126 -27934
620 -27934 29472 -21611 7394 8246 -20236 25074 -21914 12590 -668 -9967 16352 -17353 13728
633 13728 -7383 527 5060 -8679 10228 -10216 8921 -6366 2414 2794 -8555 13425 -15551
646 -15551 13500 -6906 -2947 13282 -20701 22174 -16547 4961 9105 -21055 26674 -23735
658 -23735 12884 2439 -17170 26334 -26853 18601 -4521 -10592 21703 -25325 20677 -9799
670 -9799 -3263 14202 -19654 18537 -12004 2835 5687 -11167 12566 -10492 6351 -1965 -1597
$$ packed form
582e300K2204l9024M2495l3716J7387M26j4671K2738k4640K2000j6724R970k024
595A121p142J6961k5428K9576k6503J4890L619k4288M0392m5587L6457j4364j4512
608a4808M0890n5538N2673l2309N77L2233n5049O0119m5651J6530J7459m5060
620b7934N7406n1083K9005Q52k8482M5310m6988L4504j3258r299K6319l3705L1081
633A3728k1111P910M533j3739J8907k0444J9137j5287Q780L80j1349K1980k8976
646a5551K9051k0406L959J6229l3983M2875l8721K1508M144l0160M7729n0409
658b3735L6619j0445j9609M3504n3187M5454k3122o071L2295m7028M6002l0476
670i799O536J7465l3856L8191l0541J4839K852j6854K3733k3058J6843q316L68
$$ plain form
683 -1597 3972 -5479 6558 -7235 7155 -5515 1872 3491 -9294 13472 -14126 10081 -1990
696 -1990 -7953 16367 -20101 17295 -8390 -3951 15585 -22406 21841 -13906 1202 11849 -20854
709 -20854 22684 -16999 5880 6577 -16176 19817 -16756 8603 1464 -9854 13990 -13176 8472
722 8472 -2175 -3435 6595 -7079 5570 -3446 1714 -801 297 551 -2272 4687 -6868 7483
736 7483 -5525 869 5260 -10738 13267 -11355 5117 3697 -11984 16708 -15809 9310 728
749 728 -10826 17324 -17913 12285 -2560 -7902 15288 -17223 13220 -5025 -4248 11355 -13979
762 -13979 11721 -5877 -1069 6577 -8996 7992 -4686 737 2176 -3325 2855 -1648 833 -985
776 -985 1913 -2757 2520 -670 -2484 5789 -7683 6929 -3204 -2376 7956 -11208 10648 -6074
$$ packed form
683a597N569r451J2037j3793J4390j2670P387J619j2785K2766k7598K4207j2071
696a990n963K4320l6468L7396k5685M439J9536l7991M4247l5747J5108J0647l2703
709b0854M3538l9683K2879O97k2753L5993l6573K5359p139j1318K3844k7166K1648
722H472j0647j260J0030j3674J2649r016N160k515J098K54k823O959j1555J4351
736G483j3008O394M391j5998K4005k4622J6472j420j5681K8692l2517K5119q582
749G28j1554K8150l5237L0198j4845n342K3190l2511L0443j8245P77J5603k5334
762a3979K5700j7598M808P646j5573J6988j2678N423J439n501O180m503K481j818
776i85K898m670N277l190j814Q273j3472J4612j0133Q28J0332j9164K1856j6722
$$ plain form
790 -6074 -1083 8308 -12898 13010 -8455 798 7214 -12685 13589 -9728 2532 5263 -10860
803 -10860 12378 -9500 3546 3074 -8013 9595 -7720 3443 1337 -4803 5855 -4613 2052
816 2052 555 -1934 1867 -718 -491 828 41 -1762 3291 -3618 2104 912 -4352 6699 -6676
831 -6676 3963 735 -5721 9024 -9186 5879 -165 -5909 10026 -10591 7296 -1307 -5153
844 -5153 9704 -10682 7823 -2245 -3891 8303 -9529 7252 -2621 -2526 6234 -7309 5626
857 5626 -2181 -1484 3955 -4445 3145 -909 -1058 1906 -1407 64 1149 -1413 386 1416 -3092 3639
873 3639 -2399 -292 3498 -5840 6090 -3909 -181 4628 -7755 8131 -5473 585 4750 -8556
887 -8556 9321 -6675 1591 4062 -8242 9352 -7129 2418 2893 -6938 8245 -6575 2737 1666
$$ packed form
790f074M991R391k1206K5908k1465R253O416j9899K6274k3317J2260K731j6123
803a0860K3238k1878J3046m72j1087J7608j7315J1163k106o140J0658j0468O665
816B052j497k489L801k585K27J319p87j803N053o909N722j192n264J1051j3375
831f676J0639l228o456J4745j8210J5065o044n744J5935k0617J7887q603l846
844e153J4857k0386J8505j0068j646J2194j7832J6781r873R5Q760j3543J2935
857E626p807O97N439q400P590m054j49K964l313J471J085k562J799J030m508O731
873C639o038K107L790r338J1930r999L728M809j2383J5886j3604O058M165j3306
887h556J7877j5996Q266K471j2304J7594j6481R547M75r831J5183j4820R312j071
$$ plain form
901 1666 -4997 6174 -5026 2290 761 -2893 3522 -2685 1022 446 -1071 701 235 -969 875
916 875 253 -1893 3230 -3397 1956 727 -3748 5767 -5830 3565 364 -4619 7488 -7827 5292
931 5292 -647 -4425 8088 -8951 6645 -1995 -3358 7445 -8869 7192 -3130 -1752 5726
944 5726 -7471 6591 -3617 -170 3422 -5088 4831 -3160 866 1084 -2145 2195 -1663 1082 -786
959 -786 882 -977 695 288 -1799 3305 -4077 3418 -1351 -1739 4755 -6474 6081 -3451 -697
974 -697 4976 -7822 8136 -5582 1024 4035 -7825 9020 -7174 2928 2213 -6461 8474 -7638
988 -7638 4423 5 -4046 6516 -6729 4905 -1895 -1231 3488 -4448 4090 -2873 1337 98
1002 98 -1204 2002 -2570 2957 -2959 2390 -1047 -1005 3235 -4997 5483 -4284 1445 2230 -5656 7529
$$ packed form
901A666o663J1171j1200P316j529l654O415o207L707n76j517J772m66j204J844
916H75o22k146N123o627N353j229m475R515j1597R395l201m983J2107j5315J3119
931E292n939l778J2513j7039J5596q640j363J0803j6314J6061j0322J378P478
944E726j3197J4062j0208L447L592q510R919p991M026K18l229M340l858K745j868
959g86J668j859J672m07k087N104p382P495m769l88O494j1229J2555r532K754
974f97N673j2798J5958j3718O606L011j1860J6845j6194J0102p15q674J4935j6112
988g638J2061m418m051J0562j3245J1634o800O64M719p936Q538o963M210j239
1002I8j302L206m572N527n916N349l437M2M240q232J0480r767N729P85p886J3185
$$ plain form
1018 7529 -7079 4197 272 -4909 8118 -8791 6562 -2147 -3015 7213 -9051 7962 -4358
1031 -4358 -466 4993 -7700 7938 -5725 2012 1943 -4976 6315 -5768 3779 -1126 -1454 3330
1045 3330 -4284 4268 -3489 2141 -398 -1464 3222 -4516 4897 -4129 2078 841 -3953 6267 -6953
1060 -6953 5551 -2263 -2006 5966 -8269 8073 -5317 746 4173 -7890 9128 -7511 3570
1073 3570 1479 -5944 8474 -8318 5680 -1432 -2981 6259 -7480 6499 -3770 284 2950
1086 2950 -5112 5761 -4987 3108 -702 -1661 3578 -4709 4833 -3966 2137 287 -2923 5032 -6043
1101 -6043 5501 -3349 27 3633 -6485 7624 -6506 3342 1028 -5259 8026 -8408 6214
1114 6214 -2082 -2721 6685 -8609 7893 -4823 392 4018 -7082 7921 -6468 3199 764 -4252
$$ packed form
1018G529j4608J1276l925n181J3027j6909J5353q709q68J0228j6264J7013j2320
1031d358L892N459j2693J5638j3663P737o9o919J1291j2083R547m905l28M784
1045C330p614Q552p757N630k539j066M686p738R413r026O207j237m794J0220j3220
1060f953J2504p814K57P972j4235J6342j3390O063L427j2063J7018j6639J1081
1073C570k091p423J4418j6792J3998p112j549R240j3739J3979j0269M054K666
1086B950q062J0873j0748Q095l810r59N239q287R542q799O103j850l210P955j1075
1101f043J1544q850L376L606j0118J4109j4130R848k314o287J3285j6434J4622
1114F214q296o39R406j5294J6502j2716N215L626j1100J5003j4389R667k435n016
$$ plain form
1128 -4252 6314 -6532 4987 -2292 -810 3428 -5042 5347 -4423 2483 -84 -2343 4202 -5172
1142 -5172 4904 -3454 1058 1829 -4407 6001 -6006 4329 -1261 -2345 5499 -7165 6773 -4316
1156 -4316 502 3580 -6669 7813 -6595 3405 793 -4707 7187 -7491 5591 -2128 -1821
1169 -1821 5062 -6757 6443 -4368 1209 2065 -4583 5720 -5305 3585 -1086 -1556 3655 -4809
1183 -4809 4771 -3615 1601 773 -3005 4530 -4994 4190 -2241 -386 3076 -5033 5697 -4764 2412
1198 2412 762 -3819 5880 -6229 4761 -1817 -1686 4746 -6393 6139 -4074 810 2615 -5235
1212 -5235 6241 -5447 3072 53 -3042 5031 -5533 4500 -2294 -392 2812 -4374 4706 -3855
1226 -3855 2052 150 -2241 3712 -4258 3751 -2332 345 1756 -3430 4286 -4034 2741 -659 -1687
$$ packed form
1128d252J0566j2846J1519p279J482M238q470J0389r770O906k567k259O545r374
1142e172J0076q358M512P71o236J0408j2007J0335n590j084P844j2664J3938j1089
1156d316M818L078j0249J4482j4408J0000k612n500J1894j4678J3082p719L07
1169a821O883j1819J3200j0811N577Q56o648J0303j1025Q890m671m70N211q464
1183d809R580q386N216q28l778P535r524R184o431J855L462q109J0730j0461P176
1198B412j650m581R699j2109J0990o578J31O432j1139J2532j0213M884J805p850
1212e235J1476j1688Q519l019l095Q073j0564J0033o794J902L204p186R080q561
1226c855N907j902k391N953p970Q009o083K677J411n186P716q320O775l400j028
$$ plain form
1241 -1687 3650 -4677 4401 -2889 488 2134 -4187 5074 -4482 2583 116 -2794 4663 -5148 4096
1256 4096 -1867 -902 3335 -4757 4752 -3372 1043 1472 -3475 4398 -4039 2579 -502 -1622 3152
1271 3152 -3767 3358 -2125 435 1271 -2579 3193 -3031 2146 -773 -774 2154 -3028 3177 -2563 1195
1287 1195 509 -2177 3350 -3627 2907 -1309 -741 2649 -3878 3957 -2869 889 1386 -3284 4190 -3811
1303 -3811 2290 -83 -2145 3649 -4038 3170 -1404 -724 2510 -3472 3332 -2283 650 1023 -2252
1318 -2252 2799 -2520 1651 -433 -734 1636 -2097 2081 -1643 840 99 -1073 1842 -2255 2127
1333 2127 -1449 302 1020 -2234 2842 -2724 1699 -130 -1624 2941 -3408 2822 -1356 -601 2398
1348 2398 -3450 3446 -2327 517 1436 -2891 3379 -2831 1447 317 -1851 2762 -2736 1954 -659
$$ packed form
1241a687N337q327R078p290L377J646o321R261r556P065k467k910P457r811R244
1256D096n963R65M237q092R509q124M415M29m947P873q437O618l081j120M774
1271C152o919P125n483K560Q36l850N772o224N177k919jK928n182O205n740L758
1287A195o86k686N527o977O534m216N68L390o527P835o826L758M97m670P474q001
1303c811O101k373k062N794p687P208m574O80L234n982O804n615K933L73l275
1318b252N051n319M171k084l01K370l733M178l724K483p41j172K915m097M382
1333B127l576J751P18l254N076n566M423j829j494M565o349O230m178P55K999
1348B398n848O896n773K844R19m327O270o210M278j130k168M613n498M690k613
$$ plain form
1363 -659 -666 1664 -2084 1925 -1305 465 379 -1012 1396 -1479 1273 -883 268 439 -1140 1645 -1819
1380 -1819 1507 -714 -403 1524 -2321 2462 -1837 570 984 -2313 2966 -2681 1538 147 -1793
1395 -1793 2900 -3087 2283 -740 -982 2351 -2935 2591 -1461 -35 1441 -2266 2378 -1774 768
1410 768 352 -1246 1670 -1647 1221 -611 -69 625 -1036 1265 -1245 1017 -551 -107 833 -1485
1426 -1485 1783 -1644 955 100 -1252 2139 -2426 1948 -778 -673 2031 -2750 2630 -1639 123
1441 123 1470 -2586 2888 -2239 938 645 -1945 2618 -2433 1554 -261 -1006 1865 -2153 1772 -996
1457 -996 60 779 -1326 1543 -1373 974 -391 -217 812 -1275 1498 -1406 952 -195 -714 1552
1473 1552 -2013 1939 -1268 132 1141 -2132 2546 -2167 1089 405 -1774 2656 -2693 1887 -485
$$ packed form
1363f59pK330l748M009l230J770q6j391K408k875K752k156J151J71j579K785l464
1380a819L326k221L11J927l845M783m299K407M14l297N279n647M219j391j940
1395a793M693n987N370l023k42L333n286N526m052J426J476l707M644m152K542
1410G68m16j598K916l317K868j832N42O94j661K301k510K262j568M44R40k318
1426a485L268l427K599q55j352L391m565M374k726J05K704m781N380m269J762
1441A23J347m056N474n127L177k93k590M563n051L987j815p45K871m018L925k768
1457i96J056P19k105K869k916K347j365J74J029k087K773k904K358j147n19K266
1473A552l565L952l207J400J009l273M678m713L256o84k179M430n349M580k372
$$ plain form
1488 -485 -1034 2249 -2723 2377 -1295 -105 1420 -2262 2397 -1837 801 360 -1351 1889 -1929 1468
1504 1468 -691 -175 959 -1491 1666 -1487 970 -237 -599 1338 -1814 1840 -1401 552 543 -1547
1520 -1547 2238 -2302 1687 -514 -847 2017 -2647 2475 -1590 164 1331 -2452 2828 -2363 1186
1535 1186 350 -1730 2610 -2656 1951 -691 -709 1861 -2430 2286 -1526 386 782 -1689 2090 -1949
1551 -1949 1327 -432 -556 1366 -1848 1885 -1453 685 272 -1206 1889 -2111 1812 -987 -127 1300
1567 1300 -2182 2499 -2122 1091 298 -1677 2592 -2808 2189 -891 -691 2096 -2880 2821 -1932
1582 -1932 484 1114 -2355 2877 -2548 1491 -31 -1377 2317 -2599 2111 -1107 -174 1298 -2039
1597 -2039 2202 -1809 983 42 -1016 1723 -2013 1814 -1186 264 788 -1635 2139 -2097 1517
$$ packed form
1488d85n49L283m972N100l672J190J525l682M659m234K638m41j711L240l818L397
1504A468k159N16J134k450L157l153K457j207l62J937l152L654l241J953rk090
1520a547L785m540L989k201l33K864m664N122m065J754J167l783N280n191L549
1535A186q36k080M340n266M607k642j8K570m291M716l812J912L96k471L779m039
1551a949L276j759j24J922l214L733l338K138m13j478L095m000L923k799Q60J427
1567A300l482M681m621L213p93j975M269n400M997l080K00K787m976N701m753
1582a932K416O30l469N232n425M039j522j346L694m916M710l218R33J472l337
1597b039M241m011K792r41j058K739l736L827l000J450N24k423L774m236L614
$$ plain form
1612 1517 -466 -782 1910 -2545 2487 -1699 372 1156 -2381 2939 -2622 1538 41 -1635 2728
1627 2728 -3033 2426 -1095 -523 1966 -2781 2798 -1972 651 817 -1972 2520 -2345 1564 -408
1642 -408 -768 1664 -2102 2010 -1414 534 451 -1316 1865 -1980 1622 -844 -174 1218 -1980 2264
1658 2264 -1944 1058 191 -1471 2405 -2628 2122 -941 -570 1944 -2786 2788 -1955 490 1088 -2351
1674 -2351 2870 -2568 1479 4 -1430 2411 -2634 2122 -1037 -271 1431 -2130 2230 -1752 865
1689 865 171 -1114 1741 -1920 1655 -1006 125 810 -1553 1934 -1867 1313 -362 -728 1683 -2231
1705 -2231 2166 -1484 327 975 -2043 2548 -2330 1365 17 -1414 2381 -2662 2133 -966 -491
1720 -491 1754 -2480 2459 -1721 524 804 -1824 2293 -2087 1334 -248 -829 1636 -1936 1785 -1143
$$ packed form
1612A517j983l16K692m455N032m186K071P84l537N320n561M160j497j676M363
1627B728n761N459l521N72K489m747N579m770K623J66k789M492m865L909j972
1642d08l60K432l766M112l424J948q3j767L181l845L602k466O70J392l198M244
1658B264m208L002q67j662L876n033M750l063L71K514m730N574m743K445N98l439
1674b351N221n438M047j475j434L841n045M756l159P66J702l561M360l982K617
1689H65o94j285K855l661L575k661J131O85k363L487l801L180j675l66K411l914
1705b231M397l650J811O48l018M591m878L695j348j431L795n043M795l099M75
1720d91K245m234M939m180K245K80k628M117m380L421j582n81K465l572L721k928
$$ plain form
1736 -1143 294 594 -1302 1690 -1673 1248 -537 -334 1146 -1698 1849 -1510 745 247 -1241 1933
1752 1933 -2112 1677 -748 -462 1551 -2207 2242 -1591 461 797 -1838 2327 -2115 1268 -55
1767 -55 -1121 1949 -2216 1783 -869 -238 1232 -1818 1896 -1409 605 331 -1107 1563 -1579 1211
1783 1211 -573 -181 865 -1343 1472 -1254 730 -32 -731 1333 -1610 1467 -931 88 805 -1509
1799 -1509 1848 -1636 954 48 -1065 1797 -1997 1615 -722 -363 1349 -1924 1923 -1338 390
1814 390 654 -1472 1837 -1641 1021 -113 -782 1385 -1585 1351 -749 41 681 -1149 1314 -1171
1830 -1171 710 -126 -498 976 -1235 1178 -856 257 383 -981 1333 -1345 957 -291 -476 1140
1846 1140 -1524 1477 -939 165 703 -1370 1657 -1401 794 98 -931 1498 -1574 1228 -520
$$ packed form
1736a143J437L00j896K992l363K921j785K03J480k844L547l359K255m98j488L174
1752A933m045L789k425K86K013l758M449l833K052L36k635M165m442L383j323
1767e5j066L070m165L999k652O31J470l050L714l305K014k74j438K670l142K790
1783A211j784L92J046k208K815k726J984p62o99K064k943L077k398J019P17k314
1799a509L357l484K590r06j113K862l794L612k337L59J712l273L847l261J728
1814C90K64k126L309l478K662j134o69K167k970K936k100P90O40j830K463k485
1830a171J881q36l72J474k211K413k034J113J26j364K314k678K302j248j85J616
1846A140k664L001k416J104N38k073L027l058K195o96j029K429l072K802j748
$$ plain form
1861 -520 -320 1035 -1425 1390 -995 317 412 -993 1235 -1192 797 -236 -365 831 -1079 1042
1877 1042 -754 272 245 -724 1010 -1037 817 -377 -190 720 -1060 1134 -883 382 254 -824
1893 -824 1187 -1212 887 -307 -401 983 -1290 1195 -769 88 592 -1107 1282 -1076 567 90
1909 90 -711 1119 -1185 901 -375 -217 720 -1010 1036 -764 280 222 -643 900 -903 661 -284
1926 -284 -141 545 -791 847 -698 365 58 -483 802 -907 787 -423 -49 539 -911 1028 -837
1943 -837 409 161 -692 1054 -1070 785 -239 -355 877 -1112 1013 -615 28 555 -960 1051
1959 1051 -873 400 142 -624 897 -900 651 -258 -186 538 -732 723 -560 242 87 -399 586
1976 586 -672 591 -350 61 299 -593 760 -722 495 -109 -341 727 -923 852 -527 15 520
$$ packed form
1861e20K00J355k460K815k385J312R5j405K228k427J989j033j29J196j910K121
1877A042j796J026k7r69J734k047J854j194J87R10j780K194k017J265j28j078
1893h24K011k399K099j194r4J384k273K485j964Q57N04j699K389k358J643m77
1909I0q01J830k304K086j276J58R37j730K046j800J044n8q65J543j803J564r45
1926b84J43O86j336J638j545J063l07n41J285j709J694j210L74N88j450J939j865
1943h37J246k48q53J746k124J855j024j16J232j989K125j628O43N27j515K011
1959A051j924J273k58p66J521j797J551r09P2P24j270J455j283Q02j55m86R85
1976E86j258J263r41M11K38q92J353j482J217o04k32J068j650J775j379N42N05
$$ plain form
1993 520 -913 1039 -833 381 204 -723 1018 -998 664 -141 -421 824 -979 821 -419 -75
2009 -75 499 -758 782 -610 264 122 -420 599 -606 488 -259 -7 255 -441 571 -544 410 -172
2027 -172 -147 454 -678 716 -581 236 188 -617 863 -887 620 -155 -372 812 -1007 892 -485
2044 -485 -45 589 -946 983 -736 256 249 -679 884 -813 492 -74 -346 602 -716 594 -345 48
2062 48 243 -438 524 -509 368 -167 -76 318 -500 592 -525 330 -13 -335 637 -780 683 -389 -60
2081 -60 509 -848 910 -726 288 229 -708 957 -930 608 -110 -422 792 -932 786 -406 -33
2098 -33 471 -740 786 -609 265 78 -406 580 -620 500 -284 11 261 -463 562 -537 394 -128
2116 -128 -175 434 -647 669 -511 182 208 -591 785 -792 537 -122 -378 733 -903 798 -446
$$ packed form
1993E20j433J952j872J214j77r27J741k016J662q05k80J245j803J800j240L44
2009g5N74j257J540j392Q74j42n42J019j205J094p47K52K62o96J012j115R54n82
2027a72K5O01j132J394j297Q17m8q05J480j750J507p75k17J184j819J899j377
2044d85M40O34j535J929j719R92pr28J563j697J305n66k72R48j318J310r39L93
2062D8J95o81R62j033Q77n35R1L94q18J092j117Q55l43l22R72j417J463j072L29
2081f0N69j357J758j636J014n9r37J665j887J538p18l12J214j724J718j192L73
2098c3N04j211J526j395Q74j87m84R86j200J120p84K95K50p24J025j099R31n22
2116a28m7O09j081J316j180O93K6p99J376j577J329o59k56J111j636J701j244
$$ plain form
2133 -446 -28 526 -842 910 -710 318 176 -572 829 -815 573 -201 -206 550 -712 691 -512
2150 -512 186 166 -442 628 -649 510 -251 -77 371 -587 666 -579 329 23 -358 623 -736 647
2168 647 -370 -31 427 -738 810 -697 326 111 -557 815 -852 639 -234 -220 634 -849 812
2185 812 -544 121 299 -659 821 -727 463 -51 -333 619 -738 659 -409 63 297 -571 679
2202 679 -634 415 -121 -227 516 -670 666 -497 185 183 -515 735 -737 558 -199 -207 610 -787
2220 -787 798 -566 147 315 -670 860 -792 479 -44 -423 752 -836 710 -360 -55 471 -724
2237 -724 790 -611 280 125 -454 669 -681 529 -262 -82 386 -622 642 -530 296 18 -352
2254 -352 592 -686 592 -353 13 358 -650 764 -681 397 22 -421 743 -836 679 -338 -107
$$ packed form
2133d46M18N54j368J752j620J028j42p48J401j644J388p74nP56j262J403j203
2150e12O98k0o08J070j277J159p61J74M48r58J253j245R08l06l81R81j359J383
2168F47j017L39M58j165J548j507J023k15o68J372j667J491q73J4Q54j483J661
2185H12j356O65J78r58J480j548J190n14k82R52j357J397j068M72K34q68J250
2202F79j313J049n36j06P43j186J336j163O82ko98J250j472J295p57qQ17j397
2220g87J585j364P13J68r85J530j652J271n23l79J175j588J546j070L05N26j195
2237g24J514j401Q91j55n79J123j350J210p91J80M68j008J264j172Q26k78l70
2254c52R44j278J278r45L66L45j008J414j445J078l75m43J164j579J515j017K31
$$ plain form
2271 -107 526 -792 828 -630 231 215 -589 797 -756 527 -123 -263 558 -721 661 -440 107
2288 107 241 -512 633 -598 407 -118 -186 453 -617 609 -442 163 178 -476 643 -667 487 -166
2306 -166 -207 527 -719 696 -491 129 273 -629 783 -704 426 -41 -384 657 -760 637 -346
2323 -346 -53 398 -655 703 -561 264 73 -405 588 -632 497 -228 -64 340 -520 588 -496 258
2341 258 39 -310 533 -595 503 -281 -33 352 -563 649 -512 272 90 -389 624 -666 504 -200
2359 -200 -147 453 -642 630 -457 128 236 -514 629 -570 357 -62 -262 487 -604 513 -312 32
2377 32 270 -459 553 -490 295 -20 -240 444 -525 481 -291 46 222 -422 543 -474 306 -41 -241
2396 -241 442 -534 493 -289 15 275 -488 566 -455 251 49 -331 513 -536 423 -191 -110 360 -507
$$ packed form
2271a07O33j318J620j458Q61j6q04J386j553J283o50j40Q21j279J382j101N47
2288A07J34p53J145j231J005n25o8O39j070J226j051O05J5o54J119j310J154o53
2306a66m1P34j246J415j187O20J44r02J412j487J130m67l43J041j417J397r83
2323c46K93M51j053J358j264Q25j91m78R93j220J129p25J64M04q60J108j084P54
2341B58k19l49Q43j128J098p84K48L85r15J212j161P84j82m79J013j290J170p04
2359b00N3O00j095J272j087N85J08p50J143j199R27m19k00P49j091J117q25L44
2377C2K38p29J012j043P85l15k20O84r69J006p72L37J76o44R65j017P80l47k00
2396b41O83r76J027p82L04K60p63J054j021P06k02l80Q44j049R59o14Q1M70q67
$$ plain form
2415 -507 491 -362 118 148 -391 484 -453 310 -86 -151 356 -455 430 -299 86 169 -338 438 -414 292 -83
2436 -83 -147 335 -450 419 -277 79 158 -364 457 -435 288 -40 -192 371 -479 410 -269 8 215 -392 463
2457 463 -414 220 2 -264 421 -454 357 -185 -61 270 -426 427 -335 126 76 -298 405 -418 295 -108
2477 -108 -96 290 -393 392 -276 83 120 -299 377 -388 267 -107 -114 288 -383 384 -281 93 115 -318 401 -381
2499 -381 268 -85 -136 313 -423 407 -268 44 188 -350 428 -386 244 -15 -214 355 -421 357 -189 -22
2519 -22 230 -371 397 -321 148 56 -234 342 -356 277 -130 -30 205 -330 364 -285 142 26 -226 329 -377
2540 -377 309 -163 -42 212 -384 401 -326 167 62 -265 391 -419 328 -130 -91 310 -407 413 -281 90
2560 90 132 -305 403 -385 247 -62 -129 291 -372 354 -226 59 120 -276 342 -335 235 -85 -114 273 -346 333
$$ packed form
2415e07R98q53M80L0n39Q75r37P63l96o5N07q11Q85p29L85Q3n07P76q52P06l75
2436h3o4M82p85Q69o96L56P9n22Q21q92P23l28j52N63q50Q89o79K77K07o07Q55
2457D63q77O34k18k66O85q75Q11n42J24L31o96Q53p62M61n0l74P03q23P13m03
2477a08J2L86o83P85o68L59L7m19O76p65O55l74pM02o71P67o65L74K2m33P19p82
2499c81O49l53n1M49p36Q30o75L12J44n38P78q14O30k59j99N69p76P78n46J67
2519b2K52o01P68p18M69r2k90N76o98O33m07J00K35n35O94o49M27j16k52N55p06
2540c77O86m72J21K54n96P85p27M93j05l27O56q10P47m58L9M01p17Q20o94L71
2560I0M2m37P08p88O32l09o7M20o63P26n80K85O1l96O18o77N70l20k9L87o19O79
$$ plain form
2582 333 -246 72 121 -291 375 -371 246 -61 -140 333 -405 402 -247 29 199 -363 425 -372 219 6 -227
2603 -227 382 -415 328 -167 -31 218 -347 376 -310 170 21 -201 333 -370 321 -196 -10 198 -325 382
2623 382 -343 216 3 -175 330 -398 361 -213 -3 211 -365 422 -355 180 33 -241 394 -421 350 -142
2643 -142 -63 275 -399 414 -297 118 96 -275 376 -382 290 -110 -91 259 -377 371 -285 98 73 -258 365
2664 365 -390 295 -138 -65 256 -398 406 -326 137 85 -276 423 -432 306 -122 -119 305 -423 434 -302 98
2685 98 138 -330 432 -406 277 -71 -149 335 -406 384 -246 50 150 -324 398 -377 238 -62 -162 326 -418
2706 -418 387 -261 59 143 -329 419 -389 257 -42 -175 360 -425 408 -264 36 200 -365 461 -390 230
2726 230 -17 -233 385 -450 373 -221 -8 251 -379 418 -358 191 16 -231 373 -412 334 -185 -35 209
$$ packed form
2582C33n79L18M9m12O66p46O17l07p9M73p38Q07o49K76J70n62P88p97N91k13k33
2603b27O09p97P43m95J36K49n65P23o86M80j49k22N34p03O91n17J86K08n23P07
2623C82p25N59k13j78N05p28P59n74K10K14n76P87p77N35j47k74O35q15P71m92
2643a42P9L38o74Q13p11M15k2l71O51p58O72m00J9L50o36P48o56L83k5l31O23
2664C65p55O85m33P3L21o54Q04p32M63n2l61O99q55P38m28LM24p28Q57p36M00
2685I8M0m68P62q38O83l48p8M84p41P90o30K96J00m74P22p75O15l00j00M88p44
2706d18Q05o48L20Q4m72P48q08O46k99j33N35p85Q33o72L00J64n65Q26q51O20
2726B30k47k16O18q35Q23n94K13K59o30P97p76N49j75k47O04p85P46n19J50K44
$$ plain form
2746 209 -370 404 -345 174 21 -233 374 -408 348 -183 -54 249 -385 419 -344 173 55 -268 399 -426
2766 -426 347 -144 -73 294 -409 434 -311 116 111 -298 415 -419 281 -96 -119 316 -427 401 -292 93 113 -312
2788 -312 413 -388 265 -88 -127 306 -402 390 -264 69 143 -311 404 -398 258 -69 -162 316 -413 373 -249
2809 -249 65 176 -329 414 -362 242 -33 -196 355 -419 370 -214 -2 210 -376 415 -358 200 37 -238
2829 -238 376 -407 324 -161 -61 249 -376 396 -297 149 74 -242 380 -380 294 -117 -67 251 -358 380 -289
2850 -289 134 75 -254 361 -376 286 -128 -57 257 -371 396 -291 108 93 -283 376 -400 275 -92 -128 296
2871 296 -404 368 -256 40 158 -344 394 -369 204 -29 -184 319 -370 324 -176 -9 214 -326 366 -298
2891 -298 170 21 -199 312 -356 285 -187 -15 185 -311 351 -303 159 4 -196 313 -364 290 -163 -21
$$ packed form
2746B09n79P74p49N19j53k54O07p82P56n31J29L03o34Q04p63N17j18l23O67q25
2766d26P73m91P1L67p03Q43p45M27nm09P13q34P00l77k3M35p43Q28o93L85K0m25
2788c12P25q01O53l53l9M33p08P92o54L33P4m54P15q02O56l27r3M78p29P86o22
2809b49L14J11n05P43p76O04k75j63N51p74P89n84K12K12n86P91p73N58j63k75
2829b38O14p83P31m85J00L10o25P72o93M46p5l16O22p60O74m11N0L18o09P38o69
2850b89M23n9l29O15p37O62m14P1L14o28P67o87L99j5l76O59p76O75l67l6M24
2871B96p00P72o24K96J18n02P38p63N73k33j55N03o89O94n00J67K23n40O92o64
2891b98M68j49k20N11o68O41m72J72K00m96O62o54M62j55k00N09o77O54m53J42
$$ plain form
2911 -21 215 -340 372 -312 156 64 -258 367 -383 279 -100 -82 274 -360 349 -241 68 131 -270 349 -325
2932 -325 220 -31 -126 268 -333 294 -175 30 137 -257 303 -277 183 -55 -135 251 -319 293 -188 28 119
2953 119 -268 328 -308 195 -11 -140 302 -336 298 -190 7 186 -314 362 -283 138 43 -203 314 -337
2973 -337 256 -133 -57 213 -300 311 -227 81 65 -204 284 -281 220 -74 -83 204 -289 294 -201 74 56 -217
2995 -217 290 -301 211 -83 -86 230 -308 303 -204 48 112 -240 315 -306 193 -33 -128 282 -318 291 -175
3016 -175 19 144 -278 309 -271 147 6 -153 265 -314 248 -134 -33 154 -257 289 -226 112 35 -156
3036 -156 238 -273 220 -132 -29 157 -250 262 -238 112 28 -177 255 -286 223 -96 -36 198 -279 302 -219
3057 -219 85 67 -201 298 -302 211 -66 -97 231 -303 280 -196 28 106 -248 274 -275 153 -34 -134 227
$$ packed form
2911b1K36n55P12o84M68r2l22O25p50O62l79J8L56o34P09n90L09O3m01O19o74
2932c25N45k51r5L94o01O27m69K05J07l94N60n80M60k38q0L86n70O12m81K16R1
2953A19l87N96o36N03k06j29M42o38O34m88J97J79n00O76o45M21r5k46N17o51
2973c37N93l89P6K70n13O11n38L08j6k69M88n65N01k94rK87m93N83m95K75j8k73
2995b17N07n91N12k94lL16n38O11n07K52O4l52N55o21M99k26r5M10o00O09m66
3016a75J94J25m22N87n80M18j41j59M18n79N62l82J01J87m11N46n15L38p7j91
3036a56L94n11M93l52J03J86m07N12n00L50q4k05M32n41N09l19O0K34m77N81n21
3057b19L04j8k68M99o00N13k77l1L28n34N83m76K24P8l54N22n49M28j87j00L61
$$ plain form
3078 227 -268 255 -146 20 119 -211 251 -225 151 -20 -106 220 -243 236 -148 15 107 -225 268 -243 173
3099 173 -7 -117 232 -276 252 -156 23 155 -249 304 -245 127 28 -188 282 -295 206 -94 -72 194 -269
3120 -269 275 -207 57 81 -193 264 -250 184 -48 -63 177 -238 245 -173 76 52 -170 225 -240 183 -78
3141 -78 -45 165 -232 243 -205 96 58 -204 257 -272 197 -79 -87 223 -296 261 -165 34 108 -217 280 -256
$$ packed form
3078B27m95N23m01J66R9l30M62m76L76j71q6L26m63M79l84J63R2l32M93n11M16
3099A73j80j10L49n08N28m08J79J32m04N53n49L72r9k16M70n77N01l00K2K66m63
3120b69N44m82K64K4k74M57n14M34k32j5K40m15M83m18K49k4k22L95m65M23k61
3141g8L3K10l97M75m48L01l8k62M61n29M69k76qL10n19N57m26J99P4l25M97n36
$$ [...]
8191i
##END NTUPLES=NMR FID
##END=
