##TITLE=1H_IG-120Polcy(2)
 CDCl3
 8 sc, 
 16.03.2022
##JCAMPDX= 6.0         $$ Bruker NMR JCAMP-DX V2.0
##DATA TYPE= NMR FID
##DATA CLASS= NTUPLES
##ORIGIN= UXNMR, Bruker Analytische Messtechnik GmbH
##OWNER= root
$$ XWIN-NMR		Version 3.5
$$ Wed Mar 16 10:33:26 2022 Russian Standard Time (UT+4h)  she@DPX200
##.OBSERVE FREQUENCY= 200.131346
##.OBSERVE NUCLEUS= ^1H
##.DELAY= (6, 6)
##.ACQUISITION MODE= SIMULTANEOUS
##.ACQUISITION SCHEME= undefined
##.AVERAGES= 8
##.DIGITISER RES= 18
##SPECTROMETER/DATA SYSTEM= spect
##.PULSE SEQUENCE= zg30
##.SOLVENT NAME= D2O
##.SHIFT REFERENCE= (INTERNAL, D2O, 0, 15.7039)
##AUDIT TRAIL= $$ (NUMBER, WHEN, WHO, WHERE, WHAT)
$$ ##TITLE= Audit trail, XWIN-NMR		Version 3.5
$$ ##JCAMPDX= 5.01
$$ ##ORIGIN= Bruker BioSpin GmbH
$$ ##OWNER= she
$$ F:/spectra/data/she/nmr/H-F/1/audita.txt
$$ ##AUDIT TRAIL=  $$ (NUMBER, WHEN, WHO, WHERE, WHAT)
(   1,<2022-03-16 10:31:49.21 +0400>,<she>,<DPX200>,
      <created by zg, POWCHK disabled, PULCHK disabled
       configuration hash MD5:
       00 E9 B6 7A A2 85 ED C7 34 08 36 98 17 FE 4E 26
       data hash MD5: 16K
       62 8A E1 A1 59 F6 98 AA 3C 9C 9A 57 31 2E B8 21>)
$$ ##END=
$$ 
$$ hash MD5
$$ D1 C1 CF 7D 80 6B AE 53 04 3E 7E B7 4A 7F 04 6A
##$RELAX= 
##$RELAX= 
##$RELAX= 
##$RELAX= 
##$RELAX= 
##$RELAX= 
$$ Bruker specific parameters
$$ --------------------------
##$DU= <F:/spectra>
##$EXPNO= 1
##$NAME= <H-F>
##$PROCNO= 1
##$TYPE= <nmr>
##$USER= <she>
##$AMP= (0..31)
100 100 100 100 100 100 100 100 100 100 100 100 100 100 100 100 100 100 
100 100 100 100 100 100 100 100 100 100 100 100 100 100 
##$AQSEQ= 0
##$AQ_mod= 1
##$AUNM= <au_zg>
##$AUTOPOS= <>
##$BF1= 200.13
##$BF2= 200.13
##$BF3= 200.13
##$BF4= 200.13
##$BF5= 200.13
##$BF6= 200.13
##$BF7= 200.13
##$BF8= 200.13
##$BYTORDA= 1
##$CFDGTYP= 0
##$CFRGTYP= 5
##$CHEMSTR= <none>
##$CNST= (0..31)
1 1 145 1 1 1 1 1 1 1 1 1 1 1 1 1 1 1 1 1 1 1 1 1 1 1 1 1 1 1 1 1 
##$CPDPRG= <>
##$CPDPRG1= <>
##$CPDPRG2= <>
##$CPDPRG3= <>
##$CPDPRG4= <mlev>
##$CPDPRG5= <mlev>
##$CPDPRG6= <mlev>
##$CPDPRG7= <mlev>
##$CPDPRG8= <mlev>
##$CPDPRGB= <>
##$CPDPRGT= <>
##$D= (0..31)
0 1.2 0 0 0 0 0 0 0 0.06 0 0.03 0 0 0 0 0.0002 0 0 0 0 0 0 0 0 0 0 0 0 
0 0 0 
##$DATE= 1647412308
##$DBL= (0..7)
120 120 120 120 120 120 120 120 
##$DBP= (0..7)
150 150 150 150 150 150 150 150 
##$DBP07= 0
##$DBPNAM0= <>
##$DBPNAM1= <>
##$DBPNAM2= <>
##$DBPNAM3= <>
##$DBPNAM4= <>
##$DBPNAM5= <>
##$DBPNAM6= <>
##$DBPNAM7= <>
##$DBPOAL= (0..7)
0.5 0.5 0.5 0.5 0.5 0.5 0.5 0.5 
##$DBPOFFS= (0..7)
0 0 0 0 0 0 0 0 
##$DE= 6
##$DECBNUC= <off>
##$DECIM= 32
##$DECNUC= <off>
##$DECSTAT= 4
##$DIGMOD= 1
##$DIGTYP= 9
##$DL= (0..7)
0 120 120 120 120 120 120 120 
##$DP= (0..7)
150 150 150 150 150 150 150 150 
##$DP07= 0
##$DPNAME0= <>
##$DPNAME1= <>
##$DPNAME2= <>
##$DPNAME3= <>
##$DPNAME4= <>
##$DPNAME5= <>
##$DPNAME6= <>
##$DPNAME7= <>
##$DPOAL= (0..7)
0.5 0.5 0.5 0.5 0.5 0.5 0.5 0.5 
##$DPOFFS= (0..7)
0 0 0 0 0 0 0 0 
##$DQDMODE= 0
##$DR= 18
##$DS= 0
##$DSLIST= <SSSSSSSSSSSSSSS>
$$ [...]
##$SUBNAM2= <"">
##$SUBNAM3= <"">
##$SUBNAM4= <"">
##$SUBNAM5= <"">
##$SUBNAM6= <"">
##$SUBNAM7= <"">
##$SUBNAM8= <"">
##$SUBNAM9= <"">
##$SW= 18.0517287032376
##$SWIBOX= (0..15)
0 0 2 0 0 0 0 0 0 0 0 0 0 0 0 0 
##$SW_h= 3612.71676300578
##$TD= 16384
##$TD0= 1
##$TE= 0
##$TE2= 300
##$TE3= 300
##$TEG= 300
##$TL= (0..7)
0 120 120 120 120 120 120 120 
##$TP= (0..7)
150 150 150 150 150 150 150 150 
##$TP07= 0
##$TPNAME0= <>
##$TPNAME1= <>
##$TPNAME2= <>
##$TPNAME3= <>
##$TPNAME4= <>
##$TPNAME5= <>
##$TPNAME6= <>
##$TPNAME7= <>
##$TPOAL= (0..7)
0.5 0.5 0.5 0.5 0.5 0.5 0.5 0.5 
##$TPOFFS= (0..7)
0 0 0 0 0 0 0 0 
##$TUNHIN= 0
##$TUNHOUT= 0
##$TUNXOUT= 0
##$USERA1= <user>
##$USERA2= <user>
##$USERA3= <user>
##$USERA4= <user>
##$USERA5= <user>
##$V9= 5
##$VALIST= <valist>
##$VCLIST= <CCCCCCCCCCCCCCC>
##$VD= 0
##$VDLIST= <DDDDDDDDDDDDDDD>
##$VPLIST= <PPPPPPPPPPPPPPP>
##$VTLIST= <TTTTTTTTTTTTTTT>
##$WBST= 1024
##$WBSW= 4
##$XGAIN= (0..3)
0 0 0 0 
##$XL= 0
##$YL= 0
##$YMAX_a= 148899
##$YMIN_a= -151837
##$ZGOPTNS= <>
##$ZL1= 120
##$ZL2= 120
##$ZL3= 120
##$ZL4= 120
##$ABSF1= 10
##$ABSF2= 0
##$ABSG= 5
##$ABSL= 3
##$ALPHA= 0
##$AQORDER= 0
##$ASSFAC= 0
##$ASSFACI= 0
##$ASSFACX= 0
##$ASSWID= 0
##$AUNMP= <proc_1d>
##$AZFE= 0.1
##$AZFW= 0.1
##$BCFW= 1
##$BC_mod= 2
##$BYTORDP= 1
##$COROFFS= 0
##$CY= 11.3945322036743
##$DATMOD= 1
##$DC= 2
##$DFILT= <>
##$DTYPP= 0
##$F1P= 2.36226072786647
##$F2P= -0.459571619588291
##$FCOR= 0.5
##$FTSIZE= 0
##$FT_mod= 4
##$GAMMA= 1
##$GB= 0.15
##$INTBC= 1
##$INTSCL= 1
##$ISEN= 128
##$LB= 0.24
##$LEV0= 0
##$LPBIN= 0
##$MAXI= 10000
##$MC2= 0
##$MEAN= 0
##$ME_mod= 0
##$MI= 1.114404
##$NCOEF= 0
##$NC_proc= 0
##$NLEV= 6
##$NOISF1= 3.799351
##$NOISF2= 2.8
##$NSP= 1
##$NTH_PI= 0
##$NZP= 0
##$OFFSET= 15.70392
##$PC= 1
##$PHC0= -17028.67
##$PHC1= 13.80078
##$PH_mod= 1
##$PKNL= yes
##$PPARMOD= 0
##$PSCAL= 0
##$PSIGN= 0
##$REVERSE= no
##$SF= 200.130013532006
##$SI= 16384
##$SIGF1= 3
##$SIGF2= 2
##$SINO= 400
##$SIOLD= 16384
##$SREGLST= <1H.CDCl3>
##$SSB= 0
##$STSI= 0
##$STSR= 0
##$SW_p= 3612.71676300578
##$SYMM= 0
##$S_DEV= 0
##$TDeff= 0
##$TDoff= 0
##$TI= <>
##$TILT= no
##$TM1= 0
##$TM2= 0
##$TOPLEV= 0
##$USERP1= <user>
##$USERP2= <user>
##$USERP3= <user>
##$USERP4= <user>
##$USERP5= <user>
##$WDW= 1
##$XDIM= 8192
##$YMAX_p= 0
##$YMIN_p= 0
$$ End of Bruker specific parameters
$$ ---------------------------------
##NTUPLES= NMR FID
##VAR_NAME=  TIME,          FID/REAL,        FID/IMAG
##SYMBOL=    X,             R,               I
##VAR_TYPE=  INDEPENDENT,   DEPENDENT,       DEPENDENT
##VAR_FORM=  AFFN,          ASDF,            ASDF
##VAR_DIM=   8192,          8192,            8192
##UNITS=     SECONDS,       ARBITRARY UNITS, ARBITRARY UNITS
##FACTOR=    0.0002768,     1,               1
##FIRST=     0,             0,               0
##LAST=      2.2672688,     0,               0
##MIN=       0,             -151837,         0
##MAX=       2.2672688,     148899,          0
$$ Real data points
##PAGE= N=1
##DATA TABLE= (X++(R..R)), XYDATA
0 0 0 0 0 0 0 0 0 0 0 0 0 0 0 0 0 0 0 0 0 0 0 -4 6 -8 8 -8 8 -8 8 -12 16 -16 16 -17 21 -24 24 -28 32 -35 37 -42 45
43 45 -51 56 -61 66 -73 81 -90 99 -108 119 -134 150 -166 186 -212 242 -278 327 -387 474 -594
64 -594 778 -1082 1634 -2857 6541 -37747 -151837 73962 115596 -132366 -60245 148899 -14391
77 -14391 -142316 76916 102847 -119153 -39332 140124 -20846 -119562 83398 81685 -118504
88 -118504 -23455 126227 -41420 -111357 87549 62795 -123047 -9874 124295 -48494 -99945
99 -99945 97349 59652 -117314 717 120921 -50615 -92087 92432 46618 -113960 2845
110 2845 103643 -57109 -79322 88221 31584 -102707 19437 93756 -61004 -57551 94745
121 94745 16512 -98067 34890 83598 -75680 -50102 96595 49 -102846 42365 78742
132 78742 -82339 -43030 101258 -1919 -96256 49905 76999 -78922 -34634 96831 -8462
143 -8462 -89927 49176 62249 -81313 -27127 87846 -19953 -81002 56165 52457 -80617
154 -80617 -11540 89756 -26923 -72732 65997 46022 -85218 -5451 87787 -36687 -74193
165 -74193 66406 39373 -88126 -3058 85709 -37065 -67555 68349 37852 -80409 3971
176 3971 80814 -37442 -58533 65572 26710 -77855 8406 69132 -45238 -50697 65279
187 65279 16011 -74497 18909 65955 -48157 -40151 70516 10916 -71701 25414 61534 -52691
199 -52691 -37115 67448 3014 -71072 26019 54204 -53409 -30368 65320 -532 -62098 32230
211 32230 48681 -51210 -19822 62896 -8547 -56904 35987 37902 -56523 -13570 59665 -18633
223 -18633 -54127 42178 32911 -58309 -4704 62679 -21881 -49339 48182 30027 -59418 -775
235 -775 59921 -27489 -48171 47105 22716 -60269 2753 55688 -30616 -41282 50157 18426
247 18426 -56261 11316 53589 -33882 -34783 52195 10785 -57579 15224 48427 -40742 -32447 52965
260 52965 5185 -57292 20329 47739 -41287 -26585 55796 3627 -53984 23892 44353 -42866
272 -42866 -23687 52496 -2698 -52847 24567 37683 -44641 -18323 51412 -6665 -47264 30457
284 30457 34626 -44110 -10735 51671 -11586 -44588 33172 28524 -47729 -8038 48819 -17493
296 -17493 -43011 35226 24770 -47192 -2439 48903 -18557 -37373 38375 21531 -45756 1847
308 1847 45190 -23167 -34662 37635 14216 -46649 5424 41395 -26901 -29495 40606 10796
320 10796 -44169 12236 40801 -28938 -24735 42441 5979 -44762 14553 36596 -33475 -23132
332 -23132 41651 1247 -43893 17945 34664 -33745 -17539 43407 -823 -40346 22042 31575
344 31575 -35441 -14023 41670 -6701 -39933 23454 26357 -38116 -10297 41390 -10033 -36589
356 -36589 27959 24834 -37557 -4877 42024 -12732 -34283 29653 20466 -39608 -3083 38985
368 38985 -17279 -32833 30463 16656 -39066 1458 38466 -18437 -27846 33384 14002 -37790
380 -37790 5499 36021 -22052 -25725 33104 8480 -38844 7783 33062 -24943 -22370 34808
392 34808 6086 -36682 12535 32436 -25662 -18260 35789 2636 -36142 14304 28506 -28868
404 -28868 -16471 34445 -1809 -35135 16945 26120 -29305 -11659 35727 -3685 -31957 20642
416 20642 23850 -30380 -8521 34569 -8133 -31543 21540 19589 -32504 -5958 33756 -10866
428 -10866 -28906 24598 18023 -31673 -1504 33916 -12788 -26350 26019 14384 -32801 376
440 376 31215 -16613 -24924 26569 10829 -32567 4048 30542 -17811 -20917 29047 8819 -31395
453 -31395 7492 28885 -20382 -19072 28818 4506 -32137 9033 26125 -22745 -16502 29611
465 29611 2285 -30219 12677 25267 -23031 -12811 30299 -341 -29208 14293 22091 -25302
477 -25302 -11206 29043 -3958 -28459 16111 19940 -25785 -7628 29850 -5378 -25906 18954
489 18954 18341 -26249 -5063 28989 -8536 -25323 19456 14873 -27710 -3193 27786 -10824 -23111
502 -23111 21480 13225 -26802 529 27640 -12223 -20549 22753 10321 -27324 2332 25423
514 25423 -15279 -19328 23042 7211 -27318 5031 24593 -16390 -16195 24850 5576 -26141 7877
527 7877 23278 -18093 -14380 24616 2218 -26350 9091 20708 -19938 -12220 24813 73 -24677
540 -24677 11957 19653 -20151 -8885 25413 -2115 -23522 13681 17068 -22000 -7276 24455
552 24455 -5331 -22979 15101 14987 -22612 -4485 24806 -6660 -20790 17297 13579 -22630 -2155
565 -2155 23965 -8941 -19802 17672 10603 -23476 -480 22614 -10954 -17868 19114 8904 -22770
578 -22770 2593 22380 -12140 -15614 20292 6615 -23034 4223 20635 -14535 -14573 20359 4007
591 4007 -22997 6122 19613 -15350 -12078 21393 2683 -21655 8368 18342 -16301 -10160 21068
604 21068 -34 -21362 9460 15973 -17787 -8253 20983 -2114 -20045 11742 14853 -18080 -5489
617 -5489 21450 -3840 -18936 13172 12859 -19264 -4128 20523 -6257 -18284 14003 10933 -19532
630 -19532 -1940 20335 -7347 -16249 15610 9563 -19276 234 19566 -9181 -15117 16066 7038
643 7038 -19947 1693 18371 -11042 -13655 17146 5453 -19544 4109 18122 -11968 -11807 18080
656 18080 3806 -19468 5428 16736 -13549 -10802 17895 1714 -19200 6772 15553 -14161
668 -14161 -8714 18478 462 -17976 8665 14462 -14879 -6989 18332 -1672 -17703 9574 12589
681 12589 -16101 -5635 18117 -3314 -16764 11099 11633 -16174 -3560 18285 -4459 -15583
693 -15583 12102 10046 -16666 -2313 17304 -6247 -14735 12593 8214 -16758 -500 16819 -7309
706 -7309 -12960 13837 6884 -16458 1443 16151 -8777 -11830 14263 4812 -16894 2650 15024
719 15024 -10268 -10616 14861 3408 -16385 4438 14513 -10805 -8884 15387 2053 -15909 5643
732 5643 13202 -11937 -7774 15155 153 -15607 6797 12019 -12642 -6058 15570 -1069 -14691
745 -14691 8400 11131 -13231 -4577 15543 -2690 -14339 9172 9664 -14075 -3473 15227 -4005
758 -4005 -13506 10206 8714 -14020 -1782 15152 -4893 -12353 11002 7358 -14282 -634 14332
771 14332 -6395 -11601 11413 5773 -14441 774 13865 -7331 -10277 12330 4748 -14175 2262
784 2262 13368 -8262 -9286 12605 3265 -14235 3141 12375 -9234 -8243 12825 2037 -13729
797 -13729 4489 11688 -9704 -6732 13159 790 -13216 5616 10553 -10636 -5639 13012 -847
810 -847 -12911 6619 9459 -11269 -4238 13221 -1923 -12112 7849 8653 -11620 -2910 13108
823 13108 -3162 -11539 8506 7350 -12119 -1847 12686 -4345 -10736 9295 6306 -12140 -395
836 -395 12480 -5253 -9723 10024 5121 -12336 708 11887 -6458 -9033 10435 3835 -12466
849 -12466 1814 11417 -7231 -7977 11027 2928 -12161 2992 10899 -7905 -7002 11211 1701 -12016
863 -12016 3810 9999 -8686 -6050 11307 546 -11597 4898 9283 -9157 -4793 11539 -507
876 -507 -11119 5845 8386 -9777 -3812 11430 -1710 -10743 6583 7464 -10181 -2717 11378 -2590
890 -2590 -10013 7416 6619 -10336 -1578 11123 -3599 -9346 7949 5454 -10622 -588 10672
903 10672 -4627 -8606 8565 4463 -10641 607 10419 -5392 -7727 9137 3518 -10672 1557
916 1557 9921 -6224 -7017 9423 2490 -10639 2441 9368 -6850 -6091 9707 1552 -10300 3402
930 3402 8730 -7431 -5133 9836 448 -10079 4218 7926 -8087 -4245 9937 -571 -9724
943 -9724 5113 7311 -8493 -3231 10094 -1391 -9303 5840 6611 -8873 -2415 9940 -2306
956 -2306 -8879 6370 5750 -9104 -1500 9742 -3112 -8223 6998 4933 -9239 -503 9499 -3933
970 -3933 -7621 7500 4035 -9469 323 9202 -4740 -7061 7965 3274 -9490 1177 8945 -5287
984 -5287 -6362 8308 2527 -9380 1894 8431 -5846 -5692 8397 1621 -9189 2608 7824 -6324
998 -6324 -4837 8561 801 -8844 3436 7252 -6772 -3987 8675 -98 -8606 4111 6599 -7263
1012 -7263 -3225 8673 -918 -8250 4745 5959 -7497 -2368 8603 -1621 -7701 5291 5180 -7689
1026 -7689 -1540 8314 -2494 -7160 5770 4286 -7887 -602 8106 -3278 -6544 6421 3549 -8037
1040 -8037 333 7966 -4029 -6005 6910 2778 -8218 1069 7666 -4705 -5481 7227 2034 -8182
1054 -8182 1800 7298 -5218 -4779 7478 1254 -8036 2522 6789 -5759 -4126 7637 437 -7935
1068 -7935 3212 6364 -6267 -3446 7893 -213 -7743 3895 6010 -6599 -2854 7974 -808
1081 -808 -7557 4295 5491 -6853 -2337 7813 -1375 -7170 4655 4911 -6909 -1607 7625 -1934
1095 -1934 -6619 5067 4213 -6983 -886 7357 -2619 -6135 5442 3494 -7107 -184 7122 -3171
1109 -3171 -5587 5789 2879 -7050 489 6814 -3626 -5012 5959 2146 -6933 1090 6284 -4110
1123 -4110 -4321 6075 1340 -6705 1852 5779 -4573 -3513 6308 534 -6509 2635 5290 -5149
1137 -5149 -2830 6497 -279 -6409 3283 4832 -5619 -2225 6633 -908 -6206 3838 4413 -5876
1151 -5876 -1601 6646 -1515 -5917 4275 3845 -6132 -1003 6533 -2153 -5584 4754 3338 -6338 -322
1166 -322 6548 -2689 -5230 5236 2865 -6528 216 6458 -3208 -4989 5483 2387 -6633 636 6259
1181 6259 -3555 -4606 5648 1966 -6493 1073 5950 -3817 -4114 5703 1413 -6318 1523 5513 -4150
1196 -4150 -3578 5751 803 -6138 2063 5139 -4429 -2982 5866 285 -5912 2543 4723 -4691 -2469
1211 -2469 5801 -300 -5644 2874 4176 -4859 -1878 5655 -827 -5207 3302 3621 -4961 -1180 5540
1226 5540 -1443 -4798 3749 2970 -5203 -527 5399 -2127 -4443 4215 2411 -5386 144 5337 -2639
1241 -2639 -4056 4617 1927 -5482 686 5151 -3135 -3713 4838 1359 -5533 1194 4918 -3553 -3264
1256 -3264 5104 869 -5474 1774 4718 -3914 -2808 5326 352 -5484 2214 4441 -4334 -2488 5430
1271 5430 -102 -5461 2565 4216 -4544 -2100 5498 -441 -5257 2895 3913 -4661 -1711 5424 -844
1286 -844 -5032 3135 3484 -4785 -1266 5321 -1248 -4698 3469 3091 -4816 -734 5214 -1657 -4353 3731
1302 3731 2588 -4941 -299 4982 -2113 -4029 3903 2104 -4902 196 4772 -2426 -3555 4126 1620
1317 1620 -4819 698 4468 -2821 -3105 4257 1023 -4779 1200 4131 -3220 -2627 4434 510 -4648
1332 -4648 1752 3882 -3518 -2144 4598 3 -4573 2154 3513 -3861 -1757 4602 -516 -4439 2552
1347 2552 3193 -4063 -1260 4685 -906 -4190 2947 2865 -4241 -823 4648 -1377 -4037 3220 2451 -4456
1363 -4456 -438 4595 -1777 -3800 3527 2145 -4500 4 4546 -2082 -3524 3737 1769 -4572 316
1378 316 4339 -2414 -3251 3853 1376 -4523 733 4168 -2642 -2840 4040 1018 -4409 1140 3927 -2943
1394 -2943 -2517 4081 528 -4377 1441 3579 -3218 -2148 4125 151 -4191 1822 3325 -3340 -1695
1409 -1695 4180 -234 -4015 2146 2974 -3552 -1336 4103 -688 -3826 2445 2627 -3678 -867 4109
1424 4109 -1017 -3525 2780 2288 -3778 -448 4017 -1464 -3339 2972 1848 -3935 -75 3872 -1821
1439 -1821 -3068 3240 1529 -3914 380 3792 -2081 -2724 3438 1143 -3947 712 3567 -2449 -2476 3522
1455 3522 736 -3935 1076 3403 -2659 -2103 3692 438 -3805 1427 3182 -2886 -1808 3712 6
1470 6 -3772 1682 2880 -3116 -1470 3747 -325 -3570 2038 2667 -3203 -1072 3783 -629 -3413 2270
1486 2270 2340 -3390 -784 3654 -1034 -3271 2455 2002 -3435 -417 3633 -1265 -2948 2724 1742 -3450
1502 -3450 -36 3499 -1596 -2731 2847 1317 -3525 261 3310 -1895 -2455 3020 1046 -3446 673
1517 673 3228 -2079 -2140 3151 702 -3456 911 2947 -2380 -1937 3138 295 -3400 1210 2744 -2526
1533 -2526 -1513 3280 33 -3196 1573 2528 -2690 -1211 3280 -367 -3155 1774 2219 -2906 -935
1548 -935 3280 -643 -2984 2069 2057 -2938 -575 3308 -883 -2796 2238 1753 -3077 -362 3141 -1247
1564 -1247 -2675 2366 1429 -3125 -11 3099 -1423 -2365 2629 1230 -3092 330 3021 -1694 -2222 2695
1580 2695 891 -3205 494 2834 -1930 -2040 2801 698 -3114 791 2785 -1988 -1726 2885 446
1595 446 -3014 982 2517 -2219 -1530 2827 83 -2955 1215 2300 -2338 -1183 2935 -126 -2763
1610 -2763 1536 2141 -2444 -921 2902 -462 -2738 1633 1837 -2611 -734 2813 -689 -2530 1858
1625 1858 1654 -2552 -338 2808 -870 -2247 2041 1332 -2621 -79 2607 -1248 -2104 2144 973 -2698
1641 -2698 257 2568 -1452 -1826 2419 806 -2670 572 2505 -1685 -1704 2452 489 -2771 681 2293
1657 2293 -1903 -1516 2512 270 -2643 997 2222 -1960 -1175 2627 22 -2554 1238 1991 -2202 -1000
1673 -1000 2610 -327 -2578 1441 1838 -2339 -771 2731 -434 -2434 1680 1785 -2379 -595 2695
1688 2695 -643 -2402 1671 1498 -2475 -465 2542 -835 -2188 1806 1318 -2367 -102 2504 -978
1703 -978 -1908 1957 1049 -2415 97 2323 -1266 -1833 2003 764 -2470 294 2272 -1360 -1584 2161
1719 2161 679 -2323 537 2167 -1441 -1383 2109 360 -2286 661 1864 -1643 -1140 2100 55 -2131
1735 -2131 1002 1696 -1731 -751 2226 -214 -2066 1244 1491 -1995 -628 2203 -534 -2113 1387 1351
1751 1351 -2112 -408 2296 -618 -1926 1632 1269 -2080 -169 2239 -837 -1814 1674 949 -2201 1
1767 1 2110 -1100 -1671 1871 789 -2217 328 2187 -1235 -1503 2057 646 -2323 422 2095 -1461
1783 -1461 -1540 2025 455 -2360 513 2013 -1465 -1323 2081 412 -2135 723 1907 -1483 -1087 2018
1799 2018 121 -2096 789 1582 -1686 -896 2010 -126 -1989 1055 1529 -1702 -623 2116 -241 -1877
1815 -1877 1200 1356 -1810 -545 1963 -488 -1838 1204 1108 -1811 -310 1884 -594 -1521 1398 932
1831 932 -1712 20 1781 -852 -1369 1473 576 -1882 192 1660 -1135 -1258 1652 426 -1889 498
1847 498 1751 -1205 -1062 1841 326 -1904 597 1618 -1388 -1041 1760 77 -1897 703 1459 -1454
1863 -1454 -780 1857 -32 -1746 996 1405 -1552 -587 1891 -306 -1823 1062 1199 -1794 -546 1888
1879 1888 -453 -1787 1243 1218 -1734 -315 1994 -444 -1626 1319 1094 -1742 -270 1798 -648 -1573
1895 -1573 1244 827 -1748 -88 1713 -746 -1307 1438 711 -1664 191 1673 -913 -1220 1469 465
1911 465 -1797 230 1519 -1087 -1146 1516 374 -1683 448 1532 -1029 -891 1576 257 -1573 562
1927 562 1308 -1206 -775 1460 -75 -1570 692 1119 -1307 -524 1592 -185 -1406 993 1092 -1386 -318
1944 -318 1630 -401 -1469 1034 896 -1589 -309 1566 -567 -1416 1142 846 -1490 -67 1625 -568
1960 -568 -1220 1263 704 -1530 47 1466 -832 -1188 1255 457 -1607 205 1458 -914 -1008 1466 436
1977 436 -1537 416 1482 -988 -947 1462 270 -1625 377 1315 -1124 -912 1408 160 -1506 545
1993 545 1254 -1065 -643 1469 56 -1384 665 1073 -1205 -570 1366 -231 -1413 749 927 -1289
2009 -1289 -380 1454 -267 -1241 968 938 -1250 -206 1451 -388 -1229 950 704 -1362 -187 1298
2025 1298 -575 -1139 1005 604 -1290 64 1326 -606 -930 1165 476 -1311 194 1207 -846 -916
2041 -916 1145 246 -1420 295 1186 -894 -770 1301 245 -1304 492 1197 -932 -667 1282 70
2057 70 -1337 483 999 -1080 -622 1229 -67 -1253 655 968 -1036 -367 1338 -125 -1158 782
2073 782 857 -1161 -334 1258 -352 -1227 780 732 -1235 -248 1291 -361 -1060 926 732 -1152 -67
2090 -67 1276 -448 -1009 915 519 -1232 -56 1115 -625 -945 981 422 -1162 173 1179 -613
2106 -613 -741 1111 354 -1173 261 1073 -784 -769 1031 165 -1240 277 986 -835 -639 1105 143
2123 143 -1109 470 981 -820 -488 1110 -22 -1112 495 780 -991 -435 1071 -189 -1072 642
2139 642 769 -965 -228 1183 -199 -971 773 698 -1039 -195 1092 -397 -1012 738 531 -1113 -101
2156 -101 1074 -432 -839 894 517 -1027 96 1085 -532 -776 907 325 -1148 109 956 -705 -765
2173 -765 958 242 -1103 278 1033 -661 -600 1080 236 -1059 356 943 -790 -613 983 38 -1131
2190 -1131 375 823 -846 -468 1066 18 -987 563 849 -830 -329 1084 -129 -1012 563 679
2206 679 -983 -351 996 -246 -1003 637 656 -930 -169 1088 -237 -850 742 589 -938 -99 967
2223 967 -405 -854 705 392 -999 -10 936 -461 -691 862 397 -926 179 976 -517 -644 878
2240 878 226 -1022 160 831 -686 -633 840 130 -973 301 837 -649 -440 958 89 -894 429
2257 429 738 -772 -394 898 -120 -960 453 636 -858 -294 989 -140 -865 645 695 -829 -178
2274 -178 1026 -214 -876 628 535 -946 -208 916 -344 -847 678 497 -900 -28 974 -338 -707
2291 -707 786 436 -921 43 908 -499 -742 748 270 -1003 82 891 -531 -651 863 312 -911
2308 -911 212 917 -513 -572 838 191 -933 183 745 -638 -527 793 75 -868 328 729 -614
2325 -614 -337 886 28 -795 438 653 -717 -326 832 -147 -865 440 553 -802 -249 863 -157
2342 -157 -743 564 566 -718 -98 858 -233 -687 575 396 -817 -73 753 -393 -649 643 307 -818
2360 -818 108 829 -429 -538 786 270 -838 166 790 -549 -588 744 144 -915 177 735 -579
2377 -579 -501 798 146 -807 316 753 -576 -387 815 38 -834 327 620 -699 -376 789 -70 -818
2395 -818 434 640 -685 -250 896 -59 -758 513 613 -728 -255 823 -176 -810 455 491 -760 -210
2413 -210 786 -204 -668 546 468 -679 -47 786 -254 -604 577 320 -774 -28 683 -400 -608 604
2431 604 242 -767 101 739 -394 -476 706 232 -720 173 680 -469 -471 648 101 -767 191 591 -537
2450 -537 -370 704 49 -678 351 602 -555 -259 736 -63 -719 376 491 -688 -268 726 -170 -731
2468 -731 446 491 -673 -158 805 -142 -643 531 487 -688 -115 745 -252 -670 493 350 -739 -66 721
2487 721 -295 -578 602 358 -689 60 757 -335 -532 634 255 -770 39 667 -456 -562 608
2504 608 194 -757 130 687 -419 -430 682 189 -673 208 624 -471 -399 638 33 -711 234 531 -554
2523 -554 -328 672 -2 -642 353 552 -537 -206 713 -68 -643 374 436 -631 -218 632 -166 -641 408
2542 408 403 -603 -100 688 -177 -545 493 357 -624 -36 639 -303 -554 480 230 -699 0 613 -341 -480
2562 -480 589 238 -642 131 677 -348 -422 621 174 -697 122 588 -472 -439 595 102 -676 200 582
2581 582 -448 -317 666 91 -614 275 535 -506 -301 612 -39 -671 274 461 -574 -260 646 -64 -608
2600 -608 378 495 -536 -156 671 -93 -571 398 389 -595 -163 601 -200 -556 410 336 -587 -47 635 -197 -469
2621 -469 479 290 -580 8 584 -301 -487 466 183 -639 38 541 -350 -424 529 170 -575 152 573 -333
2641 -333 -341 552 100 -586 154 477 -439 -331 529 20 -586 229 468 -440 -218 604 6 -546 314 444 -490
2662 -490 -197 574 -89 -580 303 362 -549 -181 574 -121 -521 392 361 -520 -88 582 -168 -490 397 290 -570
2683 -570 -70 539 -255 -484 429 240 -572 19 583 -252 -413 501 235 -558 76 559 -309 -417 476 155
2703 155 -598 67 504 -354 -372 495 131 -538 161 492 -351 -283 513 53 -542 179 416 -433 -284 513 -29
2724 -29 -553 234 414 -426 -203 555 -7 -485 301 391 -428 -162 525 -96 -500 289 310 -477 -128 492 -144
2745 -144 -437 366 279 -455 -26 518 -187 -400 406 208 -521 4 478 -275 -425 409 176 -544 56 506
2765 506 -280 -350 473 168 -501 101 478 -319 -330 451 83 -523 136 427 -372 -273 493 42 -493 223 446
2786 446 -383 -214 527 15 -508 238 408 -454 -233 516 -56 -541 229 382 -434 -186 524 -24 -477 289
2806 289 362 -429 -142 489 -105 -461 291 278 -460 -94 488 -147 -405 363 278 -459 -11 518 -159 -378 394
2827 394 244 -481 -6 481 -216 -384 356 179 -466 18 431 -234 -313 377 142 -424 87 392 -277 -270 389
2848 389 43 -457 132 348 -337 -225 429 23 -432 220 389 -350 -170 462 8 -441 213 337 -383 -172
2868 -172 430 -61 -437 229 298 -375 -113 446 -90 -386 302 263 -404 -50 453 -160 -400 318 219 -468 -43
2889 -43 457 -201 -401 353 227 -453 -7 478 -179 -363 360 213 -451 -8 420 -221 -342 349 147 -424
2909 -424 43 395 -233 -272 398 121 -402 114 400 -273 -258 397 62 -449 107 360 -319 -247 387 56 -412
2930 -412 138 351 -283 -204 386 26 -375 154 296 -305 -167 361 -32 -362 200 252 -323 -89 393 -76 -325
2951 -325 268 249 -349 -45 409 -125 -337 263 196 -390 -45 383 -160 -329 286 178 -363 5 378 -172 -275
2972 -275 321 135 -379 33 344 -230 -265 338 83 -401 93 350 -255 -229 385 81 -396 132 374 -270 -226
2993 -226 384 60 -399 123 333 -282 -201 367 20 -371 160 307 -273 -149 379 -1 -350 179 265 -316 -127
3014 -127 355 -64 -354 200 242 -338 -105 374 -81 -324 244 240 -329 -78 369 -86 -305 248 194 -329 -40
3035 -40 334 -136 -278 262 155 -327 21 322 -165 -234 288 109 -336 53 309 -221 -232 294 62 -360 69
3056 69 290 -234 -208 320 46 -351 107 286 -247 -172 321 11 -333 140 261 -270 -139 335 -24 -319 177
3077 177 246 -282 -91 357 -41 -315 199 231 -308 -79 340 -103 -322 210 196 -332 -66 349 -98 -295 236
3098 236 193 -311 -29 335 -115 -280 243 148 -329 -10 314 -161 -251 277 131 -326 41 331 -171 -215 277
3119 277 104 -327 59 301 -196 -210 282 64 -329 66 276 -207 -174 293 38 -298 110 259 -221 -144 288
3140 288 4 -308 130 230 -248 -108 294 -37 -289 160 210 -262 -94 306 -47 -261 185 187 -271 -68 292
3161 292 -78 -250 198 180 -277 -31 296 -91 -239 227 144 -274 6 290 -135 -225 239 107 -293 21 261
3182 261 -172 -218 247 99 -310 40 276 -176 -197 266 69 -298 76 263 -188 -176 270 45 -294 91 244
3203 244 -198 -146 286 27 -284 123 232 -218 -122 268 -13 -273 122 208 -233 -103 269 -38 -275 140 188
3224 188 -244 -90 277 -45 -255 161 176 -246 -65 252 -78 -236 181 143 -250 -38 258 -92 -214 198 121
3245 121 -243 3 239 -119 -198 200 98 -249 7 227 -139 -189 222 64 -263 47 227 -159 -155 216 63
3266 63 -249 69 211 -175 -148 219 23 -259 69 196 -198 -119 235 -5 -249 112 198 -196 -96 249 -11
3287 -11 -226 133 184 -210 -79 244 -37 -233 140 156 -216 -59 235 -57 -224 143 150 -230 -51 244 -86 -209
3309 -209 165 130 -234 -14 225 -89 -203 172 108 -233 2 233 -109 -178 191 92 -225 17 215 -122 -172 184
3331 184 89 -221 32 201 -121 -141 189 57 -223 55 184 -149 -131 186 22 -226 65 179 -167 -119 189
3352 189 -2 -215 92 159 -166 -93 196 -17 -193 106 147 -178 -69 205 -37 -200 118 128 -191 -42 198
3373 198 -55 -187 138 115 -201 -15 206 -84 -169 155 97 -201 -9 201 -86 -166 162 75 -210 4 192 -116
3395 -116 -163 156 50 -230 11 181 -136 -150 175 38 -211 33 181 -139 -120 191 35 -208 60 180 -133
3416 -133 -107 191 27 -196 70 166 -149 -99 196 5 -191 89 145 -149 -91 193 -1 -188 99 145 -165 -70
3438 -70 185 -26 -185 99 119 -168 -47 179 -49 -160 118 101 -163 -21 170 -60 -154 129 86 -170 -6 172
3460 172 -71 -149 132 72 -170 16 170 -83 -126 134 43 -185 30 148 -101 -121 153 27 -180 42 137 -114
3482 -114 -92 159 21 -181 60 132 -139 -93 164 14 -187 67 135 -145 -73 166 -8 -174 85 137 -142 -58
3504 -58 163 -22 -159 96 119 -151 -47 167 -36 -159 97 90 -168 -33 165 -56 -157 107 88 -164 -31 159
3526 159 -68 -153 119 69 -159 -12 157 -69 -132 120 59 -153 8 157 -77 -121 128 46 -156 24 131 -90
3548 -90 -102 140 29 -150 36 123 -107 -89 139 5 -155 37 107 -123 -80 131 -4 -156 57 104 -124 -78 146
3571 146 -14 -148 73 107 -135 -50 142 -11 -132 101 89 -142 -23 150 -39 -135 108 78 -143 -16 151 -55
3593 -55 -119 111 75 -142 -5 148 -68 -129 109 54 -150 -2 133 -85 -125 119 45 -152 14 125 -88 -113 120
3616 120 32 -157 30 131 -94 -88 131 26 -163 31 124 -102 -80 124 21 -130 62 99 -101 -66 129 -11
3638 -11 -123 63 93 -123 -51 126 -22 -134 67 94 -129 -51 129 -34 -124 94 71 -127 -20 128 -47 -122 84
3661 84 61 -134 -6 132 -51 -106 110 56 -130 6 130 -67 -102 117 45 -140 17 127 -78 -98 117 19 -140
3684 -140 26 108 -99 -91 112 11 -151 29 97 -99 -83 110 1 -140 52 103 -108 -67 122 -6 -129 60
3706 60 99 -112 -65 134 -19 -128 62 89 -114 -51 127 -18 -119 59 79 -108 -29 133 -29 -107 82 70 -120
3729 -120 -29 107 -42 -118 76 51 -128 -15 107 -60 -109 87 44 -124 1 113 -61 -88 98 44 -122 2
3751 2 107 -65 -76 100 31 -114 33 104 -76 -62 115 19 -110 41 94 -83 -64 107 8 -107 35 92 -99 -49
3775 -49 113 -17 -116 51 80 -89 -51 108 -14 -118 53 79 -105 -32 115 -22 -96 70 80 -108 -26 124 -21
3798 -21 -86 78 65 -109 -17 108 -29 -105 76 53 -120 -14 103 -46 -79 80 39 -105 -3 99 -53 -80 77
3821 77 37 -103 10 96 -64 -77 91 27 -107 19 96 -63 -58 100 27 -103 32 83 -59 -59 99 8 -100 31
3845 31 88 -68 -53 99 4 -98 38 78 -73 -47 97 -6 -88 52 50 -78 -32 93 -24 -94 50 53 -91 -20 83
3870 83 -30 -98 62 43 -90 -6 81 -30 -84 68 38 -93 2 86 -31 -64 68 45 -90 2 81 -46 -69 76 22
3895 22 -96 6 85 -65 -72 82 11 -93 20 70 -72 -58 79 15 -89 26 75 -65 -50 94 10 -91 38 68
3919 68 -73 -47 87 3 -95 41 68 -56 -32 88 -11 -89 41 63 -80 -35 78 -26 -86 43 53 -79 -21 74 -32
3944 -32 -85 41 43 -79 -23 74 -27 -79 62 40 -81 -16 71 -41 -71 64 35 -81 4 75 -37 -67 57 20 -81
3969 -81 8 67 -55 -50 65 25 -73 11 65 -56 -54 62 1 -85 30 67 -55 -32 66 -4 -86 18 49 -72 -36 67 -10
3996 -10 -69 44 60 -64 -22 79 -9 -74 40 48 -81 -26 72 -15 -65 51 42 -71 -5 64 -33 -65 56 41 -80 -16 79
4023 79 -36 -75 49 26 -81 -6 74 -37 -74 57 26 -87 -1 71 -44 -58 55 23 -77 0 66 -52 -48 57 6
4048 6 -77 14 63 -54 -44 66 3 -72 25 64 -52 -48 65 2 -84 22 53 -59 -44 59 -11 -81 15 34 -72 -32 69
4075 69 -22 -72 28 36 -66 -13 59 -23 -69 40 21 -71 -14 73 -20 -63 41 30 -81 -7 70 -34 -66 49 19 -84 2
4102 2 70 -37 -48 46 22 -75 10 68 -47 -47 60 11 -85 -5 51 -58 -62 67 1 -85 -3 61 -59 -57 64 2 -78 18 60
4131 60 -51 -39 67 6 -77 18 51 -63 -24 68 -2 -69 40 50 -67 -35 67 -8 -75 44 34 -69 -23 63 -21 -77
4157 -77 32 28 -88 -30 60 -24 -76 46 42 -68 -22 65 -35 -58 43 31 -58 -10 61 -42 -45 50 19 -63 9 62 -42 -43
4185 -43 65 10 -74 17 44 -60 -45 48 4 -77 18 59 -59 -41 56 -2 -69 21 57 -57 -37 52 3 -75 33 40 -72 -22
4213 -22 61 -20 -76 36 42 -63 -22 79 -27 -73 34 40 -72 -22 79 -22 -62 38 34 -70 -25 64 -19 -65 42 30
4239 30 -62 -10 45 -34 -49 45 18 -66 -1 60 -43 -56 59 15 -68 8 61 -41 -53 48 15 -75 14 58 -47 -45 50 -3
4267 -3 -69 17 53 -45 -33 61 6 -62 30 48 -51 -36 53 0 -65 29 35 -62 -27 52 -21 -67 28 39 -64 -29 70 -23 -57 43
4297 43 31 -53 -9 57 -21 -53 36 27 -57 -6 56 -28 -51 49 9 -69 6 67 -38 -59 53 19 -64 2 58 -43 -47 48 16
4326 16 -65 13 59 -43 -45 48 14 -59 13 51 -47 -35 54 11 -62 24 53 -54 -36 57 -10 -54 21 51 -45 -24 58 -8 -61 32
4356 32 44 -46 -28 47 -4 -60 16 46 -50 -19 48 -24 -65 33 29 -55 -12 44 -29 -64 30 9 -55 -7 51 -25 -44 47 19 -53 -7
4387 -7 51 -28 -41 52 11 -65 5 59 -31 -38 44 22 -50 9 51 -39 -33 39 -1 -59 19 36 -41 -38 42 -4 -63 22 43 -52 -23 57
4419 57 -3 -56 30 43 -49 -17 59 -1 -61 20 37 -48 -15 52 -8 -42 32 38 -43 -6 49 -20 -53 41 24 -48 -9 48 -20 -56 30
4450 30 15 -54 -10 45 -26 -42 39 20 -60 -10 52 -33 -32 49 11 -51 2 57 -37 -38 49 9 -53 15 44 -28 -27 55 9 -62 15 45
4482 45 -41 -34 54 1 -58 10 39 -41 -33 45 -9 -56 16 22 -41 -25 42 -28 -59 10 18 -57 -12 42 -24 -52 27 8 -55 3 59 -21
4514 -21 -40 41 19 -41 12 53 -22 -33 38 14 -60 -3 54 -26 -41 35 15 -62 3 50 -32 -39 35 3 -50 8 40 -43 -35 38 -1
4545 -1 -57 13 26 -47 -33 38 7 -51 11 37 -35 -38 44 2 -52 13 30 -39 -22 51 -6 -43 27 26 -43 -20 39 -11 -49 33 30 -36
4577 -36 -18 45 -20 -47 27 12 -56 -9 29 -32 -42 23 14 -49 -7 39 -16 -31 28 9 -44 -1 35 -35 -24 42 10 -51 9 47 -19
4608 -19 -29 40 -2 -50 6 39 -44 -33 31 -17 -48 10 34 -36 -21 31 -1 -60 17 34 -43 -18 35 -1 -50 24 27 -39 -17 39 -2
4639 -2 -46 28 18 -50 -17 46 -10 -41 31 17 -55 -12 40 -19 -41 29 20 -42 -12 43 -18 -35 42 20 -34 -16 36 -23 -37 32 3
4670 3 -50 -5 32 -31 -32 28 13 -46 5 25 -28 -27 47 8 -47 2 32 -34 -17 31 -3 -41 14 36 -37 -24 31 -12 -59 20 32 -43
4702 -43 -24 33 -18 -41 16 32 -44 -10 46 -11 -46 27 23 -48 -15 41 -20 -48 24 18 -45 -17 51 -10 -42 27 8 -45 -1 47 -9
4733 -9 -35 36 28 -37 -3 44 -17 -30 31 23 -47 -2 35 -29 -29 36 11 -39 9 29 -27 -20 41 8 -47 8 37 -43 -21 41 -3 -44 12
4766 12 22 -37 -12 43 2 -41 19 28 -29 -11 47 -5 -27 30 35 -32 -3 46 -15 -40 29 25 -39 -4 42 -11 -38 23 23 -37 -6 27
4798 27 -21 -38 24 9 -50 -4 29 -27 -35 30 15 -45 12 39 -22 -36 31 8 -38 9 32 -29 -26 43 12 -33 21 44 -30 -22 39 2
4830 2 -38 9 29 -34 -16 42 -3 -40 11 28 -46 -14 34 -15 -45 20 33 -37 -12 38 -4 -43 21 32 -33 -8 35 -12 -34 23 21
4861 21 -38 -4 39 -15 -15 31 15 -34 8 37 -27 -30 43 7 -38 5 34 -30 -32 29 7 -45 -8 29 -30 -28 23 0 -40 2 28 -26
4893 -26 -23 22 -5 -37 13 29 -21 -19 32 -6 -30 21 19 -35 -21 36 -3 -38 18 25 -41 -2 35 -23 -42 16 14 -31 -12 35 -23 -37 21
4926 21 8 -38 -14 32 -23 -40 23 15 -42 4 24 -22 -38 32 10 -37 2 45 -31 -31 27 -5 -51 10 32 -27 -15 32 -1 -41 21
4957 21 19 -29 -15 22 -5 -47 8 12 -35 -24 28 -7 -39 11 19 -46 -19 31 -13 -42 10 23 -42 -22 26 -12 -30 16 24 -45 -8 33
4989 33 -21 -37 30 20 -39 -9 24 -31 -27 22 10 -37 -3 24 -38 -25 19 3 -50 -3 33 -33 -33 17 -1 -47 6 23 -21 -24 21 -4
5021 -4 -46 -1 27 -33 -26 29 -14 -34 6 19 -33 -16 21 -8 -47 21 20 -38 -10 28 -9 -40 25 21 -30 -8 29 -18 -37 27 2 -40
5053 -40 -15 20 -14 -31 3 15 -32 -7 34 -15 -33 25 9 -23 2 32 -13 -32 24 16 -36 5 30 -16 -23 35 15 -33 -8 27 -32
5084 -32 -32 29 3 -37 2 21 -26 -25 12 -3 -50 -2 14 -29 -24 20 -10 -50 10 16 -30 -9 26 -13 -34 14 24 -25 -17 25 -10 -27 22
5117 22 23 -26 -2 27 -2 -20 23 12 -14 -8 34 -8 -24 12 6 -45 -16 31 -25 -29 27 7 -32 -8 19 -9 -33 22 12 -32 -2 25
5149 25 -10 -18 22 11 -40 3 23 -22 -10 23 16 -30 0 35 -14 -20 35 13 -28 14 32 -29 -23 32 1 -38 3 27 -29 -20 41 -11 -41
5182 -41 10 28 -33 -10 30 -5 -33 15 19 -37 -11 31 -8 -39 18 23 -32 -9 33 -17 -33 11 27 -34 -4 37 -14 -36 33 12 -29
5213 -29 -6 34 -16 -19 29 5 -32 -5 16 -26 -26 15 5 -40 -2 25 -31 -20 26 0 -26 17 29 -24 -22 27 3 -30 7 28 -32 -23
5245 -23 32 -4 -25 14 27 -30 -20 29 -6 -30 18 16 -27 -15 32 -18 -44 11 18 -37 -17 38 -16 -31 15 11 -41 -19 33 -17 -47 15
5277 15 16 -43 -6 41 -13 -26 22 13 -29 10 41 -10 -23 34 20 -35 7 33 -31 -27 27 -4 -38 8 16 -32 -24 36 -2 -41 9 27 -31
5310 -31 -24 38 7 -34 10 17 -33 -11 35 3 -36 12 24 -35 -7 28 2 -35 18 26 -26 -20 30 -6 -28 19 19 -33 -7 30 -12 -27 27
5343 27 21 -28 -1 26 -16 -35 11 14 -38 0 30 -19 -27 15 10 -37 5 24 -35 -22 28 3 -37 4 33 -23 -22 24 8 -26 11 23 -15
5376 -15 -13 26 -7 -37 7 25 -25 -13 19 -2 -38 3 15 -29 -15 28 -8 -40 18 15 -32 -20 23 -15 -36 15 23 -37 -5 43 -2 -33
5408 -33 24 21 -34 8 34 -11 -20 29 22 -30 -3 30 -16 -26 17 18 -39 -2 35 -12 -25 29 3 -33 1 37 -25 -25 19 -1 -37 10 30
5441 30 -23 -24 35 5 -30 15 26 -19 -17 36 3 -25 17 27 -15 -4 35 17 -27 16 29 -28 -14 26 -10 -27 16 29 -28 -7 38
5472 38 -10 -38 27 18 -38 -13 31 -8 -35 19 23 -30 -3 22 -13 -23 28 23 -42 -6 29 -22 -33 28 14 -29 16 32 -19 -18 39 12
5504 12 -22 8 25 -6 -22 27 6 -35 12 33 -21 -31 24 -4 -34 19 25 -26 -19 30 -14 -36 9 20 -28 -18 19 -14 -33 9 21
5535 21 -30 -25 35 -7 -32 25 19 -23 -3 49 -8 -33 23 15 -37 -3 34 -21 -28 26 23 -38 -7 26 -12 -33 18 7 -45 -9 19 -28 -32
5568 -32 11 9 -33 3 33 -22 -25 29 11 -28 15 25 -16 -21 31 2 -41 12 25 -25 -17 27 -7 -32 19 30 -26 -11 28 -3 -36 25
5600 25 16 -40 -10 32 -9 -34 9 12 -39 -20 20 -11 -24 -1 22 -33 -18 32 -21 -17 16 21 -34 -10 46 -11 -24 26 5 -29 12 28
5632 28 -7 -23 36 21 -38 -4 32 -23 -25 24 1 -41 -1 29 -26 -16 37 0 -30 0 30 -19 -14 28 4 -31 4 33 -19 -16 28 8
5664 8 -37 3 30 -28 -18 34 1 -28 28 30 -22 -4 35 1 -23 23 19 -34 -17 29 -3 -28 15 24 -32 -9 35 -6 -30 23 25 -33 -10
5697 -10 32 -10 -27 25 28 -29 -7 30 -8 -23 28 17 -27 9 35 -17 -14 38 17 -38 9 35 -22 -17 34 20 -32 6 32 -16 -24 33
5729 33 9 -23 8 28 -19 -23 26 0 -30 8 23 -25 -25 23 7 -29 14 21 -32 -18 33 -5 -22 19 21 -36 -18 33 -4 -27 21 20 -23
5762 -23 -5 24 -13 -41 12 11 -21 -12 34 -9 -36 23 17 -45 -7 21 -19 -32 19 6 -28 2 31 -10 -28 26 14 -34 9 25 -19 -29
5794 -29 37 15 -31 6 31 -18 -21 34 7 -17 2 29 -30 -24 25 4 -36 11 25 -40 -18 28 6 -34 15 29 -21 -22 35 -3 -34 10
5826 10 22 -25 -15 23 -2 -39 13 32 -27 5 40 -8 -23 33 23 -23 -3 36 -6 -33 21 21 -37 1 38 -16 -24 10 10 -28 -6 29
5858 29 -22 -33 22 9 -35 0 30 -21 -23 23 12 -29 3 32 -25 -9 25 10 -34 11 21 -26 -10 39 13 -33 17 30 -23 -23 33
5889 33 8 -33 16 21 -33 -20 26 1 -44 21 8 -39 -15 25 -5 -39 18 14 -24 -9 30 -12 -28 26 19 -28 -1 32 -8 -26 15 23
5921 23 -27 -3 40 -17 -27 23 13 -33 5 38 -8 -18 32 20 -28 14 26 -20 -27 21 3 -32 5 27 -19 -32 21 14 -37 14 28
5952 28 -25 -15 33 5 -26 14 36 -27 -18 32 3 -18 11 28 -32 -24 37 6 -30 10 20 -30 -14 36 2 -28 25 22 -20 3 29 -10
5984 -10 -32 16 15 -32 -11 28 -11 -26 24 4 -34 -15 31 -12 -29 32 12 -25 3 43 -9 -14 35 23 -23 3 45 -6 -15 45 11 -28
6016 -28 -8 32 -29 -19 32 5 -31 -2 28 -19 -20 34 3 -31 11 34 -20 -19 44 7 -30 22 27 -27 -9 25 3 -33 19 23 -29 -6
6048 -6 42 2 -26 26 32 -25 2 46 6 -27 25 33 -29 -9 35 -8 -38 19 22 -28 -7 30 -14 -38 27 17 -31 0 33 -14 -25 29
6080 29 19 -24 15 37 -16 -25 31 11 -31 10 46 -25 -22 30 11 -39 7 37 -20 -5 36 10 -35 8 28 -24 -15 39 10 -35 21 31
6112 31 -31 -8 38 2 -29 14 28 -23 -3 38 1 -25 27 34 -28 -4 38 4 -16 30 35 -20 6 32 -2 -18 34 19 -32 7 32
6143 32 -11 -21 39 22 -26 1 42 2 -11 33 6 -31 7 33 -24 -25 24 8 -37 7 29 -14 -24 28 12 -35 12 32 -26 -21 33
6174 33 3 -30 15 27 -14 -10 29 1 -40 17 22 -27 -13 33 -2 -28 13 22 -34 -12 38 -10 -26 11 23 -27 -23 18 -8 -27 13 8 -21
6207 -21 -4 30 -9 -27 23 26 -33 -6 17 -11 -29 17 27 -30 1 38 -13 -25 30 25 -31 4 33 -6 -22 27 13 -33 -1 25 -19
6238 -19 -31 27 2 -35 0 27 -38 -18 28 -9 -46 13 31 -20 -10 41 3 -36 18 12 -27 -22 37 4 -37 6 22 -25 -10 42 -4
6269 -4 -25 15 33 -27 -7 22 -6 -37 7 12 -40 -17 18 -7 -35 21 16 -36 -15 28 -21 -34 22 6 -37 0 32 -8 -24 33 21 -34
6301 -34 -10 29 -3 -22 29 10 -29 1 32 -16 -24 29 17 -38 11 30 -30 -23 22 7 -46 8 34 -27 -20 24 13 -39 12 24 -33 -27
6333 -27 20 -2 -28 14 26 -25 -11 37 -7 -32 10 24 -27 -19 42 -7 -22 24 24 -30 -17 36 2 -20 27 20 -39 -11 26 -12 -35 17
6365 17 18 -33 -5 38 -14 -28 31 8 -38 -5 32 -18 -34 34 7 -45 -2 28 -21 -15 27 10 -29 15 40 -18 -24 37 10 -27 12 44
6397 44 -13 -16 29 -2 -32 12 32 -25 -13 30 -2 -39 17 27 -28 -15 34 -7 -36 10 32 -25 -31 34 1 -36 24 29 -27 5 35 -6
6429 -6 -20 24 24 -20 -10 36 -8 -27 18 22 -29 -7 43 -11 -28 19 19 -29 -5 22 -21 -34 30 10 -42 -4 28 -31 -25 26 18 -38 4
6462 4 34 -30 -18 28 0 -27 14 27 -23 -29 20 -5 -29 16 34 -33 -11 35 3 -38 11 30 -32 -4 38 -7 -40 13 19 -42 -19 32
6494 32 -17 -30 22 21 -38 -10 35 -12 -45 16 18 -39 -12 43 -16 -28 29 8 -40 -1 34 -22 -32 37 12 -30 0 33 -19 -25 29 11
6526 11 -32 7 39 -23 -20 27 9 -39 8 31 -20 -38 32 11 -38 4 25 -29 -24 35 -3 -41 8 26 -28 -16 36 -12 -39 20 29 -28
6558 -28 -10 39 -3 -35 13 33 -27 -21 34 -3 -40 23 14 -39 1 33 -8 -42 20 17 -39 -14 29 -23 -40 31 12 -51 1 36 -18 -27
6590 -27 24 9 -41 0 27 -23 -28 31 10 -45 3 42 -25 -21 51 2 -34 22 31 -25 -22 44 9 -36 20 37 -21 -21 39 0 -36 16 33
6623 33 -26 -24 19 -7 -29 13 22 -30 -18 34 2 -31 30 28 -31 -7 44 -10 -29 30 26 -30 -9 40 -4 -23 18 14 -30 -5 39 -11 -28
6656 -28 31 27 -35 -6 33 -17 -23 34 6 -40 -6 36 -32 -27 16 0 -36 0 33 -21 -25 32 4 -35 15 38 -18 -12 41 14 -28 11 37
6689 37 -23 -15 31 -1 -25 23 37 -29 -6 37 10 -30 21 39 -30 -14 27 4 -31 20 28 -41 -14 27 -10 -39 22 23 -43 -8 32 -21
6721 -21 -34 20 25 -19 15 47 -2 -22 42 21 -31 12 48 -19 -31 40 21 -24 6 42 -26 -14 30 10 -46 -2 40 -31 -30 31 7
6752 7 -36 1 24 -30 -11 41 11 -28 14 37 -33 -14 40 6 -26 16 41 -23 -18 45 5 -12 28 41 -25 -9 33 -9 -43 20 25 -30
6784 -30 -14 41 2 -40 20 10 -38 -16 33 -13 -39 26 23 -43 11 30 -24 -30 34 9 -47 0 39 -16 -29 32 16 -41 11 42 -16
6815 -16 -24 43 15 -40 5 32 -24 -19 35 13 -36 11 30 -33 -20 37 3 -37 11 27 -35 -21 48 2 -37 16 34 -30 -24 45 -7 -41
6847 -41 22 17 -31 -12 41 -1 -32 25 30 -36 4 47 -6 -35 42 30 -34 -2 37 -4 -40 25 17 -59 -9 43 -14 -36 26 15 -39 -1
6879 -1 36 -20 -27 26 4 -44 1 37 -24 -23 43 6 -40 14 30 -23 -13 40 -6 -31 15 38 -22 -20 35 4 -41 12 23 -32 -15 37
6911 37 -8 -34 13 34 -36 -21 32 -1 -33 26 28 -45 -9 30 -14 -38 24 24 -39 -7 39 -8 -37 27 28 -48 -7 38 -15 -32 30 20
6943 20 -30 7 40 -8 -33 43 29 -41 4 41 -20 -29 44 17 -53 5 20 -33 -29 32 -6 -56 3 27 -27 -28 34 2 -31 13 42 -28
6975 -28 -35 49 9 -40 16 37 -28 -10 45 -2 -31 35 35 -32 -9 48 6 -33 25 33 -40 -6 41 -7 -37 28 14 -49 -7 41 -29 -39
7007 -39 20 19 -54 -17 36 -23 -34 28 19 -37 1 38 -24 -38 44 16 -38 1 31 -24 -32 35 14 -39 11 42 -14 -25 43 4 -44 17
7039 17 46 -27 -29 42 2 -50 11 28 -40 -17 37 -7 -51 18 32 -46 -15 37 -12 -48 28 32 -40 -12 56 -3 -35 34 25 -26 -12 50
7071 50 -11 -39 31 28 -43 1 43 -16 -37 22 25 -54 -2 32 -15 -27 23 21 -48 1 43 -35 -26 27 8 -44 2 38 -29 -28 33 4 -46
7104 -46 3 35 -29 -19 44 10 -43 20 39 -39 -17 34 10 -38 20 42 -25 -15 40 -8 -37 17 34 -49 -12 42 -11 -36 14 23 -36
7135 -36 -13 29 -6 -32 31 8 -43 2 42 -9 -31 36 15 -39 4 34 -20 -30 32 19 -48 7 45 -15 -36 40 16 -39 1 40
7165 40 -15 -21 42 4 -49 7 26 -30 -29 43 4 -53 9 30 -36 -34 33 -1 -42 13 29 -30 -23 49 1 -35 23 33 -33 -16 47 -11
7197 -11 -39 33 29 -43 -13 50 -12 -44 36 24 -30 -13 46 -12 -38 29 21 -49 -19 39 -17 -39 16 10 -47 -3 33 -33 -46 24 13 -47
7229 -47 5 44 -25 -29 46 17 -33 19 47 -25 -20 46 11 -35 15 39 -32 -27 46 1 -50 13 38 -33 -29 40 -11 -50 17 33 -39 -27
7261 -27 27 -7 -58 24 27 -41 -20 42 -5 -41 15 28 -42 -19 40 -16 -45 34 27 -27 -2 46 -14 -37 37 23 -31 1 35 -17 -36
7292 -36 35 11 -47 0 36 -30 -37 28 10 -49 8 24 -38 -29 33 18 -43 12 37 -33 -28 30 -1 -45 7 38 -30 -24 45 3 -39 30
7324 30 35 -29 -12 38 11 -46 23 29 -33 -10 50 1 -40 30 24 -48 -13 44 -20 -40 17 22 -41 -20 36 -17 -40 31 20 -37 -6 47
7356 47 -18 -43 32 24 -46 4 48 -22 -33 42 21 -36 14 49 -28 -27 36 6 -33 10 43 -24 -21 53 4 -50 11 39 -35 -37 36 -5
7388 -5 -43 13 28 -44 -20 39 1 -51 7 39 -33 -14 37 3 -40 19 27 -29 -13 49 -6 -29 29 22 -44 0 36 -3 -43 23 11 -47
7420 -47 -7 46 -18 -34 19 13 -44 -7 39 -22 -44 28 15 -42 -8 31 -27 -34 28 17 -36 6 37 -25 -20 49 20 -39 11 39 -20 -21
7452 -21 53 23 -43 23 46 -34 -22 48 14 -43 17 34 -25 -10 50 -5 -45 20 26 -43 -17 41 -12 -54 14 25 -42 -13 59 -7 -36
7483 -36 35 34 -37 -19 48 -5 -28 39 28 -35 -4 39 -10 -29 35 15 -34 0 50 -21 -25 38 20 -41 3 46 -23 -38 37 9 -49
7514 -49 1 19 -30 -29 33 1 -38 5 41 -25 -24 49 4 -49 24 40 -36 -17 45 2 -40 25 45 -31 -17 54 4 -35 26 38 -26
7545 -26 -9 43 -12 -44 32 31 -44 -13 39 -7 -41 20 25 -43 -15 45 -22 -37 33 14 -45 -5 46 -17 -22 43 19 -35 6 50 -11 -17
7577 -17 50 25 -37 21 51 -20 -28 50 17 -46 12 42 -29 -22 42 8 -45 19 47 -38 -15 54 -5 -46 27 38 -34 -17 42 1 -32
7608 -32 20 32 -35 -13 45 -3 -40 29 35 -36 -2 44 -12 -33 42 38 -34 5 43 -6 -37 43 29 -36 -5 39 -32 -39 29 19 -44 -1
7640 -1 39 -27 -18 36 15 -53 6 40 -20 -18 50 15 -43 17 56 -24 -25 48 3 -42 18 44 -28 3 62 18 -39 21 39 -21 -6 48
7672 48 -5 -45 26 38 -40 -13 38 -12 -34 27 20 -47 -14 42 -14 -30 21 25 -43 1 36 -15 -36 32 28 -36 14 56 -12 -37 42 21
7704 21 -29 10 52 -18 -27 35 25 -43 8 55 -18 -12 42 12 -33 12 35 -17 -17 45 10 -42 11 34 -19 -25 39 -14 -51 17 42 -45
7736 -45 -3 46 1 -42 31 42 -27 -2 66 -3 -28 37 37 -32 2 52 -5 -25 28 42 -36 7 52 -18 -39 29 18 -42 -6 35 -19
7767 -19 -26 35 26 -44 6 29 -21 -32 39 16 -38 4 26 -25 -25 31 30 -27 12 47 -14 -15 42 12 -30 32 38 -28 -13 46 10 -35 29
7800 29 34 -39 -7 35 -3 -49 17 30 -29 -17 43 -1 -34 22 30 -29 -28 37 -6 -42 35 24 -41 -10 41 -7 -28 28 25 -34 -5 44
7832 44 -16 -34 36 36 -49 4 47 -9 -30 33 16 -38 7 36 -31 -30 36 13 -40 7 42 -22 -26 38 2 -34 18 39 -28 -34 37 9
7864 9 -38 15 45 -28 -14 47 10 -36 29 44 -23 -22 38 -3 -46 30 35 -19 -9 52 -3 -35 30 24 -33 -14 38 -10 -34 33 11 -44
7896 -44 -9 42 -17 -48 25 15 -44 -11 43 -15 -44 28 21 -43 1 48 -11 -25 32 18 -30 11 44 -16 -7 33 6 -42 15 32 -22
7927 -22 -23 47 3 -24 22 30 -29 -14 35 2 -40 21 26 -35 -16 41 2 -46 13 25 -39 -6 34 -9 -37 25 40 -27 2 43 -1 -24
7959 -24 29 34 -24 3 51 -6 -32 30 19 -41 0 43 -8 -27 40 27 -46 -4 48 -29 -33 30 7 -41 5 41 -22 -24 32 2 -43 2
7991 2 35 -26 -27 43 1 -41 11 36 -32 -21 45 8 -27 34 36 -27 -18 41 -1 -32 28 30 -36 -19 39 -11 -38 29 21 -46 -11 38 -21
8024 -21 -41 12 12 -44 -8 39 -19 -45 24 14 -42 2 31 -12 -36 29 18 -41 8 48 -25 -14 40 14 -38 10 37 -18 -27 37 13
8055 13 -38 14 45 -22 -29 35 0 -38 1 29 -29 -26 38 -6 -45 26 31 -32 -14 39 -11 -35 22 31 -21 -11 44 -6 -38 26 33 -34 5
8088 5 45 -5 -26 30 22 -33 -14 38 -11 -31 28 17 -38 2 39 -20 -38 25 8 -51 -8 32 -29 -38 39 11 -26 -1 36 -31 -24 40
8120 40 10 -39 16 43 -38 -20 39 2 -42 24 47 -30 -17 41 -3 -42 17 39 -44 -18 36 3 -31 12 28 -42 -24 26 -12 -43
8150 -43 19 30 -43 -12 35 -16 -41 31 20 -52 -18 33 -14 -38 16 12 -47 -2 21 -20 -31 41 22 -30 17 47 2 -17 38 19 -39
8181 -39 9 39 -27 -27 31 1 -46 4 26 -28
8191b8
$$ Imaginary data points
##PAGE= N=2
##DATA TABLE= (X++(I..I)), XYDATA
0 0 0 0 0 0 0 0 0 0 0 0 0 0 6 -8 8 -8 8 -9 16 -16 22 -24 32 -32 40 -48 56 -64 72 -81 96 -106 121 -137 154
35 154 -177 199 -223 249 -275 307 -344 380 -420 466 -514 570 -627 691 -762 837 -925 1015
53 1015 -1123 1240 -1373 1522 -1698 1898 -2134 2419 -2764 3200 -3766 4535 -5642 7380 -10505
68 -10505 17844 -69698 23533 148288 -115184 -84380 140417 28148 -151306 52125 125415
79 125415 -97113 -73127 136273 7952 -132476 51860 103131 -106902 -54841 123406 -10190
90 -10190 -123966 66677 89090 -107147 -36458 129222 -18619 -113153 76257 83205 -110146
101 -110146 -29935 121583 -27629 -111070 72160 69202 -107694 -23461 111372 -31310 -93463
112 -93463 76001 58361 -96805 -4278 102739 -40352 -77123 80616 37766 -100180 8252
123 8252 92091 -58549 -70346 87420 24978 -102955 21930 94026 -63084 -61215 95873
134 95873 22432 -100344 27608 89360 -66462 -57818 89478 12002 -97434 28482 77012
145 77012 -68145 -46296 87124 4019 -86027 40460 70014 -69098 -31691 88614 -7392
156 -7392 -83504 47442 60330 -78829 -27724 87618 -17275 -84195 52386 58093 -79211
167 -79211 -21094 90245 -16462 -77476 55439 54981 -75888 -16967 82751 -21988 -72408
178 -72408 52104 42571 -74960 -10187 74976 -28063 -61564 57395 35019 -71005 2652
189 2652 73340 -33637 -53870 61463 26200 -73525 6831 67551 -41313 -51735 60865
200 60865 19776 -71677 11858 64635 -40390 -42538 62155 16237 -64602 17809 57481 -42867
212 -42867 -35335 58323 4983 -62600 22022 47872 -48458 -27019 59600 -2535 -58215 31958
224 31958 45621 -50802 -18495 62978 -8331 -57379 35972 40432 -55974 -16605 60469 -14681
236 -14681 -56321 37859 36124 -55233 -9866 60237 -16456 -48968 42517 31484 -54157 -3235
248 -3235 56613 -23528 -45970 43615 22585 -57382 1464 53869 -29230 -41743 48325 19729
260 19729 -56091 8579 54821 -30938 -37532 50375 15671 -56519 10118 49962 -35112 -35738 48294
273 48294 10073 -54639 13887 46603 -35354 -28223 50151 6726 -50010 19824 42616 -38152
285 -38152 -23322 49040 -969 -50209 22273 36819 -42334 -19319 49349 -4966 -47028 27590
297 27590 35445 -41685 -13185 50130 -7781 -44002 29454 30132 -43681 -10632 46123 -13654 -41759
310 -41759 30749 24715 -43566 -4404 45624 -16167 -35839 35458 21383 -43060 1169 43915
322 43915 -21237 -33992 36246 15176 -45556 3751 41246 -25165 -30927 38655 12744 -43549
334 -43549 9225 41081 -25927 -26194 40191 8857 -43019 11638 36607 -30150 -24086 39018 3123
347 3123 -42493 15206 33964 -31609 -18544 41383 708 -39503 20142 32072 -33387 -15141
359 -15141 40858 -4337 -39703 21269 27535 -36228 -12581 40095 -7469 -36866 24842 25868
371 25868 -35224 -7178 40485 -9762 -33719 26895 21503 -36848 -4722 37451 -14816 -32379
383 -32379 27844 17159 -37292 -409 37124 -16536 -28034 31288 15186 -36258 3759 35818
395 35818 -19585 -26153 31350 10325 -37511 5498 32748 -22649 -23410 32467 7580 -35564 10062
408 10062 31983 -23300 -18924 33891 4382 -34689 12487 28475 -26637 -17107 32902 -329
420 -329 -34457 14963 26133 -27796 -12931 34432 -2100 -31722 18778 24600 -28609 -9820 33790
433 33790 -5952 -31285 19573 20459 -30780 -7644 32567 -9003 -28951 22308 18607 -30094 -3040
446 -3040 32925 -10834 -26108 24363 15372 -31155 -856 30699 -14753 -25099 24901 11766
458 11766 -31588 2263 30020 -16172 -21588 27356 10095 -30355 5753 28805 -18256 -19597
470 -19597 27293 6103 -31001 7120 25928 -20799 -17423 27776 3663 -29482 10573 25205
482 25205 -21172 -13762 28988 1439 -28493 12598 22686 -23463 -12313 28054 -2187 -28289
494 -28289 14135 20476 -24347 -9216 28726 -3671 -25833 17008 19027 -24550 -6304 28106
506 28106 -6619 -24946 17742 15524 -26154 -4478 26805 -9315 -23140 19714 13745 -25693
518 -25693 -806 27057 -10684 -20662 21481 11338 -26199 1126 25245 -13645 -19690 21658
530 21658 8210 -26471 3389 24143 -14898 -16769 23273 6602 -25149 6414 23039 -16375
542 -16375 -14620 23406 3323 -25409 7857 20569 -18664 -12751 23733 920 -24354 10673
554 10673 19743 -19142 -9692 24709 -860 -23269 12437 17657 -20659 -8275 23700 -3820 -22826
567 -22826 13434 15400 -21317 -5721 23781 -5246 -20611 15749 14041 -21300 -3029 23366
579 23366 -7535 -19578 16566 11230 -22525 -1452 22239 -9838 -18207 17918 9587 -22186 1286
592 1286 22155 -10815 -16058 19115 7707 -22107 2919 20453 -12906 -14897 18979 4936 -22063
605 -22063 4733 19123 -14034 -12378 20112 3347 -20876 7377 18156 -15182 -10366 20361
617 20361 789 -20895 8580 16144 -16911 -8920 20313 -1205 -19992 10480 15138 -17108 -6413
630 -6413 20724 -2598 -18674 11915 13305 -17997 -4906 19818 -5047 -18047 12781 11222 -18642
643 -18642 -2788 19733 -6480 -16327 14696 10030 -18695 -533 19491 -8212 -15376 15391 7880
656 7880 -19491 648 18416 -9946 -14282 16104 6411 -19040 2725 18029 -10624 -12286 16967
669 16967 4837 -18684 4267 16657 -12215 -11143 16930 2554 -18686 5676 15512 -13241
681 -13241 -9332 17694 1306 -17785 7580 14751 -13903 -7721 17754 -502 -17511 8396 13006
694 13006 -14980 -6522 17319 -2161 -16542 9712 11857 -15018 -4351 17428 -3360 -15180
706 -15180 11000 10274 -15578 -2819 16720 -5382 -14527 11734 8446 -16136 -1157 16420 -6613
719 -6613 -13111 13023 7337 -15951 647 15988 -7805 -12038 13441 5527 -16224 1709 14822
732 14822 -9186 -10899 13872 4043 -15813 3488 14310 -9887 -9146 14666 2697 -15472 4929
745 4929 13285 -11170 -8157 14702 837 -15494 6003 12260 -12005 -6757 15099 -218 -14680
758 -14680 7413 11525 -12374 -5313 15060 -1598 -14173 8135 10052 -13113 -4199 14618 -3057
771 -3057 -13392 9158 8957 -13252 -2485 14655 -4071 -12334 10186 7780 -13630 -1300 14107
784 14107 -5505 -11748 10631 6354 -13899 -108 13643 -6394 -10558 11426 5373 -13553 1371
797 1371 13166 -7253 -9433 11785 3850 -13612 2432 12155 -8445 -8405 12116 2425 -13343 3840
811 3840 11549 -9146 -6981 12673 1247 -12980 5044 10670 -10041 -5985 12644 -211 -12773
824 -12773 5931 9647 -10654 -4738 12772 -1258 -11988 7090 8847 -10951 -3376 12730 -2473
837 -2473 -11414 7851 7598 -11557 -2330 12403 -3751 -10801 8664 6611 -11763 -1017 12309
850 12309 -4619 -9932 9430 5624 -11922 21 11830 -5643 -9259 9774 4414 -12008 1045
863 1045 11298 -6431 -8227 10331 3441 -11724 2300 10795 -7188 -7205 10675 2200 -11674 3252
877 3252 9990 -8102 -6322 10875 1046 -11430 4274 9382 -8594 -5194 11137 112 -10964
890 -10964 5200 8573 -9139 -4219 11018 -1077 -10567 5901 7582 -9583 -3116 10952 -2086
903 -2086 -9889 6812 6743 -9858 -1962 10851 -3092 -9352 7457 5749 -10255 -1051 10569 -4051
917 -4051 -8743 8030 4886 -10296 10 10318 -4748 -7903 8575 3953 -10271 981 9793
930 9793 -5585 -7143 8861 2834 -10278 1913 9230 -6362 -6262 9279 1886 -10117 2932
943 2932 8777 -6992 -5416 9566 927 -10004 3693 8152 -7600 -4666 9653 27 -9691 4479
957 4479 7554 -7947 -3684 9737 -788 -9206 5235 6794 -8345 -2794 9630 -1784 -8836
970 -8836 5859 5969 -8753 -1931 9583 -2598 -8352 6540 5327 -8963 -1055 9492 -3320
983 -3320 -7870 6993 4558 -9121 -337 9143 -4014 -7278 7314 3747 -9043 524 8761 -4576
997 -4576 -6480 7675 2916 -8943 1361 8278 -5272 -5796 7938 1966 -8918 2145 7797 -5863
1011 -5863 -5056 8202 1204 -8692 2950 7331 -6280 -4253 8292 382 -8392 3567 6608 -6708
1025 -6708 -3477 8214 -524 -7996 4248 5890 -7046 -2516 8233 -1380 -7536 5000 5193 -7446
1039 -7446 -1661 8220 -2263 -7222 5600 4504 -7781 -889 8165 -2969 -6749 6172 3886 -7895
1053 -7895 -76 7983 -3598 -6192 6544 3109 -7989 641 7609 -4288 -5641 6880 2314 -8039
1067 -8039 1413 7341 -4881 -5051 7273 1671 -8036 2107 7067 -5410 -4564 7501 1034 -7986
1081 -7986 2619 6699 -5727 -4012 7559 502 -7687 3135 6242 -5925 -3330 7484 -164
1094 -164 -7322 3599 5552 -6224 -2637 7363 -913 -6958 4126 4937 -6452 -1892 7320 -1532
1108 -1532 -6527 4629 4365 -6611 -1226 7129 -2140 -6095 4925 3655 -6645 -549 6780 -2699
1122 -2699 -5466 5253 2917 -6568 272 6427 -3306 -4768 5613 2085 -6602 1073 6062 -4013
1136 -4013 -4198 5969 1301 -6653 1814 5803 -4566 -3622 6327 688 -6590 2458 5466 -5007 -3111
1151 -3111 6427 33 -6470 2956 4989 -5378 -2512 6500 -600 -6244 3542 4580 -5700 -1880
1165 -1880 6631 -1221 -6064 4076 4157 -6048 -1377 6674 -1767 -5882 4479 3806 -6223 -889 6647
1180 6647 -2127 -5564 4754 3392 -6228 -447 6380 -2534 -5184 4875 2796 -6210 38 6064
1194 6064 -2937 -4700 5089 2246 -6132 641 5794 -3336 -4173 5314 1679 -6068 1161 5454 -3736
1209 -3736 -3702 5397 1109 -5892 1629 5053 -3977 -3103 5430 554 -5583 2146 4551 -4261 -2474 5388
1225 5388 -159 -5348 2643 3982 -4630 -1814 5447 -835 -5069 3260 3540 -4932 -1160 5527 -1424
1240 -1424 -4831 3730 3059 -5199 -653 5458 -1989 -4583 4084 2593 -5357 -101 5387 -2437 -4203
1255 -4203 4444 2134 -5421 453 5249 -2937 -3888 4757 1609 -5572 940 5103 -3372 -3572 5040
1270 5040 1233 -5581 1395 4979 -3655 -3219 5175 856 -5544 1705 4681 -3933 -2929 5156 412
1285 412 -5396 2024 4356 -4075 -2428 5198 23 -5132 2441 4014 -4256 -1955 5161 -477 -4929
1300 -4929 2753 3573 -4465 -1490 5095 -938 -4629 3101 3165 -4524 -969 4987 -1334 -4284 3373 2648
1316 2648 -4615 -499 4750 -1842 -3930 3605 2099 -4660 85 4587 -2263 -3474 3956 1630 -4666
1331 -4666 651 4391 -2717 -3099 4163 1090 -4737 1092 4143 -3109 -2725 4360 642 -4643 1581
1346 1581 3949 -3380 -2276 4510 202 -4563 1975 3622 -3720 -1916 4555 -311 -4492 2352 3325
1361 3325 -3954 -1478 4661 -673 -4292 2756 3070 -4114 -1094 4639 -1075 -4162 2963 2686 -4296
1376 -4296 -767 4557 -1441 -3916 3239 2382 -4296 -315 4481 -1716 -3591 3455 1993 -4346 62
1391 62 4282 -2107 -3312 3601 1565 -4352 466 4116 -2375 -2932 3799 1197 -4283 876 3872 -2672
1407 -2672 -2600 3846 713 -4251 1180 3550 -2964 -2247 3910 328 -4085 1606 3337 -3121 -1760 4027
1423 4027 -60 -3916 1977 3003 -3382 -1410 4004 -537 -3794 2268 2653 -3557 -988 4028 -885
1438 -885 -3541 2619 2371 -3659 -578 3957 -1279 -3373 2809 1959 -3836 -263 3836 -1634 -3122 3074
1454 3074 1663 -3821 190 3788 -1894 -2805 3283 1320 -3861 503 3590 -2241 -2589 3367 907
1469 907 -3860 854 3407 -2468 -2229 3549 618 -3751 1235 3235 -2680 -1919 3592 210 -3724 1470
1485 1470 2922 -2935 -1631 3609 -112 -3560 1803 2728 -3008 -1218 3656 -426 -3365 2065 2406
1500 2406 -3207 -937 3531 -846 -3241 2254 2052 -3299 -548 3525 -1092 -2939 2563 1830 -3295
1515 -3295 -165 3454 -1398 -2756 2687 1444 -3415 93 3259 -1712 -2518 2830 1135 -3362 480
1530 480 3168 -1902 -2168 3005 806 -3332 787 2917 -2228 -1954 3033 393 -3337 1080 2745 -2403
1546 -2403 -1604 3199 181 -3185 1447 2631 -2538 -1316 3240 -158 -3149 1593 2320 -2760 -1115
1561 -1115 3179 -469 -2985 1858 2129 -2802 -712 3221 -718 -2784 2096 1842 -2956 -488 3110
1576 3110 -1079 -2737 2224 1558 -3044 -214 3109 -1229 -2487 2466 1441 -2997 75 3047 -1422
1591 -1422 -2318 2492 1092 -3070 243 2811 -1685 -2105 2580 824 -2973 616 2728 -1807 -1749 2749
1607 2749 561 -2910 859 2515 -2070 -1600 2714 200 -2939 1050 2318 -2211 -1328 2796 37
1622 37 -2730 1344 2182 -2257 -1013 2764 -284 -2624 1467 1801 -2440 -763 2664 -629 -2432 1761
1638 1761 1600 -2454 -321 2746 -838 -2212 2030 1365 -2616 -114 2643 -1182 -2197 2094 1086
1653 1086 -2716 81 2601 -1332 -1957 2283 938 -2636 394 2522 -1521 -1760 2338 600 -2695
1668 -2695 587 2300 -1815 -1566 2439 344 -2660 920 2297 -1910 -1301 2639 213 -2632 1097
1683 1097 2168 -2086 -1227 2575 -58 -2656 1145 1978 -2161 -1024 2580 -171 -2416 1381 1826 -2129
1699 -2129 -708 2513 -449 -2290 1480 1483 -2299 -534 2403 -734 -2154 1681 1346 -2288 -209 2454
1715 2454 -822 -1947 1833 1184 -2304 -70 2289 -1041 -1848 1795 865 -2294 145 2125 -1178 -1523
1731 -1523 1950 660 -2137 516 2007 -1388 -1249 2045 282 -2228 718 1792 -1710 -1123 2123
1746 2123 17 -2226 985 1791 -1784 -879 2278 -81 -2158 1162 1644 -1912 -747 2199 -378 -2122
1762 -2122 1268 1396 -2017 -492 2239 -549 -1905 1571 1310 -2055 -200 2295 -781 -1894 1678
1777 1678 1090 -2291 -158 2225 -1011 -1899 1774 1015 -2250 37 2264 -990 -1689 1845 901 -2171
1793 -2171 156 2060 -1159 -1559 1771 576 -2155 332 1873 -1291 -1280 1935 425 -2009 650 1845
1809 1845 -1395 -1074 1970 198 -2065 709 1625 -1581 -1008 1909 4 -1961 866 1519 -1538 -691
1825 -691 1931 -114 -1733 1034 1272 -1610 -478 1775 -493 -1666 1154 956 -1770 -219 1818 -685
1841 -685 -1481 1476 908 -1797 68 1900 -860 -1447 1552 710 -1946 101 1772 -1052 -1383 1597
1857 1597 577 -1874 349 1766 -1078 -1121 1743 430 -1825 541 1605 -1336 -1053 1723 104 -1948
1873 -1948 655 1514 -1489 -905 1903 56 -1872 905 1577 -1493 -788 1915 -62 -1867 881 1369
1889 1369 -1605 -735 1783 -222 -1749 981 1259 -1500 -425 1825 -287 -1507 1149 1073 -1592 -281
1905 -281 1692 -589 -1538 1161 812 -1728 -154 1678 -692 -1382 1364 804 -1601 71 1680 -751
1921 -751 -1236 1348 572 -1654 117 1446 -937 -1108 1349 362 -1564 404 1400 -998 -795 1542 199
1938 199 -1524 621 1286 -1233 -756 1526 -80 -1638 697 1190 -1371 -624 1629 -119 -1510 912
1954 912 1191 -1329 -446 1623 -254 -1470 922 948 -1476 -393 1492 -487 -1395 1056 837 -1463 -114
1971 -114 1603 -537 -1232 1255 772 -1529 -10 1543 -741 -1281 1220 589 -1620 34 1497 -777
1987 -777 -1116 1330 583 -1462 232 1448 -808 -970 1292 345 -1492 277 1219 -1012 -892 1284 153
2004 153 -1445 490 1215 -1038 -642 1435 90 -1363 649 1131 -1141 -587 1382 -122 -1403 667
2020 667 971 -1205 -462 1377 -175 -1219 853 918 -1147 -231 1375 -327 -1156 893 665 -1317 -191
2037 -191 1254 -563 -1131 993 588 -1314 42 1359 -590 -975 1173 553 -1318 131 1283 -750
2053 -750 -989 1101 350 -1388 178 1202 -804 -816 1206 308 -1237 410 1172 -832 -669 1232 115
2070 115 -1294 450 1014 -1025 -653 1208 -28 -1289 571 1001 -1010 -469 1329 -36 -1192 707
2086 707 941 -1070 -423 1214 -235 -1219 654 740 -1135 -311 1205 -286 -1036 849 719 -1053 -90
2103 -90 1231 -375 -973 890 559 -1198 -81 1126 -562 -970 918 470 -1169 84 1167 -549
2119 -549 -800 1032 419 -1121 181 1041 -694 -783 960 180 -1196 221 936 -788 -646 1064 144
2136 144 -1077 460 978 -792 -492 1129 24 -1104 485 826 -954 -479 1059 -130 -1094 573
2152 573 796 -924 -288 1156 -123 -952 722 730 -969 -215 1061 -340 -986 694 518 -1096 -147 1054
2170 1054 -435 -893 866 546 -1028 53 1135 -468 -827 900 408 -1119 32 996 -633 -831
2186 -831 891 325 -1090 191 1029 -589 -625 1017 289 -1020 310 944 -729 -618 959 84 -1106
2203 -1106 324 851 -808 -538 1020 61 -1017 495 883 -775 -390 1056 -26 -994 487 701 -900
2220 -900 -395 929 -199 -966 540 627 -870 -182 1031 -189 -794 724 603 -888 -83 975 -368
2237 -368 -850 691 424 -1002 -49 932 -443 -748 814 422 -906 125 952 -464 -644 820 254
2254 254 -982 131 800 -655 -629 815 108 -977 297 828 -655 -441 988 115 -922 431 819
2271 819 -758 -453 955 -38 -1009 405 718 -815 -394 958 -68 -887 558 726 -772 -236 992
2288 992 -142 -852 572 565 -892 -241 890 -322 -890 609 505 -914 -97 987 -295 -759 745
2305 745 518 -881 -44 936 -398 -777 680 365 -951 -22 842 -442 -657 756 329 -822 165 846
2323 846 -455 -520 798 195 -864 198 726 -619 -535 777 71 -884 295 715 -615 -383 878 63
2341 63 -804 397 669 -670 -345 794 -98 -825 382 522 -744 -257 802 -175 -717 560 531 -711
2359 -711 -73 877 -230 -690 632 413 -840 -82 813 -389 -733 640 354 -869 13 869 -372 -611
2377 -611 742 358 -821 89 792 -467 -604 679 182 -886 114 724 -542 -526 767 183 -804 279
2395 279 786 -546 -443 832 125 -854 286 704 -656 -465 768 12 -847 319 664 -615 -332 816
2413 816 18 -733 401 592 -629 -276 741 -131 -746 406 439 -723 -218 733 -214 -660 535 453 -686
2432 -686 -51 806 -233 -615 566 363 -765 -56 688 -371 -620 556 276 -729 61 716 -346 -452
2450 -452 666 249 -692 187 687 -465 -450 651 80 -781 203 590 -569 -404 721 56 -734 331
2468 331 645 -558 -321 778 10 -753 331 563 -646 -344 705 -96 -749 378 527 -632 -199 780
2486 780 -82 -645 483 506 -640 -131 744 -220 -689 472 392 -749 -133 720 -271 -633 543 396 -683
2505 -683 -28 745 -271 -561 561 308 -728 -9 632 -390 -558 533 196 -704 90 642 -384 -408
2523 -408 654 190 -647 204 633 -446 -389 632 57 -714 196 544 -533 -348 646 13 -649 309 544
2542 544 -511 -235 689 -30 -636 333 449 -601 -236 614 -167 -637 379 381 -611 -124 682 -172 -559 492
2562 492 391 -616 -51 665 -256 -571 481 292 -692 -32 646 -311 -524 547 302 -628 89 674 -304
2581 -304 -438 572 214 -674 89 582 -426 -464 544 102 -697 143 571 -440 -366 631 118 -634 240
2600 240 567 -471 -327 610 18 -662 236 484 -521 -285 608 -17 -577 326 481 -484 -168 652 -51
2619 -51 -540 381 392 -552 -166 580 -166 -562 379 319 -582 -92 606 -196 -480 450 319 -555 -18 589 -249
2640 -249 -482 447 215 -614 -6 535 -318 -423 495 191 -559 128 566 -310 -323 544 130 -583 154 493
2660 493 -414 -348 541 46 -605 202 490 -423 -275 592 45 -534 277 469 -456 -231 559 -57 -581 266
2680 266 376 -523 -200 556 -114 -536 353 375 -502 -96 606 -109 -492 402 342 -533 -96 567 -202 -508 391
2701 391 277 -549 -40 580 -198 -429 457 271 -514 33 544 -257 -409 429 158 -568 34 479 -345 -386
2721 -386 472 125 -540 129 499 -337 -316 520 97 -541 149 445 -393 -300 489 33 -524 197 418 -377 -197
2742 -197 520 28 -453 266 388 -410 -142 510 -93 -479 290 307 -492 -128 498 -163 -473 354 303 -488 -55
2763 -55 546 -159 -433 390 264 -507 -35 501 -219 -414 385 209 -518 20 487 -247 -356 462 182 -489
2783 -489 109 492 -304 -336 471 111 -542 112 461 -358 -338 491 104 -531 157 491 -344 -291 498 78 -513
2804 -513 155 419 -388 -277 462 -2 -505 184 359 -388 -193 506 -24 -453 277 372 -399 -133 503 -70
2824 -70 -457 285 308 -455 -136 476 -102 -435 302 303 -411 -73 466 -107 -376 319 230 -418 -30 409 -208 -362
2846 -362 309 134 -455 24 399 -253 -299 407 135 -443 102 435 -291 -282 413 86 -472 116 400 -305 -257
2867 -257 416 68 -434 167 386 -301 -187 431 14 -425 205 328 -367 -175 424 -69 -439 239 305 -428
2887 -428 -142 477 -74 -436 293 327 -413 -123 483 -91 -438 262 282 -424 -115 438 -114 -391 285 252 -384
2908 -384 -32 448 -115 -323 341 213 -405 -11 426 -196 -346 329 163 -441 16 410 -226 -321 360 165
2928 165 -401 40 390 -218 -284 333 101 -408 51 330 -256 -253 333 50 -379 115 317 -263 -173 374 6
2949 6 -359 193 306 -311 -143 389 -34 -375 201 275 -332 -115 386 -46 -356 229 257 -333 -81 384 -100
2970 -100 -345 247 192 -363 -67 354 -161 -331 279 166 -370 11 384 -172 -287 337 165 -394 36 390
2990 390 -202 -303 340 144 -396 49 391 -195 -258 353 130 -379 74 355 -218 -241 337 79 -379 86 311
3011 311 -269 -217 337 25 -386 127 297 -290 -180 369 16 -363 153 293 -288 -155 347 -13 -350 176
3031 176 260 -300 -117 344 -48 -307 207 232 -285 -51 344 -83 -280 243 183 -323 -24 327 -142 -285 249
3052 249 151 -330 12 341 -158 -259 280 134 -345 23 314 -194 -256 277 92 -350 52 298 -217 -195 310
3073 310 73 -323 118 302 -225 -154 334 33 -325 150 289 -262 -155 345 0 -345 156 278 -279 -127
3093 -127 346 -12 -338 172 246 -289 -126 340 -58 -321 177 207 -306 -88 329 -84 -288 218 205 -298 -45
3114 -45 339 -98 -274 243 175 -317 -21 325 -127 -262 237 150 -289 14 330 -128 -224 274 121 -302 32
3135 32 279 -176 -220 265 57 -317 45 254 -200 -186 265 40 -306 89 262 -218 -149 290 14 -293 117
3156 117 241 -231 -128 298 -5 -283 147 226 -247 -97 306 -31 -272 182 196 -243 -59 297 -70 -260 192
3177 192 175 -292 -46 289 -102 -249 210 149 -286 -30 288 -121 -252 216 120 -304 -11 282 -141 -234 229
3198 229 113 -290 28 282 -138 -192 258 98 -271 48 270 -162 -176 261 65 -285 76 247 -183 -157 268
3219 268 42 -281 92 236 -195 -140 261 15 -268 107 212 -216 -130 243 -6 -266 114 186 -221 -93 270
3240 270 -32 -231 171 187 -211 -50 271 -58 -223 182 154 -231 -30 252 -79 -208 187 139 -233 -9 254
3261 254 -89 -196 192 93 -252 10 222 -128 -188 200 69 -258 36 225 -142 -163 217 64 -252 58 215
3282 215 -151 -139 231 38 -242 74 220 -167 -119 257 40 -242 100 214 -170 -106 255 18 -228 117 198
3303 198 -194 -94 237 -28 -238 118 166 -213 -90 232 -42 -224 140 148 -223 -65 225 -53 -229 150 141 -229
3325 -229 -38 232 -66 -198 164 124 -208 -9 234 -59 -173 169 119 -206 -2 219 -101 -153 172 81 -209
3346 -209 22 206 -113 -152 174 47 -221 42 178 -142 -148 188 24 -220 52 169 -147 -116 190 15 -204
3367 -204 91 174 -151 -84 209 1 -190 114 150 -166 -67 219 -30 -191 129 128 -189 -52 198 -46 -183 127
3389 127 129 -196 -36 205 -63 -185 131 99 -209 -22 189 -98 -176 143 101 -209 -6 196 -88 -162 157 73
3411 73 -200 19 195 -100 -140 182 73 -207 32 202 -107 -115 184 68 -194 41 178 -118 -127 170 37 -203
3433 -203 46 152 -141 -114 163 7 -202 60 148 -155 -94 169 0 -174 81 137 -146 -75 172 -25 -163 100
3455 100 122 -147 -49 177 -24 -148 123 115 -155 -23 175 -40 -134 113 81 -156 -5 166 -77 -140 133 59 -177
3478 -177 -1 163 -98 -135 133 51 -184 19 156 -105 -126 148 39 -181 45 157 -106 -92 168 39 -178
3499 -178 53 164 -109 -93 169 27 -164 76 146 -118 -86 167 8 -166 78 130 -136 -82 169 -17 -168 72
3521 72 123 -158 -76 160 -22 -173 82 95 -154 -53 153 -38 -155 100 94 -150 -33 153 -40 -131 114 83 -146
3544 -146 -3 163 -51 -116 117 61 -149 0 156 -62 -106 123 60 -143 10 134 -85 -110 127 28 -154 21
3566 21 120 -121 -106 121 11 -164 41 118 -114 -80 134 4 -149 52 118 -114 -69 152 7 -141 89 120 -122
3589 -122 -45 161 -10 -137 91 105 -127 -39 143 -32 -141 88 88 -153 -32 141 -48 -142 94 73 -148 -23
3611 -23 140 -55 -134 103 61 -154 -5 140 -75 -123 128 59 -135 9 139 -72 -100 120 54 -138 30 139
3633 139 -70 -78 133 42 -132 43 119 -93 -80 124 18 -129 47 102 -113 -69 122 -17 -147 49 100 -115 -54
3656 -54 116 -21 -131 67 91 -116 -39 137 -15 -128 92 89 -123 -23 145 -30 -110 91 78 -120 2 146
3678 146 -38 -102 105 64 -122 4 132 -63 -106 104 38 -150 -2 117 -80 -113 95 30 -145 12 108 -93
3700 -93 -87 112 28 -138 27 110 -77 -71 123 19 -124 44 117 -86 -68 134 24 -113 47 113 -84 -49 130 12
3724 12 -120 53 87 -92 -47 118 -13 -116 74 91 -95 -38 115 -26 -121 64 64 -116 -30 119 -38 -111 74
3747 74 56 -112 -12 121 -36 -84 82 66 -99 10 125 -38 -75 101 49 -110 6 110 -69 -86 97 32 -114
3770 -114 16 109 -68 -73 93 20 -117 29 95 -78 -62 104 14 -126 29 89 -86 -67 99 8 -113 52 94 -74
3794 -74 -35 129 10 -99 63 98 -77 -24 125 5 -106 66 76 -93 -26 130 -18 -102 71 68 -97 -29 94
3817 94 -38 -107 67 49 -103 -16 107 -44 -82 72 53 -97 -9 105 -33 -69 82 55 -99 20 106 -44 -68 85
3841 85 52 -95 25 99 -42 -56 92 35 -88 30 80 -61 -63 71 18 -102 16 65 -82 -58 84 -5 -105 28
3865 28 74 -68 -51 85 -12 -90 35 61 -76 -37 84 -3 -80 44 67 -64 -15 101 -15 -75 59 63 -70 -13 93
3890 93 -28 -69 71 53 -69 -12 93 -34 -70 68 40 -98 -14 86 -55 -81 62 32 -103 -3 83 -57 -74 71
3914 71 17 -87 15 76 -50 -49 83 35 -75 42 97 -52 -36 104 24 -80 35 80 -44 -36 91 4 -81 31 80
3939 80 -64 -36 91 11 -81 36 59 -63 -36 74 -10 -76 36 52 -71 -18 80 -19 -71 53 54 -72 -12 86 -25 -65
3965 -65 65 54 -64 -3 90 -17 -42 69 50 -62 17 80 -24 -57 63 25 -81 14 61 -51 -61 63 7 -82 15
3990 15 63 -62 -51 78 4 -80 25 68 -49 -35 74 7 -89 27 59 -56 -28 78 10 -63 48 66 -60 -18 86
4015 86 10 -66 58 71 -65 -14 79 -6 -72 52 52 -75 -26 64 -28 -83 43 36 -78 -25 59 -36 -76 48 42 -63 -23 70
4043 70 -28 -55 56 27 -64 4 75 -26 -40 71 38 -64 12 78 -26 -49 62 30 -65 18 63 -38 -36 65 27 -74
4069 -74 8 57 -56 -41 48 -3 -73 9 37 -68 -44 55 -9 -73 27 43 -61 -28 66 -3 -72 45 60 -58 -10 93 0
4096 0 -49 64 57 -47 -12 80 -2 -49 65 49 -65 -8 69 -19 -59 50 18 -87 -16 66 -42 -65 46 8 -87 -10 76
4123 76 -43 -60 54 17 -79 6 70 -38 -55 63 33 -64 20 76 -27 -34 80 34 -62 30 74 -36 -31 75 16 -77 31
4150 31 62 -53 -36 66 0 -66 27 51 -59 -38 64 -5 -70 25 57 -61 -29 68 -14 -70 39 46 -55 -12 71 -9 -43
4177 -43 54 45 -45 5 89 -13 -37 61 39 -56 14 76 -33 -62 57 25 -71 9 76 -52 -51 57 14 -77 8 66 -56 -50 48
4206 48 3 -71 14 51 -45 -31 64 11 -64 40 58 -43 -28 82 4 -57 44 71 -51 -22 83 13 -56 49 69 -45
4232 -45 -13 74 -5 -60 45 51 -72 -21 64 -10 -66 37 26 -79 -21 46 -36 -61 37 18 -70 -6 70 -16 -42 62 39 -61
4260 -61 1 77 -14 -38 61 32 -46 18 73 -16 -29 70 23 -51 18 53 -41 -33 53 11 -64 12 44 -56 -41 49 -8 -67 18 46
4290 46 -52 -33 45 -6 -66 31 46 -55 -21 64 -3 -46 34 61 -42 -3 83 11 -40 60 56 -46 2 69 -17 -51 47 39 -63
4319 -63 -6 55 -31 -60 35 20 -64 -11 60 -29 -49 35 19 -74 -6 48 -32 -50 47 20 -54 13 64 -27 -27 64 24 -54 21 62 -27
4350 -27 -27 71 21 -45 40 70 -29 -27 51 7 -45 26 57 -40 -25 48 -4 -68 25 37 -49 -26 43 -19 -56 18 28 -60 -17 47 -16
4381 -16 -49 38 36 -41 1 74 -14 -42 57 46 -47 9 64 -17 -32 59 43 -36 7 69 -14 -31 50 13 -51 4 45 -21 -41 46 3
4412 3 -68 7 42 -48 -44 42 -1 -70 4 43 -38 -39 62 12 -52 26 54 -25 -30 70 21 -45 37 53 -34 -12 56 5 -40 38 42 -35
4444 -35 -10 63 -9 -49 36 35 -53 -15 53 -30 -54 25 33 -57 -13 47 -24 -45 28 20 -61 -12 46 -14 -35 41 33 -48 10 66 -12 -28
4476 -28 51 31 -45 22 54 -25 -14 59 27 -48 10 49 -36 -36 43 1 -66 6 43 -35 -46 31 -6 -59 8 30 -39 -20 37 -12 -49
4507 -49 27 36 -34 -13 42 0 -38 39 51 -38 0 70 7 -34 44 41 -32 1 55 1 -26 41 32 -38 1 39 -13 -34 29 13 -57 -1
4539 -1 38 -30 -31 33 14 -57 1 48 -27 -35 35 14 -42 11 45 -25 -16 51 23 -39 26 50 -7 -4 66 22 -28 30 52 -12 -2 50 6
4572 6 -39 28 35 -30 -15 43 -4 -52 16 25 -47 -22 44 -16 -48 26 25 -39 -9 49 -8 -39 23 24 -32 -2 48 -5 -18 52 32 -34 20
4605 20 52 -6 -19 42 26 -33 13 50 -28 -18 45 20 -39 -1 37 -25 -36 36 9 -53 -5 31 -38 -40 38 -7 -55 6 38 -32 -18
4636 -18 51 11 -41 35 44 -26 -8 59 17 -29 31 61 -37 -10 54 10 -30 36 43 -32 -10 49 3 -40 33 26 -35 -17 34 -25 -47 16
4668 16 12 -57 -9 43 -19 -36 36 17 -40 3 41 -35 -35 43 19 -47 12 49 -1 -21 56 32 -24 22 66 3 -19 48 27 -31 19
4699 19 45 -28 -23 34 4 -38 18 34 -35 -33 36 -5 -48 13 33 -48 -15 53 -2 -46 9 33 -31 -20 42 -4 -35 25 46 -14 6
4730 6 57 4 -29 53 42 -24 4 54 -14 -26 31 31 -35 3 47 -14 -39 34 18 -42 -4 32 -26 -43 16 13 -51 -19 24 -13 -26 42
4762 42 15 -40 12 45 -6 -14 45 25 -23 15 41 -20 -8 60 12 -32 25 40 -22 -11 46 -3 -38 13 40 -45 -11 35 -11 -37 17
4793 17 27 -47 -20 19 -16 -50 19 14 -46 -17 37 -14 -30 21 28 -31 2 48 -9 -26 44 37 -23 8 60 2 -17 41 33 -23 13 48
4825 48 -15 -16 39 3 -40 1 26 -23 -16 32 4 -47 5 34 -38 -37 25 -7 -53 8 30 -37 -10 43 -2 -32 18 35 -23 -11 43 11
4857 11 -16 27 46 -19 -6 58 15 -18 30 23 -26 -7 34 -7 -31 28 22 -38 -12 29 -22 -44 18 21 -44 -20 22 -25 -32 17 15 -44 3
4890 3 40 -6 -17 35 19 -39 16 47 -19 -8 50 27 -13 28 38 -6 -9 42 10 -31 31 31 -25 -12 43 -5 -30 19 29 -24 -19 22
4922 22 -7 -42 9 23 -47 -14 29 -18 -33 31 27 -19 4 46 5 -21 47 28 -29 9 38 -9 -7 38 21 -32 13 51 2 -21 44
4953 44 21 -38 13 43 -19 -28 32 10 -37 3 27 -40 -33 29 4 -43 1 24 -37 -24 36 -6 -35 13 37 -21 -7 46 9 -11 34
4984 34 52 -8 0 39 7 -10 40 35 -20 -10 34 -6 -28 24 14 -33 -16 17 -16 -35 19 8 -43 -13 25 -20 -33 14 8 -52 0 25
5016 25 -14 -17 31 18 -25 9 46 -6 -10 43 28 -17 21 40 -7 -2 46 17 -15 22 37 -13 -9 38 -2 -41 7 22 -34 -18 16 -14
5048 -14 -38 8 17 -33 -27 19 -1 -34 3 19 -24 -12 32 -4 -25 20 28 -26 -3 46 -4 -22 21 27 -24 5 45 2 -12 32 29 -28 15
5081 15 36 -4 -29 19 12 -36 2 25 -26 -28 10 8 -30 -4 22 -26 -20 12 7 -28 15 32 -13 -29 32 19 -24 26 35 -9 -4 47 11 -18
5115 -18 19 32 -19 -8 35 4 -30 6 36 -26 -7 29 -1 -37 0 15 -35 -18 24 -20 -43 18 20 -43 -16 28 -11 -35 23 2 -36
5146 -36 0 39 -2 -19 42 34 -11 4 55 0 -15 37 28 -17 13 47 -2 -20 26 15 -30 -1 31 -23 -26 18 4 -42 -12 28 -33 -32
5178 -32 23 -1 -38 -4 30 -28 -26 15 -10 -38 4 17 -19 0 34 11 -16 26 39 -18 -2 53 19 -21 22 27 -21 -2 38 0 -27
5209 -27 28 19 -28 -5 27 -6 -37 11 10 -45 -12 22 -19 -38 13 11 -28 -5 31 -8 -30 29 16 -42 12 36 7 -12 34 22 -25 22
5241 22 50 3 -8 42 15 -27 8 38 -8 -12 33 -1 -32 8 20 -31 -32 20 5 -43 2 13 -36 -26 34 -12 -43 14 16 -33 -15 36
5273 36 4 -34 26 27 -26 -2 42 8 -27 29 30 -19 1 47 -10 -21 30 22 -29 0 28 -24 -32 22 16 -42 -12 27 -19 -40 14 2 -40
5306 -40 13 26 -21 -28 26 13 -31 14 34 -27 -16 35 21 -17 15 56 -10 -1 51 22 -23 28 31 -17 -5 44 6 -22 12 32 -24 -29
5338 -29 46 1 -30 19 24 -19 -17 24 -7 -46 10 23 -31 -7 39 -6 -29 21 23 -29 2 40 -9 -22 41 34 -13 13 55 13 -23 38
5370 38 22 -7 23 40 2 -13 32 13 -23 6 25 -16 -22 31 5 -39 -5 24 -35 -19 20 5 -33 2 30 -27 -5 31 10 -30 21
5401 21 37 -18 0 41 14 -23 24 28 -11 0 54 17 -10 30 43 -13 3 43 -2 -33 26 13 -23 -9 34 -21 -37 21 13 -41 -21
5432 -21 32 -19 -32 24 4 -40 1 19 -11 -13 31 25 -21 15 36 -11 -13 44 23 -17 25 46 -19 3 40 19 -24 26 32 -8 -6 39 6
5465 6 -36 21 36 -24 -19 22 -10 -45 -1 18 -28 -19 23 -7 -42 13 18 -28 -15 34 -3 -25 21 30 -14 3 42 4 -22 32 22 -14 -2
5498 -2 53 4 -35 31 34 -23 -4 34 -11 -39 23 30 -32 -5 21 -16 -23 26 -2 -44 -11 16 -23 -21 13 10 -28 9 37 -18 -15 42 9 -22
5532 -22 13 29 -9 -11 45 18 -19 32 46 -5 -6 41 0 -22 17 21 -28 -19 23 -4 -42 5 13 -39 -18 25 -11 -37 12 16 -40 -13 24
5565 24 -18 -40 22 15 -28 3 40 -6 -20 32 20 -25 8 48 7 -10 42 25 -17 16 39 -3 -11 35 14 -27 -2 27 -30 -31 27 9
5597 9 -33 10 18 -15 -30 14 -7 -39 2 26 -11 -10 25 -5 -26 15 20 -16 -5 41 7 -25 22 27 -16 1 47 4 -11 24 45 -20 6
5630 6 44 0 -23 30 17 -19 -8 26 -8 -25 11 15 -42 -18 19 -21 -29 10 2 -45 -11 33 -10 -25 36 27 -26 7 53 -1 -8 49 25
5663 25 -21 16 34 -6 -10 34 15 -18 15 37 -13 -12 33 7 -36 7 33 -19 -18 25 10 -41 6 23 -33 -16 29 -9 -41 12 16 -20
5695 -20 -11 37 -4 -19 27 37 -14 0 49 20 -20 32 40 -11 6 35 8 -24 35 24 -27 1 41 -16 -27 13 10 -42 -2 27 -23 -25
5727 -25 26 8 -49 -7 25 -22 -30 28 6 -28 4 37 -13 -22 33 18 -24 12 46 -9 -8 38 17 -18 22 39 -9 -8 38 18 -31 13
5759 13 26 -32 -15 30 -8 -36 2 16 -36 -21 20 -7 -40 15 23 -21 -21 19 -14 -38 15 25 -26 -14 41 -3 -23 25 21 -22 12 45
5791 45 1 -20 33 34 -13 6 44 -8 -17 20 15 -36 -5 32 -20 -40 14 -2 -46 -4 12 -37 -30 14 -5 -49 -2 21 -25 -31 22 6 -33
5824 -33 15 29 -14 0 48 8 -24 20 42 -10 -6 50 21 -22 28 30 -33 -16 37 3 -41 23 26 -34 -11 25 -5 -37 19 26 -45 -18
5856 -18 32 -14 -42 29 12 -35 -6 26 -8 -36 28 27 -24 10 46 -14 -13 35 28 -17 15 41 -2 -17 34 17 -25 9 38 -10 -19 35
5888 35 8 -24 -5 29 -33 -45 21 4 -37 3 18 -29 -23 26 4 -32 9 34 -25 -19 30 8 -21 14 39 -14 -10 44 18 -21 35 44
5920 44 -12 1 44 17 -22 19 19 -24 -1 46 -7 -21 30 8 -25 -17 26 -19 -31 15 14 -33 -6 24 -15 -27 26 22 -26 4 28 -1
5952 -1 -24 42 20 -22 23 48 -1 -17 39 24 -20 21 42 -10 -5 40 12 -21 15 34 -24 -21 24 0 -33 12 22 -43 -30 27 -2 -47
5984 -47 1 16 -32 -19 34 -3 -26 15 27 -21 -4 44 10 -13 34 33 -16 16 52 4 -13 38 35 -5 11 40 1 -28 15 24 -22 4
6016 4 46 -4 -18 18 27 -31 2 40 -33 -38 24 4 -33 -7 29 -20 -30 33 11 -23 13 36 -7 -15 47 24 -17 21 53 2 5 49 18
6049 18 -30 17 37 -16 -15 38 12 -29 15 24 -29 -19 32 -6 -35 7 15 -33 -20 26 -15 -40 22 24 -28 -14 39 -16 -33 27 29 -21 9
6082 9 42 -6 -23 39 33 -7 11 43 -5 -9 34 18 -25 -1 32 -17 -28 25 19 -37 -8 24 -31 -21 28 4 -36 -4 19 -28 -33 10 4
6115 4 -44 10 19 -13 -16 40 8 -28 23 35 -11 -4 42 18 -13 33 37 -18 0 47 11 -27 31 25 -26 -12 29 -10 -35 16 7 -32 -12 29
6149 29 -13 -38 10 7 -49 -23 25 -15 -35 19 20 -30 6 36 -9 -29 38 9 -23 15 50 1 -6 41 31 -18 14 42 -9 -15 40 20
6181 20 -15 4 29 -21 -25 24 12 -37 0 15 -42 -20 20 -13 -53 -1 16 -27 -22 25 -11 -40 14 26 -20 -3 46 24 -16 23 35
6212 35 -20 2 57 12 -20 41 32 -14 0 45 5 -19 25 22 -23 -8 27 -8 -31 15 8 -34 -16 27 -15 -23 20 9 -33 -5 18 -17
6244 -17 -30 24 12 -36 5 36 -11 -22 41 29 -27 19 50 -3 -6 40 29 -18 12 45 -12 -15 33 2 -27 11 31 -33 -31 27 -7 -53
6276 -53 4 29 -23 -26 32 -9 -40 15 22 -29 -23 26 -8 -31 11 27 -13 -5 47 4 -10 39 25 -22 14 43 5 -7 45 32 -18 5
6308 5 41 -5 -28 28 15 -35 -7 25 -26 -30 24 11 -45 -9 22 -26 -39 20 3 -41 -5 37 -15 -18 46 11 -22 8 36 1 -18 49
6340 49 6 -21 25 44 -24 -1 47 19 -26 25 35 -12 -14 33 -3 -34 5 17 -44 -16 27 -23 -43 4 26 -43 -18 39 -12 -51 11
6371 11 19 -29 -13 34 1 -36 41 35 -22 11 50 0 -17 38 26 -19 4 54 8 -12 33 9 -25 8 34 -21 -24 26 12 -37 -1 27
6403 27 -26 -31 23 9 -44 -1 31 -25 -30 24 1 -34 8 41 -24 -20 38 5 -19 31 48 -13 -5 48 27 -13 25 40 -18 -5 51 5
6435 5 -24 20 27 -30 -17 24 -8 -46 7 18 -38 -15 27 -13 -37 21 9 -39 -8 26 -16 -29 25 17 -47 1 37 0 -18 30 24 -19
6467 -19 18 44 -6 -15 34 17 -23 12 44 -14 -13 40 13 -42 10 34 -22 -31 19 -8 -55 -8 22 -39 -27 22 -11 -49 2 29 -35 -20
6499 -20 37 -2 -35 20 27 -23 -8 49 6 -15 31 36 -19 -3 48 0 -24 35 32 -28 2 47 -7 -26 31 13 -38 -12 27 -24 -37 5
6531 5 0 -47 -18 24 -33 -38 15 5 -39 -1 21 -19 -29 33 18 -32 13 51 -11 -12 53 16 -22 23 47 -11 -17 41 10 -22 15 41 -12
6564 -12 -18 29 -3 -33 17 24 -33 -19 24 -9 -51 2 16 -39 -24 36 -11 -35 17 24 -38 -3 37 -3 -27 24 21 -21 -1 53 4 -20
6596 -20 50 28 -23 15 52 -9 -19 29 21 -37 3 42 -13 -41 30 4 -50 -3 27 -28 -35 19 -1 -50 1 25 -28 -34 27 -1 -33 9
6628 9 31 -21 -3 39 6 -26 14 29 -17 -5 45 11 -16 28 48 -17 -1 51 16 -28 20 29 -41 -9 33 -4 -27 7 10 -43 -16 21
6660 21 -27 -39 7 15 -45 -12 29 -23 -34 24 20 -40 2 47 -2 -28 41 16 -24 19 48 -8 -10 37 34 -31 14 40 -8 -29 34 28 -42
6693 -42 2 34 -28 -29 21 -3 -33 -3 22 -40 -38 28 -14 -47 2 19 -18 -14 32 -1 -32 19 44 -23 -5 40 7 -35 28 47 -10 3
6725 3 52 0 -32 21 28 -28 -8 36 -13 -26 19 23 -41 -4 32 -23 -39 31 8 -43 -12 18 -33 -48 15 8 -39 1 27 -25 -29 32 11
6758 11 -33 13 36 -9 -14 49 20 -33 24 59 -12 -15 52 10 -32 28 35 -27 -21 41 -1 -46 7 27 -31 -13 29 -7 -45 7 14 -45 -29
6791 -29 30 -6 -43 13 29 -33 -17 46 -5 -24 22 29 -30 8 50 12 -30 43 32 -26 17 52 0 -20 45 15 -41 2 40 -18 -40
6822 -40 16 14 -50 -18 23 -30 -33 22 -3 -51 0 21 -28 -37 35 8 -40 7 47 -14 -22 46 10 -27 23 42 -5 -12 51 13 -29 26 49
6855 49 -14 -12 46 5 -28 20 25 -41 -17 32 -8 -50 18 18 -50 -22 16 -17 -56 15 17 -56 -11 32 -19 -44 27 20 -37 9 42 13 -16
6888 -16 41 32 -27 8 52 -10 -21 45 13 -32 17 43 -11 -23 37 0 -52 -1 27 -38 -36 35 2 -46 -3 30 -38 -38 27 -6 -48 4
6920 4 22 -43 -20 29 -6 -40 19 40 -32 -3 56 9 -32 38 43 -29 -4 53 -3 -32 22 35 -32 -11 41 -12 -33 22 20 -48 -18 37
6952 37 -19 -49 28 10 -48 -1 37 -27 -28 29 15 -45 -5 32 -13 -23 42 19 -36 9 57 -11 -20 54 31 -20 28 51 -20 -23 46 20
6984 20 -33 7 29 -28 -22 32 0 -45 3 25 -28 -24 38 -12 -54 12 24 -44 -15 32 -15 -40 26 23 -41 -15 42 -4 -33 39 33 -23
7016 -23 2 52 -8 -34 31 36 -23 0 49 -14 -19 42 21 -40 9 46 -16 -44 29 6 -63 -4 28 -33 -45 17 -1 -55 -4 31 -29
7047 -29 -23 31 3 -49 7 30 -23 -21 49 9 -36 35 47 -15 -5 41 12 -35 21 46 -31 -6 45 -8 -36 29 39 -40 -17 24 -14
7078 -14 -52 17 23 -48 -28 29 -18 -52 12 19 -49 -21 40 -25 -34 41 19 -39 -1 51 -13 -19 55 31 -26 14 65 0 -16 56 21 -30
7110 -30 8 45 -17 -16 39 17 -38 4 39 -34 -35 32 1 -59 4 25 -49 -27 31 -2 -50 6 35 -30 -33 36 1 -49 19 26 -31 -2
7142 -2 49 -2 -38 25 41 -36 -5 50 -3 -41 40 36 -37 1 55 -12 -43 32 17 -48 -11 23 -26 -55 17 -7 -49 -12 14 -27 -40
7173 -40 28 8 -52 6 35 -30 -27 37 7 -48 12 60 -19 -16 45 25 -31 21 57 -19 -17 44 8 -50 17 41 -37 -26 34 -5 -51 12
7205 12 26 -41 -24 26 -14 -64 9 14 -49 -22 39 -12 -45 16 36 -36 -8 41 -6 -36 28 31 -33 -2 50 -12 -23 49 25 -37 1
7236 1 57 -5 -31 41 24 -44 2 44 -25 -44 35 12 -45 -2 27 -38 -44 20 -2 -70 -7 27 -35 -33 38 5 -52 4 35 -33 -24 42
7268 42 8 -32 29 50 -24 -13 54 9 -38 30 43 -38 -21 39 -8 -41 23 23 -48 -18 55 -4 -41 20 15 -45 -23 31 -25 -55 16
7299 16 17 -59 -27 41 -36 -46 33 15 -45 -1 45 -20 -32 45 30 -41 6 63 -12 -20 46 26 -42 9 41 -23 -32 38 9 -46 15 32
7331 32 -48 -29 43 -6 -56 11 38 -36 -33 44 -12 -47 22 28 -38 -21 42 -2 -35 33 32 -17 -8 48 8 -26 33 37 -21 2 53 10 -26
7364 -26 39 38 -26 6 51 -7 -40 31 16 -36 2 33 -27 -43 25 5 -60 -11 34 -21 -36 23 7 -46 -3 39 -30 -28 49 18 -40
7395 -40 25 52 -20 -17 47 18 -39 19 48 -19 -16 53 9 -30 22 31 -36 -25 42 -10 -42 15 27 -52 -17 33 -17 -46 11 17 -46 -16
7427 -16 32 -13 -48 21 24 -31 5 45 -3 -20 48 35 -36 8 58 -11 -28 42 37 -21 11 53 -17 -27 40 30 -48 -4 31 -29 -41
7458 -41 36 7 -49 5 38 -37 -43 41 12 -44 3 35 -46 -26 40 5 -38 11 53 -17 -18 60 12 -30 41 40 -20 -5 69 5 -31 36
7490 36 45 -34 -9 47 -10 -34 36 30 -52 -25 45 -30 -54 16 14 -49 -17 40 -11 -48 15 11 -60 -8 36 -27 -30 34 14 -43 8 52 -29
7523 -29 -23 48 25 -35 18 48 -14 -26 49 24 -32 14 39 -23 -22 49 11 -44 14 34 -42 -28 34 -12 -56 13 21 -48 -34 31 -12 -41
7555 -41 14 25 -41 -13 46 -2 -30 27 32 -24 -5 55 2 -25 46 28 -29 10 54 2 -16 46 39 -27 7 49 -14 -35 38 9 -54
7586 -54 -7 27 -37 -36 29 1 -52 -6 22 -42 -35 23 7 -47 -3 45 -33 -16 50 15 -47 18 42 -10 -7 56 18 -41 24 42 -37 -18
7618 -18 51 2 -50 24 30 -30 -17 44 -8 -57 32 24 -38 -27 33 -11 -43 23 21 -49 -11 37 -22 -31 43 24 -34 -3 44 -14 -28 43
7650 43 39 -21 9 62 -7 -17 55 22 -37 16 61 -10 -20 48 7 -45 5 45 -38 -30 30 -3 -55 11 34 -36 -20 37 3 -48 4
7681 4 30 -35 -16 39 -1 -42 26 29 -22 2 58 2 -41 41 44 -20 0 64 8 -25 38 48 -35 -4 57 -5 -25 41 27 -33 5 44
7713 44 -12 -44 29 8 -52 -21 31 -32 -35 36 5 -46 3 52 -14 -19 49 19 -34 21 49 -19 -16 51 23 -31 19 54 -20 -9 60 9
7745 9 -42 21 44 -20 -8 44 3 -38 21 40 -33 -35 44 -4 -51 9 29 -42 -20 37 -16 -47 33 21 -42 -16 49 -8 -40 37 38 -26
7777 -26 9 57 1 -21 46 38 -30 9 50 -8 -20 46 21 -32 9 41 -22 -16 47 11 -45 -2 26 -31 -30 23 -7 -42 -5 28 -26 -27
7809 -27 26 2 -49 11 35 -31 -26 39 8 -31 30 38 -13 -4 58 7 -17 36 50 -29 -6 48 0 -28 28 29 -27 -10 40 -12 -46 22
7841 22 27 -38 -8 39 -23 -40 21 21 -47 -3 36 -17 -32 37 28 -36 9 50 -13 -18 49 18 -39 24 65 -9 -7 53 25 -37 20 51 -14
7874 -14 -4 42 3 -47 2 34 -32 -22 36 -10 -55 15 29 -46 -26 33 -11 -44 21 27 -34 -20 43 -8 -33 35 27 -35 -4 44 9
7905 9 -31 46 43 -22 0 57 8 -21 39 32 -26 2 44 3 -30 41 17 -38 7 35 -23 -35 29 16 -46 -5 33 -28 -41 25 -4 -51
7937 -51 4 31 -20 -30 35 9 -31 25 46 -16 -10 58 9 -28 28 52 -16 -18 43 -2 -34 16 26 -32 -10 33 -6 -36 20 32 -46
7968 -46 -12 35 -16 -42 19 12 -47 -16 29 -19 -46 19 12 -40 -5 35 -10 -28 38 18 -31 -2 52 -6 -16 51 27 -20 16 54 2
7999 2 -10 47 25 -40 12 41 -21 -29 34 -4 -45 0 23 -35 -24 29 -8 -35 10 22 -42 -25 37 -6 -39 15 39 -22 -19 47 1 -37
8031 -37 35 48 -19 -2 48 13 -16 48 39 -21 4 42 -8 -28 34 23 -34 -8 46 -9 -36 32 11 -49 1 25 -25 -32 26 9 -53
8062 -53 -4 35 -23 -32 35 15 -35 9 43 -14 -13 52 21 -32 26 49 -10 -14 52 20 -32 31 44 -26 1 50 8 -39 20 43 -33 -14
8094 -14 28 -12 -43 21 19 -36 -27 33 -21 -35 15 18 -44 -4 42 -7 -29 36 28 -36 15 50 1 -18 41 33 -28 11 46 4 -11 50 26
8127 26 -26 11 37 -8 -23 38 6 -41 4 31 -27 -27 32 0 -37 -1 38 -35 -24 33 -4 -46 12 22 -29 -27 43 2 -27 34 38 -21
8159 -21 5 45 -2 -22 30 26 -25 3 49 -8 -26 41 33 -35 -3 28 -16 -38 22 14 -44 -9 39 -25 -40 11 3 -43 -10 18 -29 -27
8191b7
##END NTUPLES=NMR FID
##END=
