##TITLE=1H_IG-120Polac(2)
 CDCl3
 8 sc, 
 16.03.2022
##JCAMPDX= 6.0         $$ Bruker NMR JCAMP-DX V2.0
##DATA TYPE= NMR FID
##DATA CLASS= NTUPLES
##ORIGIN= UXNMR, Bruker Analytische Messtechnik GmbH
##OWNER= root
$$ XWIN-NMR		Version 3.5
$$ Wed Mar 16 10:40:57 2022 Russian Standard Time (UT+4h)  she@DPX200
##.OBSERVE FREQUENCY= 200.131346
##.OBSERVE NUCLEUS= ^1H
##.DELAY= (6, 6)
##.ACQUISITION MODE= SIMULTANEOUS
##.ACQUISITION SCHEME= undefined
##.AVERAGES= 8
##.DIGITISER RES= 18
##SPECTROMETER/DATA SYSTEM= spect
##.PULSE SEQUENCE= zg30
##.SOLVENT NAME= D2O
##.SHIFT REFERENCE= (INTERNAL, D2O, 0, 15.7039)
##AUDIT TRAIL= $$ (NUMBER, WHEN, WHO, WHERE, WHAT)
$$ ##TITLE= Audit trail, XWIN-NMR		Version 3.5
$$ ##JCAMPDX= 5.01
$$ ##ORIGIN= Bruker BioSpin GmbH
$$ ##OWNER= she
$$ F:/spectra/data/she/nmr/H-F/1/audita.txt
$$ ##AUDIT TRAIL=  $$ (NUMBER, WHEN, WHO, WHERE, WHAT)
(   1,<2022-03-16 10:40:04.89 +0400>,<she>,<DPX200>,
      <created by zg, POWCHK disabled, PULCHK disabled
       configuration hash MD5:
       00 E9 B6 7A A2 85 ED C7 34 08 36 98 17 FE 4E 26
       data hash MD5: 16K
       F4 4D A1 D2 11 DF 9E 85 93 22 07 29 55 73 15 97>)
$$ ##END=
$$ 
$$ hash MD5
$$ 57 A7 51 18 12 51 FF 9C C1 21 C0 3A 85 E2 F5 3F
##$RELAX= 
##$RELAX= 
##$RELAX= 
##$RELAX= 
##$RELAX= 
##$RELAX= 
$$ Bruker specific parameters
$$ --------------------------
##$DU= <F:/spectra>
##$EXPNO= 1
##$NAME= <H-F>
##$PROCNO= 1
##$TYPE= <nmr>
##$USER= <she>
##$AMP= (0..31)
100 100 100 100 100 100 100 100 100 100 100 100 100 100 100 100 100 100 
100 100 100 100 100 100 100 100 100 100 100 100 100 100 
##$AQSEQ= 0
##$AQ_mod= 1
##$AUNM= <au_zg>
##$AUTOPOS= <>
##$BF1= 200.13
##$BF2= 200.13
##$BF3= 200.13
##$BF4= 200.13
##$BF5= 200.13
##$BF6= 200.13
##$BF7= 200.13
##$BF8= 200.13
##$BYTORDA= 1
##$CFDGTYP= 0
##$CFRGTYP= 5
##$CHEMSTR= <none>
##$CNST= (0..31)
1 1 145 1 1 1 1 1 1 1 1 1 1 1 1 1 1 1 1 1 1 1 1 1 1 1 1 1 1 1 1 1 
##$CPDPRG= <>
##$CPDPRG1= <>
##$CPDPRG2= <>
##$CPDPRG3= <>
##$CPDPRG4= <mlev>
##$CPDPRG5= <mlev>
##$CPDPRG6= <mlev>
##$CPDPRG7= <mlev>
##$CPDPRG8= <mlev>
##$CPDPRGB= <>
##$CPDPRGT= <>
##$D= (0..31)
0 1.2 0 0 0 0 0 0 0 0.06 0 0.03 0 0 0 0 0.0002 0 0 0 0 0 0 0 0 0 0 0 0 
0 0 0 
##$DATE= 1647412804
##$DBL= (0..7)
120 120 120 120 120 120 120 120 
##$DBP= (0..7)
150 150 150 150 150 150 150 150 
##$DBP07= 0
##$DBPNAM0= <>
##$DBPNAM1= <>
##$DBPNAM2= <>
##$DBPNAM3= <>
##$DBPNAM4= <>
##$DBPNAM5= <>
##$DBPNAM6= <>
##$DBPNAM7= <>
##$DBPOAL= (0..7)
0.5 0.5 0.5 0.5 0.5 0.5 0.5 0.5 
##$DBPOFFS= (0..7)
0 0 0 0 0 0 0 0 
##$DE= 6
##$DECBNUC= <off>
##$DECIM= 32
##$DECNUC= <off>
##$DECSTAT= 4
##$DIGMOD= 1
##$DIGTYP= 9
##$DL= (0..7)
0 120 120 120 120 120 120 120 
##$DP= (0..7)
150 150 150 150 150 150 150 150 
##$DP07= 0
##$DPNAME0= <>
##$DPNAME1= <>
##$DPNAME2= <>
##$DPNAME3= <>
##$DPNAME4= <>
##$DPNAME5= <>
##$DPNAME6= <>
##$DPNAME7= <>
##$DPOAL= (0..7)
0.5 0.5 0.5 0.5 0.5 0.5 0.5 0.5 
##$DPOFFS= (0..7)
0 0 0 0 0 0 0 0 
##$DQDMODE= 0
##$DR= 18
##$DS= 0
##$DSLIST= <SSSSSSSSSSSSSSS>
$$ [...]
##$SUBNAM2= <"">
##$SUBNAM3= <"">
##$SUBNAM4= <"">
##$SUBNAM5= <"">
##$SUBNAM6= <"">
##$SUBNAM7= <"">
##$SUBNAM8= <"">
##$SUBNAM9= <"">
##$SW= 18.0517287032376
##$SWIBOX= (0..15)
0 0 2 0 0 0 0 0 0 0 0 0 0 0 0 0 
##$SW_h= 3612.71676300578
##$TD= 16384
##$TD0= 1
##$TE= 0
##$TE2= 300
##$TE3= 300
##$TEG= 300
##$TL= (0..7)
0 120 120 120 120 120 120 120 
##$TP= (0..7)
150 150 150 150 150 150 150 150 
##$TP07= 0
##$TPNAME0= <>
##$TPNAME1= <>
##$TPNAME2= <>
##$TPNAME3= <>
##$TPNAME4= <>
##$TPNAME5= <>
##$TPNAME6= <>
##$TPNAME7= <>
##$TPOAL= (0..7)
0.5 0.5 0.5 0.5 0.5 0.5 0.5 0.5 
##$TPOFFS= (0..7)
0 0 0 0 0 0 0 0 
##$TUNHIN= 0
##$TUNHOUT= 0
##$TUNXOUT= 0
##$USERA1= <user>
##$USERA2= <user>
##$USERA3= <user>
##$USERA4= <user>
##$USERA5= <user>
##$V9= 5
##$VALIST= <valist>
##$VCLIST= <CCCCCCCCCCCCCCC>
##$VD= 0
##$VDLIST= <DDDDDDDDDDDDDDD>
##$VPLIST= <PPPPPPPPPPPPPPP>
##$VTLIST= <TTTTTTTTTTTTTTT>
##$WBST= 1024
##$WBSW= 4
##$XGAIN= (0..3)
0 0 0 0 
##$XL= 0
##$YL= 0
##$YMAX_a= 101916
##$YMIN_a= -98983
##$ZGOPTNS= <>
##$ZL1= 120
##$ZL2= 120
##$ZL3= 120
##$ZL4= 120
##$ABSF1= 10
##$ABSF2= 0
##$ABSG= 5
##$ABSL= 3
##$ALPHA= 0
##$AQORDER= 0
##$ASSFAC= 0
##$ASSFACI= 0
##$ASSFACX= 0
##$ASSWID= 0
##$AUNMP= <proc_1d>
##$AZFE= 0.1
##$AZFW= 0.1
##$BCFW= 1
##$BC_mod= 2
##$BYTORDP= 1
##$COROFFS= 0
##$CY= 11.3945322036743
##$DATMOD= 1
##$DC= 2
##$DFILT= <>
##$DTYPP= 0
##$F1P= 2.36226072786647
##$F2P= -0.459571619588291
##$FCOR= 0.5
##$FTSIZE= 0
##$FT_mod= 4
##$GAMMA= 1
##$GB= 0.15
##$INTBC= 1
##$INTSCL= 1
##$ISEN= 128
##$LB= 0.24
##$LEV0= 0
##$LPBIN= 0
##$MAXI= 10000
##$MC2= 0
##$MEAN= 0
##$ME_mod= 0
##$MI= 1.114404
##$NCOEF= 0
##$NC_proc= 0
##$NLEV= 6
##$NOISF1= 3.799351
##$NOISF2= 2.8
##$NSP= 1
##$NTH_PI= 0
##$NZP= 0
##$OFFSET= 15.70392
##$PC= 1
##$PHC0= -17030.9
##$PHC1= 13.80078
##$PH_mod= 1
##$PKNL= yes
##$PPARMOD= 0
##$PSCAL= 0
##$PSIGN= 0
##$REVERSE= no
##$SF= 200.130013532006
##$SI= 16384
##$SIGF1= 3
##$SIGF2= 2
##$SINO= 400
##$SIOLD= 16384
##$SREGLST= <1H.CDCl3>
##$SSB= 0
##$STSI= 0
##$STSR= 0
##$SW_p= 3612.71676300578
##$SYMM= 0
##$S_DEV= 0
##$TDeff= 0
##$TDoff= 0
##$TI= <>
##$TILT= no
##$TM1= 0
##$TM2= 0
##$TOPLEV= 0
##$USERP1= <user>
##$USERP2= <user>
##$USERP3= <user>
##$USERP4= <user>
##$USERP5= <user>
##$WDW= 1
##$XDIM= 8192
##$YMAX_p= 0
##$YMIN_p= 0
$$ End of Bruker specific parameters
$$ ---------------------------------
##NTUPLES= NMR FID
##VAR_NAME=  TIME,          FID/REAL,        FID/IMAG
##SYMBOL=    X,             R,               I
##VAR_TYPE=  INDEPENDENT,   DEPENDENT,       DEPENDENT
##VAR_FORM=  AFFN,          ASDF,            ASDF
##VAR_DIM=   8192,          8192,            8192
##UNITS=     SECONDS,       ARBITRARY UNITS, ARBITRARY UNITS
##FACTOR=    0.0002768,     1,               1
##FIRST=     0,             0,               0
##LAST=      2.2672688,     0,               0
##MIN=       0,             -98983,          0
##MAX=       2.2672688,     101916,          0
$$ Real data points
##PAGE= N=1
##DATA TABLE= (X++(R..R)), XYDATA
$$ plain form
0 0 0 0 0 0 0 0 0 0 0 0 0 0 0 0 0 0 0 0 0 0 0 0 0 -6 8 -8 8 -8 8 -8 8 -11 16 -16 16 -16 22 -24 24 -27 31 -35 38 -42
44 -42 46 -51 57 -62 67 -74 82 -90 99 -112 123 -137 154 -173 197 -226 263 -308 371 -459 592
65 592 -802 1179 -2001 4438 -25130 -98983 40862 87461 -67728 -65381 87048 37540 -97281
78 -97281 -6910 98344 -23819 -89636 51477 72861 -73750 -49183 88350 21484 -94239
89 -94239 7742 90796 -35454 -78982 59035 59805 -76454 -35674 86160 8629 -87535 18524
101 18524 80593 -43444 -66090 63751 45584 -77583 -20898 83810 -5276 -81737 30661
112 30661 71937 -52550 -55344 69104 33795 -78752 -9431 80717 -15462 -75024 38336
123 38336 62125 -57288 -43625 70197 21131 -76194 2803 74634 -26066 -65957 46296
$$ packed form
0@%%%%%%%%%%%%%%%%%%%%%%%oJ4j6J6j6J6j6J6j9K7l2L2l2L8m6M8n1N8o6P3q0
44d2Q8r7J08j19J29j41J56j72J89k11K35k60K91l27L70m23M89n71O79q30J051
65E92j394J981l180O439k9568p3853J39845M6599j55189K347J52429m9508j34821
78i7281R0371J05254j22163o5817J41113K1384j46611K4567J37533o6866j15723
89i4239J01981Q3054j26250m3528J38017P70j36259M0780J21834p7531r6164J06059
101A8524O2069j24037k2646J29841j8167j23167N6685J04708q9086p6461J12398
112C0661M1276j24487k794J24448l5309j12547O9321R0148r6179n9562J13360
123C8336K3789j19413J3663J13822m9066r7325P8997P1831j00700l9891J12253
$$ plain form
134 46296 51185 -61634 -31790 70815 9892 -72921 12559 68145 -33100 -56867 50106
145 50106 40566 -61842 -20735 67457 -628 -66558 21465 59212 -39976 -46445 54174 29268
157 29268 -63064 -9733 65628 -10551 -62013 29401 52459 -45255 -38098 56570 20257 -62285
169 -62285 -607 61975 -18770 -55514 36214 43831 -49770 -27901 58403 9569 -61169 9435
181 9435 58035 -27242 -49393 42135 36111 -52826 -19626 58178 1441 -57917 16452 51952
193 51952 -32503 -41136 45009 26506 -52904 -9662 55525 -7747 -52733 24125 45013 -37853
205 -37853 -33066 47821 18202 -53023 -1763 53099 -14580 -48047 29285 38405 -40969 -25255
217 -25255 48498 9780 -51330 6428 49112 -21928 -42237 35173 31283 -44936 -17373 50314
$$ packed form
134D6296M889j12819K9844J02605o0923q2813Q5480N5586j01245k3767J06973
145E0106r540j02408M1107Q8192o8085o5930Q8023L7747r9188o469J00619k4906
157B9268r2332N3331P5361p6179n1462R1414K3058r7714P157R4668l6313q2542
169f2285O1678O2582q0745l6744R1728P617r3601K1869Q6304m8834p0738P0604
181I435M8600q5277k2151R1528o024q8937L3200P7804n6737n9358P4369L5500
193E1952q4455q633Q6145j8503p9410M3242O5187o3272m4986P6858K0888q2866
205c7853M787Q0887k9619p1225N1260N4862o7679l3467P7332R120p9374J5714
217b5255P3753l8718o1110N7758M2684p1040k0309P7410l890p6219K7563O7687
$$ plain form
229 50314 1890 -50735 13737 46305 -27871 -37328 39234 24857 -46582 -10048 49321 -5530
241 -5530 -47189 20363 40467 -33024 -29948 42210 16612 -47301 -1974 47677 -12754 -43583
253 -43583 25956 35272 -36551 -23766 43416 10154 -45993 4225 44135 -17897 -38005 29734
265 29734 28416 -38461 -16121 43484 2482 -44202 11362 40721 -23981 -33292 34215 22679
277 22679 -41109 -10005 43920 -3623 -42576 16685 37032 -28165 -28070 36737 16354 -41786 -3175
290 -3175 42709 -10313 -39470 22715 32392 -32799 -22182 39646 9971 -42494 3137 41264
302 41264 -15685 -36012 26579 27439 -34726 -16327 39423 3783 -40253 8907 37140 -20592
314 -20592 -30506 30062 20954 -36549 -9568 39374 -2617 -38424 14371 33822 -24594 -26057 32393
$$ packed form
229E0314m8424n2625O4472L2568p4176r457P6562j4377p1439L6534N9369n4851
241e530m1659O7552K0104p3491L076P2158k5598o3913M5327M9651o0431l0829
253d3583O9539R316p1823J2785O7182l3262n6147N0218L9910o2032k0108O7739
265B9734j318o6877K2340N9605m1002m6684N5564K9359o4702r311O7507j1536
277B2679o3788L1104N3925m7543l8953N9261K0347o5197R5O4807k0383n8140L8611
290c175M5884n3022k9157O2185R677o5191J0617O1828k9675n2465M5631L8127
302D1264n6949k0327O2591Q60o2165J8399N5750l5640m4036M9160K8233n7732
314b0592r914O0568r108n7503K6981M8942m1991l5807N2795J9451n8416j463N8450
$$ plain form
327 32393 15930 -36997 -4325 38066 -7542 -35453 18649 29444 -27905 -20613 34405 9792
339 9792 -37580 1934 37047 -13471 -32959 23587 25667 -31419 -15962 36135 4754 -37326
351 -37326 6833 34911 -17638 -29082 26664 20520 -32914 -9947 35955 -1371 -35355 12506
363 12506 31383 -22212 -24384 29647 15148 -34113 -4618 35246 -6243 -33021 16269 27601
375 27601 -24678 -19674 30510 9861 -33404 713 32978 -11161 -29395 20418 23019 -27613
387 -27613 -14420 32175 4543 -33540 5823 31767 -15517 -26826 23772 19381 -29623 -10008
399 -10008 32587 -273 -32346 10474 28913 -19622 -22701 26749 14233 -31293 -4511 32683
411 32683 -5676 -30988 15137 26229 -23131 -19022 28769 10026 -31560 -172 31271 -9534
$$ packed form
327C2393j6463n2927L2672M2391m5608k7911N4102J0795n7349P292N5018k4613
339I792m7372L9514L5113n0518j9488N6546K080n7086J5457N2097l1381m2080
351c7326M4159K8078n2549j1444N5746o144n3434K2967M5902l7326l3984M7861
363A2506J8877n3595k172N4031j4499m9261K9495L9864m1489k6778M9290J1332
375B7601n2279N004N0184k0649m3265L4117L2265m4139j8234M9813K601n0632
387b7613J3193M6595k7632l8083L9363K5944m7284j1309N0598m391m9004J9615
399a0008M2595l2860l2073M2820J8439m8535l079M9450j2516m5526K6782L7194
411C2683l8359k5312M6125J1092m9360M109M7791j8743m1586L1388L1443m0805
$$ plain form
423 -9534 -27915 18224 21945 -24954 -13906 29227 4669 -30594 4908 29034 -13902 -24719
435 -24719 21481 18060 -26983 -9758 29834 555 -29842 8625 26944 -16922 -21500 23520
447 23520 13978 -27807 -5147 29412 -4139 -28130 13064 24161 -20670 -17802 26326 9728
459 9728 -29387 -717 29560 -8362 -26887 16539 21596 -23095 -14302 27298 5637 -28875 3393
472 3393 27598 -12073 -23742 19489 17589 -24935 -9781 27968 1155 -28200 7549 25802
484 25802 -15334 -20895 21616 14141 -25682 -6077 27300 -2404 -26275 10598 22741 -17729
496 -17729 -17083 23062 9749 -26210 -1569 26733 -6817 -24746 14446 20278 -20734 -13941 24958
509 24958 6205 -26788 2098 26000 -10156 -22648 17240 17172 -22527 -9945 25683 1859 -26218
$$ packed form
423i534j8381M6139L721m6899J1048M3133k4558l5263L5502K4126m2936j0817
435b4719M6200l421m5043J7225L9592k9279l0397L8467J8319m3866m578M5020
447B3520r542m1785K2660L4559l3551k3991M1194J1097m4831K868M4128j6598
459I728l9115K8670L0277l7922j8525M3426N057m4691Q793M1600k1661l4512L2268
472C393K4205l9671j1669M3231j900m2524J5154L7749k6813k9355L5749J8253
484B5802m1136n561M2511p475l9823J9605L3377k9704k3871L6873J2143m0470
496a7729O46M0145j3313l5959K4641K8302l3550j7929L9192N832m1012O793L8899
509B4958j8753l2993K8886K3902l6156j2492L9888o8l9699J2582L5628k3824k8077
$$ plain form
522 -26218 6465 24266 -14061 -19895 20271 13612 -24424 -6084 26157 -1967 -25386 9652
534 9652 22126 -16355 -16866 21330 10011 -24268 -2329 24773 -5519 -22925 12703 18872 -18585
547 -18585 -13035 22622 6048 -24451 1483 23933 -8774 -21130 15193 16358 -20133 -10041
559 -10041 23104 2770 -23829 4750 22199 -11789 -18439 17643 12834 -21774 -6014 23731
571 23731 -1369 -23397 8610 20793 -14994 -16182 19914 10015 -22866 -2875 23581 -4468
583 -4468 -21949 11316 18180 -16962 -12703 20840 6041 -22687 1074 22267 -8050 -19771 14125
596 14125 15336 -18827 -9535 21612 2844 -22314 4001 20861 -10364 -17397 15662 12328 -19364
609 -19364 -6097 21229 -627 -20955 7303 18679 -13205 -14575 17817 9095 -20704 -2726
$$ packed form
522b6218L2683J7801l8327n834M0166o659l8036J8340L2241k8124k3419L5038
534I652J2474l8481n11L8196j1319l4279K1939K7102l0292j7406L5628O169l7457
547a8585N550L5657j6574l0499K5934K2450l2707j2356L6323J165l6491J0092
559a0041L3145k0334k6599K8579J7449l3988o650L6082m809l4608J5760K9745
571B3731k5100k2028L2007J2183l5787j188L6096r899l2881J9991K6456k8049
583d468j7481L3265O864l5142M259L3543j4799k8728K3761K1193l0317j1721L3896
596A4125J211l4163R292L1147j8768k5158K6315J6860l1225p033L3059l334l1692
609a9364J3267K7326k1856k0328K8258J1376l1884j370L2392q722k9799J7978
$$ plain form
621 -2726 21538 -3901 -20363 10068 17125 -15360 -12325 19035 6257 -20943 331 20692 -6903
634 -6903 -18475 12722 14441 -17266 -9011 20107 2799 -20966 3664 19845 -9661 -16799 14744
647 14744 12226 -18320 -6498 20102 231 -19912 5953 17807 -11491 -14069 15781 8992 -18591
660 -18591 -3189 19551 -2938 -18690 8706 15982 -13651 -11803 17211 6444 -19126 -535
672 -535 19156 -5390 -17321 10753 13831 -15051 -9023 17880 3325 -18960 2690 18167 -8476
685 -8476 -15596 13389 11443 -17018 -6235 18918 431 -18989 5362 17218 -10584 -13810 14740
698 14740 9113 -17430 -3569 18420 -2251 -17581 7817 15061 -12520 -11088 15965 6107 -17824
711 -17824 -617 17931 -4882 -16372 9791 13227 -13786 -8945 16332 3755 -17366 1654
$$ packed form
621b726K4264k5439j6462L0431P057l2485L035L1360j2778k7200K1274K0361k7595
634f903j1572L1197J719l1707Q255K9118j7308k3765K4630J6181k9506p138L1543
647A4744k518l0546J1822K6600j9871k0143K5865J1854k9298k578K9850o789k7583
660a8591J5402K2740k2489j5752K7396P276k9633J848K9014j0767k5570J8591
672e35J9691k4546j1931K8074L078k8882O028K6903j4555k2285K1650J5477k6643
685h476p120K8985j946k8461J0783K5153j8487j9420K4351J1856k7802l226K8550
698A4740n627k6543J3861K1989k0671j5330K5398P244k7581J432K7053r858k3931
711a7824J7207J8548k2813j1490K6163L436k7013M841K5277j2577k1121J9020
$$ plain form
723 1654 16630 -6927 -14367 11445 10671 -14840 -5980 16777 736 -17065 4614 15720 -9469
736 -9469 -12792 13437 8669 -16035 -3659 17111 -1665 -16455 6792 14205 -11255 -10588 14539
749 14539 5906 -16426 -727 16621 -4555 -15238 9275 12313 -13129 -8315 15585 3482 -16570
762 -16570 1549 15924 -6381 -13782 10549 10381 -13610 -5976 15383 1108 -15587 3861 14335
775 14335 -8359 -11686 12021 7952 -14496 -3493 15549 -1285 -15161 5892 13257 -9969 -10141
788 -10141 13013 6004 -14835 -1300 15137 -3518 -13969 7976 11418 -11618 -7746 14120 3316
801 3316 -15231 1430 14852 -6022 -13024 10014 9923 -12993 -5870 14691 1280 -14944 3363
814 3363 13707 -7636 -11194 11085 7621 -13436 -3358 14463 -1146 -14078 5541 12375 -9309
$$ packed form
723A654J4976k3557p440K5812p74k5511Q860K2757j6041j7801K1679J1106k5189
736i469l323K6229m768k4704J2376K0770j8776j4790K3247P413k5460O67K5127
749A4539q633k2332J5699J7348k1176j0683K4513L038k5442M814K3900j2103k0052
762a6570J8119J4375k2305p401K4331j68k3991P634K1359j4275j6695J9448J0474
775A4335k2694l327K3707m069k2448J1003J9042j6834j3876K1053P365k3226j72
788a0141K3154p009k0839J3535J6437j8655j0451K1945L442k3036L872K1866j0804
801C316j8547J6661J3422k0874p002K3038r1k2916P123K0561j3411j6224J8307
814C363J0344k1343l558K2279l464k1057J0078J7821j5609j2932J9619O834k1684
$$ plain form
827 -9309 -9485 12199 5754 -13842 -1487 14197 -2847 -13179 6881 10911 -10204 -7638 12520
840 12520 3605 -13634 698 13394 -4991 -11905 8718 9190 -11676 -5655 13437 1494 -13933
853 -13933 2778 13049 -6789 -10869 10127 7668 -12413 -3685 13541 -589 -13240 4829 11720
866 11720 -8501 -9002 11372 5457 -13101 -1401 13528 -2788 -12662 6617 10528 -9802 -7483
879 -7483 11947 3704 -12963 316 12658 -4304 -11212 7796 8651 -10510 -5314 12185 1476
892 1476 -12667 2499 11941 -6199 -10015 9300 7171 -11443 -3611 12510 -245 -12350 4090
905 4090 10995 -7525 -8565 10200 5278 -11887 -1484 12379 -2461 -11656 6153 9760 -9238
918 -9238 -6928 11401 3433 -12438 369 12269 -4102 -10911 7408 8498 -9966 -5302 11527
$$ packed form
827i309j76K1684o445j9596J2355J5684j7044j0332K0060M030k1115K566K0158
840A2520q915j7239J4332J2696j8385o914K0623M72k0866O021J9092j1943j5427
853a3933J6711J0271j9838m080K0996k459k0081Q728J7226j4130j2651J8069O891
866A1720k0221n01K0374n915j8558J1700J4929j6316r874J9279L911k0330K319
879g483J9430q243j6667J3279J2342j6962o908J9008Q55j9161N196J7499j0709
892A476j4143J5166R442j8140l816J9315k129j8614P832J6121j2755j2105J6440
905D090O905j8520j040J8765m922j7165J0403J3863j4840r195J7809L607j8998
918i238K310J8329p968j5871J2807J1900j6371o809J8319J090j8464M664J6829
$$ plain form
931 11527 1626 -11969 2162 11206 -5705 -9392 8629 6673 -10707 -3358 11725 -248 -11619
944 -11619 3790 10404 -6928 -8202 9397 5243 -10913 -1782 11403 -1768 -10718 5214 9048
957 9048 -8071 -6451 10172 3252 -11254 279 11231 -3796 -10119 6894 7975 -9371 -5107
970 -5107 10881 1676 -11376 1823 10678 -5202 -8982 7982 6392 -9998 -3211 11004 -255
983 -255 -10913 3684 9805 -6697 -7712 9101 4944 -10547 -1702 11005 -1634 -10372 4805
996 4805 8785 -7454 -6360 9345 3342 -10328 -67 10282 -3226 -9303 6127 7370 -8471
1009 -8471 -4791 9948 1698 -10501 1497 10010 -4588 -8575 7183 6298 -9087 -3398 10115
1022 10115 204 -10115 3047 9158 -5953 -7260 8283 4667 -9804 -1601 10341 -1600 -9889
$$ packed form
931A1527r901j3595J4131R044j6911l687J8021j956j7380P349J5083j1973j1371
944a1619J5409O614j7332j274J7599m154j6156R131J3185j3171q950J5932L834
957I048j7119J620J6623o920j4506J1533J0952j5027o323J7013J081j7346M264
970e107J5988r205j3052J3199Q855j5880l780J6964j590j6390O787J4215j1259
983b55j0658J4597O121j6502j015J6813m157j5491Q845J2707j2639q738J5177
996D805L980j6239J094J5705o003j3670J0261J0349j3508o077J5430J243j5841
1009h471L680J4739q250j2199J1998Q513j4598l987J5758q85j5385N689J3513
1022A0115r911j0319J3162O111j5111j307J5543l616j4471Q203J1942j1941q289
$$ plain form
1035 -9889 4629 8448 -7203 -6218 9049 3394 -10008 -272 9965 -2839 -8967 5635 7099
1048 7099 -7843 -4585 9263 1652 -9777 1404 9342 -4291 -8030 6749 5936 -8558 -3309
1061 -3309 9477 374 -9551 2544 8645 -5234 -6950 7340 4573 -8759 -1764 9324 -1212
1074 -1212 -8955 4066 7748 -6521 -5726 8381 3184 -9342 -278 9447 -2596 -8591 5240 6929
1088 6929 -7337 -4590 8705 1806 -9240 1126 8819 -3946 -7604 6316 5586 -8112 -3093
1101 -3093 9032 267 -9145 2498 8323 -5028 -6758 7045 4543 -8335 -1908 8841 -851
1114 -851 -8449 3525 7298 -5792 -5411 7505 3047 -8473 -395 8632 -2304 -7963 4746 6502
1128 6502 -6750 -4457 8067 1931 -8635 708 8327 -3327 -7256 5576 5442 -7304 -3124 8290
$$ packed form
1035i889J4518L819j5651R85J5267n655j3402R736J0237j2804o128J4602J464
1048G099j4942L258J3848p611j1429J1181P938j3633l739J4779q13j4494N249
1061c309J2786r103r925J2095O101j3879j716J4290k767j3332O995J1088j0536
1074a212p743J3021L682j4269P95J4107n197j2526R064R725j2043n995J3831J689
1088F929j4266K747J3295o899j1046J0366P693j2765l658J3920p30j3698N019
1101c093J2125q765r412J1643N825j3351j730J3803k502j2878O427J0749r692
1114h51p598J1974L773j3090L81J2916m458j1520Q078R027j0936n659J2709J756
1128F502j3252K293J2524o136j0566R343P619j1654l929J2832j34j2746M180J1414
$$ plain form
1142 8290 461 -8480 2213 7812 -4687 -6376 6681 4327 -8011 -1889 8562 -734 -8277 3226
1156 3226 7207 -5424 -5449 7044 3179 -7992 -637 8125 -1953 -7495 4304 6120 -6211 -4180
1170 -4180 7526 1888 -8097 587 7892 -2997 -6949 5102 5337 -6697 -3229 7623 774 -7819
1184 -7819 1679 7219 -4003 -5963 5879 4065 -7232 -1827 7823 -636 -7701 3014 6786 -5109
1198 -5109 -5219 6708 3145 -7601 -754 7791 -1641 -7190 3913 5927 -5737 -4048 7038 1831
1212 1831 -7606 568 7428 -2893 -6551 4897 5015 -6459 -3080 7310 815 -7532 1444 6968
1226 6968 -3602 -5814 5328 4046 -6574 -1958 7142 -347 -7025 2576 6221 -4542 -4811 6068
1240 6068 2969 -6992 -800 7275 -1407 -6792 3516 5689 -5251 -3997 6465 1930 -7042 318
$$ packed form
1142H290p829q941J0693N599j2499j689J3057k354j2338O122J0451r296p543J1503
1156C226L981j2631k5J2493l865j1171P355Q762j0078n542J1799J816j2331K031
1170d180J1706n638r985Q684P305j0889l952J2051K35j2034L468J0852o849q593
1184g819R498N540j1222j960J1842j814j1297N405R650q459p065J0715L772j1895
1198e109j10J1927l563j0746O847Q545r432n549J1103K014j1664J689J1086n207
1212A831r437Q174O860j0321l658J1448J18j1474L379J0390o495q347Q976N524
1226F968j0570k212J1142j282j0620M616R100p489o678R601L645j0763k69J0879
1240F068l099r961O192Q075q682n385J0308K173j0940J254J0462m535q972P360
$$ plain form
1254 318 6898 -2537 -6081 4463 4653 -5982 -2813 6881 654 -7134 1543 6652 -3595 -5542 5259
1269 5259 3882 -6405 -1880 6884 -283 -6718 2370 5899 -4208 -4548 5618 2738 -6491 -700
1283 -700 6732 -1416 -6291 3356 5264 -4965 -3737 6079 1863 -6591 165 6500 -2160 -5764 3950
1298 3950 4490 -5334 -2768 6207 774 -6465 1295 6073 -3240 -5089 4845 3593 -5985 -1793 6523
1313 6523 -223 -6469 2171 5727 -3940 -4492 5284 2769 -6117 -816 6336 -1201 -5931 3083 4966
1328 4966 -4627 -3497 5751 1754 -6272 192 6226 -2056 -5551 3750 4391 -5032 -2802 5831 968
1343 968 -6058 932 5691 -2744 -4811 4230 3425 -5362 -1768 5901 -122 -5927 1953 5317 -3606
1358 -3606 -4232 4893 2712 -5705 -945 5957 -912 -5616 2688 4734 -4177 -3366 5263 1678 -5783
$$ packed form
1254C18O580r435l544J0544J90j0635L169R694o227p788Q677N109j0247j947J0801
1269E259j377j0287M525Q764p167o435R088L529j0107l40J0166k880r229N791
1283g00P432q148m875R647J908j0229J228R816m216q454O756O335q660l604R714
1298C950N40r824K566Q975n433p239P760M778r313j849R934j252r578M192Q316
1313F523o746o246Q640L556r667n52R776k515q886N301P152p537m730R014J883
1328D966r593J130R248l997q026O464O034q282l495R301O41r423K230Q633m863
1343I68p026O990M759q435k067R041q05q787L594P669o023n805P880L364q923
1358c606o26R125k181q417M760O902o869m704Q304K046q911Q11Q629l585p461
$$ plain form
1373 -5783 181 5757 -1999 -5143 3616 4027 -4878 -2542 5649 809 -5867 976 5509 -2657 -4633
1388 -4633 4074 3300 -5063 -1689 5545 -99 -5474 1834 4886 -3383 -3842 4580 2400 -5355 -771
1403 -771 5583 -957 -5301 2559 4459 -3921 -3225 4875 1665 -5357 45 5313 -1724 -4727 3250
1418 3250 3711 -4448 -2282 5210 664 -5453 1056 5161 -2632 -4340 3970 3123 -4916 -1597 5359
1433 5359 -76 -5280 1727 4680 -3201 -3647 4326 2232 -5062 -656 5241 -1013 -4961 2524 4167
1448 4167 -3823 -3018 4726 1579 -5172 16 5135 -1562 -4564 2981 3621 -4046 -2263 4771 776
1463 776 -4966 849 4726 -2335 -3988 3618 2890 -4538 -1506 5009 -53 -5004 1571 4470 -2953
1478 -2953 -3543 4016 2238 -4707 -747 4903 -838 -4625 2306 3889 -3560 -2771 4456 1373 -4909
$$ packed form
1373e783N964N576p756l144Q759M11q905K336Q191m840o676O843M533q166j976
1388d633Q707p74q363L374P234n644n375P308L052q269m59Q422k180p755M584
1403g71O354o540m344P860J900q380O96Q100l210p022N402N268p037l003P977
1418C250M61q159K166P492m546o117O509M105p793j708Q310q47q039L319O956
1433E359n435n204P007K953p881m46P973k094p294M406N897o254l948P485J643
1448D167p990Q05P744l147o751N188N119o697l002P545O40p667J783P034l995
1463G76n742N815L877p061j653P606p28p428L032O515n062m951O575K899p423
1478b953n90P559j778o945L960N650n741l787O931J583p449P89P227l083o282
$$ plain form
1493 -4909 142 4872 -1652 -4366 2958 3450 -3979 -2202 4608 770 -4784 723 4505 -2143 -3779
1508 -3779 3322 2712 -4178 -1396 4619 -69 -4611 1515 4147 -2799 -3297 3802 2127 -4444 -780
1523 -780 4639 -670 -4397 2035 3700 -3189 -2668 4008 1354 -4451 66 4428 -1498 -3996 2768
1538 2768 3137 -3764 -1976 4393 631 -4574 778 4330 -2090 -3636 3204 2613 -3974 -1326 4367
1553 4367 -66 -4317 1449 3837 -2674 -2998 3628 1874 -4221 -582 4375 -783 -4164 2022 3498
1568 3498 -3100 -2558 3829 1317 -4216 -19 4153 -1307 -3707 2479 2895 -3420 -1808 4008 548
1583 548 -4185 776 3979 -1995 -3370 3059 2435 -3781 -1264 4158 -33 -4103 1320 3653 -2464
1598 -2464 -2853 3351 1744 -3913 -525 4080 -799 -3861 1994 3230 -3026 -2340 3718 1181 -4087
$$ packed form
1493d909N051M730o524k714P324M92p429J777O810l838n554N507L782o648j636
1508c779P101o10o890K782O015m688m542O126K632o946m98P099j675o571L664
1523g80N419n309l727O432J665o889N21O676k654n805M517M362n926k498O764
1538B768L69o901J788O369l762n205N352L552o420j546O840n91o587K648N693
1553D367m433m251N766K388o511l24O626j754o095L639M957n158l381O186J476
1568C498o598N42O387k512n533M197M172n460k400O186M16o315J612N816l460
1583E48m733M961L203n974j375O429o24o216K517N422m191m070N423K333o117
1598b464l89O204j607n657L388M605m879l062N855J236o256O86O058k537n268
$$ plain form
1613 -4087 66 4018 -1285 -3589 2375 2814 -3228 -1774 3749 573 -3899 688 3686 -1845 -3092
1628 -3092 2833 2232 -3536 -1130 3893 -56 -3876 1229 3486 -2285 -2762 3127 1749 -3655 -608
1643 -608 3817 -601 -3597 1753 3023 -2742 -2167 3421 1064 -3801 118 3779 -1307 -3400 2331
1658 2331 2663 -3160 -1700 3638 547 -3789 620 3546 -1742 -2976 2662 2112 -3325 -1040 3670
1673 3670 -102 -3633 1261 3268 -2256 -2572 3053 1643 -3533 -564 3684 -555 -3475 1611 2942
1688 2942 -2515 -2135 3146 1105 -3501 6 3478 -1152 -3156 2132 2473 -2949 -1580 3439 517
1703 517 -3616 570 3424 -1623 -2899 2504 2109 -3135 -1077 3469 -14 -3432 1139 3076 -2103
1718 -2103 -2393 2883 1486 -3375 -438 3514 -652 -3332 1658 2809 -2522 -2036 3098 1043 -3401
$$ packed form
1613d087M153L952n303k304N964M39o042J454N523l176m472M587K998n531j247
1628c092N925o01n768K406N023l949l820N105K257n771m77N889j378n404L047
1643f08M425m418k996N350J270n765N75N588k357m865L919L661n086k093N731
1658B331L32n823J460N338l091m336M409K926n288j234N638n50n437K285M710
1673C670l772l531M894K007n524l16N625j410n176K969M248m239k920N086J331
1688B942n457L80N281k041m606L507L472m630k004N288L41n422J369N019k922
1703E17m133M186K854n047j276N403l95n244K058M546l483l418M571J937n179
1718b103k90N276j397m861K937L952m166k680M990J151n331M86N134k055m444
$$ plain form
1733 -3401 -6 3335 -1055 -2994 1979 2327 -2730 -1458 3187 445 -3346 603 3174 -1605 -2694
1748 -2694 2418 1950 -3007 -1031 3305 5 -3284 1008 2939 -1924 -2314 2655 1441 -3103 -442
1763 -442 3257 -612 -3063 1589 2578 -2414 -1852 2993 940 -3277 53 3258 -1065 -2930 1939 2269
1779 2269 -2643 -1447 3036 440 -3181 541 2961 -1524 -2521 2277 1785 -2865 -929 3150 -57
1794 -57 -3156 1001 2841 -1863 -2241 2538 1480 -2936 -530 3083 -425 -2910 1367 2487 -2133 -1796
1810 -1796 2722 926 -3044 17 3042 -976 -2768 1815 2186 -2529 -1454 2922 513 -3078 402
1825 402 2892 -1346 -2467 2102 1770 -2678 -914 2957 -43 -2962 989 2666 -1809 -2100 2479 1362
1841 1362 -2873 -476 3018 -439 -2859 1316 2433 -2040 -1767 2567 932 -2854 -24 2837 -896
$$ packed form
1733c401L395L341m390j939M973L48n057J272M645k742l791L949K571m779j089
1748b694N112m68m957J976M336l300l289M292J931m863l90M969j214m544K661
1763d42L699l869k451M652R89m992N62M845k053m217L330L205m323j865M869L30
1779B269m912J196M483k596l621L722K420m485r97M798m92m650J936M079l207
1794e7l099M157J840m704l78M779j058m416K406L613l508k485M277J120m620L37
1810a796M518j796l970L061L025m018j792M583L71m715J075M376k409l591L480
1825D02K490m238j121M569l32m448J764L871l000k919L951J677m475k91M579j117
1841A362m235K397L494l457k420M175J117m473K73M334j635l786K830K861l733
$$ plain form
1856 -896 -2567 1691 2031 -2357 -1313 2763 458 -2936 410 2791 -1285 -2393 2000 1748 -2523 -960
1872 -960 2785 65 -2793 808 2516 -1639 -2010 2271 1285 -2693 -446 2857 -450 -2739 1287 2352
1888 2352 -1988 -1728 2512 957 -2765 -93 2781 -772 -2506 1553 1996 -2190 -1288 2595 453 -2760
1904 -2760 409 2613 -1255 -2269 1924 1643 -2462 -925 2705 63 -2736 744 2459 -1514 -1954
1919 -1954 2123 1264 -2511 -451 2644 -407 -2511 1229 2143 -1917 -1541 2433 815 -2666 18 2676
1935 2676 -831 -2404 1574 1896 -2155 -1205 2500 390 -2624 427 2450 -1233 -2080 1876 1453 -2389
1951 -2389 -750 2603 -93 -2608 860 2313 -1590 -1849 2130 1179 -2483 -416 2567 -389 -2421
1966 -2421 1148 2036 -1790 -1452 2254 739 -2495 52 2490 -846 -2253 1530 1783 -2080 -1156 2416
$$ packed form
1856h96j671M258L40m388J044M076k305l394L346K381m076j108M393k52m271J563
1872i60L745k720k858L601J708m155l71M281r86l978K247L303l307k289M026J065
1888B352m340K60M240j555l722K672K874l553j734M059M43m186R02L883k142l213
1904b760L169K204l868j014M193k81m105J537L630k642k799L480J715l973m40
1919a954M077q59l775K060L095l051k104L740R14m060L76L974j618l481K684K658
1935B676l507j573L978L22m051R50L705k110l014L051K023l683q47L956m23l842
1951b389J639L353k696k515L468J453l903k59L979r51l662K067K983k956k032
1966b421L569Q88l826L38L706j515l234K547K438l336j407L783K53l863R24L572
$$ plain form
1982 2416 411 -2536 371 2392 -1128 -2029 1732 1436 -2213 -740 2436 -64 -2421 823 2161
1997 2161 -1533 -1704 2063 1066 -2425 -353 2514 -431 -2359 1149 1998 -1754 -1424 2186 714 -2378
2013 -2378 40 2352 -783 -2095 1477 1645 -1987 -1016 2332 314 -2427 451 2300 -1145 -1946 1731
2029 1731 1395 -2159 -732 2335 -32 -2336 736 2048 -1417 -1607 1908 974 -2265 -284 2340 -484
2045 -484 -2227 1151 1883 -1747 -1341 2154 690 -2354 56 2321 -762 -2038 1429 1579 -1912 -953
2061 -953 2214 244 -2302 490 2148 -1177 -1805 1738 1252 -2152 -625 2314 -116 -2295 780 2016
2077 2016 -1415 -1588 1869 949 -2170 -276 2230 -455 -2092 1128 1742 -1692 -1217 2086 583 -2267
2093 -2267 124 2237 -795 -1991 1412 1550 -1876 -949 2144 275 -2223 435 2069 -1102 -1710 1670
$$ packed form
1982B416k005k947K907K021l520r01L761k96l649J473L176k500k357L244J338
1997B161l694j71L767r97l491K072K867k945j928L508Q49l752L30L610j472l092
2013b378K418K312l135j312L572J68l632R71L348k018k741K878J849l445q01L677
2029A731l36l554J427L067k367k304L072J312l465j90L515r34l239J981K624k824
2045d84j743L378P32l630M06L495j464l044K410K265l083j276L467J50l491R59
2061i53L167j970k546K792J658l325o28L543m86l404J527K939k430k179L075J236
2077B016l431j73L457r20l119J894K506k685j637L220O14l434M75L303j503k850
2093b267K391K113l032j196L403J38l426R27L093j869k498K658J634l171o08L380
$$ plain form
2109 1670 1186 -2042 -548 2228 -156 -2191 834 1943 -1430 -1503 1883 930 -2167 -264 2210 -449
2125 -449 -2062 1074 1684 -1621 -1164 1974 527 -2155 153 2111 -828 -1874 1425 1451 -1856 -871
2141 -871 2127 223 -2191 452 2043 -1059 -1682 1593 1185 -1946 -531 2105 -130 -2063 797 1815
2157 1815 -1386 -1399 1825 815 -2105 -198 2146 -474 -2028 1073 1660 -1591 -1178 1926 537 -2088
2173 -2088 118 2035 -777 -1779 1340 1356 -1775 -785 2062 173 -2097 508 1963 -1095 -1623 1592
2189 1592 1142 -1914 -533 2062 -103 -2011 741 1752 -1302 -1340 1712 777 -1990 -169 2027 -495
2205 -495 -1898 1066 1565 -1576 -1107 1893 509 -2049 112 1998 -727 -1751 1271 1340 -1679 -797
2221 -797 1936 177 -1993 465 1849 -1047 -1525 1550 1052 -1866 -481 2032 -128 -1978 752 1750
$$ packed form
2109A670m84l228J494K776k384k035L025J109l373p3L386r53l097J903K474k659
2125d49j613L136O10l305M57L138j447k682K308J958k939j046L299K6l307R85
2141h71K998j904k414K643J591l102o23L275m08l131J415K636k235j933K860J018
2157A815l201j3L224j010k920J907K344k620j554L101N87l251M13L104j389k625
2173b088K206J917k812j002L119J6l131R90K847j889k270K605J455l058n28L215
2189A592m50l056J381K595k165j908K752J011l054l8L052r35k767J821K196k522
2205d95j403K964M99l141M69L000j384k558K161J886k725j024L022O9l019Q82
2221g97K733j759k170K458J384k896m78L075m98k918J385K513k160j850K730R98
$$ plain form
2237 1750 -1263 -1337 1671 807 -1901 -188 1956 -424 -1814 1011 1496 -1493 -1017 1817 456 -1979
2253 -1979 142 1928 -743 -1718 1266 1298 -1666 -793 1892 186 -1936 409 1794 -970 -1458 1449
2269 1449 1011 -1776 -435 1925 -168 -1882 778 1674 -1279 -1268 1665 773 -1885 -184 1939 -429
2285 -429 -1793 976 1459 -1440 -1025 1728 425 -1916 155 1836 -767 -1627 1256 1224 -1657 -725 1874
2302 1874 162 -1921 432 1783 -970 -1455 1428 1031 -1722 -446 1863 -138 -1802 708 1584 -1222
2318 -1222 -1200 1606 702 -1833 -153 1894 -442 -1774 971 1462 -1417 -1024 1701 463 -1859 98
2334 98 1794 -677 -1584 1173 1196 -1577 -697 1804 131 -1869 440 1736 -997 -1439 1420 993 -1729
2351 -1729 -474 1847 -118 -1802 668 1584 -1168 -1192 1553 685 -1774 -123 1802 -462 -1668 984
$$ packed form
2237A750l013p4L008q64k708J713K144k380j390K825M85k989M76K834j361k435
2253a979K121J786k671r75K984L2k964Q73K685j706k122K345J385k764m88K907
2269A449m38k787J341K360k093j714K660Q96k953J1K933q92k658J701K123k368
2285d29j364K769M83k899M15K753j303k341K071J681k603q60K883l2k881R32K599
2302A874j712k083K353J351k753m85K883l97k753J276K309k001j664K510Q76k806
2318a222K2K806r04k535J680K047k336j332K745M91k879L93K725j238k322J957
2334I8J696k471r07K757K3k773Q80K501j673k000K309J296k733m42K859m27k722
2351a729J255K321j965j684K470R16k752k4K745q68k459J651J925k264j206K652
$$ plain form
2367 984 1379 -1421 -943 1704 424 -1842 126 1789 -696 -1577 1148 1180 -1531 -700 1730 114 -1788
2384 -1788 415 1625 -968 -1343 1380 908 -1683 -406 1809 -160 -1764 698 1552 -1161 -1168 1523
2400 1523 706 -1716 -150 1748 -400 -1604 911 1331 -1338 -904 1631 385 -1787 150 1718 -702
2416 -702 -1525 1139 1142 -1507 -712 1691 156 -1756 363 1603 -877 -1327 1287 886 -1589 -399 1710
2433 1710 -146 -1672 695 1471 -1143 -1109 1501 662 -1688 -135 1737 -394 -1589 893 1297 -1291
2449 -1291 -887 1561 360 -1683 157 1618 -690 -1419 1116 1063 -1478 -622 1665 96 -1710 405
2465 405 1563 -911 -1271 1276 865 -1547 -381 1642 -141 -1594 643 1382 -1092 -1039 1434 595 -1631
2482 -1631 -96 1666 -409 -1537 878 1264 -1265 -867 1516 396 -1628 115 1585 -618 -1381 1053
$$ packed form
2367I84L95k800M78K647j280k266J968J663k485q81K725L2k711Q31K430j616j902
2384a788K203J210k593l75K723m72k591J277K215j969j604K462Q54k713pK691
2400A523q17k422J566J898k148j204K515M20k669M34K535j246k172J937J568k420
2416g02q23K664Lk649P95K403j535j912K119J240k480m50K614m01k475J190K109
2433A710j856j526K367P76k614L4K610q39k350J553J872k131j195K482M04k588
2449a291M04K448j201k043J840J461k308p29K535n3k541Q56K287j569j806K115
2465D05J158k474l60K547m11k412J166K023j783j453K237P39k474N3K473q39k226
2482a631J535J762k075j128K415L86k529L98K383j120k024J743J470k203p63K434
$$ plain form
2498 1053 1035 -1402 -607 1565 81 -1633 415 1491 -888 -1238 1254 826 -1536 -401 1619 -124
2514 -124 -1579 603 1358 -1043 -1036 1347 589 -1535 -97 1589 -392 -1448 869 1209 -1227 -808 1495
2531 1495 365 -1618 125 1562 -617 -1373 1026 1027 -1343 -621 1506 118 -1560 359 1412 -849
2547 -849 -1187 1184 785 -1481 -358 1562 -149 -1554 594 1338 -1011 -1037 1307 618 -1500 -140 1542
2564 1542 -344 -1419 793 1168 -1161 -794 1424 345 -1532 133 1505 -604 -1318 990 1013 -1314
2580 -1314 -623 1489 157 -1534 311 1407 -775 -1172 1110 794 -1383 -372 1471 -114 -1467 568
2596 568 1280 -977 -1002 1277 601 -1480 -159 1508 -314 -1411 734 1168 -1089 -813 1341 385 -1453
2613 -1453 90 1429 -531 -1251 944 972 -1245 -589 1449 137 -1484 309 1387 -726 -1166 1075
$$ packed form
2498A053j8k437P95K172j484j714K048J076k379l50K492m28k362J135K020j743
2514a24j455K182P55k401PK383p58k124J438J686j981j056K317L40k436M19K303
2531A495j130j983J743J437k179p56K399Jk370P22K127j388j678J919J053k261
2547h49l38K371l99k266J123J920j711j405K148P44k349k6K344o89k118J360J682
2564A542j886j075K212L75k329L67K218j079j877J665J372k109p14K308K3k327
2580a314O91K112j332j691J845J096k182l97K282l16k177J011J843j585j353K035
2596E68P12k257k5K279o76k081J321J667j822j097K145M34k257K76K154r56j838
2613a453J543J339j960p20K195K8k217O56K038j312j621J793J078k113m40K241
$$ plain form
2629 1075 816 -1332 -415 1424 -66 -1419 496 1230 -923 -961 1206 564 -1408 -140 1460 -309
2645 -309 -1365 724 1141 -1069 -808 1318 409 -1422 54 1413 -488 -1244 875 958 -1167 -576 1370
2662 1370 151 -1418 289 1323 -713 -1115 1052 788 -1310 -407 1405 -39 -1405 469 1229 -873
2678 -873 -976 1135 586 -1332 -167 1375 -288 -1286 692 1087 -1034 -760 1281 364 -1389 66 1385
2695 1385 -462 -1213 855 951 -1135 -591 1305 176 -1362 271 1270 -667 -1057 1012 736 -1244 -353
2712 -353 1368 -72 -1350 480 1204 -855 -942 1118 585 -1306 -192 1340 -250 -1259 636 1055
2728 1055 -972 -741 1203 357 -1319 65 1312 -476 -1166 849 919 -1104 -578 1289 201 -1338
2744 -1338 238 1262 -605 -1049 947 744 -1178 -371 1289 -51 -1294 443 1139 -815 -911 1089
$$ packed form
2629A075k59k148R17J839j490j353J915P34k153l8K167o42j972J268J600j769
2645c09j056K089M17k210K61K126r09j831J476J359j901p56K119Q3k125N91J946
2662A370j219j569J707J034k036m02K167k64k098R03J812j444j366J874P60k102
2678h73j03K111n49j918J165J542j663r98J978L95k121K74K041r17j753J455J319
2695A385j847p51K068R6k086N44J896j129j538J633R99j937l90K069k76j980Q91
2712c53J721j440j278J830P24k059q7K060n33j891J114J532j590j009J895M19
2728A055k027K31J944q46j676J384J247j788o90K015P0k023N26J867j088j539
2744a338J576J024j867m44J996k03j922Q07J660j340j243J737O96j954r6K000
$$ plain form
2760 1089 554 -1272 -191 1304 -230 -1262 588 1045 -915 -764 1135 390 -1261 3 1256 -400
2776 -400 -1132 775 881 -1050 -561 1235 185 -1293 224 1244 -581 -1051 911 771 -1128 -408 1247
2793 1247 17 -1256 371 1109 -750 -899 1003 562 -1210 -198 1257 -216 -1207 572 1018 -905
2809 -905 -752 1122 406 -1253 -23 1233 -358 -1122 698 884 -981 -567 1164 194 -1227 190 1175
2826 1175 -558 -1007 877 739 -1102 -405 1221 42 -1223 332 1111 -688 -894 961 567 -1140
2842 -1140 -221 1194 -174 -1152 514 971 -857 -730 1063 368 -1209 -25 1201 -358 -1102 686
2858 686 879 -959 -590 1111 221 -1185 151 1133 -507 -955 828 712 -1038 -359 1169 22 -1165
2875 -1165 357 1070 -678 -861 945 563 -1115 -224 1165 -148 -1126 490 938 -800 -698 1001 357
$$ packed form
2760A089n35j826J081J495j534j032J850M57j960J51J899p45j651J264J253j656
2776d00p32J907J06j931M89J796j050j478J517J020j825m70J962j40j899P20J655
2793A247j230j273J627P38j859j49J902m41j772J012J455j473r91J779M46j923
2809i05J53J874p16j659J230J256j591p64J820J86j865M14J731r70j421J417R85
2826A175j733m49J884j38j841O97J626j179j265J555P79j799k06J855l94j707
2842a140R19J415j368r78J666M57j828J27J793o95j577J184J226j559p44J788
2858F86J93j838L69J701q90j406J336R82j640m48J783j16j750O79J528j147j187
2875a165J522P13j748j83J806l82j678Q91J389j313r78J616M48j738J02J699o44
$$ plain form
2892 357 -1131 -28 1126 -359 -1044 676 820 -934 -550 1097 218 -1148 149 1099 -472 -941 781
2909 781 691 -976 -355 1109 19 -1099 345 1002 -658 -803 904 525 -1082 -197 1129 -155 -1099
2926 -1099 475 921 -771 -683 969 369 -1079 -44 1082 -319 -984 623 776 -890 -507 1038 172
2943 172 -1110 162 1060 -476 -908 757 675 -961 -374 1071 48 -1073 289 966 -601 -772 860
2960 860 508 -1004 -187 1070 -155 -1027 468 880 -757 -661 943 364 -1062 -60 1054 -293 -972
2977 -972 582 766 -824 -506 970 178 -1044 140 987 -471 -864 733 634 -932 -352 1047 35
2994 35 -1057 298 955 -580 -755 831 515 -968 -192 1030 -129 -964 443 830 -722 -618 917
3011 917 328 -1036 -27 1024 -309 -945 578 750 -820 -510 947 191 -1017 106 955 -439 -817
$$ packed form
2892C57j488J103J154j485o85J720J44j754L84J647q79j366J297R50j571m69J722
2909G81r0j667O21J464j090j118J444O57j660j45J707l79j607Q85J326j284r44
2926a099J574M46j692Q8J652o00j448J035J126j401o65J607J53j666L83J545q66
2943A72j282J272Q98j536m32J665q2j636N87J445j023j121J362O77j567j71J632
2960H60l52j512Q17J257j225q72J495M12j637R6J604n79j426J002J114j347o79
2977i72J554J84j590L18J476p92j222J184Q47j458l93J597r9j566N80J399j012
2994C5j092J355O57j535j75J586l16j483P76J222j159q35J407L87j552J04J535
3011I17n89j364J009J051j333o36J523J72j570L10J457p56j208J123Q49j394l78
$$ plain form
3028 -817 691 607 -881 -319 997 23 -1000 305 927 -570 -727 808 506 -938 -196 1009 -108
3045 -108 -958 417 831 -665 -605 850 316 -967 -37 966 -298 -890 556 715 -801 -480 941
3062 941 179 -995 107 952 -417 -823 649 599 -840 -340 942 39 -951 262 877 -538 -704 773
3080 773 463 -911 -171 986 -118 -940 411 805 -643 -599 833 345 -919 -41 935 -254 -863 525
3098 525 693 -751 -466 883 166 -960 109 908 -407 -795 641 600 -831 -349 919 48 -927 242
3116 242 843 -512 -678 725 462 -856 -169 925 -98 -882 401 786 -623 -579 823 343 -916
3133 -916 -43 924 -233 -842 492 676 -705 -468 833 186 -904 93 862 -381 -760 614 559 -798
3151 -798 -319 901 32 -917 245 836 -500 -672 697 456 -823 -185 886 -95 -853 379 731 -598
$$ packed form
3028h17J508q4j488N62J316r74j023J305O22j497j57J535l02j444P42J205j117
3045a08q50J375M14j496O0J455n34j283R30J003j264n92J446J59j516L21J421
3062I41p62j174J102Q45j369m06J472n0j439N00J282r03r90J213O15j415j66J477
3080G73l10j374P40J157j104q22J351L94j448M4J432m88j264Q78R76j189o09J388
3098E25J68j444K85J349p17j126J069P99j315l88J436m1j431M82J268q71r75J169
3116B42O01j355j66J403k63j318O87J094j023p84J283L85j409M4J402m80j259
3133i16Q73R67j157o09J334J84j381K37J301o47j090R97P69j243l79J374n5j357
3151g98M79J220q69r49J162N91j336j72J369k41j279O38J071r81p58J232L52j329
$$ plain form
3169 -598 -531 790 296 -873 -13 888 -244 -808 504 660 -699 -436 826 174 -885 97 838 -372
3187 -372 -724 588 520 -768 -288 846 16 -855 253 788 -499 -648 687 426 -832 -182 878 -95
3205 -95 -835 358 731 -575 -528 746 289 -828 -26 843 -233 -777 487 619 -686 -412 824 166
3223 166 -871 96 826 -361 -729 555 524 -750 -313 823 32 -833 220 756 -483 -627 665 398
3241 398 -807 -159 851 -104 -820 354 716 -572 -537 723 314 -814 -41 838 -207 -749 454 623
3259 623 -650 -398 776 155 -840 95 813 -356 -713 571 520 -731 -309 809 39 -836 195 747
3277 747 -446 -615 635 399 -754 -165 813 -91 -781 342 692 -553 -509 725 298 -803 -38 821
3295 821 -199 -758 437 623 -608 -419 748 176 -788 83 777 -324 -670 553 496 -703 -296 792
$$ packed form
3169e98O7J321m94j169Q60R01j132n64J312J56j359K63J262o52j059R82P41j210
3187c72l52J312o8j288M80J134q30q71J108N35j287j49J335k61j258O50J060r73
3205i5p40J193L73j306M7J274m57j117Q02Q69j076n44J264J32j305K74J236o58
3223A66j037R67P30j187l68J284l1j274M37J136p91q65J053N36j239j44J292k67
3241C98j205O48J010r55p16J174L62j288L5J260m09j128P73Q79j045n42J203J69
3259F23j273K52J174o21r95R35P18j169l57J284n1j251M22J118p70q75J031N52
3277G47j193j69J250k36j153N89R78r04o90J123L50j245M4J234m27j101P65Q59
3295H21j020n59J195J86j231J89J167n72r64Q71O94j101l46J223n7j199M07J088
$$ plain form
3313 792 45 -822 189 740 -433 -612 606 408 -743 -182 778 -72 -774 310 650 -527 -490 682
3331 682 287 -762 -31 788 -206 -744 437 609 -606 -406 740 182 -783 72 757 -297 -652 509
3349 509 487 -671 -287 746 28 -764 205 698 -441 -580 604 369 -743 -183 771 -70 -757 296
3367 296 644 -509 -480 654 280 -728 -25 748 -197 -678 435 569 -585 -361 730 164 -764 94
3385 94 742 -305 -637 514 488 -645 -287 729 43 -738 192 676 -408 -544 573 361 -713 -164
3403 -164 740 -87 -727 299 626 -510 -481 639 272 -701 -54 734 -186 -671 389 549 -561 -350 694
3422 694 151 -724 88 709 -298 -602 501 457 -641 -258 722 45 -728 177 675 -380 -537 545 361
3441 361 -660 -150 705 -91 -685 290 602 -486 -445 633 258 -711 -38 716 -179 -657 389 552 -538
$$ packed form
3313G92p47q67J011N51j173j79J218j98j151N61R60q50p02J084L40j177L7J172
3331F82l95j049P31Q19r94n38J181J72j215K00J146n58r65Q55O85j054l55J161
3349E09k2j158L84J033p18p92R69M93j139j39J184k35j112N60R54q41o87J053
3367B96L48j153K9J134l74j008P03P73r45m81J113J34j154K24J091n66r28Q58
3385I4O48j047l32J151k6j133L58J016o86p81R30M84j084j36J117k12j074N49
3403a64R04q27o40J026L27j136K9J120l67r73O47P88r20m85J060J60j110K11J044
3422F94n43q75Q12O21j007l04J103m4j098L83R80o77p73R05M98j055j57J082j84
3441C61j021N10Q55p96n94R75L12j088M1J078l75r69O73P54q95m78J046J63j090
$$ plain form
3460 -538 -365 667 162 -687 79 690 -276 -573 482 440 -610 -233 694 41 -701 184 661 -389 -531
3479 -531 538 354 -657 -165 678 -72 -669 254 566 -464 -445 587 236 -681 -32 676 -193 -645 372
3498 372 517 -535 -349 648 151 -689 55 661 -256 -576 461 438 -573 -243 668 31 -670 191 622
3517 622 -371 -503 531 338 -638 -143 683 -66 -662 264 569 -449 -430 565 241 -651 -46 647 -174 -613
3537 -613 358 478 -521 -340 631 136 -680 69 646 -281 -560 446 424 -571 -244 641 36 -647 158 597
3557 597 -362 -474 515 312 -612 -127 658 -82 -634 259 544 -447 -426 570 231 -635 -49 628 -163 -600
3577 -600 335 468 -503 -318 591 129 -630 68 618 -269 -536 442 405 -558 -230 641 46 -636 169 593
3597 593 -340 -469 485 325 -586 -133 622 -62 -597 257 521 -430 -400 553 209 -635 -40 627 -166 -585
$$ packed form
3460e38J73J032n05q49P66O11r66k97J055m2j050L77R27o53p42Q85M77j050j42
3479e31J069j84j011M92Q43p50n97R23L12j030J9J032l51r17O49P08q69m52J017
3498C72J45j052J86R97m97q40P44O06r17l20J037k3j011L30R11o37p01Q61M31
3517F22r93j32J034j93r76M95Q26p49n96R26L05j018J9R95l24q92O05O93q21m39
3537f13R71J20r99J81R71m95q16P49N77r27k79J006k2r95L27Q85o05o83Q05M39
3557E97r59j12R89k03r24M85P85p40n52Q93K85r91K1R96l39q66N86O77p91m37
3577f00R35J33r71J85R09m62p59O98N50q87k67R78l7r63L28Q71n95o82Q05M24
3597E93r33j29R54j60r11M53P55o84n35Q54K64r51L0R53l44q44N95O67p93m19
$$ plain form
3617 -585 325 464 -484 -327 572 135 -620 61 591 -252 -503 420 386 -529 -209 617 36 -599 168 570
3637 570 -340 -459 481 325 -568 -147 615 -33 -587 240 519 -400 -386 510 209 -589 -37 587 -149 -563
3657 -563 316 459 -461 -312 561 130 -608 40 577 -236 -512 374 376 -504 -225 579 37 -580 150 538 -314
3678 -314 -443 476 308 -553 -118 600 -45 -581 237 503 -376 -396 492 241 -555 -55 574 -140 -546 298
3698 298 431 -449 -293 535 117 -593 30 568 -229 -491 367 385 -500 -242 561 60 -571 128 518 -275
3718 -275 -421 428 305 -523 -123 574 -47 -542 241 482 -370 -372 481 223 -549 -50 567 -133 -524 289 429
3739 429 -429 -295 516 116 -566 42 529 -234 -476 373 347 -484 -205 549 31 -563 137 506 -288 -409
3759 -409 422 290 -509 -122 547 -47 -525 225 462 -372 -335 487 202 -540 -27 548 -141 -507 279 416
$$ packed form
3617e85R10J39r48J57Q99m37p55O81N30q43k51R23l4r15L20Q26n81o35P67M02
3637E70r10j19R40j56q93M21P62o48n54Q27K79r19J4Q96l01p98N52O24p36m14
3657e63Q79J43r20J49Q73m31p38O48N37q13k76Q86Kq80K79Q04n42o17P30L88q52
3678c14j29R19j68q61M35P18o45n36Q18K66q79k0Q88k51p96N00O29p14m06Q44
3698B98J33q80J56Q28m18p10O23N38p97k62Q58J8q85K58Q03n01o31O99L90p93
3718b75j46Q49j23q28M00O97o21m95P83K41q52kQ53k58p72M99O17p00l91Q13J40
3739D29q58J34Q11m00o82O08M87p63k42Q49k6q31K79P54n18n94P00L69p94j21
3759d09Q31j32p99L87O69n94m78P50K37q34L7Q22k85p42N13N75o89l66P86J37
$$ plain form
3779 416 -421 -283 501 117 -539 46 511 -213 -453 349 329 -472 -199 520 15 -533 136 485 -290 -405
3799 -405 419 289 -503 -117 540 -43 -504 208 453 -351 -324 459 197 -496 -29 526 -130 -471 297 395 -417
3820 -417 -260 495 117 -533 62 503 -203 -449 324 322 -446 -196 503 22 -517 117 468 -279 -386 406 260
3841 260 -480 -106 525 -45 -492 207 445 -329 -316 451 196 -483 -23 507 -127 -447 280 370 -387 -251 473
3862 473 106 -506 51 485 -210 -427 332 327 -439 -190 491 37 -499 113 451 -253 -362 374 243 -457 -103
3883 -103 508 -52 -471 200 433 -326 -305 443 192 -486 -22 505 -116 -450 263 372 -363 -243 448 104
3903 104 -482 48 463 -215 -406 326 296 -418 -162 473 35 -491 109 444 -263 -375 352 242 -450 -112
3923 -112 461 -52 -456 194 395 -307 -289 412 178 -455 -21 481 -113 -434 270 357 -360 -237 443 115 -455
$$ packed form
3779D16q37J38P84l84o56N85M65p24k40Q02k0q01K73P19n05n48O69L49p75j15
3799d05Q24j30p92L86O57n83m61P12K45q04K7P83k62o93M67N55o56l41P68R8q12
3820d17J57P55l78o50N95M41p06k46P73kp68K50O99m81n39O34L51p47j07P92j46
3841B60p40L74O31n70m47O99K38p74J3P67k55o79M60N30o34l20P27R0p57J36P24
3862D73l67o12N57M34o95k17P59np66K49O81m54n36O12L38p04j09P36j31p00L54
3883a03O11n60m19O71K33p59K1P48k51o78M64N27o21l34P13J09p35J20O91l44
3903A04n86N30M15o78j91P32l0p14K56O35m38n26O00L35p07j12P27j10o92L38
3923a12N73n13m04O50K01p02J8P01k34o33M34N02n94l21P04Q7p17J23O80l28n70
$$ plain form
3944 -455 42 459 -177 -391 316 290 -401 -170 448 17 -466 120 409 -268 -357 354 216 -443 -108 463 -50
3965 -50 -446 190 391 -296 -282 399 168 -437 -8 457 -110 -387 267 349 -348 -215 442 105 -447 59 446
3986 446 -181 -371 291 290 -382 -163 430 17 -433 105 405 -250 -337 331 207 -428 -97 444 -48 -432 173
4007 173 385 -297 -278 380 171 -432 -22 440 -95 -397 238 321 -329 -212 406 96 -427 55 426 -172 -361
4028 -361 297 289 -369 -157 426 35 -418 98 399 -222 -325 318 218 -394 -92 423 -45 -411 174 355 -292
4049 -292 -263 373 153 -426 -20 434 -97 -394 231 318 -318 -208 390 90 -403 59 405 -160 -352 288 266
4070 266 -358 -145 424 25 -417 105 378 -233 -317 311 212 -389 -90 410 -32 -399 160 348 -276 -263 350
4091 350 142 -402 -25 414 -98 -379 236 317 -314 -212 389 103 -390 33 404 -144 -334 274 273 -326 -134
$$ packed form
3944d55M97M17o36k14P07k6o91K31O18m31m83N86K89o77q9P11j38o59L35N71n13
3965e0l96O36K01o87J4O81k31o05M29M65n67k77O54Q2o97J33O57l37n52N06L87
3986D46o27j90O62jo72K19N93m13m50N38L00o55q7O68j24o35L31N41m92l84O05
4007A73K12o82J9O58k09o03M10M62n35l02O35Q3o50J17O18l10n23M82L71n98j89
4028c61O58qo58K12N83l91m53N16L01o21j03O43j00o12L02N15m68l66N85J81o47
4049b92K9O36k20n79M06M54n31k97O25Q7o36J10N98l00m93M62L46n65j92O40k2
4070B66o24K13N69l99m42N22K73o11q4O28r9o01K99N00m42l67N59J88o24J3O13
4091C50k08n44L77M39n12k81O15Q1o31J02O01k86m93M23L71n48j90O08jn99J92
$$ plain form
4112 -134 390 40 -396 107 373 -205 -296 316 214 -372 -82 402 -37 -380 152 334 -265 -259 341 145 -386
4133 -386 -23 391 -97 -348 209 285 -310 -185 377 78 -394 47 394 -145 -329 258 256 -327 -145 388 26
4154 26 -367 105 364 -212 -277 315 193 -366 -75 385 -40 -388 154 331 -255 -251 329 161 -377 -29 375
4175 375 -92 -348 204 283 -287 -190 347 76 -383 38 376 -152 -317 267 247 -328 -146 392 40 -362 103
4196 103 350 -189 -280 297 203 -337 -82 362 -26 -365 152 321 -256 -236 327 144 -372 -28 369 -103 -358
4217 -358 194 282 -292 -198 342 99 -370 39 371 -135 -307 259 237 -332 -130 372 30 -373 101 358 -197
4238 -197 -284 292 204 -349 -88 369 -31 -356 145 315 -250 -234 318 128 -366 -23 372 -105 -356 199 281
4259 281 -309 -200 344 76 -373 29 357 -153 -308 245 226 -319 -124 362 19 -364 110 347 -201 -283 295
$$ packed form
4112a34N24l50m36N03K66n78r1O12j02n86K90M84m39l43N32J82n99OO00j96n31
4133c86L63M14m88k51N57P6n95J25N62k99m72M41L47n39j84N87kn83J82N33l62
4154B6l93M72K59n76o5N92j22n59K91M60m25l48N42J77n86MN80j68n38L48M04
4175C75m67k56N52P9n70R7N37k71m59M21L38n28j65N84k0n75J82N38l52m02M65
4196A03K47n39r1N77r4n40K55M44l88l39N17J69n77K0N63j83n16L44L97m72k55
4217c58N52Q8n74R4N40k43m69M09L32n06j72N66k2n69K02N02l42m03M74K57n55
4238a97q7N76q8n53K61M57m00l25N01J70n65J6N52j90m94L43L95m77k51N55Q2
4259B81n90J09N44k68m49M02L28n10j55N53j9n45J95M86l43l83M74K37n48q2N78
$$ plain form
4280 295 195 -345 -79 372 -29 -362 147 304 -240 -240 316 129 -360 -27 355 -105 -345 189 268 -291 -177
4301 -177 337 68 -375 39 354 -154 -308 231 226 -307 -133 356 26 -359 106 335 -183 -260 280 174 -335
4322 -335 -66 365 -39 -356 155 312 -255 -221 312 136 -351 -24 358 -90 -334 183 255 -292 -186 321 65
4343 65 -356 33 341 -154 -307 240 225 -318 -135 350 23 -354 93 336 -185 -257 278 181 -327 -69 349
4364 349 -31 -326 152 290 -239 -214 316 123 -349 -13 355 -90 -319 182 267 -277 -186 324 73 -345 22
4385 22 336 -143 -300 230 218 -310 -143 335 29 -356 86 326 -188 -280 273 192 -325 -86 357 -12 -333
4406 -333 133 304 -222 -220 304 140 -334 -21 343 -91 -320 202 269 -271 -183 334 80 -354 34 333 -129
4427 -129 -299 227 226 -300 -134 325 23 -343 80 310 -185 -259 272 186 -324 -74 359 -22 -336 136 300
$$ packed form
4280B95j00n40K66M51m01l33N09J57n44%N56j87m89L33L82m60k40N34P9n59J14
4301a77N14k69m43M14L15n08j54N39nn33J74M89l30l85M65K29n18p7N40j06n09
4322c35K69M31m04l17N11J57n67L4N33j76m87L27L82m48k44N17P2n47J06N07k56
4343F5m21L89L08m95j53N47j5n43J83M85l27l77M47K43n21p2N35r7n08K58M18
4364C49l80k95M78J38n29K5N30j93m72L36L68m45k29N01Q5n44R1N10k51m18L67
4385B2L14m79j57N30j2n28J67M78l06l85M42K40n14r2N53q1n17K39M43l69l21
4406c33M66J71n26KN24j64m74L13L64m34k29N22O7n40Q8N17k54m34L88K99m62
4427a29j70N26jn26J66M59l02l66M23K30m95p4N31q6n10K50M33l81l14M72J64
$$ plain form
4448 300 -227 -208 306 133 -338 -26 352 -68 -317 182 261 -267 -176 340 74 -349 32 336 -127 -301 221
4469 221 220 -299 -129 332 26 -345 87 315 -178 -259 263 167 -317 -58 348 -36 -331 135 298 -225 -220 297
4491 297 132 -329 -14 365 -77 -313 177 260 -250 -169 321 78 -343 25 321 -138 -282 219 214 -297 -138
4512 -138 332 25 -345 75 303 -191 -279 261 172 -309 -84 342 -28 -331 131 290 -216 -211 293 129 -327
4533 -327 -16 351 -79 -301 185 267 -246 -163 321 87 -336 20 325 -131 -291 213 223 -289 -136 330 23
4554 23 -346 59 307 -182 -278 254 182 -318 -96 331 -19 -344 114 294 -209 -228 281 134 -309 -35 343
4575 343 -76 -309 179 261 -254 -178 315 101 -333 15 336 -120 -287 219 215 -289 -136 319 27 -343 74
4596 74 305 -177 -265 247 174 -309 -93 326 -22 -328 118 297 -201 -229 288 143 -318 -38 325 -67 -314
$$ packed form
4448C00n27J9N14j73m71L12L78m20k49M99P9n28R1N16k66m23L81L04m63j74N22
4469B21jn19J70M61l06l71M32K28m93q1N22r6m84K59M06l84k95M66J63n23NN17
4491B97j65m61L15L79m42k36M90Q3n10Q1M90k43m21L68K96m59j44N01nn11J59
4512a38M70l07l70M20K28m94q8N40q9m81K25M26l70l03M62J59n06NN04j64m56
4533c27L11L67m30k22M86Q2n13Q3M84k34m23L56L05m56j60N04J0n12J53M66l07
4554B3l69M05K48m89r6N32p2n00K22M27l50l25M58J80n03j9N09j47m43K74L78
4575C43m19k33M88Q2n15P6M93k14m34L48L21m56j67N06mn04J53M55k92l70M17
4596G4K31m82q8N12p3m83K16M19l48l06M46J79m98k8N17j45m61K80L63l92k47
$$ plain form
4617 -314 170 265 -245 -186 304 99 -330 16 338 -113 -293 208 231 -285 -153 317 38 -333 60 307 -168
4638 -168 -256 246 186 -313 -90 328 -27 -336 119 277 -220 -221 279 132 -326 -47 338 -69 -308 160 263
4659 263 -238 -180 301 100 -327 11 323 -116 -290 212 238 -283 -142 323 35 -338 55 312 -167 -274 243
4680 243 188 -304 -110 327 -9 -332 112 298 -219 -227 270 140 -325 -41 333 -67 -317 162 275 -237 -189
4701 -189 304 105 -318 8 331 -106 -289 205 222 -271 -141 325 40 -332 65 303 -163 -267 232 182 -307
4722 -307 -114 327 5 -335 96 297 -198 -242 265 143 -325 -54 331 -62 -325 158 278 -244 -192 318 107
4743 107 -329 5 344 -105 -300 200 250 -269 -148 317 51 -327 52 316 -162 -264 232 187 -306 -88 333
4764 333 -1 -335 98 294 -207 -246 256 151 -326 -64 325 -56 -326 151 262 -248 -198 301 108 -320 0
$$ packed form
4617c14M84R5n10N9M90k05m29L46L22m51j80N01K3n16J32M70k79l71L93K47m75
4638a68q8N02o0m99K23M18l55l09M55J58m97jN00j47m58K79L85m07k39M68J03
4659B63n01N8M81k01m27L38L12m39j74N02K6n21J41M65k88l73L93K57m79j07N17
4680B43n5m92J94M37l36l23M44J86n17qM97j30m65K84L74m00k50M79J13n12M8
4701a89M93j99m23L26L23m37j83M94J7m93J30M66k85l72L97K38m66j04M99n0m89
4722c07J93M41l22l40M31K01m95m4N07j22m68K71L85l93k63M83J20n22N2N10k11
4743A07m36L34L39m49j95N00N0n19J21M65k66l78L79K64m78j02M96m5m93K18M21
4764C33l34l34M33J96n01l9N02j05m77K62L89l81k70M77J11n10N0M99j93m28L20
$$ plain form
4785 0 339 -106 -312 189 249 -262 -170 326 77 -338 38 321 -142 -274 231 192 -297 -123 332 -4 -340 87
4807 87 311 -193 -244 263 154 -322 -55 321 -56 -333 146 272 -236 -212 288 114 -322 -5 333 -96 -294
4828 -294 188 239 -264 -158 326 70 -332 38 330 -142 -286 232 212 -296 -122 324 15 -333 85 290 -185
4849 -185 -248 262 149 -322 -77 326 -32 -326 128 282 -237 -230 287 120 -335 -25 332 -86 -308 183 246
4870 246 -260 -160 304 64 -331 45 322 -139 -270 221 214 -291 -116 338 20 -336 73 304 -173 -256 240
4891 240 168 -317 -77 324 -31 -329 125 287 -227 -214 281 123 -335 -32 325 -75 -309 162 249 -254 -185
4912 -185 303 88 -328 19 331 -117 -278 214 213 -278 -124 318 21 -336 79 301 -168 -256 239 166 -306
4933 -306 -85 323 -25 -315 119 270 -215 -209 278 128 -327 -40 328 -86 -313 159 253 -255 -178 312 93
$$ packed form
4785@L39m45k06N01O0n11R2M96k49m15L76K83m63j32N05l9m89J74M55l36l36M27
4807H7K24n04n1N07j09m76K67L76l77k77M79J26n08K4N00j74m36L17L38m29j98
4828b94M82N1n03J06M84k56m02L70K92m72j44N18k0n08J74M46l09l48M18K05m75
4849a85o3N10j13m71K45M03l58k94M54J54n19PN17j67m55L10L57m18k22M91O3
4870B46n06J00M64k40l95L76K77m61j31M91pn05J75M54l18l56M09K31m77q3M96
4891B40p2m85K40M01l55k98M54J62n14J3M95j58m58L03L57m00k34M71Q7n03O9
4912a85M88k15m16L47L12m48j61M92jm91J54M42k97l57M15K22m69q8M95p3m72
4933c06K21M08l48k90M34J51m85OM87j50m55K87L68m14k27M72R4n08P7M90k19
$$ plain form
4954 93 -332 1 320 -105 -291 207 233 -261 -133 317 46 -327 75 314 -166 -256 237 183 -291 -99 320
4975 320 -7 -333 109 282 -209 -235 250 134 -323 -40 316 -75 -305 144 247 -238 -174 289 79 -313 14
4996 14 314 -102 -281 206 226 -256 -133 317 57 -317 54 313 -138 -263 236 186 -295 -95 335 4 -314
5017 -314 92 282 -197 -236 260 138 -309 -55 312 -48 -310 127 251 -235 -204 267 109 -315 -14 314 -98
5038 -98 -272 187 240 -252 -152 298 59 -311 42 305 -126 -254 214 197 -271 -97 308 10 -301 77 280
5059 280 -169 -233 239 148 -303 -78 312 -26 -317 124 262 -215 -209 272 114 -307 -22 316 -76 -291 170
5080 170 233 -248 -167 291 74 -311 32 316 -118 -260 214 207 -257 -125 297 30 -305 80 288 -162 -231 234
5102 234 169 -285 -62 300 -32 -306 118 254 -209 -206 258 124 -300 -33 306 -77 -288 154 243 -239 -167 277
$$ packed form
4954I3m25L33L19m25j86M98K6m94J28M50k71l73M02K39m80r0M93n4m74J92M19
4975C20l27l26M42J73m91k6M85j16m57K83L56l91k30M49J03m85O4M63k10l92L27
4996A4L00m16j79M87K0m82J23M50k60l74L71K59m51j25M99n0m81K00M30l31l18
5017c14M06J90m79l9M96j22m47K54L67l60k62M37J24m86L1M71j58m24L01L28m12
5038i8j74M59N3m92J00M50k39l70L53K63m31j28M68j7m68J74M05k98l11L78K03
5059B80m49o4M72r1m51K25L90l38k91M41J38m77OM81j58m21K85L38l92k15M61
5080A70O3m81Q1M58k17l85L43K84m34j42M74pm64J32M22k67l35L85K08m50o9M65
5102B34o5m54K23L62l32k74M24J36m63LM64j34m24K67L39l83k11M42Q9m82P2M44
$$ plain form
5124 277 76 -318 24 307 -120 -265 193 222 -268 -125 314 39 -320 55 298 -148 -250 232 176 -280 -90
5145 -90 294 -11 -308 105 265 -196 -213 251 118 -299 -37 306 -66 -299 147 237 -237 -180 261 88 -301
5166 -301 8 297 -108 -260 195 208 -248 -116 300 50 -306 66 303 -141 -257 223 182 -289 -91 301 7
5187 7 -313 92 268 -182 -226 249 136 -304 -59 310 -53 -304 143 251 -212 -189 273 99 -311 -8 304
5208 304 -95 -273 164 213 -238 -140 286 48 -293 46 287 -130 -251 213 180 -264 -94 297 11 -302 80
5229 80 273 -176 -228 226 135 -294 -59 294 -46 -292 122 241 -208 -194 269 100 -310 -9 304 -87 -280
5250 -280 172 221 -243 -150 291 68 -298 30 287 -121 -245 210 186 -263 -101 291 4 -295 87 276 -167
5271 -167 -220 222 150 -283 -64 282 -43 -289 104 233 -205 -195 251 102 -292 -17 281 -84 -274 167 223
$$ packed form
5124B77k01l94L42K83m27j45M58K9m90J43M39k75l59L75K43m46j02M82n6m56J90
5145i0L84l05k97M13J60m61j7M64j33m17K62L43l72k33M46R0m74N7M41j73l89
5166c01L09K89m05j52M55J3m56J32M16k50l56L72K37m44j16M80m1m71J98L92k94
5187Gl20M05J76m50m4M75j13m40K45L69l63k51M47J08m63K3M62j74m10L03L12
5208C04l99j78M37M9m51R8M26k38l41L39K41m17j21M64l3m44J70L91k86l13L82
5229H0J93m49n2M54r1m29K35L53l40k46M14J19m49J4M63j69m10L01L13l91j93
5250b80M52M9m64R3M41k23l66L28K57m08j24M55k4m49J62L92k87k99L82J89m43
5271a67n3M42p2m33K19L46l25k46L93J29m38J0M46j49l94K75K98l65j90M41N6
$$ plain form
5292 223 -232 -155 282 69 -302 26 301 -110 -252 200 195 -252 -117 294 26 -297 67 278 -153 -225 225
5313 225 148 -277 -72 300 -32 -294 95 242 -186 -197 248 108 -291 -33 281 -64 -261 137 210 -220 -152
5334 -152 259 66 -283 19 280 -100 -237 190 199 -245 -126 288 47 -287 62 281 -141 -234 216 174 -269
5355 -269 -80 294 -7 -289 103 251 -184 -211 241 119 -294 -50 292 -52 -288 131 221 -206 -170 249 79
5376 79 -284 7 285 -91 -244 169 197 -225 -124 279 45 -281 52 276 -135 -230 189 162 -241 -95 280
5397 280 -5 -269 87 257 -167 -208 215 123 -278 -55 277 -57 -285 118 223 -210 -184 249 96 -287 -10
5418 -10 293 -86 -259 165 198 -230 -139 270 51 -277 43 269 -112 -225 205 181 -234 -91 288 9 -269
5439 -269 81 247 -162 -197 218 122 -262 -53 265 -48 -266 115 217 -186 -176 236 88 -286 -16 279 -75
$$ packed form
5292B23m55P7M37k13l71L28K75m11j42M52nm47J35M11k68l23L64K11m31p2M50
5313B25p7m25K05L72l32k62L89J47m28j1M45j40l99K58L14l45j97L98P3m30O8
5334a52M11j93l49L02K61l80j37M27Rm44J19M14k41l34L49K19m22r3M50m2m43
5355b69J89L74l01k82L92J48m35k7M52j22m13K44L42l44k36M19R0m27L6M19j70
5376G9l63K91K78l76j53M13K8m22J01M03k34l26L33K24m11r5M19k7m03J46L75
5397B80k85k64L56J70m24m1M23r2m01K23L32l34k28M03J05m33K6M33j53l83K77
5418a0L03l79j73M24L3m28R1M09k19l28L20K26l81j13M30k4m15J43L79k79k78
5439b69L50J66m09l5M15r6l84K09L18l13k18L81J02m03J0M12j48l74K70K95l54
$$ plain form
5460 -75 -256 145 210 -202 -144 258 70 -270 24 267 -111 -233 191 172 -238 -95 285 19 -285 72 254
5481 254 -147 -215 226 151 -248 -63 289 -27 -269 110 226 -176 -180 227 104 -265 -29 269 -69 -255 135
5502 135 203 -203 -147 243 70 -266 8 269 -96 -227 172 177 -223 -114 261 33 -272 59 259 -134 -211 219
5524 219 155 -254 -81 282 -8 -262 97 245 -163 -191 230 124 -256 -37 270 -49 -251 126 211 -200 -153
5545 -153 244 83 -256 6 258 -89 -230 161 184 -215 -116 262 49 -251 46 251 -118 -203 197 157 -228
5566 -228 -77 267 -3 -253 85 244 -149 -188 216 131 -259 -53 269 -37 -258 123 221 -192 -159 237 88
5587 88 -264 -3 268 -80 -241 163 202 -227 -123 257 45 -272 27 254 -117 -215 181 166 -225 -94 260
5608 260 10 -245 85 239 -151 -171 210 117 -247 -43 265 -36 -246 110 220 -174 -165 228 89 -254 -17
$$ packed form
5460g5j81M01O5m12N8M02j88l40K94K43l78j22M24j9m10J43L80k66l04L57J82
5481B54m01o8M41p5l99J85L52l16k42L79J16m02mM07j23l69K36K98l38j86L90
5502A35O8m06N6L90j73l36K74K61l65j31L99Nm00J09L75k28l05L31K00l93p7M30
5524B19o4m09J73L63k90k54L59J48m08k8M21j06l80K19L07l19k02L77Q5m11M7
5545a53L97j61l39K62K52l47j41L91K3l99R9L78k13l00K97K05l69q5M00m0l85
5566b28J51L44k70k50L38J59l93l9M04q5l90K06L22l06k21L81R8m13L3L96j49
5587H8l52K61K71l48j61M04L9m29J04L80k12l17K99K27l71r8L96j5l91J31L54
5608B60k50k55L30J54l90k0L81r3l64K04L08l01k10L56J10l94RL93j39l43K37
$$ plain form
5629 -17 247 -81 -238 148 184 -201 -134 271 61 -265 29 260 -105 -221 188 172 -229 -85 269 18 -269
5650 -269 78 255 -137 -200 208 135 -238 -54 277 -30 -254 103 223 -184 -161 222 102 -259 -23 263 -56
5671 -56 -229 136 202 -189 -126 233 62 -251 29 254 -108 -217 174 166 -227 -90 259 20 -258 68 252 -122
5693 -122 -192 213 137 -247 -53 278 -15 -263 106 229 -173 -163 226 100 -257 -20 272 -58 -246 143 202
5714 202 -196 -145 245 66 -248 12 249 -97 -216 171 171 -213 -88 258 26 -249 61 237 -138 -188 191
5735 191 133 -222 -56 263 -9 -250 92 222 -160 -171 212 94 -254 -23 260 -58 -238 132 193 -205 -142
5756 -142 251 67 -260 17 269 -94 -225 182 186 -214 -98 261 38 -257 59 252 -130 -198 198 141 -226
5777 -226 -69 264 -10 -244 90 217 -156 -178 204 94 -242 -26 247 -37 -234 118 200 -185 -140 225 70
$$ packed form
5629a7K64l28j57L86L6l85O7M05k10l26K94K31l65j16M09j6m01J44L54k51k87
5650b69L47J77l92o3M08p3l73J84L31l07k24L57J20m07K3L83j20l61K36K86l19
5671e6j73L65O6l91O3L59j71l13K80K25l62j09L91ql93J37L49k39k78L26J84l74
5693a22p0M05p6l84J94L31k93k48L69J23m02J0L89j26l57K37K92l30j88L89N9
5714B02l98N1L90j79l14K60K37l46j19L87%l84J25L46k32k75L10J76l75n0L79
5735A91n8l55J66L19k72k41L42J30l82j1L83j18l48K31K83l18j80L70O1l98O3
5756a42L93j84l27K77K52l63j31M07Mm00J16L59k23k95L16J93l82o8L96n7l67
5777b26J57L33k74k34L34J27l73k2L82j10l36K16K73k84j97L52Q2l85M5L65j55
$$ plain form
5798 70 -244 6 244 -84 -232 162 189 -213 -104 259 42 -252 44 252 -111 -198 195 150 -217 -68 266
5819 266 8 -247 94 235 -155 -179 210 128 -244 -30 254 -38 -241 114 208 -175 -145 220 74 -243 2
5840 2 240 -67 -211 147 173 -200 -111 234 39 -247 40 240 -111 -201 169 143 -219 -79 240 6 -234 73
5862 73 224 -138 -185 206 115 -240 -31 247 -44 -248 119 211 -176 -159 228 83 -250 3 251 -73 -226 154
5884 154 182 -202 -121 235 52 -234 31 232 -99 -194 177 154 -207 -80 238 13 -234 75 220 -118 -174 195
5906 195 128 -217 -33 245 -30 -244 112 211 -165 -153 218 77 -244 -6 250 -73 -236 143 170 -206 -129 232
5928 232 47 -252 31 236 -110 -216 172 162 -212 -91 251 21 -235 66 234 -124 -175 194 134 -219 -50
5949 -50 249 -21 -231 85 206 -159 -145 201 79 -230 -15 232 -59 -224 115 177 -180 -138 218 57 -248
$$ packed form
5798G0l14K50K38l28j48L94K7m02J09L63k17k94K96K08l63q7L93m5l67J49L34
5819B66k58k55L41J41l90k4L89q2l72K14K84k92k03L55R4l83L0L65j46l17K45
5840BK38l07j44L58K6l73Q9L45j95k86K87K00l51r0L70k6l62J40L19k34k40L07
5862G3J51l62m7L91r1l55K09K78k91k04L67R2l87J7L87j45l33K53K48l24j53L80
5884A54K8l84Q1L56j83k86K65K01l31r5L71k3l61J27L18k25k47L09J45l38n6L69
5906A95o7l45J84K78k75k14L56R9l76J2L71j41l21K38K56l23j63L79K7l76P7L61
5928B32j85k99K83K05l46j06L88j0l74J21L42k30k56L01J68l58n1L69o0l53J69
5949e0K99k70k10L16J21l65J4L46j22l09K15K47k91j65L39O2l57M2L56j61l05
$$ plain form
5970 -248 14 224 -95 -206 155 158 -202 -91 237 18 -248 61 236 -130 -175 180 130 -222 -62 248 -14
5991 -14 -242 95 200 -156 -153 202 93 -238 -22 234 -56 -223 113 170 -187 -135 221 56 -239 5 233 -92
6013 -92 -210 139 156 -197 -98 215 37 -239 39 226 -110 -181 175 134 -216 -65 241 -9 -231 85 213 -144
6035 -144 -155 203 106 -227 -26 241 -55 -226 110 185 -178 -137 223 61 -242 8 231 -86 -212 146 163 -196
6057 -196 -105 232 34 -239 33 220 -113 -183 171 141 -201 -75 233 3 -221 74 216 -130 -165 197 113 -212
6079 -212 -21 228 -34 -223 99 185 -161 -145 202 69 -237 -5 231 -73 -211 142 164 -189 -114 231 40
6100 40 -240 34 231 -98 -198 168 147 -199 -84 238 13 -230 71 217 -129 -165 187 131 -213 -46 230
6121 230 -30 -217 96 190 -149 -153 205 73 -220 -25 221 -60 -214 109 162 -182 -123 208 47 -232 12 221
$$ packed form
5970b48K62K10l19j11L61Ll60J11L28k19k66L09J75l66m5L55n0l52J60L10k62
5991a4k28L37J05l56LL55j09l31K16K56k90j67L36N7l57N2L56j65k95K44K28l25
6013i2j18L49J7l53R9L13j78k76K78J87l36p1L56m1l50J51L06k50k22L16J28l57
6035a44j1L58r7l33K01K67k96j71L36P5l63M1L60j62l03K50K23l17j26L58J7l59
6057a96R1L37j98k73K72J87l33p0L54l0l42J26L08k30k24K95J42l46l5L62q4l25
6079b12J91K49k62j89L22Q6l46J6L47j33l06K32K36l04j38L53K2l53P5L45j91
6100D0k80K74J97l29j00L66k1l46J15L22k25k43L01J46l46l6L52n6l44J67K76
6121B30k60j87L13R4l39mL58j32k93J95K46k81j54L23N3l44N9L31j61k79K44K09
$$ plain form
6143 221 -104 -200 141 139 -204 -86 224 14 -238 65 219 -127 -182 169 115 -221 -55 233 -27 -222 100 197
6165 197 -149 -162 194 72 -226 -27 231 -55 -218 101 171 -179 -125 200 48 -228 -2 219 -87 -197 131
6186 131 145 -194 -95 207 22 -227 45 211 -112 -179 166 120 -197 -65 223 -14 -223 78 201 -141 -151 187
6208 187 94 -228 -25 228 -50 -227 108 173 -176 -124 194 43 -237 6 215 -89 -197 136 149 -182 -104 218
6230 218 23 -226 29 200 -103 -170 150 142 -200 -74 225 -1 -215 85 198 -117 -156 176 108 -209 -36 209
6252 209 -36 -199 102 173 -159 -134 189 60 -226 -2 214 -74 -201 129 156 -189 -103 204 40 -221 29
6273 29 200 -104 -185 158 126 -196 -59 222 0 -216 73 204 -130 -156 169 112 -194 -35 221 -31 -201 89
6295 89 173 -146 -132 177 71 -201 -13 211 -52 -192 114 153 -162 -110 197 49 -205 14 207 -92 -183 141
$$ packed form
6143B21l25r6L41kl43J18L10k10k52L03J54l46n5L51n4l36J66K88k60j95L22R7
6165A97l46j3L56j22k98J99K58k86j63L19P0l50N4L25j52k76K26K21l06j10L28
6186A31J4l39R9L02j85k49K72J66l23o7L45m6l17J32K88k37k09L01J23l42j0L38
6208A87r3l22K03K53k78j77L35O5l49N2L18j51k80K43K09l04j08L33J3l31P8L22
6230B18j95k49K55J71l03o7L20ql42J26K99k26k14L00J13l15l9L32o8l17J73K45
6252B09k45j63L01P1l32K5L23j29k86K24K16k88j27L30K7l45Q6L07j64k61K50
6273B9J71l04q1L43l2l22J37K81k22k16K89J31l34k6L25n7l06J59K56k52j70K90
6295H9Q4l19J4L09j06k72J88K24k63j40L06L9l15N2L07j48k54K19J93k99r1L24
$$ plain form
6317 141 143 -178 -68 216 21 -209 60 186 -113 -152 182 109 -197 -40 222 -13 -210 86 181 -141 -145 191
6339 191 87 -208 -13 213 -47 -203 102 163 -160 -115 183 52 -210 5 201 -78 -181 133 141 -167 -81 203
6361 203 25 -212 43 204 -97 -165 158 106 -182 -44 207 -6 -201 74 181 -123 -145 188 87 -206 -20
6382 -20 208 -37 -198 101 165 -151 -117 186 51 -209 3 197 -76 -181 118 140 -169 -88 198 31 -206 32
6404 32 185 -100 -171 139 121 -172 -60 192 2 -191 63 179 -115 -141 148 92 -177 -30 193 -34 -188 84
6426 84 166 -141 -138 183 61 -199 -20 203 -61 -181 109 148 -166 -98 193 34 -207 27 199 -91 -169 148
6448 148 121 -173 -57 201 15 -199 55 184 -106 -145 154 104 -168 -27 193 -27 -185 78 170 -124 -121 174
6470 174 78 -189 -21 185 -41 -187 110 153 -144 -104 171 54 -190 20 194 -69 -167 124 122 -171 -70 195
$$ packed form
6317A41Kl21J10K84j95k30K69J26k99l9L34p3l06J57K62k35j97K96R5l22mL36
6339A91j04k95J95K26k60j56L05O1l23M5K98j31k62K15J96k79j03L14Ql08Q6K84
6361B03j78k37K55J61l01o8L23n2k88J38K51k13j95K75J07l04k2L33j01k93J86
6382b0K28k45j61K99O4l16L4L03j35k60K12J94k73j05K99K2l09Q1K86j67k37K38
6404C2J53k85p1L10j8k93J12K52j90j93K54J16k94k6K89n6k69J47K23k27j54K72
6426H4Q2l07LL21j22k60J79K23k64j20K90L9l14O8K91j59k41K34J72k90p8L17
6448A48k7k94J16K58j86k14K54J29k90l9K99n0k72J41K20k20j58K63R2k94LK95
6470A74r6k67J68K06k26j46K97M3k97M0K75j17k44K10J74k63r8K91kk93J01K65
$$ plain form
6492 195 21 -194 55 185 -104 -152 156 103 -179 -39 196 -9 -189 78 174 -135 -123 161 70 -183 -22 189
6514 189 -33 -179 89 153 -139 -114 175 48 -193 -2 189 -53 -166 110 122 -147 -96 170 34 -192 35
6535 35 192 -77 -145 145 118 -166 -51 199 5 -192 67 174 -113 -125 164 80 -179 -26 197 -32 -180 83
6557 83 140 -140 -112 171 56 -191 -2 187 -63 -171 110 130 -163 -89 179 22 -186 20 172 -82 -153 129
6579 129 117 -158 -64 179 12 -189 50 176 -104 -137 162 87 -177 -48 182 -19 -181 80 143 -121 -123 149
6601 149 55 -185 -9 183 -63 -179 108 126 -154 -99 169 31 -192 20 186 -78 -160 126 118 -164 -74 182
6623 182 4 -190 46 161 -99 -141 130 97 -167 -48 184 -13 -178 72 160 -109 -134 157 78 -177 -20 176
6645 176 -35 -166 80 130 -146 -106 157 46 -188 1 170 -69 -160 110 112 -157 -70 167 23 -176 41 166
$$ packed form
6492A95j74k15K49J30k89m8L08n3k82J40K35k05j80K67R6l09J2K84r1k53J61K11
6514A89k22j46K68O4k92K5K89j27k41J91J91k42j13K76J2k69N1K66j36k26K27
6535C5J57k69o8K90k7k84J15K50j94j97K59J07k87j2K89q4k59J53K23k29j48K63
6557H3N7k80K8K83j15k47J89J89k50j08K81K0k93P4K68j57k08K06J52k54p1K82
6579A29j2k75R4K43j67k01K39J26k80l3K99p5k64J29K30k01j62K61O3k64kK72
6601A49r4k40J76J92k46j16K87J8k80N5K68j38k23K12J66k64q2K86qk82R0K56
6623A82j78j94K36J15k60m2K71l3k64J19K32j97j65K50Q8k69k5K91p9k55J57J96
6645A76k11j31K46N0k76M0K63j11k34J89J69k39r1K70Kk69Q7K37j44j99K17J25
$$ plain form
6667 166 -96 -134 143 96 -176 -44 186 -19 -180 77 150 -129 -117 154 66 -175 -23 174 -36 -172 83 135
6689 135 -130 -104 149 65 -173 6 171 -53 -156 99 121 -139 -80 164 14 -178 30 161 -81 -148 121 103
6711 103 -157 -47 185 7 -167 64 163 -106 -108 148 81 -171 -20 178 -31 -166 77 139 -139 -103 153 49
6733 49 -178 1 168 -53 -159 91 120 -146 -80 166 39 -170 26 161 -73 -141 121 111 -147 -58 171 12
6755 12 -167 57 158 -84 -121 132 91 -159 -29 171 -19 -163 73 132 -119 -112 155 55 -180 -11 172 -51
6777 -51 -167 101 124 -132 -78 172 24 -172 23 163 -66 -145 122 104 -151 -42 172 2 -162 52 141 -91
6799 -91 -120 124 87 -159 -34 164 -6 -168 67 140 -108 -106 135 61 -162 -13 161 -37 -154 81 128 -124 -84
6822 -84 144 35 -169 20 158 -55 -152 105 108 -140 -54 171 16 -153 56 152 -81 -118 137 87 -156 -31 172
$$ packed form
6667A66k62l8K77m7k72J32K30k05j61K57P3k79J2K71q8k41J52J97k10j36K55N2
6689A35k65K6K53q4k38J79J65k24j03K55K2k60N9K44j50j92K08J31k42o7K69j8
6711A03k60J10K32j78j74K31R9k69kK56o7k52J51J98k09j35K43O2k78L6K56j04
6733D9k27J79J67k21j06K50K9k66O6K46j27k09J96J35k34o8K62j0k58Q9K29j59
6755A2j79K24J01k42l7K53m1k50J30K00j90j44K36N9k51PK67j00k35J69J83k23
6777e1j16K68K3k56N4K50j48j96J95J40k29p9K67j8k55J09K14j70j64K14Q9k32
6799i1k9K44l7k46J25J98j70j62K35P3k48KK41p4k23J49J74j98j17K35M7k52M0
6822h4K28j09k04J89J38k13r7K57Lk48Q6K25j55j69K09R6k33l7K55n0k43J25K03
$$ plain form
6845 172 -8 -150 74 158 -102 -112 137 73 -153 -14 166 -38 -147 79 122 -114 -89 137 50 -153 2 164
6867 164 -44 -150 95 112 -123 -59 158 34 -142 28 160 -57 -127 122 94 -140 -42 163 -2 -151 48 150
6889 150 -94 -104 140 75 -160 -18 164 -25 -135 72 120 -109 -91 155 44 -153 2 156 -55 -155 98
6910 98 104 -133 -78 154 26 -159 16 149 -66 -128 114 92 -127 -49 149 12 -150 48 138 -76 -106 127 69
6933 69 -144 -33 158 -18 -151 77 136 -109 -112 132 41 -158 -8 152 -45 -147 92 117 -125 -68 150 24
6955 24 -156 32 160 -71 -129 111 94 -131 -37 159 13 -149 46 144 -80 -106 132 78 -146 -20 157 -11
6977 -11 -148 61 141 -97 -99 129 61 -150 -10 141 -46 -138 71 118 -114 -77 136 42 -147 3 150 -52 -132
7000 -132 97 91 -127 -48 155 12 -151 50 135 -78 -104 125 86 -131 -25 150 -6 -138 70 126 -106 -92 124
$$ packed form
6845A72j80j42K24Q4k60j0K49o4k26J39J80k04j09K26M3k36K5K26q7k03J55J62
6867A64k08j06K45J7k35O4K17j24j76J70J32k17p0K49k8k34R8K05j65j49J99J02
6889A50k44j0K44o5k35J42J82j89j10K07M8k29J8K46j11j97J55J54k11j00K53
6910I8Ok37N5K32j28j85J75J33k15o2K42k2k19P8J98j37j62J98R0k14l0K33n8
6933F9k13J11J91j76j33K28N9k45lK44r1j99J50J60j97j02K39K5k42N7K18j26
6955B4j80J88J28k31n8K40j7k25R4J96j46j62J95R8k24k6K38n4k24J26J77j68
6977a1j37K09Q0k38kK28o8k11J40J51j87r2K09M7k32L7K13r4j89J50J47k02q0
7000a32K29ok18P9K03j43j63K01Q5k13k6K29l9k17J06J75j56j32K08N6k32J4K16
$$ plain form
7023 124 57 -138 -13 153 -31 -133 78 120 -111 -74 137 40 -146 16 149 -46 -124 91 110 -115 -68 149
7045 149 21 -143 30 136 -63 -120 108 89 -130 -41 150 1 -135 59 123 -94 -97 123 59 -129 -12 146
7067 146 -30 -129 62 107 -112 -76 132 28 -149 8 146 -47 -128 89 104 -118 -50 131 22 -142 20 127
7089 127 -63 -105 99 84 -118 -32 147 5 -146 48 128 -79 -89 125 67 -127 -12 144 -28 -131 69 115
7111 115 -98 -83 126 35 -135 8 138 -51 -119 83 87 -115 -56 137 18 -134 30 137 -61 -102 105 77 -116
7134 -116 -43 137 10 -134 50 130 -77 -99 110 64 -122 -21 130 -14 -131 58 116 -87 -79 111 52 -132 -7
7157 -7 129 -38 -117 69 98 -102 -67 120 27 -135 18 126 -57 -112 93 72 -121 -48 133 6 -129 42 130
7180 130 -75 -85 125 64 -119 -20 135 -17 -115 65 108 -90 -70 121 56 -131 -12 122 -34 -107 75 90 -97
$$ packed form
7023A24o7j95J25J66j84j02K11M2k31L7K11r7j86J62J33j95p8K15J9k25M7K17
7045A49j28j64J73J06j99n7K28j9k19Q9J91j49j36J94O4k17lK20o4j88J17J58
7067A46j76r9J91M5k19L6K08j04j77J57J38j93q1K17J5k22O8J81j09j64J62J07
7089A27j90m2K04j5k02Q6J79j42j51J94Q0k07j0K14n8j94J15J56j72j03K00M6
7111A15k13J5K09r1j70J43J30j89o8K02Mk02N9J93j19j52J64J07j98m1K07k8j93
7134a16P3J80j27j44J84Q0k07k2K09m6j86J01J51j44j17J89N8k03QJ90n9j84J25
7157gJ36j67p9J86K9k00L5J87r3j62J53J08j83n5K05k1j93P3J81j27j35J71Q8
7180A30k05j0K10o1j83R9J55j52r8J80M3j98K0J91o5j87J19J34j56p3J82J5j87
$$ plain form
7203 -97 -62 118 25 -130 3 130 -51 -102 90 86 -108 -54 138 14 -131 32 125 -58 -88 100 63 -116 -17 132
7227 132 -5 -121 65 109 -78 -84 112 46 -119 -13 120 -25 -117 78 98 -83 -56 115 38 -127 18 125 -52
7250 -52 -108 89 87 -103 -46 129 7 -136 29 123 -58 -97 94 75 -107 -26 117 7 -116 51 124 -78 -74 100
7274 100 46 -126 -6 120 -28 -117 56 97 -90 -63 105 25 -125 4 120 -49 -99 80 68 -106 -51 119 17
7297 17 -121 23 119 -61 -90 101 68 -113 -27 126 3 -110 48 105 -66 -83 104 62 -110 -10 121 -20 -108
7320 -108 66 91 -88 -75 114 34 -119 -3 118 -28 -114 70 75 -90 -51 113 16 -114 24 110 -57 -87 83
7343 83 76 -105 -33 122 2 -116 40 106 -66 -84 93 59 -112 -13 127 -11 -101 52 93 -80 -62 95 35 -117
7367 -117 -7 122 -31 -96 69 82 -93 -57 120 26 -119 18 110 -46 -101 85 78 -87 -40 118 12 -112 29
$$ packed form
7203i7L5J80r3j55J33J27j81n1J92mj94N4J92j24j45J63R3j83l0J88l7j79R9J49
7227A32j37j16J86M4j87oJ96o6j65J06J33j45r2J95K0j81K7J71p7j65J45J07j77
7250e2n6J97kj90N7J75j22j43J65R4j81l9J91j9j82Q1J43j10j23J67P3k02MJ74
7274A00n4j72J20J26j48q9J73M1j87K7J68q0j50J29J16j69n0J79j2j74N5J70j02
7297A7j38J44R6j80k9J91l3j81Q6J53j23j13J58N7j71j7J87m2j72J00J31j41q8
7320a08J74K5j79J3J89q0j53J16J21j46q6J84Nj65L9J64r7j30J38Q6j67l0J70
7343H3pj81P2J55j20j18J56O6j72j8J77l4j71R9J40j38r0J53M1j73J8J57o0j52
7367a17J10J29j53o5J65J3j75L6J77r4j45J37R2j56n5J86pj65M7J58j06j24J41
$$ plain form
7390 29 100 -56 -80 89 64 -97 -23 120 -6 -107 55 110 -78 -60 99 45 -114 9 120 -28 -96 61 77
7413 77 -99 -48 107 12 -120 6 105 -57 -98 74 71 -92 -35 114 12 -105 32 97 -53 -83 87 63 -100 -21
7437 -21 119 5 -109 55 99 -58 -64 100 49 -105 -5 114 -21 -111 55 80 -72 -59 103 16 -117 2 113
7460 113 -53 -94 76 68 -99 -38 114 1 -113 21 95 -63 -86 90 57 -99 -20 102 -1 -101 43 106 -62
7483 -62 -70 97 53 -95 -14 120 -6 -97 47 81 -77 -64 107 41 -101 7 110 -25 -94 68 66 -87 -46 109
7507 109 20 -106 27 105 -56 -83 80 65 -88 -16 114 10 -98 43 93 -58 -59 100 46 -93 -10 110 -20
7530 -20 -98 50 87 -71 -65 99 36 -109 0 101 -29 -86 67 76 -93 -48 98 15 -98 6 94 -44 -80 73
7554 73 63 -84 -32 110 4 -99 40 97 -52 -77 90 61 -86 -16 114 -7 -94 51 91 -71 -60 97 32 -101
$$ packed form
7390B9P1j56k4J69k5j61P4J43j26j01J62N5j88J8J59n4j59J23J11j48o8J57J6
7413G7j76N1J55r5j32J26R9j62m1J72lj63N7J49j02j17J37O5j50l0J70k4j63P9
7437b1J40j14j14J64M4j57oJ64n1j54J00J19j35r0J66K5j52J3J62q7j33J19J11
7460A13j66m1J70qj67O1J52j13j14J34P4j58k3J76l3j56P9J22j03j00J44O3j68
7483f2qJ67m4j48Q1J34j26r1J44L4j58J3J71o6j42J08J03j35o9J62kj53M1J55
7507A09q9j26J33P8j61k7J63j5j53P2J30j04j08J41N0j51jJ59n4j39Q3J20j30
7530b0p8J48L7j58OJ64o3j45J09J01j30n7J53Rj69M5J46q3j13J04Q8j38l6J53
7554G3j0j47N2J42j06j03J39N7j49k5J67k9j47P0J30j21q7J45M0j62J1J57o5j33
$$ plain form
7578 -101 2 112 -32 -95 56 78 -84 -46 100 36 -99 10 94 -42 -91 68 58 -85 -29 108 14 -92 32
7601 32 101 -46 -74 77 56 -87 -9 108 1 -95 42 93 -49 -66 87 40 -90 -10 100 -15 -86 62 94 -74
7625 -74 -61 92 15 -89 5 88 -36 -82 63 65 -87 -40 88 6 -86 26 106 -40 -69 86 64 -67 -18 113 7
7650 7 -92 47 86 -49 -61 81 42 -84 -14 98 -6 -80 53 84 -72 -54 97 29 -95 7 108 -28 -72 57
7674 57 69 -74 -52 103 19 -94 20 91 -34 -82 81 67 -78 -24 98 8 -82 36 93 -42 -62 82 56 -79
7698 -79 -7 89 -5 -80 29 83 -50 -57 88 29 -87 -5 93 -33 -78 57 62 -67 -43 89 19 -89 18 89 -30 -71
7724 -71 66 61 -78 -24 95 9 -81 21 89 -51 -57 84 44 -75 -14 109 0 -85 43 78 -61 -47 82 29 -82
7749 -82 -5 90 -24 -80 53 65 -71 -43 87 19 -88 9 91 -32 -70 63 56 -75 -26 90 10 -83 23 92 -38
$$ packed form
7578a01J03J10j44o3J51K2j62L8J46o4j35J09Q4j36m9J59j0j43N6J37r4j06J24
7601C2O9j47k8J51k1j43P8J17j07r6J37N1j42j7J53m7j30Q0J10j15p1J48L2j68
7625g4J3J53p7j04R4Q3j24m6J45Kj52M7J28q2r2J12Q0j46k9J55k2j31M9J31j06
7650Gr9J39L9j35j2J42l9j26P0J12j04p4J33L1j56J8J51o8j24J02J01j36m4J29
7674E7J2j43K2J55q4j13J14P1j25m8J63j4j45N4J22r0r0J18N7j35k0J44k6j35
7698g9P2R6r4p5J09N4j33pJ45n9j16Q2R8j26m5J35Nj29K4J32p0j08J07P1j19m1
7724g1J37nj39N4J19q6r0J02O8j40oJ41m0j19O1J23j09q5J28L5j39J4J29n3j11
7749h2P7R5j14n6J33J2j36K8J30o8j07R7Q2j23l8J33pj31M9J16q0r3J06O9j30
$$ plain form
7774 -38 -68 67 51 -81 -10 97 -3 -76 38 95 -44 -54 81 38 -84 -14 82 -16 -81 41 66 -70 -54 76 19
7799 19 -89 1 81 -36 -78 54 51 -84 -36 80 7 -84 4 80 -48 -76 59 52 -78 -26 95 14 -83 31 83 -40
7825 -40 -48 77 34 -83 -9 97 -8 -82 49 79 -63 -49 65 16 -93 -6 79 -27 -76 54 66 -70 -35 85 19
7850 19 -84 8 84 -44 -73 62 47 -74 -31 97 -1 -80 26 75 -41 -56 76 44 -79 -13 91 -17 -73 46
7874 46 75 -61 -49 77 32 -81 -4 84 -27 -71 42 62 -63 -51 80 10 -84 6 83 -34 -74 71 47 -69 -27
7899 -27 88 16 -74 44 74 -38 -59 60 49 -79 -8 83 -3 -73 39 71 -49 -46 76 35 -69 5 76 -23 -82 46
7925 46 47 -60 -40 73 15 -83 9 72 -32 -59 43 47 -62 -34 83 4 -71 21 76 -39 -52 71 43 -74 -9 84 -1
7952 -1 -73 42 72 -49 -51 65 28 -73 1 81 -24 -73 48 62 -64 -41 76 17 -77 12 75 -29 -72 45 50 -64
$$ packed form
7774c8l0J35j6j32P1J07j00p3J14N7j39j0J35m3j22P0R6r8o5J22K5j36J6J30n7
7799A9j08R0Q0j17m2J32lj35M8J16p3r1Q8P6j28k8J35pj30N2J21q1r7J14N2j23
7825d0qJ25m3j17P4J06j05p4J31L0j42J4J14m9j09Q7Q5j06m9J30J2j36L5J20o6
7850A9j03R2P6j28k9J35j5j21M3J28r8p9J06M9j16j5J32l2j23O6J04j08n6J19
7874D6K9j36J2J26m5j13P7Q8j11m4J13K0j25J2J31p0r4R0P7j17m0J45k4j16M2
7899b7J15p2r0J18L0j12k1J19j1j28P1R1q6p0J12L2j20LJ22m1j04P4P1r9n9J28
7925D6Jj07K0J13n8r8R2O3j04k7J02Mj09K8J17p9p5R2N5j15j3J23k8j17O5R3q5
7952ap2J15L0j21kJ16l7j01P4Q0j05m9J21J4j26K3J17n9r4Q9O3j04m3J17Nj14
$$ plain form
7978 -64 -26 82 12 -83 7 69 -35 -49 69 45 -69 -14 90 -3 -65 36 69 -44 -45 73 41 -58 1 83 -13 -68 41
8005 41 64 -57 -42 71 15 -79 12 69 -27 -68 51 55 -64 -29 75 14 -79 15 85 -38 -58 55 49 -61 -26 87 -3
8032 -3 -68 28 67 -44 -43 69 33 -69 -5 70 -10 -54 42 49 -49 -31 75 26 -66 12 68 -27 -62 40 43 -50 -33 63 3 -70
8062 -70 9 66 -35 -69 61 40 -61 -23 71 3 -77 25 64 -37 -43 64 32 -72 4 76 -9 -57 45 65 -48 -38
8088 -38 60 13 -74 14 63 -28 -68 47 45 -62 -21 56 3 -73 7 55 -36 -64 56 42 -61 -19 72 -1 -72 21 63 -39
8116 -39 -43 63 20 -54 -6 65 -8 -54 38 57 -51 -31 77 11 -64 -1 75 -21 -58 31 54 -66 -31 65 4 -69 22 58 -37
8145 -37 -43 36 29 -69 -17 58 -10 -71 18 51 -42 -43 51 22 -55 -9 69 -9 -51 35 55 -46 -32 59 16 -56 8 71 -20 -47 37
8176 37 44 -57 -30 75 9 -63 10 59 -29 -51 43 21 -53 -26 51
$$ packed form
7978f4L8J08p0r5R0O2j04j4J18k4j14N5J04r3o2J01L3j13jJ18l2r9N9Q2r6n5J09
8005D1K3j21J5J13n6r4R1N7r6m1J19Mj19L5J04o1r3R4P0j23k0J13oj10L5J13r0
8032co5R6L9j11JJ12l6j02O4P5q0m4R6Pr8J8J06m9r2P8N6r5l5J02Lr3J7R6o0p3
8062g0P9N7j01l4J30k1j01L8R4o8q0J02L9j01oJ07l2j04P6P2q5m8J02K0j13J0
8088c8R8m7q7Q8M9r1m0J15kj07M1P7n3p6Q0M8r1k8J20j4j03M2R1p3p1R3M2j02
8116c9mJ06m3p4M8P1p3m6R2J9j08K0J08o6p5O3P6r6l7Q9K3j20L5R6o1p3R1L6r5
8145c7oP9pr8N2P5o8o1Q9L3r3jR4k9p7M6P8p8m2Q6K0j01J4R1m3p2O4O3r1k7Q4
8176C7Pj01K7J05o6p2P3M9q8k2R4k2p4K7P7
8191E1
$$ Imaginary data points
##PAGE= N=2
##DATA TABLE= (X++(I..I)), XYDATA
$$ plain form
0 0 0 0 0 0 0 0 0 0 0 0 0 0 0 0 0 -8 8 -8 8 -8 16 -16 16 -24 24 -32 32 -40 42 -49 57 -65 73 -86 97 -106 121
37 121 -137 153 -169 187 -211 233 -259 284 -315 348 -385 423 -466 514 -564 621 -686 758 -839
56 -839 932 -1038 1160 -1305 1479 -1691 1957 -2305 2776 -3452 4523 -6442 10966 -43288 14905
71 14905 101916 -59976 -73734 75504 54348 -95337 -20691 97505 -7322 -96270 39260
82 39260 81306 -62570 -62440 82830 35105 -91824 -7331 94154 -22356 -85499 47565
93 47565 70489 -68933 -47986 82062 22507 -88136 5211 84879 -31335 -74379 54370
104 54370 56349 -71527 -33704 81762 7795 -83745 18209 77823 -42168 -64319 61620
115 61620 45123 -74832 -21762 80739 -3046 -78782 27318 69408 -48437 -53496 64559
$$ packed form
0@%%%%%%%%%%%%%%%qJ6j6J6j6K4l2L2m0M8n6O4p2Q2r1J06j22J38j59J83k03K27
37A21k58K90l22L56l98M44m92N43n99O63p33Q08q89R80j078J185j307J444j597
56h39J771j970K198k465K784l170L648m262N081o228P975j0965J7408n4254N8193
71A4905Q7011j61892j3758J49238k1156j49685P4646J18196j04827q8948J35530
82C9260M2046j43876J30J45270m7725j26929Q4493J01485j16510o3143J33064
93D7565K2924j39422K0947J30048n9555j10643R3347P9668j16214m3044J28749
104E4370J979j27876L7823J15466p3967r1540J01954N9614j19991k2151J25939
115F1620j6497j19955N3070J02501q3785p5736J06100M2090j17845n059J18055
$$ plain form
126 64559 32705 -74148 -9242 76314 -14721 -71180 36639 59219 -54712 -41963 67042
137 67042 20994 -72792 1410 71394 -23172 -63220 42194 49292 -56658 -30940 65499 10160
149 10160 -67794 11263 63677 -31124 -53436 47702 38289 -59376 -19712 65129 -485 -64615
161 -64615 20219 57888 -37837 -45865 51516 29483 -60209 -10579 62890 -9232 -59490 27879
173 27879 50280 -43550 -36274 54805 18975 -60504 -1 60369 -18560 -54335 35185 43271
185 43271 -48073 -28169 56202 10619 -58775 7632 55583 -24846 -47131 39250 34181 -49616
197 -49616 -18292 54869 886 -54809 16167 49452 -31396 -39487 43392 25954 -51038 -10058
209 -10058 53745 -6491 -51161 22259 43775 -35568 -32186 45318 17705 -50535 -1683 50831
$$ packed form
126F4559l1854j06853O4906Q5556r1035n6459J07819K2580j13931J2749J09005
137F7042m6048r3786P4202O9984r4566m0048J05414P098j05950K5718R6439n5339
149A0160p7954P9057N2414r4801k2312J01138r413r7665L9664Q4841o5614o4130
161f4615Q4834L7669r5725q028R7381k2033q9692M9630P3469p2122n0258Q7369
173B7879K2401r3830P276R1079l5830p9479O0503O0370p8929l5775Q9520Q086
185D3271r1344J9904Q4371m5583o9394O6407M7951q0429k2285Q6381n069q3797
197d9616L1324P3161n3983n5695P0976L3285q0848q091Q2879j7438p6992M0980
209a0058O3803o0236m4670P3420K1516p9343L382P7504k7613o8240M8852N2514
$$ plain form
221 50831 -14373 -46253 28887 37170 -40583 -24640 48187 9701 -51169 5992 49107 -21091
233 -21091 -42348 33976 31477 -43443 -17638 48581 2268 -48839 13165 44390 -27026 -35593
245 -35593 38131 23559 -45311 -9363 48084 -5487 -46189 19613 39872 -31690 -29887 40463
257 40463 17107 -45302 -3002 45595 -11239 -41600 24115 33593 -34537 -22517 41491 9412
269 9412 -44367 4532 43017 -17876 -37427 29496 28348 -38112 -16523 43068 3227 -43782
281 -43782 10314 40287 -22738 -32962 32840 22458 -39793 -9893 42757 -3655 -41639 16703
293 16703 36366 -28143 -27642 36674 16259 -41596 -3426 42413 -9535 -39089 21436 32128
305 32128 -31026 -22110 37566 10183 -40329 2628 39193 -14959 -34239 25665 26036 -33747 -15457
$$ packed form
221E0831o5204l1880P5140Q283p7753J5943P2827l8486o0870N7161M3115p0198
233b1091k1257P6324k499p4920K5805O6219m6313n1107O2004L1225p1416q567
245c5593P3724j4572o8870L5948N7447n3571m0702O5802K0259p1562J803P0350
257D0463k3356o2409M2300M8597n6834l0361O5715R478o8130J2020O4008l2079
269I412n3779M8899L8485o0893j9551O6923j148o6460K1589N9591l9841m7009
281d3782N4096K9973o3025j0224O5802j0382o2251K9900N2650m6412l7984N8342
293A6703J9663o4509N01O4316k0415n7855L8170M5839n1948k9554O0525J0692
305C2128o3154Q916N9676k7383n0512M2957L6565n4152j9280N9904L71n9783J8290
$$ plain form
318 -15457 38415 3474 -39406 8587 36532 -19761 -30311 28835 21228 -35143 -10253 37997
330 37997 -1623 -37210 13277 32867 -23549 -25312 31564 15408 -36433 -3955 37797 -7803
342 -7803 -35442 18769 29665 -27863 -21089 34185 10457 -37214 1041 36555 -12425 -32424
354 -32424 22418 25095 -30182 -15433 34870 4317 -36098 7047 33790 -17574 -28193 26281
366 26281 20016 -32277 -9964 35139 -812 -34551 11420 30693 -20742 -23929 27941 14924
378 14924 -32374 -4644 33584 -6042 -31595 15970 26501 -24337 -18965 30255 9581 -33283
390 -33283 636 33059 -10791 -29648 19905 23415 -27018 -14854 31518 4961 -32870 5468
402 5468 31046 -15226 -26116 23504 18701 -29387 -9500 32390 -593 -32250 10528 28930
$$ packed form
318a5457N3872l4941m2880M7993K7945n6293j0550N9146p607n6371K4890M8250
330C7997l9620l5587N0487J9590n6416j763N6876j6156n1841L2478M1752m5600
342g803k7639N4211J0896n7528O774N5274k3728m7671L8255L5514m8980j9999
354c2424N4842K677n5277J4749N0303l0553m0415M3145K6743n1364j0619N4474
366B6281o265n2293K2313M5103l5951l3739M5971J9273n1435l187N1870j3017
378A4924m7298K7730L8228l9626k5553M7565J0531n0838N372M9220k0674m2864
390c3283L3919L2423m3850j8857M9553L510n0433J2164M6372k6557l7831L8338
402E468K5578m6272j0890M9620m803m8088J9887M1890l2983l1657M2778J8402
$$ plain form
414 28930 -19404 -22914 26262 14681 -30572 -5174 31800 -4768 -29961 14077 25256 -21880
426 -21880 -18132 27446 9408 -30261 157 30206 -9508 -27187 17926 21665 -24535 -14081
438 -14081 28768 5208 -30235 4083 28726 -12961 -24542 20453 17939 -26019 -9722 28940
450 28940 494 -29155 8685 26478 -17075 -21246 23804 13957 -28188 -5275 29865 -3859
462 -3859 -28570 12631 24560 -20060 -18159 25521 10086 -28432 -1140 28579 -7862 -26004
474 -26004 15952 20889 -22513 -13885 26762 5509 -28462 3236 27332 -11620 -23650 18711
486 18711 17720 -23946 -10218 26835 1871 -27089 6602 24828 -14318 -20151 20669 13591 -24932
499 -24932 -5722 26805 -2653 -26064 10757 22787 -17827 -17345 23123 10174 -26223 -2102
$$ packed form
414B8930m8334l510M9176j1581m5253K5398L6974l6568k5193M4038J1179m7136
426b1880L748M5578j8038l9669L0418L0049l9714j7679M5113L739m6200J0454
438a4081M2849k3560l5443L4318K4643m1687j1581M4995k514m3958J6297L8662
450B8940k8446k9649L7840J7793m3553m171M5050r847m2145K2913L5140l3724
462c859k4711M1201J1929m4620J901M3680j5435l8518K7292K9719l6441j8142
474b6004M1956M937m3402Q628M0647k1253l3971L1698K4096l8952j2030M2361
486A8711r91m1666J3728L7053k4964k8960L3691J8226l9146n833M0820p078l8523
499b4932J9210L2527k9458k3411L6821J2030m0614M82M0468j2949l6397K4121
$$ plain form
511 -2102 26695 -6236 -24655 13853 20136 -20145 -13731 24425 5977 -26282 2352 25594 -10381
524 -10381 -22331 17405 16972 -22615 -9952 25633 2079 -26085 5900 24038 -13182 -19737 19066
537 19066 13569 -23109 -6255 24810 -1646 -24171 9225 21145 -15863 -16156 20873 9643 -23820
550 -23820 -2292 24497 -5195 -22809 12151 18991 -17871 -13350 21880 6498 -23751 1005
562 1005 23310 -8381 -20594 14896 15823 -19969 -9565 23014 2329 -23877 5036 22367 -11965
575 -11965 -18745 17661 13246 -21668 -6528 23521 -810 -23048 8010 20340 -14314 -15620 19174
588 19174 9496 -22028 -2497 22766 -4619 -21276 11237 17771 -16700 -12599 20463 6233 -22252
601 -22252 584 21823 -7300 -19374 13170 15035 -17759 -9341 20547 2767 -21360 4019
$$ packed form
511b102K8797l2931j8419L8508O283m0281O414L8156j8448l2259K8634K3242l5975
524a0381j1950L9736m33l9587J2663L5585k3554k8164L1985J8138l7220o555L8803
537A9066n497l6678J6854L1065k6456k2525L3396J1920l7008k93L7029j1230l3463
550b3820K1528K6789k9692j7614L4960O840l6862M521L5230j5382l0249K4756
562A005K2305l1691j2213L5490R27l5792J0404L2579k0685k6206K8913J7331l4332
575a1965o780L6406m415l4914J5140L0049k4331k2238L1058J2330l4654j306L4794
588A9174r678l1524J9531K5263k7385j6657L2513O534l4471M101L3062j4230k8485
601b2252K2836K1239k9123j2074L2544J865l2794Q418K9888j7780k4127K5379
$$ plain form
613 4019 20066 -10381 -16836 15727 12001 -19484 -5974 21396 -571 -21198 7081 18984 -12880
626 -12880 -14913 17406 9398 -20265 -3021 21065 -3689 -19850 9915 16628 -15198 -11887 18906
639 18906 5962 -20802 430 20653 -6747 -18559 12360 14701 -16732 -9463 19468 3407
651 3407 -20240 2922 19096 -8835 -16119 13813 11663 -17411 -6166 19295 126 -19358 5877
664 5877 17538 -11337 -14087 15624 9229 -18414 -3543 19382 -2457 -18465 8182 15775 -13060
677 -13060 -11564 16673 6263 -18634 -315 18806 -5631 -17087 11071 13694 -15395 -8938 18185
690 18185 3368 -19197 2495 18319 -8092 -15719 12819 11579 -16305 -6425 18140 654 -18246
703 -18246 5093 16528 -10307 -13238 14440 8719 -17104 -3387 18116 -2164 -17343 7445
$$ packed form
613D019J6047l0447o455L2563l726l1485J3510K7370k1967k0627K8279J1903l1864
626a2880k033L2319q008k9663J7244K4086k4754j6161K9765O713l1826L311L0793
639A8906j2944k6764K1232K0223k7400j1812L0919K341l1433P269K8931j6061
651C407k3647K3162J6174k7931p284K9932k150k9074J1245K5461j9169j9484K5235
664E877J1661k8875k750K9711o395k7643J4871K2925k1839j6008K6647P593k8835
677a3060J496K8237j0410k4897J8319J9121k4437j1456K8158K623k9089O457K7123
690A8185j4817k2565K1692J5824k6411p627K8538j240k7884R880K4565j7486j8900
703a8246K3339J1435k6835k931K7678n721k5823J3717K1503k0280j5179K4788
$$ plain form
715 7445 14994 -11932 -11214 15239 6431 -17047 -1073 17199 -4363 -15704 9293 12657 -13335
728 -13335 -8448 15995 3379 -17157 1953 16592 -7142 -14450 11585 10870 -14933 -6237 16795
741 16795 1021 -16980 4296 15542 -9126 -12545 13067 8363 -15674 -3362 16749 -1942
753 -1942 -16136 7000 13948 -11372 -10452 14527 5948 -16302 -997 16438 -4027 -15051 8565
766 8565 12221 -12237 -8268 14682 3572 -15678 1409 15152 -6182 -13158 10324 9942 -13411
779 -13411 -5771 15211 1113 -15542 3635 14368 -8043 -11860 11630 8167 -14115 -3718 15157
792 15157 -1144 -14758 5807 12838 -9927 -9700 13028 5598 -14865 -954 15239 -3756 -14102
805 -14102 8121 11630 -11651 -7983 14030 3621 -14998 1065 14505 -5568 -12610 9471 9520
$$ packed form
715G445P549k6926P18K6453q808k3478J5974J8272k1562j1341K4997L364k5992
728a3335M887K4443j2616k0536J9110J4639k3734p308K6035p15k5803Q696K3032
741A6795j5774j8001K1276J1246k4668l419K5612m704k4037J2312K0111j8691
753a942j4194K3136O948k5320R20K4979q579k2250J5305J7435k0465j1024K3616
766H565L656k4458L969K2950j1110j9250J7087J3743k1334o976K3482l82k3353
779a3411P640K0982j4098j6655J9177J0733k2411l817K3490l463k2282J0397J8875
792A5157j6301j3614K0565P031k2765K27K2728p430k0463J3911J6193j8995j0346
805a4102K2223L509k3281L668K2013j0409j8619J6063J3440k0073p042K2081M9
$$ plain form
818 9520 -12437 -5576 14109 1100 -14463 3374 13383 -7530 -11076 10876 7705 -13198 -3662
831 -3662 14195 -690 -13841 4930 12199 -8643 -9375 11515 5700 -13237 -1475 13695 -2876
844 -2876 -12803 6937 10689 -10339 -7525 12707 3623 -13874 623 13663 -4849 -12126 8541
857 8541 9374 -11415 -5762 13126 1572 -13554 2749 12644 -6752 -10494 10083 7337 -12381
870 -12381 -3459 13492 -696 -13263 4767 11741 -8320 -9118 11012 5652 -12627 -1728 12962
883 12962 -2355 -12100 6118 10040 -9282 -7089 11488 3427 -12607 516 12450 -4407 -11114
896 -11114 7850 8704 -10495 -5452 12136 1698 -12582 2202 11816 -5873 -9895 8978 7007
909 7007 -11192 -3432 12281 -504 -12175 4349 10833 -7815 -8460 10433 5231 -12078 -1561
$$ packed form
818I520k1957O861J9685j3009j5563J7837J0009k0913l546K1952l171k0903R536
831c662J7857j4885j3151J8771P269k0842p32K0890n815j8937J1762J5170j6571
844b876r927J9740L752k1028K814K0232r084j7497J4497J3040j8512p277K0667
857H541Q33k0789N653J8888j1554j5126J6303R895j9396l742K0577k746j9718
870a2381Q922J6951j4188j2567J8030O974k0061p98K0130n360j8279J0899J4690
883A2962j5317r745J8218L922j9322K193J8577q061j6034J3123J1934j6857o707
896a1114J8964Q54j9199N043J7588j0438j4280J4784R614j7689m022J8873j971
909G007j8199P760J5713j2785j1671J6524O484j8648o45J8893n202j7309J0517
$$ plain form
922 -1561 12510 -2269 -11742 5837 9826 -8791 -6982 10894 3509 -11870 287 11731 -3957
935 -3957 -10421 7254 8139 -9788 -5083 11352 1575 -11820 2040 11140 -5447 -9443 8258 6800
949 6800 -10302 -3569 11287 -5 -11197 3536 10007 -6722 -7846 9249 4924 -10820 -1489
962 -1489 11387 -2045 -10792 5418 9165 -8230 -6603 10254 3441 -11255 66 11153 -3564
975 -3564 -9958 6669 7786 -9113 -4873 10627 1480 -11103 1992 10483 -5265 -8869 7992
988 7992 6408 -9939 -3364 10916 38 -10820 3274 9705 -6194 -7648 8516 4914 -9956
1001 -9956 -1728 10447 -1591 -9916 4728 8432 -7395 -6163 9318 3276 -10364 -118 10379
1014 10379 -3073 -9421 5946 7519 -8255 -4924 9728 1831 -10236 1451 9766 -4538 -8290
$$ packed form
922a561J4071j4779r473J7579L989j8617J809J7876p385j5379J2157J1444j5688
935c957o464J7675Q85j7927M705J6435r777j3395J3860R100j6587l996J7701j458
949F800j7102O733J4856j1292j1192J4733O471j6729j124J7095m325j5744R331
962a489J2876j3432q747J6210L747j7395J627J6857o813j4696J1321J1087j4717
975c564o394J6627J117j6899M240J5500r147j2583J3095Q491j5748l604J6861
988G992j584j6347O575J4280j0878j0858J4094O431j5899j454J6164l602j4870
1001i956Q228J2175j2038q325J4644L704j5827J232J5481o042j3640J0246J0497
1014A0379j3452o348J5367J573j5774L331J4652p897j2067J1687Q315j4304l752
$$ plain form
1027 -8290 7209 6038 -9147 -3155 10203 8 -10242 3151 9273 -5999 -7441 8217 4853
1040 4853 -9663 -1854 10101 -1327 -9596 4288 8121 -6830 -5912 8661 3151 -9642 -127
1053 -127 9683 -2874 -8788 5600 7077 -7745 -4662 9138 1863 -9636 1107 9202 -3933
1066 -3933 -7904 6347 5828 -8162 -3225 9145 280 -9265 2647 8442 -5367 -6819 7530 4507
1080 4507 -8970 -1747 9516 -1172 -9128 3974 7864 -6356 -5817 8129 3248 -9072 -345
1093 -345 9160 -2554 -8309 5193 6678 -7303 -4392 8677 1683 -9216 1123 8835 -3834
1106 -3834 -7641 6105 5703 -7797 -3264 8700 532 -8751 2207 7965 -4704 -6425 6740 4289
1120 4289 -8077 -1736 8680 -953 -8394 3582 7325 -5816 -5548 7498 3225 -8471 -626 8584
$$ packed form
1027h290J5499j171j5185N992J3358j0195j0250J3393O122j5272j442J5658l364
1040D853j4516P809J1955j1428q269J3884L833j4951R18J4573n510j2793R515
1053a27R810j2557n914J4388J477j4822L083J3800p275j1499J0743Q095j3135
1066c933l971J4251n19j3990M937J2370q865r545J1912N795j3809j452J4349l023
1080D507j3477P223J1263j0688p956J3102L890j4220N39J3946m881j2320Q727
1093c45R505j1714n755J3502J485j3981K911J3069o994j0899J0339P712j2669
1106c834l807J3746m02j3500M533J1964q168r283J0958N758j2669j721J3165k451
1120D289j2366O341J0416r633p441J1976L743j3141K68J3046m273j1696P845R210
$$ plain form
1134 8584 -2052 -7916 4502 6422 -6537 -4345 7897 1821 -8500 882 8244 -3494 -7175
1147 -7175 5748 5427 -7437 -3148 8388 592 -8518 2007 7849 -4375 -6396 6312 4373 -7627
1161 -7627 -1943 8154 -681 -7925 3165 6882 -5339 -5225 6942 3064 -7912 -662 8087 -1817
1175 -1817 -7510 4090 6224 -5969 -4318 7256 2036 -7807 461 7633 -2869 -6666 5008 5069
1189 5069 -6625 -2979 7621 592 -7868 1836 7328 -4132 -6087 5966 4233 -7259 -1989 7787
1203 7787 -471 -7591 2813 6631 -4891 -5046 6471 2982 -7410 -645 7623 -1753 -7073 3951
1217 3951 5874 -5739 -4099 6961 1970 -7519 321 7333 -2562 -6476 4505 4984 -6032 -3055
1231 -3055 6935 800 -7180 1453 6692 -3606 -5591 5363 3948 -6612 -1909 7217 -302 -7117
$$ packed form
1134H584j0636n864J2418J920j2959K192J2242o076j0321R382P362j1738l681
1147g175J2923l21j2864M289J1536p796r110J0525N842j2224k021J2708j939j2000
1161g627N684J0097q835p244J1090L717j2221J14J2167l878j0976P250Q749r904
1175a817n693J1600K134j2193J651J1574n220r843Q268P172j0502l797J1674O1
1189E069j1694L646J0600p029q460R704N492j1460j955J2053j733j1492N270R776
1203G787q258p120J0404L818j1522j55J1517l489j0392O765Q268r376n320J1024
1217C951J923j1613J640J1060m991r489P840P012r895l914J0981M79j1016K977
1231c055R990o135p980Q633N239j0298j985J0954j415j0560M703R126p519o815
$$ plain form
1245 -7117 2502 6331 -4443 -4906 5934 3011 -6833 -809 7054 -1448 -6572 3543 5435 -5299
1259 -5299 -3795 6501 1750 -7108 450 6964 -2609 -6177 4474 4758 -5910 -2905 6731 816
1273 816 -6886 1337 6387 -3330 -5275 4975 3685 -6141 -1745 6692 -384 -6595 2413 5841 -4229
1288 -4229 -4555 5579 2819 -6423 -868 6618 -1186 -6214 3089 5188 -4706 -3680 5848 1788 -6423
1303 -6423 277 6350 -2293 -5653 4089 4404 -5476 -2726 6334 795 -6570 1207 6177 -3094 -5183
1318 -5183 4657 3672 -5791 -1823 6295 -203 -6218 2158 5499 -3909 -4284 5240 2639 -6085 -802
1333 -802 6326 -1133 -5954 2944 5030 -4439 -3624 5508 1911 -6010 -12 5954 -1850 -5320 3530
1348 3530 4181 -4856 -2634 5714 832 -6003 1038 5680 -2821 -4857 4284 3506 -5365 -1858 5899
$$ packed form
1245g117R619L829j0774m63J0840k923r844O024P863q502n124J0115J892j0734
1259e299J504J0296m751q858P558O514r573l568J0651K84j0668L005R636n915
1273H16p702Q223N050r717j945J0250j290r826M396Q437p076o211R008L428j0070
1288d229l26J0134k760r242N555P486p804n028R303K099r894J026R528m060q211
1303f423O700O073q643l360R742L15r880K750R060n539p365P777M970r271k089
1318e183R840r85r463L968Q118o498o015Q376L341r408l75R524k601q724N283
1333h02P128p459m821Q898K086r469Q15R132l597p921N998N966p804l470Q850
1348C530O51r037K222Q348m882o835P041M642q501k036R141p78q871L507P757
$$ plain form
1363 5899 9 -5871 1824 5237 -3473 -4100 4773 2555 -5591 -753 5843 -1099 -5513 2848 4640
1378 4640 -4308 -3328 5320 1686 -5832 86 5762 -1854 -5145 3395 4017 -4626 -2540 5362 794
1393 794 -5585 981 5252 -2639 -4418 4045 3172 -5032 -1601 5545 -84 -5505 1771 4946 -3272
1408 -3272 -3894 4451 2471 -5180 -833 5402 -902 -5093 2513 4270 -3906 -3037 4887 1491 -5401
1423 -5401 189 5357 -1866 -4824 3345 3784 -4490 -2383 5208 768 -5389 913 5045 -2494 -4203
1438 -4203 3828 2971 -4760 -1467 5213 -184 -5162 1783 4603 -3220 -3637 4319 2305 -5024 -793
1453 -793 5212 -799 -4910 2296 4135 -3557 -2979 4461 1552 -4919 39 4907 -1600 -4409 3011
1468 3011 3492 -4124 -2220 4836 735 -5070 823 4798 -2287 -4060 3532 2919 -4423 -1519 4861
$$ packed form
1363E899n890n880P695L413q710o27Q873k218q146M838O596o942m414Q361J792
1378D640q948R80Q648l634p518N918N676p616l291Q540O22q643K086P902m568
1393G94o379O566M271p891j779Q463q73q204L431P146n629n421P276L175q218
1408c272o22Q345j980p651M347O235o304m191P606J757q176Q69P924l396o892
1423e401N590N168p223k958Q169M39q274K107P591m440o157O302M132p539j709
1438d203Q031q57p731L293O680n397m978O945K820p823m17P956k014p329M231
1453g93O005o011m111P206J839p692N78P440k909o471M958M868o507k809P420
1468C011M81p616J904P056m101n805N893L975p085j773P592o13p342K904O380
$$ plain form
1483 4861 -51 -4837 1591 4304 -2974 -3371 4055 2096 -4737 -605 4949 -902 -4665 2339 3956
1498 3956 -3512 -2853 4352 1506 -4755 -17 4707 -1451 -4199 2762 3290 -3805 -2083 4455 647
1513 647 -4686 794 4434 -2180 -3776 3337 2756 -4175 -1465 4582 47 -4570 1370 4098 -2635
1528 -2635 -3226 3640 2047 -4279 -657 4499 -784 -4272 2158 3612 -3314 -2604 4124 1316 -4544
1543 -4544 59 4498 -1453 -4048 2674 3154 -3645 -1995 4225 620 -4393 787 4136 -2089 -3461
1558 -3461 3187 2468 -3963 -1231 4367 -83 -4312 1424 3889 -2595 -3069 3495 1958 -4071 -690
1573 -690 4220 -664 -3983 1916 3340 -2981 -2378 3753 1191 -4151 110 4132 -1415 -3716 2555
1588 2555 2952 -3460 -1866 4027 619 -4179 684 3937 -1912 -3294 2941 2335 -3691 -1143 4052
$$ packed form
1483D861m912m786O428K713p278l97P426j959o833M132N554n851l763P004J617
1498C956p468O59P205k846o261M738M724o158k748O961N28p095J722O538l808
1513F47n333N480L640o614j596P113n81o931K710O047m535m617N940K728o733
1528b635n91O866j593o326L622N156n283l488O430J454o926P10O728k808n860
1543d544M603M439n951k595O722M80o799J650O220l605n013N180L349o225j372
1558c461O648p19o431K732N598m450m229N736K465o484m74O564j537o029L381
1573f90M910m884l319N899J424o321O03O131k562n342M261M022n547k301O271
1588B555L97o412J594N893l408m798M863L253n849j382O235o06o026K548N195
$$ plain form
1603 4052 -141 -4022 1409 3578 -2542 -2824 3414 1764 -3957 -566 4095 -680 -3856 1853 3243
1618 3243 -2832 -2323 3534 1193 -3876 63 3850 -1288 -3428 2380 2695 -3210 -1701 3753 558
1633 558 -3936 657 3731 -1791 -3152 2747 2294 -3437 -1209 3769 -4 -3750 1214 3360 -2275
1648 -2275 -2619 3121 1641 -3655 -472 3834 -707 -3625 1846 3083 -2771 -2207 3465 1150 -3771
1663 -3771 30 3718 -1193 -3316 2222 2583 -3041 -1606 3539 481 -3697 686 3507 -1780 -2954
1678 -2954 2683 2142 -3324 -1128 3648 18 -3618 1099 3265 -2073 -2563 2872 1643 -3355 -549
1693 -549 3535 -585 -3351 1662 2836 -2580 -2055 3235 1060 -3576 26 3552 -1127 -3206 2101
1708 2101 2526 -2863 -1605 3340 540 -3489 589 3298 -1635 -2756 2530 1964 -3162 -963 3491
$$ packed form
1603D052m193l881N431K169o120k82O238j650n721L391M661m775l176N709J390
1618C243o075N09N857k341n069L939L787n138k140N808L15n905J509N454l195
1633E58m494M593L074n522j361N899m53n731K228M978l773l746M964K146n635
1648b275l44N740j480n296L183M306m541k918N471J237n854N64N672k315m921
1663c771L801L688m911k123N538L61n624J435N145l058m178M383K821n287j174
1678b954N637n41n466K196M776l630l636M717K166n338m90N435j229m998K806
1693e49M084m120k766N013J174n416N25N290k175m636L602L526m679k079N307
1708B101M25n389J258M945k800m029M078K709m933j121N286n66n126K199M454
$$ plain form
1723 3491 -101 -3468 1167 3093 -2118 -2458 2842 1558 -3290 -533 3408 -530 -3212 1535 2689
1738 2689 -2394 -1931 2997 973 -3300 80 3304 -1110 -2975 2039 2356 -2746 -1506 3197 521
1753 521 -3338 498 3156 -1479 -2661 2308 1907 -2914 -964 3211 -79 -3201 1102 2856 -2023
1768 -2023 -2243 2737 1401 -3184 -444 3307 -569 -3127 1525 2634 -2311 -1883 2874 960 -3145
1783 -3145 61 3112 -1043 -2778 1915 2183 -2608 -1364 3051 442 -3193 527 3027 -1453 -2588
1798 -2588 2224 1877 -2777 -1015 3052 60 -3038 907 2734 -1758 -2155 2468 1380 -2908 -457
1813 -457 3084 -512 -2945 1432 2511 -2193 -1836 2750 1000 -3038 -61 3007 -896 -2722 1734
1828 1734 2132 -2429 -1363 2849 428 -3011 512 2841 -1412 -2417 2187 1760 -2709 -927 2994
$$ packed form
1723C491l592l367M635J926n211l40N300j284m848K757L941l938k682M747J154
1738B689n083M63M928k024m273L380L224m414j865N014L17n102J240M703k676
1753E21l859L836K658m635j182M969m01m821J950M175l290l122M303J754m879
1768b023k20M980j336m585K740L751l876k558M652J109m945M28M757j914m105
1783c145L206L051m155j735M693K68m791J244M415k609l635L720K500m480j135
1798b588M812l47m654J762M067k992l098L945J827m492l97M623j088m288K451
1813d57L541l596k433M377J079m704L57M586j750m038K977L068l903j826M456
1828A734L98m561J066M212k421l439L523K329m253j005M604m27m469J782L921
$$ plain form
1843 2994 26 -2982 881 2685 -1700 -2125 2343 1373 -2743 -484 2876 -443 -2734 1305 2316
1858 2316 -2048 -1706 2588 898 -2893 -26 2890 -870 -2630 1663 2096 -2291 -1373 2685 521 -2822
$$ packed form
1843B994k968l008L863J804m385m25M468r70m116K259L360l319k291M039J011
1858B316m364L42M294j690l791K867K916l760j760M293M33m387R18M058k164l343
$$ [...]
8191A1
##END NTUPLES=NMR FID
##END=
