##TITLE=1H_ES-prec-AN-DMSO
 D2O
 8 sc, 
 13.04.2022
##JCAMPDX= 6.0         $$ Bruker NMR JCAMP-DX V2.0
##DATA TYPE= NMR FID
##DATA CLASS= NTUPLES
##ORIGIN= UXNMR, Bruker Analytische Messtechnik GmbH
##OWNER= root
$$ XWIN-NMR		Version 3.5
$$ Wed Apr 13 14:30:46 2022 Russian Standard Time (UT+4h)  she@DPX200
##.OBSERVE FREQUENCY= 200.13135
##.OBSERVE NUCLEUS= ^1H
##.DELAY= (6, 6)
##.ACQUISITION MODE= SIMULTANEOUS
##.ACQUISITION SCHEME= undefined
##.AVERAGES= 8
##.DIGITISER RES= 18
##SPECTROMETER/DATA SYSTEM= spect
##.PULSE SEQUENCE= zg30
##.SOLVENT NAME= D2O
##.SHIFT REFERENCE= (INTERNAL, D2O, 0, 15.7039)
##AUDIT TRAIL= $$ (NUMBER, WHEN, WHO, WHERE, WHAT)
$$ ##TITLE= Audit trail, XWIN-NMR		Version 3.5
$$ ##JCAMPDX= 5.01
$$ ##ORIGIN= Bruker BioSpin GmbH
$$ ##OWNER= she
$$ F:/spectra/data/she/nmr/H-F/1/audita.txt
$$ ##AUDIT TRAIL=  $$ (NUMBER, WHEN, WHO, WHERE, WHAT)
(   1,<2022-04-13 14:29:40.43 +0400>,<she>,<DPX200>,
      <created by zg, POWCHK disabled, PULCHK disabled
       configuration hash MD5:
       00 E9 B6 7A A2 85 ED C7 34 08 36 98 17 FE 4E 26
       data hash MD5: 16K
       00 16 D6 2F 6A DD E5 9A 9F B8 AC D5 71 3F 28 D7>)
$$ ##END=
$$ 
$$ hash MD5
$$ 89 E1 6F 54 55 AC 25 7E 56 A3 6F C4 8A B6 AE 67
##$RELAX= 
##$RELAX= 
##$RELAX= 
##$RELAX= 
##$RELAX= 
##$RELAX= 
$$ Bruker specific parameters
$$ --------------------------
##$DU= <F:/spectra>
##$EXPNO= 1
##$NAME= <H-F>
##$PROCNO= 1
##$TYPE= <nmr>
##$USER= <she>
##$AMP= (0..31)
100 100 100 100 100 100 100 100 100 100 100 100 100 100 100 100 100 100 
100 100 100 100 100 100 100 100 100 100 100 100 100 100 
##$AQSEQ= 0
##$AQ_mod= 1
##$AUNM= <au_zg>
##$AUTOPOS= <>
##$BF1= 200.13
##$BF2= 200.13
##$BF3= 200.13
##$BF4= 200.13
##$BF5= 200.13
##$BF6= 200.13
##$BF7= 200.13
##$BF8= 200.13
##$BYTORDA= 1
##$CFDGTYP= 0
##$CFRGTYP= 5
##$CHEMSTR= <none>
##$CNST= (0..31)
1 1 145 1 1 1 1 1 1 1 1 1 1 1 1 1 1 1 1 1 1 1 1 1 1 1 1 1 1 1 1 1 
##$CPDPRG= <>
##$CPDPRG1= <>
##$CPDPRG2= <>
##$CPDPRG3= <>
##$CPDPRG4= <mlev>
##$CPDPRG5= <mlev>
##$CPDPRG6= <mlev>
##$CPDPRG7= <mlev>
##$CPDPRG8= <mlev>
##$CPDPRGB= <>
##$CPDPRGT= <>
##$D= (0..31)
0 1.2 0 0 0 0 0 0 0 0.06 0 0.03 0 0 0 0 0.0002 0 0 0 0 0 0 0 0 0 0 0 0 
0 0 0 
##$DATE= 1649845779
##$DBL= (0..7)
120 120 120 120 120 120 120 120 
##$DBP= (0..7)
150 150 150 150 150 150 150 150 
##$DBP07= 0
##$DBPNAM0= <>
##$DBPNAM1= <>
##$DBPNAM2= <>
##$DBPNAM3= <>
##$DBPNAM4= <>
##$DBPNAM5= <>
##$DBPNAM6= <>
##$DBPNAM7= <>
##$DBPOAL= (0..7)
0.5 0.5 0.5 0.5 0.5 0.5 0.5 0.5 
##$DBPOFFS= (0..7)
0 0 0 0 0 0 0 0 
##$DE= 6
##$DECBNUC= <off>
##$DECIM= 32
##$DECNUC= <off>
##$DECSTAT= 4
##$DIGMOD= 1
##$DIGTYP= 9
##$DL= (0..7)
0 120 120 120 120 120 120 120 
##$DP= (0..7)
150 150 150 150 150 150 150 150 
##$DP07= 0
##$DPNAME0= <>
##$DPNAME1= <>
##$DPNAME2= <>
##$DPNAME3= <>
##$DPNAME4= <>
##$DPNAME5= <>
##$DPNAME6= <>
##$DPNAME7= <>
##$DPOAL= (0..7)
0.5 0.5 0.5 0.5 0.5 0.5 0.5 0.5 
##$DPOFFS= (0..7)
0 0 0 0 0 0 0 0 
##$DQDMODE= 0
##$DR= 18
##$DS= 0
##$DSLIST= <SSSSSSSSSSSSSSS>
$$ [...]
##$SUBNAM2= <"">
##$SUBNAM3= <"">
##$SUBNAM4= <"">
##$SUBNAM5= <"">
##$SUBNAM6= <"">
##$SUBNAM7= <"">
##$SUBNAM8= <"">
##$SUBNAM9= <"">
##$SW= 18.05172834244
##$SWIBOX= (0..15)
0 0 2 0 0 0 0 0 0 0 0 0 0 0 0 0 
##$SW_h= 3612.71676300578
##$TD= 16384
##$TD0= 1
##$TE= 0
##$TE2= 300
##$TE3= 300
##$TEG= 300
##$TL= (0..7)
0 120 120 120 120 120 120 120 
##$TP= (0..7)
150 150 150 150 150 150 150 150 
##$TP07= 0
##$TPNAME0= <>
##$TPNAME1= <>
##$TPNAME2= <>
##$TPNAME3= <>
##$TPNAME4= <>
##$TPNAME5= <>
##$TPNAME6= <>
##$TPNAME7= <>
##$TPOAL= (0..7)
0.5 0.5 0.5 0.5 0.5 0.5 0.5 0.5 
##$TPOFFS= (0..7)
0 0 0 0 0 0 0 0 
##$TUNHIN= 0
##$TUNHOUT= 0
##$TUNXOUT= 0
##$USERA1= <user>
##$USERA2= <user>
##$USERA3= <user>
##$USERA4= <user>
##$USERA5= <user>
##$V9= 5
##$VALIST= <valist>
##$VCLIST= <CCCCCCCCCCCCCCC>
##$VD= 0
##$VDLIST= <DDDDDDDDDDDDDDD>
##$VPLIST= <PPPPPPPPPPPPPPP>
##$VTLIST= <TTTTTTTTTTTTTTT>
##$WBST= 1024
##$WBSW= 4
##$XGAIN= (0..3)
0 0 0 0 
##$XL= 0
##$YL= 0
##$YMAX_a= 539411
##$YMIN_a= -476516
##$ZGOPTNS= <>
##$ZL1= 120
##$ZL2= 120
##$ZL3= 120
##$ZL4= 120
##$ABSF1= 10
##$ABSF2= 0
##$ABSG= 5
##$ABSL= 3
##$ALPHA= 0
##$AQORDER= 0
##$ASSFAC= 0
##$ASSFACI= 0
##$ASSFACX= 0
##$ASSWID= 0
##$AUNMP= <proc_1d>
##$AZFE= 0.1
##$AZFW= 0.1
##$BCFW= 1
##$BC_mod= 2
##$BYTORDP= 1
##$COROFFS= 0
##$CY= 11.3945322036743
##$DATMOD= 1
##$DC= 2
##$DFILT= <>
##$DTYPP= 0
##$F1P= 2.36226072786647
##$F2P= -0.459571619588291
##$FCOR= 0.5
##$FTSIZE= 0
##$FT_mod= 4
##$GAMMA= 1
##$GB= 0.15
##$INTBC= 1
##$INTSCL= 1
##$ISEN= 128
##$LB= 0.24
##$LEV0= 0
##$LPBIN= 0
##$MAXI= 10000
##$MC2= 0
##$MEAN= 0
##$ME_mod= 0
##$MI= 1.114404
##$NCOEF= 0
##$NC_proc= 0
##$NLEV= 6
##$NOISF1= 3.799351
##$NOISF2= 2.8
##$NSP= 1
##$NTH_PI= 0
##$NZP= 0
##$OFFSET= 15.70392
##$PC= 1
##$PHC0= -18546
##$PHC1= 5.200779
##$PH_mod= 1
##$PKNL= yes
##$PPARMOD= 0
##$PSCAL= 0
##$PSIGN= 0
##$REVERSE= no
##$SF= 200.130013532006
##$SI= 16384
##$SIGF1= 3
##$SIGF2= 2
##$SINO= 400
##$SIOLD= 16384
##$SREGLST= <1H.CDCl3>
##$SSB= 0
##$STSI= 0
##$STSR= 0
##$SW_p= 3612.71676300578
##$SYMM= 0
##$S_DEV= 0
##$TDeff= 0
##$TDoff= 0
##$TI= <>
##$TILT= no
##$TM1= 0
##$TM2= 0
##$TOPLEV= 0
##$USERP1= <user>
##$USERP2= <user>
##$USERP3= <user>
##$USERP4= <user>
##$USERP5= <user>
##$WDW= 1
##$XDIM= 8192
##$YMAX_p= 0
##$YMIN_p= 0
$$ End of Bruker specific parameters
$$ ---------------------------------
##NTUPLES= NMR FID
##VAR_NAME=  TIME,          FID/REAL,        FID/IMAG
##SYMBOL=    X,             R,               I
##VAR_TYPE=  INDEPENDENT,   DEPENDENT,       DEPENDENT
##VAR_FORM=  AFFN,          ASDF,            ASDF
##VAR_DIM=   8192,          8192,            8192
##UNITS=     SECONDS,       ARBITRARY UNITS, ARBITRARY UNITS
##FACTOR=    0.0002768,     1,               1
##FIRST=     0,             0,               0
##LAST=      2.2672688,     0,               0
##MIN=       0,             -476516,         0
##MAX=       2.2672688,     539411,          0
$$ Real data points
##PAGE= N=1
##DATA TABLE= (X++(R..R)), XYDATA
$$ plain form
0 0 0 0 0 0 0 0 0 0 0 0 8 -8 8 -16 18 -24 25 -32 48 -56 64 -73 89 -104 121 -144 168 -193 224 -257 294 -333
32 -333 378 -431 486 -546 613 -687 769 -856 953 -1061 1176 -1300 1438 -1590 1756 -1934
48 -1934 2132 -2349 2589 -2849 3142 -3469 3832 -4243 4712 -5250 5872 -6610 7498 -8586
62 -8586 9955 -11750 14204 -17779 23482 -34064 60194 -261888 -176462 519449 144380 -392308
74 -392308 -153938 474302 225671 -440935 -369137 331556 361075 -253976 -357548 265916
84 265916 418442 -192117 -476516 84008 438306 -27073 -421901 8517 445327 70030
94 70030 -441800 -151162 384308 186693 -354282 -211586 343688 272862 -303384 -320440 238858
105 238858 334330 -199168 -350025 165592 383762 -108135 -398426 43940 390840 812
$$ packed form
0@%%%%%%%%%%Qj6J6k4L4m2M9n7Q0j04J20j37J62j93K25k65L12l61M17m81N51o27
32c33P11q09R17j032J159j300J456j625J809k014K237k476K738l028L346l690
48a934M066m481M938n438N991o611P301q075Q955r962J1122j2482J4108j6084
62h586J8541k1705K5954l1983M1261n7546R4258l22082Q5426O95911l75069n36688
74c92308K38370O28240k48631o66606P1798P00693K9519o15051j03572O23464
84B65916J52526o10559k84399N60524L54298m65379l94828M30418M36810l75297
94G0030n11830K90638N35470j97615n40975J42696N55274p0826n76246j7056N59298
105B38858R5472n33498j50857N15617K18170m91897k90291M42366L46900l90028
$$ plain form
115 812 -388114 -45566 390161 104158 -373237 -158030 343014 196543 -317357 -235948 289626
126 289626 279835 -247047 -313306 198298 334068 -153726 -353297 105997 369779 -49957
136 -49957 -373598 -5285 366973 54712 -357417 -104303 341982 154560 -315912 -198470
146 -198470 283374 235118 -248973 -268287 210155 297071 -165285 -317064 118891 329448
156 329448 -72883 -336868 25512 338033 22805 -330900 -68478 317103 110358 -299004
166 -299004 -149844 275559 186065 -246343 -217084 213396 242870 -177839 -264228 139498 280005
177 280005 -99286 -289362 59012 293106 -19737 -292141 -18739 286207 55988 -275412
187 -275412 -90976 260435 123745 -241972 -154456 219726 182262 -193963 -206406 165636
$$ packed form
115H12l88926L42548M35727k86003m77395K15207N01044j46471n13900Q1409N25574
126B89626r791n26882o6259N11604J35770m87794j99571M59294K63782m19736
136d9957l23641L68313L72258l12261m12129K53114M46285j87422m70472J17442
146a98470M81844m8256m84091j9314M78442Q6916m62356j51779M35955K10557
156C29448m02331k63985L62380L12521l15228l53705K62422L85581k06745m09362
166b99004J49160M25403q9494m32408K9259M30480K9474m20709q6389M03726J40507
177B80005l79291j90076L48374K34094l12843k72404K73402L04946k30219l31400
187b75412J84436L51411j36690l65717Q7516L74182l7464l76225j2443L72042
$$ plain form
197 165636 227001 -135141 -244070 102111 257029 -67067 -265546 30856 269338 5934
207 5934 -268461 -42915 262427 79180 -251182 -114168 234920 147127 -213762 -177399 188040
218 188040 203808 -158338 -225570 125721 242161 -90801 -253450 54549 259156 -17745
228 -17745 -259260 -18561 254061 53821 -243720 -87253 228589 118037 -209129 -145445
238 -145445 186100 169246 -159990 -188889 131605 204361 -101654 -215345 70868 222057
248 222057 -39832 -224501 9031 223001 20877 -217685 -49691 208904 76904 -196885
258 -196885 -102213 181891 125315 -164350 -146048 144288 164251 -122013 -179781 97742 192098
269 192098 -71950 -201067 45016 206549 -17522 -208392 -10212 206514 37747 -200915
$$ packed form
197A65636O1365l62142j08929L46181J54918l24096j98479K96402K38482k63404
207E934k74395K25546L05342j83247l30362J37014L49088q7793l60889L6363L65439
218A88040J5768l62146o7232L51291J16440l32962j62649L07999K04607k76901
228a7745k41515K40699K72622k00240k97541J56467L15842j10552l27166O3684
238a45445L31545j6854l29236k8899L20494P2756l06015j13691K86213J51189
248B22057k61889j84669K33532K13970k02124k38562J67994K58595j32000k73789
258a96885R4672K84104n6576k89665J8302K90336J9963k86264n7768K77523R4356
269A92098k64048j29117K46083J61533k24071j90870J98180K16726j68767k38662
$$ plain form
279 -200915 -64523 191674 90101 -178949 -114039 162832 135811 -143584 -154938 121727
289 121727 171047 -97617 -183808 71608 192798 -44438 -197944 16473 199129 11598
299 11598 -196358 -39443 189595 66251 -179067 -91229 165036 114140 -147879 -134443 127883
310 127883 151719 -105722 -165657 81734 176030 -56574 -182675 30851 185564 -4966
320 -4966 -184800 -20538 180480 45109 -172744 -68083 161811 89383 -148121 -108427 131906
331 131906 124900 -113757 -138706 94097 149640 -73400 -157527 52067 162688 -30323 -165030
342 -165030 8377 164654 13421 -161494 -34861 155676 55438 -147379 -74823 136680
352 136680 92822 -123756 -109129 108882 123581 -92123 -135926 73759 146060 -53842 -153577
$$ packed form
279b00915J36392K56197j01573k69050O4910K76871k7021k79395j1354K76665
289A21727M9320k68664q6191K55416J21190k37236j53506K14417J82656j87531
299A1598k07956J56915K29038j23344k45318Q7838K56265n0896k62019J3436K62326
310A27883K3836k57441n9935K47391R4296k32604j26101K13526J54713j90530
320d966j79834J64262K01018j35371k17853J04661K29894p2428k37504L9694K40333
331A31906p006k38657k4949K32803N5543k23040q4127K09594J10621j93011j34707
342a65030J73407J56277j51233j74915J26633J90537j00238k02817P2556K11503
352A36680m3858k16578J4627K18011J4699k15704m3803K09685P2301j99902r9735
$$ plain form
363 -153577 32860 158249 -11097 -160031 -11151 158676 33349 -154158 -55119 146410
373 146410 75903 -135508 -95255 121594 112403 -105094 -127082 86542 138777 -66304 -147373
384 -147373 44766 152681 -22621 -154541 694 153087 20594 -148540 -40939 141211
394 141211 59921 -131173 -77164 118962 92458 -104883 -105489 89367 116227 -72648 -124604
405 -124604 55165 130676 -37081 -134266 18784 135481 -502 -134393 -17481 131050
415 131050 34813 -125655 -51154 118169 66463 -108966 -80430 98052 92829 -85733 -103790
426 -103790 71988 112771 -56984 -120082 40880 125160 -24012 -128044 6725 128634
436 128634 10650 -126738 -27981 122359 44741 -115735 -60635 106782 75270 -95717 -88297
$$ packed form
363a53577J86437J25389j69346j48934J48880J69827j25327j87507R9039K01529
373A46410p0507k11411M0253K16849r191k17497k1988K13624N2235k05081q1069
384a47373J92139J07915j75302j31920J55235J52393j32493j69134J07601J82150
394A41211q1290j91094N4009J96126k6504j97341o06J94856K6860j88875n1956
405a24604J79769P5511j67757r7185J53050J16697j35983j33891J16912J48531
415A31050r6237j60468P4501J69323n1706j75429K8536J78482n223j78562j8057
426a03790J75778M0783j69755o3098J60962Q4280j49172j04032J34769J21909
436A28634j17984j37388R8757J50340p7618j60476N5100J67417l1512j70987P420
$$ plain form
447 -88297 82922 99345 -68692 -108441 53227 115259 -36912 -119778 19852 121978 -2625
458 -2625 -121756 -14578 119026 31292 -114047 -47102 106819 61754 -97624 -75027 86516
469 86516 86722 -73727 -96627 59505 104305 -44390 -109717 28619 112762 -12691 -113469
480 -113469 -3167 111907 18393 -108203 -32958 102481 46561 -94991 -58867 85914 69838
491 69838 -75406 -79116 63902 86771 -51409 -92743 38420 96845 -25057 -99268 11538
502 11538 99858 1872 -98814 -15126 96100 27995 -91772 -40316 85915 51867 -78629
513 -78629 -62540 69846 71936 -60000 -80151 48984 86796 -37044 -91943 24275 95315
524 95315 -11055 -96859 -2420 96488 15855 -94151 -28867 89974 41123 -84069 -52534
$$ packed form
447h8297J71219J6423j68037l9749J61668O2032j52171q2866J39630J02126j24603
458b625j19131J07178J33604q7734j45339O6945J53921m5065j59378K2597J61543
469H6516K06j60449k2900J56132M4800j48695o5327J38336Q4143j25453j00778
480a13469J10302J15074r3514j26596P5245J35439n5920j41552L6124J44781j6076
491F9838j45244l710J43018K2869j38180m1334J31163N8425j21902p4211J10806
502A1538Q8320r7986j00686Q3688J11226o8105j19767N1456J26231l4048j30496
513g8629J6089J32386K090j31936k0151J29135L7812j23840n4899J16218P1040
524I5315j06370q5804R4439R8908q0633j10006O5284J18841m8851j25192L1535
$$ plain form
535 -52534 76483 62810 -67376 -71840 56920 79200 -45365 -84891 33072 88669 -20302
546 -20302 -90560 7269 90519 5514 -88636 -17820 85009 29379 -79944 -40020 73396
557 73396 49596 -65647 -57964 56957 65117 -47344 -70931 37150 75267 -26592 -78114
568 -78114 15819 79621 -4895 -79693 -5780 78438 16229 -75792 -26179 72050 35516 -67103
580 -67103 -44123 60998 51920 -53961 -58865 45947 64779 -37108 -69491 27652 72953 -17408
592 -17408 -75101 6998 75751 3626 -74880 -14135 72610 24298 -68737 -33802 63681 42447
604 42447 -57429 -50173 50170 56896 -41906 -62477 32853 66797 -23219 -69736 13288 71270
616 71270 -3139 -71262 -6959 69949 16807 -67186 -26235 63077 34971 -57671 -42927 51276
$$ packed form
535e2534J29017j3673j30186m464J28760K2280j24565l9526J17963N5597j08971
546b0302p0258R7829Q3250q5005r4150P0816J02829n5630j09323L9924J13416
557G3396k3800j15243P683J14921Q160j12461k3587J08081L8117j01859n1522
568g8114R3933O3802q4516p4798P3913Q4218o2209r2021M9613R8229l6534j02619
580f7103K2980J05121r078j05881m904J04812J8832j01887l2383R7143M5301r0361
592a7408n7693Q2099O8753p2125p8506O0745Q6745m8312r3035L4935R7483k1234
604D2447r9876P256J00343O726r8802k0571R5330L3944r0016m6517Q3024N7982
616G1270p4409o8123O4303P6908n3142q3993M0951Q9312k8106r2642J4744R4203
$$ plain form
628 51276 49851 -43935 -55631 35759 60138 -27183 -63391 18291 65267 -9203 -65829 128
640 128 65123 8782 -63192 -17332 60051 25336 -55795 -32728 50700 39161 -44760 -44759 38104
653 38104 49415 -30951 -53085 23392 55785 -15523 -57375 7597 57906 246 -57461 -7910
665 -7910 56035 15280 -53836 -22267 50706 28788 -46768 -34908 42032 40521 -36431 -45511 30136
678 30136 49676 -23244 -52817 15864 55032 -8121 -56151 249 56028 7660 -54790 -15375
690 -15375 52361 22867 -48820 -29679 44221 35864 -38666 -41083 32340 45500 -25349 -48712
702 -48712 18002 50791 -10382 -51700 2770 51368 4693 -50013 -11713 47684 18330 -44507
714 -44507 -24354 40494 29641 -35868 -34307 30707 38120 -25215 -41156 19306 43370 -13306
$$ packed form
628E1276j425r3786j1696R1390K4379q7321l6208Q1682M6976p4470n6626O5957
640A28O4995n6341p1974M5860P7383l4715q1131K3067Q3428j1539q3921JQ2863
653C8104J1311q0366k2134P6477L2393p1308m1852O4972N0309n7660n7707M9551
665g910O3945m0755o9116L1569P2973k1918p5556J1860P6940j511p6952r080P5647
678C0136J9540p2920k9573O8681L9168o3153m8030N6400N5779m8368o2450L9415
690a5375O7736k9494p1687J9141P3900q357p4530k417P3423J3160p0849k3363
702d8712O6714L2789o1173m1318N4470M8598m6675n4706L8300N9397k9354o2837
714d4507K0153O4848j0853o5509J561O5014P413o3335j5941O0462K4064n6676
$$ plain form
726 -13306 -44730 7213 45341 -1069 -45115 -4987 44144 10717 -42463 -16354 39964 21581
738 21581 -36893 -26371 33165 30608 -28913 -34383 24111 37452 -18864 -39761 13211 41453
750 41453 -7396 -42254 1478 42146 4500 -41301 -10282 39564 15839 -37038 -21030 33757
762 33757 25728 -29869 -29768 25403 33207 -20617 -35913 15340 37840 -9919 -39009 4290 39397
775 39397 1387 -38965 -6837 37685 12173 -35723 -17211 32947 21803 -29628 -25733 25693
787 25693 29163 -21317 -31914 16646 33918 -11665 -35208 6650 35748 -1619 -35532 -3327
799 -3327 34590 8032 -33027 -12554 30777 16699 -28119 -20378 24947 23450 -21399 -26069 17592
812 17592 28105 -13608 -29649 9367 30629 -5079 -31027 826 30885 3482 -30228 -7554
$$ packed form
726a3306l1424N1943L8128m6410m4046M0128M9131l3427n3180K6109N6318j8383
738B1581n8474J0522N9536k557n9521n470N8494J3341n6316k0897N2972K8242
750D1453m8849l4858M3732M0668l7646m5801L1019M9846k3725n2877J6008N4787
762C3757q029n5597J01N5171P804n3824j5296N1253K2500m7759k9090M3299L5107
775C9397l8010m0352L2128M4522k5512m7896J8512N0158j1144n1431L895N1426
787B5693L470n0480j0597M8560J7272m5583k3543M1858K9098l7367l3913L2205
799c327L7917k6558m1059K0473M3331j4078m4818P741M5325j497m4849m670M3661
812A7592J0513m1713j6041L9016K1262l5708k5948L1853L0059k7403l3710K2674
$$ plain form
824 -7554 29044 11544 -27405 -15296 25253 18737 -22595 -21873 19494 24590 -15980 -26833 12255
837 12255 28519 -8188 -29656 3931 30153 344 -30046 -4677 29262 8845 -27835 -12893
849 -12893 25693 16540 -23141 -19815 19906 22605 -16406 -24823 12605 26379 -8557 -27380 4452
862 4452 27723 -305 -27439 -3754 26592 7580 -25161 -11169 23280 14438 -20861 -17305 18124
875 18124 19801 -15087 -21687 11862 23226 -8450 -24197 4996 24648 -1517 -24730 -1836
887 -1836 24286 5169 -23437 -8356 22169 11320 -20559 -14136 18441 16592 -15995 -18768 13247
900 13247 20512 -10350 -21896 7111 22805 -3838 -23322 473 23293 2885 -22723 -6144
912 -6144 21724 9337 -20268 -12282 18440 14947 -16143 -17246 13526 19182 -10688 -20711 7508
$$ packed form
824g554L6598j7500l8949J2109M0549o516m1332P22M1367N096m0570j0853L9088
837A2255J6264l6707k1468L3587K6222k9809l0390K5369L3939k0417l6680J4942
849a2893L8586r153l9681L326L9721K699l9011q417L7428J3774l4936j8823L1832
862D452K3271k8028k7134K3685L0346j9012l2741J3992L4449q842l5299L556L5429
875A8124J677l4888o600L3549J1364l1676j5747K9193J9652k6165k3213K2894
887a836K6122j9117k8606J5081L0525j0849l1879O423L2577j849l2587k773L2015
900A3247P265l0862j1546K9007J5694k6643j9484K3795K2820k0408k5608J6579
912f144K7868j2387k9605P986L0722l493l1090j103L0772N656k9870j0023K8219
$$ plain form
925 7508 21744 -4308 -22318 992 22441 2316 -22081 -5533 21146 8559 -19895 -11452
937 -11452 18157 13919 -16096 -16240 13617 18126 -10905 -19589 7962 20618 -4956 -21218 1817
950 1817 21287 1263 -20938 -4260 20153 7117 -18904 -9754 17310 12166 -15407 -14236 13212
963 13212 15998 -10809 -17473 8147 18499 -5482 -19185 2703 19401 46 -19323 -2847
975 -2847 18816 5503 -18063 -8021 16882 10338 -15350 -12502 13636 14475 -11546 -16144 9355
988 9355 17511 -6848 -18500 4192 19185 -1389 -19454 -1448 19267 4274 -18725 -6982
1000 -6982 17693 9557 -16317 -11926 14483 14109 -12420 -15893 9980 17379 -7293 -18438 4424
1013 4424 18978 -1600 -19201 -1362 18870 4201 -18241 -6912 17039 9422 -15480 -11667
$$ packed form
925G508J4236k6052j8010K3310K1449k0125k4397J6548K6679j2587k8454Q443
937a1452K9609m238l0015j44K9857M509k9031q684K7551J2656k5574j6262K3035
950A817J9470k0024k2201J6678K4413j3036k6021R150K7064n144k7573J171K7448
963A3212K786k6807o664K5620J0352k3981j3703K1888J6698j9355j9369J6476
975b847K1663j3313k3566J0042K4903o544k5688K848K6138Q39k6021m598K5499
988I355Q156k4359j1652K2692J4993k0574j8065J8006K0715j4993k2999J1743
1000f982K4675q136k5874M391K6409l74k6529l473K5873P399k4672j1145K2862
1013D424J4554k0578j7601J7839K0232j4669k2442J1329K3951p617k4902L813
$$ plain form
1025 -11667 13697 13667 -11564 -15291 9263 16615 -6837 -17437 4276 17985 -1672 -18151 -847
1038 -847 17935 3380 -17412 -5798 16563 8122 -15344 -10237 13877 12192 -12200 -13847 10202
1051 10202 15235 -8024 -16357 5737 17206 -3337 -17688 734 17751 1675 -17527 -4255
1063 -4255 16887 6665 -15981 -9038 14587 11199 -13030 -13064 11099 14785 -8923 -16129 6546
1076 6546 17098 -3955 -17704 1363 17996 1278 -17782 -3917 17292 6316 -16407 -8682
1088 -8682 15157 10874 -13657 -12858 11841 14527 -9786 -15965 7465 16984 -5066 -17740 2456
1101 2456 18070 50 -18021 -2711 17606 5235 -16839 -7650 15617 9757 -14181 -11773 12374
1114 12374 13518 -10415 -14923 8230 16050 -5912 -16847 3494 17275 -1028 -17371 -1445
$$ packed form
1025a1667K5364l0k5231l727K4554P352k3452j0600K1713J3709j9657j6479J7304
1038h47J8782j4555k0792J1614K2361q441k3466N107K4114j685k4392j647K4049
1051A0202N033k3259q333K2094J1469k0543j4351J8422J7017j6076j9202J3272
1063d255K1142j0222k2646O943K3625l388k4229l4K4163L686k3708p206K2675
1076F546J0552k1053j3749J9067J6633j6718j9060J3865K1209j0976k2723P725
1088h682K3839m283k4531P99K4699K686k4313o179K3430R519k2050j2674K0196
1101B456J5614j8020j8071J5310K0317j2371k2074R189K3267n860k3938K408K4147
1114A2374J144k3933m508K3153P820k1962j0935K0341J3781j8303j6343J5926
$$ plain form
1126 -1445 17129 3807 -16563 -6185 15650 8386 -14507 -10365 13076 12224 -11402 -13815 9508
1139 9508 15217 -7399 -16213 5155 17030 -2913 -17568 531 17677 1945 -17499 -4363
1151 -4363 16971 6795 -16114 -9096 14867 11268 -13334 -13188 11501 14908 -9411 -16250 7075
1164 7075 17310 -4510 -17970 1875 18217 706 -18125 -3375 17606 5910 -16708 -8304
1176 -8304 15461 10545 -13929 -12551 12001 14220 -9989 -15577 7722 16691 -5363 -17390 2890
1189 2890 17758 -433 -17837 -1997 17515 4431 -16896 -6751 15904 8909 -14716 -10987
1201 -10987 13203 12767 -11462 -14328 9503 15694 -7392 -16639 5170 17437 -2789 -17883 410
1214 410 17940 2117 -17735 -4606 17096 6963 -16058 -9305 14757 11450 -13222 -13358 11369
$$ packed form
1126a445J8574j3322k0370J0378K1835p264k2893M142K3441q52k3626k413K3323
1139I508N709k2616q814K1368J1875j9943j4655J8099J7146j5732j9444J3136
1151d363K1334j0176k2909P018K3963l599k4602J46K4689L407k4319o839K3325
1164G075J0235k1820j3460J9845J6342j7511j8831J4750K0981j1696k2618Q404
1176h304K3765m916k4474J378K4552K219k4209n588K3299Q969k2054j2027K0280
1189B890J4868j8191j7404J5840J9512j3084k1327J0145K2655o995k3625L729
1201a0987K4190m36k4229k866K3831O191k3086r247K1809J2267k0226j5094J8293
1214D10J7530j5823j9852J3129K1702j0133k3021O753K4062l307k4672j36K4727
$$ plain form
1227 11369 14916 -9209 -16292 6968 17291 -4555 -17995 1997 18316 696 -18336 -3222
1239 -3222 17870 5786 -17126 -8254 15967 10497 -14535 -12520 12813 14304 -10787 -15876 8540
1252 8540 17129 -6109 -17991 3577 18455 -971 -18533 -1633 18235 4120 -17646 -6580
1264 -6580 16660 8947 -15434 -10985 13782 12868 -11984 -14451 9943 15692 -7743 -16832 5392
1277 5392 17482 -2954 -17862 423 17868 2031 -17579 -4382 16995 6694 -15993 -8861
1289 -8861 14823 10897 -13393 -12667 11696 14302 -9699 -15658 7672 16788 -5356 -17562 3027
1302 3027 18070 -506 -18145 -1920 17978 4347 -17430 -6745 16593 9021 -15401 -11220
1314 -11220 13895 13140 -12067 -14880 9982 16249 -7673 -17305 5246 18127 -2677 -18464 47
$$ packed form
1227A1369L547k4125p083K3260J0323k1846j3440J9992J6319j7620j9032J5114
1239c222K1092j2084k2912Q872K4221n470k5032K015K5333J491k5091n089K4416
1252H540Q589k3238j1882K1568J4878j9426j7562J6900J9868j4115k1766J1066
1264f580K3240p713k4381M449K4767r14k4852k467K4394N749k3435r089K2224
1277E392J2090k0436j4908J8285J7445j5837j9610J3197K1377j0301k2687P132
1289h861K3684l926k4290P26K4363K606k4001n959K3330R116k2144j2206K0589
1302C027J5043j8576j7639J6225J9898j3631k1777J0685K3338p572k4422M181
1314a1220K5115p55k5207k813K4862O267k3922r632K2551J2881k0804j5787J8511
$$ plain form
1327 47 18435 2635 -17997 -5222 17216 7637 -16080 -9901 14625 11974 -12886 -13673 10963
1340 10963 15121 -8802 -16290 6608 17167 -4183 -17575 1761 17847 586 -17791 -3019
1352 -3019 17265 5377 -16563 -7656 15462 9695 -14142 -11598 12550 13280 -10765 -14701 8765
1365 8765 15856 -6594 -16763 4389 17363 -2020 -17632 -387 17585 2827 -17203 -5104
1377 -5104 16509 7450 -15510 -9537 14243 11521 -12691 -13164 10842 14728 -8867 -15980 6650
1390 6650 16914 -4348 -17527 1925 17792 478 -17806 -2858 17410 5281 -16664 -7630
1402 -7630 15677 9730 -14386 -11707 12785 13427 -10909 -14939 8909 16103 -6686 -16921 4388
1415 4388 17573 -2046 -17738 -371 17667 2784 -17232 -5071 16459 7316 -15408 -9379
$$ packed form
1327D7J8388j5800k0632J2775K2438r579k3717O179K4526k651k4860p87K4636
1340A0963M158k3923p488K2898J0559k1350j3392J9336J6086j7261j8377J4772
1352c019K0284j1888k1940Q907K3118n767k3837K544K4148P30k4045l936K3466
1365H765P091k2450j0169K1152J2974j9383j5612J7245J7972j4758k0030J2099
1377e104K1613r059k2960N973K3780k722k4212m73K4006L886k3595p113K2630
1390F650J0264k1262j3179J9452J5867j7314j8284J4948K0268j2129k1945R034
1402g630K3307n947k4116K679K4492O42k4336m030K3848P194k2789j0235K1309
1415D388J3185j9619j5692J7367J8038j4883k0016J2161K1530r143k2724O029
$$ plain form
1427 -9379 14065 11271 -12491 -12913 10664 14362 -8696 -15472 6598 16261 -4445 -16847 2146
1440 2146 17092 75 -17039 -2246 16717 4570 -16185 -6696 15270 8675 -14135 -10662 12768
1453 12768 12312 -11109 -13811 9279 15122 -7288 -16116 5099 16868 -2831 -17216 460 17432
1466 17432 1946 -17122 -4291 16590 6649 -15622 -8864 14449 10888 -12914 -12646 11133 14201
1479 14201 -9072 -15482 6890 16407 -4516 -17044 2035 17295 368 -17196 -2827 16778
1491 16778 5100 -15939 -7334 14928 9379 -13625 -11234 11968 12823 -10174 -14115 8256 15217
1504 15217 -6113 -16047 3926 16473 -1814 -16676 -429 16585 2726 -16154 -4884 15534
1516 15534 6947 -14494 -8827 13331 10616 -11906 -12220 10208 13562 -8466 -14694 6382 15537
$$ packed form
1427i379K3444k794k3762m22K3577L698k3058o776K2070R663k0706j2402J8993
1440B146J4946j7017j7114J4793J8963j2147k0755R489K1966o595k2810L473K3430
1453A2768m56k3421k702K3090N843k2410q828K1215J1769j9699j4385J7676J6972
1466A7432j5486j9068J2831K0881r941k2271O758K3313l561k3802K68K3779L068
1479A4201k3273o410K2372R517k0923j2528J9079J5260j6927j7564J4369J9605
1491A6778j1678k1039Q605K2262n549k3004K391K3202Q55k2997l941K2371O961
1504A5217k1330r934J9973J2547j8287j4862J6247J7014j3859j8880J1270K0418
1516A5534q587k1441N667K2158k715k2522l14K2428L354k2028o228K1076R155
$$ plain form
1529 15537 -4264 -16111 2075 16404 173 -16363 -2425 16076 4590 -15461 -6679 14527
1541 14527 8658 -13361 -10447 12004 12040 -10310 -13493 8426 14690 -6415 -15541 4205 16140
1554 16140 -2026 -16411 -222 16315 2507 -15938 -4673 15330 6765 -14441 -8679 13215
1566 13215 10406 -11826 -12016 10099 13295 -8333 -14437 6295 15204 -4196 -15703 2042 15921
1579 15921 137 -15778 -2173 15422 4291 -14791 -6320 13773 8170 -12521 -9903 11157
1591 11157 11321 -9567 -12584 7766 13669 -5903 -14371 3916 14873 -1892 -15127 -73 15132
1604 15132 2129 -14874 -4087 14287 5930 -13529 -7727 12528 9395 -11341 -10869 9859 12209
1617 12209 -8214 -13364 6402 14219 -4472 -14785 2478 15169 -377 -15209 -1734 14962
$$ packed form
1529A5537j9801j1847J8186J4329j6231j6536J3938J8501j1486k0051Q782K1206
1541A4527n869k2019K914K2451L6k2350l183K1919O264k1105r126J9746J1935
1554A6140j8166j4385J6189J6537j3808j8445J1265K0003q565k1206N762K1894
1566A3215k809k2232j90K2115L196k1628o104K0732Q909j9400j1507J7745J3879
1579A5921j5784j5915J3605J7595j1131j9082Q471K0093n603k0691K618K1060
1591A1157J64k0888l017K0350N903j9572q468J8287J0957j6765j3235J5054J5205
1604A5132j3003j7003J0787J8374q357j9459N802K0255l133k0736M72K0728K350
1617A2209k0423n150J9766P817j8691j0313J7263J2691j5546j4832J3475J6696
$$ plain form
1629 14962 3785 -14370 -5779 13549 7676 -12476 -9384 11122 10904 -9507 -12159 7812 13198
1642 13198 -5804 -14034 3800 14480 -1791 -14645 -291 14562 2330 -14104 -4224 13487
1654 13487 6066 -12620 -7763 11484 9244 -10161 -10568 8695 11766 -7096 -12608 5325 13271
1667 13271 -3491 -13695 1671 13899 192 -13780 -2055 13419 3865 -12927 -5517 12119
1679 12119 7142 -11167 -8622 9925 9934 -8562 -11032 6990 11979 -5442 -12694 3670 13151 -1876
1693 -1876 -13370 119 13409 1714 -13155 -3550 12585 5278 -11917 -6908 10915 8400 -9712
1706 -9712 -9734 8393 10883 -6882 -11818 5283 12563 -3576 -12983 1838 13227 64 -13191
1719 -13191 -1767 12916 3507 -12337 -5142 11590 6747 -10631 -8083 9450 9363 -8177 -10432
$$ packed form
1629A4962j1177j8155Q591J9328n873k0152L092K0506k18k0411k652J9971N386
1642A3198j9002q230J7834J0680j6271j2854J4354J4853j2232j6434R880J7711
1654A3487p421j8686M857J9247k240j9405m07J9263L071j8862n512J7933P946
1667A3271j6762j0204J5366J2228j3707j3972J1725J5474r554j6792P410J7636
1679A2119m977j8309K545J8547Rj8496k470J8022M989j7421p252J6364R481j5027
1693a876j1494J3489J3290j1695j4869R605J6135p307j7195N009J7823k515j8112
1706i712k2J8127K490j7765m936J7101P280j6139r407J4821J1389j3163j3255
1719a3191J1424J4683r409j5844P195J6732m843j7378K548J7533q7j7540k255
$$ plain form
1732 -10432 6623 11299 -5103 -11942 3358 12347 -1656 -12504 14 12401 1742 -12073
1744 -12073 -3284 11544 4852 -10825 -6269 9925 7587 -8837 -8747 7612 9752 -6286 -10573 4852
1758 4852 11224 -3409 -11610 1846 11853 -307 -11874 -1232 11680 2818 -11335 -4279 10735
1771 10735 5764 -9952 -7024 9016 8273 -7902 -9385 6653 10359 -5198 -10993 3684 11480
1784 11480 -2082 -11769 456 11789 1201 -11556 -2869 11155 4387 -10481 -5794 9663 7150
1797 7150 -8622 -8280 7425 9229 -6122 -10029 4745 10647 -3221 -11041 1615 11167 -153
1810 -153 -11206 -1353 10896 2806 -10500 -4113 9866 5438 -9111 -6587 8128 7598 -7152 -8495
1824 -8495 5940 9252 -4700 -9832 3399 10178 -2023 -10518 600 10525 859 -10436 -2196
$$ packed form
1732a0432J7055M676j6402o839J5300Q989j4003j0848J2518J2387j0659j3815
1744a2073Q789J4828o692j5677M556J6194k338j6424R0J6359K140j6038m287J5425
1758D852O372j4633q201J3456J0007j2160j1567J0642J2912q862j4153P056J5014
1771A0735m971j5716K928J6040p43j6175j483J6038L706j5557n795J4677P796
1784A1480j3562r687J2225J1333j0588j2757Q687J4024o768j4868M687J5457k513
1797G150j5772L42J5705J804j5351l907J4774N902j3868p820J2656R552j1320
1810a53j1053R853J2249q090j3306O387J3979m428j4549K524J4715n30j4750j343
1824h495J4435L312j3952n132J3231O779j2201q495J1118R925r666j1295Q240
$$ plain form
1837 -2196 10052 3557 -9573 -4892 8816 6005 -7977 -7118 7001 8076 -5868 -8846 4644
1850 4644 9493 -3377 -9935 1988 10209 -637 -10239 -795 10109 2197 -9799 -3494 9333
1863 9333 4788 -8593 -5989 7769 7052 -6803 -7957 5650 8622 -4476 -9255 3147 9616 -1821
1877 -1821 -9792 446 9813 904 -9627 -2247 9269 3524 -8700 -4639 7981 5745 -7164
1890 -7164 -6699 6252 7485 -5150 -8150 4046 8598 -2827 -8907 1667 9086 -398 -9102 -816
1904 -816 8905 1964 -8590 -3068 8181 4160 -7587 -5217 6827 6121 -6013 -6817 5017 7510
1918 7510 -4066 -7991 2867 8365 -1771 -8595 625 8633 616 -8505 -1731 8279 2866 -7826
1932 -7826 -3906 7270 4932 -6589 -5827 5781 6570 -4829 -7262 3831 7790 -2729 -8147 1523
$$ packed form
1837b196J2248o495j3130M681J3708k811j3982Q59J4119J075j3944k978J3490
1850D644M849j2870o558J1923Q221j0846r602R444J0904p912j1996O305J2827
1863I333m545j3381K604J3758p17j3855j154J3607K972j3098m779J2402O469j1437
1877a821p971J0238R367q909j0531P380J1516n745j2224M061J2620k236j2909
1890g164M65J2951J233j2635l000J2196M552j1425o080J0574P419r484q704Q286
1904h16R721o941j0554N522J1249m021j1747K370J2044p06j2134q04J1834K493
1918G510j1576l925J0858N498j0136o824R220Q008q017r121O774J0010n413j0692
1932g826L920J1176k338j1521P62J1608P89j1399k433J1093L959j0519n418R670
$$ plain form
1946 1523 8330 -403 -8323 -802 8157 1926 -7862 -3038 7393 4058 -6856 -4944 6046 5764
1960 5764 -5178 -6446 4211 7030 -3229 -7345 2217 7611 -1177 -7739 71 7663 967 -7524
1974 -7524 -1961 7154 2974 -6746 -3820 6156 4659 -5483 -5310 4693 5934 -3921 -6408 2981 6794
1989 6794 -2086 -7068 1169 7107 -180 -7077 -765 6958 1706 -6744 -2618 6276 3453 -5802 -4184
2004 -4184 5205 4904 -4505 -5500 3701 5979 -2914 -6349 2012 6628 -1063 -6781 187 6760 713
2019 713 -6597 -1677 6339 2500 -6021 -3361 5474 4121 -4869 -4761 4155 5255 -3456 -5714 2616
2034 2616 6041 -1781 -6237 912 6300 -18 -6317 -892 6130 1717 -5876 -2481 5390 3204 -4903
2049 -4903 -3860 4320 4412 -3701 -4913 2954 5268 -2257 -5469 1478 5667 -640 -5687 -112 5591
$$ packed form
1946A523O807q733p920P521Q959o231r788M824J0431l335j0914J912J0990k82
1960E764j0942j268J0657K819j0259m116R562N394q788o562P810P592o696q491
1974g524N563R115m180r720K926R976j497j0142J73J0003J241r855k487R389L813
1989F794q880m982Q237N938p287o897O312P723n252q450M126Q894k823r255J618
2004d184R389l01r409r95R201K278q893l435Q361M616p691n718O968O573o047
2019G13p310M920Q016l839q521K660Q835j353q990J08Q916J100q711k258Q330
2034B616L425p822m456P149N388o318o299N425P022m413p593L395P871k186q107
2049d903J043Q180R2q113j212P867K314p525l212O947M189o307n047N575N703
$$ plain form
2064 5591 927 -5440 -1610 5186 2300 -4846 -2954 4407 3496 -3919 -4030 3344 4467 -2697 -4838
2079 -4838 2035 5054 -1362 -5257 610 5232 63 -5216 -815 5078 1458 -4870 -2109 4553 2757
2094 2757 -4175 -3303 3631 3803 -3081 -4201 2496 4479 -1806 -4667 1154 4827 -417 -4837 -239
2109 -239 4776 922 -4586 -1590 4325 2243 -3963 -2713 3571 3181 -3072 -3567 2580 3853 -1975 -4156
2125 -4156 1406 4273 -775 -4326 143 4337 411 -4248 -976 4012 1508 -3811 -2079 3460 2610
2140 2610 -3148 -2885 2682 3289 -2198 -3552 1703 3771 -1216 -3848 646 3940 -44 -3912 -438
2155 -438 3760 1002 -3581 -1521 3375 1944 -2991 -2403 2646 2748 -2247 -3053 1828 3342 -1360 -3453
2171 -3453 792 3525 -278 -3617 -164 3578 691 -3423 -1160 3219 1606 -2991 -2039 2680 2367
$$ packed form
2064E591m664o367L830O796k886p146J892P361r11p415j11P374J123p164k141
2079d838O873L019o416l895N867M622n169n279M401N893l620o328K761O662j796
2094B757o932Q72O934J72o884j120O697J983o285k861N821L673n244m420M598
2109b39N015l854n508K996N915k082o206J250O284l90o253m95O147J273n828k181
2125d156N562K867n048l551M469M194l926m659L272M988k504n319J732N539q50
2140B610n758K63N567O07n487j354N255K068m987k632M494L294l984l868L474
2155d38M198k758m583K060M896j431m935N88N049J02m995q06M881J514m702k093
2171c453M245K733l803l339L453L742k887m114K263M379j613m597R52M719l13
$$ plain form
2186 2367 -2289 -2708 1888 2932 -1429 -3116 978 3244 -467 -3264 64 3199 385 -3145 -833
2201 -833 2929 1253 -2778 -1635 2467 1878 -2222 -2244 1818 2452 -1469 -2692 1052 2750 -680 -2865
2217 -2865 229 2895 147 -2756 -548 2661 906 -2506 -1238 2303 1540 -2035 -1821 1745 2104 -1476
2233 -1476 -2252 1128 2433 -826 -2449 412 2540 -79 -2492 -317 2452 681 -2331 -998 2086
2248 2086 1273 -1949 -1498 1651 1794 -1440 -1955 1073 2100 -813 -2230 498 2233 -174 -2219 -169
2264 -169 2156 521 -2092 -831 1904 1133 -1788 -1405 1497 1567 -1215 -1732 945 1826 -666 -1949 370
2281 370 2015 -110 -1962 -250 1880 508 -1783 -817 1640 1023 -1490 -1292 1249 1415 -1095 -1567
2297 -1567 787 1632 -557 -1764 299 1752 -30 -1755 -301 1668 531 -1652 -702 1412 982 -1318
$$ packed form
2186B367m656m19M596J044m361j687M094K266l711k797L328L135k814l530K312
2201h33L762j676m031J143M102n89m100k2M062O34l921j223L744J698l430k185
2217b865L094K666k748k903K208L209j755l412J268L541p63l575K14L566L59l580
2233a476p76L380J305l259j623K861K128k619k413K175K769j771l012J333L084
2248B086q13l222M51L149J43l234n15L028J027k913j417K728J735k407k045K050
2264a69K325j635k613J261K735p71k921L83K902P0k782n17K677Q81k492j283K319
2281C70J645k125j852J712K130j372k291R66K457o17k513J98K541J66k510m72
2297a567K354Q45k189j207K063J453j782j725J454J969j137k183R50K114m30k300
$$ plain form
2313 -1318 -1237 1117 1315 -953 -1482 643 1574 -430 -1614 192 1679 44 -1633 -308 1600 591
2329 591 -1546 -798 1405 1000 -1224 -1199 1005 1354 -845 -1509 579 1540 -308 -1639 66 1676 184
2346 184 -1601 -413 1554 717 -1447 -903 1312 1139 -1111 -1281 937 1465 -683 -1576 459 1597 -134
2363 -134 -1660 -121 1693 389 -1592 -637 1507 874 -1394 -1069 1163 1244 -1043 -1489 728 1534 -560
2380 -560 -1709 255 1695 -93 -1759 -179 1726 441 -1649 -673 1519 905 -1402 -1205 1231 1424
2396 1424 -1143 -1598 834 1714 -589 -1793 346 1877 -54 -1930 -245 1880 520 -1829 -827
2411 -827 1723 1060 -1523 -1329 1377 1561 -1144 -1747 906 1882 -566 -2060 342 2042 -48 -2108
2427 -2108 -314 2063 641 -2016 -936 1867 1241 -1709 -1481 1514 1709 -1313 -1877 934 2127 -699
$$ packed form
2313a318Q1K354J98k268n29K125R31k004j184J806J487j635j677J325J908j009
2329E91k137P48K203m05k224K5K204L49k199o64K088R61j848j331J705J610j492
2346A84j785J188J967q37k164N44K215j73k250j70K218N28k148q93K035J138j731
2363a34j526J539J814j304j981R55K144o33k268L25K232Q1k287m46K217Q06k094
2380e60j149J964J440j788j666J580J905j285k090R76K192o14k307J97K436J93
2396A424k567m55K432Q80k303j204K139J531j931j876J685K125j360k349J002
2411h27K550o63k583J94K706J84k705o03K653R76k448j494K402J700k090k060
2427b108J794K377j422k657J080K803o26k950K28K995J95l022n64K811J193k826
$$ plain form
2443 -699 -2159 410 2274 -35 -2279 -204 2286 536 -2187 -863 2120 1217 -1957 -1438 1737 1742
2459 1742 -1536 -1994 1261 2135 -928 -2340 649 2414 -302 -2560 -68 2488 383 -2501 -800
2474 -800 2415 1092 -2276 -1456 2101 1720 -1836 -2028 1601 2293 -1236 -2528 916 2637 -553 -2800
2490 -2800 139 2858 204 -2762 -659 2725 1003 -2589 -1349 2377 1722 -2148 -2109 1882 2335 -1620
2506 -1620 -2629 1183 2766 -850 -2936 398 2990 -35 -3087 -456 2988 876 -2879 -1299 2754
2521 2754 1723 -2532 -2086 2235 2430 -1907 -2726 1591 2926 -1183 -3105 717 3249 -286 -3279 -195
2537 -195 3330 600 -3174 -1109 3086 1504 -2913 -1923 2577 2282 -2342 -2681 1997 2961 -1601 -3160
2553 -3160 1104 3377 -735 -3494 192 3527 285 -3489 -792 3379 1248 -3269 -1769 3028 2184
$$ packed form
2443f99j460K569J864k309k244K075K490j750k723J324K983r03l174N19L175N
2459A742l278m58L255Q74l063j412K989J765k716k258K492K556k105k884J701
2474h00L215j323l368Q20L557l81l556j92L629O92l529j292L444J721l190k247
2490b800K939K719k654k966K103L384j722l592J240L726o55l870L9L991M53l955
2506a620j009L812J583l616k086L334K592l025l052K631L444k112l755J580M053
2521B754j031m255M46M321J95m337q19M317J335m109j922L822K532l535k993L084
2537a95L525k730l774K065M195j582m417R90M500k95m624l39M678R64m562j559
2553c160M264K273m112k759L686L335l242l774K697M171k131m517J500M797q44
$$ plain form
2568 2184 -2763 -2578 2379 2937 -1939 -3242 1550 3476 -1069 -3654 569 3738 -5 -3750 -546
2583 -546 3728 1079 -3585 -1561 3365 2060 -3112 -2500 2732 2893 -2373 -3217 2009 3526 -1409 -3732
2599 -3732 889 3901 -325 -3959 -198 3916 763 -3803 -1246 3642 1811 -3388 -2211 3125 2690
2614 2690 -2787 -3082 2369 3388 -1914 -3694 1392 3888 -888 -4008 351 4096 186 -4055 -783
2629 -783 3962 1383 -3832 -1862 3520 2349 -3194 -2802 2839 3217 -2433 -3585 1882 3876 -1430 -4071
2645 -4071 858 4229 -304 -4298 -282 4263 895 -4108 -1450 3930 2094 -3634 -2523 3365 3037
2660 3037 -2951 -3418 2457 3822 -1937 -4066 1385 4256 -796 -4401 149 4479 413 -4419 -1063
2675 -1063 4278 1670 -4073 -2267 3704 2773 -3415 -3194 2906 3651 -2452 -3922 1860 4252 -1256 -4407
$$ packed form
2568B184m947J85M957N58m876j303M792J926m545k585M223L169l743l745L204
2583e46M274k649m664K024M926j305n172O12N232J61n266q44N226J517m935k323
2599c732M621L012m226l634L761M114l153m566K557M888j831n199J177N336m35
2614B690n477k95N451J019n302j780N086K496m776l120M359L745l910m241L272
2629g83M745k579n215J970N382j171n543L92N641L78n650j152N467J994n306k641
2645d071M929L371m533l994M016M545l368n003K658N380j836n728J111N888l28
2660C037n988m67N875J365n759k129N451K871n052l605M550M330m066m832L356
2675a063N341k608n743J806N971r31o188K21O100P45o103j470N782K392n508l151
$$ plain form
2691 -4407 658 4584 -41 -4557 -617 4481 1207 -4325 -1784 4063 2391 -3782 -2908 3413 3453 -2844
2707 -2844 -3839 2386 4200 -1861 -4421 1246 4619 -613 -4728 -29 4771 675 -4644 -1330 4483
2722 4483 1898 -4229 -2526 3953 3099 -3492 -3547 2994 4000 -2457 -4299 1877 4610 -1244 -4794 571
2738 571 4983 105 -4875 -796 4829 1504 -4621 -2092 4317 2762 -3945 -3176 3467 3757 -2952 -4160
2754 -4160 2412 4540 -1793 -4810 1113 4961 -426 -5002 -208 4975 919 -4862 -1611 4639 2313
2769 2313 -4392 -2857 3930 3425 -3510 -3865 3030 4392 -2384 -4652 1764 4942 -1069 -5098 459
2784 459 5187 231 -5196 -991 5039 1674 -4783 -2312 4455 2967 -4152 -3498 3646 4056 -3154 -4398
2800 -4398 2482 4831 -1812 -5051 1104 5156 -422 -5289 -387 5172 1115 -5116 -1757 4830 2465
$$ packed form
2691d407N065L926m625m516L940N098l274n532K541N847j672o173Q74O321M0o297
2707b844r95O225J814o061k560N667L373n232m115M699M800m096n319L314N813
2722D483k585o127J703O479q54o591n5O541J006o457j842O176K733n854l550N365
2738E71M412m878m980M079N625l325o125K529O409j555o707P69O643K90o709j208
2754d160O572K128o333l017N923L848n387m576M794N183m056n781L251O250k326
2769B313o705J535O787n05o935l55O895J362o776k268O416L178o011m029N557
2784D59M728m956n427M205O030l365o457K471O767j488p119O54P144M10p210j244
2800d398O880K349o643l239O155M052n578m867M902N559m057o231L359O587k365
$$ plain form
2815 2465 -4468 -3142 4078 3684 -3593 -4183 2969 4615 -2400 -4899 1721 5153 -1003 -5324 268
2830 268 5360 486 -5248 -1247 5105 1917 -4791 -2642 4405 3215 -4025 -3755 3465 4254 -2889 -4692
2846 -4692 2255 4940 -1540 -5202 839 5315 -231 -5363 -555 5248 1256 -5134 -2021 4849 2681
2861 2681 -4426 -3280 4005 3919 -3469 -4374 2917 4794 -2264 -5079 1621 5364 -838 -5453 12 5408
2877 5408 641 -5373 -1414 5169 2174 -4886 -2793 4504 3472 -4014 -4093 3452 4459 -2775 -4851
2892 -4851 2047 5178 -1404 -5439 585 5482 163 -5465 -955 5323 1650 -5099 -2381 4750 3006
2907 3006 -4342 -3624 3789 4104 -3222 -4554 2660 4941 -1970 -5186 1244 5357 -456 -5366 -263
2922 -263 5365 1009 -5222 -1721 5023 2403 -4665 -3068 4289 3602 -3785 -4137 3150 4576 -2599 -4973
$$ packed form
2815B465o933J326P220l94p277n90P152J646p015k499O620L432o156m321N592
2830B68N092m874n734M001O352l188o708K149P047j190p240K70P220P89p143j803
2846d692O947K685o480l662O041M476n546n132M808N803l992o390L113O870k168
2861B681p107J146P285q6p388r05P291J877p058k815O700L743o202m615N465N396
2877E408m767o014L959O583k995p060K093P297j032p486p9P545J007p234k076
2892d851O898L131o582m035O024M897n319n628M510O278l673o749K718P131j744
2907C006p348P18P413L15p326j332P214K281o911l216O430M113n813m910N103
2922b63N628m356o231L501O744k620p068J597P357o87p387l52P287J426p175k374
$$ plain form
2938 -4973 1888 5147 -1166 -5371 426 5388 280 -5405 -991 5239 1753 -5067 -2482 4673 3120
2953 3120 -4259 -3633 3793 4167 -3204 -4588 2551 5055 -1885 -5242 1168 5381 -435 -5510 -345
2968 -345 5449 1094 -5197 -1867 4977 2563 -4676 -3188 4162 3776 -3714 -4301 3033 4725 -2395 -5044
2984 -5044 1740 5287 -1047 -5359 264 5397 474 -5342 -1177 5157 1930 -4861 -2567 4534 3230
2999 3230 -4111 -3737 3592 4222 -3054 -4586 2350 4944 -1722 -5189 1034 5300 -343 -5393 -409
3014 -409 5255 1116 -5127 -1802 4873 2422 -4555 -3046 4138 3642 -3668 -4133 3037 4546 -2441 -4889
3030 -4889 1781 5107 -1120 -5312 338 5293 440 -5268 -1105 4998 1867 -4818 -2445 4440 3122
3045 3122 -4003 -3643 3578 4135 -2974 -4555 2280 4830 -1690 -5090 939 5180 -186 -5187 -568
$$ packed form
2938d973O861L259o313m205N797M962n108n685M414O230l486o820K585P155j553
2953C120p379O26P426L74p371j384P139K504o940l357O410M213n816n075N165
2968c45N794m355o291L330O844k414p239J488P350l86p490n87P334J692p120k649
2984e044O784L547o334m312N623N133m923n816M165O334l227o791K294P101j304
2999C230p341L74P329O30p276j532O936K594o666l467O223M266n643n050M984
3014d09N664m139o243L325O675k451o977J509P184m96p310m65P170J509o987k448
3030d889O670L326o227m192N650M955m853n708M163O103l131o685K373O885j318
3045C122p125L60P221N57p109j581O835K550o520l400O029M241n366n001M619
$$ plain form
3060 -568 5122 1288 -4934 -1930 4601 2526 -4226 -3215 3768 3681 -3261 -4092 2728 4554 -2064 -4785
3076 -4785 1396 4963 -712 -5106 -15 5063 720 -4932 -1381 4720 2036 -4446 -2646 4147 3206
3091 3206 -3635 -3713 3074 4211 -2503 -4602 1859 4798 -1215 -4972 490 5015 175 -5023 -853
3106 -853 4892 1529 -4726 -2151 4411 2770 -4031 -3307 3583 3784 -3026 -4185 2467 4546 -1855 -4755
3122 -4755 1214 4921 -456 -4970 -172 5010 897 -4839 -1559 4601 2196 -4280 -2773 3886 3341
3137 3341 -3408 -3762 2860 4151 -2389 -4442 1684 4647 -1076 -4815 398 4844 275 -4861 -936
3152 -936 4646 1552 -4483 -2225 4092 2729 -3731 -3258 3255 3724 -2735 -4086 2159 4335 -1562 -4565
3168 -4565 967 4686 -294 -4705 -339 4671 1011 -4502 -1611 4265 2216 -4013 -2748 3596 3295
$$ packed form
3060e68N690l834o222L004O531k075o752J011O983q7o942q31O820J826o618k721
3076d785O181L567n675m394N091N078m343n652L551O101k684o482J800O793r41
3091C206o841p8O787J137o714k099O461K939o013l757N462M525m840n198M170
3106h53N745l363o255K575O562j641o801P24O890K01o810j159O652K079o401k900
3122d755N969L707n377m514M798N182m113n736L280O160k405o476J507O659n45
3137C341o749l54O622J291o540k053O126K963n723l739N213M446m569n136L925
3152i36N582l094o035K258O317j363o460M73O513M69o459j351O245K176n897l003
3168d565N532L719m980m411M366N010l660n513K891N876k049o229J265O344l01
$$ plain form
3183 3295 -3140 -3633 2579 4072 -2073 -4298 1451 4506 -880 -4606 190 4597 487 -4585 -1081
3198 -1081 4403 1676 -4195 -2266 3856 2795 -3471 -3300 3013 3714 -2534 -3959 1939 4322 -1353
3213 -1353 -4467 690 4594 -122 -4549 -537 4488 1102 -4325 -1748 4052 2291 -3756 -2830 3328
3228 3328 3249 -2856 -3656 2376 3929 -1861 -4212 1175 4345 -638 -4422 -18 4388 597 -4305 -1181
3244 -1181 4144 1748 -3941 -2282 3614 2734 -3233 -3242 2756 3628 -2271 -3884 1696 4120 -1135 -4326
3260 -4326 554 4352 50 -4339 -720 4240 1284 -4034 -1887 3729 2364 -3427 -2852 3017 3259
3275 3259 -2651 -3597 2042 3859 -1542 -4100 975 4183 -401 -4274 -155 4241 813 -4056 -1321
3290 -1321 3873 1860 -3591 -2327 3281 2783 -2924 -3212 2449 3566 -1937 -3779 1449 3958 -891
$$ packed form
3183C295o435m93O212J493o145k225N749L055n386l726M796M407m110n072L504
3198a081N484k727n871J929O122j061o266J71O313P01o248j425N898K383n675
3213a353l114N157L904m716m427M012N025l386n427K577N800j761o047R26O158
3228C328p9o105q00O032J553n790k351N387L170m983l784M404M406l791m902L124
3244a181N325k396n689J659N896q80n967rN998Q72n899j613N580K424n255l191
3260d326M880L798m302m389L619M960k956n318K147N616j365n791N75N869K42
3275C259n910r46N639J817n401k558N075L208m584l873M119M396l428m869K735
3290a321N194k013n451J264N608m98n707k88N661J117n503j842N228K509m849
$$ plain form
3305 -891 -4118 285 4090 289 -4086 -838 3961 1435 -3733 -1952 3467 2413 -3132 -2858 2710
3320 2710 3218 -2289 -3445 1781 3701 -1296 -3901 716 3947 -161 -4025 -355 3924 948 -3809
3335 -3809 -1398 3576 1914 -3310 -2422 2973 2808 -2613 -3123 2128 3468 -1641 -3675 1128 3814 -621
3351 -621 -3941 28 3950 521 -3900 -1030 3658 1517 -3475 -2028 3213 2450 -2782 -2909 2348 3177
3367 3177 -1887 -3453 1450 3695 -938 -3782 317 3821 231 -3740 -717 3667 1210 -3554 -1673
3382 -1673 3247 2194 -2931 -2596 2582 2903 -2156 -3237 1649 3429 -1177 -3659 688 3705 -195
3397 -195 -3765 -320 3660 820 -3564 -1361 3376 1718 -3100 -2194 2779 2627 -2438 -2929 2008 3191
3413 3191 -1556 -3414 1102 3511 -561 -3657 38 3613 465 -3596 -980 3485 1427 -3240 -1874
$$ packed form
3305h91l227M403L805l801m375L248M799k526n168J781N419j054n545K74N568
3320B710N08n507j156N226J920m997k605M617L231m108l864L670M279k976m757
3335c809K411M974j662n224Q88N395j65n421n10N251J340n109k034M803K686m435
3351f21l320L969L922l429m421K870M688k141m992J447N241p63n232j27N257Q29
3367C177n064j566M903K245m633k844M099L504l590l971L023M384k457m764J881
3382a673M920j053n125L35N178L21n059j081M886J780m606k482M347L017l900
3397a95l570L445L980k840m384K203M737j658m818R06M973j52n065m91M937J183
3413C191m747j858M516K409m072l096L695L575l148m061K616M465k058m667J366
$$ plain form
3428 -1874 2958 2308 -2634 -2689 2180 2970 -1837 -3243 1325 3385 -883 -3571 309 3593 151 -3531
3444 -3531 -649 3454 1123 -3276 -1583 3017 2010 -2734 -2377 2417 2729 -1999 -3000 1615 3217
3459 3217 -1145 -3346 691 3487 -174 -3438 -328 3467 816 -3291 -1267 3089 1746 -2841 -2145
3474 -2145 2595 2460 -2235 -2741 1887 2980 -1421 -3191 940 3308 -575 -3457 64 3412 409
3489 409 -3350 -830 3208 1314 -3074 -1759 2761 2076 -2542 -2437 2152 2670 -1775 -2957 1363 3154
3505 3154 -945 -3257 422 3344 92 -3316 -511 3271 909 -3093 -1395 2907 1766 -2626 -2181
3520 -2181 2307 2503 -2035 -2770 1590 2992 -1210 -3162 684 3172 -252 -3306 -157 3194 580
3535 580 -3128 -1113 3001 1493 -2740 -1912 2527 2191 -2136 -2531 1803 2755 -1405 -2987 957 3041
$$ packed form
3428a874M832o50m942n5M869P90m807j406M568K060m268k688L880L284l442l682
3444c531K882M103k331m399J693M600j007m744L57M794L12m728j001M615J602
3459C217m362k201M037K796l661l264L110L795k651m107K024M356j343m587O96
3474b145M740j35m695n06M628J093m401j770M131K368l883k882L521L348l003
3489D09l759K520M038j894m388J315M520o85m618J05M589N18m445j182M320J791
3505C154m099k312L679K922l252l408K805L782k362m002J698M302j141m392M45
3520b181M488J96m538p35M360J402m202j952L846K488l424l054L149L351k614
3535E80l708K015M114j508m233Q28M439l36m327l95M334R52m160j582L944K084
$$ plain form
3551 3041 -551 -3175 83 3181 288 -3152 -757 3032 1193 -2797 -1595 2597 1918 -2291 -2219 2006
3567 2006 2569 -1641 -2790 1262 2909 -859 -3068 406 3111 23 -3110 -520 3025 858 -2902
3582 -2902 -1311 2717 1637 -2530 -2031 2167 2316 -1847 -2604 1551 2781 -1105 -2942 704 3056 -216
3598 -216 -3102 -186 3067 642 -2894 -1058 2800 1444 -2589 -1788 2320 2104 -2021 -2380 1681 2646
3614 2646 -1312 -2798 952 2882 -481 -2958 136 2940 311 -2930 -715 2819 1113 -2655 -1427
3629 -1427 2402 1808 -2179 -2075 1907 2383 -1521 -2511 1125 2681 -765 -2799 366 2841 -38 -2881
3645 -2881 -444 2858 806 -2689 -1162 2530 1488 -2308 -1828 2055 2146 -1742 -2382 1388 2546 -1080
3661 -1080 -2685 645 2791 -277 -2829 -140 2818 564 -2691 -941 2575 1278 -2417 -1558 2153
$$ packed form
3551C041l592k624L258L098k893l440K395L789j839l990J202M192o79m209P2M225
3567B006N63m210j149M052J647l768k209L474K705l088l133K590L545k167l760
3582b902J591M028j080m167M99M198J49m163p57M155J230l886j837L646K352l272
3598b16k886K916L253k425l536J836L858j356m033Q01M108k16m125l59M061R65
3614B646l958j486L750J930l363k477L094K804k629l241K215L534j706l768J228
3629a427L829n94l987J04L982M76l904r90L636J556l446k034L165K475k879k843
3645b881K437L302k052l495J527L692j042l796M80L883R1l888o40L770J158l626
3661a080j605L330K146l068k552K689K958k254l255J750L516j297l695Q59L711
$$ plain form
3676 2153 1939 -1917 -2178 1615 2398 -1214 -2575 845 2704 -510 -2737 148 2777 258 -2718 -666
3692 -666 2550 1006 -2500 -1323 2276 1648 -2047 -1958 1724 2144 -1371 -2408 1086 2574 -758 -2699
3708 -2699 344 2684 36 -2662 -386 2607 765 -2561 -1108 2365 1432 -2134 -1702 1910 2031 -1617
3724 -1617 -2251 1299 2418 -947 -2557 607 2644 -204 -2639 -131 2645 500 -2597 -852 2403
3739 2403 1216 -2282 -1462 2022 1778 -1809 -2028 1519 2225 -1297 -2371 858 2515 -508 -2611 149
3755 149 2584 248 -2607 -571 2479 890 -2350 -1287 2171 1571 -2013 -1856 1678 2075 -1411 -2193
3771 -2193 1053 2399 -803 -2471 354 2567 -27 -2572 -322 2456 616 -2445 -980 2275 1311
3786 1311 -2055 -1643 1866 1894 -1582 -2072 1281 2239 -1070 -2386 660 2441 -298 -2499 -46 2548
$$ packed form
3676B153k14l856k61L793P83l612j361L420J859l214k227K885K629k519k976K052
3692f66L216j544l506J177L599o28l695Q9L682M20l515j037L494J488l332j941
3708b699L043K340k648k698K276K993j842l326J453L473r33l566M32L612J21l648
3724a617o34L550J119l365j610L164K037k848k435K508K776k145l097J745L255
3739B403j187l498Q20L484k44l587k19L547P06l522j074L229J657l023k103K760
3755A49K435k336k855K036L050j589l240J063L458o00l584J57L534L97l486p82
3771b193L246J346l202j668K825K213k594k545K250K778j840l061J465L255r64
3786A311l366M12L509K8l476m90L353R58l309j316L046J781k739k201K453K594
$$ plain form
3802 2548 368 -2468 -744 2317 947 -2248 -1318 2032 1599 -1773 -1812 1545 2014 -1238 -2243 982
3818 982 2351 -650 -2422 267 2488 27 -2464 -420 2417 708 -2342 -1001 2216 1351 -1986
3833 -1986 -1696 1742 1829 -1456 -2007 1173 2191 -875 -2341 545 2427 -216 -2452 -143 2388 465
3849 465 -2347 -765 2234 1142 -2067 -1376 1900 1657 -1632 -1859 1413 2072 -1048 -2280 769 2298
3865 2298 -397 -2366 84 2402 270 -2377 -645 2244 894 -2151 -1208 1939 1407 -1760 -1710 1498
3881 1498 1944 -1243 -2083 926 2251 -623 -2288 330 2385 39 -2402 -334 2345 674 -2200
3896 -2200 -929 2094 1264 -1873 -1507 1676 1802 -1454 -1978 1198 2080 -866 -2234 564 2316 -214
3912 -214 -2429 -111 2314 419 -2237 -760 2148 1003 -2084 -1377 1840 1572 -1656 -1814 1348 2030
$$ packed form
3802B548k180k836J724L061j370l195R30L350m33l372l9L357M69l252j005L225
3818I82J369l001j772K689K221k461k491K044K837j709l050J341L217q65l337
3833a986K90L438Q7l285n51L180J018l066j466K886J882k643k236K309K531j923
3849D65k812J582K999j092l209O91L276k43l289k27L272O59l120j232L049J529
3865B298k695j969K450K318k132k647J732K889j350l045R43L147n32l167N0L208
3881A498M46l187q40L009J325k874j665K618K055k346k441K068K679j671k874
3896b200J271L023q30l137L66L183J26l256n24L176Q82k946j368K798J752k530
3912b14k215K318K425j895k656J477K908j145l087P07L217k68l228j58L162O82
$$ plain form
3928 2030 -1105 -2132 803 2246 -489 -2372 160 2328 141 -2290 -491 2245 786 -2058 -1101
3943 -1101 1935 1354 -1734 -1610 1506 1792 -1330 -1969 1004 2120 -747 -2253 424 2275 -137 -2282
3959 -2282 -248 2208 469 -2170 -915 2009 1110 -1863 -1333 1687 1607 -1474 -1810 1231 1954 -987
3975 -987 -2104 637 2202 -338 -2289 -14 2222 302 -2203 -608 2153 880 -1984 -1169 1863
3990 1863 1400 -1664 -1672 1446 1845 -1102 -2016 780 2091 -525 -2161 273 2238 57 -2219 -375
4006 -375 2135 653 -2090 -909 1953 1205 -1756 -1468 1528 1614 -1363 -1849 1087 1995 -839 -2070 572
4023 572 2154 -247 -2156 -69 2169 345 -2103 -604 2011 884 -1892 -1238 1721 1435 -1562 -1638
4039 -1638 1309 1817 -1076 -1952 772 2080 -538 -2095 209 2123 44 -2118 -328 2124 593
$$ packed form
3928B030l135j027K935J443k735j883K532K168k187k431J799K736j459k844R57
3943a101L036n81l088J24L116K86l122o39K973J116k867j506K677J851k412k145
3959b282K034K456j739k639J255K924q99k973N30L020q0l081l36L041P23k941
3975i87j117K741J565k540j951K275K236j920k505J595K761j273k864Q15L032
3990A863m63l064qL118L99k947r14K796J311k616j636K434J965k181k276J844
4006c75K510j482k743J181K862p48k961K88K996Q6k977m86K936R08k834j231K642
4023E72J582k401j909K087K238j824k448J499K615j127k776O54K959k86k997p6
4039a638K947N08k893q76K724J308k618j557K304J914k079k162J790K452j531
$$ plain form
4054 593 -1994 -936 1873 1185 -1740 -1423 1539 1633 -1303 -1798 1095 1934 -802 -2061 534 2138 -219
4071 -219 -2142 -48 2149 376 -2136 -654 2018 901 -1891 -1248 1702 1428 -1476 -1689 1256 1829
4087 1829 -1040 -1952 748 2017 -451 -2103 196 2109 148 -2115 -424 2028 700 -1895 -962
4102 -962 1773 1214 -1607 -1432 1421 1663 -1179 -1770 976 1916 -702 -1999 425 2092 -109 -2054
4118 -2054 -155 2047 430 -2004 -703 1881 999 -1800 -1188 1622 1383 -1419 -1659 1159 1747 -941
4134 -941 -1851 659 1999 -383 -2021 128 2107 171 -2050 -470 2022 674 -1853 -839 1783
4149 1783 1155 -1553 -1419 1437 1559 -1132 -1772 938 1852 -680 -1983 381 1995 -142 -2061 -168
4165 -168 1965 457 -1969 -755 1800 969 -1736 -1203 1560 1381 -1319 -1572 1135 1740 -865 -1858 580
$$ packed form
4054E93k587J058K809o88k925L17K962R4k936m95K893Q39k736j259K595J604k357
4071b19j923K094K197j773k512J482K672j117k792O43K950k74k904k13K945N73
4087A829k869r12K700J269k468j652K299J913j961k263J691K452j328k595R33
4102i62K735n59k821J75K853K42k842n91K746R40k618j297K424J667k201j945
4118b054J899K202j617k434J301K584q82k799O12K810k39k802k40K818N88k688
4134i41r10K510J340k382j638K149J979j936k221J580K492j348k527J014K622
4149A783o28k708J34K856J22k691o40K710R14k532j303K364J614k137j919J893
4165a68K133j508k426J214K555q31k705N33K763j79k700k53K707O05k605r93K438
$$ plain form
4182 580 1921 -357 -1965 90 1997 242 -2009 -512 1887 742 -1805 -1012 1665 1209 -1498 -1450
4198 -1450 1292 1638 -1037 -1729 828 1847 -553 -1914 318 1963 -49 -2007 -221 1972 493
4213 493 -1920 -718 1718 977 -1615 -1215 1413 1378 -1292 -1630 1065 1718 -766 -1857 539 1899 -272
4230 -272 -1909 8 1909 228 -1860 -459 1825 777 -1733 -1028 1568 1194 -1379 -1414 1237 1578
4246 1578 -1016 -1692 779 1778 -578 -1815 244 1851 46 -1900 -265 1799 540 -1795 -772
4261 -772 1678 969 -1551 -1215 1382 1414 -1228 -1574 1039 1658 -737 -1746 484 1874 -229 -1844 -28
4278 -28 1879 275 -1815 -502 1791 714 -1599 -974 1496 1197 -1333 -1421 1123 1527 -993 -1617 700
4295 700 1747 -441 -1838 186 1854 28 -1804 -331 1739 587 -1720 -783 1560 985 -1395 -1201
$$ packed form
4182E80J341k278j608K055J907j755k251J497K399j145k547P93K677m56k707M8
4198a450K742L46k675o92K557J019k400j361K232J645k012j958J786K193j479
4213D93k413J202K436p41k592M00K628l5k670l38K695O53k484j091K396J360k171
4230b72j637J917J901j681k088J401K284j048k510P05K596l74k573l5K651L41
4246A578k594o76K471R99k356j237K059J607j805j946J635K064j259k335J023
4261g72K450p09k520L36K597L2k642l46K613O19k395j009K230J390k103j615J816
4278b8J907j604k090J313K293j077k313O25K470k99k530q8K544M04k520o24K317
4295G00J047k188j397K024J668j826j832J473K070j152k307R37K343n75k380J94
$$ plain form
4311 -1201 1264 1349 -1092 -1518 865 1607 -687 -1787 428 1744 -174 -1780 -123 1777 337 -1704
4327 -1704 -573 1616 776 -1530 -1003 1368 1187 -1253 -1378 1051 1502 -877 -1574 620 1695 -437
4343 -437 -1714 146 1746 143 -1741 -340 1725 565 -1589 -799 1555 1038 -1375 -1156 1258 1340
4359 1340 -1060 -1522 826 1632 -595 -1680 410 1742 -157 -1709 -69 1736 343 -1646 -592
4374 -592 1578 743 -1495 -1060 1350 1200 -1223 -1325 959 1456 -829 -1557 551 1631 -341 -1706 155
4391 155 1773 113 -1724 -303 1698 662 -1584 -822 1438 1019 -1355 -1221 1176 1395 -948 -1436
4407 -1436 813 1561 -567 -1653 369 1772 -67 -1786 -132 1697 372 -1622 -609 1526 816
4422 816 -1481 -1039 1300 1145 -1172 -1411 971 1508 -759 -1600 522 1605 -313 -1693 84 1653
$$ packed form
4311a201K465Q5k441m26K383P42k294j100K215J316j918j606J657J900j440k041
4327a704J131K189q40k306N27K371j81k440j25K429M51k379o97K194J075k132
4343d37j277J860J600j603j884J401K065j160k154P90K354n17k413K19K414Q2
4359A340k400m62K348Q06k227j085K090J332j899j552J640J805j393j989J054
4374e92K170q35k238M35K410j50k423j02K284M97k285p28K108J080j972j365J861
4391A55J618j660j837J421K001j036k246P62K260m19k374J34K397K19k343m88
4407a436K249P48k128j086K022J403j839j719J654J829j325j994J013K135p10
4422H16k297M42K339j55k317k39K382N37k267q41K122J083j918j380J777J569
$$ plain form
4438 1653 94 -1685 -401 1555 586 -1471 -817 1467 1051 -1260 -1199 1117 1305 -901 -1432 711 1472
4455 1472 -558 -1598 267 1594 -111 -1662 -118 1525 341 -1567 -538 1444 742 -1403 -986
4470 -986 1236 1063 -1122 -1246 902 1356 -729 -1476 530 1561 -383 -1528 101 1615 122 -1519
4486 -1519 -295 1511 495 -1443 -674 1335 842 -1180 -1041 1068 1149 -956 -1296 773 1372 -531 -1428
4503 -1428 335 1442 -102 -1518 -115 1449 273 -1464 -464 1343 642 -1284 -813 1193 1007 -1084
4519 -1084 -1110 903 1277 -694 -1344 509 1411 -273 -1486 131 1484 48 -1437 -239 1427 487
4535 487 -1308 -653 1242 858 -1132 -1002 1020 1082 -828 -1288 633 1331 -460 -1436 309 1397 -147
4552 -147 -1495 -116 1434 275 -1454 -444 1286 630 -1276 -824 1058 984 -981 -1129 818 1187 -663
$$ packed form
4438A653j559j779J284J956r69k057O54K284m16k311O1K316J88k206n31K143P61
4455A472k030j040J865J327j705j551J544J643j184j908J029J982p02k145M17
4470i86K222j73k185j24K148M54k085p47K006J031j944j145J629J514j493j641
4486a519J224J806j016j938P69K009m93k022J39K109Q1k105l40K069N99j903q97
4503a428J763J107j544j416J403J564j176j737J000J807p01j926M71K006j86k091
4519a084k6K013L74j971o50J853R02j684j213J617J353j436j485J198J666r40
4535D87j795O55J895l84j990J30K022O2j910m60J921O98j791r76J745J088j544
4552a47j348J379J550j159j729J010J730o56j906M52J882p4j965j48J947L69j850
$$ plain form
4569 -663 -1281 470 1350 -314 -1335 99 1446 82 -1404 -264 1355 453 -1312 -567 1176 791
4585 791 -1059 -937 973 1057 -855 -1198 656 1233 -500 -1321 278 1351 -152 -1404 -73 1362 184
4602 184 -1360 -372 1285 582 -1220 -803 1070 883 -917 -1036 839 1138 -704 -1219 504 1294 -348
4619 -348 -1323 121 1377 107 -1387 -244 1313 427 -1271 -592 1129 764 -1047 -931 914 1012 -816
4636 -816 -1112 627 1180 -495 -1261 255 1295 -95 -1304 -73 1322 232 -1267 -389 1253 541
4652 541 -1124 -701 987 875 -936 -1013 771 1106 -645 -1076 466 1256 -279 -1272 118 1283 29
4669 29 -1278 -231 1196 393 -1209 -548 1065 681 -992 -878 865 930 -751 -1060 571 1114 -436
4686 -436 -1184 264 1247 -122 -1257 -107 1265 171 -1205 -404 1127 522 -1156 -652 968 845 -835
$$ packed form
4569f63o18J751Q80j664j021J434J347j364j486J140J619r02j765P45J743l85
4585G91j850J22J910Q4j912l43J854N77j733q21J599J073j503j252J331J435j178
4602A84j544R88J657p03j802M17J873j87j800j19J875K99j842n15J723P90j642
4619c48r75J444J256j270j494J143J557q86j698O79J721l65j811J16J845R8j828
4636h16k96J739N53j675p66J516J040j390j209J231J395j090j499Q78J642p12
4652E41j665M23J688j12j811p7J784L35j751m31J542P90j535r93J390J165j254
4669B9j307J047J427q03j602O61J613l84j673J14J743O5j681l09J631N43j550
4686d36p48J448R83j369j135J150J372j094j376Q01J531o05j678N04J620j23j680
$$ plain form
4703 -835 -932 738 1049 -579 -1138 463 1182 -214 -1161 95 1156 59 -1205 -223 1106 380 -1080
4720 -1080 -505 1028 636 -951 -824 858 868 -667 -991 541 1081 -449 -1109 283 1142 -138 -1177
4737 -1177 -50 1157 216 -1094 -369 1036 509 -962 -623 913 780 -776 -890 716 973 -510 -1032
4754 -1032 426 1077 -280 -1096 97 1097 57 -1101 -247 1082 352 -1054 -503 951 696 -890
4770 -890 -752 779 844 -657 -967 489 951 -401 -1028 225 1086 -63 -1118 -36 1047 200 -1017
4787 -1017 -359 945 507 -940 -604 883 725 -701 -843 611 877 -457 -1016 338 1010 -243 -1084
4804 -1084 28 1068 64 -1041 -228 993 330 -981 -488 852 569 -771 -688 689 763 -555 -870
4821 -870 455 935 -313 -1017 138 966 -39 -945 -109 971 259 -928 -445 916 526 -839 -608
$$ packed form
4703h35r7J670L11j628n59J601P19j396r47J256J061j097j264R82J329p26j460
4720a080N75J533l92j587J27J682J0j535l24J532N40j530o60J392Q59j280j039
4737a177J127J207r41j310P25J405n27j471L39J536j33j556j14J606K57j483n22
4754a032J458O51j357q16J193J000j040j158Q54J329p30j406N51J454k55j586
4770h90J38J531O5j501l10J456M62j352o27J253Q61j149j055J082J083q47j217
4787a017O58J304m38j447L36J487j58j426j42J454K66j334n59J354O72j253q41
4804a084J112J040j004j105Q13J221o63j311M93J340k83j340Q3J377P4j318l15
4821h70J325M80j248p04J155Q28j005r06Q36J080p12j187M83J361l90j365K31
$$ plain form
4838 -608 750 669 -624 -791 516 857 -402 -952 289 965 -162 -1006 -9 961 102 -959 -244 872
4856 872 361 -884 -537 784 586 -737 -689 591 818 -506 -805 362 896 -209 -910 207 962 49
4874 49 -931 -120 893 241 -883 -309 819 442 -726 -584 680 701 -662 -760 499 790 -406 -867
4892 -867 271 887 -102 -915 8 926 88 -908 -245 815 337 -784 -483 690 565 -651 -631 537
4910 537 739 -470 -743 350 823 -249 -908 112 882 57 -850 -31 829 228 -777 -352 732 470
4928 470 -730 -587 648 591 -569 -706 423 772 -312 -773 248 855 -142 -873 17 824 126 -810
4946 -810 -257 760 342 -711 -447 673 495 -555 -633 498 744 -427 -772 302 773 -211 -788 60
4964 60 813 103 -786 -206 752 276 -795 -370 696 403 -647 -580 504 549 -485 -686 360 700 -251
$$ packed form
4838f08J358q1j293j67J307L41j259n50J241O76j127q44R97R70q59j061P15J116
4856H72n11j245L47J321j98j323M8J280K27j324k99J167N34j105p01J117P55r13
4874D9r80Q11J013o52j124N74J128l77j168J42J264K1j363r8J259K91j196m61
4892h67J138O16r89q13R23R18q38r96O63J060m78j121L01J173j25j216K0J168
4910E37K02j209k73J093M73j072o59J020P70q25r07Q19Q60o01j005M25J084k62
4928D70j200J43J235n7j160j37J129L49j084m61J021O07r97p31Q90Q07o98r36
4946h10N53J017m18j053K64J120j78j050p8J131K46j171l45J074M71r84n77Q48
4964F0P53p10q89N80R58m76j071M25J066k93j050O7J084M5j034k01J046L40r51
$$ plain form
4983 -251 -773 194 784 -48 -787 -41 740 131 -756 -219 685 313 -616 -370 606 475 -534 -538 483 556
5003 556 -380 -684 336 762 -159 -755 88 713 6 -721 -109 726 216 -634 -309 611 389 -592 -506 515
5023 515 528 -487 -604 347 666 -329 -735 162 716 -68 -720 -11 709 151 -678 -186 664 355 -669 -400
5043 -400 534 430 -488 -566 404 611 -324 -654 257 657 -147 -723 75 695 32 -677 -146 646 225 -597
5063 -597 -398 575 344 -512 -465 444 532 -416 -571 343 592 -230 -670 120 632 -61 -673 -12 674 114 -651
5084 -651 -180 684 310 -602 -409 520 429 -445 -451 376 534 -318 -592 201 662 -170 -644 51 587 43 -716
5105 -716 -132 586 217 -597 -272 520 348 -566 -421 473 473 -356 -548 277 643 -263 -580 144 632 -112 -637
5126 -637 53 638 126 -621 -193 588 292 -532 -361 546 404 -427 -448 386 518 -340 -535 233 582 -148
$$ packed form
4983b51n22R67N90q32p39P46P81o09q87N37R04l72r29K46R76j31j009mJ021P3
5003E56r36l04J020M26r21n96Q43O25p07p27O12Q35n10q50L25R20k22r81Q6J021
5023E15J3j015j17R51L19r95m06Q97N54p84o52P09P20n58q29M92Q50l09j024K69
5043d00R34j04r18p8R70K07r35l30R11M00q04n76P98O20o63p09N31P92m21q22
5063e97J99R73k31q56M7R09Q8r48j55R14K49q22m40P90N12o93o12O61O86n60p65
5084f51M71Q64l74r12J93R29r1q74oQ27J58q52k74P93M61q32m74O95N36n44p59
5105g16N84P18l69q14L25P92j72r14J45Q94%q29j92Q25L66r06l17P24M88p44n25
5126f37O90N85n12p47M28P81k96q24J71R07j42q31k1Q34J32q58j95P68L49p30
$$ plain form
5146 -148 -616 36 573 23 -614 -111 558 187 -574 -272 563 297 -506 -433 430 483 -370 -459 306 603 -198
5167 -198 -604 171 593 -64 -649 -9 543 86 -543 -159 548 299 -536 -279 482 360 -416 -419 362 462 -307
5188 -307 -493 242 557 -187 -582 46 502 0 -610 -79 609 208 -521 -217 466 286 -448 -375 393 387 -344
5209 -344 -473 303 480 -245 -500 175 543 -108 -534 -57 582 67 -570 -180 552 192 -489 -274 424 340
5229 340 -421 -366 385 460 -357 -485 232 465 -186 -544 95 587 28 -520 -26 564 139 -555 -229 499 230
5250 230 -498 -321 438 354 -356 -385 323 441 -183 -500 232 553 -146 -551 51 546 36 -540 -109 492 166
5271 166 -520 -314 442 245 -419 -363 352 372 -332 -464 267 489 -185 -481 105 555 -41 -518 -24 539 74
5292 74 -523 -170 537 213 -420 -310 410 344 -376 -349 258 429 -263 -523 232 488 -128 -509 58 495 -12
$$ packed form
5146a48m68O52N37n50o37N03O69l71p61L02Q35k66q03P3Q63N3q53q9P65K97q01
5167a98m06P75M22o57n85O40N52m57o29L84P07k49q35K57P61j22p76lP81J00p69
5188c07j86P35L15p44l95O28M56n02o10N31O88m01p29L04O83j80p34P3P68op31
5209c44j29P76J77p25k55O75L68o51m26M77O39n15o37L90P32l60o81K15O98q4
5229C40p61N5P51P5q17j28P17K33o51l58O39M92n59n48M94N90m25o94L26P28k69
5250B30p28J77P59q4p10k9P08J18o24l17P32L21o99m05O02M95n10n76M31O01l26
5271A66o86K06P56j97o64N6P15K0p04j32P31K22o74k96N86M50n96m77M94N63m65
5292G4n97L53P07l24o33J10P20o6p20K7O07J71o92k60P55K56o16l81N67M37n07
$$ plain form
5313 -12 -490 -64 481 176 -452 -246 473 272 -465 -359 381 355 -331 -362 255 486 -190 -458 154 464 -89
5334 -89 -484 22 518 43 -468 -95 423 199 -474 -232 437 325 -381 -330 369 422 -265 -454 224 451 -134
5355 -134 -531 78 512 -61 -490 4 480 106 -473 -138 420 222 -367 -304 354 268 -294 -358 313 448 -173
5376 -173 -402 160 467 -105 -488 25 457 2 -457 -70 460 183 -401 -173 441 278 -380 -291 332 383 -297
5397 -297 -376 262 402 -195 -461 104 500 -47 -509 -77 427 115 -477 -122 441 175 -378 -276 372 277 -349
5418 -349 -349 309 382 -184 -381 182 433 -115 -437 1 483 30 -450 -34 474 116 -423 -200 344 228 -339
5439 -339 -237 300 351 -298 -412 227 371 -203 -411 106 426 -66 -448 -7 443 10 -465 -131 371 123
5459 123 -429 -214 394 297 -358 -299 305 349 -219 -352 185 404 -152 -422 108 408 -49 -442 15 424 55
$$ packed form
5313a2m78M26N45l05o28K06P19k01p37J06P40k6o86l1O17K31o76k68O12L10n53
5334h9l95N06M96m75n11L73N18k24o73K42O69j12p06N1O99N3o87j89O78K27n85
5355a34l97O09M34n73m29M94M76l74n79L35N58j98n89O3O58q6n62o4O71J35o21
5376a73k29N62L07n72l83N13M32m55m59L87N30k77n84K28O14j63o58Q9O23N1o80
5397b97p9O38J40n97k66N65L96n47m62M32N04l12n92L55N63k66n53J02O48r5o26
5418c49%O58P3n66j97N63K51n48l22M38M82m53m80M16N08l58n39K23N44j16n67
5439c39J02N37N1o49j14O39J44n74k08N17L20m92l82M41M50m33m75L34N02k48
5459A23n52K15O08r7o55N9O04M4n68j33N37K19n56k70N30L00m57l93M57M09l69
$$ plain form
5480 55 -415 -96 451 146 -363 -265 316 297 -338 -332 242 322 -251 -411 160 406 -149 -485 34 439 0 -402
5502 -402 -58 444 125 -384 -166 401 238 -314 -248 336 328 -279 -334 232 371 -222 -345 119 394 -49 -398
5523 -398 -13 428 82 -408 -149 373 165 -378 -237 296 253 -313 -360 265 291 -231 -393 181 419 -120 -413
5544 -413 91 375 6 -386 -19 411 97 -380 -176 349 201 -402 -242 296 288 -312 -357 243 363 -196 -445
5565 -445 159 455 -96 -451 -15 382 32 -415 -130 344 129 -455 -174 364 233 -333 -257 276 345 -232 -385
5586 -385 188 414 -123 -448 56 394 -5 -406 -7 384 68 -413 -149 397 171 -366 -276 302 292 -271 -350
5607 -350 235 357 -214 -419 162 429 -105 -382 26 409 -55 -442 -129 418 151 -441 -171 342 203 -343
5627 -343 -247 346 343 -324 -333 258 401 -177 -427 127 447 19 -375 -44 442 94 -425 -110 359 141 -420 -251
$$ packed form
5480E5m70L19N47l05n09R8N81j9o35ON74Q0n73j60N71K46n55l36N19M05m39m02
5502d02L44N02l19n09K18N67j63n52O6N84qo07n5N66J39n93j23M64K75m43l49
5523c98L85M41l46m90K59N22k08n43J41N33m3n66m7O25K6n22j62N74K38n39k93
5544d13N04K84l69l92L67M30l14m77K04N25j48o03J60N38qo00m5O00J20n59k49
5565d45O04K96n51l55M36L97l50m47K85M74k15n84K81N38j31n66P6N33O9n77j53
5586c85N73K26n37l25N04L38l99m01L99L91l16m81K64N46k26n37R0N78j0n63p9
5607c50N85J22n71k05N81K67n34k77M08L83m64l87L13N47k67n92K70N13j39n46
5627c43R6N93lo67rN91J43n78k50N54L20m28l94L31M86l48n19L15M69k18n61J69
$$ plain form
5649 -251 355 236 -363 -322 267 332 -183 -404 138 409 -112 -465 34 439 46 -459 -43 449 95 -437 -156
5670 -156 395 216 -376 -243 297 311 -246 -336 267 403 -187 -422 154 448 -33 -472 56 427 19 -449 -93
5691 -93 463 131 -424 -213 355 264 -331 -332 297 314 -255 -401 140 423 -214 -451 44 455 -43 -527 -39 413
5713 413 26 -457 -163 404 261 -426 -263 361 312 -328 -379 283 403 -209 -445 166 378 -93 -470 10 436
5734 436 56 -489 -104 483 222 -480 -235 383 298 -353 -389 293 366 -295 -457 231 451 -182 -480 90 459
5755 459 53 -483 -33 493 99 -468 -176 463 252 -447 -307 424 362 -276 -423 300 450 -217 -442 218
5775 218 508 -91 -490 9 472 8 -495 -171 486 201 -517 -223 416 252 -391 -376 377 432 -284 -498 234
5796 234 443 -178 -490 79 502 -49 -554 24 542 110 -480 -180 493 181 -461 -295 396 355 -386 -380 340
$$ packed form
5649b51O06j19n99M1N89O5n15k21N42K71n21l53M99M05l93n05M16M92l54n32K81
5670a56N51j79n92J33N40J4n57r0O03J36n90k35N76K94m81m39N28L71m08m68L56
5691i3N56l32n55K11N68r1n95jO29J7n69j46N41K83o37k37M95M11m98m84M88M52
5713D13l87m83K94N67j43o87J63O24m9o40n1O62J20o12k36O11K12m71l77M80M26
5734D36l80n45L85N87k61p02K45O18q5o51l6O82P3o61j62O88K20o33k98N70L69
5755D59m06n36M50N26l94n67K92O39k11o99J40P31o2o38j47P23J50o67k25O60
5775B18K90n99l99M99M63m64n03L24O57k85p18K94O39j64o43J5P53N5p16k14P32
5796B34K09o21l12N69M23n51n05N78N18m32n90L00O73l12o42J66O91m1p41OP20
$$ plain form
5817 340 469 -218 -474 157 510 -173 -568 57 551 29 -533 -83 551 167 -542 -268 474 304 -467 -436
5837 -436 375 411 -318 -525 267 465 -153 -546 139 543 -35 -560 -52 548 112 -526 -137 508 267 -478
5857 -478 -361 412 398 -366 -434 282 480 -257 -508 158 491 -126 -574 72 565 87 -582 -166 447 233 -535
5878 -535 -281 446 296 -470 -399 412 432 -313 -506 238 521 -181 -587 101 591 1 -599 -21 575 165 -505
5899 -505 -204 539 314 -501 -322 447 431 -407 -445 310 458 -252 -582 153 514 -150 -618 34 587 19 -606
5920 -606 -145 554 194 -534 -281 521 338 -479 -434 431 486 -316 -536 268 557 -194 -580 116 603 -1 -602
5941 -602 -53 635 84 -586 -197 601 296 -540 -339 493 386 -471 -504 354 507 -286 -559 220 502 -120
5961 -120 -604 46 600 -28 -652 -138 625 160 -596 -257 506 317 -482 -429 433 461 -336 -525 306 563 -162
$$ packed form
5817C40J29o87k56O31L53o83l95O25M94n22n62M50O34l84p09K74P42j70p71L1
5837d36Q11L6p29k07P92J98o18l93O85M04n78n25N08O00m36o38L89O45k41p45
5857d78J17P73j4p64o8P16J98p37k51O66L33o17m48O46M93m78o69M16O13k14p68
5878e35K54P27j50p66P1Q11K0p45j93P44K83p02m06O88M90n90o00N78N96m10o70
5899e05L01P43k25q15J79P69j6q38l8P55J48p10l30P35L61o64m68O52N53n68o25
5920f06M61O99l60p28K53Q02j83q17M5Q65N5q02k20Q04K89p51l86O96M87o04o01
5941f02N49O88n51o70L89P98l05q36K01Q32j07q57l3Q58J53p93k73P79K82o22
5961a20m84O50N54o28o24N14P63m65p56L39P63j89p99N3Q62K8p97j89Q31K57p25
$$ plain form
5982 -162 -540 128 603 -35 -543 16 630 114 -558 -141 630 244 -509 -325 442 391 -446 -431 329 465 -369
6003 -369 -560 183 592 -140 -658 69 641 7 -611 -137 600 180 -548 -235 554 329 -505 -439 482 471 -348
6024 -348 -518 322 589 -243 -583 209 616 -68 -651 -17 590 119 -615 -217 602 271 -609 -392 494 315
6044 315 -471 -488 371 525 -338 -545 271 637 -119 -638 105 664 51 -579 -116 543 185 -553 -289 508
6064 508 343 -501 -423 419 484 -411 -500 350 532 -257 -605 138 598 -102 -661 0 636 117 -633 -218 518
6085 518 214 -534 -370 466 407 -457 -510 420 576 -312 -597 237 614 -157 -650 69 652 11 -641 -90 601
6106 601 227 -580 -312 575 342 -503 -373 429 494 -391 -506 302 584 -235 -587 181 642 -64 -607 -48
6126 -48 632 105 -617 -189 574 242 -553 -389 452 414 -465 -496 408 490 -345 -626 191 600 -154 -636 68
$$ packed form
5982a62l78O68M75o38n08N59O14n16o72M17P71l86p53J84P67n1q37J5P60J36q34
6003c69j91P43M09p32n18P27N72o34o18M74P37m20p28L13P89k25q34O6R21j1q19
6024c48j70Q40K67q32l40P92M07o84n83O34O07m71p34L98Q19l31q80K17Q86j79
6044C15p86j7Q59J54q63k07Q16L66p56n19P43N59o13o30M63O59l58p38K64P97
6064E08j65q44P8Q42O5q95q9Q50J82p89l48P43M60p00n59O61O36n19p50M15P36
6085E18l04p48J64Q36n9q64n3R30J56q88k85Q34L77p71m93P19N83o41o52N51O91
6106F01l74q07K68Q87k33q45J30Q02O5q85j15Q08K82q19l52P68M61p06n43N59
6126d8O80n27p22M28P63l32p95J64Q41l8q79l1R04Q2q35k81Q17M09p54m82P04
$$ plain form
6147 68 618 10 -604 -94 594 161 -543 -252 579 377 -525 -438 425 487 -336 -513 264 552 -166 -541 138
6168 138 590 -74 -717 -40 565 160 -629 -165 610 272 -562 -362 471 406 -384 -424 362 499 -258 -578 252
6189 252 584 -146 -608 35 552 92 -677 -166 613 190 -529 -269 515 369 -500 -438 464 482 -354 -582 279
6210 279 560 -235 -574 160 585 -33 -600 -39 613 106 -602 -173 549 240 -551 -372 490 367 -417 -438
6230 -438 382 508 -298 -512 224 558 -215 -541 86 584 -19 -556 -78 613 122 -531 -246 470 285 -467
6250 -467 -390 388 419 -367 -489 275 489 -244 -511 164 631 -93 -587 -55 571 83 -543 -167 574 268 -542
6271 -542 -317 471 333 -396 -368 352 432 -319 -506 282 499 -157 -514 111 566 23 -537 -102 530 185 -566
6292 -566 -207 497 268 -425 -349 437 422 -342 -432 250 442 -222 -523 140 531 -39 -541 -27 551 103 -582
$$ packed form
6147F8N50o08o14N10O88m33p04K91Q31k02r02Q7Q63O2q23j77P77K88p18l75O79
6168A38M52o64o43O77O05m05p89M64P75l38q34K00Q33o5p90m0P86J37p57l20Q30
6189B52L32p30m62O43N17m60p69N11P79m23p19K60P84j46q69O2R02J8q36k28Q61
6210B79K81p95l39P34M25o18n67N61O52n07p08M29P22l09p91J79Q62j23p84k1
6230d38Q20J26q06k14P36L34p73l26O27M98o03n37M78O91m91o53K85P16j85p52
6250d67P7P78L1p86j22P64K14p33k67O75M67p24m94N32O26m88o26L76P41l06q10
6271e42K25P88j38p29K8P20Q0p51j87P88K17o56l57O25M55n43n60M35O32l45p51
6292e66L59P04k29o93P6P86j5p64r0O82J92o64l01O63L91n70n02N14N78m48o85
$$ plain form
6313 -582 -183 543 260 -461 -300 403 360 -392 -332 335 437 -275 -428 203 492 -122 -519 117 509 -11 -529
6334 -529 -97 505 136 -534 -225 503 227 -456 -389 365 440 -336 -461 274 456 -206 -501 162 488 -47 -471
6355 -471 -53 511 96 -470 -169 502 204 -434 -269 396 281 -335 -353 329 411 -241 -432 177 527 -113 -496
6376 -496 74 435 8 -513 -45 468 125 -456 -203 456 239 -383 -307 332 316 -287 -396 238 425 -151 -474
6397 -474 105 506 -33 -448 40 509 80 -446 -157 428 187 -430 -277 385 252 -338 -386 294 379 -241 -385
6418 -385 209 407 -113 -456 115 396 -25 -431 -124 433 72 -455 -225 395 199 -353 -281 324 309 -270 -319
6439 -319 307 412 -207 -462 97 423 -61 -464 21 448 20 -481 -108 459 157 -356 -220 311 251 -337
6459 -337 -347 278 353 -262 -425 168 375 -129 -400 16 429 -27 -446 -40 445 47 -390 -171 411 238 -357
$$ packed form
6313e82L99P26k83p21J61P03m3p52O0O67J02p12j53O31K89o14l97O36L92n20n18
6334e29M32O02l69o70L09P28k76o83O7P54P5p76j25P35J82o62k95O63L26n35m24
6355d71M18N64m15n66L01O71k98o38J65O65j15o16j8O82Q2o52j91O09L50o40l83
6376d96N70L61m27n21M68N13l43n81K53O59k17o22P6O39j6o03j09O34J87n76l23
6397d74N79M01n39m15M88M69m29n26K89N85k41o17J53O62j33n90m8O80Q5o20j44
6418c85N94J98n20l43N71K81m21m06L07N57l61n27K30O20j96n52P2O05j5n79m9
6439c19O26J05o19k55N59L26m84m03M85M27m28n01L73N67l02n13J36N31o0n88
6459c37j0O25P5o15j63N93K07n04k71M16M13m56m19M06M85l98m37K19N82j73n95
$$ plain form
6480 -357 -261 297 308 -264 -243 209 353 -175 -338 170 410 -55 -412 -23 444 9 -379 -67 419 118 -325
6501 -325 -141 304 239 -313 -272 283 286 -228 -286 208 381 -183 -439 83 367 -68 -422 -64 356 59 -372 -116
6523 -116 350 160 -378 -212 292 272 -250 -286 204 307 -149 -333 166 340 -64 -393 92 401 12 -318 -81
6544 -81 317 120 -394 -163 309 194 -304 -294 223 255 -186 -246 163 325 -108 -359 107 357 -41 -380 -5
6565 -5 350 16 -304 -73 375 180 -254 -197 291 230 -229 -259 208 259 -124 -325 164 333 -79 -321 18 321
6587 321 12 -337 4 327 101 -321 -145 296 194 -255 -232 219 187 -224 -303 130 287 -108 -357 63 314
6608 314 -85 -338 -2 307 4 -337 -107 262 143 -225 -192 259 153 -263 -216 201 268 -189 -254 135 288
6629 288 -90 -323 76 256 -29 -337 -43 276 45 -319 -134 275 92 -242 -174 277 177 -162 -201 199 238
$$ packed form
6480c57R6N58J1n72K1M52J44n28j63N08K40m65l57L89M67m35l88L12M86l01m43
6501c25J84M45o5n52M1N55Ln14n8M94J73n64k56N22K84m35l54L58M20k97m31K56
6523a16M66j90n38J66N04k0n22l6M90J03m56j84M99J74m04l29M85L09l89l30K37
6544h1L98j97n14K31M72j15m98J0N17L2m41o0M09J62m33k51M66K50l98l39L75
6565eL55l34l20K31M48j95m34N7M88o1m59l0M67N1l83k01M89J69m12k42L39L03
6587C21l09l49L41L23k26m22J76M41j02m49K3M51l2m11p9M33J57l95k49M20K51
6608C14l99k53L36L09l03l41K30L69j19l68L3M51j06m16M7M17O7m57o5L89J53
6629B88l78k33L99J80k85l08K94L19k31l64J85M09j83l34O8M51j00l39l9M00L9
$$ plain form
6650 238 -151 -239 109 279 -31 -300 26 278 14 -241 -84 249 94 -320 -116 277 175 -215 -214 169 206
6671 206 -116 -243 60 269 -134 -292 11 269 -28 -317 -64 257 89 -260 -103 273 154 -191 -188 181 209
6692 209 -183 -158 134 244 -95 -203 50 259 -37 -240 36 220 56 -240 -78 219 73 -227 -146 177 142
6713 142 -201 -228 140 171 -76 -190 127 208 -122 -269 3 230 -27 -252 -32 216 46 -224 -123 199 159
6734 159 -213 -208 192 134 -78 -169 120 186 -115 -205 42 246 7 -193 -2 249 21 -169 -57 261 79 -189
6756 -189 -81 134 121 -209 -175 110 164 -96 -171 59 131 -109 -239 1 147 -70 -207 -19 137 24 -195 -41
6778 -41 221 66 -186 -85 175 146 -157 -144 107 180 -128 -150 42 205 -38 -167 -10 208 14 -207 -48 203
6800 203 32 -195 -72 114 66 -89 -163 81 145 -77 -185 52 154 0 -181 26 131 -37 -163 -7 169
$$ packed form
6650B38l89q8L48J70l10k69L26K52k64k55J57L33j55m14K04L93j02l90JL83L7
6671B06l22j27L03K09m03j58L03K58k97k89K53L21j68l49J57L76j19l45LL69K8
6692B09l92K5K92J10l39j08K53K09k96k03K76J84j64k96J62K97j46l00Q1L23l5
6713A42l43k7L68L1k47j14L17Q1l30j47K72K27k57k25K20K48j70k70J01L22m0
6734A59l72NM00n8k12r1K89O6l01r0K47K04k39k00J91K51k28j90J12L18j82k68
6756a89J08K15j3l30L4K85N4k60p5K30P2k40j30K40J46k17j37J88J56j13k19J54
6778d1K62j55k52J01K60k9l03J3K51P3l08k2J92J63k43j29J57K18j94k21J59K51
6800B03j71k27J23J86m8j55p4K44O4k22j08K37J02j54j81K07J05j68j26J56J76
$$ plain form
6821 169 55 -125 -29 171 71 -145 -66 170 127 -91 -131 92 133 -14 -187 67 136 0 -198 -6 167 13
6843 13 -164 -14 169 22 -135 -149 119 88 -122 -67 59 104 -145 -127 101 131 -75 -177 38 145 18 -175
6865 -175 26 135 53 -122 -36 122 149 -84 -102 97 100 -116 -149 54 141 -59 -97 86 160 6 -151 33 110 -53
6889 -53 -142 -31 80 28 -129 -81 133 63 -183 -131 59 53 -72 -74 71 121 -33 -111 7 124 -2 -117 73 106
6913 106 46 -105 -54 134 41 -72 -69 147 148 -92 -122 96 34 -60 -103 49 73 -26 -83 -15 114 -49 -149 -45 72
6938 72 22 -75 -101 89 45 -81 -97 71 34 -29 -101 72 130 -65 -88 15 111 -22 -76 41 57 4 -94 -19 117 11
6964 11 -44 -36 91 72 -25 -43 90 72 -32 -119 43 26 -43 -107 41 74 -66 -55 -74 -6 -14 -33 43 63 26 -62 11 102
6992 102 17 -61 -52 70 24 -40 -40 21 79 4 -51 1 59 21 -56 9 48 19 -25 -24 32 0 -98 -40 6 9 -47 -44 -4 63 -33 -32
$$ packed form
6821A69j14j80R6K00j00k16P9K36m3k18m0K23M1j47j73K54O9j36j98J92J73j54
6843A3j77J50J83j47j57j4K68l1k10N5J26M5k49J8K28L0k06j02K15J07j27j93
6865a75K01J09q2j75Q6J58K7k33j8J99Lk16l3K03Q7k00l8J83P4j54j57J84P7j63
6889e3q9J11J11n2j57M8K14p0k46N2J90oj25kJ45N0j54p8J18J17j26j15J90L3
6913A06o0j51N1J88r3j13LK16Jk40l0K18o2r4m3J52K4r9n7O8J29j63j00J04J17
6938G2n0r7k6J90m4j26j6J68l7o3p2J73N8j95k3J03R6j33n4J17J6n3r8P5J36j06
6964A1n5QJ27j9r7j8J33j8j04q7J62j7o9o4J48L3j40J1j9O8qj9P6K0l7q8P3R1
6992A02q5p8RJ22m6o4%O1N8p5n5N2N8l8p7O5L9k9m4JN6l2r8N8M6Ln6LM0O7r6J
$$ plain form
7024 -32 49 73 -44 10 -26 -16 26 -60 -31 80 7 -39 -40 -43 27 -30 -12 25 57 17 -20 59 33 -21 -95 17 23 19 -38 7 24
7055 24 -26 -54 18 52 37 -71 -6 16 -29 -30 -6 41 48 -66 -77 -1 0 -3 -22 31 12 -40 -55 33 28 -19 -12 -18 28 -28 11 32 -3
7088 -3 25 -29 20 47 42 -34 -39 51 31 -40 8 23 22 -40 8 9 35 -23 -81 -8 7 -45 -5 19 22 14 -45 6 3 -47 -34 -3 18 -7
7122 -7 -54 17 103 -9 -47 11 28 60 -18 -7 47 -17 -40 -10 86 39 -11 -44 31 22 -3 -41 -38 43 28 -64 -6 20 20 -42 -4 50
7154 50 48 -16 -44 14 27 -49 -55 13 43 -58 -8 52 65 -25 -7 -4 131 4 -41 49 32 56 -39 11 37 15 -44 -30 34 68
7184 68 -31 -18 37 45 -29 -60 20 -19 -19 -44 12 79 -54 -2 -27 -34 27 -65 -12 42 73 -22 -50 32 48 -81 -43 61 54 -6 -75
7215 -75 39 95 -23 -51 -9 43 37 -96 -2 43 15 -52 1 20 -4 -54 -75 14 47 -53 -53 34 26 30 -31 35 55 -63 -73 -31
7245 -31 79 21 -26 -27 61 46 -26 -9 55 34 -11 -82 33 57 5 -47 14 84 -28 -104 4 78 -23 -50 -58 43 -34 -83
$$ packed form
7024c2Q1K4j17N4l6J0M2q6K9J11p3m6jlP0n7J8L7L2m0l7P9k6n4p4J12Omn7M5J7
7055B4n0k8P2L4j5j08O5K2m5jK4M7Pj14j1P6Jlj9N3j9n2j5Q8nm7PoM6n6L9K1l5
7088cK8n4M9K7np6nR0k0p1M8J5jo2M8JK6n8n8P3J5n2M0K4Lqn9N1ln0J3L1K1k5
7122gm7P1Q6j12l8N8J7L2p8J1N4o4k3L0R6m7n0l3P5rk5l8LQ1j5r2N8K6%o2L8N4
7154E0ko4k8N8J3p6oO8L0j01N0O0J3r0J8LJ35j27m5R0j7K4r5N0K6k2n9J4O4L4
7184F8r9J3N5Qp4l1Q0l9%k5N6O7j33N2k5pO1r2N3N4L1r5k8Q2J6j29L8J04po0o9
7215g5J14N6j18k8M2N2oj33R4M5k8o7N3J9k4n0k1Q9L3j00%Q7qMo1O6K0j18j0M2
7245c1J10n8m7jQ8j5p2J7O4k1m5p1J15K4n2n2O1P0j12p6J08P4j01k7qJ01p7m9
$$ plain form
7273 -83 -52 24 11 -11 -38 19 51 -76 -69 -14 35 -32 -45 76 53 20 -78 -40 113 -11 -47 -26 74 43 -55 -16 9 17 -8
7302 -8 -60 63 26 5 -73 9 94 -40 -39 -24 58 -50 -17 -4 35 -25 -78 -60 57 53 -62 -53 47 47 -83 -50 52 63 -43
7331 -43 -79 23 52 -15 -53 -3 109 -4 -75 52 85 27 -46 -10 68 69 -14 -51 23 61 -22 -60 12 75 -20 -75 -2 59 10
7360 10 -75 3 75 41 -116 8 50 40 -117 -70 33 76 -74 -59 21 76 -29 -97 6 21 48 -123 10 109 17 -64
7386 -64 0 132 76 -64 -79 96 91 -84 -51 85 17 2 -54 -11 65 -55 -55 10 85 2 -71 22 29 26 -95 -91 29 20 -50
7415 -50 -48 54 28 -26 -80 24 51 -42 -66 54 13 16 -68 9 89 18 -63 -53 49 68 -32 -33 34 40 -56 -34 17 80 -57
7444 -57 -39 -6 41 2 -93 80 67 10 -73 -62 86 9 -114 -36 90 43 -91 -109 27 80 -18 -70 71 46 -15 -69 22
7471 22 71 40 -77 -45 75 11 -122 -7 36 59 -39 -36 34 39 2 -53 74 60 -68 -52 21 38 -2 -91 -11 53 -12 -82
$$ packed form
7273h3L1P6j3k2k7N7L2j27PN5M9o7j3J21k3l3r8L8J53j24l6K1J00l1r8L9K5Qk5
7302hn2J23l7k1p8Q2Q5j34JJ5Q2j08L3J3L9o0n3J8J17mj15RJ00%j30L3J02J1j06
7331d3l6J02K9o7l8N0J12j13p1J27L3n8p3L6P8Jq3l7P4L8q3l8P2O3r5n5P3O1m9
7360A0q5P8P2l4j57J24M2j0j57M7J03M3j50J5Q0N5j05o8J03J5K7j71J33R9r2q1
7386f4O4J32n6j40j5J75nj75L3J36o8j5n6M3P6j20%O5P5q3p3R3Plj21MJ20rp0
7415e0KJ02k6n4n4J04K7r3k4J20m1Lq4P7Q0p1q1J0J02J9j00jO7Or6K2N1O3j37
7444e7J8L3M7l9r5J73j3n7q3J1J48p7j23P8J26m7j34j8J36N3r8n2J41k5o1n4R1
7471B2M9l1j17L2J20o4j33J15M3K3r8LP0Nl7n5J27j4j28J6P3J7m0q9Q0O4o5p0
$$ plain form
7499 -82 -6 42 22 -63 -89 7 70 -40 -44 51 95 -68 -96 -3 47 -64 -26 32 68 -41 -94 -23 57 13 -56 -66 20 26 -42
7528 -42 -85 48 65 -59 -45 21 52 -53 -97 4 39 -6 -32 -29 54 -15 -70 6 38 29 -85 -80 58 55 -64 -95 21 33
7556 33 -53 -34 9 108 38 -45 17 68 0 -61 -48 42 60 -84 -70 41 -3 -48 -57 10 56 -46 -112 22 51 -29 -130 -9
7584 -9 64 34 -58 12 82 -11 -47 -50 43 21 -47 -38 53 60 -67 -66 6 32 13 -94 17 60 -3 -40 1 54 36 -60 -33 8 27
7615 27 -11 -65 76 19 -93 -106 -13 33 -16 -90 -21 53 -17 -40 2 63 49 -83 -30 113 16 -70 -43 13 80 -23 -95 42
7643 42 24 -5 -20 57 51 -33 -131 3 78 12 -97 -3 46 43 -71 -75 40 16 -43 -39 -22 54 -17 -82 16 46 -4 -55 -20 83
7673 83 5 -88 -21 122 55 -60 -42 94 94 -10 -55 56 105 -29 -55 17 80 -21 -65 -22 62 -17 -122 -31 69 1
7699 1 -44 -20 39 -4 -63 -42 46 7 -87 -83 -53 68 -62 -70 8 54 -20 -145 -51 100 21 -55 -25 72 -30 -15 -54 33 88
$$ packed form
7499h2P6M8k0q5k6R6O3j10mR5M4j63k8R3N0j11L8N8L6j09n3P1Q0m4o9j0Q6Oo8
7528d2m3J33J7j24J4O6L1j05m4J01L5m5k6LQ3o9n5P6L2rj14NJ38lj19l1J16J2
7556C3q6J9M3R9p0q3O2N1o8o1J3R0J8j44J4J11m4m5rO7M6j02o6J34K9q0j01J21
7584iP3l0r2P0P0r3l6lR3k2o8RR1Pj27JP2K6j9j07J11M3o3l7M1N3j8r6K7M1J9
7615B7l8n4J41n7j12j3R3M6m9p4O9P4p0k3M2O1j4j32N3J43r7q6K7N6O7j03p2J37
7643D2j8k9j5P7oq4r8J34P5o6j09R4M9lj14mJ15k4n9MJ7P6p1o5R8L0n0n1L5J03
7673H3p8r3O7J43o7j15J8J36%j04m5J11M9j34k6P2O3j01m4M3Q4p9j05R1J00o8
7699Am5K4N9m3n9K1Q8l9r4ML0J21j30qP8M6p4j25R4J51p9p6L0R7j02J5l9Q7N5
$$ plain form
7728 88 -39 -60 31 69 2 -47 -5 102 11 -59 -4 29 -4 -53 -52 63 10 -61 -20 32 99 -30 -55 19 31 -35 -88 -3 25
7757 25 -19 -145 0 39 5 -29 -5 95 28 -54 3 50 31 -52 -71 51 82 -59 -71 35 106 -14 -48 -56 34 39 -111
7784 -111 -5 99 -20 -58 -73 13 61 -77 -76 23 39 -48 -71 38 72 -46 -53 35 31 -33 -35 -43 45 8 -72 -68 108 20 -6
7813 -6 -25 76 32 -30 -81 26 66 -52 -106 21 112 -37 -90 -34 47 21 -52 47 30 24 -67 -50 63 7 -103 -75 48
7840 48 44 -44 -32 26 85 -20 -68 36 51 29 -64 -41 60 21 -56 -19 90 -55 -35 -34 12 48 -65 -46 74 32 -19 -111
7868 -111 58 -16 -61 -104 -2 51 4 -111 -16 71 4 -99 -16 67 -5 -21 -31 36 68 34 -15 -13 49 -42 -22 43 87 8
7896 8 -53 54 57 49 -70 -2 36 39 -42 -56 75 82 -52 -100 24 23 -38 -26 16 0 -34 -83 0 88 -10 -98 -58 43 10 -51
7926 -51 7 70 50 -71 -8 25 22 -11 -109 49 48 28 -32 42 27 17 -24 17 103 24 -102 -10 27 65 -24 -86 11 18 -21 -53
$$ packed form
7728H8j27k1R1L8o7m9M2J07r1p0N5L3l3m9JJ15n3p1M1N2O7j29k5P4J2o6n3Q5K8
7757B5m4j26J45L9l4l4K4J00o7q2N7M7j9q3j9J22L1j41j2J06P1j20l4qR0Nj50
7784a11J06J04j19l8j5Q6M8j38JR9J6q7k3J09L4j18pQ8mo4kqQ8l7q0MJ76q8k6
7813fj9J01m4o2n1J07M0j18n4J27R1j49n3N6Q1k6p3R9j7or1J7J13n6j10K8J23
7840D8mq8J2N8N9j05m8J04J5k2r3K3J01l9p7L7J09j45K0JM6L6j13J9J20m2n1r2
7868a11J69p4m5m3J02N3m7j15R5Q7o7j03Q3Q3p2j6j0O7L2l4m9KO2r1K0O5M4p9
7896Ho1J07Lqj19O8L8Lq1j4J31Pj34m8J24jo1J2M2j6l4m9Q3Q8r8q8M0J01l3o1
7926e1N8O3k0j21O3L3ll3r8J58jk0o0P4j5j0m1M1Q6p9j26R2L7L8q9o2R7Pl9l2
$$ plain form
7956 -53 -20 36 -22 -95 -1 71 -21 -46 25 43 79 -109 -33 43 -16 -99 -73 25 75 -76 -37 16 44 -30 -74 25 49 -56 -66
7985 -66 -8 64 58 -29 3 36 8 -22 -35 43 54 -64 -73 0 63 -40 -40 12 54 -83 -59 -29 49 21 -59 -1 72 75 -101 1
8015 1 41 39 -29 -53 13 38 -47 -28 59 34 -87 -34 40 44 -46 -71 1 88 17 -87 8 -28 -1 -71 -55 -3 -15 -61 -47 19 3
8046 3 -15 -113 -45 19 -41 -85 17 27 -4 -109 -19 101 -3 -56 -15 52 12 -70 -81 75 19 -25 -26 49 45 -37 -26 29 119
8075 119 0 -65 40 87 40 -55 -40 52 25 -90 -7 29 22 -42 -50 30 56 -32 -88 21 91 29 -51 26 30 8 -62 41 53
8104 53 17 -51 7 56 9 -33 -65 56 47 -2 -42 59 53 -32 -46 13 33 -30 -46 36 24 -19 -39 -62 81 -8 -62 23 55 -28
8134 -28 -97 -60 85 57 -39 -45 76 45 -44 -44 73 49 -27 -30 -8 88 77 -37 3 35 37 -76 -42 80 59 -23 -70 40 37
8163 37 -36 -29 52 83 -99 -68 33 53 3 -101 38 40 22 -80 33 76 31 6 -51 24 27 -23 -30 71 83 -27 -73 41
$$ packed form
7956e3L3N6n8p3R4P2r2k5P1J8L6j88P6P6n9q3K6R8N0j51L9N3K8p4m4R9K4j05j0
7985f6N8P2oq7L2L3k8l0j3P8J1j18rP3O3j03%N2M2j37K4L0P8k8q0N8P3Lj76J02
8015AM0ko8k4O6K5q5J9Q7k5j21N3P4Mr0k5P2Q7p1j04R5l6K7p0J6N2j2m6J4O6j6
8046Cj8r8O8O4o0m4J02J0l1j05R0J20j04n3M1O7m0q2j1J56n6m4jP5mq2J1N5R0
8075A19j19o5J05M7m7r5J5R2k7j15Q3L6po4qQ0K6q8n6J09P0o2q0P7Mk2p0J03J2
8104E3l6o8N8M9m7m2l2J21rm9m0J01oq5j4N9K0o3j6Q2j2m3k0k3J43q9n4Q5L2q3
8134b8o9L7J45k8r6oJ21l1q9%J17k4p6lK2R6j1j14M0L2Kj13L4J22k1q2m7J10l
8163C7p3PQ1L1j82L1J01K0n0j04J39Kj8j02J13M3m5k5n7P5Ln0pJ01J2j10m6J14
8191D1
$$ Imaginary data points
##PAGE= N=2
##DATA TABLE= (X++(I..I)), XYDATA
$$ plain form
0 0 0 0 0 0 0 0 0 0 0 0 0 0 0 0 0 0 0 0 0 0 0 4 -1 0 -4 6 -4 4 -6 7 -4 4 -8 9 -7 8 -10 10 -9 11 -13 13 -11 12 -16 15
46 15 -14 17 -19 19 -21 23 -28 32 -37 47 -59 69 -87 114 -152 206 -291 426 -652 1063 -1910 3995 -11183
69 -11183 81149 539411 171977 -431921 -144618 428394 171667 -476150 -308624 390529
79 390529 378795 -277761 -350675 260955 380439 -241609 -458643 135657 463720 -45625
89 -45625 -422368 21421 431877 24005 -452181 -115286 414594 174595 -363745 -195329
99 -195329 349967 239552 -329116 -301463 270278 330132 -215453 -339223 184333 366717
109 366717 -139950 -395086 74362 395748 -19660 -387696 -21419 390293 73770 -384617
119 -384617 -133191 358371 178428 -329361 -215271 305029 258196 -270092 -298672 222347
$$ packed form
0@%%%%%%%%%%%%%%%%%%%%%MnJmJ0j0Qj0J3j1Qj2J7j6J5j8K0j9K0k4K6k4K3k8L1
46A5k9L1l6L8m0M4n1O0o9Q4j06J28j56K01k66L58m97P17j078J715k973N905j5178
69a1183R2332M58262l67434o03898K87303N73012k56727o47817J67526O99153
79C90529j1734o56556p2914O11630J19484o22048k17034N94300L28063n09345
89d5625l76743M43789M10456m07872m76186L36895N29880k39999n38340J68416
99a95329N45296j10415n68668K7653N71741N9854n45585j23770N23556J82384
109C66717n06667k55136M69448L21386m15408l68036L66277M11712l16523m58387
119c84617K51426M91562j79943n07789J14090N20300m6833n28288k8580N21019
$$ plain form
129 222347 324520 -175721 -343511 130982 362672 -78601 -373479 21601 371004 30427
139 30427 -362500 -79148 350926 129766 -330173 -177549 299962 217435 -266445 -251976
149 -251976 230367 283558 -188281 -308258 142046 323994 -95959 -333855 49504 338468
159 338468 -1289 -335470 -46072 324547 89740 -308616 -130427 287984 168443 -261555
169 -261555 -202280 230198 230550 -195945 -254149 159057 272861 -119530 -285463 79043 291790
180 291790 -39317 -293168 405 289844 37536 -281428 -73833 268438 107677 -251703
190 -251703 -139400 231336 168787 -207238 -194829 180080 217205 -150724 -236083 118960 251130
201 251130 -84793 -261869 49082 267966 -12521 -269564 -24479 266058 61199 -257473
$$ packed form
129B22347J02173n00241j67790M74493K31690m41273k94878L95080L49403l40577
139C0427l92927K83352M30074k21160m59939J52624M77511q2527m83880J4469
149b51976M82343N3191m71839j19977M50304J81948m19953k37896L83359K88964
159C38468l39757l34181K89398L70619k34807l98356J78189M18411j19541m29998
169b61555N9275M32478L52m26495n8204M13206J13804l92391j65933L64506K12747
180B91790l31107k53851K93573K89439k52308l18964K07595L42271j60761l59380
190b51703J12303L70736o2549l76025J2409L74909L7125l67929q5359L55043J32170
201B51130l35923j77076L10951K18884k80487k57043K45085K90537k04859l18672
$$ plain form
211 -257473 -96943 243709 130909 -225040 -162729 201500 191156 -173627 -215341 142342
221 142342 234507 -108454 -248536 72778 257064 -36184 -259976 -551 257322 36424
231 36424 -249597 -70852 236796 103049 -219375 -132233 198044 157839 -173415 -179628 145998
242 145998 197258 -116762 -210441 86372 219295 -55359 -223832 24365 224277 6026
252 6026 -220864 -35469 213768 63557 -203263 -89878 189722 114103 -173442 -135987 154651
263 154651 155489 -133443 -172442 110104 186378 -84989 -197087 58665 204352 -31372 -207981
274 -207981 3631 207992 24044 -204259 -51308 196794 77563 -185878 -102355 171343
284 171343 125266 -153638 -145818 133018 163431 -109906 -177944 84755 188775 -58103 -195937
$$ packed form
211b57473J60530L40652j12800l55949O2311L64229j0344l64783m1714L57683
221A42342R2165l42961j40082L21314J84286k93248k23792K59425K57873k20898
231C6424k86021J78745L07648j33747l22424Q7142L30277m0205l31254o213L25626
242A45998N1260l14020r3679K96813J32923k74654j68473K48197J99912k18251
252F026k26890J85395K49237j50211k66820J13385K79600p5619k87545L7455K90638
263A54651Q38k88932l8999K82546P6274k71367j12098K55752J45687k35724j76609
274b07981K11612K04361j83948k28303J52951K48102j19231k63441Q3523K73698
284A71343m6077k78904P820K78836L0413k73337o8038K62699J04020k46878j37834
$$ plain form
295 -195937 30484 199116 -2448 -198241 -25628 193500 53100 -184834 -78978 172501
305 172501 103022 -156902 -124679 138220 143539 -117028 -159159 93917 171386 -69331 -179881
316 -179881 43763 184648 -17906 -185758 -7887 183166 32994 -177078 -56855 167697
326 167697 79033 -155355 -99181 140352 116971 -123100 -132271 104158 144522 -83903 -154010
337 -154010 62734 160539 -41255 -164211 19369 165226 2539 -163439 -24232 158954
347 158954 45306 -151858 -65343 142382 84059 -130501 -101221 116569 116594 -100785 -129980
358 -129980 83151 141361 -63923 -150205 43393 156341 -22006 -159577 0 159843
368 159843 22252 -156895 -44314 150732 65681 -141394 -85796 128914 104151 -113679
$$ packed form
295a95937K26421J68632k01564j95793J72613K19128j40400k37934J05856K51479
305A72501o9479k59924L2223K62899N319k60567m2131K53076P7469k40717j10550
316a79881K23644J40885k02554j67852J77871J91053j50172k10072J20223K24552
326A67697q8664k34388N6174K39533k3381k40071r171K36429M0364k28425p0107
337a54010K16744R7805k01794j22956J83580J45857j62687j65978J39207J83186
347A58954j13648j97164Q6515K07725n8323k14560K9280K17790K5k17379k9195
358a29980K13131N8210k05284q6282J93598J12948j78347j37571J59577J59843
368A59843j37591j79147J12581J95046q5051k07075N5598K14710k4763k17830
$$ plain form
378 -113679 -120125 96078 133333 -76594 -143497 55658 150480 -33675 -154034 11632 154268
389 154268 10076 -151299 -30993 145220 50624 -136523 -68784 125429 85161 -112149
399 -112149 -99284 97319 111203 -81245 -120754 63997 128034 -46156 -132841 27920 135198
410 135198 -9574 -135342 -8602 133078 26222 -128646 -43109 122173 59056 -113816
420 -113816 -73642 103704 86837 -92105 -98495 79017 108502 -64705 -116706 49084 122971
431 122971 -32529 -127000 15447 128684 1969 -127987 -19394 124894 36386 -119349
441 -119349 -52805 111535 68124 -101471 -82015 89550 94089 -76002 -104205 61094 112137
452 112137 -45173 -117857 28447 121223 -11245 -122181 -6016 120690 23009 -116834
$$ packed form
378a13679o446K16203L7255k09927o6903J99155R4822j84155j20359J65666J42636
389A54268j44192j61375J20306J76213r4596j87147O7739J94213m0268j97310
399a12149J2865J96603J3884j92448l9509J84751O4037j74190q6685J60761J07278
410A35198j44772j25768J26740J41680j06856j54868Q5537J65282o3117j72872
420a13816M0174J77346j6867j78942o390J77512K9485j73207n2001J65790P3887
431A22971j55500r4471J42447J13237j26715j29956J08593J44288q8508j55735
441a19349O6544J64340m3411j69595J9456J71565M539j70091k8203J65299N1043
452A12137j57310p2684J46304R2776j32468j10936J16165J26706r7681j39843
$$ plain form
462 -116834 -39322 110703 54560 -102496 -68600 92341 81126 -80287 -91951 66775 100795
473 100795 -52093 -107312 36545 111559 -20639 -113391 4689 112965 10898 -110360
483 -110360 -25878 105575 39962 -98918 -52879 90640 64450 -80815 -74673 69801 83175
494 83175 -57731 -90008 44993 95025 -31759 -98301 18294 99784 -4762 -99583 -8612
505 -8612 97649 21649 -94098 -34300 89021 46220 -82420 -57308 74403 67384 -65091
516 -65091 -76245 54607 83722 -43115 -89606 30740 93840 -17709 -96325 4294 96965
527 96965 9177 -95615 -22474 92272 35115 -87281 -47004 80514 57840 -72099 -67530
538 -67530 62250 75776 -51343 -82260 39335 87014 -26712 -89884 13820 90776 -917
$$ packed form
462a16834P7512J50025n6143j57056L3896J60941j1215j61413j1664J58726L4020
473A00795j52888n5219J43857P5014j32198r2752J18080J08276j02067j21258
483a10360Q4482J31453o5613j38880M6039J43519k6190j45265O142J44474J3374
494H3175j40906l2277J35001N0032j26784o6542J16595Q1490j04546r4821R0971
505h612J06261p6000j15747N9798J23321m2801j28640K5112J31711p019j32475
516f5091j1154J30852K9115j26837m6491J20346O3100j11549p8616J00619R2671
527I6965q7788j04792P3141J14746n7157j22396M0277J27518k2674j29939M569
538f7530J29780J3526j27119l0917J21595M7679j13726o3172J03704P6956r1693
$$ plain form
549 -917 -89836 -11731 87077 23749 -82664 -34841 76852 44910 -69685 -53944 61449 61723
561 61723 -52251 -68239 42295 73286 -31939 -76910 21209 79103 -10361 -79834 -521
572 -521 79277 11141 -77358 -21223 74108 30931 -69726 -39867 64202 48140 -57660 -55597
584 -55597 50091 61954 -41680 -67353 32357 71408 -22603 -74201 12222 75604 -1703 -75489
596 -75489 -8947 73874 19280 -70834 -29095 66420 38218 -60714 -46438 53907 53676 -46162
608 -46162 -59819 37469 64789 -28045 -68439 18296 70675 -8231 -71506 -1954 70804 11884
620 11884 -68778 -21624 65271 30732 -60568 -39102 54643 46497 -47696 -52893 39963 58107
632 58107 -31575 -61972 22743 64507 -13771 -65736 4646 65680 4352 -64385 -13137 61818
$$ packed form
549i17q8919P8105R8808o3328j06413M7823J11693l1942j14595J5741J15393K74
561F1723j13974j5988J10534L0991j05225m4971R8119N7894q9464o9473P9313
572e21P9798o8136q8499N6135R5331m3177j00657K9859J04069j6062j05800K063
584e5597J05688J1863j03634k5673R9710L9051r4011n1598Q6423O3382p7307p3786
596g5489O6542Q2821n4594r0114M1739R5515k8202r8932J4276J00345k31r9838
608d6162j3657R7288K7320r2834m0394Q6735N2379p8906o3275O9552P2758n8920
620A1884q0662M7154Q6895l4539r1300K1466R3745q146r4193n197R2856J8144
632E8107q9682l0397Q4715M1764p8278n1965P0382O1034o1328o8737N1248P4955
$$ plain form
644 61818 21446 -58135 -29130 53357 35983 -47813 -42108 41484 47229 -34655 -51416 27237
656 27237 54520 -19447 -56692 11553 57778 -3638 -57797 -4161 56890 11628 -55015 -18844
668 -18844 52352 25562 -48863 -31933 44495 37851 -39369 -43107 33394 47729 -26789 -51394
680 -51394 19625 54077 -12023 -55761 4265 56212 3737 -55565 -11567 53702 19219 -50719
692 -50719 -26358 46654 32895 -41581 -38618 35614 43412 -28967 -47240 21719 49814 -14210
704 -14210 -51328 6544 51657 1005 -50844 -8273 49040 15139 -46200 -21438 42542 27133
716 27133 -38276 -32081 33366 36298 -28011 -39753 22278 42373 -16313 -44148 10231 45134
728 45134 -4109 -45313 -1980 44739 7866 -43395 -13646 41334 19031 -38582 -24036 35148
$$ packed form
644F1818m0372p9581K9005Q2487j7374q3796N705Q3592N745q1884j6761P8653
656B7237K7283p3967l7245O8245M6225o1416n4159N3636O1051m5262o6643L6171
668a8844P1196k6790p4425J6930P6428o644p7220l738P6501J4335p4518k4605
680e1394P1019L4452o6100m3738O0026N1947n2475n9302M3998O5269l4483o9938
692e0719K4361P3012j3759p4476K963P4232P798p2379j8273O8959K8095o4024
704a4210l7118N7872M5113n0652n1849M2571N7313l3901o1339K4762O3980j5409
716B7133o5409O195O5447K932o4309j1742O2031K0095n8686k7835N4379L4903
728D5134m9243m1204M3333M6719l6873n1261K9749N4980k2303n7613J4546N9184
$$ plain form
740 35148 28625 -31095 -32626 26553 35983 -21490 -38760 16023 40731 -10386 -41981 4488 42323
753 42323 1469 -41885 -7465 40553 13105 -38388 -18470 35428 23468 -31828 -27818 27735
765 27735 31636 -23093 -34663 18045 36985 -12689 -38547 7139 39290 -1485 -39307 -4065
777 -4065 38467 9532 -36792 -14723 34458 19533 -31345 -23806 27779 27581 -23612 -30711 18924
790 18924 33015 -14141 -34690 9162 35530 -4090 -35721 -823 35163 5739 -33971 -10341
802 -10341 32060 14694 -29538 -18635 26537 21970 -23228 -24818 19513 27151 -15581 -28928 11459
815 11459 30204 -7214 -30887 2877 31059 1368 -30650 -5598 29694 9587 -28330 -13488
827 -13488 26381 17038 -23977 -20378 21087 23297 -17807 -25793 14171 27706 -10256 -29176 6050
$$ packed form
740C5148o523n9720j531N9179R430n7473j7270N4783K4708n1117l1595M6469L7835
753D2323m0854m3354L4420M8018k7448n1493J9918N3898j1960n5296M010N5553
765B7735L901n4729j1570N2708J8940m9674k5858M5686L2151m0775l7822L5242
777d065M2532k8935m6324K2069M9181j4925n0878P539N1585j98n1193p099M9635
790A8924J4091m7156k0549M3852K6368l9620l1631L4898L5986k9424l9710K3630
802a0341M2401j7366m4232J0903M5172m567m5198j590M4331P638m2732j3347M0387
815A1459J8745l7418k3673L3764K8182k9691l2018K5052L5292k0107l7917J4842
827a3488L9869r343m1015L599M1465K210m1104p986L9964J3535l7962j8920L5226
$$ plain form
840 6050 30029 -1725 -30125 -2524 29731 6820 -28598 -10924 26833 14767 -24501 -18255
852 -18255 21606 21316 -18262 -23766 14497 25703 -10630 -27007 6510 27658 -2374 -27680 -1774
865 -1774 27041 5729 -25948 -9414 24285 12844 -22123 -15949 19532 18584 -16578 -20751 13441
878 13441 22476 -10123 -23767 6660 24447 -3286 -24772 -173 24575 3510 -23919 -6803
890 -6803 22855 9855 -21405 -12756 19513 15448 -17260 -17700 14692 19722 -11863 -21322 8742
903 8742 22426 -5511 -23111 2080 23325 1242 -23098 -4516 22299 7773 -21121 -10810
915 -10810 19409 13631 -17322 -16175 14890 18286 -12081 -20024 9085 21344 -5933 -22118 2652
928 2652 22431 655 -22272 -3881 21598 7083 -20563 -9981 19082 12745 -17131 -15199 14863
$$ packed form
840F050K3979l1754k8400K7601L2255k2911l5418J7674L7757j2066l9268O246
852a8255L9861k90l9578n504L8263J1206l6333j6377L3517K1148l0032k5306K5906
865a774K8815k1312l1677J6534L3699j1441l4967O174L5481r48l5162m173L4192
878A3441R035l2599j3644L0427J7787k7733k1486K4599K4748k1065k7429J7116
890f803K9658j3000l1260Q649L2269m065l2708m40L2392N030l1585r459L0064
903H742J3684k7937j7600K5191K1245k2083k4340J8582K6815j4526k8894J0311
915a0810L0219n778l0953J147L1065L396l0367p943K9109J2259k7277j6185K4770
928B652J9779k1776k2927J8391K5479j4515k7646J0582K9063o337k9876J932L0062
$$ plain form
941 14863 17235 -12271 -18916 9538 20205 -6549 -21001 3382 21309 -317 -21177 -2693
953 -2693 20604 5656 -19640 -8462 18146 10989 -16371 -13264 14311 15211 -11988 -16783 9528
966 9528 17993 -6846 -18879 4084 19346 -1285 -19447 -1441 19218 4209 -18498 -6750
978 -6750 17512 9202 -16160 -11466 14566 13546 -12653 -15404 10525 16881 -8097 -18041 5574
991 5574 18913 -2785 -19391 -62 19390 2843 -19056 -5638 18234 8306 -17053 -10802 15429
1004 15429 13107 -13478 -15088 11144 16695 -8624 -17928 5900 18809 -2978 -19173 114 19098
1017 19098 2811 -18553 -5607 17677 8206 -16303 -10646 14604 12728 -12599 -14551 10421 16003
1030 16003 -8003 -17084 5511 17861 -2980 -18116 397 18043 2162 -17678 -4617 16974
$$ packed form
941A4863K372k9506o645K8454J0667k6754j4452K4383J7927k1626k0860J8484
953b693K3297j4948k5296J1178K6608p157k7360L107K7575R00k7199m795K6311
966I528Q465k4839j2033K2963J5262k0631j8162J8006K0659j5009k2707J1748
978f750K4262q310k5362M694K6032j020k6199k751K5929O356k4978r944K3615
991E574J3339k1698j6606J9329J9452j6547k1899J3418K3872r928k5359O251K6231
1004A5429k322k6585j610K6232N551k5319r304K3828J2909k1787j6195J9287J8984
1017A9098j6287k1364J2946K3284r471k4509N657K5250j876k5327j952K4972N582
1030A6003k4006r081K2595J2350k0841j5136J8513J7646j5881j9840J3061K1591
$$ plain form
1042 16974 6996 -15989 -9249 14652 11246 -13022 -13006 11225 14555 -9182 -15844 6902 16819 -4549
1056 -4549 -17427 2097 17769 480 -17741 -2982 17310 5508 -16488 -7929 15371 10133
1068 10133 -13909 -12194 12045 13970 -10005 -15450 7700 16604 -5256 -17455 2665 17892 -8
1081 -8 -17853 -2585 17576 5176 -16879 -7554 15828 9827 -14447 -11922 12710 13777 -10867
1094 -10867 -15309 8633 16596 -6252 -17460 3765 18003 -1193 -18139 -1338 17888 3952
1106 3952 -17215 -6382 16255 8711 -14906 -10812 13342 12706 -11415 -14316 9350 15603 -7116
1119 -7116 -16555 4762 17144 -2306 -17363 -151 17341 2598 -16933 -5009 16187 7276
1131 7276 -15186 -9449 13813 11288 -12267 -13060 10460 14502 -8419 -15762 6312 16663 -4080
$$ packed form
1042A6974r978k2985O740K3901l406k4268J6K4231L330k3737o662K2746R917k1368
1056d549j2878J9524J5672j7289j8221J4759K0292j1802k1996Q559K3300n238
1068A0133k4042J715K4239J925k3975n445K3150Q904k1860j2199K0120J5227j7900
1081hj7845J5268K0161j2400k2055R325K3382o001k4274K525K4632J067k4644
1094a0867m442K3942P963k2848j1208K1225J4238j9196j6946J6801J9226j3936
1106C952k1167J0833K2637p544k3617M094K4154o36k4121k901K3666O253k2719
1119g116r439K1317J2382j9450j5057J7212J7492j4743j9531J1924K1196q911
1131G276k2462N737K3262k525k3555p93K3520M042k2921p343K2074J0351k0743
$$ plain form
1144 -4080 -17317 1660 17600 693 -17640 -3193 17299 5586 -16547 -7940 15524 10226
1156 10226 -14184 -12224 12413 14015 -10533 -15613 8227 16831 -5777 -17746 3225 18151 -558
$$ packed form
1144d080j3237J8977J5940j6907j8333J4447K0492j1713k2133Q607K3464n298
1156A0226k4410J960K4637J602k4548n080K3840Q604k2608j1969K0971J4926j8709
$$ [...]
8191F1
##END NTUPLES=NMR FID
##END=
