##TITLE=1H_ES-AN-MeCel-st
 
 8 sc, 
 21.1.2022
##JCAMPDX= 6.0         $$ Bruker NMR JCAMP-DX V2.0
##DATA TYPE= NMR FID
##DATA CLASS= NTUPLES
##ORIGIN= UXNMR, Bruker Analytische Messtechnik GmbH
##OWNER= root
$$ XWIN-NMR		Version 3.5
$$ Fri Jan 21 12:56:27 2022 Russian Standard Time (UT+4h)  she@DPX200
##.OBSERVE FREQUENCY= 200.131346
##.OBSERVE NUCLEUS= ^1H
##.DELAY= (6, 6)
##.ACQUISITION MODE= SIMULTANEOUS
##.ACQUISITION SCHEME= undefined
##.AVERAGES= 8
##.DIGITISER RES= 18
##SPECTROMETER/DATA SYSTEM= spect
##.PULSE SEQUENCE= zg30
##.SOLVENT NAME= DMSO
##.SHIFT REFERENCE= (INTERNAL, DMSO, 0, 15.7039)
##AUDIT TRAIL= $$ (NUMBER, WHEN, WHO, WHERE, WHAT)
$$ ##TITLE= Audit trail, XWIN-NMR		Version 3.5
$$ ##JCAMPDX= 5.01
$$ ##ORIGIN= Bruker BioSpin GmbH
$$ ##OWNER= she
$$ F:/spectra/data/she/nmr/H-F/1/audita.txt
$$ ##AUDIT TRAIL=  $$ (NUMBER, WHEN, WHO, WHERE, WHAT)
(   1,<2022-01-21 12:54:47.42 +0400>,<she>,<DPX200>,
      <created by zg, POWCHK disabled, PULCHK disabled
       configuration hash MD5:
       00 E9 B6 7A A2 85 ED C7 34 08 36 98 17 FE 4E 26
       data hash MD5: 16K
       A1 8C 1D 35 17 FA 6F 40 BA 0E 0E 1E 36 65 A8 00>)
$$ ##END=
$$ 
$$ hash MD5
$$ 90 24 29 0F C7 E0 7F A8 54 41 0D E7 6B 74 21 EE
##$RELAX= 
##$RELAX= 
##$RELAX= 
##$RELAX= 
##$RELAX= 
##$RELAX= 
$$ Bruker specific parameters
$$ --------------------------
##$DU= <F:/spectra>
##$EXPNO= 1
##$NAME= <H-F>
##$PROCNO= 1
##$TYPE= <nmr>
##$USER= <she>
##$AMP= (0..31)
100 100 100 100 100 100 100 100 100 100 100 100 100 100 100 100 100 100 
100 100 100 100 100 100 100 100 100 100 100 100 100 100 
##$AQSEQ= 0
##$AQ_mod= 1
##$AUNM= <au_zg>
##$AUTOPOS= <>
##$BF1= 200.13
##$BF2= 200.13
##$BF3= 200.13
##$BF4= 200.13
##$BF5= 200.13
##$BF6= 200.13
##$BF7= 200.13
##$BF8= 200.13
##$BYTORDA= 1
##$CFDGTYP= 0
##$CFRGTYP= 5
##$CHEMSTR= <none>
##$CNST= (0..31)
1 1 145 1 1 1 1 1 1 1 1 1 1 1 1 1 1 1 1 1 1 1 1 1 1 1 1 1 1 1 1 1 
##$CPDPRG= <>
##$CPDPRG1= <>
##$CPDPRG2= <>
##$CPDPRG3= <>
##$CPDPRG4= <mlev>
##$CPDPRG5= <mlev>
##$CPDPRG6= <mlev>
##$CPDPRG7= <mlev>
##$CPDPRG8= <mlev>
##$CPDPRGB= <>
##$CPDPRGT= <>
##$D= (0..31)
0 1.2 0 0 0 0 0 0 0 0.06 0 0.03 0 0 0 0 0.0002 0 0 0 0 0 0 0 0 0 0 0 0 
0 0 0 
##$DATE= 1642755287
##$DBL= (0..7)
120 120 120 120 120 120 120 120 
##$DBP= (0..7)
150 150 150 150 150 150 150 150 
##$DBP07= 0
##$DBPNAM0= <>
##$DBPNAM1= <>
##$DBPNAM2= <>
##$DBPNAM3= <>
##$DBPNAM4= <>
##$DBPNAM5= <>
##$DBPNAM6= <>
##$DBPNAM7= <>
##$DBPOAL= (0..7)
0.5 0.5 0.5 0.5 0.5 0.5 0.5 0.5 
##$DBPOFFS= (0..7)
0 0 0 0 0 0 0 0 
##$DE= 6
##$DECBNUC= <off>
##$DECIM= 32
##$DECNUC= <off>
##$DECSTAT= 4
##$DIGMOD= 1
##$DIGTYP= 9
##$DL= (0..7)
0 120 120 120 120 120 120 120 
##$DP= (0..7)
150 150 150 150 150 150 150 150 
##$DP07= 0
##$DPNAME0= <>
##$DPNAME1= <>
##$DPNAME2= <>
##$DPNAME3= <>
##$DPNAME4= <>
##$DPNAME5= <>
##$DPNAME6= <>
##$DPNAME7= <>
##$DPOAL= (0..7)
0.5 0.5 0.5 0.5 0.5 0.5 0.5 0.5 
##$DPOFFS= (0..7)
0 0 0 0 0 0 0 0 
##$DQDMODE= 0
##$DR= 18
##$DS= 0
##$DSLIST= <SSSSSSSSSSSSSSS>
$$ [...]
##$SUBNAM2= <"">
##$SUBNAM3= <"">
##$SUBNAM4= <"">
##$SUBNAM5= <"">
##$SUBNAM6= <"">
##$SUBNAM7= <"">
##$SUBNAM8= <"">
##$SUBNAM9= <"">
##$SW= 18.0517287032376
##$SWIBOX= (0..15)
0 0 2 0 0 0 0 0 0 0 0 0 0 0 0 0 
##$SW_h= 3612.71676300578
##$TD= 16384
##$TD0= 1
##$TE= 0
##$TE2= 300
##$TE3= 300
##$TEG= 300
##$TL= (0..7)
0 120 120 120 120 120 120 120 
##$TP= (0..7)
150 150 150 150 150 150 150 150 
##$TP07= 0
##$TPNAME0= <>
##$TPNAME1= <>
##$TPNAME2= <>
##$TPNAME3= <>
##$TPNAME4= <>
##$TPNAME5= <>
##$TPNAME6= <>
##$TPNAME7= <>
##$TPOAL= (0..7)
0.5 0.5 0.5 0.5 0.5 0.5 0.5 0.5 
##$TPOFFS= (0..7)
0 0 0 0 0 0 0 0 
##$TUNHIN= 0
##$TUNHOUT= 0
##$TUNXOUT= 0
##$USERA1= <user>
##$USERA2= <user>
##$USERA3= <user>
##$USERA4= <user>
##$USERA5= <user>
##$V9= 5
##$VALIST= <valist>
##$VCLIST= <CCCCCCCCCCCCCCC>
##$VD= 0
##$VDLIST= <DDDDDDDDDDDDDDD>
##$VPLIST= <PPPPPPPPPPPPPPP>
##$VTLIST= <TTTTTTTTTTTTTTT>
##$WBST= 1024
##$WBSW= 4
##$XGAIN= (0..3)
0 0 0 0 
##$XL= 0
##$YL= 0
##$YMAX_a= 298675
##$YMIN_a= -313697
##$ZGOPTNS= <>
##$ZL1= 120
##$ZL2= 120
##$ZL3= 120
##$ZL4= 120
##$ABSF1= 10
##$ABSF2= 0
##$ABSG= 5
##$ABSL= 3
##$ALPHA= 0
##$AQORDER= 0
##$ASSFAC= 0
##$ASSFACI= 0
##$ASSFACX= 0
##$ASSWID= 0
##$AUNMP= <proc_1d>
##$AZFE= 0.1
##$AZFW= 0.1
##$BCFW= 1
##$BC_mod= 2
##$BYTORDP= 1
##$COROFFS= 0
##$CY= 11.3945322036743
##$DATMOD= 1
##$DC= 2
##$DFILT= <>
##$DTYPP= 0
##$F1P= 2.36226072786647
##$F2P= -0.459571619588291
##$FCOR= 0.5
##$FTSIZE= 0
##$FT_mod= 4
##$GAMMA= 1
##$GB= 0.15
##$INTBC= 1
##$INTSCL= 1
##$ISEN= 128
##$LB= 0.24
##$LEV0= 0
##$LPBIN= 0
##$MAXI= 10000
##$MC2= 0
##$MEAN= 0
##$ME_mod= 0
##$MI= 1.114404
##$NCOEF= 0
##$NC_proc= 0
##$NLEV= 6
##$NOISF1= 3.799351
##$NOISF2= 2.8
##$NSP= 1
##$NTH_PI= 0
##$NZP= 0
##$OFFSET= 15.70392
##$PC= 1
##$PHC0= -15938.04
##$PHC1= -5.399225
##$PH_mod= 1
##$PKNL= yes
##$PPARMOD= 0
##$PSCAL= 0
##$PSIGN= 0
##$REVERSE= no
##$SF= 200.130013532006
##$SI= 16384
##$SIGF1= 3
##$SIGF2= 2
##$SINO= 400
##$SIOLD= 16384
##$SREGLST= <1H.CDCl3>
##$SSB= 0
##$STSI= 0
##$STSR= 0
##$SW_p= 3612.71676300578
##$SYMM= 0
##$S_DEV= 0
##$TDeff= 0
##$TDoff= 0
##$TI= <>
##$TILT= no
##$TM1= 0
##$TM2= 0
##$TOPLEV= 0
##$USERP1= <user>
##$USERP2= <user>
##$USERP3= <user>
##$USERP4= <user>
##$USERP5= <user>
##$WDW= 1
##$XDIM= 8192
##$YMAX_p= 0
##$YMIN_p= 0
$$ End of Bruker specific parameters
$$ ---------------------------------
##NTUPLES= NMR FID
##VAR_NAME=  TIME,          FID/REAL,        FID/IMAG
##SYMBOL=    X,             R,               I
##VAR_TYPE=  INDEPENDENT,   DEPENDENT,       DEPENDENT
##VAR_FORM=  AFFN,          ASDF,            ASDF
##VAR_DIM=   8192,          8192,            8192
##UNITS=     SECONDS,       ARBITRARY UNITS, ARBITRARY UNITS
##FACTOR=    0.0002768,     1,               1
##FIRST=     0,             0,               0
##LAST=      2.2672688,     0,               0
##MIN=       0,             -313697,         0
##MAX=       2.2672688,     298675,          0
$$ Real data points
##PAGE= N=1
##DATA TABLE= (X++(R..R)), XYDATA
0@%%%%%%%%%%%%%%%%%qJ6j6J6j6K0k8L2l2L8m6N2o0O8p6Q5r7J11j23J36j53J72
39I1j90K08k30K56k82L10l43L78m16M59n05N55o12O76p48Q28r20J025j148J295
59F87j471J687j962K321k807L505m579O409j0069J9912r1187k36143L60518K20379
73B67200l38557j19301L40175J4248l57954M8517L57239r1578l26288J18097K71759
84A83557j46748k02712J76981J43439j98135r3788J98667N1983j81248j1322J49109
95F9783k7222j12909N9795P6306p9468m0416Q5462L447p8480L3042O2950o6478
107a4188m1793R2733J6690j09677J2051J16500m2829j14419P3219J05076j00331
118f968q9635J21733O8932j35835m4552J42434J8536j42031O927J35064k9552
$$ plain form
0 0 0 0 0 0 0 0 0 0 0 0 0 0 0 0 0 0 0 -8 8 -8 8 -8 12 -16 16 -16 22 -24 28 -32 36 -40 45 -52 59 -64 72 -81 91
39 91 -99 109 -121 135 -147 163 -180 198 -218 241 -264 291 -321 355 -393 435 -485 540 -608 687
59 687 -784 903 -1059 1262 -1545 1960 -2619 3790 -6279 13633 -77554 -313697 46821 267200
73 267200 -71357 -190658 149517 163765 -194189 -145672 211567 119989 -206299 -88202 183557
84 183557 36809 -165903 11078 154517 -43618 -137406 61261 113244 -68004 -79326 69783
95 69783 42561 -70348 -10553 65753 -13715 -54131 31331 34778 -43702 -10660 52290 -14188
107 -14188 -55981 36752 53442 -56235 -44184 72316 29487 -84932 -11713 93363 -6968
118 -6968 -96603 25130 94062 -41773 -86325 56109 74645 -67386 -60459 74605 45053
129D5053j22118M7399J04511n9511q3875O5570O1981o5372m0854N9120K2415m7596
141a3277p974L1827j500j3122N094o638k557K5706n894m2609J9871N5808l8509
154F226o3981O0363O6241q3815o2081J07236N1263j28849l4056J46838J1457j59805
166h2963J5303J66564m4737j66214P5001J58415j04178j43383J30433J21832j52069
177b5996r4889J67674O4015j76215l1014J77241k289j70707L4084J56947o2534
188C6317j36866Q6138J11701j03780q2859J14621N1958j18198k0802J14568q917
199D3881j04172L5708Q7653n8097o6109P4933M0923q5413j3692Q9186j4063q6035
211e5297M0575P6381o4284o1003Q3843M0979r8129j7620J06285p413j07985L2449
$$ plain form
129 45053 -77065 -29666 74845 15334 -68541 -2971 59010 -6362 -47216 11904 34319 -13277
141 -13277 -21251 10576 9076 -4046 1048 -5590 -8147 17559 11665 -30944 -11073 44735 6226
154 6226 -57755 2608 68849 -14966 -77047 30189 81452 -47397 -81453 65385 76842 -82963
166 -82963 -67660 98904 54167 -112047 -37046 121369 17191 -126192 4241 126073 -25996
177 -25996 -120885 46789 110804 -65411 -96425 80816 78527 -92180 -58096 98851 36317
188 36317 -100549 -14411 97290 -6490 -89349 25272 77230 -40968 -61770 52798 43881
199 43881 -60291 -24583 63070 4973 -61136 13797 54720 -30693 -44385 44801 30738 -55297
211 -55297 -14722 61659 -2625 -63628 20215 61194 -36935 -54555 51730 44317 -63668 -31219
223c1219J03407n5951r3022P6460P7646r2711n8512J03854L7006j09427j4584
234e7053J09328p310j03813K7247R3534m4056p9467N6931O2654o5236m4318O8658
246A7099K5782o7304q249O1498p136n1897J9470L9308k7972k4832L2256R577l2150
259a4550N294K7777j8629j9578K9405Q309l6788N095M0209j9544l9399L3877L4361
272C5839m6885k5496N7521J3453o4928R09O8411j6475o7676L2091O2749m6648
284B865n3900N9114M1656o8587k6839P4387J0449p6131O518P3670k2978o7133
296d6909L7877N6947n0312m3720N9532K8243o4960j1448O6277n662o3372K2026
308a5481N6393l6577m5829M8432L2331n6859j6740O1305P1o1482J6574N7361l2048
$$ plain form
223 -31219 72188 16237 -76785 -325 77321 -15390 -73902 29952 66958 -42469 -57053
234 -57053 52275 44965 -58848 -31601 61933 17877 -61590 -4659 57995 -7241 -51559 17099
246 17099 42881 -24423 -32672 28826 21690 -30207 -10737 28571 599 -24233 8023 17600 -14550
259 -14550 -9256 18521 -108 -19686 9719 18028 -18760 -13665 26544 7000 -32399 1478 35839
272 35839 -11046 -36542 20979 34432 -30496 -29587 38824 22349 -45327 -13236 49513 2865
284 2865 -51035 8079 49735 -18852 -45691 28696 39145 -36986 -30468 43202 20224 -46909
296 -46909 -9032 47915 -2397 -46117 13415 41658 -23302 -34750 31527 25865 -37507 -15481
308 -15481 40912 4335 -41494 6938 39269 -17590 -34330 26975 27046 -34436 -17862 39499 7451
321G451m9290M5365L7808n5615k3771O2160Q138o4609Q010O2866k3585n7130L7570
334d632M7818m9007l5681N7262K1558o1829o422O2526q721n9437K2933N2841l5367
347C842m3213M5267L1198n2069j7590N5390L325n5125J0745N1300k3715m4230
359c4875L4768L4414m3223k2509M8558R289n0401M277M8678j7288m3524K8825
371c011L5372l8098k4819M4511J2627m7625L19M7253j3083m3464K4750L6582l4487
384c173k7169M1692J5876m5875l532M6785q958m4475K0841L9057l1268l0971L9587
397H417K0780m5298r156M8050l167m7685J5376M4269k6742l7978L6500K9222m4068
410a1480j8567M8972O681n0852N657M9619j7632m5362K8504L8357l7551k9082
$$ plain form
321 7451 -41839 3526 41334 -14281 -38052 24108 32246 -32363 -24353 38513 14928 -42202 -4632
334 -4632 43186 -5821 -41502 15760 37318 -24511 -30933 31593 22872 -36565 -13632 39209 3842
347 3842 -39371 5896 37094 -14975 -32565 22825 26150 -28975 -18230 33070 9355 -34875
359 -34875 -107 34307 -8916 -31425 17133 26422 -23979 -19702 28976 11688 -31836 -3011
371 -3011 32361 -5737 -30556 13955 26582 -21043 -20724 26529 13446 -30018 -5268 31314 -3173
384 -3173 -30342 11350 27226 -18649 -22181 24604 15646 -28829 -7988 31069 -199 -31170 8417
397 8417 29197 -16101 -25257 22793 19626 -28059 -12683 31586 4844 -33134 3366 32588 -11480
410 -11480 -30047 18925 25606 -25246 -19589 30030 12398 -32964 -4460 33897 -3654 -32736
422c2736M4185J8171m7961o399M8693n460m6365J6576M1200k6216l3638L3777
434C827K4244l8826j3652M1042K664m0383P955L7006j7550l1204K5502K3431l1338
447g282j4262L4735M314l5520N737L3689j5247k9348K3544K2896l0133j4726L4567
460A2964N400l6532M441L5896j4119l2718K2991K7186l0427j9625L5832J0639
472B1928l8870q51L9331r088l7159J8464L2480k6565k5688L2876J7255l6964p794
485b0645L8546k041l7555J1530L4148k0092k8557K7167K1177l2294j2539L5159
497A4004L280l5702O119L3823j4975k9709K2734K3654k8926j6038L3166P368l5204
510a6406J839L4878j0961l2213J9394K7392k6603k0703L2075J2581l5438l598
$$ plain form
422 -32736 11449 29620 -18341 -24740 23953 18493 -27872 -11296 29904 3688 -29950 3827
434 3827 28071 -10755 -24407 16635 19299 -21084 -13129 23877 6327 -24877 625 24056 -7282
447 -7282 -21544 13191 17505 -18015 -12278 21411 6164 -23184 360 23256 -6877 -21603 12964
460 12964 18364 -18168 -13727 22169 8050 -24668 -1677 25509 -4918 -24543 11289 21928
472 21928 -16942 -17793 21538 12450 -24709 -6245 26235 -330 -26018 6858 24113 -12851 -20645
485 -20645 17901 15860 -21695 -10165 23983 3891 -24666 2501 23678 -8616 -21155 14004
497 14004 17284 -18418 -12299 21524 6549 -23160 -426 23228 -5698 -21736 11430 18798 -16406
510 -16406 -14567 20311 9350 -22863 -3469 23923 -2680 -23383 8692 21273 -14165 -17763
522a7763L6504n668l5165J4589L1496k2531k5771K8934J8434l3416j0009L5713
534A5347J015l5641P860L3318j6029k8957K3010K2856k8343j5462L1706P343l2977
547a4954R86L2114q964k9245J6146K4558k2015j8440K6225J1333k8596l633K8886
560A4401m067k7167J1258K3565j7448j8353K2254J1825k5294m458K6323l171k5296
573a5628J0560K2251j7179j7356K2459J1015k6060l691K7746m151k7335J1946
585e423K4844j9101k0472K5148J4533k9691p417L2449m34l3199Q473L1944j6185
598E469k8819K3173K3933k8942j7655L3172J0350l5619k493L6187n528l4782J3163
611h391L1523j9969k6624K5558K0368k9588j3137L1786N415l2012K294L0322r528
$$ plain form
522 -17763 18741 13073 -22092 -7503 23993 1462 -24309 4625 23059 -10357 -20366 15347
534 15347 16362 -19279 -11419 21899 5870 -23087 -77 22779 -5564 -21026 10680 18023 -14954
547 -14954 -13968 18146 9182 -20063 -3917 20641 -1374 -19814 6411 17744 -10852 -14485 14401
560 14401 10334 -16833 -5575 17990 542 -17811 4443 16268 -9026 -13484 12839 9668 -15628
573 -15628 -5068 17183 4 -17352 5107 16122 -9938 -13629 14117 9966 -17369 -5423
585 -5423 19421 320 -20152 4996 19529 -10162 -17579 14870 14436 -18763 -10290 21654 5469
598 5469 -23350 -177 23756 -5186 -22841 10331 20681 -14938 -17431 18756 13228 -21554 -8391
611 -8391 23132 3163 -23461 2097 22465 -7123 -20260 11526 16941 -15071 -12777 17545 8017
624H017k6806J5809K1707k0708j5410K3921Q364k5298j039K4772o038k2419J2391
637b737J8492j7660j3282K1529P149k3766n59K4310o064k3160J2257K0492j7683
650f82j6505K2021J1490k5009n838K6537j08k6543N949K5082j1324k2268J5869
663a329J8345j9290j3619K1428Q412k2125l119K1370j850j9267O137J5963r397
676A659j1788J1419P064j1989k246J1151k323q935O205N563r122j308J0805l502
690B653j1109Q488R965j3225p477J7360L804k0607Q70K2646o166k3360J1807K2618
704A8267j7370k0488K2570J6985k7005j2304L0377O734l2481n35L3135n951l2210
717b0276J2291K9791j8161k5912K3155K0772k6936j4686K9230Q034k9914j208
$$ plain form
624 8017 -18789 -2980 18727 -1981 -17391 6530 14894 -10404 -11443 13329 7291 -15128 -2737
637 -2737 15755 -1905 -15187 6342 13491 -10275 -10834 13476 7412 -15748 -3491 17001 -682
650 -682 -17187 4834 16324 -8685 -14523 12014 11906 -14637 -8688 16394 5070 -17198 -1329
663 -1329 17016 -2274 -15893 5535 13947 -8178 -11297 10073 8223 -11044 -4907 11056 1659
676 1659 -10129 1290 8354 -3635 -5881 5270 2947 -5988 217 5780 -3342 -4650 6155 2653
690 2653 -8456 32 9997 -3228 -10705 6655 10459 -10148 -9278 13368 7202 -16158 -4351 18267
704 18267 897 -19591 2979 19964 -7041 -19345 11032 17766 -14715 -15250 17885 11934 -20276
717 -20276 -7985 21806 3645 -22267 888 21660 -5276 -19962 9268 17302 -12612 -13820
729a3820K8941n417k6305J1362K2197j6238j6940J9811J0816k1832m235K2211
741A0551k383k0949Q590J8230j4121j4145J8564R039k1709l240K3438k920k3686
754a4741R083K2449j4870j9842J9975J6053k4149j1311K7164N906k8868j46K9169
767A5872n579k8130J0972K5816j5718k2421J9538J8182k2204j3450K3666Q479
779A5023k3828l663K2774o74k0681M290J7746o975j4238Q602J0478r117o773Q592
793A556L411p170o17N021j436k319K605o53k839L632K145o324o07Q514j614j0088
809f783M345J0870p389j0743J0466R739j3390p857J5887N189j7730j919J8741
822I426j724j8819N518J7885r162j5964J2406J3112j4940r544J6589N503j7231
$$ plain form
729 -13820 15121 9704 -16601 -5239 16958 720 -16220 3591 14407 -7425 -11660 10551
741 10551 8168 -12781 -4191 14039 -82 -14227 4337 13376 -8333 -11573 11865 8945 -14741
754 -14741 -5658 16791 1921 -17921 2054 18107 -6042 -17353 9811 15717 -13151 -13297 15872
767 15872 10293 -17837 -6865 18951 3233 -19188 350 18532 -3672 -17122 6544 15023
779 15023 -8805 -12468 10306 9632 -11049 -6759 10987 4012 -10226 -1624 8854 -263 -7036 1556
793 1556 4967 -2203 -2820 2201 765 -1554 1051 398 -2441 1191 3336 -2988 -3595 4919 3305 -6783
809 -6783 -2438 8432 1043 -9700 766 10505 -2885 -10742 5145 10334 -7396 -9315 9426
822 9426 7702 -11117 -5599 12286 3124 -12840 -434 12678 -2262 -11806 4783 10286 -6945
835f945j225J6748k974j5150O799J2549r982r104J2297N055j3597o48J3785l820
849C788j2849Q065J0838j1848p883J4916M150j7070J22J8209m719j8264R392J7163
863A4010j3819j5004J7796J1862k1075p898K3435L353k4723J521K4882o463k3863
876a5986J1188K1730j5397j8593J8825J4662k1296j0172K2657N433k2870p32K1946
889A1395l651j9998P473J7173j0517j3684J2598R801j3675n807J3762J917j2865
902f078J610J1117m563q729O832N829q271k649Q844n69q553L641P431o322n627
917f057Q486L250r945m94J0639k455j0496N322R553p932p880J0079N606j1586
931c910k914J2341J6j2300K878J1420n513r844P724P661r315n052J0180K225j0287
$$ plain form
835 -6945 -8170 8578 5604 -9546 -2747 9802 -180 -9284 3013 8068 -5529 -6177 7608 3788
849 3788 -9061 -996 9842 -2006 -9889 5027 9177 -7893 -7771 10438 5719 -12545 -3153 14010
863 14010 191 -14813 2983 14845 -6230 -14128 9307 12660 -12063 -10542 14340 7877 -15986
876 -15986 -4798 16932 1535 -17058 1767 16429 -4867 -15039 7618 13051 -9819 -10551 11395
889 11395 7744 -12254 -4781 12392 1875 -11809 789 10590 -3085 -8892 4870 6787 -6078
902 -6078 -4468 6649 2086 -6643 189 6018 -2253 -4902 3942 3373 -5180 -1539 5892 -430 -6057
917 -6057 2429 5679 -4266 -4760 5879 3424 -7072 -1750 7803 -129 -8009 2070 7676 -3910
931 -3910 -6824 5517 5533 -6767 -3889 7531 2018 -7826 -102 7559 -1756 -6808 3372 5597 -4690
946d690O19R629l272q260N545O302p286l899Q405J185q767J608Q406m306p342
961f123O744N625q725l402J0179P43j0936K156J0938n103j0162P866Q677j0308
975a831o521J2237L813j3479p55J3938k464j3588N629J2393q497j0473J0895P915
989I212j2612m946J3606J727j3773J525J3111m565j1714P255R650r395p081J0852
1003B852M211j1600j170J1583j814j0840M567R431o937p436Q764N025j0006k310
1017e680J0523n11j0308L255R397n756p837P834N730r337l240J0196N18j0332
1031e548K247R705m839q381P066O474q781m081R850J417j0214J343R828l988q758
1046f660O351P072q254m893R591K367j0265L00J0262k951r594N434Q306p594o466
$$ plain form
946 -4690 -4071 5558 2286 -5974 -429 5873 -1413 -5312 3093 4278 -4489 -2881 5525 1219 -6123
961 -6123 621 6246 -2479 -5881 4298 5041 -5895 -3739 7199 2096 -8066 -200 8477 -1831
975 -1831 -8352 3885 7698 -5781 -6536 7402 4938 -8650 -3021 9372 875 -9598 1297 9212
989 9212 -3400 -8346 5260 6987 -6786 -5261 7850 3285 -8429 -1174 8476 -919 -8000 2852
1003 2852 7063 -4537 -5707 5876 4062 -6778 -2211 7220 283 -7153 1611 6636 -3370 -5680
1017 -5680 4843 4332 -5976 -2721 6676 920 -6917 917 6647 -2690 -5930 4266 4784 -5548
1031 -5548 -3301 6404 1565 -6816 250 6724 -2057 -6138 3712 5129 -5085 -3742 6086 2098 -6660
1046 -6660 -309 6763 -1491 -6384 3207 5574 -4691 -4391 5871 2920 -6674 -1240 7066 -528 -6994
1061f994R264M236j0406j710J0877r00j0726L503R917n895q502P929O570r462
1075b299m266J0418J704j0693R16J0319l454r264N696P643p507n561Q755L174
1089E581r360o45R300j857q583M131P292o039n536P487L399q355j091Q619j250
1104C093q280L477P392n470n995P052M233q172k216Q790L1q846K133Q357m140
1119A439p343N876N913p252m114Q135K098q461k7Q261k010p499L814O246n241
1134a65m621O230K725o673p38O570j223n927K994M772m431l196N415J358n902
1149b812O22N815k572n185M337M071n804k583O907P82p524J195P647l228p232
1164e564N167O321o900m970Q340L237r358j226R894r59r890L186R318n292q227
$$ plain form
1061 -6994 2270 6506 -3900 -5610 5267 4367 -6359 -2856 7061 1166 -7336 593 7163 -2299
1075 -2299 -6565 3853 5557 -5136 -4220 6099 2645 -6619 -923 6720 -787 -6348 2407 5581
1089 5581 -3779 -4424 4876 3019 -5564 -1433 5859 -180 -5716 1771 5170 -3185 -4276 4343 3093
1104 3093 -5187 -1710 5682 212 -5783 1269 5502 -2670 -4886 3904 3935 -4911 -2778 5579 1439
1119 1439 -5904 -28 5885 -1367 -5481 2654 4752 -3709 -3736 4525 2515 -4984 -1170 5076 -165
1134 -165 -4786 1444 4169 -2504 -3242 3328 2105 -3822 -828 3944 -487 -3683 1732 3090 -2812
1149 -2812 -2190 3625 1053 -4132 205 4276 -1528 -4111 2796 3578 -3946 -2751 4896 1668 -5564
1164 -5564 -397 5924 -976 -5946 2394 5631 -3727 -4953 4941 3982 -5908 -2722 6596 1304 -6923
1179f923P151O642q618m690R624K471j0082j17R915k195r177M318P901o106o176
1194f062P437M143q241j930Q491l44q157K506P283m408n945N946M248p042k293
1209d368P658K10p735J862P289l795o392N505N063o858l411P791J544q266M51
1224c452Q216k416p692M232O699n782n339P001L660p752j806Q016j06p763J892
1239b392P080l496n971M781M548n661k903O074J202o029M53N545j955m653L173
1254b04L455m042k050M530N14m580J018M200k406l478L591K427m506j106N041
1269B404l47n227J901M955l365m315M713L275n777j924O494L76o840J295O739
1284D357k971o196M530N227n844l915O845K335p458n63P589j224p272K942O520
$$ plain form
1179 -6923 228 6870 -1748 -6438 3186 5657 -4425 -4542 5373 3178 -5999 -1681 6220 114 -6062
1194 -6062 1375 5518 -2723 -4653 3838 3494 -4663 -2157 5126 718 -5227 719 4967 -2075 -4368
1209 -4368 3290 3500 -4235 -2373 4916 1121 -5271 234 5297 -1561 -4972 2819 4363 -3903 -3452
1224 -3452 4764 2348 -5344 -1112 5587 -195 -5534 1467 5127 -2625 -4431 3585 3479 -4284 -2392
1239 -2392 4688 1192 -4779 2 4550 -1111 -4014 2060 3262 -2767 -2314 3231 1276 -3377 -204
1254 -204 3251 -791 -2841 1689 2203 -2377 -1359 2841 435 -3043 548 2975 -1531 -2637 2404
1269 2404 2057 -3170 -1269 3686 321 -3994 719 3994 -1783 -3707 2787 3163 -3677 -2382 4357
1284 4357 1386 -4810 -280 4947 -897 -4812 2033 4368 -3090 -3653 3936 2712 -4560 -1618 4902
1299D902m453n392N680L953o539k312O979N78o991J126O572k711n765M096M624
1314D347n183l230N916J663o263k4O191j564n745L073M901m357l722N335K303
1329C641n949p24O163r13n931K474N314l892m302N017L012n813j524O213p0o178
1345c462J615N757l048m960M260L846n161k521N695J083n843L66N618j739n036
1360c530K929M165l872l081M548J806m858m71M816q28m422K019L733l046k762
1375b854L796J587m218l06M323j038m053K329L422l449k485M335J282m896Q5N098
1391B958j540m911K943M348m230l423N281K230o029q17O393o82o409K208O015
1406D335l602n307M840M271n795l038O496J619o818j26O773j327o402K708N690
$$ plain form
1299 4902 449 -4943 737 4690 -1849 -4161 2818 3396 -3595 -2469 4103 1392 -4373 -277 4347
1314 4347 -836 -4066 1850 3513 -2750 -2774 3417 1853 -3892 -819 4082 -275 -3997 1338 3641
1329 3641 -2308 -3032 3131 2218 -3713 -1239 4075 183 -4119 898 3910 -1903 -3427 2786 2716 -3462
1345 -3462 -1847 3910 862 -4098 162 4008 -1153 -3674 2021 3104 -2739 -2373 3245 1506 -3530
1360 -3530 -601 3564 -308 -3389 1159 2965 -1893 -2364 2452 1624 -2798 -779 2954 -92 -2854
1375 -2854 942 2529 -1689 -1995 2328 1290 -2763 -434 2988 -461 -2946 1389 2671 -2225 -2140 2958
1391 2958 1418 -3493 -550 3798 -432 -3855 1426 3656 -2373 -3190 3203 2521 -3888 -1680 4335
1406 4335 733 -4574 266 4537 -1258 -4296 2200 3819 -2999 -3125 3648 2321 -4081 -1373 4317
1421D317l892m713M841L507n498k159N825P14n795P04N399k012m681L141L676
1436C374l989k468M529J124m713K53M524j553l996K708L175l635k124M260R36
1451B405m571L21M550j561m194K665L586l598k744M301J732m725o42M880m70m744
1467b809J524M345k463l710L229K862l750j920M027R02m027R8L768j042l238J828
1483c76K502k396j614K716O22k749L75K492j311j959K110J187k666k37K980q10
1499H66k983J868K684k869k098L701J289m345k81M719q29m802J947M635l085m143
1515c726M076L423m935k467N560J357n914j69N987j067n764K259N279l369m496
1530c966M277L512m964k330N352J060n443K38N219j476m679K585L874l491k830
$$ plain form
1421 4317 425 -4288 553 4060 -1438 -3597 2228 2942 -2853 -2149 3250 1238 -3443 -302 3374
1436 3374 -615 -3083 1446 2570 -2143 -1890 2634 1081 -2915 -207 2968 -667 -2791 1469 2405
1451 2405 -2166 -1845 2705 1144 -3050 -385 3201 -397 -3141 1160 2892 -1833 -2475 2405 1935 -2809
1467 -2809 -1285 3060 597 -3113 116 2978 -772 -2692 1335 2237 -1790 -1692 2076 1034 -2204 -376
1483 -376 2126 -270 -1884 832 1454 -1295 -920 1572 261 -1698 412 1599 -1067 -1304 1676 866
1499 866 -2117 -249 2435 -434 -2532 1169 2458 -1887 -2168 2551 1722 -3080 -1133 3502 417 -3726
1515 -3726 350 3773 -1162 -3629 1931 3288 -2626 -2795 3192 2125 -3639 -1380 3899 530 -3966
1530 -3966 311 3823 -1141 -3471 1881 2941 -2502 -2264 2955 1479 -3200 -615 3259 -232 -3062
1545c062M133J631m470l54M454q87m135K046L530l049k692L806J664m300n12M494
1561B297o52m410J781M048k813l441L679K633m328j666M723O28m866M21M765j443
1577A356m411K389L814l153l041L713K137m027j172M103K00l927P20L494j505
1592F90k868K099K095k467j252K590L84k470M33K119j135j575J650R02j984j24
1608i13K082o52j946J373J643k029j133K521M92k833K36K964j012k881J768K606
1624B286k464k131L040J502l460p64L707p8l745R43L546j757l144K492K541l092
1640e78j771L495Q83l673P1L578r84l261J818K742k537k005L040J152l337k15
1656a582L391p26l186J604K776k371k168K996J407l409n63L621l40l609J247L349
$$ plain form
1545 -3062 1071 2702 -1768 -2122 2332 1445 -2690 -644 2886 -163 -2855 951 2615 -1685 -2197 2297
1561 2297 1645 -2765 -984 3064 251 -3190 489 3122 -1206 -2872 1851 2479 -2387 -1966 2799 1356
1577 1356 -3055 -666 3148 -5 -3046 667 2804 -1223 -2395 1708 1908 -2019 -1299 2195 690
1592 690 -2178 -79 2016 -451 -1703 887 1271 -1199 -766 1353 218 -1357 293 1195 -789 -913
1608 -913 1169 517 -1429 -56 1587 -442 -1575 946 1438 -1395 -1159 1805 793 -2088 -320 2286
1624 2286 -178 -2309 731 2233 -1227 -1991 1716 1638 -2107 -1164 2382 625 -2519 -27 2514 -578
1640 -578 -2349 1146 2029 -1644 -1573 2005 1021 -2240 -422 2320 -217 -2222 818 1970 -1367 -1582
1656 -1582 1809 1083 -2103 -499 2277 -94 -2262 734 2141 -1268 -1831 1790 1450 -2159 -912 2437
1672B437k075k919K807K291l370j526L740O71l927K36L892j140l614J964L129
1687B596k660k476L199J684l549q03L668j06l533R51L215j745k659K369J966k793
1703f76j173L003L43l011M90K786j232k378J868J797k328j132K612M08k708L30
1719a001K618j051k331J684J885k193j315K545O48k729L7K756p63k557J432K204
1735A869k009j704K472J045k728l34K813l98k717J117K411j754j927K264J323
1750A743k608o27K764j01k744Q28K519j488k127K030J601k446r64K686K72k744
1766a406M13K626j051k374J642J948k103j418K427Q22k602j76K617m72k459J072
1782d94K147j581j716K010J158k272n35K369j08k298P41K058j313j656J778J110
$$ plain form
1672 2437 362 -2557 250 2541 -829 -2355 1385 2056 -1871 -1635 2257 1117 -2497 -533 2596
1687 2596 -64 -2540 659 2343 -1206 -2009 1659 1553 -1980 -1029 2186 441 -2218 151 2117 -676
1703 -676 -1849 1154 1497 -1514 -1024 1762 530 -1848 20 1817 -511 -1643 969 1377 -1331 -1001
1719 -1001 1617 566 -1765 -81 1804 -389 -1704 841 1489 -1240 -1203 1553 790 -1767 -335 1869
1735 1869 -140 -1844 628 1673 -1055 -1389 1424 1026 -1691 -574 1837 83 -1844 420 1743
1750 1743 -865 -1492 1272 1171 -1573 -745 1774 286 -1841 189 1790 -656 -1620 1066 1338 -1406
1766 -1406 -993 1633 582 -1792 -150 1798 -305 -1723 704 1526 -1076 -1252 1365 893 -1566 -494
1782 -494 1653 72 -1644 366 1524 -748 -1283 1086 978 -1320 -579 1479 166 -1490 288 1398
1798A398k071n13K216j29k186P68J971j352j605J824J112k163n37K353q6k361
1814a361O97K213j283j913J773J495k148r88K408M17k528K04K471p95k271J343
1830b66J948j815j487K158R42k367l35K427k92k331R19K047j452j655J891J116
1846A448k190n14K353j65k307Q13K103j421j731J917J246k294o57K536qk585O71
1863g85K473j292k205J855J809k303j314K635P13k809q2K830n32k720J138K451
1879A862j648k080K075J611k405j048K581M43k605J43K481p00k231J186J857j579
1895e7j373J828Q45j957k86J917k34j743P28J433j104j042J388N61j509p5J507
1912H27l99j370Q27J141j201p90J442L96j600L9J634m76j549Q78J364j245j077
$$ plain form
1798 1398 -673 -1186 1030 901 -1285 -517 1454 102 -1503 321 1433 -730 -1267 1086 1000 -1361
1814 -1361 -664 1549 266 -1647 126 1621 -527 -1515 893 1310 -1218 -1014 1457 662 -1609 -266
1830 -266 1682 -133 -1620 538 1480 -887 -1222 1205 913 -1418 -499 1548 96 -1559 332 1448
1846 1448 -742 -1256 1097 932 -1375 -562 1541 120 -1611 306 1552 -742 -1399 1137 1129 -1456 -785
1863 -785 1688 396 -1809 46 1855 -448 -1762 873 1586 -1223 -1305 1525 993 -1727 -589 1862
1879 1862 214 -1866 209 1820 -585 -1633 948 1391 -1214 -1071 1410 710 -1521 -335 1522 -57
1895 -57 -1430 398 1243 -714 -1000 917 683 -1060 -332 1101 -3 -1045 343 904 -605 -680 827
1912 827 428 -942 -115 1026 -175 -965 477 873 -727 -688 946 470 -1079 -201 1163 -82 -1159
1929a159J533P06j699l23J794j31j754N54J605r36j362J272J019j515n87J647
1945F64J18j638L40J501p56j252J119R08j391m65J532Jj559M89J438r45j202J342
1963B44Q42j635m42J849n5j908N43J851j025j670J467J376j844j005K146N52k328
1980a042n4K377m51k325R72K156j445j859J852J457k163r88K362M65k426P8K359
1997A325n91k176J069J883j481j466J752J003j936m93J974j7j870M73J670q93
2013B26j355J198R74j406n38J493J01j469L09J351o81j153J007Q55j234m93J377
2030E62J17j413K49J376o20j213R35R84j209o74J385L37j476L7J468m19j335P43
2048a66J120j019q40J213M96j313j44J305k14j205N45J009q29p21J021L94j110
$$ plain form
1929 -1159 374 1080 -619 -942 852 721 -1033 -479 1126 190 -1172 100 1119 -396 -983 664
1945 664 782 -856 -516 985 229 -1023 96 1004 -387 -852 680 681 -878 -389 1049 104 -1098 244
1963 244 1086 -549 -991 858 803 -1105 -562 1289 264 -1406 61 1437 -407 -1412 734 1286 -1042
1980 -1042 -1096 1281 830 -1495 -523 1633 188 -1671 181 1638 -525 -1513 849 1314 -1112 -1034 1325
1997 1325 734 -1442 -373 1510 29 -1437 315 1318 -618 -1111 863 846 -1024 -551 1119 226
2013 226 -1129 69 1043 -363 -901 592 693 -776 -467 884 203 -950 57 912 -322 -815 562
2030 562 679 -734 -485 891 271 -942 -7 977 -232 -906 479 816 -660 -623 845 426 -909 -166
2048 -166 954 -65 -905 308 804 -509 -653 652 438 -767 -222 787 -42 -763 258 652 -458
2065d58m3J107l02j006O16Q32r00n51J083K53j204J01J235m61j170Q02J021j123
2083a68p72J362M80j551j25J659k79j665O83J546j045j364J385J073j663p26J865
2100F95L19j971J35J945n62j812R71J585j322j259J577Q91j740m78J803N8j770
2117i35L63J623p30j381J016J110j254p60J375L98j424k6J373l35j232O36J028
2134H45r07p56J089M50j205j23J226k14j167N48J015q36p89J057N07j193j83J253
2152F17j51j221M83J096p45q90R50O49j108l45J166N2j151K42J053n15q72O91
2170AO76q57m08R13J39r05J12Q33l55o91N62M95p11k57P91oq11K77P60n34o20
2191e96P58M34r45j84J059j00j111M18J075p19r55J001P73j253m79J395J75j494
$$ plain form
2065 -458 -501 606 304 -702 -86 746 -154 -705 378 631 -573 -472 763 302 -868 -66 955 -168
2083 -168 -940 422 902 -649 -774 885 606 -1059 -376 1170 125 -1239 146 1219 -444 -1170 695
2100 695 1014 -957 -822 1123 561 -1251 -280 1305 -17 -1276 301 1192 -548 -1026 777 835 -935
2117 -935 -572 1051 321 -1060 -44 1066 -188 -948 427 825 -599 -625 748 413 -819 -183 845
2134 845 -62 -818 271 721 -484 -607 619 405 -762 -214 801 -35 -824 233 740 -453 -636 617
2152 617 466 -755 -272 824 79 -811 139 788 -320 -665 501 553 -598 -356 697 182 -690 1
2170 1 677 -180 -588 325 464 -441 -329 504 149 -542 20 515 -196 -453 338 332 -479 -202 558 24 -596
2191 -596 162 596 -349 -533 526 426 -685 -267 808 89 -866 135 908 -345 -824 571 746 -748
2209g48J61J510n28j409Q33J236j109j005J341P07j504l57J556Rj536L24J436
2226I17o38j263R11J027j123p33J263M20j320q6J292k29j202N30J035p84q05R94
2244B06N21j109k25J170r8j155M32J020p16q19R37N87j113k95J198j4j204L15
2262c62J126o08r70Q28P83j015n18J099K66j143KJ121k52j034M81Q82o55o86P79
2281A24M77q50k46Q48J9p90J89P00l79n42N13L34n86j24O03q1n77L00M61m79l14
2302d00O28J04p03J03P33l49o77N86N60p81l78R10J84j015Q7J016l08r99N64Q84
2322G49p61p27R44N15j075k59J121J2j120K40J061m91r28O93P45q52n45R85K88
2341E95j031k8J025k47r65N08Q15p24o13Q96L58r92j01J047j79j014M71Q89p21
$$ plain form
2209 -748 -587 923 395 -1014 -181 1055 -54 -1059 282 989 -515 -872 684 693 -843 -519 917
2226 917 279 -984 -73 954 -169 -902 361 781 -539 -625 667 438 -764 -234 801 17 -788 206
2244 206 727 -382 -607 563 465 -690 -258 762 46 -773 164 751 -362 -657 541 527 -677 -362
2262 -362 764 156 -814 14 797 -218 -736 363 629 -514 -512 609 357 -677 -196 686 31 -655 124
2281 124 601 -249 -495 353 372 -418 -229 471 92 -450 63 397 -189 -313 290 209 -368 -68 393 -86 -400
2302 -400 228 332 -371 -268 465 116 -561 25 585 -196 -574 336 520 -495 -408 608 300 -699 -135 749
2322 749 -12 -739 205 720 -355 -614 507 519 -601 -361 700 209 -719 -26 719 -133 -678 307 595
2341 595 -436 -464 561 314 -651 -143 672 -52 -665 231 589 -403 -504 543 364 -650 -179 710 -11
2360a1p12R19N12j077k46J159m2j161L24J089n80r64Q28P61r90n48J102L00j158
2379d95l5J138k11j088M53R52o55p77Q08N68r13l36R56R9r41J43Q66l57p39N32
2399c2N72o75l58P65J35p84J11P16l17o16N08M66o52k62P29N0p50J42P38l68o30
2420e12N47M85o89l27P84J26q15P5P89k76p06M38N95n62m65O74K92p35r2P47j06
2441B67o92K65O26m45m74N67K94o19j29O81q7o47K76N75m54m61O11K80p23o9P53
2462C95j36p48L48O79n46n50P08L77q31j69Q84l3r05K59Q56m65p49O40O13p98
2482a71m15Q80K11r13rR24k02q66M07P51n78o02P14M26q21k08Q53oq49K45P60
2503E31m36o49O05M83p47k69Q12N7q52J79Q13l97p21O05N49p32l81Q61J46q94
$$ plain form
2360 -11 -723 196 708 -369 -615 544 502 -659 -335 754 174 -790 38 799 -191 -739 363 663 -495
2379 -495 -530 608 397 -691 -238 714 59 -718 90 658 -255 -591 365 464 -477 -334 532 175 -564 -32
2399 -32 540 -135 -493 272 407 -377 -266 450 133 -483 25 491 -161 -423 306 356 -394 -252 486 118 -512
2420 -512 35 520 -169 -496 288 414 -401 -326 463 187 -519 -81 514 -48 -513 161 453 -282 -374 373 267
2441 267 -425 -160 466 21 -453 114 408 -211 -340 341 254 -393 -117 458 4 -457 154 434 -289 -358 395
2462 395 259 -489 -141 538 -8 -558 150 527 -304 -473 411 378 -527 -268 588 123 -626 14 627 -171
2482 -171 -586 294 505 -408 -417 507 305 -561 -154 597 19 -583 131 557 -264 -472 381 375 -474 -229 531
2503 531 95 -554 51 534 -213 -482 330 387 -465 -286 527 130 -591 14 563 -169 -550 311 457 -437
2523d37P7Q78k76q15M79P01o42n58P61L90q44j77Q61j1q65K12P95l81o76N26N34
2544E32o34l70O89J85p22J2O88j92o11L46M89m70l43N67J60o00J5O01k08n27L66
2565b7M30m83k93N86J15o25P3O04k32n48L73M77n09l61O07J89o43l9O62j27o34
2586d05K73N60m05m41M98L12n70j85O28Mo06J50N53l04m43M14L34n15j83N64K7
2607B60n77J54N40l25m33M72K94n73j43O43l2o56K08O30m01n44N62M16o84k72
2627d61P72R3q13Q9P97k74p48M49O65o06n41P27L75q06j84Q29Pq39J95P79l65
2648A40o69M99N64o36l81P07K05p41j9P22j65o54L40N54m90m06N91K40o53o2O63
2669C49j23o30K96N45m49m19N57K56o27j01O67o1o63K44N83l70n05M97L92n82
$$ plain form
2523 -437 -360 518 242 -573 -94 607 -35 -593 168 558 -286 -463 398 387 -478 -266 529 148 -528 -2 532
2544 532 -102 -472 217 402 -320 -308 380 188 -423 -77 412 -58 -401 166 326 -274 -259 342 134 -393 -27
2565 -27 403 -80 -373 213 328 -297 -224 380 148 -400 -27 450 -59 -420 187 376 -267 -306 356 229 -405
2586 -405 -132 428 23 -418 80 392 -178 -363 265 269 -337 -187 366 62 -381 33 367 -148 -331 233 260
2607 260 -317 -163 377 52 -381 91 385 -188 -331 312 280 -376 -168 462 61 -483 79 495 -189 -461
2627 -461 311 404 -409 -320 477 203 -545 -96 569 -37 -578 149 524 -282 -466 363 370 -469 -274 505 140
2648 140 -529 -30 534 -102 -483 224 429 -312 -331 391 226 -428 -88 466 -24 -430 161 401 -252 -314 349
2669 349 226 -404 -108 437 -12 -431 126 382 -245 -346 321 260 -403 -159 424 54 -451 46 438 -144
2689a44k53O47R1o39L3O46j87n89L31M84m33l76N19K29n48q5N48p4m91K01M01
2710C11k97l11L78J79m28l8M18r4l99K35L21l51k01M27P5m65P5M62k03m44L44
2731fL60m55k42N36J20n83J0O07j49n78L01N17m24m41N50K90o04j77O58K2o68
2752c56J33O37k87n61M14M59n35l20O02J67o39qO39j58n78L11M92m45l65N38K26
2773C66n98o1O19j08n96K76N26m08m20N18K91o06j34O39k1o42J69O14l18n37M48
2794A7M27n48l00O09J61o50j7O48j39o11K71N53m02m47N07L17n56j77N89Nn47
2815b90J17N15k57m18L47L09m18j72M39M6m33Q8L89k07l23L12K04l55j07L94k3
2836A57l91J37L57k35l02L32K14m12j09M55j9m53J19M40k36l91L58L16m45j98
$$ plain form
2689 -144 -397 250 341 -298 -265 381 194 -395 -64 420 -13 -389 130 359 -189 -274 274 200 -291 -90 311
2710 311 14 -297 81 260 -168 -206 212 118 -281 -46 275 -76 -277 150 225 -240 -165 297 94 -350 -6
2731 -6 354 -101 -343 193 313 -270 -260 347 198 -380 -79 438 14 -427 123 413 -191 -368 290 312 -356
2752 -356 -223 414 127 -434 -20 439 -96 -416 186 353 -286 -294 345 187 -391 -80 412 -33 -398 140 366
2773 366 -232 -293 326 218 -378 -102 424 16 -404 114 405 -201 -335 304 283 -359 -190 424 106 -431 17
2794 17 444 -104 -404 205 366 -284 -301 347 208 -403 -132 421 19 -428 79 396 -160 -337 252 257 -290
2815 -290 -173 342 85 -333 14 323 -95 -267 172 218 -215 -127 262 55 -268 44 248 -107 -214 180 157
2836 157 -234 -97 260 25 -277 55 269 -143 -252 203 184 -269 -150 290 54 -337 21 337 -108 -306
2856c06M95R8n33L3N36j73m92L08M06m02l14M84J88n42l3N28q8n09K25M38l50
2877cl47M43K29n06r0N14m7n10J85M65l06l84M12K79m81j67N40L1n55J11N29k38
2899A04m88L72M03m73k80N43J60n91k5O08j17n77K52N15l65m45M70L14n41j82
2919c43N78K8n59J00N21k25m55L24L75m24k44M69J13m76PM53j29l84K24L21k99
2940b5k27L66J14l84KL71j00l43J96K85k73k12L29J24l78k1L86p8l83J91L25k87
2962b2k52L64J54m13n5M37o7m11J59L81k63l04L48K04l88j01M19j7m17J22M02
2983B80k24l38L24K40l78j36M05L7m12O2L95j71l61K76K81l51j97M04Q7m29K1
3004a85M32j45l94K50L42l34k78M07J77m64m8M76o5m66J79M32k89l52L75K59m27
$$ plain form
2856 -306 189 287 -246 -213 323 150 -342 -34 372 -30 -344 140 328 -214 -247 281 193 -316 -91 347 -3
2877 -3 -350 93 322 -184 -274 240 193 -317 -132 333 27 -357 55 334 -147 -314 226 257 -298 -187 342 104
2899 104 -384 -12 391 -82 -362 181 341 -250 -275 333 216 -361 -109 406 41 -404 66 380 -161 -343
2919 -343 235 263 -296 -196 325 100 -355 -31 344 -80 -324 145 258 -218 -211 242 113 -271 -47 274 -25
2940 -25 -252 114 228 -156 -154 217 117 -226 -30 255 -18 -230 99 223 -155 -176 210 132 -251 -60 265 -22
2962 -22 -274 90 244 -169 -224 213 146 -265 -106 275 12 -292 56 260 -128 -229 190 173 -244 -122 280
2983 280 56 -282 42 282 -96 -232 173 210 -202 -140 255 84 -277 -1 280 -71 -268 136 223 -206 -185
3004 -185 247 102 -292 -42 300 -34 -312 95 272 -192 -240 236 171 -295 -116 316 27 -325 50 309 -118
3025a18j63M83L7m80O5M76j90m04K82L26l63k36M12J26m31k1M30r8l88J81L32
3046B58k62k72L30J84l76p6L85k6l60J07L45k15k65K74J86l16j01L56Ol73J16
3067i5L30j86k85K78J98l26j12L58K5l75P9L48j66l11K43K32l07j49L41O3l68
3088a85L4L49j15l18J99K72k72j89L22J03l55rL53p1l33J65K90k35k38L05J56
3109B28l42o2L55l2l37J20L13k10k65K83J94l37j05L71%l81J00L59k07l03K75
3130A7K36l44j47L82M8l83M1L76j40l42K20K92k90k11L47J22l64l9L70n1l52J48
3152f4L07k15k61K81K03l31j18L48K2l52P4L27j63k86K17K34k81j45L01O7l31
3173a66L3L24j32k86K00K28k61j50L13N7l16L2L09j12k80J91K31k42j74K91R3
$$ plain form
3025 -118 -281 202 239 -241 -176 300 110 -294 -12 314 -49 -285 127 253 -178 -199 231 133 -255 -74 258
3046 258 -4 -276 54 238 -138 -214 171 145 -215 -108 237 22 -243 31 217 -99 -200 156 162 -211 -95
3067 -95 235 49 -236 42 240 -86 -198 160 185 -190 -111 237 71 -240 3 235 -72 -221 120 183 -185
3088 -185 -151 198 83 -235 -36 236 -36 -225 97 200 -155 -164 189 118 -215 -50 240 5 -233 72 228
3109 228 -114 -176 179 147 -190 -70 243 33 -232 51 245 -92 -197 174 174 -207 -107 252 45 -258 17
3130 17 253 -91 -238 144 192 -191 -150 226 86 -256 -36 256 -34 -245 102 224 -140 -179 191 140 -212 -64
3152 -64 243 28 -233 48 251 -80 -198 150 172 -180 -106 221 58 -228 -11 223 -58 -203 98 165 -166
3173 -166 -133 191 59 -227 -27 201 -60 -210 103 160 -156 -124 185 73 -207 -16 215 -27 -201 90 183
3194A83l02j3L13n3l23J39K80k14k11K59J42k99p4L06kl20R8K93j70k53K27J94
3216B00k67j32L13M4l26M6L15j44k57K02K18k59j46K90P0l02OL21j02k94J90K34
3238B20k42j68K87R9l05l4L13m5l25J42K66k11k14K58J50l06p5L27Jl24P2L05
3260A91j53k54K12K07k59j46K99P3l18K7L11j00k76J67K23k09j64K50R2k91oK84
3282A60p1k50J33K25k09j62K43J05k75k2K60m2k66J09K41j95j58K12J27k50o8
3303a53K82j6k75R1K46j41k17K01J73k51r4K65L6k82M7K73j19k49J87J94k32j31
3325a65K57P6k86qK82q1k46J39K13k08j58K61Q1k70k7K85o4k60J34K17j76j84
3347a88K22J28k64m5K76lk80Q1K71j59k19K13J65k53j00K73L9k83M0K79j09k49
$$ plain form
3194 183 -119 -132 181 128 -195 -56 224 10 -201 58 200 -99 -173 133 131 -189 -91 202 32 -221 6 200
3216 200 -67 -199 114 158 -168 -122 193 49 -208 -6 212 -47 -193 97 167 -135 -129 192 90 -204 -14 220
3238 220 -22 -190 97 196 -109 -143 170 125 -200 -58 208 -3 -217 41 191 -115 -190 137 138 -186 -114 191
3260 191 38 -216 -4 203 -56 -202 97 170 -148 -121 190 90 -186 -19 204 -5 -169 81 173 -118 -124 160
3282 160 89 -161 -28 197 -12 -174 69 174 -101 -123 137 95 -171 -62 179 -16 -174 38 165 -85 -153
3303 -153 129 113 -162 -71 175 34 -183 18 191 -60 -154 111 147 -135 -88 185 66 -183 4 198 -34 -165
3325 -165 92 168 -118 -126 156 75 -171 -32 181 -27 -185 76 157 -113 -140 145 81 -179 -45 172 -4 -188
3347 -188 34 162 -102 -147 129 126 -154 -73 198 39 -180 33 198 -55 -155 118 157 -126 -86 193 84 -165
3369a65J57K07k37j34K48Q5k81qK71o2k55J11K37j85j76K31J12k50m0K55j9k47
3391a45R3K18j38j89J95J25k26n5K45kk43O6K12r8k16J76J53k18r5K28M3k50K1
3414a00K45r9k04J55J59j98j28K37P2k56PK39p1k29J43J95j90j35K10R8k42k8
3436a20K53m8k40J25K05j65j63J98J08k31m0K41j7k37P5K16j34j91J89J24k00
3457e2q9K33L4k55L2K40j00k15J59J83k10j14K26N9k51J0K52p0k31J34J94j72
3479cj57K25Q8k33k9K41k9k41J07K02j53j72J88J24k28o8K49lk37N2K27j18j93
3502a61J68J44j99r5K19K8k20K4K17o5k07J29J63j68j21K17O4k25oK31n2k15J04
3525b6J88j60j37J92Q5k12l9K34l8k01P4J82j37j54J95Q3j91n4K09j8k02P0J88
$$ plain form
3369 -165 -8 199 -38 -172 76 161 -120 -128 143 81 -174 -63 174 -11 -187 44 156 -94 -134 121 102 -145
3391 -145 -52 166 28 -161 34 159 -67 -122 123 121 -122 -56 156 58 -158 18 171 -47 -142 86 129 -121 -100
3414 -100 145 46 -158 -3 156 -42 -170 67 139 -117 -110 129 58 -171 -28 167 -23 -158 52 150 -92 -120
3436 -120 133 85 -155 -30 175 10 -153 45 153 -78 -118 123 106 -131 -56 160 26 -165 24 148 -52
3457 -52 -141 92 126 -129 -97 143 43 -172 -13 170 -40 -154 72 131 -120 -110 142 72 -159 -25 169 -3
3479 -3 -160 65 153 -80 -109 132 103 -138 -31 171 18 -154 34 158 -70 -138 111 108 -129 -77 150 32 -161
3502 -161 7 151 -48 -143 76 104 -116 -92 125 60 -147 -18 145 -23 -144 73 137 -88 -94 137 85 -130 -26
3525 -26 162 2 -135 57 142 -70 -109 125 87 -114 -40 142 5 -149 46 129 -62 -116 93 75 -127 -57 131
3548A31j26j50J54J14j81o9K17J0k18L8K14q8j80J39J49j75j02J92O7k22KK23
3570A39o6k11J12J70j49j30J80Q5k13l4K30l3k11Q9J75j28j54J77J02k07m7K18
3592I4j3k13P1J90j03j66J58J10j72p4J97L2k08L4J99p7j93J26J54j69j07K02
3614G2N1k04j3K08m3j93Q1J85j48j41J84P9k02l2K04j1j99O6J83j07j56J52J08
3637A24j83m5J95%j85M7J78j09j38J45J03j70o2J90J1j92M0J87q9j68J31J17j48
3660b1r7J76M8j93jJ92n1j81J00J61j40j30J74Q2j93l1K01j0k03O4J81j11j51
3683a34J59J14j84o4J96J1k00M7J86r1j59J32J20j66p5J85K4j88J9J81p1j59J03
3706a4J43j59q9J73M4j80OJ83m3j86Q6J68j26j39J66Q9j77m1J88lj94N4J83j07
$$ plain form
3548 131 5 -145 9 123 -58 -127 90 100 -118 -80 134 46 -134 5 154 -21 -123 69 136 -86 -84 139
3570 139 73 -138 -26 144 -5 -135 45 130 -83 -117 113 80 -131 -42 133 5 -149 28 130 -77 -124 94
3592 94 81 -132 -61 129 26 -140 18 128 -44 -118 79 111 -97 -63 136 59 -134 -8 146 -23 -130 72
3614 72 123 -81 -94 114 71 -122 -41 144 -4 -145 39 118 -84 -116 88 77 -122 -56 127 20 -136 16 124
3637 124 -59 -104 91 91 -94 -47 131 22 -116 29 132 -38 -100 90 101 -91 -51 136 47 -121 10 127 -21
3660 -21 -118 58 106 -87 -88 104 53 -128 -28 133 -7 -137 37 119 -74 -105 96 86 -117 -53 128 17 -134
3683 -134 25 139 -45 -109 87 98 -102 -55 131 40 -119 13 133 -33 -108 77 101 -87 -68 113 42 -117 -14
3706 -14 129 -30 -119 54 98 -82 -76 107 64 -122 -36 132 6 -133 33 122 -55 -96 92 89 -105 -51 132 25
3730B5j45J45J04j53p9J95Oj90M4J69q5j43J07J32j72p2J79K3j74PJ77o5j50R0
3754b5J40j44r8J68N9j75LJ68l9j67R3J35j18j21J67P6j65m1J93m2j71O7J75j08
3778C0j45J39J06j67o3J79J0j87L6J79r0j47J07J26j48q9J83L2j79OJ79n1j68
3801a22R6J49j40r6J67N1j78rJ73k5j58O6J51j08j25J45Q1j60l3J65lj73N1J56
3825A21r4j53J28J13j58p0J71K2j94L6J79p2j53J13J21j44r0J64M4j56LJ49m0
3848D0j43R1J29j18j02J52M5j59lJ52k2j53O7J32j00j12J36Q4j67l5J56rj70N0
3872e9J60r6j37J26J03j38o9J59K2j61K4J66o6j49J08J17j44q0J81K8j64LJ58
3895I2l2j61R4J28j17j05J44O3j62j4J60l5j53O6J34r8j18J21R7j61m8J67J9j87
$$ plain form
3730 25 -120 25 129 -24 -103 92 98 -92 -48 121 36 -107 0 132 -40 -112 67 90 -84 -77 100 35 -115 -25
3754 -25 115 -29 -127 41 100 -75 -72 96 57 -110 -17 118 0 -121 46 122 -43 -84 109 67 -104 -37 138 30
3778 30 -115 24 130 -37 -100 79 89 -98 -62 117 27 -120 -13 113 -35 -124 59 91 -88 -82 97 46 -122
3801 -122 -26 123 -17 -113 54 105 -73 -82 91 66 -92 -26 125 17 -108 37 118 -42 -75 90 87 -86 -35 121
3825 121 27 -126 2 115 -43 -113 58 80 -114 -78 101 29 -124 -11 110 -34 -124 40 84 -72 -69 80 40
3848 40 -103 -12 117 -1 -103 49 94 -65 -68 84 62 -91 -24 108 8 -104 32 116 -51 -86 70 61 -109 -59
3872 -59 101 5 -132 -6 97 -41 -110 49 71 -90 -66 100 34 -115 -7 110 -34 -114 67 95 -69 -66 92
3895 92 60 -101 -7 121 4 -101 43 106 -56 -70 90 55 -98 -32 102 4 -114 7 104 -57 -105 62 81 -106
3919a06M2J66p6j53J22J15j51p0J67M0j80J3J73m8j53Q5J34j23r2J52N0j67nJ56
3943I1l2j59Q1J24j12r2J31P6j64l0J53rj53O1J24r6j07J15Q6j36m7J53J1j51
3967h2L1J44p9j13J06J00j25o7J40L2j53J6J45m4j41Q7J04j10r0J55K7j45NJ39
3991H2l7j36P8J12j15q1J30N4j64lJ57l1j51P6J30j04r7J17P2j43l5J55Nj50M4
4016c5J40p7j17J03R7j28o4J56K4j70K2J61o8j42R5J13j18r5J39N6j51k3J64l6
4040D6j41O5J22r7j07J28P1j41k9J50j1j37M6J26q8r7J01Q5j19m8J43Kj40K9J39
4065I8m8j30Q5J00j20o4J37J7j30%J33m5j32P8J10j09p2J13N1j33j6J39j8j35
4089i1O3J08p9q5J09O4j25k9J38j5j27L9J25p5r4Q8Q0j13l7J24Nj25J4J25o6j06
$$ plain form
3919 -106 -64 102 26 -127 -5 110 -41 -111 56 96 -84 -71 102 54 -99 -14 120 -3 -95 57 107 -60 -65 91
3943 91 59 -100 -19 105 -7 -99 32 108 -56 -86 67 58 -95 -34 90 -6 -113 2 88 -48 -95 58 69 -82
3967 -82 -51 93 14 -99 7 107 -18 -85 55 87 -66 -50 95 51 -90 -3 101 -9 -99 56 83 -62 -57 82
3991 82 45 -91 -13 99 -16 -97 33 87 -77 -80 77 46 -105 -29 101 -3 -100 17 89 -54 -89 66 71 -79 -35
4016 -35 105 28 -89 14 111 -17 -81 75 99 -71 -49 112 44 -98 -3 110 -8 -103 36 92 -59 -82 82 46
4040 46 -95 -30 92 -5 -112 16 87 -54 -83 67 56 -81 -35 91 3 -94 7 92 -27 -75 68 70 -70 -41 98
4065 98 50 -80 5 105 -15 -79 58 75 -55 -55 78 33 -99 -21 89 -20 -92 21 72 -61 -77 62 44 -91
4089 -91 -28 80 1 -84 25 89 -36 -65 73 58 -69 -30 95 20 -74 14 94 -19 -56 68 73 -52 -38 87 21 -85
4115h5R6P4j14m5J21Oj29PJ46n9j09P6R0r7p6J22N8j40rJ48m9j26P1J18r7p8J15
4142C5N9j28k6J39j5j37N4J10o4j06R8P8j25m9J34J2j46L1J28n8j06P6Q6j16n1
4167h7J22L0j31QJ18l1j13P6R6r5p8J24N1j33j7J34pj40N3J17o8j06J00O6j17
4192b8k8J13K2j31J1J27p1r3Q7O7j06m4J09J7j11NJ19m8r9N6R5r2n2J06L6j10
4218d3KJ12k9j00N8P9p4p1J07L6r9l3J28k1j19O0J03q6q9R8N7j06m0J25lj19L7
4245c0J08p1q9P8P3r9l6J09J5j17K9J07n1q7N6R5j10l8J18J2j05rJ22l1j02O0
4271GR2r6o8R8N3j15k3J24k7j02L3J13q1q7R0N3j11l1J18Lj12K0J13m8j02Q2O6
4298F2q4n2J25J0j10RJ15l6r3O9P1p6o3R1L6j01j5J14k8j01M5Q7p2p2Q6M8j05
$$ plain form
4115 -85 11 85 -29 -74 47 53 -76 -69 77 18 -91 -15 75 -22 -98 24 82 -58 -67 81 32 -94 -23 95 -2 -80 35
4142 35 94 -34 -60 79 64 -73 -19 91 27 -79 19 97 -28 -77 57 69 -77 -46 82 24 -82 -6 80 -36 -87
4167 -87 35 65 -66 -58 60 29 -84 -8 88 -7 -85 39 90 -43 -60 74 67 -73 -20 97 29 -77 23 89 -28
4192 -28 -56 57 79 -52 -41 86 15 -78 9 76 -30 -74 35 52 -59 -54 65 17 -82 -26 69 -23 -75 31 67 -43
4218 -43 -41 71 42 -58 0 79 5 -66 41 77 -22 -55 73 52 -67 -7 96 10 -79 19 76 -30 -70 55 52 -67 -30
4245 -30 78 7 -82 -4 69 -30 -66 43 58 -59 -30 77 26 -61 -5 90 -20 -58 60 72 -33 -42 80 49 -53 7
4271 7 99 3 -65 33 86 -29 -52 72 45 -57 -24 89 8 -79 11 64 -47 -78 40 43 -69 -49 64 16 -86 -4 62
4298 62 -22 -74 51 61 -49 -40 75 39 -54 15 86 10 -53 38 74 -27 -42 72 44 -57 -12 75 3 -69 17 65 -40
4325d0j8J06j2j00L5R4n9q6Q5O3j07l1J00K0r7%J08l7q5O2O7q0m0J02K3j18J4
4352c1R7m0p6N3P1p2n7R1K2r7JJ04m1r3M1Q1p1n4Q5M1r9j2R6j4q2K2R9o9o6Q3
4382A3O0r6l6J12Mj01K0J12n7r6P9P1r3m4J01J0r8J9R1l7r1N7P6q2m6O8L4j03
4410e3lJ00j6j02N0Q9q2o5Q9M1q3k8J09Jr5L2Q0n7n9O9N5q9l7J06J1r6J2R3n1
4439B1p2N0P6q9l7Q3L2j06J3Q3k4r1M9P1p5o2J00K0r5j4J05or5L8Q0m7p5Q9M0
4468F2p9j8Q1Lq5J8R1n0q2P6N0p2l8P9J0q5J1P6k2p6N7N1p8m1Q6J4p9kR0l0q3
4499f5M7P5o0m9O8L5r8NR8k2r2M7P9n5n3O5M3r3rP8%q3K1Q0n3n7N9M2o5l6Q7P
4531D6r7QR3l8p7N5N3p2l9R1J4r0J2Q6l3q3N3P4n7m1O3M5j02JR5k0p6K6Q5n4p7
$$ plain form
4325 -40 -58 48 36 -64 -29 65 6 -80 5 68 -39 -70 30 50 -47 -47 61 24 -61 1 68 -12 -52 50 73 -45 -31
4352 -31 66 26 -50 3 74 2 -55 36 58 -39 -38 66 25 -68 -27 54 -17 -71 14 55 -44 -56 40 26 -56 -34 65 -4 -70 13
4382 13 73 -23 -59 53 57 -44 -24 88 31 -65 14 85 -8 -52 49 59 -39 -20 71 34 -57 0 76 -6 -52 16 50 -53
4410 -53 -56 44 28 -74 -24 65 -17 -82 7 48 -35 -63 46 47 -48 -16 64 7 -52 17 72 -17 -54 52 63 -33 -21 72 21
4439 21 -51 -1 75 -14 -51 32 64 -42 -29 54 30 -61 -12 59 -16 -78 22 42 -53 -67 38 32 -63 -25 55 8 -67 22 62
4468 62 -17 -35 46 49 -36 -18 73 23 -59 17 67 -5 -43 36 46 -39 -28 48 26 -50 7 58 -20 -61 25 39 -40 -42 48 18 -65
4499 -65 -18 57 -3 -52 16 51 -47 -42 56 34 -58 -11 68 13 -40 25 68 -25 -34 44 44 -39 -18 62 9 -48 11 53 -12 -48 39 46
4531 46 -51 -43 50 12 -65 -10 43 -29 -68 23 37 -53 -41 45 12 -71 -18 56 -1 -42 21 66 -36 -35 60 40 -36 -10 75 21 -56
4562e6P3N0q9k1P9lq3K3Q5n1o0M5O1q0l1P8J7q9J6P5k0q5N6O0o4m1Q6J9p6j0P6
4593D0nq2L9O7m7o6P8M0q3j4Q6j0p5K1O5n4n7O5M7q4j7Q1kq0K3P0m2n7N6M0o1
4624a8k7O0K3p5nQ0j9p6N2N4n5l5O3K4p4RO8j6p0L8N2m4m8N8L1p4j4Q2k0p6L5
4655a7P3n3o5P5K9p8j7P2ko5J7Q0l9n6M4N3p2k2Q3jq0K9O6l2p1N0M9n4m7Q2L2
4686F3r1%Q1j6p3L2N4n3m8N3L2p0j2P7qp0J8Q2n1n8N5M6p1j8P0J0q6K8P5l5p1
4717e5N6M5m6m3P3J8p0NP0j8o9L7M3m6m2N7K5o0k0O5lo0J9N5l6n6M8L6n9j0N7
4748A6ln8K7N3l5n0N6M0o2j4O4jn8K8M5k3m4L5L5m6k9N6Jn8QN2k3n2M1M0n1l9
4780d9O2J6o8kO7k0n1K8N3m1m0O0J3n7MN4ln8J9N9m2m3M6L8o4oO5j0n3QO7m0n4
$$ plain form
4562 -56 17 67 -22 -43 36 33 -50 -27 58 7 -53 -8 53 -27 -58 20 37 -52 -36 39 19 -66 -10 50 -14 -55 31 50 -26 -36 40
4593 40 35 -47 -8 59 12 -54 24 64 -19 -33 53 43 -32 -11 54 0 -57 8 55 -29 -46 35 33 -47 -24 46 4 -53 3 43 -18
4624 -18 -45 15 38 -37 -42 38 19 -57 -5 49 -6 -41 22 46 -28 -19 49 33 -37 1 53 9 -39 19 50 -24 -38 44 24 -52 -17
4655 -17 56 3 -62 13 42 -36 -53 19 17 -48 -31 49 10 -46 -2 51 -21 -43 40 39 -41 -12 54 22 -49 1 50 -4 -51 31 63
4686 63 -28 -28 53 37 -36 -4 50 -3 -51 2 34 -36 -48 29 21 -49 -31 51 0 -58 -3 43 -28 -46 24 34 -52 -24 51 16 -55
4717 -55 1 46 0 -43 30 48 -22 -17 53 35 -34 3 46 0 -42 15 40 -20 -40 25 22 -38 -19 36 0 -56 -8 28 -31 -41 16
4748 16 13 -45 -18 35 0 -50 6 46 -16 -30 34 33 -25 3 48 25 -19 16 51 5 -24 32 33 -25 -17 35 12 -40 1 41 -10 -49
4780 -49 13 29 -39 -41 26 6 -45 -17 36 -5 -45 15 28 -29 -25 29 26 -32 -13 46 4 -39 7 45 -19 -25 40 30 -23 -15 52 12 -42
4813d2L7O3p2j5N5Op1J5N9k3n2K7M3m8m1P5K2p8JN5Jn7K1N5l8n0O4J4m2j7N5J5
4845C7o9K2N8k6n1L3M4n4k5N9On8jN4j9n1M1K7m2k0L8J5m6LM2j8m8L3M5k9m5M9
4877DK9n7%N8j2m7K0L3k3l9M6J9l5qL7J1n3J1M5l6l3L1L6n9j5M5Kn9K7M9k7m3
4909d3L5L2m3j3L8Rm8J1M7k1m9L4M5l8k4M2K0m9jM7qn3K9M7l4m0L8L3n7j1M3J0
4941B8o8J4N3j8n5L5L7l8k8O1Lp2J3O3l0m7M8L1m2l4N7J7m7mM8nm1K0M1l1l0L6
4973A5J1m2oM5On7J6N3l4m8L6L6m8j8M6Pn3KM9j0l9K1M4n3j7N8ll8lN9k1n5L9
5006bL8l6k9M4J8m8RL8j5l9L8K4k9l9L6K0n2LL6lm5QM7k3l8M2Mk3j2L9mk9NL3
5040A6j8l5L6K9l9k5N4Om3LN2k2m3M0L6n1j9M4Mm3jM6kn9L3L1l3l9N2J2m9j4N5
$$ plain form
4813 -42 -5 58 -14 -29 26 32 -39 -24 35 12 -40 -13 30 -18 -59 16 38 -40 -39 16 17 -40 -19 36 -2 -52 12 26 -16 -33 22 37
4845 37 -32 -10 48 22 -29 4 48 -6 -31 28 34 -24 -25 29 10 -41 0 27 -15 -35 3 18 -28 -25 17 -1 -49 -16 29 0 -45 4
4877 4 33 -24 -24 34 22 -25 -5 28 5 -34 12 31 -4 -12 25 36 -17 -6 39 3 -30 1 37 -22 -37 8 10 -49 -22 27 0 -43
4909 -43 -8 24 -19 -32 6 15 -33 -22 25 4 -45 -11 34 -4 -28 14 34 -15 -16 31 23 -30 -1 46 12 -28 10 43 -14 -25 18 28
4941 28 -40 -26 27 9 -46 -11 26 -12 -40 21 24 -48 -35 28 -2 -49 -1 30 -12 -46 11 28 -19 -23 25 20 -21 -1 40 9 -21 15
4973 15 26 -16 -22 23 29 -28 -12 41 7 -41 -5 31 -17 -35 11 18 -35 -33 16 6 -33 -12 32 -21 -38 20 17 -21 -24 35 14 -41 -2
5006 -2 36 0 -29 15 33 -15 -6 32 17 -22 16 40 11 -28 8 28 -24 -21 15 12 -33 -25 22 -1 -39 3 7 -16 -28 11 7 -22 -17 16
5040 16 -2 -37 -1 28 -11 -36 18 24 -19 -16 36 14 -29 11 47 -4 -23 21 25 -18 -19 27 25 -34 -1 30 -3 -42 10 22 -27 -41 14
5073A4pm4NM6k3l7M2K3l2k0N0jl2kN0l0k9L0L7l6l3N0K3o2J3L1j2m1K1L9l8k6
5105c1L7K8n0j2M9j2l6PM5l9k6M0J7l4k0M1Ll9J7L2j6l3K6L1k9j6L9Nl4J1K8p
5137B2m1J8L3l1k7M5Pm0QK6mm2K8L1m3j9M9rm3lL5Nm8J8M0j8l3M0J9n1nM8nl7
5171b7J5L8j5l5L7K1l9qK8J2m7K1K6lm7J4K9l3j4L6K0n2NL4qn2K3L7k0k2L2J8
5203B4n1%M0j0l3J7L0k0k4L9K5l9j4L9J2n0J1L7j8l0K3K8l5k3L9Nk8j0L2j0l4
5234b8J7K8l4qL4Jl7KL4jl9K9K6k8k4L4Pj5rK8Nm2ON4l3k0L2J3l1j8L8Qm8J3M3
5269C7l2k3QL0l0j6K9Qn3J7L8j9k6J8K6k0j9K4J3l9RL8j9k3K5K5k8lJ0K3k4j3
5301iM1j3l1J5L1k3k7K1K2k7j3K2Pk7lL4k8k6L1J0j7k5L7Lk8KK2%k7J2L4l0j8
$$ plain form
5073 14 7 -37 -32 14 -9 -46 -4 19 -13 -33 17 16 -16 -18 32 2 -27 3 40 4 -29 21 44 -18 -5 26 14 -27 -6 33 -5 -31
5105 -31 6 34 -16 -28 21 9 -27 -20 25 -14 -40 0 17 -17 -37 4 7 -32 -15 17 1 -32 -6 25 -4 -20 19 24 -10 1 29 22
5137 22 -19 -1 32 1 -26 19 26 -14 -6 20 16 -26 2 33 -10 -29 20 11 -32 -35 0 5 -43 -25 15 -3 -36 4 23 -28 -33 15 10 -27
5171 -27 -12 26 11 -24 13 34 -5 -13 15 27 -20 1 27 24 -23 -9 20 -13 -27 9 29 -23 -18 16 8 -44 -21 16 -4 -26 6 24
5203 24 -27 -27 13 3 -30 -13 17 -3 -27 12 37 -2 -16 23 35 -15 -4 33 15 -15 8 36 1 -22 17 22 -6 -16 16 6 -28
5234 -28 -11 17 -17 -25 9 10 -27 -25 9 8 -31 -2 24 -4 -28 6 13 -2 -11 17 22 -20 -14 40 7 -13 19 32 1 -17 21 29 -19 -6 37
5269 37 5 -18 -10 20 -10 -26 3 11 -42 -25 13 -6 -32 -14 12 -8 -27 -3 10 -29 -20 18 -1 -24 1 26 -2 -5 5 28 4 -9
5301 -9 32 19 -12 3 34 11 -16 5 27 0 -13 9 16 -11 -14 20 -8 -34 -3 7 -10 -35 2 5 -23 -21 1 1 -26 -14 20 -10 -28
5334b8K9K2k8j5M2mk6J0K2j8j8J7J8j8j2J3J2k6J1K0j9k9J4K3l2oL3kl4QK2Km4
5367d1L1J8l1mL3Rj8j3L9j4l1K2L2l5j1K5J2l2jK3Pk7jL2k0j5J1J9j6j4K2%l0
5400a9LK4k5qQK1k7j6L2Rk3kL5j5qRJ6k5mK6lj8nL6Nl6RK8j9rJ9J0k4mJ4mk4L
5438a1K9j2k6J4J1k1pK8%l5KL9j6k5J4K2l0nL6Mk4JL3rk3ML0k2pL3mk5LK8qk2
5474aJ1J0k4jJRj0j4K1J0k9PJ7k2j4K5Qk2j4K9%k3J1L0j5k2K6J2k0mK6Lk7J2K5
5509C1k1j7J3Rj1kRQk5mK6lk8KK6k4k4M1Jl3NJ1J0j7OK0rj5J2J3j6pK2Mk8J9J1
5546A5kj7NK6j9j8K6Ml6ML0rk2J4J2j6j4K6Nm4RK6Kl8K5K4j8k0LK1j1nJ7qrOK1
5583A5j2LJK0j6j8M2j3k1OJ3jk9J9M%k5J6Qk1%K0k1oJ6Rj3j8J8kj4KK1j6qNK6
$$ plain form
5334 -28 1 23 -5 -20 22 18 -8 2 24 6 -12 5 23 5 -7 6 18 -8 3 23 4 -25 -11 12 -20 -26 7 5 -29 -21 1 3 -41
5367 -41 -10 8 -23 -27 6 15 -3 -16 23 9 -22 0 32 -3 -14 11 23 -9 -10 13 20 -7 -8 24 4 -11 0 19 3 -11 11 11 -19
5400 -19 -16 8 -17 -25 -17 4 -23 -39 -7 2 -21 -23 12 -3 -11 -2 14 -11 -15 11 8 -10 -15 21 26 -10 -1 27 8 -1 18 28 4 0 14 10 -14 -11
5438 -11 18 6 -20 -6 5 -16 -23 5 5 -30 -28 11 -5 -30 -16 6 -24 -29 7 11 -13 -12 21 12 -11 -7 23 1 -6 27 23 -2 1 29 21 -1
5474 -1 10 20 -4 -5 -4 5 -5 -19 2 12 -17 -10 7 -15 -29 -4 4 -18 -32 -3 -3 -26 -15 15 0 -22 4 16 -4 -8 18 21 -6 6 31
5509 31 10 -7 6 15 4 2 11 19 -6 -10 16 13 -15 -13 13 -11 -35 6 7 -26 -21 -10 0 -17 -11 9 0 -15 -3 10 -6 -13 9 13 -15 4 15
5546 15 13 -4 1 27 8 -10 16 20 -16 -12 18 9 -13 1 13 -3 -17 9 14 -30 -21 5 7 -31 -6 18 0 -20 -17 4 -7 -12 5 -3 -12 -6 15
5583 15 3 6 7 27 11 -7 35 22 1 7 20 19 -10 9 13 13 -12 4 12 -9 -9 11 -10 -16 0 9 -4 -22 -4 -6 -20 -18 3 -13 -21 -16 10
5620A0k3kK1NpnJ5%k2ML4k3pJ6Nj6oJ8lk1oK0rrjK5k2lNJ3k1JJ0j1jQJ3k4LJ6
5660@Mk7K1J0oj1NK1j9OMMlj0L5j7k2J7Ppk1J0J2j3mPNk5LJ9j0qkQj4kJ9%k4J2
5700a6J8jj9J2J0lrJ9Nk0J3MPk5J8%j6oK4nrQRj0k1jJ8j0pJ2J5l3RPPj4qK0j1
5739ik4K2JoOPJ1pkJ8qrJ0KojJ5pj6MJ2%j3J2lqj3J9j3%nJ9pj4PJ0j4jQLqj1J3
5782fPj6PK0k3mJ3K0j5kJ0%ljJ3Jk0NJ3j4jjOj3LJ6j5oKJ3j6nRkj4J6%%j4J1R
5823Cj3lJ1J5k3J0Rjj2OK7j8nNQk1OJ6mj4J5j1J1ollr%J2j7LjJQj6ONj6MK0rp
5865a1LR%j6J4PJj2J1Rj3JJ7j1lJ5Nk1LJ1Pl4J3KlmjJjj2J7lnnJ0jj0OJ0j4nQ
5907eJ6j4j0K6roMJ4j3lJ7Mj4JJ7lj7jJ5lj5J1Lj2nPPj7jJ5oj7QRpj3RJ1pnK1
$$ plain form
5620 10 -13 -15 6 11 4 -1 14 14 -8 -4 30 7 0 16 21 5 -1 17 14 -7 -13 7 -2 -11 -12 13 -9 -12 -7 6 -15 -14 -4 -15 -16 -8 5 -19 -16 0
5660 0 4 -23 -2 8 2 -9 -4 17 -2 4 8 12 9 -1 34 17 -5 12 19 12 -9 1 13 0 -4 3 8 -17 -14 5 -5 -13 -15 -7 -21 -23 -4 -4 -28 -16
5700 -16 2 1 -18 -6 4 1 -8 11 16 -4 9 13 20 -5 13 13 -3 -9 15 10 1 9 18 8 -13 -14 4 -6 -13 -1 14 -19 -10 -3 4 -10 -18 2 -9
5739 -9 -33 -11 -10 -16 -10 -3 8 1 -1 17 9 0 10 12 6 5 20 13 -3 1 13 13 0 12 9 1 -12 7 -6 -6 -11 8 1 -13 -6 4 -10 -11 -3 0 -8 -19 -6
5782 -6 1 -15 -8 12 -11 -15 -2 18 3 1 11 11 8 7 20 21 1 6 19 5 4 3 9 -4 -1 15 0 -6 -4 9 -7 -12 -3 -5 -19 -3 -3 -3 -17 -6 3
5823 3 -10 -13 -2 13 -10 0 9 8 -4 2 29 11 6 11 19 -2 4 20 16 2 17 6 17 11 8 5 -4 -4 8 -9 -6 -7 -6 2 -14 -8 -3 -19 -15 5 -4 -11
5865 -11 -8 1 1 -15 -1 6 7 -5 6 15 2 3 20 9 6 21 26 5 8 19 26 -8 5 7 4 0 -1 0 -1 -13 4 1 -4 -9 1 0 -10 -4 6 -8 -13 -5
5907 -5 11 -3 -13 13 4 -2 2 16 3 0 17 21 7 8 25 22 5 4 19 16 1 12 15 3 -2 5 12 -5 -6 9 3 -14 -6 3 -4 -17 -8 3 -4 -9 12
5948A2j4rJ7kj1QjQpoJ5Lk0QQJnRQj2pJ6Jk0%K0k1oOjrKOlj1J0J6k0oJ1J0j1j
5991hJ7Kj6JJ3Nj2QQlj5K3Jk3QPMj6OJ4k2pJ9jj6KLKnlMnqMJ0oj5J7Nj0J0LrM
6035@LJ9k8J1J2JqpJ8lk1J0Mj0KJ1Jj3PqRj4PNj1j3K1Rj8qJ4j0jKOjj1J2QqmO
6077AJ4k2kK7pj1NJ9j7j1K3oqKJ2mk9J6L0k6j3K2j3j3PLLnlOj0jOPj4nJ9Oj9J0
6117aOJj1PJ2j1nJ9Mj0%LNj7NKnlJ0Jk0MKPk1J2J3j2j1J2Nj6oK5jk9J2O%oJ4%
6159B%oJ9nqLQjj3K1plj6K2JpnK5j5k0PLnj0J2%j8NJnJJ2J1j6j4K6lj3qJ9J7j3
6201DkJ4k0nJ8PqmJ1koKJ1j5mmJ9j7oPJ2k4NJ5k1qJ3Rk0OPOj7MPKj8J6K3k5kJ2
6243BOj1kJ2Kj3J2Onj2J4Rj6LkJ4j5mJ9qj7%Oqj2K9j0qqJ5oojJ0lqK0Jj0mK2r
$$ plain form
5948 12 -2 -11 6 4 -7 1 0 8 1 -5 10 13 -7 1 9 10 5 14 22 10 3 19 20 0 0 20 -1 -7 -1 -2 -11 -9 -3 -6 -17 -7 9 -11 -17 -6 4 -7 -8
5991 -8 9 11 -5 -4 9 14 2 10 18 15 0 23 24 1 9 16 20 4 10 24 2 -5 14 13 -3 -1 2 4 -1 -4 0 -5 -13 -9 1 -5 -20 -3 2 -8 2 5 -4 0
6035 0 3 22 -6 5 17 18 10 3 21 18 -3 7 11 1 3 14 15 2 9 1 10 -4 3 8 -3 -16 5 14 -4 -12 2 -8 -9 -7 -1 -2 -13 -1 7 -1 -5 1
6077 1 15 -7 -9 18 11 0 5 24 7 -4 19 13 5 7 19 15 -14 2 32 6 -7 15 2 -11 -4 -1 2 -3 -6 0 -10 -11 -5 2 -12 -17 2 8 -11 -1
6117 -1 5 6 -5 2 14 3 -2 17 21 11 11 14 19 2 7 9 4 1 11 12 -8 -4 -2 5 -16 -4 9 -3 -14 -2 3 -13 -19 6 5 -24 -12 -6 -6 -12 2 2
6159 2 2 -4 15 10 2 5 13 12 -1 20 13 10 -6 16 17 10 5 30 15 -5 2 5 0 -10 2 2 -16 -11 -10 -15 -14 -2 9 -7 -21 5 2 -11 -19 0 17 4
6201 4 2 16 -4 -9 9 16 8 4 15 13 7 9 20 5 1 -3 16 -1 -7 0 12 -12 -7 8 -13 -21 -8 1 -19 -13 -6 0 -17 -13 -6 -4 -22 -6 17 -8 -10 2
6243 2 8 -3 -5 7 9 -4 8 14 9 -3 11 20 4 7 5 19 4 0 19 11 -6 -6 0 -8 -20 9 -1 -9 -17 -2 -8 -14 -15 -5 -8 -16 4 5 -5 -9 13 4
6285DpLOqjPJ5qj8K6j1pKJ0qj4J1Mj0OJ0pj4NJ2k4j0J6Oj0nJ6oqKK1pj8J4J4%
6326Ij9J5koNJ7j1j5J6J4j0qJ2Mj8JMJ3l2J4K4l2j3J6Qj3qJ6mnkJ4j2k2L1Jjq
6364gJ2jj2LJ2omK4nj8RNJ5k9PJ7j6nNNqj5J7Qk2JJ9pk0JJ1j8KJ1Nj1qK4Kj0%
6405gJ0j5OJ0J9k4rL4nl0J4J4j1j2K7Jk6LK7j3j3J0Oj3j9J4OmrMJ2j4lJ3Kk2J1
6442fQ%rLJqJ4RKj3J0J1j2j0J9kq%J4j1pQRj7j1J7Pj8j4K2Mj7jJ0nk0J4J1nj3
6482a4OOonJ0Rk0J0NJ1j6J4Rj8NJ2mk1J2J6mj8QRj2nK2pk2RMKl2K0Nrj2J1J3j6
6522a3LJ8nk1J5PqoJ4Ok0QK2nj5JK0j3mJ1Rj3j4J6Mk4J3QNk5OQj2MLnj0KJ4pj8
6563b1J7Qrj3QJ6j9J2J3prkJ6rqK0Nj6L%J0j8J3Rj1j2K4nj6qJ5Lj3JJ2j7j4J0
$$ plain form
6285 4 -3 0 6 -2 -3 4 19 11 -7 19 8 1 3 13 5 -9 2 6 -4 2 12 5 -9 -4 8 -16 -26 -10 -4 -14 -19 -3 -9 -17 -15 6 -1 -19 -5 9 9
6326 9 -10 5 3 -3 2 19 8 -7 9 23 13 5 17 21 3 4 8 21 -11 3 27 -5 -18 -2 6 -7 -15 1 -3 -8 -10 4 -8 -30 1 2 1 -7
6364 -7 5 4 -8 -5 7 1 -3 21 16 -2 7 12 27 -2 5 22 6 1 6 11 3 -12 5 13 -9 -8 11 4 -16 -15 -4 -22 -20 -9 -4 -15 -23 1 3 -7 -7
6405 -7 3 -12 -6 4 23 -1 -10 24 19 -11 3 17 6 -6 21 22 -4 -1 26 13 0 10 16 3 -16 -2 4 0 -9 -5 7 -7 -10 3 5 -17 -6
6442 -6 2 2 -7 -4 -3 -11 3 12 14 1 11 22 10 0 19 17 9 9 23 12 5 13 22 5 -6 11 18 0 -14 8 12 -5 -6 4 -1 -21 -7 4 -1 -14
6482 -14 -8 -2 -8 -13 -3 6 -14 -4 1 12 -4 10 19 1 6 18 14 -7 5 21 17 -1 7 16 4 -1 21 14 -8 1 5 7 -25 -5 0 -9 -21 -10 3 -13
6522 -13 -10 8 3 -18 -3 4 -4 -10 4 10 -10 -2 20 15 0 1 21 8 4 15 24 11 -3 13 17 -7 6 14 19 -6 0 8 -4 0 3 -2 -12 -10 4 -3 -21
6563 -21 -4 4 -5 -18 -10 6 -13 -1 12 5 -4 -6 10 1 -7 13 18 2 5 5 15 -3 10 19 8 -4 20 15 -1 -9 6 9 -4 -3 9 -8 -22 -12
6601a2K0j2%Mjj4kK2oj1J7Pj5mJ3komJ9nmMJ0qj3J6Pj6rK8ok7J1J0j5j0RKj6J2
6641gQnj5MK0Kk3OJ7j6j1K7%Jj0J1LpJ1Mj4jJ6poJ0Ppk8J1K0pj0J1%k4mJ6%j5
6681a2PJ0j9j0J5J4j6rJ9mj4RK3k2JJ1Rj3jJ3Oj7kK0nj7J5J3j6rJ5jj5jJ3nj8
6718a3J2J3k0lOJ6l4LJ7mp%J8j3j8K2J4j3pK4j3j5J4K3j4qJ4Joj6J8Oj4LMkrL
6756BQj8jJ4l%j9K8j4k5J2J8j2rJ3Or%J4oj1RJ8k2jJ8jpoJ9Oj9OOpjLJ0j3JMQ
6798A9k2J0%oqjJ9k2j4K0%qLMPj5jK1oj6J1K5l0JJ9Pj9lJ5J3k7K3Qj3k1L3qj1
6836GmJ3j1j3J6Rj9qJ0J6k7jJ3kj9PJ9j0rJ1Pk1KJ1J8l1K8Nj0j2K3l%j7K6qj9
6873cJ0J3j5nQJ2k2KJ2Kj3jJ0Jl0J2J4j4j3J1PoLJ5k5lRK0rj6J4J3j7KK1qk0J7
$$ plain form
6601 -12 8 -4 -4 0 -1 -15 -17 5 -1 -12 5 12 -3 -7 6 4 -2 -6 13 8 4 8 18 10 -3 13 20 4 -5 23 17 -10 1 11 -4 -14 -5 -3 -19 -7
6641 -7 1 -4 -19 -15 5 7 -16 -10 7 -9 -20 7 7 8 -2 9 12 5 16 20 6 5 21 14 8 18 25 18 -10 1 21 14 4 15 15 -9 -13 3 3 -12
6681 -12 -5 5 -14 -24 -9 5 -11 -20 -1 -5 -19 -10 13 -9 -8 3 12 -1 -2 11 17 0 -2 18 13 -4 11 24 8 -1 14 13 -2 -3 10 5 -13
6718 -13 -1 12 -8 -11 -5 11 -23 -20 -3 -7 -14 -14 4 -9 -27 -5 9 -4 -11 13 0 -15 -1 22 8 0 14 15 9 -7 11 17 3 6 10 8 -1 2
6756 2 10 -8 -9 5 2 2 -17 11 -3 -28 -16 2 -10 -19 -6 0 -9 -9 5 -1 -12 -3 15 -7 -8 10 9 2 -4 15 21 2 8 14 7 6 9 19 6 7 11 19
6798 19 -3 7 7 1 -7 -8 11 -11 -25 -5 -5 -13 -10 -6 1 -14 -15 6 0 -16 -5 20 -10 -9 10 17 -2 -5 10 23 -4 19 27 14 -7 26 18 7
6836 7 3 16 5 -8 8 17 -2 -10 0 16 -11 -12 1 -1 -20 -13 6 -4 -13 -2 5 -16 -14 -3 15 -16 12 17 7 -5 18 15 15 -2 24 16 -3
6873 -3 7 20 5 0 8 20 -2 0 12 14 1 0 10 11 -19 -7 7 -7 -20 -9 -2 -8 -5 10 -15 -18 -9 11 2 -14 0 13 -4 -2 19 11 -9 8
6911HK1j6oJ2kj2%K0nj5nJ9j5%LMj5j7K4Jqj3J6mj0PJ5j4mJ0Pk4QK6j0j4NK2k0
6950anK8kj9nJ4J0k0jK1rj8J1Mpj0LJ0j5QNkj6J0Qj6KRkqoJ7j0MJ0MoJJ6j2rQ
6992DRoqPJ3mj3J6opmJ8Jk3lJ7j3qROqk1L1j1j5NJ6mj9OK2j7%K1Mj1j1L3j1jj2
7033BJ7pj1J0J4k5P%J3j3%J8j5j5J8Qj8oJ0Jj7rJ9lk0J9LrjJ5Jj2kJ8jk1J4J3
7071A5k0QJ1%oKNRk6J5Rrj0J0Lj0nLRk5J1J5j8qJ3J3k5%J7j1j2J0J0j6JQJ1qj4
7110a5K3Nnj3K2j1lJ4LpmJ5%k3jK0j0q%K1k6lJ1Lj7kK1j2k4J2J8j8j0J8%qMJ3
7148CRk1jK6lk1J8pJ1j5K1j2lJJ4qj7J5J5j4j3K2j8j0MK2rj0Kjqj1J5J1k0mK2
7185Ekk1NJ9j8%RJ9j3mK3mj5mK2kk1J3J6j5j4QNk0J0J6pj1J0J0k2j0RNj4jJ1q
$$ plain form
6911 8 29 13 7 19 17 5 5 25 20 5 0 19 4 4 7 11 -4 -21 3 4 -4 -17 -1 -5 -15 -8 7 -7 -11 -1 6 -18 -10 16 6 -8 -3 19 -1
6950 -1 -6 22 20 1 -4 10 20 0 -1 20 11 -7 4 8 1 -9 -6 4 -11 -3 2 0 -16 -6 2 -14 -12 -3 -5 -13 -19 -2 -12 -8 2 6 0 1 17 5 -4 4
6992 4 13 7 -1 6 19 15 2 18 12 5 1 19 20 -3 -6 11 -2 -10 -1 5 -3 -24 7 -4 -19 -14 2 -2 -21 -15 7 -10 -10 11 15 4 -7 26 15 14 2
7033 2 19 12 1 11 25 0 7 7 20 7 7 25 10 -5 13 21 3 -3 7 8 -9 -18 1 -2 -22 -3 0 -9 -10 5 6 -6 -8 10 9 -12 2 15
7071 15 -5 3 14 14 8 10 15 24 -2 13 22 13 3 13 16 6 1 4 13 -12 -1 14 -4 -12 1 14 -11 -11 6 -5 -17 -7 3 -13 -12 -4 7 -1 -15
7110 -15 8 13 8 -5 17 6 3 17 20 13 9 24 24 1 0 20 10 2 2 23 -3 -6 5 8 -9 -11 10 -2 -26 -14 4 -14 -24 -6 -6 -14 -10 3
7148 3 12 -9 -10 16 13 -8 10 3 14 -1 20 8 5 6 20 12 -5 10 25 11 -2 20 2 -8 -4 18 9 -1 1 0 -8 -19 -4 7 -13 -17 5
7185 5 3 -18 -13 6 -12 -12 -3 16 3 -1 22 18 3 -1 21 19 -2 11 27 12 -2 6 11 -9 1 17 10 -1 9 19 -3 -13 -4 1 -13 -14 -3 -11
7223a1rJ6J4j6pRQj3mNJ4j5OK1oj0OJ5j8qJ7Rk4RJ2nk5K0Qj7qMJ1k4MJ8j3j1K
7262a6K0j7qJ4lnnK1kplJ7j2nK5Kj2nJ5Nj5KMomQKrpJ5J0k1lJ3j5j0PM%oMJ1k2
7305a9LJ8j1j1J8Mj3nJ6Lj4NJ9jj4J1Rj0rJ6J1j5j9J6l%jJ5j3j9K5Lj0%Lmj3j
7343a0J9k0oJ1J2ppOKk0NK1j5%oK8j6jNOmj4J3J4j0kJ7oj3J1PrrLOk1J2J1j5j6
7383a8J2J4j7lKLj2QJ3kk3QJ7j0qJ8knPJ4j4j0J1K1mj5RKj7NJ4Nk3KJ5ok0OJ2
7422Irk2J7Oj3J2Lpj4J3Pj2kJ2Qk4PK0Kl1K1J2j3mJ3Mj5MPJoOJ0j5kLLj7nJ5P
7463A1k3%J8j0j3J6Lj0rkJ3%pQNj7J1J6j8LJ0Nj1LJ2Lj7QJ3kj8NJ5l2J3Qjj3Q
7502DRr%lLj0NPkj6OLjj3J5J0k0NRKj2J4%Ok2J4Poj0J0J3k4NK6j7j1OJ5j3qJ7
$$ plain form
7223 -11 -20 -4 10 -6 -13 -4 4 -9 -13 -8 6 -9 -3 18 12 2 8 23 5 -3 14 23 -1 8 20 15 -10 10 18 1 -7 -3 8 -16 -12 6 -7 -18 -16
7262 -16 4 -13 -21 -7 -10 -15 -20 1 -1 -8 -11 6 -6 -11 14 16 4 -1 14 19 4 6 10 4 0 8 10 1 -6 9 19 -2 -5 8 -7 -17 -10 -6 -6 -12 -8 3 -19
7305 -19 -16 2 -9 -20 -2 2 -11 -16 0 3 -11 -6 13 12 -2 9 18 8 -1 15 26 11 -8 8 5 5 4 19 6 -13 12 15 5 5 8 4 -9 -10
7343 -10 9 -11 -17 -6 6 -1 -8 -2 0 -20 -15 6 -9 -9 -15 13 -3 -4 1 7 3 -11 2 16 6 4 21 15 2 13 20 11 2 5 11 -10 2 13 -2 -18
7383 -18 -6 8 -9 -12 -10 -7 -19 -11 2 0 -23 -15 2 -8 -16 2 0 -5 2 16 2 -8 3 24 20 5 14 16 -1 4 18 23 0 2 17 11 -9 -3 9
7422 9 0 -22 -5 1 -12 0 3 -4 -18 -5 2 -10 -12 0 8 -16 -9 11 13 -18 3 15 2 -2 11 15 0 4 11 12 6 12 22 7 5 8 11 -6 -11 4 11
7463 11 -12 -12 6 -4 -17 -1 2 -8 -17 -19 -6 -6 -13 -5 0 -17 -6 10 -8 -5 5 10 -1 2 14 17 0 8 21 19 1 6 21 -11 2 10 9 -4 4
7502 4 13 4 4 1 4 -6 -1 6 4 -12 -6 -3 -4 -17 -2 8 -12 -7 2 4 -8 6 6 12 -10 4 11 5 -5 5 18 -6 -1 25 8 -3 3 18 5 -3 14
7543A4rj6kJ3%j8K0Mqk0K0pqJJ0Pr%K0rj2J3RqpJ2nlpJ4J1j4QNj2kJ9ljj8J0j
7585A1k1PJ7j3j1J0Mj3j6J4J0j1rK1pj6J7Pj0KQJ4j4%L0k2j1K0%pnPjj7JJ7j3
7622@j2J1Jj%J1oj0nJ2jj1J4pkj2J6kqJ0KPj5%K1j6JmK2onK1j4qLJ7rj8J2Rj2
7663Fj0QJqkQo%j2J9j5kJ0Mj4pK3kk3QJ6j0qJ6Ok0jK3Ok0KJ6Qk1MJ5j4rJ2%mj2
7705iJ6RqoNjqMkj7oJ7jmlJ7k0O%K1l1QJ4nmLJ4%j6J6Oj2oJ5Pj4JJjj1RRok0J8
7750EOk3OJ0Ok2oK4j1nJ0Jj0j1K6qkpJ4oj0J9Roj8J4Nj2J6Qj8L%Pj0jRLk1MJ5
7791A3qj3NJ1j8nJ6oqOOJj1JJ0Jj5PJ9k1rJ5J1j6ONKpQJ0jkjJ4j3OPj4rNRj4j3
7834a0J0Nk0J1KqmLJ2j4jJ9j3j6J3J8j4kJ3Jkk0K1Rj2mJ8jj2NJ1mj0MkpLRoj3
$$ plain form
7543 14 5 -11 -13 0 0 -18 2 6 -2 -22 -2 -9 -17 -16 -6 1 -8 -8 12 3 -9 4 13 5 -2 10 5 2 -5 9 20 6 14 19 7 5 24 21 20 2 12 11
7585 11 -10 -3 14 1 -10 0 4 -9 -25 -11 -1 -12 -21 0 -7 -23 -6 1 -9 -7 1 15 1 1 31 9 -2 18 18 11 6 13 12 -5 -4 13 0
7622 0 -12 -1 0 -1 -1 10 4 -6 -11 1 0 -11 3 -4 -6 -18 -2 -4 -12 -2 0 7 -8 -8 13 -3 -2 -6 16 10 5 26 12 4 7 24 15 -3 9 18 6
7663 6 -4 4 5 -3 -5 3 -3 -3 -15 4 -11 -13 -3 1 -13 -20 3 1 -22 -14 2 -8 -16 0 6 -14 -15 8 14 -6 -4 12 20 -1 3 18 4 -5 7 7 3 -9
7705 -9 7 16 8 2 7 6 -2 2 0 -17 -23 -6 -7 -11 -14 3 -17 -11 -11 10 -21 -13 1 -4 -8 -5 9 9 -7 9 15 3 -3 12 19 5 6 7 6 -5 4 13 7 -13 5
7750 5 11 -12 -6 4 10 -12 -18 6 -5 -10 0 1 -9 -20 6 -2 -4 -11 3 -3 -13 6 15 9 -9 5 10 -2 14 22 4 7 7 14 4 3 12 15 -6 -2 13
7791 13 5 -8 -3 8 -10 -15 1 -5 -13 -7 -1 0 -11 -10 0 1 -14 -7 12 -9 -18 -3 8 -8 -2 3 5 -2 6 16 15 13 12 26 13 19 26 12 3 8 17 3 -10
7834 -10 0 5 -15 -4 -2 -10 -14 -11 1 -13 -14 5 -8 -24 -11 7 -7 -9 4 5 3 -17 4 13 1 -3 15 14 2 7 18 14 4 8 6 -1 2 11 5 -8
7874hRkpOj1Rrj0K0Qj7%RnoPNrKLPrJ0J1mj5QJ1jpQPj2kN%nqJ8j2j0OPlpKMj6
7922a3NJ0lj5JJ9j7jJ0LrkJ1JqPJ0kj6J6Rj2%J0j1RoK6k6pRJmrJ8oj0MJKk7J2
7964a0LKj3J5Oj9J0J3pk0J5MNj7J5Oj3LJ2QrMOj0kO%qlK8k4NpJ2nj5QJ0j4j9J8
8005aJj4mJ4lkKQrmJ6rjLQQj9J1J1pKlJ0j2mJ7oj2Qlkj2QJ5j9LmJ2j0%Npj6PJ0
8050dnmNJ5rlPLk1RJ4q%K3j2j2mK5j4MlJ2j5OOKj1oNlqPRj7NNl%k0J7qjMOOj8
8096a4J0Nkj9K0LrjJ8onJ2kmlLJ3j5OMlj9J1J0j1jjjKlMj2mRNprK2rqOLlj0RJ7
8142A1j6JLJ5j7oK0J1j9LMOj3KMJoMjrLJ1j0qQj6J0jP%j8OL%nLJ4j5J0j2J6j1
8184gMJ1mrNJ2K
$$ plain form
7874 -8 1 -1 -8 -2 -13 -4 -13 -23 -3 5 -12 -12 -3 -8 -14 -7 -2 -11 -9 -6 1 -8 2 13 9 -6 2 13 12 5 13 20 8 6 11 11 6 -2 16 4 -6 0 7 4 -3 -1 3 -13
7922 -13 -8 2 -1 -16 -15 4 -13 -14 -4 -1 -10 -12 -1 0 -8 -1 9 7 -9 7 16 4 4 14 3 12 6 32 6 -1 8 9 5 -4 14 8 -2 2 3 5 -22 -10
7964 -10 -7 -5 -18 -3 3 -16 -6 7 0 -20 -5 -1 4 -13 2 8 -5 -2 10 18 9 13 19 9 7 13 13 5 2 30 6 11 4 16 11 -4 4 14 0 -19 -1
8005 -1 0 -14 -18 -4 -7 -9 -7 1 -8 -12 4 -5 -6 -3 5 13 -6 5 16 9 11 8 18 6 2 19 13 1 9 6 4 -8 0 15 -4 -1 -5 7 -3 -3 2 -5 -21 -14 -4
8050 -4 -9 -13 -8 7 -2 -5 2 5 -16 -7 7 -1 -1 22 10 -2 -6 19 5 9 6 18 3 9 15 17 6 0 5 2 -6 1 10 -7 -2 3 0 0 -20 -3 -11 -12 -8 -2 4 -14
8096 -14 -4 1 -1 -20 0 3 -6 -7 11 5 0 12 10 6 3 6 19 4 10 14 11 -8 3 13 2 1 0 -1 1 -2 2 -10 -14 -5 0 -7 -16 6 -3 -11 -5 -2 -5 -15 -6 11
8142 11 -5 -4 -1 14 -3 -9 11 22 3 6 10 16 3 5 9 10 4 8 7 -2 1 12 2 -6 2 -14 -4 -5 2 2 -16 -10 -7 -7 -12 -9 5 -10 0 -12 4 -7
8184 -7 -3 8 4 -5 0 12 14
8191A4
$$ Imaginary data points
##PAGE= N=2
##DATA TABLE= (X++(I..I)), XYDATA
0@%%%%%%%%%%%qJ6j6J6k4L2m0M8n6P2q8J04j20J42j66J92k24K56k96L42l90M40
33B32m96N63o35P12q00Q96j000J118j244J380j530J692j870K066k279K512k767
50a450L049l360L700m081M509m987N527o143O856p694Q690r895J1393j3319J5889
65H684j9509K5034l4590N5586j80427J25991L17906l77518j38279L21993Q3469
76A88340l61794L1961L48909o6422l55692J10584K94427j26542k42002J67337
86a0894J68226j85230j20227K04331O9729j89694l4067J68174j0436j29612M3145
97b6555R5867p2612n7229Q3257K3000q4108J5707P0924m9846n3428Q1094K9326
109E5397j02151k998J14564k7567j16253N8099J10711q7475r7962J11786P9929
$$ plain form
0 0 0 0 0 0 0 0 0 0 0 0 0 -8 8 -8 8 -16 16 -24 24 -32 40 -48 56 -64 78 -88 104 -120 136 -160 182 -208 232
33 232 -264 299 -336 376 -424 472 -528 590 -654 726 -804 888 -982 1084 -1195 1317 -1450
50 -1450 1599 -1761 1939 -2142 2367 -2620 2907 -3236 3620 -4074 4616 -5279 6114 -7205 8684
65 8684 -10825 14209 -20381 35205 -145222 -19231 298675 -78843 -217122 104871 188340
76 188340 -173454 -141493 207416 140994 -214698 -104114 190313 63771 -178231 -10894
86 -10894 157332 -27898 -148125 56206 125935 -63759 -97826 70348 59912 -69700 -26555
97 -26555 69312 -3300 -60529 22728 45728 -38380 -22673 48251 -1595 -55023 26071 55397
109 55397 -46754 -49752 64812 37245 -79008 -20909 89802 2327 -95635 16151 96080
120I6080j29791n7043J39996L1658j43100n574J39322j8726j29256L9145J13795
131G6506n4190r4487O3323P2978o6267n1188O2958L1198n3945j4606M0145K554
143A4979k2723M061L239m559J6343r33l4528J2239M9735k8679o0596M9142O5881
156F3601p1975o5001R5648N7486j18377m3406J38389K3352j54026J500J64018
167I1209k9784j67325N9887J63234q9828j51765J17772J33372j41930j08959J60713
178C6596P9831j72855m7677J77678J4299j74915J8491J64690m8821j47644P5020
189b5307J24849r5774r7646J10084O7574j17330l6304J17250N685j10181K2755
200c4345R6628m7525p7429O7258N3879q1005k7478Q8168k36q8465K7584Q1991
$$ plain form
120 96080 -33711 -90754 49242 80900 -62200 -67774 71548 52822 -76434 -37289 76506
131 76506 22316 -72171 -8848 64130 -2137 -53325 9633 40831 -13114 -27720 12425 14979
143 14979 -7744 -3683 -444 -5003 11340 10407 -24121 -11882 37853 9174 -51422 -2280 63601
156 63601 -8374 -73375 22273 79759 -38618 -82024 56365 79717 -74309 -72809 91209
167 91209 61425 -105900 -46013 117221 27393 -124372 -6600 126772 -15158 -124117 36596
178 36596 116427 -56428 -104105 73573 87872 -87043 -68552 96138 47317 -100327 -25307
189 -25307 99542 3768 -93878 16206 83780 -33550 -69854 47396 53081 -57100 -34345
200 -34345 62283 14758 -62671 4587 58466 -22539 -50017 38151 37915 -50550 -22966 59025
212E9025n2891o9347P4672N1489r1705k9625J03024N201j07953K0039J06479m4500
224B3908r8903O6672Q5895q5190o8456R8957M7953j07340k5824J10083L468j07213
236e5990J7613R9197l6090q6911N1019P1334o1677n3598O7560L5001o8575j6810
248c7927O4933K17n7130J3748M5904k4224l2245L0651J7226l2731k024L0483j2229
261D652k4117K4403J4254l3550j799L9024j2275m0333K6825L7361m0615l0369
273c6539N2559J9826o1681o499O7195q625o8585K4355O5733l9565n8792N3197
285B579M8155o4265l4530P1984J8788p5776j981P5420j4868p0904L0695O2464
297D7761m4458n0667N5368L6207o2743j9950O6152K859o5357J4002O0381k9568
$$ plain form
212 59025 6134 -63213 11459 62948 -28757 -58382 44642 49843 -58110 -38071 68408 23908
224 23908 -74995 -8323 77572 -7618 -76074 22883 70836 -36504 -62328 47755 51223 -55990
236 -55990 -38377 60820 24730 -62181 -11162 60172 -1505 -55103 12457 47458 -21117 -37927
248 -37927 27006 27223 -29907 -16159 29745 5521 -26724 3927 21153 -11578 -13602 16881 4652
261 4652 -19465 4938 19192 -14358 -16157 22867 10592 -29741 -2916 34445 -6170 -36539
273 -36539 16020 35846 -25835 -32334 34861 26236 -42349 -17994 47739 8174 -50618 2579
285 2579 50734 -13531 -48061 23923 42711 -33065 -35046 40374 25506 -45398 -14703 47761
297 47761 3303 -47364 8004 44211 -18532 -38482 27670 30529 -34828 -20826 39555 9987
309I987n1546M2897L9395n3118k4725N9593Q485o1936Q318N9942k4506n3808L9035
322a987M3933n0927l1048N9390J6075o3914n2O4261j5941o0480L0841N2873m3636
335f12m2064N3550K8825o0016j4065O2673j198o1459J6004N6548k9421m8348M0663
348A080L7451m9085k4535N4175J0491n5698L793N3630j7412m8162K9541L9625
360C4894l9351k8674M6308J5995m9922k496M9970j0915m6494K3292L9775l3777
372a395l0351M1702J8867m6499o188M7878o786m5761J9086M0396k9899l2138L8429
385G341K1702m4180r788M6741k734m6030J5041M2111k6259l5325L5730K6091m2793
398a2352j5102M7063L039m8275R338M6336k1197m1443L1838L3885m0609k4104
$$ plain form
309 9987 -41559 1338 40733 -12385 -37110 22483 30968 -30968 -22650 37292 12786 -41022 -1987
322 -1987 41946 -8981 -40029 19361 35436 -28478 -28530 35731 19790 -40690 -9849 43024 -612
335 -612 -42676 10874 39699 -20317 -34382 28291 27093 -34366 -18362 38186 8765 -39583 1080
348 1080 38531 -10554 -35089 19086 29577 -26121 -22328 31302 13890 -34272 -4731 34894
360 34894 -4457 -33131 13177 29172 -20750 -23246 26724 15809 -30685 -7393 32382 -1395
372 -1395 -31746 9956 28823 -17676 -23864 24014 17228 -28533 -9447 30949 1050 -31088 7341
385 7341 29043 -15137 -24925 21816 19082 -26948 -11907 30204 3945 -31380 4350 30441 -12352
398 -12352 -27454 19609 22648 -25627 -16289 30047 8850 -32593 -755 33130 -7479 -31583
410c1583M6901J2736n0306n27N0616j1730m7852K3250M2192l3301l3973M1207
422G630K3782m6446j2360M8722M41m7900J1157M4105k1610l7691L0290K9141l6661
435g400j9032M0281Q168m1060K707L9044j2919l4396K1778K7526k8723j8978L3358
448A0354R344l5459P41L4926j0613l1799J9571K6371k7083j9006L2647J0185l5878
461a5699m94L6534r348l4617J8682L0245k6914k3636L3407J5288l7683n788L9430
474A9407m151l8579J3903L5110k2710k9322K9983K1633l5221j2606L8084K871
486A8402l8372O869L6138j5970l1594K3836K5063k9984j6983L4002P955l5739
498a6377J465L5052j0647l2026J9020K6885k6031k0010L1289J1813l4482k769
$$ plain form
410 -31583 15318 28054 -22252 -22779 27837 16107 -31745 -8495 33697 396 -33577 7630
422 7630 31412 -15034 -27394 21328 21769 -26131 -14974 29131 7521 -30170 120 29261 -7400
435 -7400 -26432 13849 22017 -19043 -16336 22708 9789 -24607 -2829 24697 -4026 -23004 10354
448 10354 19698 -15761 -15020 19906 9293 -22506 -2935 23436 -3647 -22653 9994 20179 -15699
461 -15699 -16193 20341 10993 -23624 -4942 25303 -1611 -25247 8160 23448 -14235 -20023 19407
474 19407 15256 -23323 -9420 25690 2980 -26342 3641 25274 -9947 -22553 15531 18402
486 18402 -19970 -13101 23037 7067 -24527 -691 24372 -5612 -22595 11407 19362 -16377
498 -16377 -14912 20140 9493 -22533 -3513 23372 -2659 -22669 8620 20433 -14049 -16818
510a6818L5337o459l3826J5294L0063k3175k4265K9589J6785l4044q157L6267
522A6591j036l6131J0201L3629j8725k8870K5947K2273l1427j4332L4835N546
534A8501l5970L480L4749j2059l1385J9700K6095k5907j9284L0294J1461l2609
546a2934l174L2805n054l0935J2721K7111j9275k1660K4342J4993k7661p509K8999
559A2769k53k8287P761K5600j4510k1150K0057J5213k4009q211K6069O48k6062
572a4365O928K4003j3988k0018J9999J4344k4491p442K7151j97k7804Q092K6348
585A8560j5639k2890K2296J7683k7617j1108L1309L551l3083M458L2833j2395
597G958l0620J9804K6580k6230k0955L1279J4096l4624o465L6139j519l5735R431
$$ plain form
510 -16818 18519 12060 -21766 -6472 23591 416 -23849 5740 22525 -11519 -19676 16591
522 16591 15555 -20576 -10375 23254 4529 -24341 1606 23879 -7548 -21880 12955 18501
534 18501 -17469 -13989 20760 8701 -22684 -2984 23111 -2796 -22080 8214 19675 -12934
546 -12934 -16108 16697 11643 -19292 -6571 20540 1265 -20395 3947 18940 -8721 -16230 12769
559 12769 12516 -15771 -8010 17590 3080 -18070 1987 17200 -6809 -15020 11049 11697 -14365
572 -14365 -7437 16566 2578 -17440 2559 16903 -7588 -15030 12121 11924 -15880 -7788 18560
585 18560 2921 -19969 2327 20010 -7607 -18715 12594 16145 -16938 -12480 20353 7958
597 7958 -22662 -2858 23722 -2508 -23463 7816 21912 -12712 -19177 16962 15443 -20292 -10861
610a0861L3363j6701k9259K2947K3644k7802j6847L0944R292l2150j523L1410
622A6457n999k8790J2822K4431j8449j8686K2540J1956k4849m718K5280k554k3812
635a4371R337K0632j5196j6007J9782J0306k2866l886K4262k787k3930R222K2020
648A6518j5100j8641K0010J4088k3680q730K5965K887k6750L074K5991q715k3842
661a6925J3716K0442j7739j6069K0539J1050k1966n739K1924N85k0487M095J7751
674A1177p920j3957J0575R472j1884m641J1746j13j0203M376P388p811l518J0119
688D806j060j1125N999J0717j0905q902J5396N791j9135j571K1792l469k3174
701a4840Q974K3180j4616k1738K0038J8896k4901j4772K8828R624l1593l692L2995
$$ plain form
610 -10861 22502 5801 -23458 -511 23133 -4669 -21516 9428 18720 -13430 -14953 16457
622 16457 10458 -18332 -5510 18921 472 -18214 4326 16282 -8567 -13285 11995 9441 -14371
635 -14371 -5034 15598 402 -15605 4177 14483 -8383 -12269 11993 9206 -14724 -5502 16518
648 16518 1418 -17223 2787 16875 -6805 -15535 10430 13317 -13433 -10359 15632 6917 -16925
661 -16925 -3209 17233 -506 -16575 3964 15014 -6952 -12691 9233 9818 -10669 -6574 11177
674 11177 3257 -10700 -125 9347 -2537 -7178 4568 4455 -5748 -1372 6016 -1795 -5313 4806
688 4806 3746 -7379 -1380 9337 -1568 -10470 4926 10717 -8418 -9989 11803 8334 -14840
701 -14840 -5866 17314 2698 -19040 998 19894 -5007 -19779 9049 18673 -12920 -16612 16383
714A6383k711l2862R179L1193j5328k8020K0790K3494k5225j7836K8276J1429
726A8762k9788m622K9637k162k7824Q506K4416j3941j9712J8210J3963k1031p546
739a3132K2230Q95k1782N561J9767j1475j6331J6487J1711k0311o201K2753J79
752A0351k3750O015K3257j2037k1306J7525J8081k2194j3792K5825Q664k8188
764a1549l038K9182k725k8825Q352K7108j3436k4245J7750K0391k1027j5863K3103
777E178J0977k3911o045K3448J422k1852K590J9307n763j6055P933J2368q993
790F04q606Q991N031p993j906O170n18l719K138Q39k830K154K597n027j439P478
806C964m34r388K920J0574n829j0921Q937J0356j1967q902J4687O616j6879l642
$$ plain form
714 16383 13672 -19190 -10011 21182 5854 -22166 -1376 22118 -3107 -20943 7333 18762
726 18762 -11026 -15648 13989 11827 -15997 -7491 16925 2984 -16728 1482 15445 -5586 -13132
739 -13132 9098 9993 -11789 -6228 13539 2064 -14267 2220 13931 -6380 -12581 10172 10351
752 10351 -13399 -7384 15873 3836 -17470 55 18136 -4058 -17850 7975 16639 -11549
764 -11549 -14587 14595 11870 -16955 -8603 18505 5069 -19176 -1426 18965 -2062 -17925 5178
777 5178 16155 -7756 -13801 9647 11069 -10783 -8193 11114 5351 -10704 -2771 9597 604
790 604 -8002 989 6020 -1973 -3879 2291 1773 -1946 192 1031 -1799 355 2952 -2075 -3514 3964
806 3964 3530 -5858 -2938 7636 1807 -9114 -177 10179 -1788 -10690 3997 10613 -6266 -9908
820i908J8364J26j8918L623J8482p375j7027J0838J4636j3763j1419J5898P572
833A1129j7063l356J7123q99j6090M970J3951q494j0905J1267P134j3084k876
846g193J3831j590j3450N985J1965j0031r471J3483O105j6115k069J7783k409
859F824j8372P057J7849j1650j6215J5890J3547j9548r973K2379N694k4222r43
872a1683K4958m012k4517Q874K2934j3371k0276J7219J6726k0203j2481K2129
884F297P834k2919l061K2554j530k1087N640J8688r092j5494J1661J1798j3283
897a994p809J3835L842j3406j16J2099l176j0002N806P322p670m263Q669J044
911D181q804K139Q083n030o624P476M511r314j896J0395r75j0662L908J0109o666
$$ plain form
820 -9908 8456 8582 -10336 -6713 11769 4394 -12633 -1795 12841 -922 -12341 3557 11129
833 11129 -5934 -9290 7833 6934 -9156 -4186 9765 1271 -9634 1633 8767 -4317 -7193
846 -7193 6638 5048 -8402 -2417 9548 -483 -9954 3529 9634 -6481 -8550 9233 6824
859 6824 -11548 -4491 13358 1708 -14507 1383 14930 -4618 -14591 7788 13482 -10740 -11683
872 -11683 13275 9263 -15254 -6380 16554 3183 -17093 126 16852 -3351 -15832 6297
884 6297 14131 -8788 -11849 10705 9175 -11912 -6272 12416 3324 -12170 -509 11289 -1994
897 -1994 -9803 4032 7874 -5532 -5648 6451 3275 -6727 -921 6401 -1269 -5532 3137 4181
911 4181 -4623 -2484 5599 569 -6055 1421 5932 -3382 -5278 5117 4142 -6520 -2612 7497 831
926H31q810R086O819j0929m305J2052J495j2413J440J1953m237j0729O686Q820
940G759q612o382R834L650j0333p96J0055j980r016M458P344o493n141P923K578
955D848q680K06Q684k974p973N560O575p803m566R537K100j0642P00J1030l648
970B954j0642O521R516r150p669J1346N219j2943k327J3814q42j3872M071J3082
984I078p101j1528R760R260j1841o476J3210L343j3765r7J3529l086j2501N978
998b237J0754q395q431J0213N666j1313k696J1689l21j1304L210J0214n795q500
1012g246P927O275r468l687J0353Q98j0508J909R927m540q693O849O851q665m524
1027f342R854J897j0355Q71J0098l570r121O003P481p988n320R406K768j0123
$$ plain form
926 831 -7979 1107 7926 -3003 -7308 4744 6239 -6174 -4734 7219 2982 -7747 -1061 7759
940 7759 -853 -7235 2599 6249 -4084 -4880 5175 3195 -5821 -1363 5981 -512 -5653 2270 4848
955 4848 -3832 -3626 5058 2084 -5889 -329 6246 -1557 -6123 3414 5514 -5128 -4428 6602 2954
970 2954 -7688 -1167 8349 -801 -8470 2876 8095 -4848 -7175 6639 5797 -8075 -4004 9078
984 9078 1977 -9551 209 9469 -2372 -8848 4362 7705 -6060 -6157 7372 4286 -8215 -2237
998 -2237 8517 122 -8309 1904 7570 -3743 -6439 5250 4929 -6375 -3165 7049 1254 -7246
1012 -7246 681 6956 -2512 -6199 4154 5052 -5456 -3547 6380 1840 -6853 -4 6847 -1818 -6342
1027 -6342 3512 5409 -4946 -4075 6023 2453 -6668 -665 6816 -1172 -6492 2914 5682 -4441
1041d441m3J0127k700r374N209P992p363o028R000L661j0011j064J0368j641j0007
1056f315M230R013o559p459Q502N396r905k999J0714M21j0889K221J0383m727
1070B027r266O951P586q757n447J0005L003j0641l82J0605k228r875M609Q533
1084F723o659o644Q193M397r135j915R413o19r037L050Q004n149o457O833M497
1099E495p991k265Q572j00q520K386P905m506o756O313N159p681l240Q545J131
1114D447q897J058Q669l172p902N050O674o610n038P733L133q362j060Q435j015
1129C143p948K942O936m572n493N814L695o512j729O686k72o306K137N402l761
1144A62m011M982K299n728l78N930j609n568L490M673n108l372O425J689p273
$$ plain form
1041 -4441 -4484 5643 2943 -6431 -1222 6770 -593 -6621 2379 6040 -3971 -5035 5333 3692 -6315
1056 -6315 -2085 6928 369 -7090 1412 6808 -3097 -6096 4618 5039 -5850 -3629 6754 2027
1070 2027 -7239 -288 7298 -1459 -6906 3099 6102 -4539 -4921 5684 3456 -6419 -1810 6723
1084 6723 64 -6580 1613 6010 -3125 -5040 4373 3754 -5283 -2233 5771 622 -5835 998 5495
1099 5495 -2496 -4761 3811 3711 -4809 -2423 5482 976 -5780 533 5692 -1989 -5229 3316 4447
1114 4447 -4450 -3392 5277 2105 -5797 -747 5927 -683 -5721 2012 5145 -3217 -4277 4158 3143
1129 3143 -4805 -1863 5073 501 -4992 822 4517 -1995 -3724 2962 2690 -3616 -1479 3923 162
1144 162 -3849 1133 3432 -2296 -2674 3256 1647 -3921 -431 4242 -866 -4238 2187 3876 -3397
1159c397K01P638k206p508M212O858o080n706P663M163q913k261R694J48r963
1174e457K077R678m262q831O254P482p935n713R198L594r910j295J0049j039r624
1189e734L296Q604n266p096O839N200p919l050Q446P83q399J453P792l511o658
1204e220N227N139o567l302P427J263p755Q24P579k844o911M688N776o225m276
1219e177P394K481q083n49Q318j454q026L355P258n054o061O434M524p423k743
1234d806P936Q44p949J026P483k749o563M183N283n270l738N924K051o100l64
1249b809N843j229n157K614M096l664k762M331J287m597K41M444j710l885L021
1264F4K979m091j791M832L88n188J128N137k638m688M056L838n283k624O182J168
$$ plain form
1159 -3397 -3196 4442 2236 -5272 -1060 5798 -282 -5988 1675 5838 -3075 -5336 4358 4506 -5457
1174 -5457 -3380 6298 2036 -6795 -541 6941 -994 -6707 2491 6085 -3825 -5120 4929 3890 -5734
1189 -5734 -2438 6166 900 -6196 643 5843 -2076 -5126 3320 4103 -4296 -2843 4949 1438 -5220
1204 -5220 7 5146 -1421 -4723 2704 3967 -3788 -2964 4615 1771 -5140 -452 5324 -901 -5177
1219 -5177 2217 4698 -3385 -3934 4384 2930 -5096 -1741 5517 463 -5598 836 5360 -2063 -4806
1234 -4806 3130 3974 -3975 -2949 4534 1785 -4778 -595 4688 -582 -4320 1604 3655 -2445 -2809
1249 -2809 3034 1805 -3352 -738 3358 -306 -3068 1263 2550 -2047 -1806 2638 928 -2957 64
1264 64 3043 -1048 -2839 1993 2381 -2807 -1679 3458 820 -3868 188 4026 -1257 -3881 2301 3469
1280C469o708M46O847k151o522L773N749n227m607O400L165p218j455P584l37
1295C208p483K082O960l728n992N114M694o154l152O804J456p044K91O823j939
1310A940o204L438N224m678l959N606K452o148q47O291p87o016K342N358l752
1325B60m347M902L045n704j522O107r8o099J708N679l210m851M489L686n454k285
1341c694O061P36o250Q45O029k359n400L696M428m757l197N460J818n813l56N773
1357C020j066n380K356M646l445l641M252K450m730j151M874j87m652J439M116
1372B901k561l286L463K206m057r60M328l68m236J702L775k914k990L933J909
1387B845m670o10N051q12n063K270M664l618l931M809K863n719j527O253O9o443
$$ plain form
1280 3469 -3239 -2793 4054 1903 -4619 -846 4903 -324 -4931 1469 4634 -2584 -4039 3545 3208
1295 3208 -4275 -2193 4767 1039 -4953 161 4855 -1299 -4451 2353 3809 -3235 -2944 3879 1940
1310 1940 -4264 -826 4398 -280 -4239 1367 3819 -2329 -3176 3115 2328 -3688 -1346 4012 260
1325 260 -4087 815 3860 -1844 -3366 2741 2643 -3456 -1748 3931 721 -4130 359 4045 -1409 -3694
1341 -3694 2367 3103 -3147 -2302 3727 1368 -4032 -336 4092 -665 -3862 1598 3416 -2397 -2753 3020
1357 3020 1954 -3426 -1070 3576 131 -3510 742 3192 -1538 -2689 2185 1998 -2654 -1215 2901
1372 2901 340 -2946 517 2723 -1334 -2294 2034 1666 -2570 -868 2907 -7 -2997 936 2845
1387 2845 -1825 -2435 2616 1804 -3259 -989 3675 57 -3874 935 3798 -1921 -3448 2805 2874 -3569
1403c569J438O250k914n703M251M832n363l665O177K335o675q85O837o15o616
1418c885K015O092l318n239M401M146n215k853N722J438n863qN649j379n072K596
1434g73M209l595l091M299J799m661m30M658r17m303K154L620l214k669L995J537
1450B618m464l03M601r44m417K132L936l170l182L983K257m554j202M848P8m844
1466b627J006M575k011m049K875L320l538k405L928J415m075l88L939n99l533
1481b167J451K899k134k074K589J127k784j05K649q64k255J743J586k419p21K862
1497A383k81l012J339K860k360k428L297J719m054q13M573k51m810J400M756k536
1513G82m409L587L820m538k961N264J938n765p76N986m69n900J677N557k834m911
$$ plain form
1403 -3569 -2131 4119 1205 -4498 -247 4585 -778 -4443 1734 4069 -2606 -3491 3346 2731 -3885
1418 -3885 -1870 4222 904 -4335 66 4212 -1003 -3856 1866 3304 -2559 -2567 3082 1703 -3369 -773
1434 -773 3436 -159 -3250 1049 2848 -1813 -2243 2415 1498 -2805 -651 2969 -245 -2914 1081 2618
1450 2618 -1846 -2149 2452 1508 -2909 -777 3159 -11 -3193 790 3047 -1507 -2709 2139 2217 -2627
1466 -2627 -1621 2954 943 -3106 -231 3089 -449 -2854 1074 2489 -1586 -1974 1965 1366 -2167
1481 -2167 -716 2183 49 -2025 564 1691 -1093 -1198 1451 587 -1668 75 1661 -758 -1479 1383
1497 1383 1102 -1910 -571 2289 -71 -2499 798 2517 -1537 -2350 2223 1972 -2838 -1438 3318 782
1513 782 -3627 -40 3780 -758 -3719 1545 3483 -2282 -3058 2928 2459 -3441 -1764 3793 959 -3952
1529c952L840M025m645k944N195J712n445m08N364q73m981K062M303l070l369
1544c186L843K239m320j006M494k65m334J482L869k567l130L450K178m066j100
1559b419M431p5m482J228M257k305l785L252L066m025k168M557J165m841j02M854
1575B608r58m602J931M138k793l442L453K604l901j656M104O75m041K79L730j133
1591I96l193J816K498k319j660K564P95k563M4K325q14j860J413J257j856n11
1607a068K062k66k046J029J820j731j390K295Q14k698j45K935o10k966J393K765
1623B193k110k393K761J842l268j156L626L36l755N21L658j343l375K135K874
1638B546k819k168L316J335l602m20L653n24l461J422L031k215k382K820J579
$$ plain form
1529 -3952 -112 3913 -732 -3676 1519 3231 -2214 -2622 2742 1869 -3112 -1050 3253 183 -3186
1544 -3186 657 2896 -1424 -2430 2064 1799 -2535 -1053 2816 249 -2881 569 2747 -1319 -2419
1559 -2419 2012 1937 -2545 -1317 2940 635 -3150 102 3168 -857 -3025 1532 2697 -2144 -2246 2608
1575 2608 1650 -2952 -1021 3117 324 -3118 335 2939 -962 -2618 1486 2161 -1880 -1601 2129 996
1591 996 -2197 -381 2117 -202 -1862 702 1497 -1066 -1022 1303 489 -1371 42 1299 -557 -1068
1607 -1068 994 728 -1318 -289 1531 -200 -1590 705 1519 -1179 -1324 1611 1001 -1965 -572 2193
1623 2193 83 -2310 451 2293 -975 -2131 1495 1831 -1924 -1403 2255 912 -2463 -328 2546
1638 2546 -273 -2441 875 2210 -1392 -1812 1841 1317 -2144 -722 2309 94 -2288 532 2111
1653B111l225o86L415k77l326J181L023k017k499K708J806l227r87L546R4l619
1669a979P94L510j681l159K466K620l121j911L595J100l878k16L928o77l770J555
1685h24L387k310k849K959K097l394j257L631L47l624N37L394j365k936K056K336
1701B185k605j576K920P50l023P2K928q74k604J557K127k118j495K504P76k684
1717a160k4K670p02k477J371K113j955j601K390R91k665k97K758m17k676J105
1733e76K405j738j958K247J373k611o92K801l2k787P61K585j449k192K022J658
1749A817k452r96K713K60k778M76K645j165k342J779J878k256j294K604O08k742
1765a245O9K718p44k511J350K170j868j705K273J130k540m84K620j53k557P74
$$ plain form
1653 2111 -1114 -1800 1615 1338 -1988 -807 2216 199 -2300 408 2214 -1013 -2000 1546 1640 -1979
1669 -1979 -1185 2325 644 -2515 -49 2571 -550 -2461 1134 2234 -1644 -1860 2068 1391 -2379 -824
1685 -824 2563 253 -2596 363 2460 -934 -2191 1440 1787 -1837 -1300 2094 729 -2207 -151 2185
1701 2185 -420 -1996 924 1674 -1349 -1277 1651 777 -1827 -270 1857 -261 -1756 748 1524 -1160
1717 -1160 -1184 1486 784 -1693 -322 1791 -164 -1765 625 1616 -1049 -1346 1412 995 -1681 -576
1733 -576 1829 91 -1867 380 1753 -858 -1550 1251 1219 -1568 -807 1778 329 -1863 159 1817
1749 1817 -635 -1631 1082 1342 -1436 -960 1685 520 -1822 -43 1835 -421 -1715 889 1497 -1245
1765 -1245 -1176 1542 798 -1713 -363 1807 -61 -1766 507 1637 -903 -1387 1233 1080 -1477 -703
1781g03K331j355j934J807J457k164q61K345K27k369M38K197j035j873J563J391
1797A462j947q16K162J95k226M60K099j078j796J599J376k011q42K275K24k367
1813a231L98K304r96k081J539J714j982j254K308O98k483j05K515m97k393J062
1829d84K132j569j734J993J233k280o58K422J0k387O06K219j196j865J695J382
1845A519k066q16K290J78k349M95K226j125j947J682J514k129r47K415L37k570
1861a293L29K546r88k358J587K008k081j554K480J002k730l91K831k29k788Q38
1877g91K600j402k280J875J848k248j341K510P53k606j56K565m27k371R58K047
1893A534j394j628J735J103j908n63J949Nj849N04J597r28j245J272P98j472l09
$$ plain form
1781 -703 1628 273 -1661 146 1603 -561 -1422 923 1150 -1219 -781 1416 381 -1492 71 1462
1797 1462 -485 -1301 861 1056 -1170 -710 1389 311 -1485 114 1490 -521 -1363 912 1136 -1231
1813 -1231 -833 1471 475 -1606 -67 1647 -335 -1589 719 1417 -1066 -1171 1344 847 -1546 -484
1829 -484 1648 79 -1655 338 1571 -709 -1367 1055 1065 -1322 -716 1503 307 -1558 137 1519
1845 1519 -547 -1363 927 1105 -1244 -749 1477 352 -1595 87 1601 -528 -1475 940 1277 -1293
1861 -1293 -964 1582 594 -1764 -177 1831 -250 -1804 676 1678 -1052 -1443 1388 1159 -1629 -791
1877 -791 1809 407 -1873 2 1850 -398 -1739 771 1524 -1082 -1238 1327 900 -1471 -513 1534
1893 1534 140 -1488 247 1350 -558 -1121 828 833 -1016 -512 1085 157 -1088 184 982 -490 -799
1910g99J518j55j469O30J271j019r75J324O07j536j86J629k50j606O88J447j051
1927F8j228J390Q96j614n14J763Q6j797L56J683p47j496J114J190j402q03J584
1944E29L63j649R0J590n51j390R49J085j272o99J493K25j552K56J503p25j332
1961a087J159J033j509o27J743J82j871K93J891p93j763J258J535j671j206K016
1977E83P74k243l08K365k02k378P23K256j218k009J646J660k009j219K275P27
1993A423k408k08K420l41k283Q38K046j286j679J625J247j853p63J963K48j935
2009i46K50J777o99j508J050J163j307p62J476L11j504J14J426n15j251Q54J000
2026I29j127o89J323L15j407P0J410m52j294P82J113j085q22J288N05j439j36
$$ plain form
1910 -799 719 564 -905 -275 996 -23 -998 326 933 -603 -789 840 590 -1016 -328 1119 68
1927 68 -1160 230 1126 -488 -1002 761 847 -950 -594 1089 342 -1154 -40 1150 -252 -1055 529
1944 529 892 -757 -667 923 372 -1018 -69 1016 -256 -955 538 763 -789 -533 970 245 -1087
1961 -1087 72 1105 -404 -1031 712 894 -977 -684 1207 414 -1349 -91 1444 -227 -1433 583
1977 583 1357 -886 -1194 1171 969 -1409 -686 1570 352 -1657 -11 1649 -360 -1579 696 1423
1993 1423 -985 -1193 1227 886 -1397 -559 1487 201 -1478 147 1394 -459 -1222 741 989 -946
2009 -946 -696 1081 382 -1126 -76 1087 -220 -982 494 805 -699 -585 841 326 -925 -71 929
2026 929 -198 -887 436 751 -656 -586 824 372 -922 -140 973 -112 -934 354 859 -580 -716
2043g16J476k37j407N84J248q92r93J134O78j289l18J323m5j256L84J107o86q72
2061g77R26N64j080k16J113j21j063M57R24p70o97R98M09j147q1J226k81j203
2079h19O32J117r74r05J242O43j472l20J634o8j681M74J616q64j469J220J243
2096A249j546q99J775N15j909j07J964l55j887P79J709j151j431J452J076j667
2112d33o82J785K70j802J55J700n35j517Q72J258j154r25J319N82j412j94J400
2129F87j68j304M79J153p86r07J015O14j164k74J220o3j204M01J087o98r14R67
2147A41O43j135l45J232K1j242L04J167o17r91Q56P70j038n06J166J88j171J07
2165d50J104l78r80O19P78p86n38Q83K86r24j1Q91k60p62M62N92o39l72P58J23
$$ plain form
2043 -716 760 523 -884 -300 948 56 -937 197 875 -414 -732 591 546 -710 -326 781 95 -777
2061 -777 149 713 -367 -583 530 409 -654 -197 727 -43 -740 258 667 -480 -561 665 384 -819
2079 -819 -187 930 -44 -949 293 936 -536 -856 778 710 -971 -497 1119 255 -1214 6 1249
2096 1249 -297 -1196 579 1094 -815 -922 1042 687 -1200 -421 1288 137 -1294 158 1234 -433
2112 -433 -1115 670 940 -862 -707 993 458 -1059 -187 1071 -83 -1008 311 893 -519 -713 687
2129 687 519 -785 -306 847 61 -846 169 783 -381 -655 565 502 -702 -301 786 88 -826 141
2147 141 784 -351 -696 536 557 -685 -381 786 169 -822 34 804 -234 -740 426 614 -557 -450
2165 -450 654 276 -704 -85 693 -93 -631 252 538 -386 -397 494 234 -528 -66 526 -113 -485 273 396
2185C96q03J37P96m04p00O54N24q51l14J000M9j095K59J106n57j043Q64Q78j140
2204b44o24J326L40j459%J504l41j480O95J326r73j139J249Q55j441n28J537K01
2222H04j555J46J495m90j351P67J155j014q86J184N88j280k70J318p1j258L73
2239c45J132o71r24R04O73j071l55J144M3j164K78J079n67r36Q39P21j042m45
2257g07J163J46j208J72J159m51j055P08Q85r31o54J073L94j152j22J153j40j076
2275f43L66R51n65p89P21N88q21l57Q51J36q35J04P31k72o26M64M36n67k40O04
2295B37L8n96J83N31l86m10N57K24o76pP31k18p20M62O14o63m82Q44K89r63o2
2316d73J031j98j016M41R40o80p91Q71O08j014l86J107J26j125J22J091l66r93
$$ plain form
2185 396 -407 -270 526 122 -578 76 600 -251 -565 435 484 -611 -352 754 197 -846 18 896 -244
2204 -244 -868 458 798 -661 -661 843 502 -978 -283 1043 70 -1069 180 1035 -406 -934 603 804
2222 804 -751 -605 890 400 -951 -184 971 -43 -929 255 843 -437 -707 611 540 -718 -345
2239 -345 787 116 -808 96 769 -302 -657 487 530 -634 -356 723 156 -780 59 780 -262 -707
2257 -707 456 602 -606 -434 725 274 -781 -73 812 -119 -773 300 694 -458 -580 573 433 -643
2275 -643 -277 674 109 -680 41 629 -192 -549 302 438 -397 -293 438 166 -460 4 440 -127 -367 237
2295 237 275 -321 -138 393 7 -403 154 378 -298 -305 426 208 -512 -50 564 -99 -581 263 552 -411 -473
2316 -473 558 360 -656 -215 725 45 -746 125 733 -281 -667 440 566 -559 -437 654 288 -705
2334g05N85Q51p80o39R28M01j016j42J033j27r82L78Q91o25p22Q18M94r50k41
2353e50J032o0j018L22R64n99q23Q29O23j007l78J128R8j164J77J150m71j023
2371g70O96Q70r01o68J051M23j127j70J162r5j113L38J018n52q78P35O84q78m40
2390f15R39K13r72K6R26k61q10M45O73o21m57P16K52p79j2P48k07o79M13N44n77
2411i5l66O94J75p59N9P52k78o84M71N62o22m12P22K52q08l1Q07j74p48L51O55
2432E23n13n31O45L58p07j94P45Rp32J77O61l45n58M94M13o13k14O65K0o75J86
2453a86O14l76n10N47L58o65j70P34k5p60K52P13m65o11O27M81p78k84Q58Q7r07
2474d66J43Q85l69p94N53O79p11n25Q29L36r10j27R24q7q82K98Q06n05o70O57
$$ plain form
2334 -705 -120 731 -49 -688 240 641 -375 -517 516 389 -593 -215 676 51 -671 147 641 -309 -550
2353 -550 482 422 -596 -274 690 91 -732 97 720 -287 -665 463 561 -603 -426 724 253 -770
2371 -770 -74 796 -105 -773 278 701 -426 -596 566 471 -642 -304 714 162 -716 19 703 -175 -615
2390 -615 324 537 -435 -409 517 256 -554 -109 564 -57 -514 202 454 -325 -337 411 204 -475 -62 482 -95
2411 -95 -461 233 408 -351 -292 460 182 -502 -31 531 -91 -503 219 471 -337 -368 439 265 -483 -132 523
2432 523 10 -521 124 482 -225 -419 326 335 -397 -220 441 96 -462 32 445 -168 -382 283 303 -372 -186
2453 -186 428 52 -458 89 447 -218 -388 346 321 -439 -187 526 61 -550 77 558 -220 -504 354 441 -466
2474 -466 -323 562 193 -601 -48 631 -80 -605 224 560 -350 -477 447 360 -522 -224 582 77 -593 64
2494F4M95p53l08Q21J01q44J32Q01l45p04N29N58o75l77P93J47q29P6Q20k93p57
2515e48M99O30o76m67Q07K63q83m1Q91j70q58L79P66n56o37P09M65q05k89Q71
2535C50Q7q79J14Q27k96p34M63O09n87m51O70K70p18p0P04j11o57K84N49m12m27
2556d15N29K55n93o8N94j06n58K81M66m16l52N38J95o04k5O18j43n94L07N21m45
2577a5m12N58K74o22j19O58l4o61K03N90l31n18M76L72n37k58N98R9o07N2N93
2598C59k29n03L52L99m70k51N36R4n67Q3N46k50m69M00L68n25k36O22N0o55J30
2619b16O57l23n86M64M96o27l39P26J75p89OQ08j97p73L70P18n46n81O61M45p66
2640b17k79Q22J01q41R7P92k64p29M27O26n82m67O71L04p33j13P41q4o90K58O08
$$ plain form
2494 64 559 -194 -502 319 420 -424 -292 509 164 -540 -11 547 -128 -505 288 435 -394 -318 502 209 -548
2515 -548 -49 581 -95 -562 245 508 -375 -416 475 305 -553 -174 592 36 -601 108 573 -232 -521 350
2535 350 437 -442 -328 499 203 -531 -68 541 -46 -497 173 443 -275 -345 359 248 -409 -125 424 12 -415
2556 -415 114 369 -224 -292 302 196 -362 -81 385 -31 -383 155 350 -254 -279 339 196 -398 -91 430 -15
2577 -15 -427 131 405 -217 -336 322 288 -373 -170 420 89 -429 47 419 -118 -376 222 321 -286 -234 359
2598 359 130 -373 -21 378 -92 -343 193 287 -280 -197 349 99 -370 30 398 -127 -363 259 309 -346 -216
2619 -216 441 118 -468 -4 492 -135 -474 252 427 -362 -356 452 255 -518 -148 570 24 -557 104 549 -217
2640 -217 -496 326 427 -414 -317 475 211 -518 -91 535 -47 -514 157 461 -272 -385 356 272 -418 -160 448
2661D48m22m77N32L46o39j42O60m0o39K13N88l81m80N19L36o19j73O61J3o73J58
2682b11O26l05n53M40M40n38l24O20J73o53k3O46j19n96K42N36l66m31M65L07
2702C76n34j59N32K3n15J27M54k46l62L43K51m12j18M49m6m17J81L52k95k61L86
2723A09J47m47j4M72j42m44K74L91l93l02M90J87n71m1N92q6n92K34N46l65m80
2744d35M98L71n89k40O39J02o71N6O55k11o12L64N31m82m09N82K47o29r3O43p4
2765B43o20K40N49l92m25M97K99n76j36O04l3n95J83N61l40m61M45L63n63k09
2785c66O26O1o54R7O29k56n69L88M94n09l73N83K44o33r7O61n8o42K16N73l33
2806H2n06M51L79n39k35N74R1n72N0N40j84m65L03L58l86k42M37J08m51K7M25
$$ plain form
2661 448 26 -451 81 427 -212 -354 306 266 -373 -160 428 47 -433 86 422 -197 -370 291 304 -369 -211
2682 -211 415 110 -443 -3 437 -101 -425 195 368 -285 -308 338 219 -377 -135 401 35 -396 69 376
2702 376 -158 -317 215 238 -277 -150 304 58 -304 39 290 -122 -240 209 163 -254 -73 279 -16 -277 109
2723 109 256 -191 -205 267 125 -319 -45 346 -47 -349 141 328 -243 -284 308 222 -370 -136 410 45 -435
2744 -435 63 434 -155 -395 244 346 -325 -269 386 175 -437 -73 458 -24 -433 149 396 -233 -326 317 243
2765 243 -377 -137 412 20 -405 92 391 -185 -321 283 250 -345 -162 399 59 -402 43 406 -157 -366
2785 -366 260 321 -333 -236 393 137 -432 -44 450 -59 -432 151 395 -238 -335 326 268 -374 -158 415 82
2806 82 -424 27 406 -133 -368 206 297 -275 -225 315 131 -334 -31 327 -59 -301 136 244 -207 -180 245
2827B45j61l46K53K84l49j59L79M1l92P6L92j97l38K93K63l68j72M30M6m50O0
2848a70M59j81m19L02L46m03k58M61J58n16k1N24j02n08K26M59l53l59M34K68
2868C47n28j16N36j1n27J59M76k83m03L98K86m67j62N20J7n23J18M90k50m32L58
2889CL46m57k19N25Q4n40M0N45j82n10L06M41m14l59N06K43n73r4N97l9n94J80
2911a65N34k86m86M27L78n17k49N69J00n69M3N36j82m72K75M01l61l00M26J79
2931B81m58n5M63p7m18J86L55k73k73L36J75l69p5L85l9l69J46L21k41k54L18
2952F5J66l61p0L83k5l87J40L53k49k95L34K11l86j10M14Qm21J05L96k18l50L22
2974B5K61l89j54M21M8m32O2M19j83l55K67K93l51j88L90R6m20PM19j34l75K32
$$ plain form
2827 245 84 -262 -9 275 -74 -233 146 187 -205 -129 263 66 -272 21 284 -84 -256 174 220 -230 -170
2848 -170 289 108 -311 -9 337 -66 -324 137 295 -221 -242 282 180 -328 -102 357 4 -355 79 347
2868 347 -181 -297 239 228 -299 -140 336 53 -350 48 334 -133 -295 225 242 -281 -163 327 77 -355 3
2889 3 349 -108 -327 198 282 -258 -218 327 145 -365 -59 382 -32 -391 115 358 -215 -309 288 249 -345 -165
2911 -165 369 83 -403 24 402 -115 -364 205 305 -264 -221 315 133 -339 -64 337 -24 -324 102 281
2931 281 -177 -232 231 154 -264 -78 277 4 -269 67 242 -127 -202 183 144 -225 -79 242 1 -253 65
2952 65 231 -130 -200 183 158 -229 -89 264 15 -280 54 265 -121 -231 183 191 -230 -125 271 53 -297 25
2974 25 286 -103 -257 164 212 -220 -158 261 78 -277 -10 283 -68 -256 134 230 -190 -183 236 102 -273 -41
2996d1L13l09k30L69J51m07l9M18o7m25J82L86k88l15L63K28m28j26M72Mm71J17
3018a43M49k35l98L34L13m17k14M73R6m99L0M84j37m39K36L75l36k64L77J84m32
3039a63q0M52m1m12J32L77k28l02L02K21l45j33L72K4l71P1L54j67l03K48K40
3060B48l08j55L48N4l74N3L53j44l12K12K69l16j67L59Q2l71K0L68j27l26K13
3081b1K79k97k02L42J03l42k4L73r8l29J66K94k43k41L13J45l32p3L58k4l46J17
3103h2L13k12k48K63J95l10j18L47J2l38Q0L13j62k92K51K37l28j43L52N1l72
3124a91O1L63j54l21K28K77l12j93L55J06l96LL84r0l60J85L07k62k47L10J87
3145B40l49j03L74Rl71R1L44j77k93K43K33l04j61L43P0l47J7L31j05l08K02K44
$$ plain form
2996 -41 272 -37 -267 102 253 -154 -193 225 158 -267 -85 301 13 -302 61 289 -139 -265 207 211 -260 -143
3018 -143 306 71 -327 7 320 -97 -311 162 258 -241 -211 273 136 -303 -67 308 -28 -292 85 269 -163
3039 -163 -243 209 168 -244 -112 265 37 -265 37 258 -87 -220 152 176 -195 -124 230 63 -240 8 248
3060 248 -60 -215 133 187 -187 -134 219 75 -237 -25 244 -72 -239 120 202 -169 -149 219 92 -234 -21
3081 -21 258 -39 -241 101 204 -138 -162 211 113 -216 -50 244 1 -240 73 218 -114 -187 171 147 -199 -82
3103 -82 231 19 -229 34 229 -81 -199 148 160 -178 -98 215 53 -239 12 249 -79 -222 130 181 -191
3124 -191 -130 233 79 -242 -14 263 -49 -242 113 219 -177 -174 210 120 -240 -55 252 -10 -257 53 240
3145 240 -109 -212 162 171 -200 -109 235 58 -235 8 241 -63 -224 119 189 -158 -141 190 85 -223 -21 223
3167B23k54j88K96J15l32oL21p3l02J60K45k31j75K71J13l17qL18p7k96J39K69
3189B11k17j95K65J26l07n8L38l9l08R9K85j78k45K41J85k81j15L12M3l27M9L10
3211A94j34k63J81K28k54j48K91Q0l16kL25j00k87J70K57k47j84K76J17l13j8
3232a47L18o5l04J45K59k13k00K65J25k93n4L20l0l03R9K78j63k49K38J88k77
3253f3j23L01M8l09K7L10j16k76J80K37k40j76K75J05l01k5L05m4k97J25K59k04
3275bj91K58J23k85n7K95l3k65R4K47j72j97K31J26k44p0K61rk55P6K42j47j97
3298a71J89J63k40r2K70J9k77O1K42r8k36J68J99k34j43K71P3k98J2K87q6k64
3320a85J58K09j97j71K55J02k80k8K90n0k73J20K46j91j84K41J24k71o3K88j9
$$ plain form
3167 223 -31 -219 77 192 -140 -146 175 102 -200 -40 205 -26 -201 70 183 -134 -142 176 99 -197 -58 211
3189 211 -6 -201 64 190 -117 -175 163 124 -184 -85 200 22 -223 18 203 -78 -193 119 162 -165 -116 194
3211 194 60 -203 -22 206 -48 -196 95 175 -141 -143 182 82 -205 -35 222 -25 -209 67 184 -129 -147
3232 -147 171 106 -198 -53 206 -7 -207 58 183 -110 -164 156 126 -177 -78 200 37 -212 26 214 -63
3253 -63 -186 115 163 -146 -119 191 75 -201 -21 216 -24 -200 75 180 -121 -146 159 115 -182 -57 202 -2
3275 -2 -193 65 188 -97 -154 141 108 -157 -63 184 12 -185 46 172 -72 -142 119 110 -145 -69 173 26 -171
3298 -171 18 181 -59 -151 119 138 -139 -78 164 66 -170 -2 197 -37 -180 91 164 -134 -122 165 79 -185
3320 -185 -27 182 -15 -186 69 171 -109 -137 153 103 -170 -50 196 5 -179 62 186 -85 -148 140 121
3341A21k75Q4K60j72k16K26J64k65p5K57K2k82N8K62j18k35J81J90k25j29K44
3362G7Q4k72j3K80o5k68J32K39j98j90K55J20k69m8K74k8k57R1K52j62k15K27
3384D6J25k40q0K60J0k58O4K33j17k00J61J64k18r6K40L3k48L3K30j00k01J50
3406iJ65j81j22K22N7k41KK38n6k25J26J86j72j58K32Q8k41k7K49l9k41R9K19
3429A71j60j74K04J17k40n0K44j6k41P3K25j34j72J72J34k26o7K35J6k40M8K26
3451A45j04k11J69J65k09j18K46M6k42KK47o3k40J41J90j69j61K17R8k37l2K44
3473A24k7k55J07K14j46k02K19J28k36p9K63Qk59P2K22j24j94J65J59k16q0K26
3495H9L2k43L6K28q7k13J53J60j77j18K01P3k29jK07k6k15R0J92j54j42J92R0
$$ plain form
3341 121 -154 -70 190 18 -198 28 192 -73 -148 109 131 -151 -93 169 51 -184 -3 187 -38 -167 77
3362 77 161 -111 -124 156 91 -177 -45 194 -4 -194 61 181 -88 -136 138 110 -147 -56 196 34 -181 46
3384 46 171 -69 -149 111 121 -137 -73 160 43 -157 4 168 -50 -146 94 127 -121 -88 142 42 -159 -9
3406 -9 156 -25 -147 75 132 -109 -107 131 75 -150 -24 162 -10 -168 64 152 -89 -116 133 94 -147 -48 171
3429 171 11 -163 41 158 -82 -132 112 96 -145 -72 153 19 -153 19 153 -73 -140 95 111 -129 -81 145
3451 145 41 -170 -1 164 -45 -163 83 129 -113 -111 136 73 -167 -26 164 -5 -166 51 149 -88 -120 124
3473 124 97 -158 -51 163 17 -185 34 162 -74 -153 110 118 -141 -69 153 29 -165 0 159 -57 -137 89
3495 89 121 -122 -86 142 55 -158 -5 155 -22 -140 61 134 -95 -96 111 85 -130 -40 152 -2 -144 48 138
3518A38k10l8K14j1k18P2J90j32j54J72J15k11n7K31j1j94M5K09j28j68J50J29
$$ plain form
3518 138 -72 -110 104 93 -125 -53 137 5 -149 23 138 -73 -130 101 90 -104 -59 150 22 -146 4 133
$$ [...]
8191B
##END NTUPLES=NMR FID
##END=
