##TITLE=1H_ESAC-MeCel-C2
 
 8 sc, 
 20.1.2022
##JCAMPDX= 6.0         $$ Bruker NMR JCAMP-DX V2.0
##DATA TYPE= NMR FID
##DATA CLASS= NTUPLES
##ORIGIN= UXNMR, Bruker Analytische Messtechnik GmbH
##OWNER= root
$$ XWIN-NMR		Version 3.5
$$ Thu Jan 20 10:57:55 2022 Russian Standard Time (UT+4h)  she@DPX200
##.OBSERVE FREQUENCY= 200.131346
##.OBSERVE NUCLEUS= ^1H
##.DELAY= (6, 6)
##.ACQUISITION MODE= SIMULTANEOUS
##.ACQUISITION SCHEME= undefined
##.AVERAGES= 8
##.DIGITISER RES= 18
##SPECTROMETER/DATA SYSTEM= spect
##.PULSE SEQUENCE= zg30
##.SOLVENT NAME= CDCl3
##.SHIFT REFERENCE= (INTERNAL, CDCl3, 0, 15.7039)
##AUDIT TRAIL= $$ (NUMBER, WHEN, WHO, WHERE, WHAT)
$$ ##TITLE= Audit trail, XWIN-NMR		Version 3.5
$$ ##JCAMPDX= 5.01
$$ ##ORIGIN= Bruker BioSpin GmbH
$$ ##OWNER= she
$$ F:/spectra/data/she/nmr/H-F/1/audita.txt
$$ ##AUDIT TRAIL=  $$ (NUMBER, WHEN, WHO, WHERE, WHAT)
(   1,<2022-01-20 10:56:21.18 +0400>,<she>,<DPX200>,
      <created by zg, POWCHK disabled, PULCHK disabled
       configuration hash MD5:
       00 E9 B6 7A A2 85 ED C7 34 08 36 98 17 FE 4E 26
       data hash MD5: 16K
       C4 E8 DA 1B 49 9A 2F 57 D6 4D 8B 11 D8 10 59 2E>)
$$ ##END=
$$ 
$$ hash MD5
$$ D9 C8 EA C6 31 C7 F9 2F E9 00 1A 88 DE F2 97 18
##$RELAX= 
##$RELAX= 
##$RELAX= 
##$RELAX= 
##$RELAX= 
##$RELAX= 
$$ Bruker specific parameters
$$ --------------------------
##$DU= <F:/spectra>
##$EXPNO= 1
##$NAME= <H-F>
##$PROCNO= 1
##$TYPE= <nmr>
##$USER= <she>
##$AMP= (0..31)
100 100 100 100 100 100 100 100 100 100 100 100 100 100 100 100 100 100 
100 100 100 100 100 100 100 100 100 100 100 100 100 100 
##$AQSEQ= 0
##$AQ_mod= 1
##$AUNM= <au_zg>
##$AUTOPOS= <>
##$BF1= 200.13
##$BF2= 200.13
##$BF3= 200.13
##$BF4= 200.13
##$BF5= 200.13
##$BF6= 200.13
##$BF7= 200.13
##$BF8= 200.13
##$BYTORDA= 1
##$CFDGTYP= 0
##$CFRGTYP= 5
##$CHEMSTR= <none>
##$CNST= (0..31)
1 1 145 1 1 1 1 1 1 1 1 1 1 1 1 1 1 1 1 1 1 1 1 1 1 1 1 1 1 1 1 1 
##$CPDPRG= <>
##$CPDPRG1= <>
##$CPDPRG2= <>
##$CPDPRG3= <>
##$CPDPRG4= <mlev>
##$CPDPRG5= <mlev>
##$CPDPRG6= <mlev>
##$CPDPRG7= <mlev>
##$CPDPRG8= <mlev>
##$CPDPRGB= <>
##$CPDPRGT= <>
##$D= (0..31)
0 1.2 0 0 0 0 0 0 0 0.06 0 0.03 0 0 0 0 0.0002 0 0 0 0 0 0 0 0 0 0 0 0 
0 0 0 
##$DATE= 1642661780
##$DBL= (0..7)
120 120 120 120 120 120 120 120 
##$DBP= (0..7)
150 150 150 150 150 150 150 150 
##$DBP07= 0
##$DBPNAM0= <>
##$DBPNAM1= <>
##$DBPNAM2= <>
##$DBPNAM3= <>
##$DBPNAM4= <>
##$DBPNAM5= <>
##$DBPNAM6= <>
##$DBPNAM7= <>
##$DBPOAL= (0..7)
0.5 0.5 0.5 0.5 0.5 0.5 0.5 0.5 
##$DBPOFFS= (0..7)
0 0 0 0 0 0 0 0 
##$DE= 6
##$DECBNUC= <off>
##$DECIM= 32
##$DECNUC= <off>
##$DECSTAT= 4
##$DIGMOD= 1
##$DIGTYP= 9
##$DL= (0..7)
0 120 120 120 120 120 120 120 
##$DP= (0..7)
150 150 150 150 150 150 150 150 
##$DP07= 0
##$DPNAME0= <>
##$DPNAME1= <>
##$DPNAME2= <>
##$DPNAME3= <>
##$DPNAME4= <>
##$DPNAME5= <>
##$DPNAME6= <>
##$DPNAME7= <>
##$DPOAL= (0..7)
0.5 0.5 0.5 0.5 0.5 0.5 0.5 0.5 
##$DPOFFS= (0..7)
0 0 0 0 0 0 0 0 
##$DQDMODE= 0
##$DR= 18
##$DS= 0
##$DSLIST= <SSSSSSSSSSSSSSS>
$$ [...]
##$SUBNAM2= <"">
##$SUBNAM3= <"">
##$SUBNAM4= <"">
##$SUBNAM5= <"">
##$SUBNAM6= <"">
##$SUBNAM7= <"">
##$SUBNAM8= <"">
##$SUBNAM9= <"">
##$SW= 18.0517287032376
##$SWIBOX= (0..15)
0 0 2 0 0 0 0 0 0 0 0 0 0 0 0 0 
##$SW_h= 3612.71676300578
##$TD= 16384
##$TD0= 1
##$TE= 0
##$TE2= 300
##$TE3= 300
##$TEG= 300
##$TL= (0..7)
0 120 120 120 120 120 120 120 
##$TP= (0..7)
150 150 150 150 150 150 150 150 
##$TP07= 0
##$TPNAME0= <>
##$TPNAME1= <>
##$TPNAME2= <>
##$TPNAME3= <>
##$TPNAME4= <>
##$TPNAME5= <>
##$TPNAME6= <>
##$TPNAME7= <>
##$TPOAL= (0..7)
0.5 0.5 0.5 0.5 0.5 0.5 0.5 0.5 
##$TPOFFS= (0..7)
0 0 0 0 0 0 0 0 
##$TUNHIN= 0
##$TUNHOUT= 0
##$TUNXOUT= 0
##$USERA1= <user>
##$USERA2= <user>
##$USERA3= <user>
##$USERA4= <user>
##$USERA5= <user>
##$V9= 5
##$VALIST= <valist>
##$VCLIST= <CCCCCCCCCCCCCCC>
##$VD= 0
##$VDLIST= <DDDDDDDDDDDDDDD>
##$VPLIST= <PPPPPPPPPPPPPPP>
##$VTLIST= <TTTTTTTTTTTTTTT>
##$WBST= 1024
##$WBSW= 4
##$XGAIN= (0..3)
0 0 0 0 
##$XL= 0
##$YL= 0
##$YMAX_a= 241478
##$YMIN_a= -274535
##$ZGOPTNS= <>
##$ZL1= 120
##$ZL2= 120
##$ZL3= 120
##$ZL4= 120
##$ABSF1= 10
##$ABSF2= 0
##$ABSG= 5
##$ABSL= 3
##$ALPHA= 0
##$AQORDER= 0
##$ASSFAC= 0
##$ASSFACI= 0
##$ASSFACX= 0
##$ASSWID= 0
##$AUNMP= <proc_1d>
##$AZFE= 0.1
##$AZFW= 0.1
##$BCFW= 1
##$BC_mod= 2
##$BYTORDP= 1
##$COROFFS= 0
##$CY= 11.3945322036743
##$DATMOD= 1
##$DC= 2
##$DFILT= <>
##$DTYPP= 0
##$F1P= 2.36226072786647
##$F2P= -0.459571619588291
##$FCOR= 0.5
##$FTSIZE= 0
##$FT_mod= 4
##$GAMMA= 1
##$GB= 0.15
##$INTBC= 1
##$INTSCL= 1
##$ISEN= 128
##$LB= 0.24
##$LEV0= 0
##$LPBIN= 0
##$MAXI= 10000
##$MC2= 0
##$MEAN= 0
##$ME_mod= 0
##$MI= 1.114404
##$NCOEF= 0
##$NC_proc= 0
##$NLEV= 6
##$NOISF1= 3.799351
##$NOISF2= 2.8
##$NSP= 1
##$NTH_PI= 0
##$NZP= 0
##$OFFSET= 15.70392
##$PC= 1
##$PHC0= -15953.34
##$PHC1= 16.00078
##$PH_mod= 1
##$PKNL= yes
##$PPARMOD= 0
##$PSCAL= 0
##$PSIGN= 0
##$REVERSE= no
##$SF= 200.130013532006
##$SI= 16384
##$SIGF1= 3
##$SIGF2= 2
##$SINO= 400
##$SIOLD= 16384
##$SREGLST= <1H.CDCl3>
##$SSB= 0
##$STSI= 0
##$STSR= 0
##$SW_p= 3612.71676300578
##$SYMM= 0
##$S_DEV= 0
##$TDeff= 0
##$TDoff= 0
##$TI= <>
##$TILT= no
##$TM1= 0
##$TM2= 0
##$TOPLEV= 0
##$USERP1= <user>
##$USERP2= <user>
##$USERP3= <user>
##$USERP4= <user>
##$USERP5= <user>
##$WDW= 1
##$XDIM= 8192
##$YMAX_p= 0
##$YMIN_p= 0
$$ End of Bruker specific parameters
$$ ---------------------------------
##NTUPLES= NMR FID
##VAR_NAME=  TIME,          FID/REAL,        FID/IMAG
##SYMBOL=    X,             R,               I
##VAR_TYPE=  INDEPENDENT,   DEPENDENT,       DEPENDENT
##VAR_FORM=  AFFN,          ASDF,            ASDF
##VAR_DIM=   8192,          8192,            8192
##UNITS=     SECONDS,       ARBITRARY UNITS, ARBITRARY UNITS
##FACTOR=    0.0002768,     1,               1
##FIRST=     0,             0,               0
##LAST=      2.2672688,     0,               0
##MIN=       0,             -274535,         0
##MAX=       2.2672688,     241478,          0
$$ Real data points
##PAGE= N=1
##DATA TABLE= (X++(R..R)), XYDATA
$$ [...]
$$ plain form
276 -49379 11635 54653 14758 -47352 -37924 28059 50945 -2371 -50128 -21283 38238 38123 -19257
289 -19257 -45631 -2666 42264 21752 -30147 -33738 13963 38074 3031 -35012 -17808 25819
301 25819 27662 -13352 -32027 -49 31185 12796 -25296 -22871 15547 28851 -3814 -30523
313 -30523 -8891 27017 20526 -18296 -28372 6231 31196 7111 -28498 -19823 19842 28777 -6863
326 -6863 -31547 -7062 28203 19428 -19472 -27995 6718 30556 7000 -26724 -18394 18221 25909
339 25909 -6693 -28380 -5784 25239 16519 -17603 -23603 7348 26359 3894 -24448 -14301
351 -14301 18084 21787 -8761 -25407 -2003 24574 12506 -19257 -20831 10383 25379 478
363 478 -25376 -11508 20554 20594 -11625 -25760 414 26084 11069 -21318 -20553 12246 26005
$$ packed form
276d9379O1014M3018l9895o2110R428O5983K2886n3316m7757K8845N9521j15n7380
289a9257k6374M2965M4930k0512n1899l591M7701K4111l5043l8043J7204M3627
301B5819J843m1014j8675L1978L1234j8389l8092K425L8418J3304l2665k6709
313c0523K1632L5908o491l8822j0076L4603K4965k4085l5609Q675L9665Q935l5640
326f863k4684K4485L5265q775l8900q523L4713K3838k3556l3724Q330L6615P688
339B5909l2602k1687K2596L1023q720l4122o000L0951J9011k2465k8342J0147
351a4301L2385L703l0548j6646K3404K6577j2068l1763j574L1214J4996k4901
363D78k5854J3868L2062M0l2219j4135K6174K5670j5015l2387P65L2799J3759
$$ plain form
376 26005 -655 -26190 -10884 21320 20298 -12231 -25651 712 25730 10707 -20701 -19734 11793
389 11793 24754 -695 -24836 -10386 19876 19026 -11199 -23708 599 23666 9856 -18998
401 -18998 -18113 10723 22547 -674 -22485 -9149 18192 16948 -10504 -21223 1166 21386 8042
414 8042 -17578 -15404 10751 19739 -2202 -20357 -6376 17422 13592 -11567 -18293 3808 19752
427 19752 4448 -17797 -11863 12812 17242 -5614 -19706 -2767 18643 10725 -14203 -16975 6991
440 6991 20210 1779 -19663 -10534 15187 17407 -7559 -20970 -1800 20353 11048 -15461 -18132
453 -18132 7274 21511 2500 -20365 -11774 14969 18556 -6450 -21352 -3271 19666 12101 -13988
466 -13988 -18211 5633 20416 3503 -18492 -11584 13002 16995 -5343 -18944 -2979 17217 10267
$$ packed form
376B6005k6660k5535J5306L2204j022l2529j3420K6363K5018j5023l1408R67L1527
389A1793J2961k5449k4141J4450L0262q50l0225j2509K4307K3067j3810k8854
401a8998Q85K8836J1824k3221k1811J3336K7341j244k7452j0719K2389K0220j3344
414H042k5620K174K6155Q988k1941j8155J3981K3798l830k5159o726K2101J5944
427A9752j5304k2245N934K4675M430k2856j4092J6939K1410p918k4928k772K3966
440F991J3219j8431k1442R129K5721K220k4966j3411J9170K2153r305k6509k671
453a8132K5406J4237j9011k2865Q591K6743L587k5006j4902J8081K2937p565k6089
466a3988m223K3844J4783j6913k1995O908K4586L993k2338j3601J5965K0196o950
$$ plain form
479 10267 -12465 -15343 5667 17413 1804 -16338 -8664 12393 13744 -6436 -16286 -492 15933
492 15933 7260 -12735 -12636 7292 15724 -532 -15933 -6350 13214 12104 -7976 -15605 1167 16152
506 16152 5898 -13624 -11924 8388 15627 -1539 -16334 -5683 13829 11744 -8661 -15576 1770
519 1770 16310 5376 -13901 -11477 8789 15256 -2066 -16071 -4993 13773 10956 -8874 -14730
532 -14730 2372 15630 4486 -13518 -10327 8884 14100 -2647 -15098 -3978 13210 9703 -8852
545 -8852 -13457 2901 14584 3488 -12954 -9126 8877 12936 -3175 -14267 -3074 12832 8649
558 8649 -9024 -12589 3484 14071 2675 -12892 -8327 9205 12345 -3774 -14003 -2392 12911
571 12911 8066 -9312 -12132 3927 13808 2206 -12718 -7784 9151 11738 -3853 -13255 -2041
$$ packed form
479A0267k2732k878K1010J1746j5609j8142P674K1057J351k0180r850J5794J6425
492A5933q673j9995R9J9928Q432j6256j5401R583J9564j110k0080p629J6772J4985
506A6152j0254j9522J700K0312P239j7166j4795J0651J9512k085k0405o915J7346
519A770J4540j0934j9277K424K0266O467j7322j4005J1078J8766k817j9830n856
532a4730J7102J3258j1144j8004L191J9211N216j6747j2451J1120J7188l507j8555
545h852m605J6358J1683j1096j6442L828J8003M059j6111j1092J1193J5906m183
558H649j7673l565J6073J0587j1396j5567M565J7532L140j6119j0229J1611J5303
571A2911m845j7378k820J6059R881j1602j4924M934J6935K587j5591r402J1214
$$ plain form
584 -2041 12137 7327 -8696 -10938 3732 12301 1670 -11280 -6462 8215 9758 -3879 -11154
597 -11154 -897 10515 5201 -8167 -8488 4577 10243 -361 -10367 -3866 8818 7530 -5822
610 -5822 -10081 1736 11037 2889 -10112 -7328 7253 10757 -2740 -12322 -2654 11526 7993 -8205
624 -8205 -11970 2917 13609 3358 -12295 -9137 8183 13064 -2084 -14123 -4534 11960 10139
637 10139 -7091 -13359 721 13459 5569 -10567 -10342 5484 12529 414 -11893 -5792 8825
650 8825 9483 -4242 -10934 -694 10139 5018 -7554 -7961 3958 9284 1 -8957 -3595 7299
664 7299 6467 -4595 -8228 1281 8750 2276 -7875 -5562 5677 8037 -2351 -9214 -1600 8655
678 8655 5442 -6370 -8374 2660 9631 1683 -8872 -5730 6172 8481 -2239 -9340 -2068 8141
$$ packed form
584b041J4178m810j6023k242J4670Q569j0631j2950M818J4677J543j3637p275
597a1154J0257J1412n314j3368l21J3065N666j0604j0006O501J2684j288j3352
610e822m259J1817R301q148j3001K784J4581L504j3497r582R668J4180l533j6198
624h205l765J4887J0692j0251j5653L158J7320M881j5148j2039R589J6494j821
637A0139j7230o268J4080J2738p890j6136K25J5826P045j2115j2307O101J4617
650H825O58j3725o692J0240J0833n121j2572m07J1919N326r283q958N362J0894
664G299q32j1062l633R509P469o474j0151K313J1239K360j0388o863P614J0255
678H655l213j1812k004J1034O971p948j0555L142J1902K309j0720p101P272J0209
$$ plain form
692 8141 5643 -5339 -7795 1677 8159 1922 -6910 -4704 4596 6318 -1827 -6668 -808 6062 3018
707 3018 -4783 -4659 3085 5772 -1069 -6328 -1225 6186 3713 -5126 -6101 2957 7828 255 -8338 -4079
723 -4079 7035 7634 -3931 -9986 -651 10174 5610 -7904 -9687 3418 11645 2212 -10780 -7555
737 -7555 7194 11160 -1721 -11979 -4143 9842 8900 -5322 -11277 -237 10847 5433 -7865
750 -7865 -8930 3359 10094 1489 -8908 -5437 5974 7778 -2214 -8300 -1465 7174 4373 -5011
764 -5011 -6181 2280 6791 474 -6399 -2948 5113 4897 -3177 -6173 724 6537 1943 -5843 -4452
779 -4452 4078 6334 -1386 -7055 -1747 6384 4688 -4280 -6656 1210 7216 2168 -6101 -4943 3678
794 3678 6525 -552 -6531 -2437 5119 4603 -2780 -5542 200 5238 1974 -4048 -3441 2398 4066 -763
$$ packed form
692H141k498j0982k456R472O482o237q832K206R300J722q145m841N860O870l044
707C018p801J24P744K687o841n259N103P411k473q839r75R058M871p573q593M259
723d079J1114N99j1565o055R335J0825m564j3514j783J3105Q227r433j2992L225
737g555J4749L966j2881j0258P836J3985r42j4222n955J1040J1084n414j3298
750g865j065J2289O735q605j0397L471J1411J804r992o086O835Q639k801r384
764e011j170Q461M511o317o873L451Q061k16q074k996O897N813m594p786J391
779d452Q530K256p720n669N308Q131j696q968k376P866O006n048q269J158Q621
794C678K847p077n979M094P556n16p383k762N742N038l264o022O07N839J668m829
$$ plain form
810 -763 -4088 -671 3664 1837 -3038 -2825 2203 3682 -1058 -4316 -479 4531 2386 -3957 -4313 2417
826 2417 5816 68 -6244 -3007 5253 5744 -2784 -7382 -676 7387 4344 -5495 -7145 2098 8319
841 8319 1955 -7427 -5608 4678 7856 -821 -8176 -3162 6492 6183 -3403 -7635 -315 7205 3645
856 3645 -5265 -5921 2348 6723 745 -6085 -3365 4373 5092 -2015 -5732 -427 5368 2633 -4136 -4238
872 -4238 2344 5142 -219 -5207 -1904 4429 3778 -2879 -5039 761 5435 1607 -4798 -3736 3180
887 3180 5179 -852 -5593 -1701 4798 3872 -2993 -5202 551 5334 1900 -4336 -3822 2458 4795 -225
903 -225 -4698 -1840 3675 3339 -2045 -4027 275 3975 1353 -3233 -2539 2123 3250 -817 -3470 -475
919 -475 3274 1688 -2677 -2734 1690 3491 -386 -3794 -1149 3494 2684 -2524 -3902 906 4466 1047
$$ packed form
810g63l325L417M335j827m875K13N028J479m740l258L837N010k145o343l56O730
826B417L399n748o312L237Q260M91q528m598O706Q063l043r839j650R243O221
841H319o364r382J819J0286L178q677p355N014R654l09r586m232P320P520l560
856C645q910o56Q269M375n978o830K720P738P19p107l717N305N795k735o769j02
872d238O582K798n361m988L303O333o51o657k160N800M674l828o405J062O916
887C180J999o031m741L892O499r26o865k209N753M783l434o236N14O280K337n020
903b25m473K858N515l36n384j982M302L700k622m586O94M662J127m067k653K995
919d75L749j586m365n7M424J801l877l408K645M643q10n208j378M808L560l419
$$ plain form
935 1047 -4189 -3016 2945 4461 -966 -5025 -1367 4476 3475 -2889 -4859 636 5168 1775 -4318
950 -4318 -3769 2526 4911 -222 -4934 -2031 3925 3796 -2120 -4656 -5 4575 2016 -3576 -3549 1942
966 1942 4325 -48 -4283 -1814 3426 3239 -2009 -4097 231 4149 1518 -3479 -3009 2175 3942 -492
982 -492 -4148 -1319 3584 2858 -2326 -3868 619 4132 1186 -3587 -2759 2358 3793 -649 -4024 -1123
998 -1123 3484 2660 -2268 -3592 668 3841 1022 -3331 -2458 2213 3384 -721 -3645 -873 3241 2233
1014 2233 -2257 -3201 860 3555 640 -3280 -2058 2378 3076 -1067 -3545 -475 3367 1925 -2540
1029 -2540 -3037 1240 3590 334 -3424 -1827 2646 2983 -1313 -3551 -236 3423 1756 -2640 -2890 1349
1045 1349 3466 181 -3354 -1633 2590 2751 -1363 -3328 -96 3243 1500 -2565 -2614 1399 3205 -9
$$ packed form
935A047n236J173N961J516n427m059L658N843j001o364j970N495M532l393o093
950d318N49O295K385n133m712K903N956j29n916k536M651M580k559n592K7N491
966A942K383m373m235K469N240j87n248k088M328L918k631m997M70N184J767m434
982d92l656K829M903p26n184j542M487L513k946m773Q28N117J435m442l375K901
998a123M607q24m928j324M260L173k819m353Q73M671J171m105k924K772M114j008
1014B233m490r44M061K695k915l920J222M436O98m143k478L070L842j442m465
1029b540m97M277K350l256l758J597M473L37m296k238L315L659j667m396k50M239
1045A349K117l285l535J721M223J61m114j965L232L339j743m065m9M013J806l214
$$ plain form
1061 -9 -3201 -1407 2570 2515 -1465 -3165 89 3192 1316 -2606 -2466 1534 3141 -138 -3184 -1261
1077 -1261 2639 2409 -1544 -3061 189 3136 1189 -2563 -2274 1535 2893 -266 -2963 -995 2475
1092 2475 2024 -1574 -2665 418 2770 733 -2443 -1746 1680 2423 -670 -2679 -455 2508 1515 -1890
1108 -1890 -2332 929 2759 253 -2703 -1430 2135 2415 -1106 -2955 -178 2947 1539 -2300 -2597 1168
1124 1168 3187 297 -3086 -1710 2344 2782 -1061 -3277 -435 3062 1845 -2195 -2821 884 3173
1139 3173 557 -2868 -1836 1964 2657 -744 -2932 -564 2579 1665 -1788 -2389 706 2625 427 -2364
1155 -2364 -1396 1728 2111 -792 -2408 -211 2312 1197 -1775 -1942 962 2368 54 -2343 -1056 1896
1171 1896 1895 -1077 -2381 32 2416 1032 -1967 -1907 1123 2399 -66 -2419 -1019 1938 1856 -1097 -2305
$$ packed form
1061il192J794L977n5l980j700L254L103j876l922J40M000J607l279l046J923
1077a261L900k30l953j517L250K947j947l752K89L809J358l159k697J968L470
1092B475m51l598j091L083K352k037l176O97L426P43l093k009K224K963r93l405
1108a890m42L261J830k506k956J273L565K80l521j849K777L125j408l839k97L765
1124A168K019k890l383J376M054M38l843k216K842L497j217m040o26L705K289
1139C173k616l425J032L800O93l401k188K368L143r14l453o01L095J919k198k791
1155b364R68L124L83k903j616K197K523j115k972j67K904J406k314k397J287K952
1171A896jk972j304K413K384j384k999O0L030J276k465k353J400K957q2k953j208
$$ plain form
1188 -2305 52 2299 935 -1836 -1704 1047 2110 -124 -2089 -744 1740 1453 -1090 -1852 324 1967
1204 1967 500 -1732 -1184 1268 1720 -553 -1939 -241 1881 1047 -1477 -1713 787 2089 106 -2114
1220 -2114 -1068 1677 1848 -901 -2308 -131 2290 1181 -1806 -2029 892 2461 230 -2376 -1326
1235 -1326 1781 2148 -789 -2490 -351 2308 1404 -1633 -2107 655 2388 439 -2115 -1362 1468 1983
1251 1983 -546 -2153 -403 1939 1225 -1336 -1780 545 1974 299 -1801 -1058 1321 1593 -633 -1865
1267 -1865 -178 1766 905 -1391 -1510 731 1816 49 -1817 -834 1463 1465 -832 -1830 30 1855 792
1284 792 -1494 -1434 878 1818 -65 -1845 -735 1509 1389 -867 -1741 112 1771 660 -1462 -1273 878
1301 878 1637 -174 -1679 -556 1410 1145 -909 -1518 240 1606 430 -1419 -1032 982 1455 -360
$$ packed form
1188b305K357K247j364k771J32K751J063k234j965J345K484k87k543p62K176J643
1204A967j467k232N48K452M52k273j386J698K122q34k524k36K500J302j983k220
1220b114J046K745J71k749j407K177K421j109k987k23K921J569k231k606J050
1235a326L107L67k937j701K139K659r04l037m74K762J733j949k554P53K830N15
1251A983k529j607J750K342p14k561m44K325J429j675k100P43K379K72k226j232
1267a865J687J944q61k296j19K241J085j767j866R83K297Kk297r98J860J825j063
1284G92k286O0K312R40j883j780J110K244j20k256q74J853J659j111k122J89K151
1301H78P59j811j505J123J966k65k054o09J758J366j176j849L87K014M73j815
$$ plain form
1317 -360 -1606 -323 1483 976 -1067 -1435 469 1686 269 -1574 -944 1190 1509 -530 -1742 -230
1333 -230 1677 992 -1240 -1545 563 1809 257 -1700 -1016 1245 1577 -535 -1808 -283 1657 1027
1349 1027 -1180 -1547 470 1722 318 -1552 -999 1088 1467 -417 -1610 -313 1446 938 -984 -1344
1365 -1344 395 1483 267 -1325 -817 965 1227 -418 -1364 -146 1299 709 -979 -1107 522 1324
1381 1324 31 -1308 -573 1075 1026 -650 -1314 85 1349 486 -1175 -992 756 1318 -190 -1412 -437
1398 -437 1238 985 -798 -1333 210 1438 444 -1239 -976 799 1350 -182 -1413 -427 1221 991 -743
1415 -743 -1305 184 1378 445 -1159 -950 748 1266 -186 -1333 -403 1129 893 -760 -1217 226 1314
1432 1314 328 -1181 -839 812 1172 -309 -1325 -263 1210 782 -879 -1179 364 1352 237 -1242
$$ packed form
1317c60j246J283J806n07k043l68J904J217j417j843O30K134L19k039j212J512
1333b30J907o85k232l05K108J246j552j957O84K261L32k112j273J525J940o30
1349A027k207l67K017J252j404j870N53K087L79j884j193J297J759n08j922l60
1365a344J739J088j216j592N08J782K62j645r46J218J445n90j688j28J629Q02
1381A324j293j339P35J648m9j676o64J399J264q63j661J83J748N62j508j222R75
1398d37J675k53j783n35J543J228r94j683K63J775N51j532j231R86J648k30j734
1415g43n62J489J194r33j604K09J698N18j452j147R30J532k36j653m57J443J088
1432A314r86j509L42J651L60j481j016J062J473m28j661l00J543R88j115j479
$$ plain form
1448 -1242 -783 889 1197 -351 -1343 -235 1245 813 -852 -1181 313 1316 290 -1161 -809 777
1464 777 1148 -250 -1230 -308 1044 759 -704 -1044 202 1101 257 -968 -681 655 901 -271 -1006 -162
1482 -162 928 513 -694 -791 382 937 -3 -931 -368 808 713 -521 -936 157 1026 287 -915 -679
1500 -679 656 985 -219 -1098 -267 1004 720 -683 -1049 213 1143 299 -1015 -779 645 1065 -181
1517 -181 -1159 -357 963 786 -614 -1067 114 1111 367 -933 -778 571 1015 -128 -1061 -337 904 725
1535 725 -568 -952 181 1033 268 -908 -648 637 937 -247 -1034 -208 936 613 -689 -931 263
1552 263 1039 183 -967 -619 668 927 -266 -1053 -224 929 636 -640 -921 210 1006 239 -880 -643
1570 -643 568 886 -168 -937 -249 803 590 -510 -803 159 850 201 -734 -499 511 690 -214 -781
$$ packed form
1448a242M59J672L08j548r92J108J480m32j665l29J494J003j026j451L52J586
1464G77L71j398r80R22J352k85j463l40J246Q99q44j225K87J336K46j172p35Q44
1482a62J090m15j207r7J173N55r40r28N63J176r5j234m15J093Q69p39j202K36
1500f79J335L29j204q79Q31J271k84j403l66J262R30q44j314K36J424M20j246
1517a81r78Q02J320j77j400m53J181R97p44j300J55J349M44j143r33P24J241j79
1535G25j293l84J133Q52p65j176K60J285L00j184p87Q26J144l23j302k42J194
1552B63P76q56j150L48J287K59j193p87Q29J153k93j276k81J131P96p67j119K37
1570f43J211L18j054p69O88J052k13j100k93R62O91o49r35K35J010J79r04n67
$$ plain form
1588 -781 -104 723 386 -563 -610 306 737 -27 -765 -308 624 546 -429 -734 89 783 224 -707 -570 464
1608 464 764 -129 -831 -257 734 580 -468 -799 119 854 279 -724 -595 458 798 -89 -834 -294 705
1627 705 606 -434 -776 85 807 261 -695 -581 421 739 -128 -807 -237 680 515 -480 -735 147 783 171
1647 171 -713 -486 502 696 -197 -791 -147 730 475 -519 -699 209 803 156 -713 -454 523 706 -177 -784
1667 -784 -166 692 477 -466 -678 163 738 169 -653 -459 439 630 -155 -702 -155 628 410 -446 -603 168
1687 168 661 99 -618 -373 453 546 -226 -631 -42 617 313 -487 -492 281 626 1 -624 -249 520 485 -295
1708 -295 -601 46 629 245 -522 -471 309 606 -49 -636 -237 508 451 -320 -624 31 613 223 -521 -469 304
1729 304 584 -49 -618 -216 518 436 -314 -581 67 608 195 -510 -411 335 565 -91 -588 -163 522 395 -353
$$ packed form
1588g81O77Q27l37r49m7R16M31p64p38M57R32p8r75l05Q23O94n59r31J37J034
1608D64L00q93p02N74R91j54j048l31R18P35n75j003J29J053L40q87p45N40R99
1627G05r9j040l42Q61P22n46r56J14J002L18q67o79N70R17j65r95k55Q82O36o12
1647A71q84K27R88J94q93n94O44Q77k55r94j80R08N94o47q69K59R77J83q83o07
1667g84O18Q58k15r43k12Q41N75n69q22J94Q98J91p85n47N47P83k18q56j57P71
1687A68M93n62p17K45Q26R3p72m05N89O59l04q00nP73L45o25o25L75P69l5p80
1708b95l06O47N83l84p67N1P80K97o55n87L99P45n7p71l04O55N82l90p44N2P73
1729C04K80o33n69M02P34q2p50k67O48N41m13p05R9P46K30o56m97M25O85j27p48
$$ plain form
1750 -353 -543 117 598 137 -535 -367 374 518 -139 -574 -117 514 336 -371 -504 126 545 86 -515 -340
1770 -340 358 467 -151 -540 -98 498 296 -349 -455 165 535 69 -489 -279 375 453 -175 -518 -52 523
1790 523 277 -394 -438 220 522 24 -529 -242 411 423 -233 -539 -12 520 226 -420 -419 227 511 -8 -514
1811 -514 -220 395 396 -216 -501 -3 486 224 -390 -389 201 471 -4 -462 -194 381 369 -215 -452 27 473 192
1833 192 -378 -352 235 447 -37 -460 -156 386 331 -247 -442 47 456 129 -404 -313 258 428 -73 -461 -135
1854 -135 386 299 -260 -418 76 438 111 -379 -283 253 379 -86 -415 -85 378 260 -246 -344 109 408 86
1875 86 -356 -217 259 345 -116 -393 -51 369 205 -278 -334 147 393 16 -399 -192 312 324 -192 -419 -1
1896 -1 406 180 -343 -333 196 439 -4 -425 -183 367 341 -194 -416 -1 429 184 -337 -339 189 433 23 -403
$$ packed form
1750c53j90O60M81m61o72J68P41J44o57m35M57O31j78p07j33O30M19m59o01J75
1770c40O98J09o18l89M42N96k02o45j06O20L70m66n58K10O54P8o28l43M66N75
1790E23k46o71m4O58L02m98n53K87O53J2o56l06N27N32k94o46JO46K84n19n06
1811e14K94O15Jo12k85M98M89k62o14JN90K70m75m58K68N75j2n84k37M79M46k81
1833A92n70K6N87K12m84m23L04N42n5n78j95M89M09l27n33R1N71J70n01l88L26
1854a35N21q7n59j58M94L62l27m90R6N36J26m65l29L30M63j18n06r8M53K99l22
1875H6m42J39M76Q6m61k77L42M20j64m83n6M81K46l77m15K07N04J2n16k27M18
1896aM07k26n23J0N29K43m43m21K42N50k6n35k22M15M30k45n21kN28K44m10m26
$$ plain form
1918 -403 -180 320 325 -156 -402 -7 379 178 -304 -312 156 365 -17 -374 -172 284 278 -172 -376 11 362 142
1940 142 -302 -277 186 352 -36 -366 -123 308 263 -205 -332 69 372 114 -309 -242 220 346 -58 -351 -103
1961 -103 312 230 -207 -321 62 327 90 -286 -228 177 294 -66 -323 -79 268 193 -198 -283 64 305 44
1982 44 -286 -173 206 250 -105 -302 -18 297 156 -231 -246 139 311 -6 -310 -127 255 252 -148 -319 25 335
2004 335 132 -279 -244 163 325 -28 -345 -148 271 253 -162 -331 -3 326 130 -275 -268 132 321 1 -313
2025 -313 -154 251 252 -131 -299 -3 306 142 -233 -222 129 300 21 -284 -116 237 229 -127 -283 20 287 103
2047 103 -248 -204 145 266 -46 -288 -80 243 188 -182 -265 39 270 67 -257 -186 159 249 -52 -276 -60 243
2069 243 165 -157 -235 52 265 68 -220 -153 154 238 -50 -234 -52 213 144 -154 -213 66 241 39 -232 -140
$$ packed form
1918d03K23N00Nm81k46L95L86k01m82qM68K09l82l57K02M56om50k04L87L51k20
1940A42m44K5M63J66l88l30K43M31m5m68j27M01L03k58m23O7M62J26m04k93K48
1961a03M15q2m37j14L83K65k37l76N8M05J17l60k57K44L47p5l91q5L47K41k61
1982D4l30J13L79M4l55j97K84L15j41l87j5L85J72l17l04J83L82lm00j71L44L10
2004C35k03m11L5M07J62l53l17J97M19j8m15j69L28L29j96m05PM00J89l20l14
2025c13J59M05Jl83j68K96L09j64l75J1L51J71k79l05J68L53ql56j56L03K67j84
2047A03l51M4L49J21l12k42K08L23n5l70q3L04K31k03l24P1L45R0l01k24K16L03
2069B43p8l22p8K87K13j97k88O7L07Q4k88j84J82K65o9k98n9K79J75k02k71R2
$$ plain form
2091 -140 172 193 -88 -243 -10 231 103 -199 -187 126 238 -21 -263 -105 208 180 -134 -266 20 267 92
2112 92 -221 -197 142 270 -16 -275 -104 228 215 -121 -250 15 268 124 -208 -207 104 255 11 -254 -115 194
2134 194 190 -110 -252 -10 239 92 -203 -195 95 218 -15 -233 -89 189 165 -108 -217 22 221 73 -182 -152
2156 -152 126 206 -44 -208 -57 201 149 -130 -187 54 224 53 -195 -132 137 190 -52 -213 -45 191 124 -130
2178 -130 -191 45 199 29 -188 -127 113 161 -61 -205 -35 173 103 -148 -161 56 191 22 -188 -84 146 150
2200 150 -83 -188 2 195 89 -160 -139 96 184 -22 -204 -74 175 155 -124 -205 22 209 62 -193 -166 106
2222 106 195 -33 -228 -89 164 145 -119 -214 -14 203 72 -179 -173 94 200 -1 -208 -90 160 157 -79 -186
2244 -186 2 190 84 -154 -138 91 179 -13 -182 -65 153 117 -98 -179 18 163 29 -163 -123 92 149 -43
$$ packed form
2091a40L12K1k81j55K33K41j28l02J2L13J12k59k42J58L13k8l14j32K86K47j75
2112I2l13K4L39J28k86k59J71L32j3l36j29K65K53j44l32JL11J51k44k65J39L09
2134A94ml00j42K42K49j47k95QK90J23k33k18J44K78k4k73j09K39J99j48k55L0
2156a52K78Q0k50j64J51K58n2k79n7K41J70j71k48O3K69N3k42j61J68K36o7k54
2178a30o1K36J54j70k17O1K40M8k22j44J70K08p0k51j3K17J35j69k10J04K30M
2200A50k33j05J90J93j06k49K1K35Q8k06j82J30K49k0k79q1K27J87j47k55K7K72
2222A06Q9k28j95J39K53j9k64r5K00K17j31k51OK67J06k01k07J18K50lk36j07
2244a86J88J88j06k38J6K29Q8j92j69J17K18l6k15q1J97J45j34j92M0K15N7j92
$$ plain form
2266 -43 -185 -60 139 99 -118 -169 22 167 13 -167 -108 106 152 -38 -172 -38 149 99 -103 -149 30 166
2288 166 27 -147 -97 116 134 -48 -159 -31 137 76 -115 -134 56 145 -8 -163 -74 111 93 -92 -161 3 140
2311 140 44 -148 -114 74 146 -31 -167 -58 135 110 -99 -147 24 176 52 -130 -118 97 164 -10 -167 -69 141
2334 141 121 -91 -160 16 161 52 -146 -126 84 152 -11 -168 -77 125 111 -89 -158 -3 147 47 -147 -119 79
2357 79 138 -24 -150 -42 120 87 -90 -128 36 142 31 -138 -83 92 122 -42 -152 -29 128 84 -100 -132 36
2380 36 139 33 -123 -90 88 109 -43 -142 -36 114 67 -97 -131 25 126 13 -130 -77 81 103 -47 -135 -19
2403 -19 122 61 -102 -101 48 119 0 -122 -47 104 90 -65 -119 16 131 38 -109 -97 65 111 -21 -141 -39 110
2427 110 83 -74 -126 7 127 29 -122 -104 65 118 -27 -146 -52 100 91 -63 -142 10 127 34 -105 -91 72 114
$$ packed form
2266d3j42J25J99m0k17n1J91J45j54j80N9K14M6j90j34J34J87n0k02m6J79J36
2288A66j39j74N0K13J8j82j11J28J68o1j91j9J90Q9j53j55Q9J85j8j85o9J64J37
2311A40r6j92L4J88P2j77j36J09J93k5k09m8J71J52j24j82J2K15O7j74j57R8K10
2334A41k0k12o9J76J45j09j98K0K10O8j63j57R1K02j4k00o9J55J50j00j94K8J98
2357G9N9j62j26J08J62l3j77l8J64J06j11j69N5J75L0j64j10J23J57m4j84l2J68
2380C6J03j06j56L3J78K1j52r9J06J50m7j64l4J56J01j13j43N3J58K2j50q8J16
2403a9J41o1j63JJ49P1j19j22P5J51j4j55n4J35J15r3j47J2J62M6j32j20J02J49
2427A10k7j57n2J33J20r8j51J8J69N3j45j19R4J52rj54p9J52J17r3j39J4J63M2
$$ plain form
2451 114 -23 -126 -34 116 89 -69 -109 24 118 32 -104 -67 82 111 -23 -131 -40 101 74 -93 -114 28 119 13
2475 13 -124 -75 74 102 -34 -134 -28 108 68 -76 -111 28 110 17 -103 -66 72 106 -26 -114 -16 98 68 -70
2499 -70 -101 36 98 24 -104 -58 76 82 -38 -113 -13 97 23 -98 -97 40 94 -13 -114 -50 80 74 -52 -104 -1
2524 -1 106 36 -83 -81 54 100 -15 -111 -40 96 77 -48 -108 15 110 46 -82 -80 45 103 -1 -108 -43 87 70 -50
2550 -50 -101 7 94 19 -95 -75 52 82 -17 -110 -42 76 57 -81 -104 27 89 11 -88 -54 68 80 -28 -105 -6 100
2576 100 58 -69 -73 36 105 28 -96 -69 70 94 -27 -102 -20 90 59 -76 -94 28 88 2 -102 -66 63 71 -36
2601 -36 -104 -21 87 37 -66 -85 23 83 6 -81 -51 55 71 -35 -80 0 86 33 -80 -64 45 96 -1 -79 -34 64 67
2628 67 -48 -83 8 72 31 -80 -73 35 75 -14 -94 -42 64 50 -49 -91 2 63 17 -76 -78 50 76 -20 -90 -21 74 64 -53
$$ packed form
2451A14j37j03R2J50k7j58m0J33R4q6j36L7J49K9j34j08R1J41k7j67k1J42R1j06
2475A3j37M9J49K8j36j00J06J36m0j44l5J39Q2r3j20L7J38L4j32q8R8J14l0j38
2499g0l1J37O2p4j28M6J34Oj20p5J00J10p4j21JJ37N4j07j01O4J30oj26n2J03
2524aJ07p0j19KJ35M6j15r6P1J36j9j25o0J23R5o4j28KJ25N8j04j07O5J30j7j20
2550e0n1J08Q7p5j14K0J27L0r9r3O8J18j9j38k3J31O2p8r9L4J22J2j08p7R9J06
2576A00m2j27mJ09O9p7j24K7J39K4j21p5Q2J10l1j35j8J22O0q6j04L6J29Qj07
2601c6o8Q3J08n0j03j9J08O0p7q7L0J06J6j06m5Q0Q6n3j13J6J09N1r7p8M5R8L
2628F7j15l5R1O4m1j11PJ08M0q9q0N2J06j4r9m2R3O1m6r3kJ28K6r6p0O9R5j0j17
$$ plain form
2657 -53 -82 12 83 17 -69 -52 59 76 -11 -68 -7 71 48 -61 -65 22 76 1 -81 -50 57 59 -30 -87 -21 67 43 -75 -76 12
2687 12 72 6 -83 -66 54 73 -25 -82 -17 74 45 -55 -73 16 78 18 -71 -42 53 72 -24 -68 -21 75 35 -51 -58 28 66 -3
2717 -3 -77 -37 43 55 -45 -87 -9 60 21 -60 -57 29 72 1 -72 -36 44 57 -39 -63 4 67 20 -64 -45 47 74 4 -57 -16 63
2748 63 61 -24 -64 -2 55 26 -51 -49 45 50 -11 -74 -17 50 37 -45 -76 9 58 8 -69 -40 44 62 -25 -59 -13 61 36 -43 -55 25
2780 25 69 11 -57 -36 41 65 -4 -67 2 61 55 -31 -45 19 79 10 -54 -37 55 55 -14 -66 -11 55 25 -52 -49 21 68 10 -65 -34
2812 -34 56 56 -19 -52 4 60 39 -50 -45 23 67 5 -52 -26 45 57 -25 -49 12 70 30 -48 -47 33 60 9 -51 -20 47 42 -29 -47
2844 -47 4 53 18 -52 -45 21 48 -7 -66 -19 47 41 -33 -48 -3 59 21 -48 -42 36 54 2 -55 -12 57 44 -18 -41 21 59 13 -39
2876 -39 -21 30 46 -13 -47 -1 49 32 -35 -51 5 46 -4 -57 -36 30 39 -24 -55 -13 43 32 -44 -42 14 50 26 -49 -36 43 48 -4
$$ packed form
2657e3k9R4P1o6q6J7J11J7q7n7O1P8k3j09mQ7N4p5q2L1J07Kq9n7O6Q8k4j18jQ8
2687A2O0o6q9J7J20J9r8n7O5R1k9j00j8Q9O2o0q9K9R5J9r6m4M7R6m0q6pQ6L8o9
2717cp4M0Q0J2j00m2P8O9l9q1LQ6M3p1p3L6Q0J3r6k4O7O3m7q4J9R2K7p0o1M1P9
2748F3kq5m0O2N7k9p7KR4No1o3N7O7j3q2l1Q5M9n0p7K9Q4J8q7l4M6P4k5p9j2Q0
2780B5M4n8o8K1P7K4o9o3O9N9oq6j4O4O0o9o4J7R2%o9n2N5O6l0p7LP0M7n8p5L1
2812c4R0%p5l3N6N6k1q9NO8M4o2n7K6P1J2q2k4O1N8m0p8JQ0K7n1o0L1O7np1j8
2844d7N1M9l5p0PO6K7n5n9M7O6op4j5M5O2l8o9OP8J8n2n7M3O9j3o2k3O2L8m6n2
2876c9J8N1J6n9l4M6N0j7o7j6N6M1n0n3K1O6Ro3l1M2N6j1p6KN6L6k4p5J3P9Nn2
$$ plain form
2908 -4 -41 -3 46 37 -30 -43 26 62 15 -51 -22 41 43 -8 -49 -5 42 21 -43 -36 13 42 -10 -52 -30 27 30 -24 -50 3 38 15 -40
2941 -40 -32 23 45 2 -40 -19 39 44 -19 -41 1 45 19 -29 -26 23 44 6 -37 -10 36 34 -25 -42 6 43 9 -46 -41 21 40 -9 -39
2974 -39 -13 36 25 -29 -39 14 51 6 -33 -22 33 33 -8 -37 -8 34 23 -23 -28 17 47 13 -33 -23 38 41 -3 -34 7 45 25 -23
3006 -23 -27 15 48 10 -34 -22 30 33 -27 -48 -9 41 21 -28 -26 17 34 4 -31 -10 33 34 -16 -40 3 39 26 -21 -19 23 44 2 -25
3039 -25 -8 35 37 -3 -32 9 48 17 -39 -34 15 34 0 -42 -19 24 32 -18 -40 -11 36 6 -28 -30 17 40 3 -35 -12 29 28 -14 -24
3072 -24 16 44 17 -17 -19 23 35 -3 -25 -4 42 20 -19 -24 15 40 11 -19 -28 23 25 -11 -31 -14 30 14 -27 -33 2 27 2 -33 -28
3105 -28 16 28 -7 -41 -7 30 30 -17 -29 10 41 10 -21 -6 30 32 0 -28 0 42 19 -15 -17 12 40 12 -30 -14 23 31 -13 -31
3137 -31 0 17 14 -14 -31 4 16 2 -30 -18 17 23 -12 -26 10 33 18 -25 -16 20 39 10 -28 -6 33 16 -10 -31 12 36 23 -19
$$ packed form
2908dl7L8M9ro7j3O9L6m7o6K9O3Kn1m1M4M7k1o4PM9K9n2m2K2N7Ln4k6N3L5k3n5
2941d0QN5K2m3m2K1N8No3k2M2M4k6m8LM9K1l8m3K7M6kn9j7M8L7l4n5NO2J9m9l0
2974c9K6M9j1n4j0N3L7m5l9J1N5%m1k9K9M2j1m6nM5L0l4m6J0O1Lm4l1M1L8k0m8
3006b3mM2L3l8m4J2N2Lo0k1L9N0k0m9KM3J7l0l5K1M3Jn0k4M3L6j3m7KM2K1m2k7
3039b5J7M3Km0k9M1L9l1n6NM9J9l4m2K3M3Qn0k2K9M7l0l4kM7K3l7l8K3M1jm2j0
3072b4M0K8k7l4kM2J2l8k2K1M6k2l9nL9K5k9l0rN1Kl6k0J7M4j6m1oL5K5k5l5N
3105b8M4J2l5l4L4L7%m7j2L9L1l1l1J5L6Kl2k8K8M2k3l4kK9K8k8m2J6L7Qm4j8
3137c1L1J7lk8j7L5J2j4l2J2L5Ol5j4L6K3j5m3RL6J9k9l8K2L9j7k6k1M3K4j3m2
$$ plain form
3169 -19 -17 19 35 6 -18 -10 27 15 -17 -36 -1 36 2 -30 -28 1 25 -16 -33 -3 25 20 -18 -27 8 24 9 -15 -3 16 37 4 -24
3202 -24 3 24 19 -7 -8 13 27 8 -21 -11 24 18 -12 -25 -11 25 16 -18 -23 -2 24 0 -24 -22 14 23 -6 -24 7 16 13 -28 -10 19 29
3237 29 14 -14 -5 23 21 -6 -17 6 24 17 -13 -15 4 26 7 -19 -3 12 24 -15 -11 -7 26 14 -22 -21 8 20 -4 -24 -17 18 16 -17 -15
3272 -15 8 23 13 -15 -10 11 24 -3 -20 9 24 25 -2 -10 12 29 7 -21 -6 18 19 0 -16 1 16 20 -19 -22 4 16 2 -17 -12 2
3306 2 4 -10 -25 -20 18 5 -19 -18 3 17 4 -18 -12 14 19 -11 -23 5 29 19 -6 -14 -1 22 8 -17 0 18 11 -5 -31 1 6 16 -16
3341 -16 -12 0 6 -8 -23 -22 10 9 0 -24 2 11 5 -26 -24 -1 14 -3 -25 -13 22 20 -5 -7 6 21 10 -6 -5 16 27 15 -16 -1 14 10
3377 10 -12 -16 8 28 3 -30 -18 12 7 -8 -32 -15 20 6 -10 -22 3 13 4 -11 -9 8 23 -6 -22 3 21 23 -9 -5 18 19 6 -7
3411 -7 -4 32 28 6 -11 -5 20 13 0 -12 6 28 1 -15 -9 20 14 -16 -21 -7 9 14 -10 -5 4 9 1 -18 -5 19 9 -10 -11 -12 17 0 -13 -15
$$ packed form
3169a9KL6J6k9k4QL7j2l2j9L5L7l4l2KK9K4m1j7L0K8nl8rL5J6j5k4J2J9K1l3k8
3202b4K7K1nk6jK1J4j9k9J0L5ol0j3J4L6rl4nK1K6k4k4KL6Rk9j8L1Rlm1J8K9J0
3237B9j5k8RK8kk7j1K3J8pl0kJ9K2j9k6J6J5J2l9MML3j2l6JK9J2k4k0PL5kl3K
3272a5K3J5j0k8NK1J3k7j7K9J5Jk7qK2J7k2k8J5K4Jj9j6J7J5Ml9lK6J2j4j9NJ4
3306BKj4j5NL8j3k4JK1J4j3k2OK6Nl0j2K8K4j0k5qJ3K3j4k5J7J8pj6k6L2NJ0l2
3341a6MJ2Oj4j5JL2jrk4K6Rol1KK3J5j7k2J2L5kk5kJ3J5j1j6JK1J1j2l1J5J5m
3377A0k2mK4K0k5l3J2L0nj5k4J7L5j4j6j2K5J0rj5KJ7J5k9j6K5J8Kl2MK3Jj3j3
3411gLL6mk2j7OK5pj3j2J8K2k7j6OK9ol0nJ4J6Nk4NRNqj9J3K4j0j9jjK9j7j3k
$$ plain form
3449 -15 9 23 3 -1 -8 22 18 6 -10 8 22 21 -2 -13 8 27 2 -11 4 24 7 -18 -14 0 13 2 -18 -6 0 12 -8 -19 -1
3482 -1 18 13 -8 -2 13 24 8 -12 -6 22 13 4 -17 6 18 15 -2 -10 11 11 7 -7 -8 9 10 0 -15 2 14 6 -20 -14 11 12 0 -17 -9 7
3520 7 17 -3 -23 -5 20 9 -14 -15 9 21 14 -1 -3 26 9 1 -11 7 41 12 -2 -5 19 5 -1 -13 -7 12 10 -11 -15 -2 11 9 -8 -16
3556 -16 3 6 -7 -17 -9 4 10 -11 -13 0 13 5 -1 -12 11 16 4 2 1 27 12 -5 -3 11 27 -4 3 -4 10 21 -5 -8 5 25 6 -4 -14
3593 -14 0 14 5 -22 -13 1 5 -10 -15 -4 7 3 -13 -8 -7 10 5 -13 -6 14 15 -5 -12 3 27 9 10 -9 12 21 13 -13 -4 9 10 -10 -17 -2 11
3632 11 2 -19 -12 2 11 -3 -11 -2 14 -2 -10 -10 8 2 0 -12 -10 -1 13 -6 1 -1 8 9 -7 -16 7 14 12 -4 0 17 6 -3 -6 -4 5 12 -8 -4 0 11 9 -16
3676 -16 -9 1 14 -9 -21 -6 9 8 -13 -9 -5 -4 -2 -19 -10 7 12 0 -6 -1 14 14 -16 -1 10 19 11 -12 -6 0 18 -7 -4 7 21 22 -3 -8 14
3715 14 19 1 -1 -11 6 3 -8 -6 -14 3 3 -1 -21 -1 12 3 -2 4 12 7 -10 -6 6 12 3 -11 0 8 12 5 -7 -5 21 9 -6 -5 9 15 7 -6 -6 7
$$ packed form
3449a5K4J4k0mpL0mj2j6J8J4jk3j1K1J9k5j3J5K0j7k5MJ4J3j1k0J2OJ2k0j1J8
3482aJ9nk1OJ5J1j6k0OK8rrk1K3J2lj7qK1%mj4jJ7Jj0j5J7J2qk6OK5Jj2j7QJ6
3520GJ0k0k0J8K5j1k3jK4J2pj5kK9j7qj2J8L4k9j4lK4j4oj2OJ9kk1mJ3J3kj7q
3556a6J9Lj3j0QJ3Ok1kJ3J3qoj1K3Nj2kjK6j5j7KJ4J6l1PpJ4J1k6lJ3K0j9j0j0
3593a4J4J4rk7RJ4Mj5nJ1J1mj6NJJ7nj8PK0Jk0pJ5K4j8Jj9K1Rqk6RJ3Jk0pJ5J3
3632A1rk1PJ4Rj4qRJ6j6q%J8okj2KRJ4j9PkRJj6rK3Pkj6MJ7j1rlKRPk0MMJ1kk5
3676a6PJ0J3k3j2J5J5jk1MMJKj7RJ7Nj2oNJ5%l0J5J1Rqk3OOJ8k5LJ1J4Jk5nK2
3715A4Nj8kj0J7lj1KqJ7%mk0K0J3rnOQnj7MJ2Orj4J1QMpj2KK6j2j5JJ4Oqj3%J3
$$ plain form
3757 7 13 3 -15 -2 5 9 -20 -5 3 3 5 -9 -21 -3 11 -1 -9 -3 20 -1 -3 -5 3 13 5 -9 -3 12 9 -2 1 8 16 1 -3 -5 13 22 16 0 -5 7
3799 7 12 -7 -9 -5 1 -6 -8 -3 2 15 -3 -17 -7 4 7 1 -10 -11 12 9 -9 7 -2 11 1 -5 -8 9 10 4 2 8 11 19 -4 -2 16 17 9 4 -3 5 14 -6 -8
3844 -8 6 6 2 -14 -4 11 12 -8 -5 -9 6 11 -9 -13 10 9 -3 -4 0 8 12 -3 -5 12 8 15 -1 -1 2 14 7 -8 -1 3 9 -9 -13 2 6 -4 7 -9
3886 -9 -4 9 -3 -3 0 5 8 6 -18 1 17 -2 -2 -8 19 11 -3 -5 -6 11 8 -2 -5 1 15 20 2 6 13 16 11 -5 3 15 12 -3 -7 9 14 2 1 -7 1 10
3930 10 -1 -10 -8 5 0 -13 -11 5 -1 7 -8 2 2 3 0 -1 6 10 7 1 -5 16 21 11 3 1 14 13 9 -5 9 19 12 -2 -10 -5 17 0 -5 -2 2 9 -2 -13
3974 -13 -10 12 5 -11 -5 6 12 16 -7 1 18 2 8 -4 -4 9 12 1 2 12 8 3 -7 2 12 20 -2 -4 -1 9 10 -3 -12 4 6 0 -13 -10 -1 2 0 -14
4016 -14 5 3 0 -3 -7 7 14 4 -2 1 10 13 -3 4 9 11 11 0 2 8 21 10 0 5 15 0 4 -7 4 10 13 -10 3 2 1 1 -13 -5 0 4 -13 -8 -2 11
4060 11 -5 -9 -3 5 4 -6 -6 -15 7 -5 5 -4 4 10 5 2 -2 -2 9 -1 -2 1 16 15 3 10 7 10 3 -9 -2 9 -2 -4 -15 -14 -1 9 0 -6 10 1 7 -7
$$ packed form
3757GOj0j8J3PMk9J5Q%Kj4j2J8J4j2qOK3k1kkQJ0qj4OJ5lj1LPQj5mkJ8Roj6nJ2
3799GNj9kMOpkNNJ3j8j4J0J1Loj1jK3lj8J6rJ3j0olJ7JokOLQk3KJ8JqnpQRk0k
3844hJ4%mj6J0J5Jk0LmJ5Nk0mK3jj2jMQMj5kJ7mPj6%LJ2pj5PMOj8mJ5Mj0J1j6
3886iNJ3j2%LNLkk4J9J6j9%oK7qj4kjJ7lj0lOJ4Nj8MPLnj6QJ2lj5mJ6Nj2jqQR
3930A0j1rKJ3nj3KJ6oQj5J0%JljPMlooK1Nj0qkJ3jmj4J4J0pj4qNK2j7nLMPj1j1
3974a3LK2pj6OJ1OMk3QJ7j6Oj2%J3Lj1JJ0mnj0RJ0Qk2kLJ0Jj3rJ6Koj3LRLkj4
4016a4J9kllmJ4Pj0oLRLj6PNK%j1KOJ3j1j0NJ0j5Mj1J1OLk3J3jj%j4QNMj7NOJ3
4060A1j6mOQjj0%rK2j2J0rQOnlm%J1j0jLJ5jj2PlLpj2PJ1j1kj1JJ3J0roJ6rOj4
$$ plain form
4104 -7 -10 8 0 -3 -8 -3 9 -7 -5 -9 0 9 8 -3 -3 -2 10 2 -1 2 5 -3 0 -7 10 20 5 -12 -1 5 6 -5 3 -8 10 -6 0 -1 2 3 5 1 -5 1 -7 6
4150 6 -3 -4 0 -1 -15 1 3 18 1 7 4 8 -7 -6 -5 3 13 -4 5 5 16 3 0 -10 -3 5 1 -5 -2 -6 3 -4 -12 -2 0 4 2 -1 6 3 4 -4 -6 4 25 0 0
4197 0 12 7 9 7 1 7 14 13 5 8 19 8 10 -2 2 13 10 3 2 1 6 2 0 1 1 0 3 -1 0 5 2 2 -12 4 12 5 4 2 9 9 0 3 12 17 15 7 4 15 15 13 -4 2
4249 2 17 11 0 6 0 2 8 2 3 -2 3 4 -2 -4 9 7 -6 -4 -10 3 5 -1 -4 1 0 2 -9 -6 -2 7 1 3 8 3 0 -5 -2 3 7 8 10 -3 16 -6 5 -4 4 13 1 -8
4299 -8 -11 0 3 0 -10 0 -3 -11 -1 -10 -4 0 -3 -11 -8 -12 -2 -4 -11 9 6 4 -4 -6 -8 2 1 2 2 3 4 -4 -10 -2 11 -1 0 -6 -1 -5 0 -13 -11 -4 4 -3 -12 1 -4 -2
4349 -2 -5 -11 -12 3 -5 1 -11 1 -7 -4 -6 -6 0 7 -4 5 -9 1 0 3 -8 1 11 -2 3 -4 11 8 0 -9 -5 0 2 -10 -15 10 -2 1 -10 3 1 4 -9 -12 5
4394 5 0 -6 -11 -4 -13 3 -3 -6 -6 1 2 3 -4 7 7 2 2 -2 2 2 -2 1 5 3 6 -2 -3 5 6 -6 -14 -2 -2 2 0 -2 -3 3 1 -9 -10 1 3 2 1 0 1 2 -7 2 -4 -4 9 -1
4448 -1 0 0 9 1 8 9 7 4 -6 7 -2 0 -3 7 3 4 8 -4 -4 8 7 3 -8 -12 -1 0 4 -16 -9 1 12 -4 -1 -3 13 -1 -6 2 2 5 1 0 1 13 7 4 3
$$ packed form
4104glJ8qlnNJ2j6KmRRjj1%JJ2qlLLqLpJ7J0j5j7J1OJj1Qj1J8j6OjLJKmoOqJ3
4150FrjMjj4J6KJ5j7OlMj5JJQJ0j7R%J1j3lj0PQmoLmRpqJ0KMklPlJqkJ0K1k5%
4197@J2nKkoOPjqLJ1j1Kj2MJ1lpjjNmkJ%jLmJNl%j4J6QpjkP%rLRNkqlJ1%kj7O
4249BJ5oj1OoKOoJnNJokJ3kj3KoJ3KolNjKj1LMRoKNnlnLNMJKj3J9k2J1rQRj2r
4299hlJ1Llj0J0lqJ0rOMlqLmJ0kpK0lkqkkJ0jJ%JJqoQJ3j2JoNmNj3KPQprJ3nK
4349blojJ5qOj2J2qLk%OPj1Rj4J0jLj1RJ0j3NpJ5lqrMNKj2nK5j2Lj1J3kLj3lJ7
4394EnonPrJ6ol%PJJpJ1%n%mM%mLMkLqjQJj2qJ2%MkkjOkj0jJ1KjjjJJrRo%J3j0
4448aJ%RqPJklj0J3rKlJ0mJMj2%J2jmj1mJ1JMk0PJ0J1j6LkJ6j4nQ%LmjJJ2olj
$$ plain form
4495 3 5 5 11 4 9 6 -6 13 6 4 -5 -1 -3 -5 6 -3 -3 -8 -9 1 -15 -6 -13 -8 -8 -3 -3 -10 -11 1 -1 2 -13 -5 -3 7 1 7 1 2 17 -1 6 9 9 7 2 10 -2 -3
4545 -3 -3 -3 1 -2 -1 -6 5 2 -8 -9 -3 -5 10 -3 -6 4 7 -8 2 -1 2 5 3 1 -2 2 5 -1 -4 2 7 3 6 1 12 7 0 -2 3 8 7 -3 0 -10 6 -5 -5 -10 -8
4594 -8 -5 -4 3 0 6 -4 1 -9 0 2 5 -4 -1 -2 2 4 2 5 -3 -4 -7 4 -4 4 3 -9 8 -3 2 12 4 -7 1 15 -10 -2 -2 -7 -4 -1 -10 -9 -2 -3 -2 -3 -5 5 -2 6
4644 6 -3 6 -6 -11 -7 2 10 3 -1 12 2 3 -4 7 -2 7 8 0 11 8 9 8 1 11 11 1 5 -7 15 -7 -6 -3 -8 4 3 6 -9 -1 -9 1 2 -12 -2 0 0 -5
4690 -5 -1 -9 -3 -1 -2 5 -3 -1 -4 -16 -2 4 15 -6 -2 15 6 1 -4 0 -4 5 -1 -1 -3 1 -1 1 -3 -1 6 -7 -16 -3 4 2 10 -4 -11 -12 -6 -13 -19 5 -1 -8 -4 11 7 3 5
4741 5 11 11 7 5 10 3 7 5 9 4 7 1 -5 -7 -4 -3 3 -7 -2 7 -7 2 -4 -10 -8 -7 0 -4 -5 -9 -1 6 -12 -5 -3 2 -5 -2 -1 7 8 -2 -4 3 1 -1 2 -3 0 5 -2 -5 2 2 1 -14
4797 -14 3 11 -11 -2 1 -9 -2 -5 -2 -9 -2 -6 2 -1 -5 4 -3 7 5 2 -1 -2 7 -7 -4 3 3 15 0 -1 0 16 -2 -1 2 -1 -1 0 2 2 -1 9 1 -2 1 -7 1 -9 1
4846 1 2 -15 4 3 -3 -9 1 1 -9 8 3 0 -11 1 0 -1 0 3 4 3 8 -5 9 6 0 0 -4 5 4 2 6 -1 -1 3 7 1 -1 1 0 -6 5 0 -3 -9 -6 -1 0 -8 0 -3 2
$$ packed form
4495CK%OpNlj2J9pkrMkkJ1r%njJ0j6RpN%N%pjJ2kLj5QKJ0oOoJJ5j8PL%knQj2j
4545c%%MlJnJ1lj0jOkJ5j3lJ0Lj5J0lLLkklMLolONmLnJ1npkNNjj0Lj0J6j1%nK
4594hLJPlOj0Nj0RKLrLjMKkLqjlJ1qQjj2J7j1NJ0qj1QJ4k5Q%nLLrJPjJjkJ0pQ
4644FrRj2nMRQpmJ3j0JpJ1rRJqJ1lJjpJ0%j0Mj2K2k2JLnJ2jLj5QqJ0Jj4J0K%n
4690eMqOKjPqKlj2J4OJ1k1MJ7rnnMmRo%kMkKmKPj3rJ3PkQj4pjOpoK4opMJ5mmK
4741EO%mkNpMkMnLookLJOj0NRj4RooKJPmjmQPj8PKNpLJQJj0kPkkLnLNplP%jj5
4797a4J7Qk2RLj0PlLpPmQlmRpJ0klljRj4LP%J2j5jJJ6j8JLl%JK%lJ0qlLqQj0J0
4846AJj7J9jooJ0%j0J7nlj1J2jjJLJjNj3J4lo%mRjkMp%MMokKjoJ1nloLNJqQlN
$$ plain form
4897 2 -3 -2 -2 11 -4 -7 2 -6 8 6 13 -1 -1 4 3 5 6 9 7 1 5 -7 13 4 7 6 -3 0 4 5 5 -4 -7 -5 -4 -6 -4 2 -3 -7 -2 -3 -5 0 1 9 -3 -1 7 9 -7 -5 11
4950 11 2 1 -1 2 -2 -3 4 -1 -5 -1 4 1 -6 -3 4 5 -8 -3 -1 -9 -2 -8 -3 3 -4 -2 -9 9 2 6 3 -12 -7 0 -10 6 5 -12 -3 -3 4 4 6 3 6 -3 9 -5 7 0 -1
5001 -1 8 -16 2 -4 -1 -6 -2 -7 0 0 -4 5 4 -3 -2 4 -5 1 -11 -12 -15 2 4 -6 6 -3 4 -2 5 7 -2 6 -4 3 4 5 8 12 10 13 12 7 3 -1 2 7 -4 2 5 0 2 6 -1
5054 -1 0 10 4 -4 12 1 -5 -9 -6 3 2 -10 1 5 0 2 4 5 7 4 12 13 -4 0 4 1 2 -6 13 11 -2 0 5 6 0 1 0 -2 -3 -8 -4 -9 6 0 4 -1 11 0 -1 -3
5104 -3 1 1 3 10 2 9 5 -1 -2 1 4 7 -2 4 4 15 8 -3 -1 5 -1 2 6 -1 4 7 3 5 -4 -3 2 4 -4 -7 -3 -7 -3 -3 3 -8 -7 3 2 -10 -2 2 1 1 10 7 5 6 9 3 5 3
5160 3 1 7 11 9 2 1 -3 10 0 2 3 -4 -7 6 1 -8 -8 2 0 3 10 -7 -1 -2 -5 4 -10 -6 -4 9 -4 0 -4 0 -3 -5 1 5 -5 4 6 1 7 11 -3 -1 4 -1 4 -1 6
5211 6 12 7 -5 1 11 -1 -3 8 6 -3 4 -10 -11 1 -8 8 1 3 5 -3 -6 1 12 11 9 2 -7 -3 -4 11 5 8 9 6 7 9 6 3 -1 6 -1 12 -4 9 4 0 -1 2 4
5260 4 -7 12 1 -5 -3 -11 0 5 3 -4 -3 2 -6 -1 2 11 0 1 5 9 4 3 4 14 6 -9 6 11 6 12 4 3 5 -2 8 0 -4 5 -6 -9 -10 -5 -3 1 -3 8 -12 -8 -5
$$ packed form
4897BnJ%J3j5lRqJ4kPj4%NjKJLkoMj2K0rLjrLMJ%rlKJkKOnmNjkNJQj2KQKj6KJ6
4950A1rjkLmjPnmMNlpLPJj3NKqPoNOpKpJ8pMlj5NPj0J6jj7R%P%KlLrJ2j4J2pj
5001aRk4J8oLnMnP%mRjpJOrOj2jlJ7Kj0J2rPoPKrQj0PJJLMkLjnmmLNj1OLnKMp
5054aJJ0oqJ6j1omLRjj2J1MnKKJKlQJj7MMlJqJ9kj3KNJoJjkjnMnJ5oMnJ2j1jk
5104cM%KPqPmojLLLrO%J1pj1KOoLMpNLmKrJNKqlMmM%Oj1JJ0jj2QMj%RlkJLoKk
5160CkOMkpjmJ3j0KJplJ3nr%J0kLPj7OjlRj4MKJ3j3MmMlkOMj0RKnOMj4KNnNnP
5211FOnj2OJ0j2kJ1krPj4jJ2rJ6pKKqlPJ1jkprMjJ5oLJlJKllmPpJ3j6J3nmjLK
5260Dj1J9j1oKqJ1NkpJNqNLRj1JMMnjJJ0qj5J5NnOqjKpJ0qmRj1ljNKMmJ1k0ML
$$ plain form
5309 -5 -15 -3 5 -3 6 -4 -1 9 2 10 10 -3 4 0 12 10 13 10 -4 7 1 10 1 -3 4 8 12 2 4 11 2 5 -9 6 -4 10 10 0 0 0 -2 2 -2 -6 11 0
5355 0 4 1 -6 3 3 -4 -1 0 7 2 13 -5 -2 5 -5 6 9 10 2 5 -6 5 7 6 8 -6 4 -4 -2 12 1 2 -5 5 5 -2 4 1 -6 -1 -7 1 -5 -8 4 0 -8 -5 5
5404 5 9 6 -3 0 -3 4 1 0 5 10 9 8 4 3 5 7 0 1 5 0 -6 6 -4 -5 5 2 10 -8 0 0 0 -6 0 -5 1 -2 1 -2 1 -6 6 6 6 3 1 10 13 7 -5 2 6 0 16 15
5458 15 -1 14 16 9 13 6 -1 9 1 1 4 14 -3 -6 13 4 0 -8 -3 2 -7 -4 -4 5 -3 7 7 3 3 -3 3 11 7 14 12 5 14 -10 1 4 3 4 -1 7 -3 3 8 12 3 0
5508 0 -10 -8 -8 -3 -2 -3 -3 6 6 2 -5 -2 5 -10 2 2 -4 -2 -4 4 7 1 -2 7 6 2 5 -3 -10 0 -3 6 7 -1 -1 0 -6 1 3 4 10 9 6 3 1 0 -10 5 -3 -2 -5 -5 3 7 0
5563 0 9 2 -7 -2 -4 -8 -1 8 -9 3 -8 2 -3 7 4 15 2 13 3 11 6 3 1 1 -1 12 7 -7 10 9 -8 1 3 6 3 -1 10 -8 0 2 4 2 -2 -1 -1 3
5609 3 2 9 12 8 -2 7 9 11 5 3 8 0 16 1 1 -3 -1 2 19 12 3 -1 -2 -4 0 -14 -4 1 3 4 0 -2 3 6 7 6 2 -1 -2 -2 -1 3 -5 3 9 -7 -8 5 0 1 6 0 3
5662 3 -1 11 7 3 -4 -3 14 4 7 6 0 4 -2 14 10 -9 -2 12 9 -3 10 -4 -2 -3 9 5 8 2 -3 -3 9 0 -6 -1 -9 1 -8 -8 -3 -7 4 -5 3 8 -1 4 -2 -2
$$ packed form
5309ej0J2QqRj0LJ0pQ%j3PmJ2kLlj4J1oRrmPMMj0KPrLj4J5j0J4%j0%%kMmmJ7j1
5355@MlpR%pLJPnJ1j8LPj0J1LJqLj1J1KjKj4J0qKJ4j1JpJ0%pOlpNoQolJ2mqLJ0
5404EMlrLlPljNNjjmjKKpJMnoJ2j0jJ0lQj8Q%%oOnOlLlLpJ2%%lkRLoj2PMoJ6j
5458A5j6J5KpMppJ0q%LJ0j7lJ9rmqNNrL%RqJ0%m%oOQmPkpRk4J1LjJnQj0ONMrl
5508@j0K%NJj%R%mpLPj5J2%oKkQLolRjmLqpJ0lRJq%JoPKJOjllkjj0J5qJl%QMp
5563@RprNkmPRj7J2j1J0nJ0lJ1j3J1j0Qnlk%kJ3nj4J7jj7RKLlmJ1j8QKKkmJ%M
5609CjPLmj0RKKokNqJ6j5%mKLJ7prmjkMj4J0NKJmkNLJjmlj%JMqQOj6jJ3nJNoL
5662CmJ2mmpJJ7j0LjoMoJ6mj9PJ4lj2J3j4KjJ2mLon%J2roNqJ0r%NmJ1rQNrNo%
$$ plain form
5710 -2 -6 -1 2 -2 4 4 3 0 1 0 1 -3 -2 -1 -7 1 -1 -8 4 -7 -8 -1 -3 2 0 -3 -4 -11 -11 -6 -7 -2 2 -9 -1 -9 -3 7 -13 -3 11 0 -2 15 -10 1 2 1 7 6
5760 6 -4 10 8 -2 0 -10 3 5 2 -9 -6 -4 0 -4 -8 -11 8 -2 -3 0 -2 5 -1 -3 5 -1 -4 0 -3 1 -2 1 1 4 9 -4 -7 6 -5 1 4 -5 -7 -6 -9 0 0 2 6 8
5810 8 4 -11 -6 1 8 -12 -5 -4 5 -1 1 -6 1 -3 0 -2 -2 -8 6 6 6 -7 7 2 3 2 4 -7 0 -3 -6 1 3 1 1 -1 -4 -5 -3 -6 2 0 -1 5 -6 -3 1 -5 -6 -3 -6 -6 -1 2
5864 2 -7 8 1 3 -1 -5 1 1 1 0 -1 3 -2 -5 -2 2 -3 6 -3 9 5 3 -10 -10 1 0 0 -3 -9 -3 -2 2 -7 4 10 -11 -7 4 6 -2 8 -1 5 0 15 -2 -1 -7 8 1
5914 1 -1 -6 -1 7 -6 -5 1 -4 -4 -3 -8 -2 -6 -1 -2 -2 0 -5 1 4 -10 3 -6 -14 -16 -8 -4 3 -5 6 -2 2 -2 3 2 1 1 3 2 -4 4 -6 11 2 -8 -5 -8 -6 -2 -6 2 -8 -4
5967 -4 1 1 -1 -3 -8 7 1 0 2 -3 -3 -10 -2 1 0 -1 -7 -3 -3 8 -4 1 4 10 -1 -1 3 -1 2 2 3 -3 -4 -9 2 2 -6 3 5 -2 -4 0 2 -3 5 -3 -1 2 14 5 -12 -2 1
6020 1 -5 -2 -4 4 4 2 0 -7 7 8 12 4 -3 8 -10 -2 7 -2 9 11 4 6 3 9 5 -9 2 -2 2 4 5 0 -2 -9 6 1 -3 3 1 -3 -7 -2 -10 -6 -4 7 3 1 -3 7 -1 -5
6072 -5 2 6 -2 -5 0 -1 2 -7 -2 7 7 -2 -5 -7 -1 0 -6 5 -3 0 1 -5 1 -6 0 -4 1 -3 -10 -4 2 -4 -2 6 7 1 3 2 -4 -9 0 -2 5 6 1 10 5 -5 -1 -5 6 7 2 -4 0 -1 -1 -11
$$ packed form
5710bmNLmO%jlJjJmJJoQkpJ2j1jPkNkljp%NjNMj1QqOJ0k0J0J4j1kJ7k5J1JjOj
5760Fj0J4kj0Kj0J3Klj1LKMmmlJ9j0jLkPokQolMlMlL%LNj3lJ3j1OLrkJlR%KMK
5810Hmj5NPPk0PJRoKpPmLk%oJ4%%j3J4nJjKj1PllPKk%kljKlQkjOj1LMojLl%NL
5864BrJ5pKmmO%%jjMnlLMnRrJ2mkj3%J1j%loOJMrJ1Ok1MJ1KqJ0rOnJ5j7JoJ5p
5914AknNQj3JOn%JnOmNj%KnOLj4J3rqkQMPqJ1qMmNjj%KjoQj0J7rj0LlKMmQj0M
5967dN%kknJ5ojKn%pQLjjoM%J1j2NLOj1%MmL%JojnJ1%qRKpkMKnQqKLJ2rj7J0L
6020AoLkQ%kkpJ4JMqpJ1j8QRrJ1KpKlOmj4J1mMKJnkpJ5nmOkmmNqMKJ1mkmJ0qm
6072ePMqlNjLrNR%rlkOJoJ1qLJoOpOmNmpOOoKQJoKjonRkPJnRnj0MmJ1JnoMj%j0
$$ plain form
6130 -11 3 -2 -1 4 -6 -4 3 2 -5 1 -4 2 -3 -7 3 -2 2 3 1 -5 -1 8 0 10 4 -1 10 -4 -4 -1 10 3 10 1 6 2 3 18 9 2 -6 7 4 10 -9 -2 -1 1 -8 1
6180 1 -4 1 4 4 13 9 4 8 5 19 6 -6 -6 9 -1 -6 13 1 13 3 1 0 6 6 4 2 11 4 2 14 5 7 8 1 5 3 0 6 0 10 1 0 0 -3 -6 3 1 -11 8
6229 8 0 5 7 -3 4 8 6 0 5 5 1 3 -7 7 5 -6 10 0 12 0 -5 1 7 -1 3 2 -4 1 5 0 -3 -5 6 1 9 4 -1 6 -4 -7 -17 3 -4 -2 4 0 -10 0
6277 0 -6 -4 1 -2 -3 -2 10 -5 -5 1 8 -1 -4 -7 2 2 7 -7 -3 -10 -6 1 -4 -3 -4 -8 -11 -9 -3 -6 0 4 -1 -5 -9 -2 0 3 -15 -3 6 -6 -11 0 1 -3 2 -3 -1 -8 -2 7 5 3
6331 3 0 8 8 3 -11 -5 2 0 -3 -7 -4 2 -8 3 -3 -3 -6 -5 -1 -7 -1 -10 -3 -8 -4 12 -4 0 4 -1 -6 -12 -2 5 5 1 -4 2 6 6 -3 0 9 -4 0 10 5 2 7 3 -5 -2 -11
6384 -11 -2 0 -1 1 -1 3 -2 -6 -1 -4 -7 -4 2 -1 4 -2 -1 -4 2 -5 6 -4 -1 10 2 12 7 6 12 5 -3 -4 9 4 2 5 -1 -6 -2 2 1 -3 3 9 13 5 9 -6 -1 6 -10 7
6436 7 4 0 7 3 4 -1 7 -4 7 3 -7 -1 -2 5 3 4 3 6 0 5 1 -2 -6 2 -6 15 7 12 -2 7 5 8 -1 -9 11 2 3 9 -7 3 3 5 0 3 5 1 1 4 1 10 3 -8
6488 -8 7 7 7 5 9 5 -2 10 3 8 1 4 3 1 -2 -7 6 -1 1 0 8 -7 6 8 -6 -2 -4 -4 -11 -4 5 -8 -1 -13 2 -2 -6 -2 5 1 4 0 -1 3 0 3 2 -8 0 -3 -1
$$ packed form
6130a1J4nJNj0KPjpOnOnmJ0nMJkoMRqJ0onJ1j4%LJ1pPrNmJJ5rpqJ3lOj9PJKrR
6180AnNL%RmnMlJ4j3j2%J5j0nJ9j2J2j0kjO%kkRpkJ2rKJpMklOoJ0rj%llRkj2J9
6229HqNKj0PMkoN%mKj0J4kj1J6j0J2j2nOOqMjoNMnlkJ1nQnnPj0lj0K0pKOmj0J0
6277@oKNljJJ2j5%OPrllR%Nj4MpMPnJjmlKOlOMnmmPKLj8J2Rj2nJ1JmNnKpORkk
6331ClQ%nj4OPklmLOj0J1o%lJMoOrPnMJ6j6MMnnoJ0P%mnOM%rLRj3MJ0nlNmqLr
6384a1RKjKkMnmNllLOlNoJlOpJ1j0LJ1qJ0njOpqjJ3nkLonMMjmOOMqMj5NPj6J7
6436GlmPmJnQj1J1mj0OjPkJjLoNmlmQqK1qNj4RkLrqK0rJOj6J0%KnLKm%LlRpj1
6488hJ5%%kMmpJ2pNpLjklnJ3pKjQj5J3Kj4Mk%pPRj3Pj2J5mmMPmLmjMlLjj0QlK
$$ plain form
6539 -1 1 8 2 -3 3 -4 7 1 1 1 -6 3 -8 -2 10 6 -2 -3 3 -5 -4 0 0 -3 -3 -1 -3 -4 -4 -3 7 -2 -5 -1 -6 9 -2 -2 -3 -5 8 -1 5 6 3 6 -3 -3 3 9 5 5 -2 3
6593 3 1 4 -15 -5 -8 -7 3 -8 3 -9 -5 -6 -2 -1 10 1 -2 2 -8 -3 4 -8 10 -2 -3 1 -2 4 -1 -6 3 2 9 2 -11 -5 6 -4 -6 7 5 -7 4 1
6637 1 9 2 -5 -2 0 0 7 2 3 2 3 6 -6 0 6 0 -4 7 -1 6 -1 -4 -6 6 8 0 -7 -2 2 -2 3 9 6 -2 1 -1 -8 4 -7 -3 5 5 5 -5 6 2 0 -11 3 -3 3 1
6689 1 -7 0 9 2 10 7 1 0 -5 4 3 2 -1 -10 -4 -1 7 2 9 -11 0 2 -2 1 4 -1 5 -1 12 2 -3 4 -1 1 -6 -5 -2 2 2 9 -5 -1 -1 2 9 0 -3 0 0 1 7 0 0 2 5 11
6745 11 9 2 -2 6 -6 5 6 -2 -5 -5 0 3 8 5 -2 -1 2 -1 -1 -4 3 -1 -2 -1 3 -8 -3 3 3 13 4 -5 -6 3 -4 2 1 -11 -5 5 -5 -3 7 8 -4 5 -2 1 7 1 4
6796 4 3 -5 3 0 -3 -3 -3 -2 1 -10 -6 -4 -6 -10 -3 -3 -1 -4 1 -1 -1 8 -6 -4 1 -1 1 5 -6 2 8 1 -8 8 -6 -1 -2 5 5 1 -4 0 9 -1 11 10 2 0 -4 -3 11 -3
6848 -3 -3 -13 -3 -6 -3 4 1 -9 -5 -3 -5 -6 -2 2 2 8 10 -2 -8 -3 -1 -2 0 2 -7 5 11 -3 4 -3 8 -3 6 0 -1 7 1 -9 3 3 -3 8 -1 1 2 1 -5 -8 -2 -6
6898 -6 -1 -5 8 -3 -1 -1 5 -2 0 5 1 7 5 0 0 3 -2 0 5 3 7 13 1 0 8 1 8 9 3 13 0 6 9 13 -6 6 5 1 -1 -4 -6 -5 7 3 -3 4 2 -13 0 8 10
$$ packed form
6539aKPonOpJ1o%%pRj1OJ2mqjOqJM%l%Kkj%JJ0rlMnJ5j1%jkJ3rOJlLr%OOm%pN
6593CkLj9J0lJJ0j1J1j2MjMJJ1rlMj0NPj2J8j2jMlOnnRjPpj3OJ1j0kJ3kj2J1l
6637AQppLK%PnJjJLj2OOomJ1qPplkJ2KqpNMmNOlqLkpJ2j1MQ%%j0J1mkj1J4oOk
6689AqPRpQlojnRjjlrOLQnPk0J1KmLLnOoJ3j0nPnKpJLM%Pj4M%LPrlL%JOp%KLO
6745A1kpmQj2J1Jql%NLNlpJLl%lPmjJMj1NO%J0rrjRpOjj2OJ0j0KJ0Jj2RpLOoL
6796DjqQll%%JLj1MKkmP%KlNk%Rj4KNkKMj1QOprJ6j4NjP%mnMRj0J2jqkmJJ4j4
6848c%j0J0lLPlj0MKkjMM%OKj2oNKjKKrJ2Oj4PpJ1j1RojQoj0J2%oJ1rKJjolOm
6898fNmJ3j1K%OpKNmOkn%LnKNkMOj2jQpPJoJ0j3OLMj9J2jmklkJJ2moPkj5J3QK
$$ plain form
6949 10 -2 2 -8 4 9 2 10 1 -6 2 6 7 -1 1 4 -2 -3 11 7 3 -7 0 -7 1 -3 0 2 -3 11 0 4 -3 8 -8 3 -6 5 0 4 -6 -1 1 1 5 5 3 -12
6996 -12 -2 10 3 12 0 -2 0 4 -1 -1 5 3 1 -4 12 0 -9 -2 19 -1 2 4 -5 7 -4 -8 -7 7 -10 1 8 1 6 8 5 -2 8 -3 6 -2 9 -3 7
7039 7 10 5 -1 -6 11 -1 -3 10 5 2 2 7 2 -5 6 -3 -2 7 10 6 1 2 2 -1 13 9 -6 -8 3 5 -7 3 2 5 2 4 -7 0 3 3 4 5 8 3 0 -1 -6 -8 -9 2
7089 2 -8 1 2 3 -1 -3 0 -4 -1 3 4 -2 -2 7 4 10 2 1 7 -4 -2 -9 -8 -8 -2 6 -1 3 3 7 1 -4 -3 6 9 -6 7 0 3 -1 -9 5 3 -9 2 7 -2 0 -4 -4 5 -2 -2 1
7143 1 0 -7 -13 6 -3 -9 3 -4 -9 2 -4 5 1 -1 -9 4 -4 -5 -2 3 -6 -5 0 4 9 12 6 7 4 0 8 1 8 6 1 6 -2 3 8 8 -4 3 -3 1 2 -1 3 10 -7 4 8 -12 -9
7196 -9 2 4 4 7 -6 14 5 12 4 -3 4 -2 3 7 -2 -6 3 19 2 16 1 -3 -3 1 -9 2 12 5 15 4 1 14 -5 4 5 -2 -10 2 10 9 7 10 6 6 11 5
7242 5 -2 -2 -1 10 0 5 2 4 16 -7 5 9 13 2 7 2 -2 -1 2 4 8 4 0 5 8 -3 9 -5 0 8 0 3 5 8 4 2 -7 9 4 0 10 14 -5 2 0 10 2 8
7290 8 6 3 8 5 7 7 13 11 17 4 5 14 0 9 3 -5 6 9 4 -5 0 -5 12 4 5 8 8 -3 -5 3 6 -4 1 7 3 2 -5 5 7 2 1 5 -3 -1 11 -4 -12 11 2 -5 7
$$ packed form
6949A0j2Mj0J2NpQrpQMJqKLojJ4mmj0PpQmLKnJ4j1MpJ1j6J1rJ1nMj0NK%M%kj5
6996a2J0J2pRj2kKMn%OkknJ6j2rPK1k0LKrJ2j1mJJ4j7J1PpNKlpJ0j1RqJ1j2J0
7039GLnonJ7j2kJ3nl%NnpJ1rJRLmnJ%lJ4mj5kJ1Kj2J0jLlKj1PL%JJLnljnkjJ1
7089Bj0RJJmkLmLMJo%RlOqjOj1KpJ%OQpM%MonJRLj5J3pLmqJ4kj2J1NrKm%Rp%L
7143AjpoJ9roJ2pnJ1oRmkqJ3qjLNrJNMNLoJlmQpPknNqNN%j2PoMJlMPj7J1Mk0L
7196iJ1K%Lj3K0rPqpPoNMrmRJ6j7J4j5m%Mj0J1J0pJ0j1lJ3j9RJpqJ2QjkLm%No
7242Ep%JJ1j0NlKJ2k3J2MMj1NnmJLKMmmNLj1J2j4NQqLKLmkrJ6nmJ0Mj9PkJ0qO
7290HklNlK%OkOj3JRj4RoqJ1LnrNnJ7qJL%j1kQLj0NOmjpJ0KnjMqKJ2j5qK3rpJ2
$$ plain form
7341 7 6 6 -1 3 6 -1 -1 -1 -2 -1 -5 -4 -2 1 -2 -3 -2 -3 0 -6 0 2 7 1 -5 -3 -6 2 -3 -2 -6 -8 2 -6 7 7 10 1 12 0 -8 3 1 -3 0 -2 5 -5 -1 2 -9 4 2
7394 2 3 1 -3 6 2 1 2 9 2 -4 -4 -8 -1 -2 -1 -8 5 3 -8 -7 2 0 10 -3 11 -4 5 5 9 -17 -6 -1 -4 -8 -3 -7 3 2 -1 1 -5 -4 0 0 -2 -6 -1 -1 -4 -14 1
7445 1 -2 -5 9 7 -6 -3 0 -2 8 -4 -5 0 -5 0 -2 6 5 -2 3 -1 3 -5 7 -4 -5 -6 -1 0 -6 2 -2 -4 -2 -4 2 -4 -9 -2 -13 -10 -12 -4 -4 0 -2 -2 -4 -4 3 -4 3 -9 16
7498 16 -3 -2 5 -6 11 -6 5 0 7 4 5 3 6 10 -4 12 7 6 1 7 4 8 2 3 10 4 -1 -4 2 -2 -17 -8 -1 4 1 -8 6 1 7 -6 6 2 1 -2 11 -2 2
7545 2 10 4 2 -4 8 0 -14 -9 0 5 -7 5 16 1 1 -8 -1 -12 0 -5 -2 5 -7 1 0 1 -5 -9 4 -3 0 6 7 1 4 6 1 -3 -1 2 -3 1 -7 5 -4 -13 1 -3 1
7594 1 2 -1 -7 -6 2 -5 6 2 -7 -7 0 -5 -9 -15 -13 1 -5 -7 2 12 0 -12 -2 -8 7 -3 0 2 -1 4 5 6 -1 1 -3 -7 2 6 1 -7 1 0 -3 -1 -3 -8 -2 -12 3 7 0
7645 0 -2 1 -4 -3 -4 2 -3 4 -4 5 1 -2 6 -8 6 0 1 -10 1 -9 6 8 9 7 2 9 -4 9 10 5 -2 4 2 -5 -4 4 10 -5 -3 1 6 7 -4 5 1 -1 5 5 0 -11
7695 -11 1 4 10 4 8 2 -1 -5 3 7 0 5 0 4 -7 -1 -7 4 5 2 0 -4 2 3 2 2 8 -5 -4 -5 0 -3 0 12 10 -11 1 -3 -1 9 7 0 5 6 -8 -1 -2 0 9 1 6
$$ packed form
7341Gj%pMLp%%jJmJKLljJjLoOKNooKlQnJmkJ0qJ3%LrJ1j2qJ1kmLkPj0MLj1J3k
7394BJkmRmjJPpo%mPjJpJ3kj1JRkJ0j3J4j5R%Mk6J1NlmNmJ0jlKoJM%kmN%lj0J5
7445AllJ4kj3LLkJ0j2jNnNkQjpNmMqJ2j1jjNJoQmkKkOonPj1LkQ%Mk%k%PpPj2K5
7498A6j9JPj1J7j7J1nPlJkLMj4J6njnOlMoJPonlOmj5RPNlrJ4nOj3J2mjlJ3j3M
7545BQokoJ2qj4NRNj2J2J1j5%rPj1J2nLPj2QjJomJ3pLOJoLKnmKLnMqJ2rrJ4mM
7594AJloJQpJ1mr%PnmoKJ4okRJ0j2j2J0oJ5j0LKlNJJpKmmRMnqQjlKknOj0J5Mp
7645@kLnJjOnPqRmlQj4J4oJj1J1j0J5KJknPj3J3JnpOkpJQOj5KMNJj1RmkO%nj1
7695a1J2LOoMolmQMpNnMj1OoJ1JlkmOJj%Oj3JjNlLJ2kk1J2mKJ0kpNJj4PjKRqN
$$ plain form
7746 6 3 1 1 0 1 8 -2 0 3 3 7 12 12 -5 3 8 -5 4 -7 0 -6 -9 8 -9 5 7 -3 -5 3 4 -3 9 3 1 -5 -7 7 -6 7 -9 0 -3 5 8 10 -2 -4
7793 -4 -5 -11 1 1 0 8 -1 -3 10 7 4 -1 6 -5 -2 -3 -5 -1 4 -5 1 -7 -5 7 10 -1 -3 -1 -1 6 -3 3 6 11 -6 8 1 6 -1 -3 -2 3 5 2 1 -2 12 4 4 3 -4 -1 4
7846 4 -4 2 -2 5 0 5 -4 4 2 -5 -8 0 0 4 2 10 -4 -8 -1 -3 -3 1 0 9 9 -2 10 9 11 5 -1 0 -4 4 4 0 4 3 11 -2 1 0 -2 -1 -3 0 -5 7 -3 -4 7 -8 -2
7899 -2 0 3 -3 2 6 2 2 -11 -2 2 -2 3 -1 -5 -3 -5 3 5 -3 0 1 -1 -4 4 -13 0 3 0 3 -13 7 -3 5 -1 12 0 -3 6 3 -5 -2 -6 3 2 -6 4 1 7 -1 6 -6
7950 -6 -4 -11 -7 8 0 -3 -7 4 0 -2 1 0 -1 6 6 -11 7 1 -7 -2 6 0 5 2 0 10 4 -3 1 5 -9 -10 -3 10 -6 5 6 1 2 -8 -5 -1 3 5 -2 -4 6 2 -4 3
8000 3 -4 12 3 6 -1 5 -8 -6 3 4 6 3 2 -1 5 -1 4 -3 -1 2 3 2 4 7 4 -6 8 4 6 -4 -2 5 -1 3 -6 2 12 -6 4 4 -6 2 -3 -2 7 13 3 9 6 -2 3
8051 3 3 -2 5 -2 14 -1 -3 -4 -4 1 5 19 0 -1 0 -6 -6 8 -1 -10 -4 1 -6 -1 -1 -2 0 12 4 2 4 12 -8 -8 6 -4 3 1 16 6 10 13 2 4 -5 2 3 -4 -1
8100 -1 1 3 -2 -11 -2 9 6 -4 4 3 -1 5 2 4 12 3 -1 -1 -5 6 -3 1 7 -2 5 4 0 -3 -14 -3 2 3 2 -2 1 5 5 6 -8 3 2 8 9 1 4 -3 3 6 -11 4 -5 -7
$$ packed form
7746Flk%jJPj0KL%MN%j7QNj3Rj1PolJ7j7J4Kj0kQJpJ2okokJ4j3J3j6RlQLKj2k
7793djoJ2%jQrkJ3llnPj1LjkMNrOqKJ2Lj1kK%PrOLNj7J4pNpkJNKljlJ4q%jpLN
7846DqOmPnNrQkplQ%MkQj4mPk%MjR%j1J2jKooJmQ%mMjQj3LjkJkLnJ2j0jJ1j5O
7899bKLoNMm%j3RMmNmmKkQKqLJklQj7J3LlLj6K0j0QoJ3j2lRlqLmRjqJ0lOqPj2
7950fKpMJ5qlmJ1mkLjjP%j7J8oqNQoNlkJ0opMMj4jPJ3j6J1JnJj0LMMKpkJ0moP
8000CpJ6rLpOj3KRJKljlOoNpKLJjKLlj0J4mKj0KPoMrQJ0j8J0%j0QnJROj0OlqN
8051C%nPpJ6j5kj%NMJ4j9jJo%J4rrONpN%jKJ2qkKQk0%J4j0PkJ5j0MLj1KrPJpL
8100aKKnrRJ1lj0QjmOlKQrm%mJ1rMOrPjmlj1J1NJjmLM%Jj4J1jOJqLpOLj7J5rk
$$ plain form
8152 -7 7 3 0 5 0 -1 16 -7 5 1 2 -3 -4 8 4 2 -1 1 -1 4 3 1 4 8 13 3 -3 8 11 -4 -2 3 -1 -2 0 0 2 -6 6
$$ packed form
8152gJ4mlNnjJ7k3J2mJnjJ2mklKkNjkLMNj0oJ1Lj5KNmjK%KqJ2
8191F
$$ Imaginary data points
##PAGE= N=2
##DATA TABLE= (X++(I..I)), XYDATA
$$ plain form
0 0 0 0 0 0 0 0 0 0 0 0 8 -8 8 -8 8 -9 16 -18 24 -32 32 -40 48 -56 65 -80 88 -104 120 -138 160 -184 208
33 208 -232 264 -296 336 -376 419 -467 520 -578 642 -710 786 -868 959 -1056 1163 -1281 1412
51 1412 -1555 1715 -1892 2092 -2316 2572 -2864 3204 -3607 4091 -4682 5430 -6405 7743 -9690
66 -9690 12808 -18604 33058 -147573 -136664 241478 182874 -72042 -173244 70576 232673
77 232673 72726 -227650 -230954 30951 206462 71386 -115039 -83729 103623 136496 -28376
88 -28376 -158545 -72401 79166 89733 -28301 -74320 4864 77056 32625 -43230 -39851 18663
100 18663 22824 -26510 -38538 14247 43218 2824 -34694 3784 57501 26894 -60834 -76061
112 -76061 10073 73723 22073 -59706 -38444 60364 84432 -12819 -97729 -52903 50146 63052
$$ packed form
0@%%%%%%%%%%Qj6J6j6J6j7K5l4M2n6O4p2Q8j04J21j45J68j92K24k58K98l44L92
33B08m40M96n60O32p12P95q86R87j098J220j352J496j654J827k015K219k444K693
51A412k967L270l607L984m408M888n436O068o811P698q773J0112j1835J4148j7433
66i690K2498l1412N1662j80631J0909L78142n8604k54916j01202K43820J62097
77B32673j59947l00376l304K61905J75511j35076j86425L1310J87352L2873j64872
88b8376j30169Q6144J51567J0567j18034m6019P9184P2192m4431p5855L379N8514
100A8663M161m9334j2028N2785K8971m0394l7518L8478N3717l0607q7728j5227
112g6061Q6134O3650n1650q1779K1262R8808K4068r7251q4910M4826J03049J2906
$$ plain form
124 63052 -19506 -61263 3556 74815 43892 -44590 -67601 -6444 39808 12899 -27314 -11405
136 -11405 31437 31036 -9089 -26031 -4354 6703 -13546 -19742 14879 39846 7006 -39103 -22122
149 -22122 37841 42359 -29203 -71101 -7728 76686 52313 -54125 -84407 15401 101377 39360
161 39360 -86966 -90474 39390 112238 17135 -106790 -72776 73362 116588 -8934 -120286
172 -120286 -56036 85510 94638 -38344 -112621 -17968 104230 75059 -58622 -100719 2320
183 2320 91386 38395 -68849 -68538 33469 82867 12089 -67537 -42214 38873 50911 -15816
195 -15816 -52891 -6571 46489 26246 -29338 -32585 15098 32957 -6217 -35729 -6275 34150
207 34150 19474 -26714 -28972 17648 37893 -3349 -42493 -16294 36464 33311 -22407 -44477
$$ packed form
124F3052q2558m1757O4819P1259l0923q8482k3011O1157M6252k6909m0213J5909
136a1405M2842m01m0125j6942K1677J1057k0249o196L4621K4967l2840m6109J6981
149b2122N9963M518p1562m1898O3373Q4414k4373j06438l0282R9808Q5976o2017
161C9360j26326l508J29864P2848r5103j23925L4014J46138M3226j25522j11352
172a20286O4250J41546R128j32982p4277R4653J22198k9171j33681m2097J03039
183B320Q9066n2991j07244L11J02007M9398p0778p9626K5323Q1087J2038o6727
195a5816l7075M6320N3060k0243n5584l247M7683J7859l9174k9512K9454M0425
207C4150j4676m6188k258M6620K0245m1242l9144K6199N2758l153n5718k2070
$$ plain form
219 -44477 2739 47526 20645 -37564 -38735 18104 45843 3110 -43777 -23695 31527 38440
231 38440 -10751 -40114 -8133 32509 20250 -22136 -28095 8674 29286 4532 -23076 -10986
243 -10986 17061 13860 -13674 -18249 8292 21450 -1566 -22575 -4861 24014 14598 -21956 -26925
256 -26925 11853 35195 3560 -36480 -20761 30125 37410 -14043 -47273 -9053 45004 31807
268 31807 -30987 -48314 8078 53912 18875 -45306 -41669 24792 53796 1562 -52871 -27522
280 -27522 38736 46040 -15293 -51896 -9823 45431 30642 -29672 -43491 8120 45278 13096
292 13096 -36744 -28495 22414 36741 -5613 -37661 -11023 31062 23628 -19574 -30335 6707
304 6707 32142 6435 -29013 -18361 20829 26554 -9671 -30141 -2520 29360 14866 -23350
$$ packed form
219d4477M7216M4787k6881n8209j171N6839K7739m2733m6887K0082N5222O913
231C8440m9191k9363L1981M0642j2259m2386n959L6769K0612k4754k7608J2090
243a0986K8047l201k7534m575K6541J3158k3016k1009J7714K8875r416l6554m969
256b6925L8778K3342l1635m0040J5719N0886P285n1453l3230L8220N4057j3197
268C1807o2794j7327N6392M5834l5037o4181L637O6461K9004n2234n4433K5349
280b7522O6258P304o1333l6603M2073N5254j4789o0314j3819N1611L7158l2182
292A3096m9840Q249N0909J4327m2354l2048K6638M2085p434m3202j0761L7042
304F707K5435k5707l5448J0652L9190N725l6225k0470K7621L1880j4494l8216
$$ plain form
316 -23350 -25078 12608 30595 532 -30511 -13767 24761 24836 -13791 -30978 -92 30709 13666
329 13666 -24447 -24387 13332 30005 193 -29334 -13034 23053 22792 -12720 -27899 315 27394
342 27394 11493 -21828 -20486 12779 25595 -1745 -26066 -9417 21698 18491 -13652 -24059
354 -24059 3531 25600 7394 -22502 -17126 15125 23629 -5064 -25927 -6039 23568 16398 -16564
367 -16564 -23812 6143 26558 5463 -24272 -16161 17242 23870 -6645 -26811 -5280 24364 16024
380 16024 -17178 -23548 6632 26346 5139 -23818 -15645 16641 22850 -6355 -25432 -5018 22893
393 22893 15097 -15897 -21922 6031 24320 4786 -21879 -14399 15185 20848 -5803 -23084 -4372
406 -4372 20852 13422 -14688 -19613 5923 21798 3556 -19930 -12014 14491 18018 -6605 -20537
$$ packed form
316b3350j728L7686J7987l0063l1043J6744L8528P5l8627j7187L0886L0801j7043
329A3666l8113O0L7719J6673k9812k9527J6300L6087k61l5512j5179K8214K7079
342B7394j5901l3321J342L3265J2816k7340k4321J6649L1115l207l2143j0407
354b4059K7590K2069j8206k9896N376L2251Q504k8693k0863J9888K9607p170l2962
367a6564p248K9955K0415k1095k9735Q111L3403O628l0515k0166K1531K9644q340
380A6024l3202o370L0180J9714k1207k8957Q173L2286O209k9205j9077K0414K7911
393B2893p796l0994o025K7953J8289j9534k6665P480K9584N663k6651j7281J8712
406d372K5224p430k8110m925K5536J5875j8242k3486P916K6505L527k4623j3932
$$ plain form
419 -20537 -2191 19294 10227 -14794 -16301 7854 19464 333 -19192 -8344 15639 14876 -9419
432 -9419 -18880 1482 19621 6885 -16820 -14165 10874 19031 -2694 -20435 -6277 17884 14290
445 14290 -11708 -19693 2977 21200 6575 -18394 -14982 11669 20333 -2471 -21517 -7332 18146
458 18146 15582 -10992 -20515 1601 21041 7918 -17275 -15594 10041 19844 -1044 -19952 -7807
471 -7807 16113 14701 -9354 -18433 1163 18516 6835 -15172 -13147 9242 16776 -1930 -17260
484 -17260 -5390 14684 11489 -9621 -15370 3011 16469 3970 -14668 -10190 10239 14510 -4016
497 -4016 -16220 -2973 14923 9426 -10861 -14196 4686 16266 2416 -15260 -9123 11291 14112
510 14112 -5085 -16386 -2120 15471 8945 -11521 -13997 5336 16338 1864 -15457 -8641 11616
$$ packed form
419b0537J8346K1485r067k5021j507K4155J1610j9131j9525J0848K3983p63k4295
432i419r461K0362J8139j2736k3705K655K5039Q157k1725j7741J4158K4161l594
445A4290k5998p985K2670J8223j4625k4969L412K6651Q664k2804j9046J4185K5478
458A8146k564k6574r523K2116J9440j3123k5193J681K5635R803k0888j8908J2145
471g807K3920j412k4055r079J9596J7353j1681k2007K025K2389P534j8706j5330
484a7260J1870K0074l195k1110n749J8381J3458j2499j8638M478K0429M271j8526
497d016j2204J3247J7896n497k0287l335J8882J1580j3850j7676O137K0414K821
510A4112j9197j1301J4266J7591o526k0466k476J9333J1002j4474j7321O816K0257
$$ plain form
523 11616 13688 -5555 -16048 -1507 15297 8193 -11600 -13178 5741 15568 1093 -14942 -7611
536 -7611 11464 12524 -5892 -14967 -699 14494 7010 -11317 -11890 6000 14378 320 -14112
549 -14112 -6465 11177 11309 -6164 -13931 51 13874 6013 -11191 -10855 6400 13658 -404 -13812
563 -13812 -5620 11331 10585 -6656 -13518 710 13797 5360 -11392 -10369 6792 13296 -878
576 -878 -13599 -5140 11211 10018 -6665 -12829 898 13022 4817 -10670 -9393 6337 11923 -1024
590 -1024 -12066 -4206 9951 8338 -6155 -10707 1503 11075 3155 -9531 -7016 6499 9572 -2505
604 -2505 -10512 -1787 9791 5812 -7485 -8977 3885 10781 544 -10830 -5184 8922 9221 -5166
618 -5166 -11822 100 12232 5422 -10152 -10229 5746 13136 178 -13335 -6398 10547 11428 -5297
$$ packed form
523A1616K072j9243j0493J4541J6804p104j9793j578J8919R827j4475j6035P331
536g611J9075J060j8416r075J4268J5193p484j8327n73J7890Q378j4058j4432
549a4112P647J7642J32j7473p767J3982J3823p861j7204L36J7255P258j4062j3408
563a3812Q192J6951p46j7241o862J4228J3087q437j6752J023J7161O504j4174
576h78j2721Q459J6351j193j6683o164J3727J2124q205j5487J277J5730N586j2947
590a024j1042P860J4157j613j4493m552J2210R572p920j2686K515J3515L073j2077
604b505q007Q725J1578l979j3297j492J2862O896j0237j1374N646J4106K99j4387
618e166o656J1922J2132o810j5574p7J5975P390j2958j3513O937J6945Q81j6725
$$ plain form
632 -5297 -14000 -1253 13417 7566 -9796 -12092 4007 13814 2543 -12359 -8213 8237 11800
645 11800 -2544 -12562 -3253 10611 7894 -6649 -10498 1755 10795 2981 -9032 -6686 5846
658 5846 8837 -1976 -9322 -1871 8289 5165 -6054 -7499 2988 8650 501 -8486 -3976 6936
672 6936 6940 -4110 -8803 421 9158 3588 -7715 -7069 4660 9237 -509 -9491 -3801 7732 7318
687 7318 -4308 -9163 64 8972 3992 -6893 -6929 3546 8203 182 -7706 -3453 5840 5670 -3232
702 -3232 -6631 452 6461 1979 -5492 -3911 3977 5273 -2110 -6120 -61 6354 2468 -5785 -4946
717 -4946 4187 7092 -1457 -8272 -2138 7949 5963 -5700 -9005 1773 10389 3154 -9340 -7837
731 -7837 5888 11003 -661 -11587 -5017 9289 9663 -4603 -11941 -1269 11252 6749 -7817
$$ packed form
632e297q703J2747J4670n851j7362k296J6099R807j1271j4902M146J6450L563
645A1800j4344j0018R309J3864k717j4543l849J2253R040p814j2013K346J2532
658E846K991j0813p346P451J0160l124j1219j445J0487N662q149q987M510J0912
672F936Mj1050m693R224Q737n570j1303O46J1729M577r746q982N690J1533m14
687G318j1626m855R227Q908m980j0885l6J0475M657q021p888M253R293j70q902
702c232l399P083O009m482p471J581P888J296p383m010O059O415l886q253Q39
717d946R133K905q549o815O134J0087j986j1663l305J0778Q616p235j2494J503
731g837J3725N115j1664j0926O570J4306L74j4266p338J0672J2521m503j4566
$$ plain form
744 -7817 -10435 2577 11419 2983 -9630 -7439 5739 9818 -894 -9769 -3635 7615 6849 -4148
758 -4148 -8261 314 7926 3045 -6191 -5415 3681 6634 -884 -6699 -1753 5855 4008 -4204 -5627
773 -5627 2011 6477 601 -6324 -3252 5091 5487 -2813 -6868 -174 6903 3287 -5490 -5837 2819 7140
789 7140 493 -6862 -3675 5024 5911 -2156 -6713 -1009 5984 3661 -4024 -5230 1499 5525 981
804 981 -4709 -2800 3252 3846 -1557 -4130 22 3906 1292 -3360 -2336 2661 3285 -1669 -4035 330
820 330 4501 1394 -4353 -3365 3312 5158 -1279 -6199 -1522 5945 4449 -4202 -6759 1126 7632 2547
836 2547 -6661 -5905 3940 7977 -85 -8118 -3890 6262 6963 -2816 -8265 -1216 7568 4839 -5064
851 -5064 -7121 1561 7652 2082 -6394 -4938 3891 6507 -783 -6558 -2142 5337 4366 -3247 -5560
$$ packed form
744g817k618J3012Q842q436j2613K191J3178M079j0712q875O134J1250p66j0997
758d148m113Q575P612m881r236P76R096K953p518n815M946P608j847q212j423
773e627P638M466n876o925L072Q343L96q300m055O694P077l616q777l47Q656M321
789G140o647p355L187Q699Q87q067m557N704O993k323p685j206O729M026m544
804I81n690J909O052N94n403k573M152L884k614m652J024M997O24m954k366M365
820C30M171l107n747R88O677J846o437m920M677P467j496q651k557P885O506n085
836B547r208P56R845M037q062q033M228J0152P01r779n449P049Q784k729r903
851e064k057Q682O091n570q476J456Q829K616p290n775M416P479r71p613k313
$$ plain form
866 -5560 776 5662 1580 -4846 -3515 3295 4789 -1312 -5278 -865 4914 2894 -3746 -4509 1879
881 1879 5354 412 -5233 -2720 4100 4579 -2067 -5532 -422 5338 2868 -3993 -4666 1810 5415 709
897 709 -4980 -2955 3474 4438 -1356 -4863 -866 4281 2677 -2914 -3795 1171 4094 566 -3660 -2010
913 -2010 2705 2959 -1485 -3416 173 3436 1104 -3028 -2236 2227 3171 -1079 -3699 -353 3746 1938
929 1938 -3091 -3346 1789 4300 67 -4461 -2059 3679 3827 -2022 -4872 -181 4897 2477 -3790 -4277
945 -4277 1819 5164 588 -4885 -2869 3511 4464 -1410 -5067 -943 4540 2995 -3103 -4355 1090
960 1090 4733 1048 -4172 -2871 2820 4054 -999 -4404 -917 3957 2605 -2775 -3737 1164 4225
975 4225 668 -3901 -2318 2908 3561 -1354 -4142 -424 3953 2151 -3019 -3451 1514 4107 281 -3960
$$ packed form
866e560O336M886m082o426J331O810J494o101l966M413N779k020o640p63O388
881A879L475m942n645K513O820M79o646l465N110N760k470o861o73O476L605m706
897G09n689K025O429R64n794l507L997N147j604n591q81M966K923l528m226J650
913b010M715K54m444j931L589L263k332m132P92M463R44m250k620L346M099j808
929A938n029k55N135K511m233m528K402N738J48n849k850M691N078k420o267m87
945d277O096L345m576n473K016O380R53n874l657M124N483j545o098j252N445
960A090L643l685n220J301N691J234n053l405L487M874j352n380r62M901L061
975D225l557m569J583N226O53m915k788L718M377j802n170m32M965K593l826m241
$$ plain form
991 -3960 -2030 3041 3357 -1540 -4014 -254 3847 1932 -2944 -3215 1495 3809 189 -3679 -1791 2840
1007 2840 2991 -1488 -3595 -76 3529 1602 -2801 -2776 1604 3461 -106 -3486 -1383 2896 2628 -1764
1023 -1764 -3391 302 3543 1226 -3035 -2539 1937 3386 -467 -3597 -1119 3113 2459 -2035 -3344
1038 -3344 549 3582 1025 -3121 -2383 2032 3260 -593 -3479 -932 3035 2259 -2020 -3102 651
1053 651 3365 826 -2964 -2105 2031 2995 -709 -3277 -706 2958 2011 -2059 -2895 796 3254 639
1069 639 -2979 -1941 2128 2868 -854 -3247 -580 2983 1887 -2134 -2813 883 3174 506 -2920 -1770
1085 -1770 2105 2657 -925 -3008 -381 2782 1569 -2055 -2400 1022 2775 169 -2662 -1267 2112
1100 2112 2138 -1198 -2612 120 2675 1011 -2246 -1949 1440 2602 -356 -2805 -864 2479 1965 -1685
$$ packed form
991c960J930N071L16m897k474L760M101j915m876k71M710K314l620l868J888M631
1007B840J51m479k107L519L605j927m403K5M380J857l567l380K103M279k68m392
1023a764j627L693L241k317m261M96M476J449l853l130K478M232o54m494j309
1038c344L893L033k557m146P38M415J228l853k886K547L967p76m279j082L753
1053F51K714k539l790Q59M136R64l704k568K571L664r47m070q36L691K458k615
1069F39l618J038M069P40l722k393K667L563j096m021o79L696K291k668l426J150
1085a770L875N52l582k083K627L163j213l624l45L422J753k606k831J395L379
1100B112K6l336j414K732K555j664l257K97L389J162k958k449J941L343n14l650
$$ plain form
1116 -1685 -2767 474 3027 878 -2703 -2124 1786 2968 -455 -3215 -1012 2795 2312 -1742 -3114
1131 -3114 320 3256 1190 -2687 -2399 1587 3092 -154 -3088 -1232 2485 2327 -1374 -2851 91
1146 91 2829 1167 -2219 -2072 1276 2574 -131 -2548 -940 2097 1814 -1289 -2318 286 2407 720
1162 720 -2084 -1607 1400 2191 -460 -2399 -563 2176 1517 -1525 -2179 579 2467 526 -2243 -1499
1178 -1499 1590 2219 -598 -2458 -499 2235 1484 -1553 -2137 592 2372 451 -2105 -1341 1475 1953
1194 1953 -605 -2153 -310 1962 1125 -1453 -1693 720 1951 100 -1890 -867 1520 1476 -926 -1873
1210 -1873 151 1962 666 -1718 -1392 1163 1950 -333 -2146 -594 1957 1498 -1325 -2117 407 2357
1226 2357 677 -2109 -1639 1394 2320 -327 -2494 -800 2137 1785 -1318 -2384 223 2467 909 -2033
$$ packed form
1116a685j082L241K553k149l581N79L910J182l423k760K203L807m83m054j372
1131c114L434K936k066l877K88L986J505l246k934J856L717j58l701j477K942
1146I1K738j662l386J47L348J298k705k417J608L037k83l103j029K604K121j687
1162G20k804M77L007P91k651j939J836K739o59l042o54K758J888j941k769P44
1178a499L089O29k817j860J959K734p51l037n84K729J780j921k556P64K816M78
1194A953k558j548J843K272q37k578k40K413J231j851j990J023K387m4k402r47
1210a873K024J811j296k384L26K555P87k283j813J552K551m59k823p92K524J950
1226B357j680k786M70L033R26k647k167J694K937l52l103j066K607K244j558k942
$$ plain form
1242 -2033 -1814 1167 2298 -112 -2317 -935 1823 1720 -1029 -2121 60 2094 842 -1667 -1538 968
1258 968 1915 -112 -1926 -697 1600 1366 -988 -1764 234 1852 561 -1607 -1234 1072 1708 -350
1274 -350 -1853 -446 1673 1178 -1164 -1686 430 1892 381 -1736 -1145 1215 1672 -491 -1883 -355
1290 -355 1712 1079 -1226 -1609 509 1785 292 -1645 -1000 1195 1491 -524 -1691 -203 1588 876
1306 876 -1179 -1375 596 1608 109 -1546 -758 1221 1277 -677 -1559 23 1584 659 -1305 -1236 791
1323 791 1597 -112 -1663 -627 1409 1239 -889 -1666 149 1759 624 -1496 -1301 927 1720 -160
1339 -160 -1797 -653 1504 1330 -908 -1733 126 1782 680 -1444 -1320 851 1687 -71 -1674 -667
1355 -667 1360 1275 -752 -1578 51 1555 643 -1236 -1169 707 1450 -62 -1444 -575 1163 1046 -700
$$ packed form
1242b033K19K981J131k410k205J382K758j03k749j092K181K034j252k509J29K506
1258I68R47k027j814J229K297k34k354p76J998J618j291k168L73K306O36k058
1274c50j503J407K119m95k342n22K116J462j511k117N91K360M57k163j392J528
1290c55K067o33k305l83K118J276j493j937O45K195K96k015j167J488J791p12
1306H76k055j96J971J012j499j655P88J979N6j954q82J582J561r25j964O9K027
1323G91Q06j709j551J036K036j70k128p77J815J610j135k120J95K228P93j880
1339a60j637J144K157j74k238q25J859J656j102k124J24K171Q36j758j603J007
1355f67K027q5k027q26J629J504r12j879O7J876P43j512j382Q69J738j17j746
$$ plain form
1372 -700 -1336 124 1355 445 -1162 -934 758 1237 -253 -1341 -305 1219 825 -875 -1178 388 1359
1389 1359 197 -1291 -748 985 1186 -475 -1397 -120 1359 729 -1052 -1193 527 1423 120 -1375
1405 -1375 -727 1045 1196 -499 -1416 -120 1344 730 -1008 -1173 472 1377 147 -1292 -710 977 1134
1422 1134 -466 -1325 -115 1272 668 -970 -1071 513 1299 62 -1268 -583 1030 1040 -571 -1271 29
1439 29 1309 550 -1066 -1011 623 1295 -71 -1328 -524 1104 1011 -657 -1313 51 1321 537 -1079 -1025
1457 -1025 594 1277 -15 -1269 -580 992 994 -527 -1219 -26 1181 558 -893 -914 470 1106 34
1474 34 -1056 -464 830 812 -456 -974 59 985 344 -815 -654 552 881 -194 -955 -182 890 542
1492 542 -680 -840 348 999 62 -983 -494 805 850 -446 -1075 -25 1072 508 -859 -897 463 1128
$$ packed form
1372g00o36J460J231r10j607K28J692M79j490j088J036J524l94j700l03J566R71
1389A359j162j488N43J733K01j661r22J277J479o30j781j41J720Q96j303j495
1405a375O48J772J51j695r17J296J464o14j738j65J645R05j230j439N82J687J57
1422A134j600q59J210J387o04j638j01J584P86j237j330O85J613J0j611p00J300
1439B9J280p59j616N5J634O72j366j257Q04J628r3j668o56J364J270p84j616N4
1457a025J619O83j292j254O89J572Kj521o92J193J207o23j451k1J384O36j072
1474C4j090N92J294j8j268n18J033R26o41j159J61J206L29j075p61P73J072l48
1492E42j222j60J188O51r37j045M89J299M5j296o29J050J097n64j367l8J360O65
$$ plain form
1510 1128 48 -1117 -553 862 952 -420 -1133 -98 1101 606 -805 -957 393 1129 140 -1041 -588
1527 -588 782 926 -354 -1064 -120 1001 548 -762 -871 387 1014 43 -984 -469 789 816 -449 -1008
1545 -1008 24 1013 419 -823 -787 499 1021 -40 -1025 -396 861 804 -478 -998 38 1035 450 -799
1563 -799 -796 446 1010 24 -976 -449 737 784 -376 -935 -48 897 452 -676 -714 354 845 34 -809
1582 -809 -359 645 623 -367 -753 60 769 244 -654 -498 458 698 -147 -748 -129 721 445 -523 -659 273
1602 273 798 88 -759 -396 610 684 -305 -820 -50 807 427 -621 -700 306 859 78 -821 -445 606
1621 606 716 -275 -850 -107 794 451 -585 -709 266 824 105 -768 -425 576 686 -273 -782 -43 769
1640 769 386 -583 -627 332 788 18 -762 -336 634 613 -342 -754 30 784 316 -641 -598 371 773 -38 -780
$$ packed form
1510A128j080j165N64J415R0j372p13J035J199m95j411j52J350P36r89j181M53
1527e88J370J44j280p10R44J121m53j310j09J258O27r71j027N15J258K7j265n59
1545a008J032R89n94j242L6J286N22j061r85O29J257n7j282n20J036R97n85j249
1563g99LJ242N64r86j000N27J186M7j160n59Q87R45m45j128l8J068M91q11q43
1582h09M50J004k2r90l86Q13P09n25q98J56R56K40q45o01O19Q50k76r68j36R32
1602B73N25p10q47L63J006P4r89n15P70Q57l80j048p9J006N53p81q99L76J051
1621F06J10r91n75P43R01l43j036j24R75N58p19q73L43J001J10r59n09P39Q12
1640G69l83r69m4R59M56p70p80M26R70k1r55m12P84P54m68r57M3R69M02q11p42
$$ plain form
1661 -780 -317 624 597 -356 -761 7 754 333 -601 -589 324 738 13 -723 -320 574 576 -295 -683 9 691
1682 691 304 -528 -503 318 647 -28 -651 -235 553 465 -355 -606 90 645 181 -551 -412 371 571 -148 -637
1703 -637 -130 579 380 -411 -567 173 640 93 -594 -357 436 556 -178 -631 -98 581 361 -417 -552 185
1723 185 629 104 -570 -343 421 550 -169 -609 -78 582 350 -420 -513 204 613 63 -563 -313 428 500 -224
1744 -224 -593 -32 568 282 -452 -481 239 581 2 -577 -254 455 458 -248 -550 10 563 244 -438 -418 271
1765 271 549 -6 -531 -199 454 420 -261 -513 38 538 214 -439 -396 266 513 -46 -523 -185 441 370 -287
1786 -287 -500 84 534 153 -468 -365 314 495 -89 -537 -131 483 361 -323 -491 123 542 138 -471 -334
1806 -334 341 489 -105 -516 -104 473 337 -313 -460 117 507 113 -445 -301 307 443 -108 -490 -107 438
$$ packed form
1661g80M63R41k7r53m05P68P47m21r34J2R13M14p25p36M03Q94Kq71l88O92O82
1682F91l87q32K5Q21L29o75o23M16P88q8q20k51O96N55m64p32J39P83K00p19m89
1703f37N07P09j99p91j56P40M67n47o87K37P93J20p34m53N33O79k20p78j35P37
1723A85M44n25o74K27P64J29p19m40N31O60k32p70r3P17M09n50o26K50P41P2p24
1744b24l69N61O00k86p34k9P20L42n79n79L23P09Lp06l02N60N53l19o82K0O89
1765B71K78n55n25L32O53l4o81k52N51N00l24o53M3O62K47n59m77L38O26p1o57
1786b87k13N84M50l81o21J03O79J81n84m48M06O14j22o84j68O14M19m04o09J37
1806c34O75J48n94m11M12N77j36o50j47N77L90l94n58J44O08J36n51l82L83N45
$$ plain form
1826 438 284 -297 -424 123 472 85 -436 -273 307 396 -132 -472 -54 443 257 -319 -382 159 461 54 -430
1847 -430 -232 348 388 -161 -454 -7 451 227 -339 -364 180 444 14 -421 -189 321 339 -175 -414 -11 393
1868 393 178 -318 -324 173 395 -6 -392 -171 311 287 -188 -371 36 385 143 -328 -262 233 383 -50 -384
1889 -384 -97 366 276 -245 -364 120 435 106 -376 -258 283 396 -111 -435 -79 409 261 -278 -400 109
1909 109 428 90 -401 -278 269 388 -86 -419 -91 378 265 -244 -363 74 403 90 -336 -245 243 367
1929 367 -59 -381 -73 354 240 -231 -332 105 375 74 -333 -198 260 325 -122 -368 -40 343 187 -260
1949 -260 -298 118 368 32 -341 -182 268 302 -131 -344 -8 340 173 -261 -281 146 350 17 -310 -146 245
1970 245 268 -124 -307 -2 316 143 -232 -230 144 295 -13 -288 -111 255 233 -156 -283 46 305 97 -268
$$ packed form
1826D38j54n81j27N47L49l87n21J63N80Q9n28l40M18M97j86n76o3N41L02m07m84
1847d30J98N80M0n49k93M47M58k24n66k5N44K64m30m35K32N10J8n14k39M03M04
1868C93k15m96oM97K22m01l86K21M82k4m75j83M07L49k42m71O6M95J50m33l34
1889c84K87M63r0n21j19M84L15l29m82J18N41J13n07l24L56M88j48n39j22N09
1909A09L19l38m91J23N47J19m74l33L28M69j13n09j19M37L29l13m26R1M88J24
1929C67m26l22L08M27j14m71j01M37K70l01m07J35M58O5m47k46L28L83j56m47
1949b60l8M16K50l36l73J59M50L4m33k13L36L48j67m34k0M27K04l33l27J64L91
1970B45K3l92j83L05L18j73l75KL74J51l08k75J77L66k2l89j27L29K59k08l65
$$ plain form
1991 -268 -198 198 297 -69 -320 -74 291 195 -212 -295 95 335 53 -313 -205 216 306 -96 -332 -50 311 212
2013 212 -222 -285 93 355 78 -294 -203 205 303 -61 -322 -76 289 215 -193 -292 53 305 76 -271 -198 180
2035 180 274 -64 -297 -54 260 171 -197 -256 79 293 46 -255 -153 202 247 -98 -272 -9 277 144 -210
2056 -210 -228 113 287 17 -267 -122 215 228 -109 -272 -6 268 125 -208 -209 108 255 -1 -251 -112 197
2077 197 204 -117 -242 4 243 97 -185 -179 116 230 -12 -238 -76 210 166 -138 -208 55 254 70 -210 -152
2099 -152 170 226 -58 -240 -29 253 155 -174 -220 81 265 47 -249 -145 187 243 -85 -271 -53 246 160 -184
2121 -184 -239 73 277 51 -250 -171 171 243 -54 -262 -53 239 167 -147 -214 61 248 65 -199 -142 153 223
2143 223 -47 -227 -26 213 141 -152 -197 77 219 21 -221 -114 161 178 -94 -204 -12 208 87 -169 -173 79
$$ packed form
1991b68P0L96R9l66k51K46L65r6m07q3L90K40k82l66J08M21R0m02k36K82L61r9
2013B12m34o3L78K62k77l72R1M08R8l64k61K46L65p4m08r9L45K52k29l47P3L78
2035A80R4l38k33K43L14q9l68n9L35K14k47l01J02L55M5l45j74K63K86j33l54
2056b10j8L41J74k70k84J45L37J3l37j63K66K74j43l33jL17J47k56k50J39L09
2077A97Pl21j25K46K39j46k82OK95J14k42k26J62K86m4l04p0K63J99j84k80N8
2099a52L22N6k84j82K11K82r8l29m6L01J84k18k96J04L32N6l28j86K18K99q6l44
2121a84n5L12K04k26l01P9L42P2k97k08K09K92p2l14o7K75J87j83k64N7K95P0
2143B23k70j80K01K39p2k93m5K74J42j98k42J07K75J7k72j10J92K20j21k56mK52
$$ plain form
2165 79 207 -9 -211 -86 171 162 -97 -194 5 223 90 -167 -150 108 198 6 -199 -69 164 158 -97 -196 18
2188 18 212 82 -155 -138 109 179 -20 -195 -57 165 121 -119 -180 48 190 33 -194 -114 136 165 -72 -207
2210 -207 -18 193 100 -139 -174 81 214 32 -196 -104 163 194 -66 -211 -19 203 120 -134 -177 62 229 45
2232 45 -188 -126 151 194 -46 -202 -45 191 118 -124 -170 46 188 38 -182 -101 140 161 -61 -178 -20 179
2254 179 90 -125 -136 69 193 20 -160 -67 140 152 -71 -162 11 175 85 -136 -129 95 166 9 -159 -72 139
2277 139 128 -66 -159 2 162 65 -133 -135 69 147 -10 -161 -58 131 117 -83 -151 20 152 47 -128 -106 90
2300 90 134 -19 -152 -43 144 98 -100 -118 51 162 34 -150 -76 115 145 -57 -162 -11 173 93 -117 -141 59
2323 59 169 10 -154 -83 128 134 -51 -175 -25 167 94 -109 -142 44 171 27 -147 -92 112 157 -41 -154 -20
$$ packed form
2165G9J28k16k02J25K57rk59r7J99K18j33k57J7K58R0j92k05J30K33ok55r9K14
2188A8J94j30k37J7K47P0j99j75J38K22m4k40o1K28J42j57k27Q0K50K9k37j35
2210b07J89K11r3k39l5K55J33j82k28R2K67L1k60j45J92K22q3k54m3K39J67j84
2232D5k33O2K77M3k40j56J57K36p3k42m6K16J42j50k20Q1K41K1k22j17J58J99
2254A79q9k15j1K05J24j73j80R3K07J2k23r1J73J64r0k21PK24P1j57j68Q7K11
2277A39j1j94r3J61J60r7j98kK04P8j57j51J03J89j4k00o8J71J32j05j75K2J96
2300I0M4j53j33J09J87m6j98j8J69J11j28j84P4J91L0k02j05J51J84q0k10k4K00
2323E9J10j59j64P1K11Oj85j24J50J92p3k03l3J86J27j44j74N5K04M5j98j13J34
$$ plain form
2346 -20 163 103 -107 -132 65 164 16 -139 -78 118 127 -61 -132 -4 140 73 -122 -120 52 144 -4 -149 -64 111
2370 111 101 -71 -150 -2 142 60 -120 -109 56 134 -10 -141 -52 114 106 -51 -128 -6 132 68 -95 -96 70 139
2394 139 7 -125 -39 114 96 -62 -117 23 122 25 -115 -83 75 112 -37 -130 -25 116 73 -101 -113 39 118 8
2418 8 -125 -66 98 108 -46 -137 -11 129 76 -90 -102 49 138 21 -121 -64 113 123 -43 -130 -6 130 75 -81
2442 -81 -111 45 135 16 -131 -68 83 107 -50 -129 -12 116 43 -102 -100 50 120 -1 -117 -54 100 96 -45 -122 2
2467 2 129 53 -93 -90 70 124 -6 -114 -49 110 97 -44 -112 4 122 54 -96 -92 55 122 3 -110 -52 95 90
2492 90 -52 -104 -9 111 46 -88 -82 44 104 -10 -104 -41 88 90 -44 -99 14 113 19 -93 -63 63 96 -19 -102 -17
2518 -17 98 77 -56 -93 41 118 28 -98 -51 69 91 -39 -103 -12 107 57 -86 -94 32 96 12 -97 -51 80 94
$$ packed form
2346b0J83o0k10k5J97R9j48j55O1J96Rj88p1J28J44o7j95KJ72R2j48j45Q5J75
2370A11j0j72p9J48J44q2j80J1J65P8j44j31Q9J66qj57p7J22J38o4j63jJ66O9
2394A39j32j32Q6J53j8j58n5J40R9r7j40L2J58L7j49r3J05J41m3j74j2J52P9j10
2418Hj33N9J64J0j54r1J26J40n3j66j2J51Q9j17j42N7J77J0j66q7J24J36n5j56
2442h1l0J56R0j19j47O3J51K4j57p9J17J28p3j45KJ50P0j21j16O3J54mj41p7J24
2467BJ27p6j46LJ60N4j30j08O5J59j3j41o8J16J18o8j50MJ47O7j19j13N8J47n
2492I0j42n2R5J20o5j34OJ26O0j14r4O3J29Kj34n5J13R9r4j12L0J26L3j15q3Q5
2518a7J15k1j33l7J34P7r0j26M7J20K2j30o4R1J19n0j43qJ26O4q4j09M6J31J4
$$ plain form
2543 94 -31 -111 -1 104 59 -73 -89 40 102 7 -97 -39 89 101 -30 -82 11 111 61 -70 -68 63 98 -8 -84
2568 -84 -32 90 83 -44 -95 13 111 39 -80 -78 56 96 -9 -100 -36 85 74 -48 -97 12 103 43 -79 -75 43 99
2594 99 7 -85 -31 82 80 -34 -84 14 104 44 -66 -53 50 96 -5 -78 -22 79 66 -51 -88 18 86 21 -76 -62 54
2621 54 69 -20 -77 -4 82 50 -61 -72 30 83 21 -79 -49 66 74 -15 -84 -10 79 58 -46 -64 29 88 17 -62 -39 59
2649 59 75 -22 -77 -4 80 43 -64 -69 27 72 7 -81 -38 64 62 -43 -85 -2 90 34 -56 -62 33 79 -9 -73 -20 74 60 -40
2679 -40 -68 21 94 42 -56 -52 46 91 2 -83 -26 71 71 -35 -76 4 85 39 -71 -56 36 78 2 -73 -37 64 62 -42 -73 -2
2709 -2 74 23 -64 -49 42 66 -3 -61 -20 79 46 -43 -59 21 76 23 -52 -31 65 67 -8 -63 7 81 52 -27 -51 26 77 15 -57
2740 -57 -39 60 71 -17 -69 -10 70 37 -51 -57 25 68 5 -56 -42 58 60 -16 -49 -6 81 43 -42 -44 44 66 15 -57 -6 61 57 -23
$$ packed form
2543I4j25q0J10J05m5j32j6J29O2r5j04N8J28J2j31n2R3J00n0j31KJ31L5j06p6
2568h4N2J22pj27n1J08R8p2j19KJ34M0j05r1O4J21j1j22m9J09R1o0j22MJ18N6
2594I9r2r2N4J13kj14n0R8R0o0j10J3J03M6j01p3N6J01j3j17l7J06O8o5r7J4J16
2621E4J5q9n7P3Q6l2j11j1J02N3o2j00L0J15Qq9o9P4Q9k1j04j8R3N9p1p9K3R8
2649E9J6r7n5P3Q4l7j07nR6M5o5q8M3J02kj05m2Q3R2n6r0oR5M6q8o4N3R4j4j00
2679d0k8Q9P3n2r8MR8M5q9q5N7R7%j06m1Q0Q1m6j10J5R2M2p6p5L6J01kj04l1P1
2709bP6n1q7J5R1K4o9n8M1R9l3q9j6Q0N5n3p5K1R6Kp5n5P0P4k9p9k4P7N1o2p2
2740e7J8R9J1q8n2N9Q0l3q8oQ2M3o3o1J4J00Kp6l3M3Q7l8q5kQ8K2n1p2N1O7mq0
$$ plain form
2772 -23 -49 27 73 33 -49 -45 32 72 -4 -59 -22 57 44 -41 -80 6 73 13 -54 -49 40 58 -6 -67 -26 57 45 -31 -63 7 77
2803 77 28 -40 -34 41 71 14 -46 -24 52 57 -14 -61 14 69 14 -48 -28 42 58 -9 -53 -10 46 42 -30 -50 13 53 13 -58 -30 27
2835 27 45 -18 -58 -5 57 28 -40 -52 21 68 14 -48 -19 56 53 -17 -41 3 59 42 -25 -39 32 55 19 -47 -16 44 56 -8 -46
2866 -46 2 51 30 -51 -44 26 49 -8 -64 -26 47 37 -21 -48 8 51 23 -33 -30 33 66 1 -48 -10 42 44 -21 -48 25 61 25 -36
2898 -36 -36 37 56 -1 -43 -16 43 40 -24 -54 10 49 17 -45 -35 15 56 -18 -52 -18 37 38 -29 -47 8 53 23 -37 -24 30 47 -5
2930 -5 -50 -6 56 43 -13 -30 14 39 26 -42 -22 29 43 -12 -41 -6 31 21 -23 -40 10 38 0 -43 -27 35 36 -20 -45 -17 42
2961 42 28 -34 -39 27 45 5 -32 -15 38 32 -24 -33 10 45 30 -11 -19 25 44 0 -37 -13 38 40 -17 -49 3 43 17 -42 -33 21 42
2994 42 -15 -43 -20 29 37 -27 -51 -4 33 11 -40 -41 21 42 1 -40 -20 35 32 -21 -31 11 47 15 -35 -18 25 38 -5 -34 -7 40
$$ packed form
2772b3k6P6M6m0q2MP7M0p6n5L7P9j3q5l9Q6O7o0o7NQ9J8o4o1M1Q3j2p6l2P0P0
2803G7m9o8OP5L0n7o0K2P6Np1m7P5N5n5o2K0P0J6o7m4M3N6mp2k0O3M0m0p1K8N7
2835B7J8o3m0N3O2k9o8j2P3M7n4o2K9P5lp0k4M4N6j7o7j4P1K3l6o6L1O0J2o4l8
2866d6M8M9k1q1PP0K3n7n6L8P3j0n8k7N6M3k8n6LO3L3o5m9L8N2Ko5k7P3L6l6o1
2898c6%P3J9n7m2K7N9lo4l0O4L9l2o2J0N0M1p4l4L4N5Jo7j8N5M5l0o0J3N4J7n2
2930em5M4O2j3n6j7M4K5j3o8K0N1J4n5k9L5L7j0m4j7N0K8l8m3J6O2Jn6k5K8N9
2961D2j4o2nO6J8m0l7J7N3on6rM3L5j5m1qM4J9m4l7K4N1Kn7l2N2M0k6n9RN4K1
2994D2n7k8K3M9Qo4k4M7L7k2n1jO2K1m1m1K0N5ln3j0M2L6l2n0J7M3J3m3k9K7M7
$$ plain form
3026 40 24 -24 -32 2 53 6 -42 -30 33 34 -3 -49 -17 30 16 -22 -26 2 44 4 -29 -21 27 36 -7 -30 -2 34 29 -14 -34 24 40
3059 40 20 -28 -11 26 42 0 -23 -3 29 24 -10 -13 10 28 -8 -40 -19 22 15 -20 -26 0 32 15 -41 -32 12 33 2 -35 -19 24 20
3092 20 -20 -28 2 35 19 -24 -24 21 32 -1 -32 -2 32 27 -7 -30 -2 34 11 -23 -30 16 26 -4 -43 -21 23 12 -28 -36 -7 16 3
3125 3 -33 -22 23 16 -7 -27 -7 33 15 -11 -19 17 40 12 -28 -8 23 32 -3 -24 -9 24 19 -17 -28 9 30 2 -34 -20 13 24 -23
3158 -23 -44 -3 19 10 -33 -42 1 23 -2 -27 -30 15 19 -17 -37 -3 20 2 -26 -25 12 27 14 -19 -16 31 27 -12 -10 9 28 9 -13 -23
3192 -23 13 27 -5 -25 -15 22 18 -20 -35 -2 16 -2 -41 -31 8 15 -13 -34 -16 26 12 -10 -27 -6 23 3 -21 -5 15 31 5
3223 5 -22 -6 34 28 -9 -7 17 25 18 -24 -16 13 28 -2 -31 -5 20 8 -17 -27 5 20 13 -27 -21 14 10 -17 -28 -6 10 22 -12 -25 5
3258 5 22 3 -20 -6 21 19 -6 -8 5 28 18 -12 -17 13 26 4 -17 -14 20 9 -13 -20 -9 4 -5 -23 -29 2 17 -8 -16 -27 10 16 -16
$$ packed form
3026D0j6m8qL4N1m7m8J2O3Jl7m6L2M7j4l8mK8M2m0l3QM8Rm3k3K8L6nm3k0N8J6
3059D0k0m8J7L7J6m2k3K0L2nl4lK3J8l6l2K1M1pl5oK6L2j7n6RM4K1l1l7J6M3m
3092B0m0qL0L3j6m3%M5J1l3l1L0L4nl4k3K8L6k3l4pM6J0l0l9K2M4j1m0qK9K3j3
3125Cl6J1M5pk3k0K0M0j8k6qL6K3k8m0K0L1Rl5k1J5L3nl6j1L7K1k8l6J4L3J1m7
3158b3k1M1K2rm3rM3K2k5k5lM5Ml6k0L4K3j8k8JL7J5j3l3LM7ml9KJ9J9j9k2j0
3192b3L6J4l2k0J0L7ml8j5L3J8j8l9J0L9Pk8k1J8M2j4k2j7K1K9k0k4J6K0J6k6
3223Ek7J6M0ol7KK4Qpm2QK9J5l0k9K6K5j2k5j0L2J5pm0OL5mk7j1K2J6J2l4j3L0
3258EJ7j9k3J4K7kk5kJ3K3j0l0nL0J3k2k1LL4j1k2pJ1J3rj8oL1J5k5qj1L7Ol2
$$ plain form
3293 -16 -25 -7 18 11 -14 -21 8 22 4 -11 -3 14 25 -8 -15 7 30 20 -10 -7 18 24 0 -18 -2 35 20 -17 -21 -1 14 2 -21 -22 4
3328 4 5 -7 -19 -15 2 4 -5 -19 17 22 3 -17 -11 14 14 -7 -18 -5 22 16 -11 -9 11 29 9 -8 -8 11 17 2 -17 -4 10 1 -12 -19 14
3365 14 13 16 -28 -15 7 -7 -16 -22 -8 22 3 -15 -18 2 24 -8 -13 -4 20 20 -6 -17 2 29 3 -8 -15 26 24 4 -8 4 27 21 -5 -11
3401 -11 2 20 3 -23 -17 -1 13 -7 -28 -14 11 8 -9 -27 6 19 1 -19 -20 10 14 -6 -15 -1 28 15 -7 -15 5 30 11 -3 2 11
3435 11 22 17 0 6 20 14 3 -4 7 21 -1 -7 -14 2 9 -9 -18 -3 16 9 -17 -25 0 12 -10 -14 -19 12 11 -9 -25 3 30 14 -6 -8 16
3472 16 24 9 -6 4 18 23 -8 -5 2 20 6 -4 -14 9 21 -1 -10 -3 -7 -3 -13 -15 0 9 -1 -20 -17 7 9 -5 -15 3 21 15 -16 -5 6
3509 6 11 10 -12 -11 6 20 2 -3 1 26 16 -3 -6 2 31 19 -3 -5 12 15 6 -10 -5 22 7 -11 -13 -6 11 -2 -22 -12 7 7 -9 -14 -6 18 15
3548 15 -9 -9 6 11 5 -6 -1 18 24 3 -8 12 20 25 -3 -11 19 31 7 -7 -2 6 18 -6 -20 -5 7 5 -8 -14 1 6 0 -18 -3 4 14 -8
$$ packed form
3293a6rJ8K5pk5pK9J4j8j5QJ7J1l3pK2K3j0l0LK5Ok4j8J6L7j5l7mK0J5j2k3jK6
3328DJj2j2MJ7Krj4L6Nj9k0OK5%k1j1J3K7ok7KK0J8k0j7%J9Oj5j9J3J4rj3pL3
3365A4jLm4J3K2j4roJ4L0j9j8lK0K2l2nRK4%k6j1J9K7k6j1pM1kk0j2J2K3ok6o
3401a1J3J8j7k6OJ6J4k0k1J4K5lj7j8L3J3j8k0jL0Mk0rJ4K9j3k2qK0K5j9j4NR
3435A1J1nj7OJ4oj1pJ1J4k2opJ6Pj8rJ5J9pk6qK5J2k2mnL1jk0j6K8K7j6k0kK4
3472A6Qj5j5J0J4Nl1LPJ8j4j0j0K3J2k2rPmMj0kJ5Rj0j9LK4Kj4j0J8J8ol1J1J1
3509FNjk2JJ7J4j8nMK5j0j9lQK9j2k2kJ7Lrj6NK7j5j8kPJ7j3k0J0J9%j6nQK4l
3548A5k4%J5Noj1NJ9Ok1j1K0QNk8qL0J2k4j4NQJ2k4j4J5J2kj3oJ5Noj8J5PJ0k2
$$ plain form
3586 -8 -10 2 16 6 0 -13 11 24 13 5 7 28 29 5 -6 15 23 4 1 -7 15 22 0 -1 0 15 12 -3 -9 1 9 8 -2 -10 7 12 -5 -14 -12 5
3626 5 18 2 -10 10 17 4 -6 -8 18 20 2 -8 -1 20 13 11 -3 11 29 4 -8 0 26 18 -5 -10 10 17 14 2 -7 10 5 -1 -6 -10 6 7 2 -14
3666 -14 3 12 1 -11 -5 9 17 6 -10 7 16 15 10 -4 11 29 15 -3 -8 14 26 6 3 14 14 23 -6 -6 9 12 10 -7 -11 3 12 -1 -9 -6 9
3705 9 5 -10 -2 3 18 -7 -12 -3 5 9 -1 -6 3 27 12 3 6 7 16 13 1 -3 14 25 -4 3 10 10 10 -8 -6 6 15 -5 -13 -15 8 9 -7 -11 -4 18 -7 -7
3749 -7 -10 -5 4 8 -3 -3 5 14 -7 -3 12 19 14 1 -6 21 16 11 0 14 26 25 7 -11 12 18 10 1 1 12 10 -5 -9 -12 11 11 0 -10 -6 3 -3 -2 -13 8
3793 8 15 2 -12 -3 17 18 5 -4 15 17 12 1 16 8 23 9 6 13 20 19 -5 -4 10 17 11 -2 6 12 9 7 -3 -2 13 0 -10 -18 -2 7 5 -9 -18 9
3835 9 16 7 -14 -6 15 20 6 0 11 12 30 2 10 20 23 10 4 11 24 15 0 2 8 10 7 -2 1 20 11 6 -7 6 3 10 -8 -4 5 4 1 -13 -7 8 15 -7
3879 -7 3 2 17 12 -10 3 17 12 17 -4 9 26 29 11 7 13 22 18 10 10 9 8 -2 -11 3 21 7 -6 -7 8 4 -2 -7 -6 9 20 -7 -10 -10 5 8 -12
$$ packed form
3586hkJ2J4j0oj3K4J3j1qKK1Jk4j1K1Qj9lqK2Pk2jJJ5lj5oJ0Qjj0qJ7Nj7rKJ7
3626EJ3j6j2K0Pj3j0kK6Kj8j0PK1pkj4J4J8k5j2QK6qk3nK0Plj2rJ7nonmJ6Jnj6
3666a4J7Rj1j2OJ4Qj1j6J7Rjnj4J5J8j4j8nK2J2k0lJ1%Rk9%J5Lkj7mJ4Rj3qLJ5
3705Imj5QNJ5k5nRQMj0nRK4j5rLJRlj2mJ7J1k9PP%%j8KJ2Rk0qkK3Jj6mPK2k5%
3749glNRMj1%QRk1MJ5Pnj3pK7nnj1J4J2jj8j8K3Oqr%J1kj5mlK3%j1j0MRoJj1K1
3793HPj3j4RK0Jj3rJ9Knj1J5qJ5j4lPPjk4JJ4Poj3QOlkj0JJ5j3j0qJ6Rkj4rK7
3835IPrk1QK1Nj4oJ1JJ8k8QJ0Lj3oPJ3rj5KOKlrLJ9rnj3J3lPj8MRjlj4OJ5Pk2
3879gJ0jJ5nk2J3J4nNk1J3J7Lj8mORmq%jjj0rJ4J8j4j3jJ5monJJ5J1k7l%J5Lk0
$$ plain form
3921 -12 2 6 8 18 -2 11 5 18 8 -3 -5 11 29 -3 12 11 9 8 1 5 11 21 2 -8 -2 3 2 -12 -8 -2 1 -5 -5 -5 6 4 -2 -7 2 15 -15 -3
3963 -3 -6 2 13 4 -1 7 18 12 4 10 1 16 17 7 6 11 14 8 12 1 12 0 -9 -8 -9 2 3 -7 -12 -8 10 -5 -20 -8 -5 -2 -8 -8 -13 -11 8 -4 -10 4 7
4008 7 -1 4 1 16 15 7 6 12 8 0 9 6 11 13 4 -9 5 6 -3 -4 3 0 17 -5 -14 1 -2 -4 -7 -12 -6 1 9 -1 -14 -2 -4 -3 -6 -7 11 7 2 9 11 10 7 4 9 9 20
4059 20 10 6 -2 13 12 8 0 4 10 4 -2 -1 2 0 8 -8 -2 -3 -7 -9 -7 -3 1 -3 -8 6 12 3 1 -10 3 18 15 4 6 9 12 11 3 -1 14 14 7 10 10 15 8 9 4 11 22
4110 22 15 -9 6 8 0 1 -3 3 2 0 -4 -12 -11 3 5 -15 0 -1 6 10 -9 1 10 10 6 2 11 12 5 11 9 8 13 -5 0 10 13 9 1 6 10 11 1 -5 2 0 2 -4 -10 -11
4160 -11 4 5 -10 -4 3 -3 -5 0 -3 3 7 -9 0 9 14 11 3 3 6 20 9 8 12 24 7 16 15 10 17 6 -2 2 16 9 11 -12 -1 0 -6 2 -7 -6 1 -8 -9 -3 -5 2 -7
4209 -7 -5 -9 -2 -9 -5 3 2 13 8 0 -2 12 14 12 3 15 12 12 2 1 6 3 4 -3 -3 9 10 2 -5 6 7 6 -8 -17 5 0 -4 -5 -15 14 10 7 0 0 8 13 -2 3 6 17
4259 17 3 7 2 11 5 -1 15 13 15 5 16 10 10 2 7 -3 -8 10 3 1 6 10 -2 -2 -3 -6 -6 3 6 -11 -8 1 9 -8 -6 -8 13 5 1 9 3 1 13 -1 -6 8 -2
$$ packed form
3921a2J4MKJ0k0J3oJ3j0j1kJ6J8l2J5jkjpMOJ0j9j0ONjj4MOLo%%J1konRJ3l0J2
3963clQJ1rnQJ1oqOrJ5Jj0jNLoMj1J1j2rJjJ1Jj0nMJ8j5j5J2LLo%nKJ9j2oJ4L
4008GqNlJ5jqjOmqRlNKrj3J4JrjPlJ7k2rJ5lklnOPQj0j3J2kJljJ8mnPKjllN%J1
4059B0j0mqJ5jmqMOooJLkQj6OjmkKMMmnJ4Orkj1J3J5lj1KLLjqmJ5%pL%NpJnPJ1
4110B2pk4J5KqJmOjkmqJJ4Kk0J5jPMj9J0R%mmRJpOkjNj8NJ0LmqNMJj0oPkKooj
4160a1J5Jj5OPokNlOMj6RRNlq%LJ4j1jMJ2j7RjnPj1qMJ4pKk3J1JoQrJPrjOkPr
4209gKmPpMQjJ1nqkJ4KkrJ2l%j0jNlJp%J2JqpJ1Jjj4rK2nmjj0K9mlp%QNj5NLJ1
4259A7j4MnRooJ6kKj0J1o%qNj0nJ8pkNMj2%jl%RLj7LRQj7KkK1qmQokJ2j4nJ4j0
$$ plain form
4306 -2 1 5 8 -2 1 -2 12 6 16 13 2 2 9 3 -2 -5 2 5 -2 -5 -12 5 1 -3 -12 -12 -4 0 -8 -2 0 2 2 -2 -2 -2 9 8 -2 4 11 11 1 4 8 2 13 9 3 15 8
4357 8 1 8 -2 0 -2 1 -12 -5 -7 -4 -11 -4 -5 -3 -4 -14 -3 0 -8 -14 -17 -6 5 -5 0 -5 -3 -11 7 -5 -3 9 8 3 -4 7 19 11 4 8 9 7 -6 3 0 -4 -2 0
4405 0 -12 -5 1 0 -6 2 -17 -10 -14 -20 -10 -10 -5 -16 -7 -2 1 -2 -4 -5 1 -6 -3 -1 8 -1 6 0 5 9 4 -4 -1 8 7 2 5 4 -1 8 5 -4 -1 1 3 -8 -12 -9 -3 -8 -3 -4 6 8 4
4460 4 2 2 3 12 -9 1 -8 10 6 9 14 14 0 7 6 -6 8 1 0 -4 6 14 6 0 -5 5 -7 -11 -4 -5 -5 -10 -13 -16 -1 -10 0 -5 -7 -11 -9 5 -8 -9 5 6 -2
4507 -2 -7 4 1 1 11 5 9 2 -9 3 0 3 3 -5 1 -4 10 -2 -3 -3 2 4 -11 -6 -3 -6 -5 -3 -13 -9 -9 -7 -7 -10 -1 -9 -4 -1 2 3 -4 1 -4 2 3 7 -5 5 2 8 10
4558 10 11 6 10 6 1 7 -1 8 8 -4 -6 -1 -10 4 -8 -7 -2 -5 -14 -5 -20 -11 -4 -2 -2 -7 -17 5 0 -11 3 -4 -4 7 4 3 0 10 -4 4 13 1 -4 9 17 15 0
4605 0 -2 4 5 0 -1 1 4 1 -1 -7 1 -2 -4 -4 2 -9 -7 -8 -6 -9 -9 9 -14 -5 -4 2 -5 -4 -3 0 3 -2 1 -6 9 -1 3 -3 9 18 0 6 3 0 -2 7 6 -4 0 -10 -3 -1
4657 -1 -8 -15 -7 -8 -16 -14 -4 -6 -11 -3 -1 -5 -7 -7 3 2 -3 -3 -5 -4 7 -7 8 3 11 6 7 6 5 17 13 0 1 6 1 -4 1 0 3 4 -9 -8 -12 -6 -8 -2 -8 -5 -8 -4 -5 -14 -2
$$ packed form
4306bLMLj0LlJ4oJ0lj1%PonlPLplpJ7mmr%QMqOKK%m%%J1jj0OP%j0LMoJ1moJ2p
4357HpPj0KkLj3PkLpPjKjj0J1LqolJ1J1j0NnKqJ8j2KJ2jnpJ1J2qpMJkj3RlmKK
4405@j2POjoQj9PmoJ0%Nj1RNLlkjOpLKRrPoNMnqLRjnLjnRlrLKKj1mLOnNjJ0Km
4460Dk%JRk1J0rJ8mLN%j4Pjj2J4pjmJ0QqonJ0j2mPj%nllJ5rJ0nkmKJ4j3jJ4Jq
4507bnJ1l%J0oMpj1J2lL%qOnJ4j2j%NKj5NLlJKj0M%K%lRqNLLJpNnOJMj2J0lOK
4558A0JnMmnOqR%j2kNrJ4j2JNlrRj5RPK%nj0K2nj1J4p%J1ljlJ0j4QRj2nJ3Qkj5
4605@kOJnjKLlkoQlk%Oj1KjKl%J8k3RJOpJJLLnLpJ5j0MoJ2Rj8OllkRjj0Mj0PK
4657appQjqKJ0knQKmk%J0jn%kJJ1j4J5nQnJjjJ2mj3JNnnNjLJj3JmOkOoLlMjrJ2
$$ plain form
4710 -2 -5 -4 -6 4 6 4 4 2 2 16 6 4 4 -2 15 0 2 9 13 8 5 3 10 -2 -4 -1 -13 2 -3 -3 -5 -10 -6 -4 -7 -9 -1 -4 -5 -10 1 0 3 -2 3 2 4 2 -3 -2 4 15
4762 15 10 9 15 12 11 10 -1 11 27 3 4 -1 4 3 2 3 3 -1 0 1 -5 1 -5 -20 0 4 -8 -1 -5 8 -3 -4 -4 1 1 -8 -2 3 -1 -6 15 13 3 5 6 12 1 6
4810 6 6 12 9 8 9 -2 12 1 -4 -6 -1 10 2 -5 -9 -7 -3 -2 -9 -5 4 -9 -1 -3 0 -5 3 7 -7 3 -7 2 9 4 5 -4 1 13 5 -2 5 -2 -1 18 0 0 -2 -11 8
4859 8 14 8 3 -7 -4 -4 -8 -3 -1 6 -12 -18 1 -3 -12 -4 -4 5 7 -5 -6 0 7 -1 -2 6 3 8 8 3 1 11 -1 10 0 -1 11 9 4 -4 11 13 6 4 4 4 -2 15 -16
4908 -16 2 -1 -13 0 -5 -5 3 -8 8 4 7 6 7 -5 -6 8 5 6 6 15 9 12 3 5 8 13 6 4 -3 5 0 7 3 5 7 6 12 -7 2 -3 -5 -5 -8 -6 -15 -6 0 -5 -10 -1 -10 0
4960 0 1 -5 -3 -9 14 5 4 0 -4 6 -3 2 -4 19 14 17 9 9 17 6 0 -5 3 4 -1 1 -7 0 5 -4 -5 -13 2 4 -3 2 -7 -3 -3 -4 1 2 -4 0 1 -2 9 1 4 8 13 13 2 7
5014 7 3 8 6 13 12 -2 1 9 2 -4 -1 2 -3 11 4 1 3 -8 2 -2 2 1 -14 -4 -6 -5 -5 6 4 -1 -7 -11 -6 13 6 3 -1 0 7 13 16 11 12 2 5 2 -1 18 6 1
5064 1 -4 2 2 6 4 -4 2 7 -1 -4 -8 0 -6 -15 -4 -10 -11 1 -3 -5 -4 -8 -6 -6 -10 -4 5 9 7 2 11 -3 3 5 -3 5 3 -3 8 4 0 -5 6 5 4 -3 -10 -9 4 1 7 -6 -6 2
$$ packed form
4710blJkJ0Kk%k%J4j0k%oJ7j5KPMnlkPj2kLj2J5n%knMKlkQljnJ1jLnNjKknJOJ1
4762A5njOljjj1J2J6k4JnNjjJ%mJJoOoj5K0Mj2PmJ3j1j%N%rONmnK1kj0KJOj1N
4810F%OljJj1J4j1nkNJ1qpmKMJpMRj3QkLnQMj4J0j0RPnJrNJ2qpPpJJ9j8%krJ9
4859HOonj0L%mNKPj8oJ9mrQ%RKj2jOPqjQlN%nkJ0j2J1j0jJ2knqJ5Kpk%%oJ7l1
4908a6J8lj2J3n%Qj1J6mLjJj2jJ4lJ%RoLrKLNpkpQnPmKKjOj9Rnk%lKrROnnRrJ0
4960@JoKoK3rjmmJ0rNoK3nLq%Qj1onQJnKqPNrjqJ5KpNrM%jNJoMJlJ1qLMN%j1N
5014GmNkPjj4LQpoLLnJ4plKj1J0mMjj5J0kJ%J1knomNJ9plmJPOLnJj0LllJ9j2n
5064AnO%MkqONqlmQorJ1ojJ2mkJmK%mORMknRj4OKqQkoJ1mmnJ1jjppJJ3lOj3%Q
$$ plain form
5118 2 -4 -1 5 -5 -7 -13 -3 -2 -6 1 3 2 1 2 8 15 5 -2 5 8 11 17 13 14 18 4 12 6 15 15 6 12 1 -2 1 -5 1 3 -6 -8 -4 -3 -2 -7 1 -3 0 2 -4 -1 -8 -3 4 -1 -1 6
5174 6 11 6 0 -7 2 11 22 5 12 9 3 6 -3 11 11 2 2 1 3 4 -3 -4 -12 -3 -3 4 -6 -9 0 -7 -2 -12 -9 4 -1 -12 1 2 0 0 3 5 4 11 13 4 2 11 13 15 19 5
5226 5 4 6 3 3 7 7 2 10 2 2 12 -6 -3 -6 -5 -14 -5 -5 2 -6 9 0 -4 -2 -4 -7 5 7 7 4 -6 15 6 16 7 3 12 6 -1 11 16 12 12 18 9 13 3 2 11 7 6 3
5278 3 4 -1 3 14 8 -5 3 0 7 2 3 -5 -3 -3 4 -2 9 7 3 7 10 0 10 3 5 5 0 23 8 13 -2 12 15 7 5 2 -2 -2 -3 8 3 -3 -4 5 -10 -5 8 -2
5326 -2 5 5 2 -6 -6 2 2 9 5 2 4 4 10 7 2 11 12 6 1 8 0 3 21 4 -1 9 12 8 4 6 3 10 2 -8 2 -2 1 0 -4 -9 1 -4 -4 -4 -5 2 0 1 -2 4 -3 -1 2 1 21
5381 21 5 13 -1 0 11 18 20 7 2 15 2 4 11 8 10 3 8 4 2 0 6 -2 -7 1 1 3 -1 -4 3 -1 1 3 -3 0 -8 1 -5 -8 5 1 -3 12 9 2 14 3 8 8 7 11
5431 11 14 15 1 9 8 5 4 7 6 3 -3 13 1 3 2 4 -4 -4 1 4 4 3 6 -4 4 -3 5 1 3 -1 -1 0 9 0 11 1 0 2 14 12 26 5 -1 8 12 13 22 7 10 11
5481 11 20 7 8 15 4 0 2 5 3 4 -5 2 8 7 2 4 -7 -7 -1 -3 -2 -1 -1 3 -3 10 10 9 -5 8 9 2 8 10 4 11 12 6 15 6 15 -9 -1 9 8 2 1 2 4 0 -1 -1
$$ packed form
5118BoLOj0koJ0JmPKjjJOPj0pPLLOmJMj4QoR%rOj1lLoOKrkMJJnQmLKoLpNPn%P
5174FNnopRRJ1j7PloLrJ4%r%jKJpjqR%Pj0lRpNj0LJ3nj1J3Jk%LKjPKrkRKKMj4
5226EjKl%M%nQq%J0j8LlJrR%PqJ5rmKklJ2K%lj0K1rJ0rmRopJ2Nm%OrMj0jRmjl
5278CJnMJ1oj3QlPnJqK%PoJ1kmMLj0J0pK%nK3j5Nj5J4Lqklm%jJ1nojRj5NJ3j0
5326bP%lq%Q%PmlK%OlnRJonPqLJ8j7nJ0LmmKlPqj0J0mLjmnJ0n%%jPkJlOpKLjK0
5381B1j6Qj4JJ1PKj3nJ3j3KPlKpNmkkOqnQ%KmlPmKKoLqRolJ3mmJ5lpJ2j1N%jM
5431A1LJj4QjljLjloJ6j2KjKq%NL%jLj0QpQmKm%JRrJ1j0jKJ2kJ4k1oRMJRj5LJ
5481A1Rj3JPj1mKLkJrPOjnKj1%OkJJ%MoJ3%jj4J3JpOKoPJoRrRk4QJ0jojJKmj%
$$ plain form
5533 -1 -4 2 -9 7 6 -7 0 -4 -7 -4 -7 -5 3 -2 8 -7 -3 11 2 5 4 9 2 14 16 8 10 10 9 6 5 8 10 8 1 4 6 7 11 -4 -2 -2 -12 13 -3 -1 -3 3 0 -6
5583 -6 -10 4 -8 -7 -3 5 -3 11 1 12 9 6 15 6 10 8 7 14 10 9 9 14 1 5 0 -5 5 -3 5 -3 6 -4 7 0 -3 -6 -7 -10 9 -8 -4 -3 -4 -5 3 1 1 13 -2
5632 -2 10 11 1 4 7 4 13 8 6 7 2 14 9 3 7 13 3 8 7 9 4 8 -2 1 7 10 -3 -3 1 -8 -6 -7 4 -9 -6 -3 -3 -1 -15 -1 10 9 12 10 10 1 2 18 1
5681 1 9 7 9 17 4 10 -3 -7 7 2 4 -9 5 -2 -3 3 3 -9 -4 -2 -17 -12 1 -3 -5 -1 4 4 -14 -4 4 2 -1 5 6 10 17 3 1 10 22 2 13 7 17 -1
5727 -1 6 6 15 12 -4 5 -8 3 6 -1 -5 4 -8 -11 -1 -11 0 -6 -10 -14 -8 0 8 -1 -5 1 -3 14 6 3 15 12 14 -6 2 8 11 4 9 13 11 6 1 3 -2 2 -8 8 11
5776 11 7 0 -9 -1 0 -1 -5 -4 -5 -1 -9 -8 -6 -3 -1 -6 -1 -6 1 -12 9 6 -7 9 4 6 14 -2 3 4 6 10 0 5 4 1 3 2 -1 8 8 -6 3 -5 -11 3 2 4 -4 -8 -5 -10
5828 -10 -8 5 -2 -3 1 -9 2 -2 13 1 7 11 3 7 13 10 7 6 8 15 2 14 10 4 10 7 5 9 2 -8 -2 6 3 -2 -5 -3 -3 4 -9 -15 0 0 -7 -11 -2 -3 -4 -4 3 -5
5878 -5 -6 8 -2 1 -1 4 0 0 2 7 16 14 6 12 10 11 0 0 1 14 7 -7 7 2 6 0 -9 -6 2 -3 1 5 -4 -8 -10 -1 -5 -1 -4 -8 4 -4 10 3 -4 0 4 -2 0 12 -3
$$ packed form
5533alOj1J6jj3PmlLlKQnJ0j5MJ4rLjNpJ2KqK%jljLKkpLKJMj5K%j0K5j6KkOlo
5583fmJ4j2JMQqJ4j0J1llRrMkjPmj%Nj3MnnJ0qQqRj0J1plljlJ9j7MJjjQk%J2j5
5632bJ2Jj0LLlRnkJnJ2noMOj0NjKnMj0LOLj3%MrKjJ1j3LL%Kj4J4J1jLk%rJJ6j7
5681AQkKQj3Oj3mJ4nKj3J4pjO%j2NKj5NJ3mkMN%j8J0QklOJMPj4kRJ2k0J1oJ0j8
5727aP%Rlj6Rj3J1LpmRj2lJ0j0J1ommOQQrmOmJ7qlJ2lKk0QOLpNMknnKnMj0J6L
5776A1mprQJjmJjMqJKLKnNnPj3K1lj3J6nKQj6NJKMj0NjlKjlR%j4RqoJ4jKqmLn
5828a0KJ3pjMj0J1mJ5j2OMqMOlljKPj3J2moOlkMpj0OQlnlK%Pj3oJ5%pmRjj%Pq
5878ejJ4j0LkNm%KNRkqOkJj1%JJ3pj4J4nMorLQnMMrmkRmMlmJ2qJ4ppMMoKJ2j5
$$ plain form
5929 -3 4 7 -1 2 7 2 6 10 13 17 0 10 1 15 0 4 3 -2 -4 -6 -7 -2 -13 -3 -1 -8 2 0 -9 0 -5 5 0 4 -8 -5 0 -1 11 8 4 2 9 12 13 11 15 21 16 5
5979 5 12 6 16 9 11 4 1 11 4 -2 2 -6 -11 -6 0 -2 -6 -8 -5 -6 3 -8 -15 -12 1 8 2 -4 -5 5 14 6 19 9 3 0 7 4 9 10 -1 15 12 2 5 9 3 -7 2 4
6029 4 -12 9 -3 4 -6 3 -1 -1 -1 -4 1 6 5 -11 1 6 3 4 -7 8 8 3 11 8 10 8 15 8 7 17 -2 5 8 10 5 9 1 13 5 -5 4 0 2 8 3 -3 -1 -2 0
6078 0 -8 -3 -2 -8 -4 -12 3 -2 -5 -4 -1 8 -2 8 3 11 2 14 8 18 2 7 8 11 16 10 10 1 2 -4 10 6 0 4 1 4 1 -8 2 -6 -5 -6 9 -2 7 -8 3 10 10
6127 10 5 8 3 17 20 10 22 12 16 15 18 8 9 19 13 4 14 7 7 8 5 9 -2 8 0 -3 13 6 0 -3 -6 9 2 -2 7 2 1 -3 4 -2 -9 -7 4 8 6 -3 3 6
6175 6 11 9 13 10 12 5 6 9 11 7 3 14 16 5 13 7 11 9 -1 0 2 -1 1 -3 7 6 4 -7 6 2 -2 -2 5 -8 -7 6 -5 -4 -2 7 -1 0 -3 12 -3 6 9 9 5 11
6225 11 16 7 3 -1 5 -3 1 -4 -1 10 3 0 0 0 -5 -4 -5 2 -3 -8 8 7 6 3 10 -2 2 8 4 -2 6 5 5 17 8 8 12 12 8 9 17 7 10 13 11 9 6 1 16 12 12 9 11 8
6279 8 10 9 6 1 -1 -7 -7 -14 5 4 -4 6 -2 -1 2 0 5 1 7 9 8 21 2 12 10 12 7 16 15 9 14 5 5 11 5 4 13 -1 -4 -9 7 8 -10 -14 -11 -12 -7 -3 -5 -8 -3 4 -9
$$ packed form
5929cPLqLNnMMLMj7J0rJ4j5MjnkkjNj1J0KpJ0krRnJ0nMj2LNjJ2lmkPLJkMOnj1
5979EPoJ0pKplJ0poMqnNOkmkLjRj1pLJ3PoojJ0RqJ3j0olPlNJj1J6lj0LMoj0RK
6029Dj6K1j2Pj0Rm%%lNNjj6J2NlJj1J5%nQlKkPpjJ0j9PLKnMqJ2qj0RmKOnoKjK
6078@qNJoMqJ5nlJLRj0J0nQrJ2oJ0j6NJLNo%rJoJ4moMlLlrJ0qJjJ5j1Rj5J1P%
6127A0nLnJ4Lj0J2j0MjLj0JJ0orJ0p%JlMj1J0qlJ6pollJ5pmRnjmPopKJ1MkrOL
6175FNkMlKpJLKmmJ1Kj1QoMkj0JKlKmJ0jkj1J3mm%Pj3JJ3j1JKRqJlJ5j5RL%mO
6225A1NrmmOqMnLJ1pl%%nJjPnnJ6jjlPj2MOmoQj%J2r%M%mJQj0LLkklnJ5m%lKl
6279HKjlnko%pJ9jqJ0qJLkNmOKjJ3j9J0kKnRjoNr%OojRj4lnJ6Jj8mLjNMklNPj3
$$ plain form
6332 -9 -2 -6 -12 0 4 -1 3 5 1 -3 0 13 2 9 5 14 10 -10 11 9 18 18 11 -3 11 0 2 21 13 -3 -5 -4 0 11 -4 6 -6 0 -4 -3 1 1 -1 4 5 0 -1
6379 -1 -3 0 -3 1 8 10 15 8 19 15 8 6 -2 11 4 4 10 -3 14 11 2 7 12 -1 1 -4 -1 1 -10 -21 -9 -7 -6 1 -7 5 4 0 9 -6 -7 0 -10 7 -6 -1 8 5
6427 5 2 7 8 12 6 10 9 10 15 10 11 16 9 12 12 10 3 3 6 7 4 -3 -6 -3 -5 -3 3 3 -6 -6 1 -2 3 -2 8 4 0 11 6 16 8 1 -2 11 19 19 2 18 9 6 9 1 4 3 -2
6482 -2 2 -6 4 4 16 1 -4 0 -1 -9 1 3 3 1 -6 11 6 -1 2 5 6 7 9 7 8 2 8 11 11 2 20 10 16 17 9 15 18 4 13 13 7 12 -1 -5 12 -4 11 -2
6530 -2 -2 7 -1 2 -6 2 9 -1 -6 -1 -3 -5 -6 4 -2 -6 -5 2 0 6 9 6 16 9 5 10 17 12 8 7 14 22 8 7 14 3 13 7 4 4 4 2 4 3 -1 -2 -2 -6 -4 -5 0 -8 -4 -3 -11
6585 -11 0 -4 -2 0 11 3 7 4 11 -2 12 13 20 16 9 8 9 -3 11 13 5 12 -2 9 13 10 7 -3 -6 0 5 -1 -12 -4 4 -3 -8 -3 5 1 -6 1 5 6 1 -8 11 3 10
6634 10 12 4 10 19 17 21 18 18 13 7 7 14 5 -1 -2 7 14 6 16 9 -2 0 4 11 4 2 7 0 -3 -5 6 6 6 1 6 8 2 8 8 4 9 19 2 7 9 18 10 14 12 20 17 12 5 16
6688 16 9 11 9 4 14 15 5 18 2 3 0 5 4 -2 2 -2 -4 -9 -8 3 -9 9 -1 -6 3 1 6 13 10 11 2 10 9 12 12 11 6 10 7 15 13 21 14 13 4 8 19 8 2 2
$$ packed form
6332iPmoJ2MnMKmmLJ3j1PmRmk0K1kR%pj4J4j1KJ9qj6kJMJ1j5J0j2OmJM%kNJnj
6379akLlMPKNpJ1mpkqJ3p%Oj3J7lrNNj3KnLKj1j1J2KJPqJ2jmRj5jPj0J7j3NRl
6427ElNJMoMjJNnJNpL%kp%LJlplLkKO%r%PlNnJ0mmJ1nJ0qplJ3Q%j7J6rlLqLjn
6482bMqJ0%J2j5nMjqJ0K%kpJ7npLLJJKkJoOL%rJ8j0OJqOLj4R%oNj3mJ7j6J5j3
6530b%RqLqQPj0nNkkjJ0omJPkOLlJ0pmNPnmjPQj4jPj1J0ol%%kKjmj%mKjNqMJq
6585a1J1mKKJ1qMlPj3J4JPmpjJj2J4KqPj4J1Mllj0lONoj1QQpnNQmpPMJnrJ9qP
6634A0KqORkMl%no%ProjRPqJ0pj1KMPpkNplkJ1%%nNKoO%mNJ0j7NKRqMkQlnpJ1
6688A6pKknJ0Jj0J3j6JlNjoMmknJJ1j2J8j0nRkNPlJrQjL%jnMlQkQpjrMJ1j1o%
$$ plain form
6738 2 5 -4 6 -2 -10 3 -6 -1 -5 0 5 0 -3 -6 5 11 9 6 -8 1 1 4 -2 9 3 -1 10 4 2 8 8 10 12 9 7 4 3 4 9 15 -3 1 0 8 -6 -7 -2 2 0 1 10 -5
6790 -5 -4 -9 -3 3 2 1 6 13 7 -5 7 4 13 10 8 13 7 21 5 9 12 10 8 13 2 9 2 -1 2 6 3 -1 3 1 -4 1 6 2 2 -8 -3 -1 3 1 -6 4 8 -1 5 3 1 2 3 8
6844 8 14 11 21 16 2 7 16 6 12 14 9 10 6 9 13 1 6 7 -1 -6 4 -5 -3 7 -9 3 -4 2 -3 -4 -3 3 -5 3 -1 3 4 8 0 10 11 16 6 10 8 9 11 20 10 7
6894 7 7 14 5 16 22 2 11 -9 -5 7 0 0 -5 -2 1 -4 8 1 -4 -7 -6 -6 1 2 4 2 -2 7 3 6 6 8 12 8 4 16 15 10 9 5 8 14 12 6 13 8 3 3 -5 5 12 1 6
6947 6 -2 4 4 -11 -7 -3 -2 -3 -3 -2 -5 1 3 7 1 1 6 15 15 10 5 1 -7 5 12 9 12 9 15 14 13 6 11 11 12 4 11 5 3 -10 7 -6 -3 -1 -7 -6 -2 -3 -5 -4 0 1 1 2 -1 1
7003 1 11 4 11 -2 12 3 -1 14 6 3 8 13 9 6 7 15 3 20 4 2 1 4 7 2 4 3 7 -3 3 -7 1 -5 -5 -4 6 8 2 -10 6 -5 2 6 16 9 3 10 15
7050 15 11 20 10 -3 8 10 12 8 4 9 8 12 3 9 4 2 11 3 -3 2 7 5 11 1 10 2 -3 -1 -8 -17 -9 -4 2 -3 -2 2 1 -2 -5 7 11 9 10 7 12 10 7 10 9 22 19 12 15 21
7104 21 7 6 0 0 9 2 -1 8 1 6 8 1 6 9 9 0 5 2 8 9 9 5 5 1 6 11 12 7 4 8 21 17 8 4 6 19 12 16 11 18 10 11 5 9 5 14 10 0 10 -7 -3 0 -2 -2
$$ packed form
6738BLrJ0qqJ3rNmNNnllJ1Oklj4R%LoJ1omJ1okO%KKlkljJNOj8MjQj4jNMkJRj5
6790eJnOOjjNPoj2J2lRlkNoJ4j6MLkkNj1PplLMlmMknNNm%j0NKMkpJ0MrOkkJJN
6844HOlJ0nj4NRj0OKnJmLMj2NJqnJ0rKJ0j6J2pOnjJOqQmMJMqJ0JNj0MkJKRj0l
6894G%PrJ1Ok0Rk0MJ2p%nLLnJ2pnlJ%PJKkmRmL%KMmmJ2jnjmLOkoPnn%qJ0Pj1N
6947FqO%j5MMJj%JlOKMo%NR%nnmqJ2PlLlOjjpN%JqPokj3J7j3LKoJMjkJMJ%JlK
7003AJ0pPj3J4rmJ5qlNNmlJQj2J7j6kjLLnKjMj0Oj0Qo%JJ0Koj2J6j1PMJ0poPN
7050A5mRj0j3J1KKmmNjMrOnkRqoNNkOj0RqnKprQNOnJMjllJ2MkJlNklLjJ3lpLO
7104B1j4jo%RplRpNKpNL%rNlOJ%m%mNNJnlMJ3mrmKJ3pMnPqJoMmRmj0J0j7MLk%
$$ plain form
7158 -2 -12 -4 1 1 -7 -7 -8 -8 -1 4 12 8 4 -1 1 6 5 15 13 8 5 6 8 8 -3 4 9 9 1 12 6 9 9 -2 8 7 2 2 0 1 5 -7 -6 -1 -3 -4 -6 -4 -12 -14 -2 -5 -3
7211 -3 5 -5 0 8 20 9 19 3 -3 12 7 13 8 -5 4 7 11 12 -2 -2 8 0 1 -4 0 -2 -9 -2 -11 8 0 4 2 0 -2 -1 -7 0 -12 -3 4 -5 -3 -8 5 11 7 7 9
7260 9 15 13 0 12 5 8 3 1 9 14 10 4 -1 -3 4 5 8 9 0 -4 3 -3 0 2 -7 0 -2 3 -8 4 8 9 6 4 1 9 -6 3 4 10 14 14 11 1 10 3 2 11 5 4 12 6 8 1 4
7315 4 9 6 -2 -3 2 5 -3 -3 1 5 3 -11 -4 -6 -7 -1 1 -7 -1 4 -5 4 4 3 -1 10 4 5 4 2 9 13 6 10 3 8 12 12 5 4 8 11 9 10 7 -5 -5 -5 -3 3 6 1 -1 -2 -10 -6 0 -8
7373 -8 -5 3 0 0 6 9 3 -3 6 7 4 8 12 10 5 14 13 4 14 18 5 8 3 -1 10 -3 11 5 7 2 2 8 -1 -2 -3 -2 -13 -11 8 5 4 1 2 1 -5 8 -10 3 -4 -1 7
7424 7 5 4 12 12 13 9 7 5 13 10 11 10 8 10 13 6 1 6 -3 6 9 0 3 8 -4 0 -1 -3 10 -5 6 -1 3 5 2 1 5 5 1 3 14 4 7 7 6 8 12 17 4 13 7 15 15 13
7478 13 18 7 0 5 2 2 8 -4 -6 0 -9 -7 -5 -15 -1 -3 -7 -13 -15 -7 6 -4 4 2 -7 1 -6 11 -3 12 15 4 12 2 -6 9 7 18 -1 8 2 3 -1 16 4
7523 4 2 0 -5 2 -6 -2 -4 4 7 -7 -11 -4 -10 -9 -4 -1 -5 -8 -3 2 -6 -10 1 -4 5 5 9 6 8 -3 7 11 13 10 11 13 8 11 6 5 6 5 3 5 8 4 -4 1 3 -6 -10 -10 -3 -1 1 -3 0
$$ packed form
7158bj0QN%q%j%PNQmmnKNjJ0knlJK%j1PN%qJ1oL%j1J0jn%kJMj2JNkjkKqkJ2lK
7211cQj0NQJ2j1J0j6oJ5nOnj3RLMJj4%J0qJnMkpPrJ9qMkkkJoPj2RPrKnJ3Om%K
7260IOkj3J2pLnkQNmonkPJLJrmPoLKrPkNj1J2MJlklQj5RJOM%lj0RpjRojQoKpL
7315DNlqjNLq%MMkj4PkjOKqONrR%jmJ1oJjkPMpMpNM%pjMLkJlj2%%KOLnkjqMOq
7373hLQl%OLooRJlMMknRjrJ0Mj3LnmJ1j3J4oKn%OrjjJj1KJ9ljlJjoJ3j8J3pLQ
7424GkjQ%JmkkQlJjkKLpnNrRLrLNj2MjkJ3j5J1pMKljM%mKJ1j0L%jKMNj3RoQ%k
7478A3Nj1pNl%Oj2kOrKKj0J4kmokQJ3j0QkrQpJ7j4J5Lj1Qj0qJ5kJ1j9RoJmJ7j2
7523DkknPqMkQLj4mPoJNLmlNNqmJ1nR%MlKj1J0MKlJKnLnjJjkKLmqNKrm%PKKmL
$$ plain form
7580 0 -4 1 -2 3 -6 7 3 -2 11 7 13 6 12 1 3 18 16 18 8 10 20 5 10 13 11 6 0 2 2 -3 5 2 -2 -1 -6 0 -8 -5 -12 -6 -7 -1 -3 3 1 -8 0 -3 -9 0 1 -4 0 8
7634 8 9 4 9 0 21 18 2 9 7 4 1 1 6 -6 1 7 4 9 9 1 -3 -3 -5 -3 -6 -10 -3 3 0 2 3 4 9 -7 -3 4 5 3 2 1 10 1 8 9 11 11 15 8 7 10 15 4 14 13 12
7689 12 17 5 8 3 5 8 -2 -7 3 2 0 -2 3 -10 -14 -3 -6 -8 -7 3 11 -1 14 -1 4 -5 -2 -3 10 7 10 15 14 10 16 15 11 11 13 4 7 13 -4 11 8 7 -4
7736 -4 7 -1 2 4 4 -3 -3 2 -8 -5 2 -5 -4 -4 3 7 2 0 -4 -3 10 5 4 3 8 7 1 5 10 8 13 8 17 11 5 7 5 -3 0 0 -4 -6 0 -6 0 4 -4 -4 -3 -1 5 1 -13 2 6 14
7792 14 -8 3 11 7 1 8 8 1 15 -2 3 2 10 4 4 11 15 -1 8 5 14 5 -16 1 2 12 1 -13 -1 -4 5 7 -15 9 -2 -7 -5 1 -1 7 -2 -7 -6 4 0
7837 0 -2 6 14 4 9 0 4 6 1 8 9 7 3 10 7 13 0 0 11 9 0 -2 9 3 -1 -8 -1 3 5 -1 1 -14 -1 -6 -3 9 9 0 3 -1 7 3 0 10 1 8 14 15 13 10 15 2
7889 2 10 16 16 9 13 5 14 3 3 16 -8 5 6 1 4 0 -5 -2 -6 -5 -2 -5 -3 4 0 -8 -4 -1 -2 -5 -3 8 6 6 12 8 7 13 7 5 7 7 13 16 18 10 12 13 2 13 -2 -6 8
$$ packed form
7580@mNlNrJ3mnJ3mOpOj1KJ5kKj0KJ0j5NLknoK%nQlmJnOqLpOjOkOkrQloRJnMQ
7634HJnNrK1lj6Pkll%Nj2POlN%qm%kKlmPOlKJJNj6MPJkjjRrPJK%MpjLNj1J0jj
7689A2Nj2LnKLj0nJ0jkkNj3mJ1lkJJ0Qj2J5j5NrLjJ3lLNjmOjm%KrLOj7J5ljj1
7736dJ1qLK%p%Nj0LPpJ%PMnkmJJ3njjNjoMNkNnRooKkqL%mkOoOMq%JKOmj4J5MQ
7792A4k2J1QmoP%pJ4j7NjQo%PMj6RlRrk1J7JJ0j1j4J2lRKk2K4j1nKOkQrnJJ0m
7837@kQQj0NrMKnPJkmPlOj3%J1krkJ1ompPMKoKj5J3nLJ2%rLmQmlJ0rPOJklNj3
7889BQO%pMqRj1%J3k4J3JnLmnLmJLlKPmqMLjlKJ1k%OmjOokK%OLKqKJj1J1j5mJ4
$$ [...]
8190A1p
8191D
##END NTUPLES=NMR FID
##END=
