##TITLE=1H_ES-prec-AN-nmpta
 D2O
 8 sc, 
 13.04.2022
##JCAMPDX= 6.0         $$ Bruker NMR JCAMP-DX V2.0
##DATA TYPE= NMR FID
##DATA CLASS= NTUPLES
##ORIGIN= UXNMR, Bruker Analytische Messtechnik GmbH
##OWNER= root
$$ XWIN-NMR		Version 3.5
$$ Wed Apr 13 14:51:09 2022 Russian Standard Time (UT+4h)  she@DPX200
##.OBSERVE FREQUENCY= 200.13135
##.OBSERVE NUCLEUS= ^1H
##.DELAY= (6, 6)
##.ACQUISITION MODE= SIMULTANEOUS
##.ACQUISITION SCHEME= undefined
##.AVERAGES= 8
##.DIGITISER RES= 18
##SPECTROMETER/DATA SYSTEM= spect
##.PULSE SEQUENCE= zg30
##.SOLVENT NAME= D2O
##.SHIFT REFERENCE= (INTERNAL, D2O, 0, 15.7039)
##AUDIT TRAIL= $$ (NUMBER, WHEN, WHO, WHERE, WHAT)
$$ ##TITLE= Audit trail, XWIN-NMR		Version 3.5
$$ ##JCAMPDX= 5.01
$$ ##ORIGIN= Bruker BioSpin GmbH
$$ ##OWNER= she
$$ F:/spectra/data/she/nmr/H-F/1/audita.txt
$$ ##AUDIT TRAIL=  $$ (NUMBER, WHEN, WHO, WHERE, WHAT)
(   1,<2022-04-13 14:50:01.82 +0400>,<she>,<DPX200>,
      <created by zg, POWCHK disabled, PULCHK disabled
       configuration hash MD5:
       00 E9 B6 7A A2 85 ED C7 34 08 36 98 17 FE 4E 26
       data hash MD5: 16K
       1F BE EB 18 1A B7 01 3C 5B 61 39 A5 47 B2 91 85>)
$$ ##END=
$$ 
$$ hash MD5
$$ 63 28 40 61 D2 02 D0 E8 19 5B 75 44 A9 17 41 9B
##$RELAX= 
##$RELAX= 
##$RELAX= 
##$RELAX= 
##$RELAX= 
##$RELAX= 
$$ Bruker specific parameters
$$ --------------------------
##$DU= <F:/spectra>
##$EXPNO= 1
##$NAME= <H-F>
##$PROCNO= 1
##$TYPE= <nmr>
##$USER= <she>
##$AMP= (0..31)
100 100 100 100 100 100 100 100 100 100 100 100 100 100 100 100 100 100 
100 100 100 100 100 100 100 100 100 100 100 100 100 100 
##$AQSEQ= 0
##$AQ_mod= 1
##$AUNM= <au_zg>
##$AUTOPOS= <>
##$BF1= 200.13
##$BF2= 200.13
##$BF3= 200.13
##$BF4= 200.13
##$BF5= 200.13
##$BF6= 200.13
##$BF7= 200.13
##$BF8= 200.13
##$BYTORDA= 1
##$CFDGTYP= 0
##$CFRGTYP= 5
##$CHEMSTR= <none>
##$CNST= (0..31)
1 1 145 1 1 1 1 1 1 1 1 1 1 1 1 1 1 1 1 1 1 1 1 1 1 1 1 1 1 1 1 1 
##$CPDPRG= <>
##$CPDPRG1= <>
##$CPDPRG2= <>
##$CPDPRG3= <>
##$CPDPRG4= <mlev>
##$CPDPRG5= <mlev>
##$CPDPRG6= <mlev>
##$CPDPRG7= <mlev>
##$CPDPRG8= <mlev>
##$CPDPRGB= <>
##$CPDPRGT= <>
##$D= (0..31)
0 1.2 0 0 0 0 0 0 0 0.06 0 0.03 0 0 0 0 0.0002 0 0 0 0 0 0 0 0 0 0 0 0 
0 0 0 
##$DATE= 1649847001
##$DBL= (0..7)
120 120 120 120 120 120 120 120 
##$DBP= (0..7)
150 150 150 150 150 150 150 150 
##$DBP07= 0
##$DBPNAM0= <>
##$DBPNAM1= <>
##$DBPNAM2= <>
##$DBPNAM3= <>
##$DBPNAM4= <>
##$DBPNAM5= <>
##$DBPNAM6= <>
##$DBPNAM7= <>
##$DBPOAL= (0..7)
0.5 0.5 0.5 0.5 0.5 0.5 0.5 0.5 
##$DBPOFFS= (0..7)
0 0 0 0 0 0 0 0 
##$DE= 6
##$DECBNUC= <off>
##$DECIM= 32
##$DECNUC= <off>
##$DECSTAT= 4
##$DIGMOD= 1
##$DIGTYP= 9
##$DL= (0..7)
0 120 120 120 120 120 120 120 
##$DP= (0..7)
150 150 150 150 150 150 150 150 
##$DP07= 0
##$DPNAME0= <>
##$DPNAME1= <>
##$DPNAME2= <>
##$DPNAME3= <>
##$DPNAME4= <>
##$DPNAME5= <>
##$DPNAME6= <>
##$DPNAME7= <>
##$DPOAL= (0..7)
0.5 0.5 0.5 0.5 0.5 0.5 0.5 0.5 
##$DPOFFS= (0..7)
0 0 0 0 0 0 0 0 
##$DQDMODE= 0
##$DR= 18
##$DS= 0
##$DSLIST= <SSSSSSSSSSSSSSS>
$$ [...]
##$SUBNAM2= <"">
##$SUBNAM3= <"">
##$SUBNAM4= <"">
##$SUBNAM5= <"">
##$SUBNAM6= <"">
##$SUBNAM7= <"">
##$SUBNAM8= <"">
##$SUBNAM9= <"">
##$SW= 18.05172834244
##$SWIBOX= (0..15)
0 0 2 0 0 0 0 0 0 0 0 0 0 0 0 0 
##$SW_h= 3612.71676300578
##$TD= 16384
##$TD0= 1
##$TE= 0
##$TE2= 300
##$TE3= 300
##$TEG= 300
##$TL= (0..7)
0 120 120 120 120 120 120 120 
##$TP= (0..7)
150 150 150 150 150 150 150 150 
##$TP07= 0
##$TPNAME0= <>
##$TPNAME1= <>
##$TPNAME2= <>
##$TPNAME3= <>
##$TPNAME4= <>
##$TPNAME5= <>
##$TPNAME6= <>
##$TPNAME7= <>
##$TPOAL= (0..7)
0.5 0.5 0.5 0.5 0.5 0.5 0.5 0.5 
##$TPOFFS= (0..7)
0 0 0 0 0 0 0 0 
##$TUNHIN= 0
##$TUNHOUT= 0
##$TUNXOUT= 0
##$USERA1= <user>
##$USERA2= <user>
##$USERA3= <user>
##$USERA4= <user>
##$USERA5= <user>
##$V9= 5
##$VALIST= <valist>
##$VCLIST= <CCCCCCCCCCCCCCC>
##$VD= 0
##$VDLIST= <DDDDDDDDDDDDDDD>
##$VPLIST= <PPPPPPPPPPPPPPP>
##$VTLIST= <TTTTTTTTTTTTTTT>
##$WBST= 1024
##$WBSW= 4
##$XGAIN= (0..3)
0 0 0 0 
##$XL= 0
##$YL= 0
##$YMAX_a= 559510
##$YMIN_a= -522362
##$ZGOPTNS= <>
##$ZL1= 120
##$ZL2= 120
##$ZL3= 120
##$ZL4= 120
##$ABSF1= 10
##$ABSF2= 0
##$ABSG= 5
##$ABSL= 3
##$ALPHA= 0
##$AQORDER= 0
##$ASSFAC= 0
##$ASSFACI= 0
##$ASSFACX= 0
##$ASSWID= 0
##$AUNMP= <proc_1d>
##$AZFE= 0.1
##$AZFW= 0.1
##$BCFW= 1
##$BC_mod= 2
##$BYTORDP= 1
##$COROFFS= 0
##$CY= 11.3945322036743
##$DATMOD= 1
##$DC= 2
##$DFILT= <>
##$DTYPP= 0
##$F1P= 2.36226072786647
##$F2P= -0.459571619588291
##$FCOR= 0.5
##$FTSIZE= 0
##$FT_mod= 4
##$GAMMA= 1
##$GB= 0.15
##$INTBC= 1
##$INTSCL= 1
##$ISEN= 128
##$LB= 0.24
##$LEV0= 0
##$LPBIN= 0
##$MAXI= 10000
##$MC2= 0
##$MEAN= 0
##$ME_mod= 0
##$MI= 1.114404
##$NCOEF= 0
##$NC_proc= 0
##$NLEV= 6
##$NOISF1= 3.799351
##$NOISF2= 2.8
##$NSP= 1
##$NTH_PI= 0
##$NZP= 0
##$OFFSET= 15.70392
##$PC= 1
##$PHC0= -18658.96
##$PHC1= 5.200779
##$PH_mod= 1
##$PKNL= yes
##$PPARMOD= 0
##$PSCAL= 0
##$PSIGN= 0
##$REVERSE= no
##$SF= 200.130013532006
##$SI= 16384
##$SIGF1= 3
##$SIGF2= 2
##$SINO= 400
##$SIOLD= 16384
##$SREGLST= <1H.CDCl3>
##$SSB= 0
##$STSI= 0
##$STSR= 0
##$SW_p= 3612.71676300578
##$SYMM= 0
##$S_DEV= 0
##$TDeff= 0
##$TDoff= 0
##$TI= <>
##$TILT= no
##$TM1= 0
##$TM2= 0
##$TOPLEV= 0
##$USERP1= <user>
##$USERP2= <user>
##$USERP3= <user>
##$USERP4= <user>
##$USERP5= <user>
##$WDW= 1
##$XDIM= 8192
##$YMAX_p= 0
##$YMIN_p= 0
$$ End of Bruker specific parameters
$$ ---------------------------------
##NTUPLES= NMR FID
##VAR_NAME=  TIME,          FID/REAL,        FID/IMAG
##SYMBOL=    X,             R,               I
##VAR_TYPE=  INDEPENDENT,   DEPENDENT,       DEPENDENT
##VAR_FORM=  AFFN,          ASDF,            ASDF
##VAR_DIM=   8192,          8192,            8192
##UNITS=     SECONDS,       ARBITRARY UNITS, ARBITRARY UNITS
##FACTOR=    0.0002768,     1,               1
##FIRST=     0,             0,               0
##LAST=      2.2672688,     0,               0
##MIN=       0,             -522362,         0
##MAX=       2.2672688,     559510,          0
$$ Real data points
##PAGE= N=1
##DATA TABLE= (X++(R..R)), XYDATA
0@%%%%%%%%%%qJ6j2J2j6J6k4L2m0M8m9N7p2Q8j04J20j40J64j85K10k43K76l10
33a64L51l99M48n01N62o30P01p77Q64r60J062j172J294j428J574j734J911k108
51a106K323k557K821l124L461l841M285m805N421o162P078q247R784j1911J5057
66H477k0165K9804n3994K21239L74149o60914l10822N69625K60492o51998k83477
77e17584O40825L58316n66631k99998N52266K75340o03291l26038N54496L43728
87D11429n01417k88873N19868L01571n31438l42107M72991L23986m53759k92574
97c80323M75669L22281m57060l37208M12558L07991m16833l02140M25185L29345
107C79465l93074l22568L69505K99700l80348l09972L71380L23551l40152l05935
$$ y = [0, 0, 0, 0, 0, 0, 0, 0, 0, 0, 0, -8, 8, -4, 8, -8, 8, -16, 16, -24, 24, -25, 32, -40, 48, -56, 64, -76, 88, -97, 113, -130, 146, -164, 187, -212, 236, -265, 297, -333, 368, -409, 455, -505, 557, -615, 679, -749, 825, -909, 1002, -1106, 1217, -1340, 1481, -1643, 1818, -2023, 2262, -2543, 2878, -3284, 3794, -4453, 5331, -6580, 8477, -11688, 18116, -35878, 185361, 559510, -101404, -412226, 157399, 417891, -234107, -517584, 123241, 481557, -85074, -385072, 167194, 442534, -160757, -486795, 67701, 411429, -89988, -378861, 141007, 442578, -88860, -430967, 42024, 366010, -87749, -380323, 95346, 417627, -39433, -376641, 35917, 343908, -72925, -375065, 50120, 379465, -13609, -336177, 33328, 333028, -47320, -357292, 14088, 337639, -2513, -308448]
117c08448L33154K95750l37663l09098L17027L07598k94852k89902K94628K89997
127B98191k88541k97402K65461K86366k53492k74329K52723K78183k38982k77230
137b49052K20026K63882k14723k58690K10083K61514j94188k54329J82570K43461
147B10554j80456k42463J72500K41298j59307k31761J53848K25375j50946k25380
157a86738J41208K20599j31959k12098J29064K08895j24059k07280J14735K00460
167A52827j09010j93808J06250J91424r9745j87166R2261J79389q8958j74115
177a30651Q5506J70772p8769j64315P3527J57157p0763j52952O6159J48330o0481
188D3520j41300N7183J35455n4540j31359N0095J25831m5982j19488M3753J14880
$$ y = [-308448, 24706, 320456, -17207, -326305, -9278, 298320, 3468, -286434, 8194, 298191, 9650, -287752, -22291, 264075, 10583, -263746, -11023, 267160, 28178, -249052, -29026, 234856, 20133, -238557, -28474, 233040, 38852, -215477, -32907, 210554, 30098, -212365, -39865, 201433, 42126, -189635, -35787, 189588, 38642, -186738, -45530, 175069, 43110, -168988, -39924, 168971, 44912, -162368, -47633, 152827, 43817, -149991, -43741, 147683, 47938, -139228, -46967, 132422, 43464, -130651, -45145, 125627, 46858, -117457, -43930, 113227, 42464, -110488, -44329, 104001, 43520, -97780, -40597, 94858, 40318, -91041, -40946, 84885, 38903, -80585, -36832, 78048]
199G8048m0967j10777L7129J05248l4517r9944L2810R6110k9999r1797K6949Q6570
211E4863k5177q2348K3389P8661k0793p3985J8840O9246j7653o5328J5925O1192
223C6832j3998n6404J2660N2023j1475m8131R961M3740q503l9173P692L5081o808
236A3497l1142N630K6806m904k2572M490J8869l736j4972L002J0924k775p307
249d190K453L900k024j87J844l421j823O651J773r953j709J3370J909j6663k226
264a0296J9722K457k2957k730K6280L176k9294l621L2264M012l5407m616L8469
277A7459N242m1217n789M4029O453m6809p270M9420Q053n1945q838N4421R703
290C2912n6826j0599N9067J1530o1240j2462O3388J3442o5411j4570O7348J5650
$$ y = [78048, 37081, -73696, -36567, 68681, 34164, -65780, -32970, 63140, 33141, -58656, -31707, 54863, 29686, -52662, -29273, 49388, 28595, -45390, -26550, 42696, 25043, -40285, -24360, 36832, 22834, -33570, -20910, 31113, 19638, -28493, -18532, 25208, 16705, -22468, -14776, 20305, 13497, -17645, -12015, 14791, 9887, -12685, -8195, 10674, 6938, -8034, -5032, 5892, 3117, -4190, -1737, 2163, 139, -48, 1796, -1625, -3448, 3203, 4976, -4977, -6686, 6684, 8593, -8070, -10296, 9426, 11883, -11074, -13804, 12476, 15652, -13642, -17263, 15001, 19013, -16394, -21010, 17459, 22701, -18516, -24305, 19724, 26177, -20632, -27902, 21518, 29571, -22374, -31212, 23209, 32912, -23914, -34513, 24554, 36084, -25156, -37618, 25770, 39212, -26199, -40769, 26579, 42229]
302D2229o9306j6753P1263J7978p3102j9164P4878K0442p6791k1789P8532K3235
314E1652q0282k4625Q2085K6022q3729k7590Q5477K9049q7095l0503Q8596L2022
326F1079r0124l3537R1425L5165r2575l6725R3619L8377r4514m0108R5292M1677
338F9051r5998m3216R6507M4777r6896m6222R7222M7669r7357m9261R7404N0823
350G4503r7382n2472R7250N4189r7089n5835R6995N7499r6888n9130R6785O0680
362G9105r6821o2192R6863O3651r7011o4897R7183O6170r7304o7431R7314O8789
374H3419r7305p0187R7157P1567r6896p2902R6472P4328r5977p5653R5402P6816
386H6241r4680p8025R3793P9147r2722q0273R1526Q1444r0190q2477Q8755Q3465
$$ y = [42229, -27077, -43830, 27433, 45411, -27691, -46855, 28023, 48465, -28326, -50115, 28417, 51652, -28630, -53255, 28830, 54852, -28877, -56467, 29010, 58059, -29036, -59539, 29057, 61079, -29045, -62582, 28843, 64008, -28567, -65292, 28327, 66704, -27810, -67918, 27374, 69051, -26947, -70163, 26344, 71121, -25775, -71997, 25225, 72894, -24463, -73724, 23680, 74503, -22879, -75351, 21899, 76088, -21001, -76836, 20159, 77658, -19230, -78360, 18425, 79105, -17716, -79908, 16955, 80606, -16405, -81302, 15881, 82051, -15253, -82684, 14630, 83419, -13886, -84073, 13084, 84651, -12245, -85147, 11325, 85653, -10324, -85977, 9425, 86241, -8439, -86464, 7329, 86476, -6246, -86519, 5007, 86451, -3739, -86216, 2539, 86004]
398H6004q7352q4354Q5836Q5190q4433q5857Q3073Q6511q1752q7059Q0448Q7678
410H3933p9236q8313P8038Q8883p6795q9488P5530R0188p4248r0925P2956R1641
422H2164p1607r2438P0262R3152o8947r3780O7563R4406o6128r4895O4659R5318
434G9729o3153r5677O1600R5829o0034r5918N8476R5852n6789r5714N5234R5401
446G4836n3580r5015N1889R4537n0187r4045M8394R3533m6568r2961M4772R2433
458F8038m2963r1936M1254R1369l9613r0830L8002R0311l6466q9764L4969Q9308
470F1679l3572q8788L2143Q8309l0847q7808K9545Q7250k8285q6646K7134Q5982
482E6096k5941q5270K4791Q4474k3636q3586K2348Q2656k1071q1614J9766Q0557
$$ y = [86004, -1348, -85702, 134, 85324, 891, -84966, -1893, 84618, 2866, -84193, -3745, 83933, 4697, -83616, -5578, 83305, 6510, -82978, -7448, 82740, 8492, -82433, -9477, 82164, 10557, -81881, -11619, 81533, 12586, -81194, -13631, 80775, 14647, -80248, -15589, 79729, 16576, -79101, -17501, 78328, 18294, -77624, -19148, 76704, 19915, -75799, -20565, 74836, 21256, -73759, -21870, 72667, 22480, -71565, -23171, 70362, 23794, -69167, -24395, 68038, 25075, -66861, -25607, 65762, 26149, -64681, -26679, 63632, 27166, -62598, -27629, 61679, 28107, -60681, -28538, 59771, 28924, -58884, -29339, 57911, 29626, -57020, -29886, 56096, 30155, -55115, -30324, 54150, 30514, -53072, -30724, 51932, 30861, -50753, -30987, 49570]
494D9570j8521p9346J7276P8089j5991p6836J4726P5524j3531p4141J2346P2800
506D1965j1256p1417J0180P0042r180o8720Q287O7333p405o6026O537O4757n625
519B9472o3538M786O2356l978o1221L210O0052k495n8941J845N7858j267n6722
532b8583P87N5575k59n4438k71N3301P25n2100j191N0827J748m9578k167M8245
546B2621K601m6943k949M5525L297m4129l659M2759L943m1330m213L9927M458
559B1908l8539m735L7201M955l5872n168L4560N365l3330n462L2116N570l0926
572a2357n624K9737N696k8648n787K7636N758k6515n751K5482N750k4495n657
585a4775K3432N609k2409n512K1373N388k0353n278J9324N165j8297n017J7247
$$ y = [49570, 31049, -48297, -31021, 47068, 31077, -45759, -31033, 44491, 30960, -43181, -30835, 41965, 30709, -40708, -30528, 39514, 30334, -38386, -30099, 37234, 29829, -36197, -29660, 35097, 29472, -34066, -29280, 33076, 29098, -32123, -28913, 31139, 28644, -30297, -28452, 29406, 28139, -28583, -27796, 27779, 27520, -26918, -27189, 26112, 26837, -25263, -26454, 24373, 26121, -23457, -25624, 22621, 25222, -21721, -24670, 20855, 24152, -19977, -23636, 19123, 23066, -18264, -22477, 17450, 21908, -16631, -21366, 15835, 20790, -15082, -20250, 14310, 19675, -13655, -19117, 12999, 18569, -12357, -17981, 11756, 17452, -11196, -16983, 10653, 16411, -10104, -15855, 9627, 15377, -9118, -14775, 8657, 14266, -8143, -13655, 7718, 13106, -7247, -12525, 6799, 11964, -6333, -11350, 5897]
598E897M860j6198m676J5121M459j4075m276J3043M073j1996l842J0982L581r963
612c010l349Q985L075p995k833P127K520o217k182N343J856m480j550L644J183
627B117k824q49K086M19j305K9N31m33K12Q55r46j329J675J757k394k167L070
644E04K656l778l086M393L602n066m050N641M524o259m995O805N539p363o021
659f954P882O538q373p048Q837P556r313q070R736Q598j0109r122J0526R652j0899
674e63j0212J1240J0771j1566j1366J1891J1938j2260j2432J2598J2993j2983
686D9j3499J3286J4039j3592j4590J3873J5145j4158j5685J4402J6237j4571j6813
699a5877J4731J7357j4824j7929J4901J8465j4951j8964J4972J9484j4975j9958
$$ y = [5897, 10757, -5441, -10117, 5004, 9463, -4612, -8888, 4155, 8228, -3768, -7610, 3372, 6953, -3010, -6359, 2626, 5701, -2294, -5127, 2000, 4520, -1697, -3879, 1464, 3320, -1160, -2710, 934, 2117, -707, -1556, 530, 949, -356, -327, 204, -229, -17, 838, -108, -1437, 238, 1995, -399, -2566, 504, 3160, -618, -3704, 689, 4291, -775, -4825, 816, 5340, -919, -5914, 891, 6430, -933, -6954, 928, 7466, -907, -7955, 882, 8438, -875, -8945, 791, 9389, -720, -9842, 684, 10336, -563, -10775, 465, 11236, -330, -11696, 195, 12133, -127, -12559, 39, 13032, 49, -13450, -164, 13875, 283, -14307, -434, 14711, 553, -15132, -730, 15507, 936, -15877, -1146, 16211, 1387, -16542, -1641, 16824, 1873, -17091, -2119, 17365, 2390, -17568]
711a7568J4912K0454j4862k0901J4765K1336j4655k1757J4546K2167j4415k2614
723a8592J4338K2978j4178k3429J4024K3844j3890k4256J3783K4642j3588k5055
735a9379J3435K5461j3305k5886J3151K6276j2995k6639J2839K7002j2617k7384
747b0041J2407K7724j2174k8054J1961K8368j1755k8620J1518K8826j1261k8941
759b0042J0937K9106j0605k9266J0216K9393r815k9503R398K9589r006k9607Q559
772a0646K9658q087k9742P660K9783p244k9837O830K9852o414k9923O083K9933
785A7906n708k9979N419L0023n155l0046M873L0095m630l0098M406L0098m165
798A3039l0051L889L0037l664k9999L411K9877l116k9768K853K9604k526k9429
$$ y = [-17568, -2656, 17798, 2936, -17965, -3200, 18136, 3481, -18276, -3730, 18437, 4022, -18592, -4254, 18724, 4546, -18883, -4859, 18985, 5095, -19161, -5378, 19264, 5676, -19379, -5944, 19517, 6212, -19674, -6523, 19753, 6758, -19881, -7042, 19960, 7343, -20041, -7634, 20090, 7916, -20138, -8177, 20191, 8436, -20184, -8666, 20160, 8899, -20042, -9105, 20001, 9396, -19870, -9654, 19739, 9924, -19579, -10181, 19408, 10402, -19205, -10646, 19012, 10925, -18817, -11157, 18626, 11382, -18455, -11625, 18227, 11813, -18110, -12027, 17906, 12198, -17781, -12362, 17661, 12506, -17540, -12667, 17428, 12798, -17300, -12894, 17204, 13039, -17012, -13123, 16914, 13250, -16749, -13338, 16539, 13423, -16345, -13492, 16112, 13586, -15843]
811a5843K205K9240j904k9026J543K8766j203k8466Q52K8226n56k7900J85K7611
825A3730J43k7293n02K7035P68k6693j087K6426J371k6173j624K5866J941k5604
839a1696k193K5349K471k5172k654K4870K933k4672l077K4369L308k4141l468
852a3773K3845L663k3556l901K3316M022k2944m200K2599M375k2283m521K1923
865H565M650k1532m763K1100M927k0725n011K0281N152j9878n277J9487N389j9053
879f688n565J8710N689j8296n810J7929N861j7560n947J7178O027j6865o047J6525
893E141O094j6193o140J5891O151j5584o151J5258O192j4995o182J4699O160j4390
907d049o105J4052O083j3733o035J3369O026j3057o003J2715O000j2357n933J1955
$$ y = [-15843, -13638, 15602, 13698, -15328, -13785, 14981, 13778, -14688, -13836, 14390, 13834, -14066, -13881, 13730, 13873, -13420, -13922, 13113, 13881, -12812, -13899, 12527, 13898, -12275, -13899, 11967, 13908, -11696, -13889, 11460, 13931, -11241, -13895, 10975, 13908, -10764, -13841, 10528, 13836, -10305, -13773, 10072, 13735, -9821, -13722, 9594, 13616, -9328, -13528, 9071, 13446, -8837, -13358, 8565, 13215, -8317, -13080, 8020, 12947, -7778, -12789, 7492, 12644, -7234, -12511, 6976, 12365, -6688, -12253, 6457, 12146, -6150, -11960, 5969, 11830, -5730, -11677, 5501, 11528, -5337, -11384, 5141, 11235, -4958, -11098, 4793, 10944, -4640, -10791, 4467, 10659, -4336, -10518, 4181, 10341, -4049, -10154, 3898, 9981, -3752, -9787, 3582, 9608, -3449, -9452, 3263, 9263, -3094, -9027, 2928]
921B928N922j1624n859J1267N805j0906n770J0561N705j0170n677R843N622r512
935a865n555R164N484q825n427Q493N376q249n270P941N214p678n135P391N060
950F119p145m935O882M836o629m719O398M580o127m460N881M333n641m193N397
965E77M043n125l915M873L804m669l630M392L488m069l417L868L226l583l141
980c278L344K999l156k796K901K630k653k487K438K328k239k156K044J993j850
995F2j830J679J672j489j501J317J298j116j130R53R42p51p71N93O07m55m23L05
1013c8J93j06l4j1j78J63L45k73o24M88P59n72r72P09J183q19j411R52J573j068
1033B59j752J189J926j209k180J327K360j442k524J455K760j532k939J600L138
$$ y = [2928, 8850, -2774, -8633, 2634, 8439, -2467, -8237, 2324, 8029, -2141, -7818, 2025, 7647, -1865, -7420, 1744, 7228, -1597, -7024, 1469, 6845, -1404, -6674, 1267, 6481, -1197, -6332, 1059, 6119, -1026, -5961, 921, 5757, -872, -5591, 807, 5387, -740, -5200, 681, 5014, -627, -4820, 577, 4620, -505, -4420, 453, 4257, -412, -4042, 350, 3838, -231, -3648, 220, 3446, -137, -3278, 66, 3065, -91, -2887, 14, 2644, -9, -2496, -58, 2270, 31, -2125, -81, 1912, 62, -1768, -89, 1583, 94, -1407, -90, 1208, 92, -1038, -85, 857, 106, -665, -72, 535, 80, -343, -38, 155, 49, 15, 4, -174, -11, 334, 61, -563, -75, 684, 112, -860, -151, 1032, 213, -1198, -246, 1327, 259, -1493, -304, 1622, 413, -1767, -440, 1920, 478, -2046, -591, 2169, 637, -2302, -702, 2436]
1048B436j663l320J729L523j791l734J837L916j888m083J889M308j926m498J987
1063a278M636j996m810K003M982k025n123J977N346k036n488K026N611j960n817
1078c952J991N932j923o116J893O249j843o359J744O560j709o673J646O813j566
1093B687o939J509P069j451p183J341P329j262p468J195P597j119p700J012P813
1108D430r71p943R39Q040q69q131P66Q218o38q353N91Q399m91q462L80Q562l08
1125D159q620J97Q660m4q745m2Q761J65q791k58Q810L97q815n21Q818O61q836
1142d044p92Q816R21q824j014Q826J146q852j273Q850J352q848j400Q785J536
1157E185q832j614Q813J748q829j817Q822J904q809k004Q802K091q784k184Q757
$$ y = [2436, 773, -2547, -818, 2705, 914, -2820, -983, 2933, 1045, -3038, -1149, 3159, 1233, -3265, -1278, 3358, 1362, -3448, -1445, 3537, 1512, -3611, -1634, 3712, 1676, -3812, -1786, 3825, 1865, -3952, -1961, 3971, 2048, -4068, -2175, 4074, 2231, -4128, -2384, 4176, 2467, -4206, -2560, 4253, 2687, -4252, -2743, 4326, 2875, -4308, -2967, 4362, 3100, -4368, -3173, 4424, 3305, -4395, -3383, 4430, 3459, -4484, -3545, 4495, 3626, -4505, -3739, 4479, 3841, -4512, -3921, 4478, 3987, -4475, -4095, 4467, 4159, -4461, -4264, 4396, 4352, -4393, -4435, 4326, 4491, -4300, -4558, 4252, 4649, -4166, -4687, 4131, 4792, -4044, -4836, 3980, 4901, -3923, -4937, 3889, 5035, -3817, -5090, 3760, 5112, -3736, -5136, 3649, 5185, -3647, -5261, 3552, 5300, -3529, -5346, 3476, 5380, -3429, -5433, 3369, 5460, -3324, -5508, 3249]
1172C249K262q685k382Q660K456q595k550Q560K671q488k759Q392K836q327k928
1187e628Q228L016q149l125Q084L205p983l247P846L346p772l454P701L515p611
1202b028l556P489L646p428l698P342L763p246l841P191L888p112l904O980M010
1217E496o934m024O822M073o699m140O655M149o523m218O426M235o328m289O246
1232I47M279o094m318O007M335n879m380N744M376n602m431N492M458n384m429
1247d879N226M461n117m436M975M449m887m439M742M502m629m480M504M469m413
1262D8m444M327M454m233m427M125M383m012m390L916M377l831m344L755M271
1277C975l618m258L499M240l435m203L342M144l209m099L080M084k988m036K905
$$ y = [3249, 5511, -3174, -5556, 3104, 5560, -3035, -5585, 2975, 5646, -2842, -5601, 2791, 5627, -2700, -5628, 2600, 5616, -2533, -5658, 2426, 5631, -2352, -5599, 2247, 5593, -2179, -5633, 2068, 5583, -2028, -5584, 1905, 5551, -1877, -5575, 1767, 5530, -1716, -5557, 1634, 5522, -1590, -5494, 1486, 5496, -1438, -5462, 1360, 5433, -1266, -5406, 1249, 5398, -1125, -5343, 1083, 5318, -1010, -5299, 947, 5226, -868, -5186, 821, 5156, -723, -5103, 641, 5017, -585, -5016, 476, 4934, -450, -4879, 347, 4808, -309, -4745, 230, 4679, -208, -4647, 95, 4597, -32, -4512, -8, 4461, 48, -4396, -69, 4385, 152, -4275, -150, 4233, 221, -4169, -253, 4124, 293, -4051, -296, 3975, 357, -3901, -402, 3838, 403, -3800, -458, 3686, 477, -3622, -542, 3542, 554, -3482, -577]
1292e77L961k761l940K678L863k564l799K454L759k372l689K234L652k142l583
1307b826K075L506j977l433J888L370j788l316J731L195j596l181J523L112j485
1322G98l035J415K953j324k904J277K824j217k694J095K656j072k584J011K489
1337A688r23k420Q89K338p99k249P21K143o45k049N82J987n28j902M82J766l92
1354F89j715L54J649l40j555K88J458k31j379K20J275j84j171J74J081j39j022
1371e48P5R58r6q51O4P83n4p01N6O17k9n06pM27Ql73OK81J3j88lJ06J0m7L8p1
1397c2K1J03Qj78o1L03ll15r0M43P0n02q0N84P6o36j19O94J23o97k08P95K40q99
1421c60k41R31K69r78l05J084L11j099l45J109M45j208m48J234N01j291n51J351
$$ y = [-577, 3384, 623, -3317, -639, 3224, 660, -3139, -685, 3074, 702, -2987, -753, 2899, 757, -2826, -751, 2755, 778, -2655, -767, 2603, 815, -2501, -770, 2425, 829, -2352, -829, 2283, 798, -2237, -822, 2131, 807, -2097, -820, 2004, 787, -1907, -812, 1844, 772, -1812, -801, 1688, 765, -1655, -766, 1572, 773, -1476, -755, 1388, 743, -1306, -724, 1263, 735, -1167, -685, 1081, 689, -1026, -672, 977, 637, -918, -630, 828, 597, -782, -562, 713, 529, -642, -468, 613, 474, -548, -473, 485, 389, -462, -398, 385, 331, -370, -314, 303, 274, -232, -239, 188, 196, -177, -171, 110, 123, -65, -68, 38, 48, 1, 39, -32, -11, 92, 100, -78, -139, 164, 161, -154, -244, 199, 269, -233, -313, 271, 347, -289, -408, 286, 409, -288, -496, 299, 539, -360, -601, 330, 599, -379, -684, 400, 711, -388, -733, 376, 821, -387, -835, 399, 900, -391, -942, 409]
1439D09N67j330o57J403O65j429p31J466P55j460q33J527Q45j523r06J534R78
1456A280j552j047J552J111j596j137J603J191j598j245J600J282j586j357J608
1471A09J437j650j434J604J532j634j544J589J629j611j634J581J681j598j707
1486a650J554J781j559j823J533J866j513j925J508J962j509j984J483J994j435
1501B83k035J385K089j376k119J366K177j336k172J233K267j273k243J209K292
1516A747j164k318J138K331j079k345J041K387j019k421R80K428r50k437Q97K479
1532A695r12k455Q59K489q41k521Q16K538q03k543P80K545p73k514P06K514o35
1549I45k557O12K574n87k536N32K556m70k591M62K557m15k561L81K535k91k538
$$ y = [409, 976, -354, -1011, 392, 1057, -372, -1103, 363, 1118, -342, -1175, 352, 1197, -326, -1232, 302, 1280, -272, -1319, 233, 1344, -252, -1389, 214, 1405, -193, -1438, 162, 1444, -142, -1499, 109, 1546, -104, -1538, 66, 1598, -36, -1580, 9, 1638, 27, -1607, -26, 1655, 57, -1650, -96, 1685, 126, -1697, -164, 1702, 189, -1736, -228, 1734, 225, -1759, -276, 1718, 283, -1752, -367, 1722, 346, -1773, -407, 1770, 434, -1738, -505, 1762, 489, -1754, -545, 1747, 583, -1735, -597, 1734, 655, -1690, -649, 1738, 719, -1702, -722, 1706, 756, -1681, -784, 1695, 783, -1672, -813, 1676, 835, -1686, -870, 1668, 865, -1678, -898, 1647, 874, -1640, -934, 1580, 945, -1612, -1000, 1574, 987, -1549, -1017, 1539, 1069, -1522, -1060, 1497, 1082, -1479, -1098, 1437, 1146, -1392]
1566a392K54K539k40k536J91K501r7k531J12K517j15k488L6K514k5k492RK444
1584A201O1k490j4K433N8k423j07K409J24k367j91K387K06k337k50K366K25k301
1602a010k97K260L62k233m16K259M26k228m51K193M90k144n39K098N67k095n77
1619a335K044O47k041o26J961O50j920p31J947P10j875p56J864P51j834p70J776
1636D62Q20j760q08J704Q40j657q65J635Q72j619q74J589R03j547r09J506R46
1653A238j486r46J460R27j404r54J361R45j298r77J268R47j204r88J162J018j136
1670f7r82J117R54j050j003J037R97j001r67R43R61r15r51Q92R47q38r19P91R29
1689H75p73r43P62Q93o89r25O82R13o68q69O23Q44n91q40N69Q26n44q12M94P99
$$ y = [-1392, -1138, 1401, 1161, -1375, -1184, 1317, 1220, -1311, -1199, 1318, 1203, -1285, -1249, 1265, 1240, -1252, -1243, 1201, 1262, -1228, -1242, 1191, 1249, -1174, -1281, 1128, 1252, -1115, -1306, 1081, 1287, -1050, -1300, 1066, 1291, -1010, -1307, 953, 1315, -918, -1334, 925, 1351, -877, -1328, 865, 1355, -789, -1328, 770, 1337, -758, -1335, 709, 1356, -685, -1311, 650, 1300, -620, -1351, 596, 1306, -569, -1325, 539, 1290, -544, -1314, 462, 1282, -478, -1286, 418, 1258, -399, -1264, 371, 1243, -376, -1250, 339, 1242, -305, -1214, 292, 1238, -248, -1194, 266, 1193, -211, -1165, 196, 1141, -157, -1134, 134, 1081, -123, -1111, 51, 1069, -67, -1049, 68, 1022, -28, -1031, 6, 1003, 2, -965, -22, 939, 24, -927, -35, 912, 74, -845, -54, 875, 102, -841, -79, 814, 125, -800, -118, 795, 127, -742, -119, 725, 134, -706, -137, 689, 145, -667, -173, 626]
1709F26m79p83M55P56l87p52L52P32l36p07L11P03k94o27K25O34k25o26K04O06
1729C88j89n62J64N83j78n45J42N00j41m54J36M23q2m49J24L50n1l86Q8L40q4
1750A17k91M6K74m4k65K4K75l8k23J2J94j7j38j8J29jp5j3J03l5l9K7J0mRNj7
1777Gl6Q2Nr6J8O2K6j26l3J61O3j93q1K06P2k44o2K18J23l07n8K95J31l52j37
1802b56L82J32l80j49L73J70l89j68L85K10m24k34M88K14m46k77M80K85n21k74
1822c99M92L43n35l29N25L61n54l81N76L94o09m06O19M48o13m73O18M64o03n11
1842e73O31N15o17n69O39N83o28o23O55O42o50o65O39O75o42o90O72P12o39p79
1862g12O72P86o85p74O45Q05o36q15O20Q65o57q84O25Q97n87r44O30R26o22r52
$$ y = [626, 147, -636, -181, 575, 188, -564, -212, 520, 184, -523, -212, 491, 197, -430, -205, 429, 204, -422, -218, 388, 199, -363, -199, 384, 206, -339, -197, 303, 162, -292, -156, 267, 185, -264, -140, 210, 159, -227, -139, 201, 117, -174, -128, 146, 102, -163, -139, 136, 98, -125, -113, 81, 64, -74, -92, 37, 36, -39, -52, 51, 16, -23, 4, 14, 10, 19, 24, 7, -29, 53, 58, -38, -20, 42, 68, -58, -91, 70, 133, -60, -141, 65, 137, -107, -169, 49, 172, -135, -193, 102, 233, -119, -256, 126, 258, -122, -271, 102, 272, -117, -285, 100, 310, -114, -348, 140, 354, -92, -369, 111, 396, -125, -399, 93, 436, -99, -428, 97, 458, -96, -477, 99, 493, -116, -522, 97, 545, -68, -541, 77, 541, -62, -573, 58, 573, -44, -613, 26, 609, -19, -642, 13, 655, 5, -660, -21, 654, 12, -678, -6, 706, 67, -712, -40, 746, 61, -713, -68, 737, 101, -714, -94, 771, 114, -770, -145, 752, 165, -779, -149, 777, 155, -797]
1882g97N88J007o05j011N75J053n77j053N80J057n56j079N48J077m89j161N57
1899b86J116n23j125M92J163m77j188M57J173m00j218M20J225m08j240L90J234
1916H05l74j255L87J250l33j309L40J281l01j293K87J289k45j306K18J323k07
1933E57j322K07J324j80j360J75J346j59j307J25J361j30j350Q7J383j07j359
1950g09N3J365l6j380M1J343K3j398L9J340nj304o0J352L9j349p5J353O6j341
1970f43j02J370J00j344j24J332J62j322j76J271K31j288k24J282K29j249k76
1987g71J294K36j238k89J240K94j215l24J211L44j189l52J159L63j154l66J152
2004C95L73j147m01J148L65j072m32J108L85j049m18J048M39j038m18R96M25r68
$$ y = [-797, -209, 798, 193, -818, -243, 810, 233, -820, -240, 817, 261, -818, -270, 807, 318, -843, -286, 830, 307, -818, -326, 837, 360, -828, -371, 802, 402, -816, -396, 829, 421, -819, -429, 805, 431, -824, -437, 813, 480, -829, -489, 792, 491, -802, -515, 774, 529, -777, -559, 764, 557, -765, -558, 766, 586, -774, -599, 747, 588, -719, -594, 767, 637, -713, -626, 757, 650, -709, -656, 709, 673, -707, -666, 677, 700, -698, -659, 681, 676, -628, -688, 664, 703, -646, -721, 632, 698, -643, -745, 625, 725, -619, -743, 589, 751, -571, -747, 524, 755, -533, -757, 525, 754, -495, -771, 523, 759, -479, -768, 472, 766, -449, -773, 438, 782, -407, -759, 400, 763, -391, -757, 395, 768, -379, -780, 368, 733, -339, -771, 337, 722, -327, -745, 303, 742, -296, -714, 282, 707, -261]
2022b61m75J008M50r73m67R38M87r33m67R17M83q98m82Q83M72q39m93Q21N01q20
2042a48m98Q30M72p71n03P27M94o80n42O86N37p09n04O75N15o58m89O19N39o65
2062g3m98O17M97o00m91N82M82n34m81N49M54n11m67M98M84n04m38M42M80m80
2082Hm31M22M23m00m28M03M20l83m40L62M25l58l97L22M00l15l87K79L98k56m17
2103c50K87L89k92l29K37L34k23l25K17L21k12k91J93K71j69k52J68K36j54k49
2123a93J42K40j21k16J28J59j13j60R4J57q7j50N7J44n4j27O5J00o9n9L0M7om2
2147c4L9K2l6l8M2KLPj5kk0N5K2p6j0O5M3j27J1J16l0j00k4J91l1j61KJ94j5k09
2177a14L8K07m7k09QK57l6k75L0K93j5l02j9L59j5l40j8L73kl68QL58M4m11J0
$$ y = [-261, -736, 272, 722, -251, -718, 220, 707, -226, -693, 224, 707, -191, -673, 210, 682, -157, -650, 171, 672, -148, -646, 184, 656, -115, -618, 109, 603, -77, -619, 67, 604, -105, -609, 66, 581, -77, -566, 53, 592, -73, -571, 46, 543, -57, -548, 34, 516, -18, -499, 50, 504, -7, -474, 24, 508, 4, -434, 8, 488, 8, -423, -1, 422, 22, -406, -3, 417, 34, -406, -44, 381, 23, -374, -52, 348, 33, -354, -75, 323, 67, -350, -63, 326, 34, -295, -58, 276, 53, -272, -55, 266, 54, -237, -44, 227, 58, -194, -26, 210, 56, -193, -51, 189, 68, -148, -20, 139, 26, -134, -40, 117, 30, -120, -63, 81, 27, -100, -35, 65, -4, -63, -33, 14, 8, -34, 5, 27, -9, -47, -5, -3, 0, 7, -8, -10, -30, 25, 47, -29, -39, 26, 69, -58, -47, 69, 39, -61, -85, 106, 75, -86, -84, 110, 95, -114, -76, 131, 84, -125, -117, 140, 104, -171, -141, 152, 137, -165, -184, 175, 160, -180, -198, 175, 173, -195, -187, 171, 215, -196, -186]
2202a86L95Ol90n1M24M0m51l1M61O3m98n8N13L6m98m6N07N3n19q4N57O9n41j22
2226c51N64J10n92r7O06R2n89j08N89J70o43j30O11J90o48j85O53J88o67j84O69
2247B48K15p02k04O92K28o82k73P07K91p29k93P13K73o81l29P25L19p15l75P48
2267A76L31p27l61P34M11p66l61P47L71p49m01P62M44p80m21P36M73p73m43P49
2287A52M66p78m37P75M38p34n20P79M93p43n21P47N30p74n52P96N26p57n60P32
2307E8O06p38o05P41O09p26o43P38O21p08o45P24O69p02p05P38O66p14o89P32
2327B7O81p18o73P12O74p13o82O94P18o79p49O70P46o69p37O56P28o47p42O52
2347e1P56o40p89O33Q09o60p70O16P97o20q05O19P81n70p86N81P92o09p98O07
$$ y = [-186, 209, 215, -175, -226, 198, 238, -213, -244, 217, 280, -218, -276, 237, 273, -225, -271, 236, 289, -230, -314, 243, 312, -229, -351, 213, 323, -269, -366, 240, 332, -257, -365, 224, 394, -249, -379, 232, 422, -226, -411, 242, 430, -237, -421, 248, 463, -239, -443, 249, 477, -205, -478, 229, 520, -209, -502, 211, 484, -197, -526, 199, 518, -197, -572, 176, 507, -220, -581, 153, 564, -202, -563, 184, 555, -194, -595, 167, 611, -169, -590, 146, 619, -154, -597, 152, 618, -160, -597, 178, 616, -118, -638, 141, 634, -109, -630, 117, 647, -127, -679, 117, 643, -114, -674, 58, 664, -74, -679, 62, 671, -55, -698, 40, 661, -47, -692, 32, 701, -1, -706, 32, 698, -16, -705, 27, 708, -10, -683, 29, 703, -10, -692, 2, 720, 41, -708, -38, 708, 39, -698, -42, 686, 39, -703, -51, 705, 65, -724, -91, 718, 58, -712, -96, 701, 81, -724, -105, 676, 106, -680, -99, 693, 84, -714, -107]
2367a07P94n77p70N29Q10n46q11N22P98n04p75M78Q39n04q30M94P99m54q28M69
2387a74P98m48q04M25Q04l98q20L86Q17l72q25L89P91l40q06L20Q06k92q00K91
2407b52P64k51p83K60P83k69p41K42P40k51p20K38P28k12p02J56P13j50p11J73
2427b45O73j64o75J23P04j40o63J31O32j06o81J24O34p4o63J15O14q7o08P6N91
2448C11l9n72K3N58pn78O7N33l9n11mN27nn03j2M81K1m78j0M69Om40j3M03O1m67
2474b18mM13K6l98qL83K7l90m7L50M9l41n4L42N3k93n5K73P0k75o1K58O7k33o7
2499a33K46K1k18m3K22N0j94n4J75M2j80m6J72L8j35m4J06O2j29ON9K2r0j9O3
2524aK6n9PJ9K8o3M2j3nK2k7J7j4M5J1l3k3K6M7m8l6N6N3p1o6J02M2q1p7J06R0
$$ y = [-107, 687, 110, -660, -131, 679, 133, -678, -156, 642, 138, -637, -159, 680, 176, -654, -160, 639, 185, -643, -174, 624, 176, -628, -203, 601, 203, -617, -231, 586, 214, -611, -222, 569, 229, -577, -257, 549, 257, -543, -252, 512, 261, -522, -262, 521, 252, -489, -247, 493, 242, -478, -240, 488, 276, -426, -270, 443, 293, -418, -245, 428, 264, -411, -288, 416, 276, -387, -256, 376, 270, -411, -287, 347, 273, -390, -275, 339, 252, -356, -280, 311, 272, -300, -277, 281, 274, -304, -237, 296, 257, -254, -258, 269, 264, -239, -251, 230, 251, -227, -237, 232, 238, -202, -215, 188, 249, -218, -222, 191, 217, -181, -189, 194, 221, -169, -216, 134, 183, -158, -212, 130, 183, -110, -165, 108, 178, -97, -158, 100, 167, -66, -133, 113, 134, -84, -127, 95, 145, -49, -103, 72, 114, -66, -112, 60, 98, -37, -81, 25, 87, -42, -36, 23, 45, -45, -64, -1, 25, -34, -27, -8, 20, -43, -1, -14, -19, 3, -24, -7, -21, 24, 35, 2, -21, 5, 52, 4, -32, 24, 77, 6, -60, 42, 84, 3, -74, 32, 122]
2555A22j17j46J51J06j37j24J51J36j73j20J63J43j70j76J79J97j98j65J84J87
2575A93j94k21J99K68k45k27K15K22k05k58K38K74k47k52K34K76k32k85K53L09
2595C15k81l31K70L42k82l19K34L45k55l40K47L73k73l99L08L78k61m24K82M09
2615C38k81m21K92M48l05m41K80M76k90m78L17M51k76n06K98M74k51n26K79N41
2635D19l15n21K90N50k58n88K73N72k45n72K18O13k60o09K50O06k37o35K62N90
2655D03k17o38K17O56j88o67J98O42j75o48J81O58j57o99J93P14k04p03J86O93
2675D45j46p08J24P43j62o99J22P07r6p77J50P30j23p46J27P10j00p24Q5P37n7
2696C42p32M7P28l3p51L2P36Kp49%P61l2p13k9P74np32m3P76J2p35o5P72L2p44
$$ y = [122, 5, -141, 10, 116, -21, -145, 6, 142, -31, -151, 12, 155, -15, -191, -12, 185, -13, -178, 6, 193, -1, -222, -23, 245, 0, -227, -12, 210, 5, -253, -15, 259, 12, -240, -6, 270, 38, -247, 6, 315, 34, -297, -27, 315, 33, -286, -52, 293, 38, -302, -55, 318, 45, -354, -46, 332, 71, -353, -71, 338, 57, -364, -72, 376, 71, -370, -90, 386, 96, -382, -65, 386, 110, -396, -98, 376, 125, -401, -122, 419, 104, -417, -127, 423, 165, -423, -150, 422, 177, -395, -177, 436, 176, -433, -183, 423, 186, -449, -187, 403, 186, -452, -235, 421, 233, -434, -236, 406, 231, -417, -236, 422, 265, -434, -241, 473, 269, -434, -248, 445, 299, -409, -285, 458, 296, -403, -281, 426, 330, -447, -297, 433, 310, -436, -309, 401, 301, -423, -338, 399, 342, -390, -343, 385, 352, -399, -367, 369, 371, -378, -378, 383, 351, -362, -391, 383, 378, -354, -397, 379, 391, -344, -409, 363, 395, -349]
2721c49n7P49N5p28p2P22R3p29j03P32J07p30j18O84J51p21j23P21J44p24j23
2742d19O70J53o87j71O83J89o70k05O78K22o70k14O88J94o55k03O43K05o48k25
2762d42O30K46o02k60O03K75o17k60O05K47o04k50N69K97n88k74N34L02n59k87
2782d35N43L02n22l03N26K71m78l13M93L47n32k89M97K71m43l52N06K90m40l22
2802c83M78K92m19l29M19L24m49l01M06L33m31k82L76L22m00l05L56L16l45l57
2822c79L77L14l47k77L03L13l07l12L10K93k92k92K93K83k65l00K86K94k82k76
2842b63K50L02k67k52K36K74k49k51J85K74j89k59J95J97j56k24J48K43j76k02
2862a84J46K43j84k11J49J91j45j50Q1K13j05k04J19J71r6j67J06J39j05j16R1
$$ y = [-349, -406, 343, 398, -330, -402, 320, 413, -316, -419, 313, 420, -310, -428, 256, 407, -314, -437, 284, 428, -296, -419, 251, 404, -283, -454, 229, 418, -252, -457, 221, 443, -227, -441, 247, 441, -214, -417, 226, 431, -217, -442, 188, 434, -168, -428, 175, 450, -167, -427, 178, 425, -179, -429, 140, 437, -151, -425, 109, 411, -148, -435, 108, 410, -112, -415, 111, 382, -96, -409, 84, 431, -101, -390, 107, 378, -65, -417, 89, 379, -61, -383, 95, 387, -32, -361, 58, 382, -67, -368, 38, 371, -60, -342, 34, 356, -44, -349, 7, 323, -22, -379, -2, 312, -35, -312, -9, 304, -3, -315, -5, 288, -4, -296, -3, 280, 15, -285, 1, 295, 13, -263, -13, 289, 22, -230, 6, 280, 31, -220, -35, 239, 50, -209, -14, 183, 27, -197, -49, 194, 18, -184, -38, 205, 21, -190, -41, 150, 5, -145, -64, 149, 44, -160, -41, 130, 34, -133, -27, 112, 7, -109, -18]
2883a8J27p5j02O8R1m8j28O5R6m3j06J9J34n4q2M5O1j7r1M1N1j1l4PJQl7J5M5
2912B8k5k5M7m8J5RL7o6J4L2J2n0ON1Kp0PP2J5r3j8J24j4j17MJ29pj33LJ25K1
2943H7j72LJ75k4j63j7J99mj99J7J93jk03j9K41mk10l8K33N1k66kK63J3k74k3
2969a44K59M5k48o9L06L8l05n1K84N2k77o6L04O5l30p0L20P9l07j04L23J28l98
2992a66o6L52R1l33r7L34J12l65j01L70J18l76j09L46J54l66j57L62J75l95j55
3013b72M16J45l87j59L85J84m18j81M12K02m44j67M04J80m25k13M33J90m01j83
3033b99M08K01m16k05M03K28m52k01M42K09m11k54M25K74m38k64M33K65m26k81
3053c59M66K65m57k72M34K89m46k77M41K53l94l23M25L16m32l06M29L29m41k91
$$ y = [-18, 109, 34, -68, 0, 91, 43, -85, -20, 76, 33, -73, -54, 80, 26, -56, -11, 50, 33, -58, -17, 34, 23, -11, -4, -3, 5, -32, -17, 28, 3, -22, 25, -23, -8, 1, 38, -28, -14, 18, 30, -20, -14, 37, 39, -31, -24, 48, 63, -30, -48, 76, 62, -55, -51, 78, 71, -62, -59, 66, 87, -85, -82, 93, 69, -94, -111, 88, 84, -115, -98, 95, 94, -109, -128, 113, 109, -101, -139, 94, 145, -121, -123, 140, 153, -121, -144, 115, 160, -88, -157, 149, 187, -118, -169, 115, 167, -110, -176, 128, 193, -137, -207, 113, 192, -115, -219, 104, 232, -166, -232, 120, 211, -122, -219, 115, 227, -138, -239, 131, 249, -127, -236, 110, 264, -102, -259, 103, 278, -117, -272, 144, 289, -98, -257, 128, 312, -106, -287, 125, 327, -117, -284, 120, 300, -125, -338, 95, 285, -116, -299, 109, 310, -106, -311, 92, 320, -132, -333, 109, 318, -93, -347, 78, 352, -86, -350, 83, 348, -78, -359, 107, 372, -85, -357, 77, 366, -80, -357, 84, 337, -57, -380, 45, 361, -71, -377, 52, 381, -60, -351]
3073c51L85L29m32k76L66L34l89l67M17L55l95l69M07L69l90l63L75L77l94l48
3093c60L45L94l88l75L83L72l43l90L44L89l53l66L30L98l34m34L49M11l38m14
3113c80L19M38l21m41L18M12k86m03K78M24k97m04K59M43k92m11K55M41k59m16
3133c23K55M00k52m19K82L91k45m30K46M36k38l99J87M20k04l88J66M30j94m30
3153c09J92M00j45m51J69M08j34m16J81L81j57l97J42M13j50m01J54L79j48l93
3173b82J42M27j27m13Q6L99o3l96Q2M17j16l68P4L49n3l59Q5L39q9l10N5L25n1
3196A53l49N3L31m4l22K3L13l6l10L8L13m7l08M7L07ml06KK86jk65RK52Ok77J7
3222a19K55lk37qK59k5k15k4K18J5k19j8K37lj79o1K10K3j95j9J94J5j87n0J96
$$ y = [-351, 34, 363, -69, -345, 21, 355, -34, -401, 16, 371, -24, -393, 14, 383, -7, -370, 5, 382, -12, -360, -15, 379, -9, -384, -1, 371, 28, -362, -18, 371, 18, -348, -18, 380, 46, -388, -39, 372, 34, -380, -61, 377, 56, -385, -67, 345, 59, -344, -66, 358, 61, -343, -84, 359, 67, -344, -89, 352, 93, -323, -68, 332, 80, -339, -57, 334, 89, -341, -95, 341, 103, -296, -109, 311, 107, -281, -115, 315, 121, -309, -117, 283, 138, -313, -144, 264, 130, -286, -105, 276, 119, -278, -136, 277, 127, -274, -120, 259, 111, -282, -140, 287, 160, -253, -167, 232, 169, -227, -145, 272, 156, -212, -138, 211, 158, -201, -116, 223, 134, -176, -121, 204, 153, -196, -143, 188, 144, -178, -155, 158, 122, -188, -150, 163, 116, -192, -145, 162, 158, -148, -146, 140, 139, -126, -117, 135, 141, -136, -119, 136, 133, -104, -112, 147, 122, -93, -117, 101, 116, -103, -121, 116, 113, -66, -127, 83, 106, -89, -108, 86, 101, -86, -136, 60]
3247F0L1j49n0J51M9j77jJ33K7j34lQ2M7j02j6R2J5q9k7J17K0q8j6N7Ql7j8N5
3275C7lm2%J5J4l6QrK8n0K4K9j3qnJ3j4j3L0mk3OJ7k3nL1K1k4k6L7%k8J4K6J0
3310C4m0j1L3M7n2m0O3J5l5m0K8P9p3n9O2P4q1n3O2M6q4n4J08L4p8q3J07O6q3
3339hr9J18P4j01p8J25P9r4r6Q6J19j34q8J05Q8r5j11J12J33j41r4J33J05j39
3363aj18J34J26j51j29J65J23j56j19R9J65j41j32J47J35j62j42J62J55j61j66
3384a67J78J46j68j57J64J84j63j61J48J89j66j74J43J81j63j74J66J85j67j87
3404a63J58J96j65k43J97K18j86k13J82K20j85k14J75K13j49k51K07K07j95k10
3424b01J65K23j62k25J66K45j70k30J63K57j60k79J75K25j09k72J48K70j74k40
$$ y = [60, 91, -58, -108, 43, 92, -85, -86, 47, 74, -60, -63, 19, 66, -36, -52, 40, 55, -34, -61, 56, 76, -12, -28, 29, 37, 0, -18, 37, 34, -8, -8, 7, 21, -15, -7, -16, 12, -38, -14, 15, 2, -6, -11, 2, -12, -25, 5, 1, -22, -16, 1, -22, -27, 4, 25, 1, -25, 12, 12, -16, -2, 24, 34, -6, -17, 16, 63, 11, -29, 34, 49, 14, -26, 2, 81, 8, -51, 11, 85, 4, -49, 13, 59, -25, -79, 29, 63, -15, -98, 9, 75, -8, -107, 11, 85, -16, -94, 31, 110, 16, -80, 6, 125, -9, -97, 8, 96, 1, -110, 2, 135, -6, -100, 33, 138, -1, -119, 15, 141, -10, -139, 26, 149, -7, -126, -27, 138, -3, -135, 12, 147, -15, -157, 5, 160, -1, -167, 11, 157, -11, -168, -4, 180, 17, -144, 4, 193, 27, -147, -4, 177, 14, -160, 6, 191, 24, -163, -5, 191, 26, -217, -20, 198, 12, -201, -19, 201, 16, -198, -23, 190, 41, -210, -3, 204, 9, -201, -36, 187, 25, -200, -34, 211, 41, -189, -26, 231, 71, -208, -33, 192, 83, -189, -41, 229, 55, -185]
3444a85J39K65j63k85J83K63j40k83J41K88j67k86J73K57j24k89J41K91j28l14
3464b23J38L09j49k95J47K92j37k89J12L22j15l50J37L15j08l10J22K84j04k82
3484a84J20K57p3l29R9L23r4k97Q9L08j12k99Q1K98r4k70P1K79r2k76P4K95m5
3507A29l49Q6L19n6l11P7K84n4l18O6L40j20k71J1L53o1k75J8L04nl37N7K83m2
3531A28k77K2K94pl07J7K96l1k70k4K92nk79K5K54j2k67J0K73Pk50l0K67K8k46
3556i2o4K80J5k48k4K65J5k59lK22M1k66m2K79Kk21k0K31J1k11l6K23M9k48j7
3581a18K15K3k17k3K10K9k13j5J91M4k14m1J98M8j61p4J90L5j59o0J65L6j40n4
3605a05J69O4j61p0J49N2j15n3J26P0j32n8J26M9j38n3R5R5j30n2J10L2j15k9
$$ y = [-185, -46, 219, 56, -229, -46, 217, 77, -206, -65, 223, 56, -230, -57, 200, 76, -213, -72, 219, 91, -223, -85, 224, 75, -220, -73, 219, 82, -207, -95, 227, 112, -238, -101, 214, 106, -204, -82, 202, 98, -184, -64, 193, 120, -209, -110, 213, 119, -178, -89, 219, 107, -192, -111, 187, 93, -177, -106, 173, 81, -195, -121, 174, 129, -220, -134, 185, 129, -182, -105, 179, 125, -193, -127, 213, 93, -178, -167, 186, 125, -150, -132, 172, 167, -170, -113, 170, 128, -149, -127, 167, 160, -147, -130, 166, 135, -135, -159, 133, 128, -151, -126, 128, 116, -151, -141, 132, 139, -111, -141, 126, 154, -92, -156, 124, 139, -109, -133, 132, 147, -112, -115, 107, 148, -118, -160, 119, 121, -100, -120, 111, 122, -89, -125, 98, 147, -101, -118, 97, 120, -97, -120, 90, 119, -94, -109, 82, 126, -88, -129, 69, 117, -44, -118, 72, 107, -52, -112, 53, 89, -51, -105, 64, 128, -33, -103, 46, 98, -17, -70, 56, 126, -6, -64, 62, 111, -27, -80, 15, 110, -20, -72, 38, 70, -45, -74]
3629g4J02J2o8j5O6K8q5m7J10M0r6m5P5M7o6j8L7K5l7j2K3N7p1k1M3L8m8k2P4
3658E2m5l1nL8Lmk1K9mljQk0Rm2L1%J3Oj8J4j8Rmj2kM8m7NK8mK9o1M6Mj9j9ON9
3697E7m7l7K1P3l7n8L0J9k0l1K5N1m3k4qQ1l4p6M3M7n7l6M7M5j6p0K5Q8l6n8J9
3728a7Q3n8q4M5J03o2q1L7J05l1j09L8J05l4r6L1J11k5j32O4O7kj37K8J25m0j05
3755g1M5J02m3j34L0J20l4r0K6R7j2j03QJ18l0r9K0J32l6j01M3J13m7j04L1R9
3781H0k5j28J4J40j3j37L2J53n9j28M4J29m3j10LJ04m5p0j6J69n5j09oJ65j5j64
3807i0M7J00K3j79M7R3lj06K6J10Kj15k5J34Nj17PJ13k3j01RJ25j6j25j0J57k7
3834F1j20OJ24l4j28M2J13j9j10J4J39l2j35M2P1J8j37K0J25oj19k1J50Lr4k9
$$ y = [-74, 28, 40, -28, -43, 23, 51, -34, -81, 29, 69, -27, -72, 3, 50, -16, -34, 3, 28, -9, -21, 2, 59, -12, -33, 10, 48, 0, -22, 52, 7, -24, -29, 9, 12, 8, -13, 16, 12, 9, 8, 16, -4, 5, -37, -6, -6, 7, 13, -5, 9, -9, 0, -4, -16, -18, 30, -17, -12, 16, 12, 41, -20, 26, 30, 11, -8, -2, 57, 10, -27, -6, 67, 30, -28, 2, 21, 1, -30, -5, 46, 3, -21, -29, 52, 18, -58, -15, 32, -25, -61, -14, 31, 15, -55, -30, 58, 22, -36, -17, 66, 8, -76, -31, 72, 10, -71, -34, 71, 40, -69, -31, 74, 40, -56, -25, 86, 61, -71, -7, 60, 58, -79, -51, 74, 34, -71, -26, 76, 33, -101, -71, 49, 15, -75, -49, 48, 36, -67, -59, 59, 29, -70, -50, 82, 46, -55, -12, 101, 54, -50, -19, 80, 55, -73, -59, 81, 68, -69, -37, 116, 57, -71, -27, 102, 59, -51, -48, 56, 11, -59, -75, 94, 39, -70, -76, 89, 74, -90, -43, 57, 80, -99, -52, 41, 38, -68, -42, 68, 70, -45, -70, 64, 69, -48, -41, 72, 49, -52, -43, 82, 66, -59, -69, 88, 61, -59, -53, 71, 37, -91, -49, 64, 45, -65, -51, 88, 56, -79, -37, 34, 52, -85, -65, 60, 54, -65, -86, 64, 67, -27, -56]
3860e6J25Pj61J7J36Qj29rJ47k9j19lJ25oj29K5J12mj09oJ27Qj38J2J00Nj26N
3888f5J33k6j22K9P9L7j43L3R0J9j32j0J28L1j33QR1j1q9rJ15jj16K8Q1K3q7k9
3916d8J14J8j15k8J13qr1qQ0Qp5k6J20kq4%P8j0n4l2R5lj04J7Q1Qr6J3O4L7o6
3947dk4L7N0j02J7O6J4p7MP6j6p8%O6J2o6KL1L0o3K0K6J3p6j9P9J5p3J4L6Qn6
3979c8j5O2On6KR0k8k6j0M7J2n2j4M7J0l1pN1j7l1QJ1qm5K2M5k1l8J6K8J8l5k6
4012b3K6M1l1l9M8k6J0j4PK0l7J5NNk3LJ7j1l2N5jJ0k4J1Rj4k7L2K6j6Qn2LL5
4046A6k5J8J3Nk3J1k3J6l3M0k7J5mm2M4j5qJ5roL0J3k9J0J2j4J9l5L2l0J7mJ1
4079A0okorK3j5NJK5j4m0M5j0j2J3J9Om4l6M4qk9J4NJ6krL2Oj2m2M4nk1N%L9m1
$$ y = [-56, 69, 76, -85, -68, 68, 76, -53, -62, 85, 56, -63, -66, 59, 53, -76, -51, 61, 57, -52, -58, 69, 77, -61, -49, 51, 56, -70, -65, 68, 42, -80, -51, 28, 65, -78, -45, 45, 64, -68, -78, 50, 81, -52, -44, 47, 36, -53, -62, 53, 52, -64, -36, 45, 68, -19, -48, 66, 84, -31, -59, 54, 46, -45, -53, 27, 35, -40, -66, 54, 52, -32, -32, 46, 36, -18, -50, 45, 42, -62, -45, 36, 44, -52, -39, 25, 62, -4, -28, 9, 59, -43, -26, 40, 54, -23, -19, 57, 41, -37, -37, 29, 41, -25, -23, 8, 38, -25, -5, 21, 34, -42, -61, 18, 33, -40, -26, 10, 18, -38, -53, 9, 15, -41, -39, 51, 23, -3, -13, 34, 46, -6, -20, 27, 37, 6, -1, 50, 33, 2, 10, 21, 13, -32, -10, 35, 14, -24, -8, 20, 38, 3, -23, 3, 44, 13, -26, 22, -4, 6, -8, -1, 19, -18, -3, 2, 7, -16, -13, 4, -7, -39, 16, 15, 25, 1, 12, 21, 7, -20, 12, 38, 22, 30, -22, -19, 16, -9, 9, 22, 27, 4, 15, -8, 8, -25, 15, -12, 3, -1, -43, 1, -14, -22, -7, -16, -22, 8, 21, -8, 2, 14, 0, 19, -16, 16, -14, 3, -1, 10, 4, 2, -4, -13, 10, -5, 0, 1, 26, 12, -28, 17, 7, -5, 8, 27, 33, -11, -47, -3, -11, -40, -26, -21, -5, -7, -16, 16, 22, 10, -32, 12, 7, -14, -9, -9, 30, -11]
4117a1lJ5J3k7J6j3K5m4J6M4j7k7J4L7On7JJ7J2m0LL3J2l3j4K9Ml2j6L0Qm4K6
4150a7K5J4m5j4O2rl8mN6pn0MO3pk6j5N7j6m9rO0j1n2k3Q1J9p2nN1J9q8J2O0M
4184C0l5m2M8J7m8qN7Nm7k3Q9l1m9KO5%n7j8R8Nj00K4L6J6n1j8Q2nq0pP8Qm2k4
4218b5M8k0m6kM8K0q2K6N6J8p9LO2K1p9j5Q5Oq4j4J06j4o5l1Q0J5q1K7N2L5q4
4249a3m8R2L2p8k5O3J0n8j3Q5j6p4j1P5K3p1l1O1N0r8mN0N1r3oO0M7r9j2R3Op8
4281c0k7Q8J7p9j3Q2J2q8oQ7Jn5l3R3Po2l0O8J4m9o3J14J7q9pM1K3n4l2O1K9n3
4313a6o8Q7L1n7k6O4Pm5k1N0L7n8oK0N0l9m5N7Lk0m5O7K9n9k2N1Mm3j4L6K0n0
4345b1j6P7J6n2k7K8L3l1m0J9O2p5l0M9N3o9j8L6K7j6n7P6j1j8j7M5K0n6j3K7
$$ y = [-11, -14, 1, 14, -13, 3, -10, 15, -29, -13, 31, 14, -13, 1, 38, 44, -13, -12, 5, 17, -23, -20, 13, 25, -8, -22, 7, 11, -21, -37, -7, 1, -43, -17, 8, 22, -23, -37, 25, 16, -22, -26, 30, 23, -27, -23, 40, 33, 7, -8, 49, 33, -16, -25, 35, 24, -28, -51, 30, 49, -23, -28, 23, 42, -46, -34, 26, 30, -5, -47, 1, 18, -30, -38, 19, 24, -23, -46, 43, 12, -37, -35, 30, 30, -27, -45, 53, 58, -42, -18, 18, 34, -17, -35, 47, 42, -38, -45, 33, 41, -1, -25, 23, 3, -43, -45, 3, 23, -59, -33, 23, 41, -38, -35, 27, 48, -31, -46, 39, 45, -39, -53, 53, 39, -26, -57, 23, 38, -43, -16, 36, 71, -13, -61, 31, 63, -15, -40, 23, 33, -25, -38, 47, 31, -43, -54, 21, 44, -27, -58, 3, 53, -45, -49, 1, 52, -41, -47, 13, 60, -39, -51, 42, 48, -30, -57, 31, 48, -31, -44, 38, 50, -38, -44, 43, 44, -11, -44, 49, 56, -6, -36, 32, 46, -3, -66, 48, 65, -24, -31, 10, 33, -21, -53, 8, 37, -16, -84, 3, 34, -23, -49, 15, 22, -23, -44, 6, 43, -15, -21, -1, 49, 10, -35, 22, 25, 5, -40, 27, 56, -3, -25, 26, 30, -13, -27, 9, 29, -21, -37, 40, 56, 4, -23, 5, 38, 7, -33, -14, 48, -27, -57, -8, 45, -24, -42, -6, 21, 5, -52, 24, 13, -5, -22, 23, 43, -13, -26, 1]
4375AM2k9l2K4N2m4l8M3J4k9l3M2L1l8j3LJ1On1L0%pnJ9J6l9oJ0M2k9j4K3K0j2
4409A0n0L4RKm4K4OK8j7oL4l6kJ6K0lj8PJ1k3J9j2%MpKk2J7Lrj7J0J0qj5J2j6
4446b7QLNK4j5m2J9J6jJ3k8L5rk0J8J0J2k7k0L0jk2K0J0j7J8j2L3j7l2L4J1k3
4479Fj8K6njk9jL8jn0K3L6j6k6j7M6j3j5mK7L3n6J2L2J9o5LO1J2p5PL5K1n4NM4
4514D0Kp1QN7j7l9J3J9K4n1nO2kq6jO4Jn7lN3Rn3j5M7L1o1JM1K1o3RN3J7l8o6
4549e6Q1L1q2NO8j2l2m5R2pq9JQ6Qo5mM0jn7l1R9j2m7k6M5M0o2k9O9J5m3j3M8
4582A5L9r1J1L3K8p5PP0K7n9p4J25j3m3l5N1K9m4n0R3pn3k4L6L1q1J9M1M7p8k8
4613e3N5J8m7k6P4K4q7k6P8J9k0p2P4M2o9k0Q4qn2m7R7J9o7l1O8Km7m2R1N3p0
$$ y = [1, 43, 14, -18, 6, 58, 14, -24, 19, 33, 4, -29, 13, 44, 6, -7, -4, 7, 13, -38, -8, -8, -15, -20, -1, 15, -24, -30, -20, 22, -7, -21, 2, 22, 10, -40, -6, 3, 5, -39, -15, -9, 19, 2, -4, 30, -6, -8, 8, 28, 25, 7, 14, 25, 2, 21, 9, 9, 13, 6, 8, -14, 3, 6, -3, -20, -10, 0, -8, -23, -11, -27, -19, -16, -11, 13, -2, -44, -25, -9, -10, 3, -25, 10, 1, -19, -1, 9, 21, -6, -26, 4, 3, -19, 1, 11, -6, 12, 0, 33, 16, -16, 18, 29, 6, -12, 14, 9, 8, -21, -22, 16, 15, -35, -12, 24, 8, -18, -35, 11, -2, -17, -21, 6, 39, -17, -5, 27, 46, -19, -16, 45, 57, -18, -11, 24, 45, -9, -4, 40, 42, -29, -21, 36, 19, -20, -7, 12, 36, -15, -20, 42, 40, -46, -47, 17, 18, -39, -42, 11, 20, -33, -48, -1, 30, -31, -30, 11, 32, -31, -22, 31, 48, 10, -56, 25, 56, -26, -21, 47, 35, 3, -42, 50, 43, -46, -45, 41, 49, -16, -20, 20, 19, -38, -69, 30, 18, -29, -55, -10, 30, -32, -61, 8, 23, -20, -33, 15, 54, -37, -26, 7, 35, -40, -33, 37, 64, 5, -69, 56, 43, 0, -35, 16, 45, 1, -49, 44, 37, -16, -40, -4, 27, -54, -35, 6, 53, -25, -53, 2, 20, -27, -53, 21, 45, -42, -68, 10, 29, 9, -63, 11, 53, -16, -36, 48, 40, -12, -59, 38, 57, -10, -41, 27, 29, -18, -60, 31, 84, 14]
4644A4n0O0L9r9j0M5M8n9k0N6Ln5rO7J3q4ML3N2m3m6M0K1l0JOM6m6l9M5O3m7l6
4677a7L8K0k6n5N9N6p7k1J5N8n1l6M4K5l5p0O6L9n5k8M6J7k1k5M0L7m6n2P5K2
4707D2l8m4K7L0k0k1J3O7m4m2L8N5l9m1L0K1l1k0K3L1j8n4K6M3j1n8L7Nj2m0L9
4738fJ8jl0KN0k2l0k8N8k3l7K1L8k6lK6J6k1rJ4K8j6rj2K9j8j8%L5L1o8M0k3J9
4772B5l0NJ5Pl5K7J3l2nQj9K3l7J6MKk6RL3pJ1j6K1pj6rL8j7j1RJ0QlkoK5jqp
4811A5kpJ6ol8J9K3k9k3M5r%j9K5pRl4L1kk6mJ4j1J8J9m3K7J1lK1k5j8J6J2J2
4846B7k1LK4lk6RJ7nll5L9Pl8J1OKl6qK9K1l7J3J5%l3J0K0Nm2L3J6Om2K9j8L1
4882B6k5mK7jl1J2J6j0k5kM5j8k1pM5J1l1NJ6K1m8k2OK5k2k8O8j3l5rN6j2m3j2
$$ y = [14, -36, 24, 63, -36, -46, -1, 47, -12, -32, 24, 27, -28, -37, 30, 43, -41, -37, -4, 48, 5, -41, -1, 20, -10, -9, -3, 43, -3, -42, 3, 66, 19, -17, 21, 41, 15, -40, 19, 75, -2, -23, -8, 50, -1, -37, 7, 32, -3, -73, -7, 32, -23, -51, -5, 12, -9, -34, 6, 43, -3, -55, 20, 42, 4, -40, -13, 17, -3, -24, -11, 56, 12, -30, 8, 63, 24, -17, 13, 34, 3, -17, 6, 37, 19, -35, -9, 34, 23, -35, 2, 7, -5, -45, -6, 12, 11, -19, -17, 33, 11, -19, -47, 11, -12, -49, -28, 10, -16, -19, 7, 23, 2, -7, 7, 35, 19, 10, -2, 27, 9, -9, -9, 26, 57, -11, 29, 6, 25, -5, 0, 15, 22, -13, 14, 27, -5, -10, -2, -21, 2, -35, -19, -15, -13, -39, -30, 3, -4, 7, -9, 12, 5, -11, -20, 18, 1, -10, -1, 9, 17, 14, 12, 6, 31, 30, 22, 15, 13, 6, 22, 16, -22, -3, 20, -9, -32, 13, 4, 4, -15, 10, 3, 12, -22, 9, 7, -19, -23, -9, -20, -2, 17, -26, 1, 12, 9, 30, 5, -13, 3, 15, 27, 6, 9, 33, 30, 4, 13, 30, 25, 22, -13, 26, 33, -5, 6, 12, 14, -22, -30, -1, 20, -17, -4, 11, 11, -22, -12, 8, 13, -29, 4, 20, 26, -16, 13, -5, 26, 1, -3, 24, 23, -8, 4, 20, 10, -15, -17, 28, 10, -11, -18, 27, 38, 7, 12, 28, 49, 1, -21, -15, 10, -12, -40, 28, 15, -20, -29, 27, 15, -28, -40]
4916d0M1L4n7j6N5Rn0K9PL8m0l1L5K4k9l8N7K7n1l6O9K0n4j3K8L9m6o3P5O7q1
4947In2O4L3p4j3K1L3k2l5kN3k1n2O8J6n3l2P3K6n8k6N6L6n0j3K9K4k8k6J9N0
4978E3n9J6kN4n2o4N7K7j9o8P6Rm9m9O1L2m5k1O0J8n5n1P9L1n3o0Q9L5q1j4N4
5009IL5k6o4O3J1j2o1P5K8m5n4M1L7k3m2M8M8p0k2L2K8l9m6M4K0nn8L6N0l7l9
5040c8L6M1k3q2P5Qk6k6J2Q5o3l8M3N3l5m0K5L5o8JK6N6k9o0J8O4j6p1L5P0l6
5071C2o2M0M0n2l7L7L8jp3K6N8l4j5k6L8Mm6NL0J7n6j0P5km0J6K9Op0M8L5k9l9
5104a8JN4j3k1oK3j3k8LM5lk0rJ0K9n2J7J4J1l8nL6Kl4J6J5j3oj0N0j3m6J0L5
5138B3k5K0k6J3J1oj6L9jj4j9K0K0l2LM%mmRLn2K9qK8k4k6L8J3l0K3lnnLJ3Ro7
$$ y = [-40, 1, 35, -22, -38, 17, 26, -24, 5, 12, 50, 10, -21, 14, 38, 9, -29, 28, 55, 4, -32, 37, 57, 3, -10, 18, 57, 11, -52, 23, 90, 9, -43, 21, 54, -20, -33, -12, 21, -1, -36, -38, 15, -6, -58, 10, 26, -27, -59, 14, 40, -18, -44, 12, 48, -2, -15, 14, 38, 10, -16, 3, 53, -6, 10, 8, 62, 10, -54, 3, 30, 11, -57, 19, 28, -21, -70, -9, 23, -22, -43, 17, 35, -20, -71, 8, 39, -14, -74, 15, 50, -31, -45, 9, 44, 18, -46, 17, 28, 16, -45, 30, 58, 13, -41, 0, 37, 14, -28, 20, 68, -2, -24, 8, 36, -3, -49, -5, 15, 10, -48, -12, 38, 1, -38, -2, 39, 16, -66, 9, 17, -9, -35, -23, 62, -1, -39, 4, 57, 22, -18, 7, 42, -26, -25, 1, 57, 28, -32, -14, 50, 34, -37, -2, 68, 32, -30, 10, 50, -2, -39, -2, 36, 35, -38, -12, 46, 12, -3, -29, 9, 13, -33, -28, 2, 19, -37, -47, 28, 26, -14, 2, 31, 37, -33, 15, 50, 21, -18, -17, 37, 24, 3, -3, 20, 7, -21, -18, 27, 24, 4, -5, 5, 34, -18, -1, 13, 24, -14, -19, 17, 19, -15, 1, 16, 3, -3, -13, 37, 24, -22, -12, 23, -2, 18, -8, 5, 16, 10, -6, 33, 32, 18, -1, 19, 39, 7, 10, 14, 14, 10, 6, 15, 18, -34, -5, -13, 15, -9, -35, 3, 16, -14, 9, 6, 1, -4, -1, 12, 21, -46]
5176d6L2K0j5j2rL0LJ7j5j5jMK2j3rkK8l3J2Ok2j0J9J7rJk5J7j5Kj8J9Lj6J7r
5212b5J5j6L0JLk2K5J4kj6j4nL1nJ3j8Oj8k1J8L7l1RLJ2k2l0L6Lml7N2lj9Oj1
5248ejlKNkl5RK8J5qm8J2P5o1j8L2Oj8k1J2O0k1l8K9K9k5l2J6O5m9m2M4Kj3k1
5283b0K0K6on4K7J4j2k7L5M2p3j4O4j3Jm7K9L9n1l1L1M2j7n8M5J4j0l9N1L5o2
5314a9j7K3N5l5o0N2N6n0l2N4J8l9l7K8L0J0n9k0P0k3n6J5O2j5p6N6L8j4o7J4
5344c8R9m6n6k2J11k2n4K6L2pn5JQ9l6n2J0O3k3n6L4M8po6K9N3l2o4J7N5on3K
5376b6O4k2o3K3L3km0J1M0j9k8K9K3jl9j2P4k5n9L9M0nn5J2L8Kp3N0L5on6k3P2
5409C1Km8oO4k4m2RN9lo5NM6rm3j3L9K7p7K2M7rk1rM4J8n2NL7k1l6%M4kl3k1M6
$$ y = [-46, -14, 6, -9, -21, -30, 0, 3, 20, 5, -10, -11, -7, 15, 2, -7, -9, 19, -14, -2, 4, -18, -28, -9, 8, -1, 0, -25, -8, -23, -21, -39, -20, -17, -33, -16, -25, -10, -26, 4, 5, 8, -14, 11, 25, 23, 7, -7, -12, 19, 14, 27, 9, 15, -3, -24, -6, 31, 0, 9, 12, 24, 2, -28, 8, 11, 7, -30, 22, 19, 0, 6, -5, -6, -9, -7, -2, -4, -39, -30, -2, 13, 5, -43, -31, 44, -17, -35, -3, 3, -15, -36, -24, 36, 15, -23, 6, 35, 10, -22, -6, 59, 10, -32, 12, 14, 1, -20, 0, 26, 20, -34, -7, 7, -5, -32, 3, 45, -28, -42, 22, 9, 10, -37, -8, 31, -20, -51, -20, 22, 5, -53, -8, 6, -4, -43, 8, 43, -19, -36, -13, 42, 7, -53, -1, 55, 5, -27, 27, 45, 6, -31, -3, 27, 37, -22, -42, 28, 5, -51, -36, 26, 11, -65, -9, 29, 15, -52, -38, 61, 15, -41, -63, 48, 26, -28, -2, 30, 23, -32, -31, 58, 22, -30, -20, 43, 20, -36, -2, 46, 39, -27, 2, 55, 23, -41, -24, 31, 25, -28, -26, 38, 16, -47, -24, 9, 7, -33, -22, 18, -1, -29, 0, 23, 22, -17, -29, 45, 20, -39, 0, 40, 35, -20, -8, 30, 32, -41, 9, 44, 38, -18, -41, 31, 33, -15, -21, 43, 19, -23, -14, 45, 42, -23, -18, 28, 19, -24, -37, 2, 29, -48, -26, 21, 12, -9, -18, 26, 44, -8, -3, 34, 13, -23, -23, 21, 19, -14, -35, 11]
5445A1Nk3j6N8j4l7lM3j5m2j4Q9lo8j4L4J4l1J6J8J7m5j2K4K3k1lML0k6k6MN1
5478B8n3j3L2K5j9k1N2Pk1l4K6J8k5k9L8K5m2rJ3J6k3l0M2J2j1j3RJ3k9j4K2R
5510Aj5ML1Kl8j4K7J8l9nN3lk7J1l0OJ6LK9lj6k2J3Rj0lN0l0jk8J4Kj0lrJ9l6
5547c4L8k1L0l5l0N0J0j5J5pPoQmj4%mM6k8oJj3M8lj5k3QlL2qj7RJ2o%j7mL7l9
5586aj3kL0k5oK5k5MoJ2nj5K5nj2j8L3j6L5j7j6M6l5k0L0J0J3m6J9Rpj5QK8pJ5
5622C0n3N8k3j4Jj7M2k9j0L1j7j2nL2k9j4J6J1J2m4J4lNMj3M7k6j0j6N1j6k7K4
5655@K3rok8L5kk1J4J4J9n2J3M2k6j6k2M3j1j6k2M1Qm5J0N4Rp7J5J6kk4LM1k5
5689dj9pO7m2k0K7NJ8l8K4K7rk0mK5Mm6PL4Jo1%N1lk9j7N5j6k3oL4J4p5LP0k5
$$ y = [11, 16, -7, -23, 35, 21, -16, -19, 24, 9, -33, -47, 42, 39, -29, -43, -9, 5, -26, -10, 8, 25, -20, -32, -8, 15, -6, -9, -5, 25, -1, -27, -23, 28, -25, -38, -6, 19, 0, -21, 31, 38, 17, -17, 9, 27, 2, -27, 11, 36, -6, -15, -2, 14, -9, -39, 3, 15, 4, -9, 0, 13, -16, -30, -8, 1, -14, -10, 21, 23, -15, -29, -2, 16, -23, -28, 25, 22, -5, 6, -24, -18, -2, 1, 30, 27, 11, -11, 2, 11, 1, -2, 48, 18, 17, -11, 3, 5, -5, -8, -17, 2, -34, 4, -17, 13, -22, -52, -2, 8, -7, 8, 1, 8, 2, 10, 6, -8, -8, -12, 34, 6, 0, 1, -12, 36, 33, 18, -5, 3, 0, 32, 24, 7, 16, 28, 22, 22, 5, 1, 38, -1, -14, -16, 14, -11, -17, 8, -17, -13, -19, -7, -12, -27, -2, -7, -19, -37, -4, -20, 15, -2, -18, 28, -7, -27, 3, 13, 26, -20, -1, 8, 1, -14, -6, 22, 15, 30, -23, 35, 12, -2, -1, -18, 24, -5, -15, 16, -1, -13, -18, 14, -15, -29, -13, -2, 10, -34, -20, -23, -18, -14, -27, 20, -6, -16, -32, 19, 3, -24, 0, 23, 14, 8, -20, 15, 13, -8, 6, 20, 39, -13, 0, 42, 16, 0, -22, 21, 10, -6, -28, 13, 21, -24, -14, 40, 49, -28, -13, 3, 1, -23, -20, 21, -4, -23, -30, 37, -5, -25, 2, 7, 25, -13, 11, 38, 29, 9, 5, 30, 34, -12, -5, 29, 30, -31, -31, 20, 17, -12, -29, 26, 10, -13, -19, 15, 29, -46, -43, 27, 2]
5725Boj0K5J6o0J2K2J6l2rM6L2o1qO0J2o0j8L9K8n0j9M6Om9J3N1k8l4K0jNk7J3
5759hK4j0j8l8P4ln4J1K8J8k8k3N0Pn9OJ6L5k8k4L8Qj8k8L1J6k4l1M1Rm5J0M8
5792C1Qm5j4L5Pml9RM9m8o3P3J4Mm8M2%j4k6JN8o4JL3J9j7k8M6j6k0qJ0N6m5k0
5827b3K9J4mj3K8K7n8%pL8l5j3RJ8l3NJ9j6NlnJ9Mm4L5J8k7l6N3k1J2l2M2n%l7
5863c7L6M7n3mj2K8l3M3k0J5Nl9K0Qkk6M3j0k4m5P2J1k8j2PJ6j8oqO6m1k4K8k
5897AmkjJ0nrJ0j7QQj2K1Ql3J1J4Mk1J5J4j2njJ8j0pOj6J4j1kJJ4k3kj3J9kPk0
5937b5J2J0kk2K9pj5K7m8M6QKj9j0J1L7m8nM0k2K2k8J5Oj2K0mj4K4Ok0l1PjJ3
5972BOj8K6k1%mL2n3M2j2j1j7J4kQJ7l8J7K1k4K4lJ1j4j0L4k4J7j9k6K0LroL3
$$ y = [2, -4, -14, 11, 27, -33, -21, 1, 17, -15, -24, 22, 54, -7, -15, 45, 57, -3, -21, 18, 46, -4, -23, 23, 29, -20, -7, 44, 16, -18, 2, 1, 6, -21, -8, 16, 6, -12, -50, 24, 21, -33, -22, 6, 24, -4, -27, 23, 30, -29, -23, -7, 28, 0, -24, 14, 22, 4, -24, 7, 23, -1, -32, 9, 18, -27, -17, 31, 39, -6, -20, 15, 22, 18, -21, -12, 37, -11, -74, -1, 13, 17, -31, 11, 11, -3, -29, -28, 30, -34, -33, 0, 19, 2, -26, 20, 4, -16, -24, -14, 42, -3, -23, 6, 20, 16, 3, 31, 58, 0, 0, -7, 31, -4, -17, -8, 10, -23, -18, 1, -15, -10, -13, -18, 1, 5, -39, -4, 14, -13, -49, 4, -17, -5, -37, 5, 0, 0, -37, -1, 46, -7, -11, -23, 5, -28, 15, -5, 10, 15, -24, -4, 4, 2, -24, 19, 9, -15, -60, 12, 23, -5, -17, -10, 6, -12, -18, -26, 40, -1, -25, 3, 1, -3, -5, -6, 4, -1, -10, 0, -17, -9, -1, -13, 8, 16, -17, -6, 8, 12, -9, 6, 20, 8, 3, 2, 20, 10, 3, 9, -7, 7, -4, -6, -5, 9, -14, -16, -29, -10, -12, -5, -25, -13, -3, -5, -27, 2, -5, -20, 7, -41, 5, 13, 15, -4, -14, -3, 34, -14, -19, 21, -1, 21, -7, 8, 14, 2, 22, 18, 4, 28, 34, 14, -17, -10, -11, 2, 8, -10, 16, -5, -5, -9, 23, -30, 12, 0, -11, -28, -14, -16, -8, 9, -29, -12, 9, -15, 9, 6, 17, 3, -7, 27, 3, 20, 1, -25, -5, -2, -11, -17, 16]
6007A6pllj3j0K5j2K2j0k5j5K0J3Nk9K7j0Rj0%okj4L5l1J3L8oRk1j7K8j1J1j4
6042BK7oj3J1k6L9n7J8j6M7l8k5L0K7m7k0L6QJ0kPj1%l1K5Pj1n%K4k6j8L3J1k2
6077a2QJ7J4k6m1L6J0J2Lk4L2k1nQj4jNJJ1l0pL4l1RprK8j5k7K7K2Mk5j1M3m4
6113b6J7jKJ5n4K9M8k4k1J2K8Nk9J9kJ6k9j5M3l3j9M0j0j0kklPnJ0J0l5J5l2M1
6148EqOnj1K9m7RL3k3j2K0J9j4LPpj0K2l3J7J3j6RlJ1j5pK3k6lJ9oNk1lL6k1J0
6186EJj5Kl6K4jqQj7L7k9J0NLJj6L4k6K4k4J0J4QkorK0k1J0L1l2lNk0K9pk3K7
6224A3j7j7K5nJQk4J1kJ9l3K2l0K8kqK4j2Nl1J8J7k4J7j3J6qj4NL6lj7k2M3k8
6259bK0j4Rok6J5J6j0lK1j5J1l0JPJ1qm8L4J2JK7m6JJ0J8K3l9K0j9K1k7PQrj2
$$ y = [16, 9, 6, 3, -10, -20, 5, -7, 15, 5, -20, -35, -15, -2, 3, -26, 1, -9, 0, -10, -10, -16, -18, -32, 3, -28, -15, 23, 17, 26, 5, -12, 16, 5, 16, 2, 29, 23, 10, 21, -5, 34, -23, -5, -21, 26, -12, -37, -7, 20, -27, -47, -11, -3, 7, 5, 12, 1, 1, -30, -5, 2, -9, -14, -14, 10, -16, -34, -1, 10, -12, -4, 13, 27, 1, -40, -4, 6, 18, 21, -3, 29, 8, 3, 11, -3, -4, 1, 2, 13, -17, -24, 10, -21, -12, -19, -28, 0, -15, -42, -15, 7, 11, -14, -25, 18, -26, -9, -10, -8, 7, -47, -18, 30, 6, -15, -3, 25, 30, 1, 20, 18, 34, 5, -10, 33, 0, -19, 21, 11, 1, -1, -3, -6, 1, -4, 6, 16, -19, -4, -36, 5, -3, 3, -2, -13, 16, -31, -22, 11, -12, -24, -4, 15, 1, 4, 11, 4, -6, 16, -17, 0, 13, -3, 6, 3, 14, -1, -8, 15, -11, -14, 5, -1, 4, -17, -20, 16, -5, 5, 6, -9, -7, -43, -19, -20, -28, -20, -37, 0, -29, -19, -14, -11, -10, -26, 8, -18, 6, -18, -8, 6, 14, 12, 6, -3, 17, -4, 6, 37, 5, 2, 7, -13, 16, 9, -14, 13, -4, -21, 4, -1, 0, 8, -16, -5, -7, 12, -21, 1, -29, -1, -3, -11, 13, 1, 6, -25, -7, 10, -14, 3, -10, 6, -2, -16, -11, 25, 22, 5, -17, 26, -2, 18, 4, 13, 7, -19, -4, 12, 2, -1, 20, 5, 16, -14, -13, -6, 5, -3, -51, -17, -5, -4, 23, -23, -22, -12, 6, 29, -10, 10, -9, 12, -15, -8, 0, -9, -21]
6295b1K5omK6j1QLk0qL7j9jj4PkK1l2J1MrJ7k8LLL0m7M0j0k3J0MQj4J2j9L2pJ5
6333B1k3j6OpK1j7J9J3jm0M6rQk4k7M6j2J1j4lj6kL8m2L2j9kJ0Lj0KJ9k8j3J8
6368a2nMK1k0L9m4J2K2%j8RMpj7J4J0j7K1k7NM1k9nJ2j4j6J0oK3k0oj6K7OjPk3
6405a6K2k4J9j2j3K1l5L1lrROJ6j5J2j5j5J8J3Kk8L5j3J4J%nj7mlkK5Jm5K5Lj3
6442a4KK4ll7K6qk0J0lL2Mrj5J9Ok3kJ0jNj1OPJj1rJ9%jjKQ%j4nJ2k5MPJ6k4R
6484gJK8m3J4Lnk4NL3%j1mPn%oJ5mj9L0J1m3qM3Mj4kOj8L8jk6J9Jj2J5qPl7jK2
6525Dj8mL1jk0k3j4N9nm7K6rJ0pkK4Jmk0M4k1KqjNLl0L7Kj8j0J9L3m8K9Koj8K1
6564A8jj7oQK8kj5OoNk5MrJ4pkLK7l3J6mnRk6K7K4l7j5M5j9J0nplQkJ4J6k9l2
$$ y = [-21, 4, -2, -6, 20, 9, 17, 20, 0, -8, 29, 10, 9, -5, 2, 0, 21, -11, 0, 4, -5, 12, -16, -13, -10, 20, -27, 13, 3, -20, -10, -6, 2, -12, 0, -19, 13, 6, 21, -2, -18, -12, -19, 2, -15, 4, 17, 16, -24, 22, 13, 21, -3, -30, 16, 4, 15, 1, -2, -18, -20, 18, -24, 8, -11, -13, -3, 0, -10, -8, 11, -17, -30, -12, -17, -13, 8, -12, 27, -17, -5, 17, 17, -1, 8, 12, 5, -12, 2, 12, -5, 16, -11, -6, 35, 6, 1, 13, -1, -17, -7, -13, 10, -10, -16, -32, -5, 1, 0, 7, -16, 6, -18, 1, -11, -24, -3, -38, -7, -10, -19, -10, -4, 12, -3, 9, -6, -21, -3, 10, 12, -16, 19, 6, 20, 21, 21, 16, -1, -5, -8, -10, 15, 16, -29, -4, -1, -14, -12, 12, 9, -28, -2, -10, -30, -20, -23, 9, 13, 4, -11, 8, 14, -9, -11, -1, -2, 3, -8, -2, 5, 6, -5, -14, 5, 5, 4, 3, 5, 13, 13, -1, -6, 6, -19, -15, -8, 8, -16, -7, -6, 22, -21, -7, -4, -9, -33, -28, 5, 5, -6, -10, -3, -8, -8, -14, 1, -3, -22, 8, 19, -24, -32, 11, 15, 1, -1, 5, -13, 25, 24, -2, 17, 18, 6, 21, 13, 20, -17, -18, 4, -14, -18, 13, 12, -8, -31, -45, 14, 9, -38, -12, -21, -11, -18, -20, 4, 5, 1, -19, 25, 4, 6, -2, -3, 2, 5, -25, 12, 14, -4, -14, 5, 38, -10, 19, 21, 15, -3, 18, 17, 0, -6, 2, 30, 28, 13, 19, 13, 18, -7, -3, -12, 2, -5, -7, -4, 23, -10, 6, 2, -3, 6, -20, 7, 31, -6, -21, 24, 5, 15, 10, 3, 0, 8, 6, 20, 36, 7, -25]
6604b5J2j4L3J1j0jj5j7L3rK%oJ6qj3KQk0L4k2J0Nk7L1%l5K7Rk0L0j7K6pJj5N
6641A4%Jk4J6oJ2J2k5kj9j5K8OK5m5Pj5M8k8J5k5K1oj6J5qK0j1oK2k2KK0kj7j
6677iL7j8k8J5Mj7RJ1K3kllMk1Jj9L9j7k8ONk1K7mj8J7mJ3qoPMj5QQK3k0Pkj1
6717fK4Jj6rK1k2J7J4J4l1Mj0oJKK3K3l8rJ4Qk4J9rj8J7l6KL1jPonk9J4OJ9k5
6755a9K2J5mJ0k0nJ6j8mL0j3JNoj%j2nL8k4j6K0okk2L1j1j5J5Plk5K1j4j1j6N2
6792A1J2k7Rk8J2K0j5J5mk6LJ8PpRK1kn2L7Kl1J1J6Oj2Onrj3J2k0L0j0Kk8M8k2
6829dj0jJ3ol6LN2pj8QK4k6pL3j6pj0k4K2J2J5%k2K3jj2K5j7kpPPPo%pk6K8j4
6868gK8k4j0LkOj8j3K4kLJ5j6K9j6kJMj8L5Pj7J4j7ll0L4k0L4l0%L0oj4J0j3K1
$$ y = [-25, -13, -27, 6, 17, 7, 6, -9, -26, 7, -2, 0, 0, -6, 10, 2, -11, -9, -1, -21, 13, -9, 1, 6, -21, 10, 10, -25, 2, 11, -9, 21, 4, 30, 23, 24, 9, 14, 14, 15, -9, 7, 1, 13, 25, 0, -2, -21, -36, -8, -2, 23, -22, -15, -30, 18, -10, 5, -20, 1, -5, -21, -6, -14, 6, -5, -11, 11, -11, -9, 11, 9, -8, -9, 28, 10, -18, -3, 1, -16, -7, 4, 27, 25, 22, 19, 23, 2, 3, -16, 23, 6, -22, -16, -11, -32, -5, -9, -27, -10, -14, -1, -9, -15, -8, -4, -19, -11, -3, 20, 0, 7, 5, -6, 18, 19, 3, -6, 15, -7, 10, 24, 38, 7, 11, 1, -5, -4, -2, 21, 44, 6, -3, 11, 19, -5, 14, 5, -13, 4, -32, -30, 1, 0, 7, 1, -4, -33, -19, -13, 6, -19, 3, 18, 14, 24, 4, -1, 15, -3, -7, 23, 10, 11, 16, 10, 9, 9, -3, -8, 30, 6, -10, 10, 4, 2, -20, 11, 0, -15, 0, 7, 4, -21, 0, -14, -25, -41, 11, 23, -4, 5, -23, -11, 9, -6, 9, 5, -21, -18, 0, 7, 0, 9, 30, 28, -24, 13, 15, -16, -5, 11, 17, 5, 11, 6, -3, -16, -4, -24, 6, -4, -2, -30, 18, -4, -14, -15, -2, -8, -44, -41, 11, 4, -14, -6, 18, -8, -15, 18, 2, -5, -15, -39, -17, -5, 10, 10, -12, 11, 10, -2, 23, 6, 4, -3, 4, 11, 18, 12, 12, 5, -21, 7, -7, 21, -3, -13, -10, -12, -6, -24, -37, -13, -15, -12, 3, -13, 16, 0, -2, -1, 3, -15, 20, 27, 10, 24, 7, 4, -26, 8, -12, 22, -8, -8, 22, 16, 2, 12, -1, 20]
6905B0Nl6J3k9J6Rk0K1Jk6K7j0l1L1J0k1K0k0K9qokj1JKRQlNRk3Rk5M5k3NKKJ1
6944A6J2k6J2jk8K8k6L4k5J5rj4L5l1k3LK7Nk0kj3J3J7j1J5J0k7QJ1LNlK2l2K5
6979B5j5lln%K0k6MJ5K8n0K0pj9MjK8j6j0mj3K0rK6j2J2j4j2Lj9L2jj3K7qk0j8
7016c4L8j1K6kj7J2l7K9Oj8J6Ol0L6k7J3K8k5Lk4OJ5rpknJ5k2J6l5K9rOJ4j4R
7052ejRKj%k8J4J4K0j2qk6K8L3l5J1JK2k1k5K1j6J5Kk2J3Qj1J2j3j0J4jk8K3j0
7088a1K3o1M8j7J9j0kJOj2K7ok0K4K2oj2K%j1RqKj6J9Pj8Mj6MJ9jj6rK4j0Lko
7127gj0K6k7LJ3rJ7j8QK2pj8mK3j7kkJ5K2l4QL0k2lmL4l8J7k3J4kj3K5oj2%pJ2
7165D%j3K7l2rJ8ojj1J0j0Oj3J2JK4Lj9MJ5j3j2OJ9J1k6K4K1Jl1K3j4j4k9J3N6
$$ y = [20, 25, -11, 2, -27, -11, -2, -22, -1, 0, -26, 1, -9, -40, -9, 1, -20, 0, -20, 9, 1, -5, -7, -18, -17, -15, -6, 2, -1, 4, 13, -10, -1, -26, 19, -4, 1, 3, 5, 16, 28, 2, 14, 13, -15, 13, -13, 21, -4, 11, 2, -12, 23, -8, -31, -28, -1, 4, -16, -18, -31, -18, -1, -12, 3, 13, -14, -6, 5, 8, 13, 10, 32, 0, 25, 10, 7, 4, -1, -1, 19, -7, -3, 12, 40, -10, 10, 3, -16, -12, -13, 15, -1, -11, -15, -28, -8, -17, 9, -3, 9, -5, -17, -14, -33, -1, -2, -15, 12, 4, -16, -34, 4, -7, 19, 17, 0, 12, -25, 4, 10, -8, 8, 14, -16, 20, -7, 6, 34, 9, 12, -12, -6, 9, 0, -7, -9, -14, 1, -21, -5, -40, -11, -20, -14, 0, -14, -5, -6, 3, 5, 4, 4, -24, -10, 4, 24, 12, 4, -22, 6, 39, 4, 15, 16, 38, 17, -8, 13, -3, 12, 14, -8, 5, 13, 2, 14, 1, -9, 5, 4, -24, -1, -11, 12, -49, -1, -18, 1, -9, -11, -10, -4, -16, 11, 5, -15, 9, 31, 25, 13, 15, 15, 4, 13, 5, 7, -9, 10, 17, -1, 3, -13, -9, 10, 9, -7, -16, 8, -2, 1, -1, -7, -17, 9, -18, -15, -2, -11, 6, -12, -4, 18, 11, -7, -11, 12, -5, -7, -9, 6, 28, -6, 2, 32, 10, 7, 3, 37, -1, 16, -7, 7, 5, -8, 17, 11, -1, -1, -8, 4, 4, -9, 18, -14, -23, -5, -11, -12, -23, -13, -23, -17, -30, -18, -17, 7, 10, -9, -5, 10, -3, -15, -9, 10, 21, -5, 19, 40, 41, 10, 33, 19, 5, -24, -11, 45]
7201D5m5MkLpk6L0K1k1omK0ok2nK0k8K0jjJ2j7J3J6Km0K6PNl9K4O%Oj3J7nk3K9
7240A5Jk9Mk2K4J1m2KM3Kpl3K4NRl7L1Rl3jOK2j2k4NK5j0k0L2J5l3J5J3Nll3J1
7277a0K1rk8M1Jl1oJ1J8k3j1oK0PqPLMj2jK6m4J2K8jl3J2K6m0L3j6j5L6Ql0MK4
7314A8l0OJ6j0K8k9%K5mpkj0J0lj6M1m2j3N6l3j6QK3l2J2k1J0K5k5onM2j9j0k0
7349c3L8Nj1KQ%k0K1p%j2J2K5ml5J1K1j1k1OJ4Mk2jK6l3jK9Lqk9RK9l1oK1J8k2
7387ek8K1K7l9L4k7KlNLJ9m3L0J1kKMk8L3j7pK1L6j7l4J3k2PqJ2K6l8PMk1J6J7
7424A1k8rrRK6%k6LL1j1j2j7L9j2lNPRlnpNJ5lj3r%%pM2j1m1J7K6k0k1J7K1j0
7463Fq%mpMJqrK3J0oKj3PJ0pk8L2lPloqJ9%j7J8j0J1opPLK3m8J7j4K4j8lJ6k8
$$ y = [45, 0, 4, 2, 5, -2, -28, 2, 23, 2, -4, -8, 12, 6, -16, -21, -1, -29, -9, -10, -11, 1, -16, -3, 13, 15, -25, 1, 8, 13, -26, -2, 4, 4, 10, -3, 14, 9, -14, 15, 16, -13, -9, -31, -7, 4, -38, -36, 7, 9, 2, -31, -7, -2, 7, -30, 1, 10, -23, -24, -18, 4, -8, -32, -27, -2, -12, -32, 0, 15, -18, -3, 10, 15, 12, -21, -10, 11, 2, -26, 15, 16, -15, -21, -10, 8, -15, -26, -32, -12, -5, -13, -6, -3, 1, -11, -12, 14, -30, -18, 10, 9, -24, -12, 14, -26, 7, -9, -24, 12, 20, -10, -6, 18, -12, -6, 10, 0, 28, -1, -1, 24, 20, 13, 11, 1, 11, 8, -8, 33, -9, -22, 34, 1, -15, -7, 16, -16, -4, -25, -15, 10, -15, -21, -26, 16, -3, -13, -33, 5, 10, -1, 1, 9, 9, -11, 10, 3, 3, -9, 3, 28, 24, -11, 0, 21, 10, -11, -5, 9, 13, -9, -10, 16, -17, -18, 11, 14, 6, -23, -14, 15, -16, -22, -1, 17, -5, -33, -12, 15, -24, 10, -17, -15, -18, -13, -10, 9, -34, -4, 7, 5, 7, 11, -17, 16, -1, -8, 13, 49, 32, -2, 11, -11, -4, -12, 0, 26, -12, -5, -1, -22, -6, 11, -17, -26, -35, -26, 0, 0, -26, -23, 8, -3, -15, -32, 7, -5, -8, -3, 4, 13, 10, 5, -2, 3, 18, 15, 2, -7, -7, -7, -14, 28, 17, -24, -7, 19, -1, -22, -5, 16, 6, -2, -2, -6, -13, -9, -8, -16, -25, -2, 8, 2, 4, -9, -2, 8, 1, -27, 5, 2, 9, 6, 0, -8, 11, 11, -6, 12, 2, 13, 7, 0, 7, 10, 33, -15, 2, -12, 12, -6, -9, 7, -21]
7505b1RK1k9QJ6Lk7K1k5J3L1j8qj7L0rrJK9k2JmK7rk2K6pk8L8mmj1knkMqK0Qj0
7545Ej2J1j8RJ0l3J1OkK6j2p%RJ1l5KkL4pJ0l2PK6l4J1L0rpjK0l3L3j6PLoqNK8
7585D0l8loK3j7k9K9J0j0k5RK0k5M%L8m5MJ8pj4J4jk6mM0k1M8k9%oJ3mJ6l0K7
7621A3Kl0J5nJ8j8Rj5PLNLk1RJ1j1K2m3OL2m1j0J9K5Nl9K2JPj3K0Rj8J1KJ3j9
7658Fj7L4klJ1l3KJ0JROk6J2J4k2MkMlJk1k1K7k2rL0j1L2nk4J7K1k7J0Ok9J7k8
7696c1K7nK4j7K8j7k8K9L7n7K6j7J6j0rj0J2J5j4LlQll6J4L4j1mJQl5NK6Jk8R
7732a2K6m9J0J4RJ6j5rJ3J5j3rK2k3K5j4j4L7l4L2Lm0PL6pk9oJ6%j4J0j6koRQ
7768dk1K7k9kJ8rJ0mjJ9j2lK4pJ0j1nJ7k5K1Oj7J9qj3j2Kj2J0K5k3pMPRk5J9j0
$$ y = [-21, -12, 9, -20, -12, 4, 7, -20, 1, -24, -11, 20, 2, -6, -23, 7, -2, -11, -10, 19, -3, -2, -6, 21, 12, -10, 16, 9, -19, 19, 15, 11, 0, -2, -7, -9, -5, -13, 7, 15, 5, -7, 4, -14, -5, 5, -28, -17, -11, -13, 13, 1, -6, -6, 3, 14, -21, -19, -21, 13, 6, 16, -16, -9, 17, -17, -6, 24, 15, 8, 7, 27, -6, 27, 11, 18, 21, 15, 7, 12, 40, 2, -1, -7, 16, -1, -30, -1, 9, -1, -26, -17, 3, -22, -18, -18, 20, -25, -21, -3, -10, -24, -10, -11, -37, -41, -1, -22, 26, -3, -3, -9, 4, 0, 16, -14, 13, 15, -15, 0, -5, 13, -5, 4, -11, -4, -1, 4, 7, -14, -5, 6, -5, 17, -26, -20, 12, -29, -39, -20, 5, 10, -29, -7, -6, 1, -12, 8, 17, -1, 10, 12, 25, 6, -11, 23, 21, 18, 29, -4, -2, 8, 9, 18, 24, -2, 10, 24, 2, 6, 4, 8, 5, 6, -15, -36, -9, -31, -40, -10, -21, 11, 6, -18, -1, 20, -7, 3, 9, -20, -3, -31, -4, -9, 15, -2, 26, 9, -19, 10, 47, -10, 16, -1, 15, 5, -4, -14, -2, 13, -1, 2, -1, 7, 4, -32, -18, 16, 5, 1, 2, 10, -25, -20, 6, 7, -21, -12, 14, -35, -25, -11, -2, 14, -1, -10, 3, 18, 5, -4, 18, -5, 20, 6, -8, 29, -5, 27, 30, -10, -3, 33, 26, -3, -9, 7, 7, -7, 3, -13, -15, -21, -12, -4, -25, 2, -27, -29, -11, -20, -10, -14, -15, 4, -8, -11, 13, 6, 16, 5, 0, 17, -8, 13, 19, 2, 21, 13, 0, -12, -10, -22, -12, 13, -10, -17, -13, -6, 3, -22, -3, -13]
7806a3L2l5QK1m0J0J5j6j6M5j6%j3J9j8J9Loj3K%K4j6O%rK9oPj6j2J2nqJ0J5j3
7843Fj6J8k9N1l7J4j5Qk2j0L4j4qK6ll8M1j7J9j1j9K8j3jqJ1Ol4M4l0L6l4K5j3
7877eK2J4k1jNk1oj0lQJ2k7M9k6PJmj6J3K6pl9K3jRj2j3K5l7J6K1Lk0J1J1j5Q
7914@J4Lj0qj0L0j1%j8K8kj3k3lM9l5K4k4Llmkl2M1jj1olL3k9PMrj2M3mJ9k5j8
7953a8LJ8l6L2rj1K8LKj0QL1l9J3jm3L1JJ3k5%mKPmRk2nJ3j3J0J8j0%jJ1rj6K0
7992c%Ok4J7%Mj7O%OJ1J1J3n0J7K2Jj9pMk7K1KJ6qRnK0k9j5J8l0K2Pj1mj2ORl
8032a6K1j1J2k8PK8pJ1j9omOL3j6Mj7Pj5J7j9K0nk6M3j3lMm1K6j2J6K7l4K0k3
8067a3J3kj6J3k7L6KJ6k9qJ0J7j7kPKj2jL5J0rNj6J2l7J7KJ6k7J2k1J9k7K0J5
$$ y = [-13, 19, -16, -8, 13, -27, -17, -2, -18, -34, 11, -5, -5, -18, 1, -17, 2, 5, -1, -14, -12, -12, 12, -4, 2, 2, -7, 22, 16, 23, 7, -5, 7, 2, -6, 4, 19, 6, -10, 8, -21, 30, -7, 7, -8, 0, -22, -32, 2, -12, -20, 6, 3, -35, 6, -11, 8, -3, -22, 6, -7, -8, -16, -5, 1, -33, 11, -19, 17, -17, 8, -5, 17, 31, 10, 9, 14, -7, -13, -23, -26, -18, -6, -33, 16, -10, -3, -2, -6, -22, -9, 17, 10, -29, -6, -7, 2, -10, -23, 2, -35, -19, 2, 5, -15, -4, 7, -8, 0, 14, 17, 7, -1, -11, 19, 8, 8, -10, 18, 16, 3, -20, -23, 26, -9, 15, -9, -6, -9, -13, -15, -47, -6, -7, -18, -24, -27, 6, -23, -16, -12, -21, -33, 10, 6, 25, 0, -18, -15, 3, -33, -1, -10, -21, 7, 10, 12, 2, 10, 41, 2, 15, 14, -29, 2, 3, 16, -9, -9, -13, -11, -4, -8, 1, -21, -26, -13, -26, -16, 2, -8, -8, -9, 2, -7, -23, -3, -3, 3, -21, -4, -4, 0, -17, -11, -11, -5, 6, 17, 30, -20, -3, 19, 20, 1, -6, -2, -29, -8, -6, 10, 2, 11, 6, 26, -3, -18, 0, -30, -8, -1, -12, -16, -28, -22, -13, -16, 5, -6, 6, -22, -15, 13, 6, 17, -2, -8, -12, -6, 27, 11, 15, -2, 5, -10, 7, -12, 8, 3, -23, 20, 7, 4, 8, -33, -7, -19, -3, 24, -10, 10, -13, 0, -2, -18, -5, -32, 4, 6, 22, -7, -15, -5, 12, -5, -7, 0, 2, -10, -11, 24, 34, 25, 30, 14, 26, -11, 6, 8, 24, -3, 9, -12, 7, -20, 0, 15]
8102A5j4pLj1RKpK1l1jPK8j5k0%K7j9J4J7k1k3M2k5pJ1l9O0l1K0jjJMj0K0kj9
8139cJ8j0KprJ4lRlj1k4K3k0J7qPJ0l9K0J0j3J4jj7J9NOj7J7j3lK7m6K6LQQj7
8177arOJ4MJ5m5K8j8j2K6k4J3Nm3
$$ y = [15, 1, -6, -3, -14, -5, -3, -10, 11, -20, -21, -14, 14, -1, -21, -21, 6, -13, 1, 18, -3, -26, 16, -9, -16, -5, -44, 16, -15, 5, 4, 3, 4, 8, -2, 18, 16, -3, 15, 5, 7, 0, -9, 5, 2, 11, 8, -3, -27, -4, -24, -7, -15, -8, 2, -37, -17, -7, -20, -6, -7, -24, -5, 0, 6, -11, 6, -7, -10, 17, -29, -3, 0, 8, 16, -1, -10, -4, 10, 14, 29, -16, 12, -6, -18, 8, -16, -3, 2, -41]
8191d1
$$ Imaginary data points
##PAGE= N=2
##DATA TABLE= (X++(I..I)), XYDATA
0@%%%%%%%%%%qJ6j6J8k6M0m8N6p2Q8j04J26j50J76k08K46k89L37l89M45n12N87
32C13o66P53q53R65j085J213j359J521j693J879k088K318k565K833l129L455l808
49a996M194m621N093n613O188o831P556q374R305j0383J1644j3140J4951j7198
63i225K0075k3897K9257l7391N1307q1364K57240k86135m42229O51531K41191
74C70360n74803k80114O84058L14901n88835l52545N55931K64378n73620l04407
84d84696N98052L40865n13527l21692N08379K79489n31031l29592N08752L38323
94C93322m50990l04639M67423L00176m72521l38638M33087L23312m07542k99202
104c56212M26652L15502m11867l32367L76588L08267l73161l01107L81114L19932
$$ y = [0, 0, 0, 0, 0, 0, 0, 0, 0, 0, 0, -8, 8, -8, 10, -16, 24, -24, 32, -40, 48, -56, 70, -80, 96, -112, 134, -155, 182, -207, 238, -274, 313, -353, 400, -453, 512, -573, 640, -719, 802, -891, 988, -1100, 1218, -1347, 1486, -1643, 1812, -1996, 2198, -2423, 2670, -2943, 3245, -3586, 3970, -4404, 4901, -5482, 6162, -6978, 7973, -9225, 10850, -13047, 16210, -21181, 30126, -51238, 206002, -80133, -522362, 129169, 370360, -204443, -484557, 199501, 514402, -74433, -426978, 128953, 393331, -180289, -484696, 113356, 454221, -59306, -380998, 127381, 406870, -124161, -453753, 54999, 393322, -57668, -362307, 105116, 405292, -67229, -405867, 27220, 350532, -57010, -356212, 70440, 385942, -25925, -358292, 18296, 326563, -46598, -347705, 33409, 353341]
114C53341l55050l17497L32705K96931l37001l01651L30485L11908l03363k98423
124b87615K92959K86925k94402k95108K77627K94069k56717k78390K53500K75017
134B67865k48067k79792K28331K70848k15781k59406K13800K60504k02874k59420
144b23992J86781K48134j81225k41896J77744K42898j65601k37171J55441K27424
154A88537j52946k25168J46847K24056j35711k16179J30009K09670j27407k08600
164a66892J19433K04443j11081j96489J07828J92410j03512j89934R5560J83271
174A35037r0242j76262Q7658J72585q2273j67978P5732J60545p2118j54743O8845
185d3214J50932o3221j44953N8426J38038n6031j33391N2508J28913m7712j22542
$$ y = [353341, -1709, -319206, 13499, 310430, -26571, -328222, 2263, 314171, 10808, -287615, 5344, 292269, -2133, -297241, -19614, 274455, 17738, -260652, -7152, 267865, 19798, -259994, -31663, 239185, 23404, -236002, -22202, 238302, 35428, -223992, -37211, 210923, 29698, -212198, -34454, 208444, 42843, -194328, -38887, 188537, 35591, -189577, -42730, 181326, 45615, -170564, -40555, 169115, 41708, -166892, -47459, 156984, 45903, -150586, -42758, 149652, 46140, -143794, -48234, 135037, 44795, -131467, -43809, 128776, 46503, -121475, -45743, 114802, 42684, -112059, -43214, 107718, 44497, -100456, -42030, 96008, 39977, -93414, -40906, 88007, 40295, -82247]
196h2247M4734J16942m2611j12992L8979J08129l5586j02414L3763R7993l1528
207C3162r4095K8329Q9189k5988q4325K4395Q0519k2163p6415J9663P1570j8209
219B5632o7157J6904O3336j4885n8871J3222N4079j2135n0110J0776M6003r101
231A7693m1366Q093L7047p313l3172O143K9006n223k4640M721K0698m118j6903
244i334L318J2928k799r092K644N563k238k140J873j614j829N090J856q233j714
259e721J1612J793j5040k118J8195K337k1350k566K4656K977k7792l440L0823
272A4366L798l3831m317L6911M897l9839n529M2594O138m5395o834M8165P672
285B8796n0670q497N3166R240n5674j0126N7966J1065o0168j1929O2335J2968
$$ y = [-82247, -37513, 79429, 36818, -76174, -37195, 70934, 35348, -67066, -33303, 64690, 33162, -60933, -32604, 56585, 30597, -53728, -29333, 51186, 29023, -47392, -27729, 43841, 25632, -41525, -24621, 38715, 23830, -35041, -21819, 32260, 20125, -29985, -19209, 26794, 17693, -23673, -15580, 21467, 14154, -19018, -12875, 16131, 10908, -13732, -9011, 11687, 7569, -9334, -6016, 6912, 4113, -4979, -2335, 3228, 990, -1150, 723, -891, -2720, 2370, 4226, -4007, -5721, 5891, 7684, -7356, -9474, 8721, 11058, -10292, -12858, 11798, 14775, -13017, -16457, 14366, 18164, -15667, -19984, 16927, 21824, -18015, -23544, 19050, 25188, -20207, -27041, 21124, 28796, -21874, -30371, 22795, 32035, -23639, -33765, 24201, 35266, -24902, -36831, 25504, 38472]
297C8472o4407j4033O6355J5111o8369j6200P0305J7350p2169j8559P4030J9787
309D7673p5805k1103P7641K2485p9445k3894Q1142K5298q2908k6759Q4647K8310
321E7282q6266k9774Q7838L1226q9373l2772R0751L4316r1994l5912R3127L7582
333F6031r4084l9234R4916M0868r5642m2490R6261M3970r6740m5465R7097M6971
345G2459r7301m8441R7454M9999r7431n1643R7278N3311r7187n4990R7045N6667
357G7220r6900n8282R6844N9888r6813o1429R6793O2917r6974o4250R7102O5531
369H1647r7255o6764R7367O8082r7289o9501R7205P0825r7014p2258R6683P3617
381H5345r6211p4931R5694P6274r5086p7415R4259P8532r3283p9689R2108Q0869
$$ y = [38472, -25935, -39968, 26387, 41498, -26871, -43071, 27234, 44584, -27585, -46144, 27886, 47673, -28132, -49235, 28406, 50891, -28554, -52448, 28694, 53992, -28916, -55675, 28972, 57282, -28984, -58758, 29080, 60306, -29067, -61839, 28912, 63228, -28766, -64678, 28449, 66031, -28053, -67287, 27629, 68497, -27145, -69635, 26626, 70596, -26144, -71609, 25488, 72459, -24842, -73283, 24171, 74170, -23261, -74904, 22374, 75685, -21502, -76492, 20553, 77220, -19680, -77962, 18882, 78770, -18043, -79472, 17321, 80238, -16736, -80986, 16116, 81647, -15608, -82372, 14995, 83077, -14212, -83713, 13492, 84317, -12697, -84955, 11728, 85345, -10866, -85797, 9897, 86171, -8915, -86330, 7929, 86461, -6822, -86511, 5597, 86466]
393H6466r0851q1943Q9508Q2968q8051q3895Q6570Q4757q5169q5542Q3748Q6169
405H4735q2382q6786Q1145Q7351p9794q8001P8608Q8569p7407q9178P6158Q9817
417H2835p4881r0559P3608R1292p2254r2029P0950R2758o9630r3479O8233R4113
429H0957o6824r4666O5416R5135o3878r5492O2330R5786o0815r5923N9209R5909
441G7144n7630r5797N6027R5558n4363r5191N2714R4815n1083r4292M9275R3765
453G0942m7501r3284M5720R2697m3834r2184M2113R1662m0414r1134L8773R0585
465F4141l7263r0035L5730Q9569l4276q9024L2851Q8566l1498q8045L0169Q7484
477E8369k8891q6958K7713Q6303k6497q5651K5364Q4906k4207q4042K2993Q3121
$$ y = [86466, -4385, -86328, 3180, 86148, -1903, -85798, 772, 85529, 360, -85182, -1434, 84735, 2353, -84433, -3288, 84063, 4269, -83732, -5124, 83445, 6038, -83140, -6982, 82835, 7954, -82605, -8997, 82295, 10041, -81988, -11038, 81720, 12090, -81389, -13156, 80957, 14133, -80533, -15117, 80018, 16140, -79352, -17022, 78764, 17949, -77974, -18765, 77144, 19514, -76283, -20256, 75302, 20939, -74252, -21538, 73277, 22194, -72098, -22823, 70942, 23441, -69843, -24123, 68574, 24740, -67444, -25331, 66331, 25917, -65217, -26444, 64141, 26878, -63157, -27427, 62142, 27866, -61158, -28307, 60259, 28761, -59284, -29115, 58369, 29478, -57480, -29767, 56536, 30039, -55612, -30248, 54658, 30451, -53591, -30598, 52523]
489E2523k1741q2156K0392Q1146j9123q0018J7916P8775j6646p7479J5365P6159
501D5113j4116p4880J2953P3479j1784p2093J0738P0724r717o9383Q790O7966
513C7790p790o6699O889O5415o024o4151N169O2955m363o1761L598O0619k833
526B8814n9522K169N8378j560n7283J001N6195n12n5047L5N3885M45n2659j008
540b6669N1468J505n0241j980M8941K428m7613k771M6230L109m4834l466M3453
553A9560L786m2054m103M0664M372l9271m579L7867M824l6509n065L5207N226
566A9925l3930n383L2694N529l1504n610L0342N704k9226n749K8142N745k7083
579a0404n731K5973N747k4990n655K3955N592k2876n547K1886N440k0858n387
$$ y = [52523, 30782, -51374, -30982, 50164, 31041, -48977, -31061, 47714, 31068, -46411, -31046, 45113, 30997, -43883, -30930, 42549, 30765, -41328, -30590, 40134, 30417, -38966, -30176, 37790, 30000, -36699, -29810, 35605, 29581, -34570, -29401, 33554, 29191, -32570, -28972, 31647, 28814, -30708, -28539, 29839, 28279, -29004, -28003, 28192, 27680, -27367, -27332, 26553, 26998, -25661, -26669, 24799, 26304, -23937, -25917, 23024, 25452, -22161, -24932, 21298, 24407, -20427, -23893, 19560, 23346, -18708, -22811, 17853, 22225, -17046, -21625, 16242, 21066, -15443, -20508, 14699, 19925, -14005, -19388, 13306, 18835, -12669, -18279, 12063, 17767, -11459, -17208, 10934, 16679, -10404, -16135, 9838, 15585, -9405, -15060, 8895, 14487, -8389, -13936, 7950, 13390, -7468, -12855]
592a2855J9855N206j8797n064J7798M889j6723m741J5653M597j4616m395J3555
605D362M209j2557l944J1507L737j0510l454R472L227q520k969P567K659o661
619a875k311N749K038m936j710M116J346l258j013K482O10j706k16R08j74j39
635h9O45o14j085J332J510k058j923K720K445l456k871M098L344m723l820N352
651H07M280n950m760O528N224p053n764P611O265q089o770Q584P307r113p773
666h666R509Q309r955q827J0330R371j0685r927J1062J0489j1400j1046J1698
679B62J1617j2058j2170J2438J2703j2801j3217J3164J3726j3455j4300J3769
691c22J4851j4020j5428J4263J5975j4488j6518J4659J7072j4778j7625J4822
$$ y = [-12855, 7000, 12206, -6591, -11655, 6143, 11032, -5691, -10432, 5221, 9818, -4798, -9193, 4362, 8571, -3986, -7930, 3577, 7314, -3196, -6650, 2822, 6049, -2471, -5440, 2127, 4786, -1875, -4186, 1563, 3601, -1335, -3045, 1071, 2417, -841, -1854, 628, 1238, -468, -684, 224, 50, -89, 556, -58, -1143, 189, 1699, -359, -2282, 438, 2883, -573, -3444, 654, 3998, -725, -4545, 807, 5087, -863, -5623, 905, 6129, -924, -6688, 923, 7188, -901, -7671, 913, 8220, -893, -8666, 843, 9152, -803, -9630, 700, 10071, -614, -10541, 521, 11010, -390, -11436, 262, 11879, -179, -12349, 89, 12792, -9, -13226, -62, 13664, 209, -14091, -322, 14529, 509, -14919, -656, 15319, 831, -15687, -1028, 16044, 1266, -16359, -1537]
703a537J8221j4937j8705J4926J9252j4970j9720J4981K0182j4910k0685J4842
715c060K1112j4708k1568J4574K1989j4467k2381J4374K2778j4255k3188J4120
727d680K3594j3942k4036J3811K4439j3657k4850J3528K5281j3392k5660J3216
739f348K6064j3080k6437J2891K6845j2738k7228J2547K7527j2256k7910J2078
751h045K8219j1874k8465J1609K8713j1376k8929J1130K9056j0767k9217J0438
763i508K9306j0017k9455R638K9516r206k9582Q745K9679q333k9733P891K9794
776A8735p454k9783P025K9831o623k9895O229K9921n851k9985N584L0006n310
789A2430l0028N042L0054m782l0091M520L0100m286l0075M037L0043l788l0018
$$ y = [-1537, 16684, 1747, -16958, -2032, 17220, 2250, -17470, -2489, 17693, 2783, -17902, -3060, 18052, 3344, -18224, -3650, 18339, 3872, -18509, -4135, 18643, 4388, -18800, -4680, 18914, 4972, -19064, -5253, 19186, 5529, -19321, -5793, 19488, 6096, -19564, -6348, 19716, 6636, -19801, -6910, 19935, 7197, -20031, -7484, 20043, 7787, -20123, -8045, 20174, 8300, -20165, -8556, 20157, 8781, -20148, -9018, 20038, 9271, -19946, -9508, 19798, 9781, -19674, -10036, 19480, 10274, -19308, -10563, 19116, 10783, -18950, -11059, 18735, 11281, -18502, -11477, 18354, 11731, -18164, -11935, 17986, 12135, -17850, -12266, 17740, 12430, -17598, -12556, 17498, 12716, -17375, -12855, 17245, 12959, -17116, -13079, 16964, 13176, -16842]
802a6842L573K9945l298k9822K976K9695k658k9556K379K9354k049k9141J724
815a3720K8866j375k8623J040K8351p13k8045L74K7757k6k7426l49K7162O29k6848
830a2946r48K6545J256k6296j513K6018J796k5766k066K5526K309k5260k568K5005
844A1092K786k4775k961K4519L197k4292l381K3994L571k3689l754K3424L921
857A3652k3111m117K2772M309k2448m463K2129M580k1741m712K1340M850k0959
870g919m960K0551N077k0144n216J9729N364j9309n474J8887N591j8495n725J8082
884F039N843j7705n937J7398N963j7045o000J6687O066j6378o097J6035O148j5722
898d705o178J5447O176j5140o157J4819O148j4520o136J4196O137j3909o086J3580
$$ y = [-16842, -13269, 16676, 13378, -16444, -13468, 16227, 13569, -15987, -13608, 15746, 13697, -15444, -13720, 15146, 13771, -14852, -13812, 14539, 13826, -14219, -13845, 13912, 13886, -13540, -13889, 13273, 13902, -12946, -13894, 12651, 13907, -12389, -13902, 12116, 13912, -11854, -13920, 11606, 13915, -11345, -13913, 11092, 13878, -10897, -13858, 10661, 13858, -10434, -13815, 10179, 13750, -9939, -13693, 9731, 13652, -9459, -13576, 9196, 13505, -8943, -13406, 8723, 13303, -8438, -13150, 8190, 13040, -7919, -12879, 7672, 12749, -7395, -12611, 7118, 12482, -6827, -12301, 6586, 12177, -6318, -12043, 6039, 11882, -5823, -11760, 5638, 11601, -5444, -11444, 5243, 11309, -5069, -11166, 4869, 11017, -4705, -10883, 4564, 10740, -4400, -10557, 4262, 10410, -4110, -10246, 3950, 10087, -3822, -9908, 3672]
912C672O060j3234o038J2910N987j2545n964J2160N948j1797n915J1455N825j1043
926b519n830J0727N731j0363n685R990N699r707n580R314N570r004n484Q689N391
941F939q368n328Q083N260p816n167P525N115p262n030P020M896o748m758O483
956H44M633o262m505N979M427n755m298N562M093n271l985N001L844m737l696
971d126M479L570m198l489L996L318l706l192L459L038l228k891L014K736k786
986fk559K539K426k321k268K124K099j960j895J727J744j555j542J365J376j175
1002A19j252J034J040q63q44O74O93n22n14L91K87k15j22N8q5Q5L10k39m74L75
1022f4O83n21q53O40J060p87j230Q47J488r87j692J115J869j234k004J281K204
$$ y = [3672, 9732, -3502, -9540, 3370, 9357, -3188, -9152, 3008, 8956, -2841, -8756, 2699, 8524, -2519, -8349, 2378, 8109, -2254, -7939, 2051, 7750, -1957, -7537, 1777, 7347, -1657, -7141, 1548, 6939, -1429, -6757, 1326, 6586, -1230, -6397, 1128, 6243, -1019, -6049, 971, 5867, -881, -5639, 844, 5477, -785, -5290, 689, 5116, -639, -4937, 625, 4718, -553, -4538, 463, 4307, -430, -4126, 353, 3923, -275, -3764, 232, 3550, -156, -3348, 111, 3149, -79, -2970, 44, 2780, -6, -2565, -26, 2400, 79, -2189, -65, 2034, 74, -1821, -94, 1650, 95, -1447, -82, 1294, 119, -1133, -99, 941, 78, -766, -92, 601, 79, -435, -44, 243, 28, -94, -36, -121, -36, 274, 35, -439, -64, 619, 98, -755, -115, 945, 158, -1072, -225, 1263, 276, -1416, -301, 1568, 334, -1670, -389, 1815]
1039A815j324k439J417K640j503k827J551L023j620l226J703L391j724l599J790
1054i32L775j818l999J884M191j947m377J970M555j955m747J977M943k031n080
1069c591K013N250k007n423K008N565j976n762J997N868j919o028J895O194j837
1084B247o358J804O437j680o640J676O721j616o841J538O976j431p165J414P252
1099D334j315p403J238P522j143p677J128P746j021p859R28P987q61q103Q21Q181
1115D503p09q282O30Q374n52q472M63Q522l24q586K18Q630j05q695jQ746R2q758
1133d306k15Q755L75q828m57Q810O10q812p29Q808Q65q841r65Q848J052q825j176
1150e031Q829J289q831j377Q801J501q825j608Q859J675q857j733Q829J874q821
$$ y = [1815, 491, -1948, -531, 2109, 606, -2221, -670, 2353, 733, -2493, -790, 2601, 877, -2722, -932, 2843, 1025, -2974, -1090, 3101, 1154, -3223, -1253, 3302, 1347, -3400, -1423, 3520, 1489, -3591, -1578, 3672, 1665, -3758, -1750, 3815, 1839, -3923, -1926, 3942, 2023, -4005, -2110, 4084, 2247, -4111, -2307, 4130, 2450, -4190, -2514, 4207, 2591, -4250, -2712, 4264, 2833, -4332, -2918, 4334, 3019, -4384, -3146, 4376, 3233, -4444, -3316, 4430, 3409, -4450, -3522, 4465, 3604, -4499, -3678, 4503, 3794, -4488, -3858, 4516, 3964, -4508, -4045, 4477, 4153, -4433, -4215, 4415, 4310, -4385, -4386, 4360, 4452, -4306, -4521, 4234, 4609, -4219, -4676, 4134, 4744, -4068, -4797, 4011, 4876, -3965, -4930, 3918, 4970, -3855, -5031, 3798, 5087, -3744, -5121, 3680, 5181, -3644, -5252, 3607, 5282, -3575, -5308, 3521, 5395, -3426]
1165c426j963Q793K055q779k153Q772K203q745k278Q697K395q657k486Q578K572
1180E578q511k685Q448K784q367k855Q261K971q201l066Q110L141p995l234P923
1195B302L324p851l372P727L468p651l544P556L623p454l700P393L751p309l792
1210e529P239L824p142l896P016L971o961l969O834M053o785m100O715M130o611
1225a211m159O469M238o385m240O283M270o174m329O086M316n902m384N829M400
1240E107n718m397N565M396n383m425N240M449n158m457N045M435m886m470M836
1255A79M442m705m471M588M449m463m451M372M449m273m440M162M421m100m359
1270d200L983M333l842m357L775M295l640m293L584M256l486m238L391M166l250
$$ y = [-3426, -5389, 3404, 5459, -3320, -5473, 3299, 5502, -3243, -5521, 3176, 5571, -3086, -5572, 3006, 5578, -2933, -5618, 2830, 5614, -2753, -5608, 2653, 5624, -2577, -5643, 2467, 5608, -2387, -5621, 2302, 5626, -2225, -5597, 2130, 5598, -2053, -5597, 1959, 5582, -1872, -5572, 1821, 5572, -1737, -5529, 1710, 5534, -1608, -5504, 1512, 5483, -1478, -5447, 1387, 5440, -1345, -5445, 1270, 5400, -1211, -5370, 1099, 5337, -1048, -5288, 995, 5265, -909, -5238, 848, 5164, -738, -5122, 707, 5107, -611, -5008, 557, 4953, -430, -4855, 385, 4834, -324, -4781, 264, 4699, -187, -4657, 179, 4621, -84, -4555, 33, 4482, 19, -4432, -60, 4389, 116, -4324, -162, 4259, 159, -4200, -217, 4116, 274, -4083, -308, 3987, 347, -3946, -362, 3894, 408, -3830, -439, 3727, 477]
1285D77m134L174M093l051m067K930M026k840l962K727L914k635l856K512L813
1300C121k408l728K312L640k186l633K142L503k008l447J897L429j840l352J732
1315h26L286j681l186J592L157j543l034J424K997j402k918J321K864j244k769
1330a962J208K651j090k621J046K508r59k443Q92K360q04k276P37K194o85k129
1346a373O30K025n70j906M76J844m43j775M05J693l41j588L03J465k26j448K44
1363e85J352j99j253J61J148j28j072J27R82j01r06J01P66l2p13K9O63n6n57K8
1383b45M65K0m17RL04j2k22JJ51k7n7j7PJ5O4J5j40k7K24M7k99p7L96P1m41j01
1409b93N21J17n83j37O52J42o97j80P66K47q75k53R18K72r34l34J014L58j079
$$ y = [477, -3657, -483, 3610, 559, -3508, -578, 3448, 608, -3354, -627, 3287, 652, -3204, -692, 3121, 713, -3015, -703, 2937, 751, -2882, -740, 2763, 755, -2692, -795, 2634, 794, -2558, -826, 2460, 779, -2407, -815, 2342, 799, -2235, -811, 2186, 784, -2134, -813, 2051, 807, -1962, -754, 1897, 807, -1814, -768, 1740, 781, -1662, -770, 1590, 786, -1490, -753, 1441, 756, -1373, -743, 1282, 712, -1194, -718, 1126, 683, -1092, -687, 1006, 665, -923, -620, 845, 619, -829, -585, 767, 568, -685, -524, 624, 496, -576, -449, 533, 432, -474, -373, 393, 361, -352, -323, 340, 284, -273, -245, 220, 240, -177, -168, 136, 124, -98, -97, 54, 27, -30, -47, -40, -25, 39, 54, -86, -113, 111, 158, -141, -218, 178, 249, -192, -293, 228, 345, -238, -375, 277, 419, -278, -458, 308, 555, -320, -573, 345, 617, -317, -651, 363, 721, -358]
1428c58l82J108M03j154m41J222M86j281n00J283N64j339o05J363O71j422p00
1445a082J444P38j447q32J513Q53j518q85J534R65j559j005J552J064j590j121
1461a376J617J177j605j216J575J289j592j329J573J405j606j433J579J475j573
1476d0j527J574J578j568j659J597J686j569j752J599J758j572j814J555J874
1491A720j530j904J541J932j530j940J468K003j477k011J388K102j408k125J404
1506c67K134j347k156J276K230j269k260J230K263j192k316J177K331j135k327
1521a728J059K410j079k414J048K396r88k411R44K454r23k463Q99K483q58k482
1537a653Q23K475q02k475P55K501p18k527P21K554o97k550O45K537o05k551N67
$$ y = [-358, -740, 368, 771, -383, -824, 398, 884, -397, -897, 386, 950, -389, -994, 369, 1040, -382, -1082, 362, 1100, -347, -1179, 334, 1187, -331, -1216, 318, 1283, -276, -1281, 271, 1335, -255, -1376, 241, 1418, -187, -1403, 172, 1461, -131, -1460, 113, 1518, -88, -1521, 58, 1533, -40, -1567, 7, 1585, 17, -1642, -45, 1641, 72, -1680, -81, 1677, 105, -1709, -154, 1720, 190, -1714, -173, 1759, 229, -1711, -243, 1760, 283, -1728, -340, 1762, 354, -1771, -367, 1767, 420, -1736, -460, 1770, 501, -1759, -529, 1734, 542, -1774, -597, 1734, 599, -1728, -669, 1741, 662, -1752, -704, 1692, 704, -1707, -763, 1691, 768, -1695, -796, 1687, 829, -1653, -830, 1645, 843, -1632, -877, 1624, 906, -1621, -900, 1654, 957, -1593, -948, 1589, 984, -1567, -1000]
1554a000K533n24k526M50K553m25k561L90K555l43k535L05K517k66k512K28K521
1571A360j95k488J15K541j16k505O4K516n2k486k0K505J0k454l4K434P9k445q8
1590a259K411J10k402j29K402J80k395k15K348K70k348k60K278L49k288l65K210
1607H97M10k203m37K195M67k160n03K083N96k117n65K065O14k057o23K008O41
1624A311j930p34J985O92j894p51J884P43j824p90J805Q00j759q15J734Q34j708
1641d17q61J663Q83j647q65J585Q87j515r19J489R21j477r39J440R54j428r18
1658a164J347R48j318r36J292R64j254r88J202R86j158r73J130R71j092r81J065
1675D1R89j024r79R55R71r32r75R30R39q73r27P95R55p91r28P80R20p65q97P07
$$ y = [-1000, 1533, 1009, -1517, -1067, 1486, 1061, -1500, -1110, 1445, 1102, -1433, -1128, 1389, 1123, -1389, -1161, 1360, 1165, -1323, -1208, 1333, 1217, -1288, -1224, 1292, 1240, -1246, -1266, 1239, 1249, -1205, -1239, 1195, 1274, -1171, -1259, 1152, 1262, -1140, -1269, 1133, 1313, -1082, -1297, 1051, 1321, -1027, -1287, 991, 1340, -948, -1313, 897, 1307, -896, -1333, 862, 1329, -831, -1334, 749, 1345, -772, -1337, 728, 1342, -715, -1338, 670, 1311, -619, -1353, 632, 1324, -570, -1321, 563, 1306, -518, -1308, 497, 1297, -462, -1277, 457, 1291, -417, -1278, 385, 1268, -379, -1244, 341, 1228, -287, -1206, 283, 1204, -273, -1212, 228, 1182, -246, -1164, 183, 1131, -187, -1123, 169, 1133, -121, -1109, 93, 1079, -79, -1052, 78, 1049, -43, -1024, 41, 1030, 6, -973, -18, 953, 21, -954, -24, 915, 42, -885, -90, 865, 74, -854, -74, 846, 81, -816, -109]
1695a09R17o81r22O76Q44n98q55O06Q10n38q24N22P93m85p71M45P82m27p59L91
1715a83P38l34p60L64O53k89o71L00O54k72o14K37N77k22n55J91N60j89n35J34
1735b16N50j69m80J15M54q8m36J08M09j07l96J25L64r1l09L3L02l4k86K9K42k0
1757I9k24K3K05Rj82MJ30Nj27K2O8j9m5NM3k0Ojj7K1L5Ko8l3R8J5q5m7J36N4j83
1788g1o2K05Q3k27q4K61P6k73r4K94J04l17q2K95J35l52j36L81J57m06k01M47
1810A33J76m35k19M58K06m62k34M90K59m87k85N16L04n14l36N05L64n46l68N60
1830H5L95n47m32N78M28n71m70N86N44o53m97O09N34o19n74O33N90o33o07O21
1850@O53o61o44O58O60o39o87O69O67o35p39O81P29o56p91O46Q20o78p88O44Q38
$$ y = [-109, 808, 127, -795, -119, 725, 127, -728, -122, 688, 150, -674, -152, 641, 156, -615, -170, 612, 185, -574, -183, 555, 221, -539, -175, 478, 189, -482, -182, 472, 200, -414, -177, 400, 178, -377, -186, 374, 185, -350, -216, 334, 165, -315, -200, 254, 166, -270, -162, 247, 140, -256, -131, 233, 142, -167, -134, 168, 134, -152, -123, 119, 99, -125, -102, 103, 112, -70, -66, 64, 69, -58, -36, 32, 13, -32, -27, 16, -4, 2, 1, -16, 5, 40, 42, -26, -59, 39, 54, -31, -78, 58, 112, -71, -133, 72, 155, -72, -156, 105, 181, -92, -186, 108, 212, -105, -187, 108, 243, -109, -245, 136, 293, -113, -314, 133, 309, -126, -345, 113, 319, -143, -377, 113, 372, -115, -400, 116, 420, -94, -430, 75, 439, -107, -475, 85, 480, -67, -499, 79, 507, -64, -534, 52, 596, -57, -554, 55, 589, -30, -604, 29, 619, -14, -621, 0, 653, -8, -652, 6, 666, 27, -660, 9, 676, 41, -698, -17, 712, 56, -735, -89, 731, 53, -735, -91, 747]
1871G47o56q45O12Q85o04r30O15R51o11r51N87R95o17r65N57J034n72j046N65
1890b49J059n26j101N69J079n30j143N24J151n17j159N25J133m96j168M78J203
1907H32m60j219M61J186m11j240M35J258m21j249L65J292l68j270L42J254k76
1924E11j288K91J306k82j362K67J334k05j344J93J364j83j370J86J349j65j359
1941g57J29J378j17j387J53J316r2j340P1J380r2j373Q3J342m0j343K5J352mj345
1961f61k9J355L7j369m7J401J5j320p9J312J30j334j32J318J54j315j75J313J75
1980G49j278k40J300K34j283k37J262K33j205k99J224K98j198l07J167L37j176
1997d19l48J169L62j158l81J170L81j135m11J122M16j100m02J060M10j026m60
$$ y = [747, 91, -754, -142, 743, 139, -791, -176, 775, 164, -787, -200, 795, 178, -787, -230, 804, 232, -814, -249, 810, 284, -817, -248, 831, 301, -842, -318, 833, 316, -843, -318, 815, 319, -849, -371, 832, 372, -847, -386, 800, 389, -851, -416, 842, 421, -828, -463, 829, 461, -809, -467, 787, 511, -777, -486, 820, 538, -824, -557, 777, 572, -772, -579, 785, 602, -768, -582, 767, 602, -757, -628, 750, 633, -754, -601, 715, 623, -717, -646, 734, 642, -731, -648, 694, 654, -689, -664, 688, 684, -661, -690, 665, 702, -667, -714, 687, 702, -618, -697, 615, 745, -589, -721, 597, 751, -564, -739, 574, 749, -529, -769, 531, 765, -518, -755, 507, 740, -465, -764, 460, 758, -440, -747, 420, 757, -419, -767, 402, 764, -394, -775, 395, 776, -359, -770, 352, 768, -332, -734, 326, 736, -290, -750]
2014g50J073M04j015m49J037M29j008m32R72M66r77m59R40M95r48m45Q77M65q82
2033b07m91R03M90q87m92Q40N09q43m86P98N10p92m90P62M84p29n12P35N15p14
2053i7m98O98N03o82n04O52M86o17n18O41M98n90m93N64M90n63m95N20N02n10
2073a3m81N10M69m77m86M53M81m67m31M43M37m12m63M12M40m02m10L66M02l63
2093Hm02L48M33l47m02L49L55l09l30K57L53k28l93K53L35k10l50K57K74k25k71
2114b45J79K86j81k83J88K66j89k26J67K26j32k09R4K05r6j95J01J69p1j69R0
2135b5J39q5j36R1J13o3j13O6P5l2m4lO5l7k9K0J5q%qk9J8QRm6J5P1qj02K5J13
2166G5j3j37JJ40mj60K1J67k3j65L3J92l8j88J3K35l2k32j4L02m4k56j4L08ol11
$$ y = [-750, 323, 727, -288, -737, 300, 729, -279, -711, 261, 727, -250, -709, 231, 726, -222, -667, 210, 675, -207, -698, 205, 695, -192, -684, 156, 665, -178, -664, 134, 644, -148, -638, 124, 608, -121, -633, 102, 617, -97, -595, 103, 606, -76, -580, 72, 558, -59, -577, 64, 562, -28, -521, 43, 533, -30, -525, -5, 497, -13, -494, 16, 485, 8, -478, -25, 456, -11, -442, 1, 438, 26, -437, -25, 415, 13, -397, -31, 371, 8, -394, -46, 387, 40, -362, -13, 342, 33, -297, -40, 313, 85, -308, -55, 280, 70, -280, -23, 251, 26, -245, -66, 220, 39, -244, -56, 210, 21, -205, -38, 188, 56, -153, -59, 146, 50, -145, -44, 125, 54, -115, -25, 114, 29, -107, -16, 97, 34, -79, -13, 62, 30, -14, -17, 48, 11, -18, 2, 17, 9, 9, 1, -28, -10, -2, 7, -39, -24, 47, 39, -63, -38, 75, 62, -75, -74, 66, 62, -98, -77, 90, 67, -98, -65, 127, 89, -99, -86, 149, 117, -115, -129, 173, 129, -127, -141, 167, 161, -150]
2192a50j0L71j2l67LL64jl84nL69N0m25k1M38K3m31n3M61L2m70o2M89P3m84r8
2217c00N20Q3n16j12N75Q5n66j08N82Q6n71j10O00J02n93j43O21J53o07j44O14
2238B51J35o33j66O68J62o62j90O45K33o60k17O62K34o85k59P25K28o97k81P32
2258B25K79p10l03P15L12p14l06P16L27p28l46P60L57p89l52P30M04p72l73P55
2278A87L60p03m39P54M41p71m15P62M55p65n02P60M88p63n03P79N13p69n14P70
2298A25N37p68n50P74N44p55n57P22O07p75n59P63N51p15o37P53O15p17o53P33
2318C8O60p35o58P20O91p49o64P38O78p33o99P22O99p06p30P06P27p04p09O89
2338a9P29o64p75O85P55o64p62O82P20o03p82O47P60o22p68O16P68o11p60N71
$$ y = [-150, -160, 211, 199, -168, -165, 199, 198, -186, -191, 178, 228, -197, -218, 220, 243, -188, -241, 220, 252, -218, -280, 209, 282, -202, -300, 220, 303, -213, -325, 250, 335, -231, -339, 243, 329, -242, -352, 248, 350, -243, -386, 235, 388, -219, -363, 251, 386, -247, -413, 255, 417, -245, -435, 210, 443, -217, -434, 228, 462, -223, -482, 243, 471, -226, -507, 225, 504, -206, -509, 206, 518, -196, -502, 214, 541, -187, -533, 227, 584, -205, -557, 173, 577, -195, -568, 187, 547, -156, -595, 159, 600, -171, -586, 176, 631, -134, -636, 124, 612, -151, -654, 125, 638, -131, -645, 125, 662, -106, -656, 118, 662, -93, -650, 72, 679, -96, -655, 108, 659, -56, -693, 60, 675, -42, -695, 38, 698, -37, -695, 25, 716, -33, -697, 41, 719, -14, -713, 9, 708, 2, -728, -22, 705, 1, -708, -19, 710, 46, -729, -44, 711, 47, -715, -33, 687, 84, -698, -51, 709, 87, -681, -65, 703, 92, -668, -97]
2358i7Q04n66q25N77P85n75p74N61P93n21p92M90Q13n33q18N37Q12n12q38N20
2378a59P73m50q04M71P90m49q12M63Q28m81p70M07Q02l90q35M21Q17m01q00L65
2398b14P87l51p94L53P61k94p95L17P71k82p76K69P44k30p50K39P50k45p54K06
2418b88P41j85p57K22P27j92p28J57P49j62p33J67O82j26o88J30O88j19o67R9
2438b83O52q9o19O9O39r2o23P7O15q6n79M4N48Jn87L1N68l1n30J9N35l8m91m3
2462b93N31K9n01j6N00j4m87L9M34K5m44OM04%m05l2L86L0l41n3L78L2l36k3K83
2487A32N7l19l3K79N9k94p0K94O5k82m3K52M4k33n1K12N4k04m4J72M8j63l8J67
2511F1K9j29m7J40j3p9k0O9M1j10K9N1M2n3j9L9j9j8LM1k3m3N0k4j6K9J8n1j4
$$ y = [-97, 707, 141, -684, -107, 678, 103, -671, -110, 683, 162, -630, -140, 673, 140, -678, -141, 671, 159, -679, -159, 614, 164, -640, -169, 621, 172, -640, -177, 651, 170, -600, -193, 609, 219, -616, -195, 622, 221, -579, -214, 573, 222, -572, -219, 542, 248, -547, -230, 541, 259, -517, -248, 496, 266, -484, -245, 505, 260, -494, -288, 453, 268, -489, -267, 460, 268, -460, -303, 446, 284, -449, -282, 400, 274, -414, -284, 404, 285, -382, -283, 369, 280, -339, -270, 369, 277, -346, -269, 346, 260, -319, -275, 273, 274, -313, -282, 286, 255, -275, -256, 279, 241, -250, -293, 238, 267, -234, -250, 250, 236, -251, -212, 222, 247, -197, -191, 213, 213, -192, -224, 162, 192, -149, -202, 176, 208, -128, -151, 132, 189, -130, -163, 116, 175, -119, -189, 105, 170, -112, -155, 97, 141, -92, -143, 69, 123, -81, -125, 47, 95, -68, -106, 61, 90, -39, -86, 54, 41, -38, -58, 11, 52, -58, -29, 22, 64, 11, -8, 31, 12, -6, -3, 38, 15, -28, 22, -2, -18, 11, 29, -22, -36]
2540c6O9K3p1k1N3P1j19l8N8J01j10q3J18Q7j21q8J02J42j54j11J59J06j60j47
2564a70J80J53j68j35J50J86k11j49J73K08k28k05K26J86k10k13K20K43k27k65
2584b56K40K65k59k51K77K38k35k96K28L34k75k95K42L61l25k80K52L54k72l74
2604c27K82L76k95l72K97L68k91l84K90M43l13m22K73M42k55m73K82M42k83m50
2624c70L14M48l05m80L20M60k84m83K76N39k91n43K73N35k70n48K85N45k82n58
2644d19K70N83k76n95K78N80k37o28K78O09k59n98K02O22k16o22K04O41j94o41
2664d18J90O57k06o48J75P17j94p18J84O63j10p28J40P37j48p30J31P18j22p06
2684d16J18P27j18p05P8P20q0p27R7P13p3p55P9P48n3p55P4P13mp58J7P27rp48
$$ y = [-36, 33, 56, -15, -36, 17, 88, -31, -69, -11, 90, -20, -103, 15, 102, -19, -107, -5, 137, -17, -128, 31, 137, -23, -170, 10, 163, -5, -140, 10, 196, -15, -164, 9, 217, -11, -216, 10, 196, -14, -227, -7, 236, 9, -256, -16, 249, -10, -261, 16, 254, 19, -277, -49, 285, 10, -285, -43, 318, -7, -287, -35, 319, 47, -327, -45, 331, 36, -336, -39, 329, 38, -346, -56, 387, 74, -348, -75, 367, 112, -361, -79, 363, 80, -370, -56, 392, 87, -393, -73, 387, 103, -380, -104, 435, 144, -399, -126, 409, 139, -409, -124, 421, 139, -419, -149, 434, 158, -437, -159, 421, 184, -444, -166, 443, 184, -414, -212, 410, 194, -428, -224, 417, 223, -418, -228, 429, 223, -425, -250, 467, 273, -445, -261, 402, 292, -436, -296, 441, 293, -437, -306, 412, 290, -416, -298, 429, 311, -394, -316, 404, 324, -403, -306, 407, 334, -421, -342, 406, 353, -402, -328, 385, 381, -377, -360, 367, 358, -390]
2708c90K4P35Jp24nP28J8p18m5P45J6p45n8P76N9p60o5P33J09p33r9P18Q8p11
2732c03j14P37J11p23j23O98J12o80j35O94J51p05j36O74J76o83j75O49J91o65
2752b49j89O69J89o60k10O81J96o27k43O72K02o37k40O26K60o42k15N92K48o13
2772a90k15N70K69o02k59N83K71n81k53N59K51n16k87N46K48n19k76M84L07m78
2792h8l11M80L20m89l01M59L07m63k96M56L03m45l21M34L05l89l47M31L32m31
2812e4k90L64L29l94l09M09L17l83l09L53L10l51l16L46K94l12l00K97L06l31
2832b4k38K73K82k89k79K76K86k85l00K58L19k65k74K58K75k53k56K02K85k31
2852B0k58J91K74j96k46J76K62j56k48J65K10j63k17J63J89j28k19J29K32j43
$$ y = [-390, -366, 369, 370, -354, -359, 369, 387, -331, -376, 369, 385, -360, -418, 358, 417, -343, -408, 325, 434, -299, -398, 320, 408, -303, -417, 320, 431, -292, -415, 283, 395, -285, -420, 274, 425, -280, -416, 258, 434, -249, -424, 225, 416, -249, -438, 231, 420, -240, -450, 231, 427, -200, -443, 229, 431, -206, -446, 180, 440, -202, -417, 175, 423, -190, -405, 165, 434, -168, -427, 156, 427, -154, -407, 152, 403, -113, -400, 146, 394, -125, -401, 83, 390, -88, -399, 81, 401, -88, -389, 70, 377, -86, -382, 74, 377, -68, -389, 45, 350, -39, -386, 45, 377, -54, -344, 20, 349, -45, -354, 55, 372, -11, -320, 33, 343, -8, -324, 22, 316, 4, -296, 1, 307, -24, -262, 11, 293, 4, -275, 1, 287, 2, -298, -40, 279, 14, -260, -2, 273, 20, -236, -34, 251, 20, -238, -47, 227, 31, -215, -39, 223, 67, -181, -16, 194, 31, -186, -23, 166, 38, -181, -52, 180, 37]
2872C7j77J20J88j28j55Q5J32p3j52O6J76j02j22Q0J04n9j34M9J47m1j00J4J04
2895E9k1q6J0J06r1j6mP5k3k9J7L5oj6JqJ0Ljk2PL0k3lmM1qp6K2L6K8p6k3J01
2929D5k8q7KJ15J1j06QQ6J4j09k7J47nj54jJ76oj40k4J79J7k12J3K01ok07k4K17
2957I5M9k29m3K21M7k56k9K53K7k48j7K38M0k78m0L07L5l05m6K84O1k72o8K97
2981A23O7l29n2L08Q2l39p8L49M5k99p8L53N8l57n8L46R7l89p6L48J26l47j43
3004b43L65J21l44j40L36J85l90j59L69J64l88j50L92J33l65j72L87K01m41j48
3024b87M02J64m07j72M14J95m47j61M04J94m33j84M44K16m52k23M15K43m18k38
3044c31M18K72m38k69M47K47m32k74M09L00m39k58M13K89m40k87M27K77m00k99
$$ y = [37, -140, -20, 168, 40, -115, -30, 102, 29, -123, -57, 119, 17, -105, -25, 79, 20, -114, -65, 82, 41, -59, -45, 59, 38, -48, -38, 68, -23, -39, -43, 32, 9, -20, -3, 32, 26, 10, 11, 3, 13, 16, 15, -7, 0, 30, 7, 4, 0, 41, 33, -43, -21, 15, 43, -33, -56, 45, 17, -70, -68, 47, 58, -48, -40, 46, 60, -49, -76, 71, 66, -88, -89, 87, 81, -59, -83, 96, 113, -99, -86, 115, 109, -98, -122, 95, 144, -85, -128, 93, 140, -116, -145, 108, 135, -113, -130, 108, 148, -130, -170, 137, 172, -133, -179, 105, 166, -106, -174, 123, 190, -139, -191, 117, 199, -140, -218, 131, 176, -123, -201, 152, 210, -147, -205, 141, 238, -151, -227, 121, 247, -100, -243, 122, 243, -101, -241, 95, 280, -110, -269, 100, 264, -124, -274, 118, 251, -114, -286, 101, 302, -139, -287, 115, 279, -128, -300, 114, 309, -138, -299, 105, 299, -134, -318, 126, 342, -110, -333, 82, 325, -93, -331, 87, 359, -79, -348, 99, 346, -86, -360, 49, 349, -90, -348, 65, 354, -86, -373, 54, 331, -69, -368]
3064c68M51K75m36k97M46K72m08l04M00L26l88l36M01L43m12l37L79L88m20l63
3084c88M04L66l90l51L97L46l86l95M20L39l68l92L60M15l46m16L56M07l58m09
3104c89L47L83l01m09L35M03l53l56K68M41l44m01L30L95l13m07L28L88k66m43
3124c64K96M19k88l92K47M38k83m28K72M25k45m23K44L84k27l96K07M64k37m32
3144c19J97M35k23m03J98M06j92l87J48M42k06m09J59M19j53l90J49M19j53m43
3164c06J76L74r2m27J21M23j46l96J46L72j26l54O8L86n5m14P8M19j19l50Q6L21
3186A85n2l69R0L43o3l46O2L64p6l28L8L41l4l60L6L73o7l20L7L01J8l32K5L11
3210A77m7k68mL00k3k83PK61Rk92M5K35Ok43j0K47j2k28J1K09pj89j4K06Rk15
$$ y = [-368, 83, 358, -78, -375, 71, 343, -65, -369, 31, 357, -31, -367, 34, 377, -35, -372, 7, 395, -25, -388, 16, 382, -8, -359, 38, 384, -2, -397, 23, 362, -6, -398, -38, 377, 31, -385, -29, 378, 20, -389, -42, 341, 40, -369, -34, 369, 16, -340, -72, 369, 25, -376, -46, 349, 36, -371, -43, 345, 79, -364, -68, 351, 63, -329, -82, 356, 73, -355, -83, 342, 97, -326, -82, 302, 75, -321, -114, 350, 113, -319, -122, 313, 90, -313, -115, 291, 99, -288, -140, 302, 96, -313, -154, 265, 112, -278, -129, 290, 137, -306, -130, 244, 152, -275, -154, 269, 123, -273, -127, 245, 119, -235, -167, 219, 164, -250, -172, 247, 128, -222, -136, 185, 133, -236, -146, 197, 134, -212, -150, 214, 138, -190, -152, 189, 155, -205, -169, 204, 137, -183, -146, 155, 173, -159, -134, 177, 130, -138, -142, 158, 135, -148, -141, 120, 129, -163, -118, 117, 123, -120, -130, 117, 105, -123, -112, 97, 90, -99, -113, 93, 102, -113]
3236a13k4K30j3j80KJ58J6j38n1J80K8j72k2J74j4j26MJ10L8j41m4J71J3j31k2
3261f7J00M3j07j4Q3Or9%M8K3o2oQ1Pq2lQ8k6k9pL1Kl2PK0oMj2oJ9Oj5J3oJ4m
3297A2j1NkPMk3pJ2Pl3M1L1o2m3P1K0m5l3M3N0n8n7P2L5q2k5R1N4j03l1M1Q4j00
3330c5l7P3Q1j04o9J04P9r4o8R3P5r8j00J23N1p2q6R5R7j11j00J15R9j24j30J30
3356a3J40j40j20J48J07j43r4J11J34j33j28J35J22j35j31J48J03j30j07J29J36
3377A39j47j45J58J34j36j50J50J55j46j67J53J50j50j76J59K01j99j69J57K01
3397A72j52j86J46J86j80j86J75K04j82j92J60K24j77k12J73K04j58k13J61K44
3417B11k15j97K04K12j80k16J47K24j59k41J74K24j56k37J64K61j77k73J66K71
$$ y = [-113, -137, 93, 80, -100, -98, 60, 76, -62, -113, 67, 95, -77, -99, 75, 61, -65, -61, 49, 87, -54, -98, 73, 86, -45, -67, 33, 76, -31, -45, 38, 44, -55, -55, -7, 16, -46, -52, 29, 36, -46, -49, 39, 13, -16, -23, 8, 10, -22, -15, 5, -1, 3, -9, -15, 4, 10, -5, 8, 2, 16, 12, 1, 6, 4, 11, 15, -8, -15, -3, 4, -29, 12, 43, -19, -62, 9, 29, -16, -49, -6, 44, -14, -71, 1, 36, -46, -71, 20, 74, -29, -60, -19, 65, -35, -72, 1, 82, -22, -91, 13, 92, -2, -70, 23, 98, 0, -100, 23, 74, 2, -84, 11, 108, -3, -103, 12, 111, -13, -143, -13, 127, -13, -133, 15, 122, -21, -115, -4, 130, -3, -131, 4, 126, -9, -140, 8, 111, -19, -126, 3, 139, -8, -153, 5, 139, 3, -147, 3, 158, 12, -155, -2, 148, -2, -178, -19, 182, -17, -186, -29, 172, 20, -166, -20, 166, -14, -200, -25, 179, -3, -195, -35, 189, 12, -200, -27, 177, 19, -194, -33, 211, -4, -201, 3, 215, 35, -181, -34, 190, 31, -210, -36, 188, 32, -205, -41, 220, 43, -230, -64, 207]
3437B07j87k54J89K61k01k35J93K09j57k37J57K64j46k51J31K64j51k62J21K80
3457A95j36k72J34K89j38k95J33L13j46k71J46K62j59k69J46K76j33l21J34L09
3477A97j12l11J33L03j14l22J17L00j00l21J20L17j19k82P7K75o1l13J27L02r3
3498A20l03P7L04p1l10O6L22j10l02P2L41p7l14N3L23p7k81L2L03n4k84L1K88
3521A49k3k97K8L00k9l16M1L04l3k77J5K86j4k75j4K94kl00J3K82pk62l3L06J8
3546A54k80nK82Pl10J7K70K6k92j4K81J4k86j3K79Qk90nK45K8k29n3K61L1k44
3571a18l1K40J9k15n0K56J0k22j0K13L4k33j9K12M8k09m8K10N5k03m0J61O5j99
3595g4m4J74M5j57k9J31L9j48o7J73O7j83k2J07P1j47m7J71K5j50m4J52L6j21
$$ y = [207, 20, -234, -45, 216, 15, -220, -27, 182, 25, -212, -55, 209, 63, -188, -57, 207, 56, -206, -85, 195, 59, -213, -79, 210, 72, -223, -90, 223, 77, -194, -48, 214, 55, -214, -68, 208, 75, -246, -112, 197, 85, -226, -93, 210, 96, -226, -109, 191, 91, -230, -110, 207, 88, -194, -117, 158, 97, -216, -89, 213, 120, -183, -106, 198, 127, -183, -117, 205, 95, -207, -135, 206, 129, -185, -132, 191, 114, -167, -135, 168, 114, -170, -139, 149, 126, -171, -143, 157, 128, -188, -147, 157, 124, -153, -138, 148, 134, -141, -155, 139, 137, -163, -150, 132, 125, -137, -170, 136, 154, -126, -131, 151, 158, -152, -135, 135, 161, -131, -145, 136, 150, -136, -149, 130, 138, -152, -157, 88, 116, -113, -166, 95, 126, -118, -149, 91, 110, -105, -155, 101, 111, -111, -121, 92, 126, -107, -126, 86, 134, -75, -123, 87, 142, -61, -101, 60, 125, -74, -118, 56, 101, -56, -85, 46, 85, -63, -130, 43, 110, -73, -95, 12, 83, -64, -111, 60, 85, -65, -109, 43, 79, -42]
3619d2n2J05P2j22l0Q8M8j00l5J16K3j12k6J14Lo3l8P4L9r7m2R7M5o8o7P8L0m2
3647dj7J5L8n0j7K2M3l0o0L6L6k2j2K1K9k6l7M8ol9L7J4k2mJ1%MKj3Mj0mK1Jm5
3682c6jM5J4m0J1K3j3jQJ9j5m6RN6l5k6K4K3k5k9M4N0m9n0K1L7j5o0P2L0l3l2
3714b0j3Q0l4p7N9P3l1q4L2O0j8r0M2O9j8j08O7P6m0q2L5P4k9j04Q3P5n0j02K9
3743d6R0l2q1M4R7m4p2pJ21k3j04K6J07l2j15K9R5Mj11QJ28k5j41N0J10o0p7N3
3771hR3n0j09L2J20m2j03K2J13k2j43M4J27m6j26M9J19k2j53O2J14k5j51L8J14
3796D7j4j25J5J52n2q5K0J20nj50K4J44k8j51L8J10J6j63K5J18J4j44L4J07K3
3821I0j49j1J27Kj22k6J49j5j36M3J19k9j33K6J34k4j26J8J40k4j21nJ21mj20
$$ y = [-42, -94, 11, 83, -39, -69, 19, 67, -33, -68, 48, 71, -41, -67, 47, 50, -13, -51, 23, 62, -35, -77, 20, 65, -3, -70, 8, 38, -4, -21, -6, 32, -18, -35, -13, 30, 0, -60, -24, 12, -10, -22, -1, 28, 2, -35, 13, 7, -32, 5, 19, -3, -7, 4, 4, 8, 10, -3, 1, -9, -13, 8, 9, -36, -37, 8, 22, -18, -7, 16, 3, 2, 10, 29, 14, -32, -23, 33, -2, -28, -4, 19, -6, -35, 9, 59, 10, -40, -19, 18, 3, -57, 15, 45, 12, -20, -33, 47, 13, -64, -5, 68, 37, -47, -15, 45, 27, -63, -21, 48, 30, -78, -11, 65, 25, -57, -22, 52, 23, -81, 2, 77, 27, -75, -46, 44, 12, -69, -25, 72, 28, -44, -51, 70, 47, -57, -31, 76, 44, -71, -42, 53, 57, -54, -46, 82, 57, -84, -34, 76, 16, -61, -8, 85, 35, -74, -42, 78, 36, -67, -45, 68, 46, -97, -53, 74, 28, -98, -49, 70, 48, -105, -43, 71, 46, -105, -67, 47, 33, -92, -77, 75, 23, -62, -42, 78, 73, -77, -53, 91, 63, -88, -50, 60, 76, -87, -62, 56, 70, -74, -40, 67, 90, -59, -70, 57, 59, -63, -89, 60, 45, -91, -48, 71, 42, -91, -65, 69, 45, -81, -63, 77, 53, -68, -73, 48, 44, -76]
3846g6K5J44k8j43K3J37k9j14PJ38m0j06J8J22k0j06MJ21k1j22j2J12j9r6K6J14
3872E9Kj37J0J27j1j30K9J18k5j08OJ42kj39K2R8J0j16qJ26oj33L4J13Nj30k7
3899g1R3K9j18J0J08kj15j1J38lj26J3R7k5n5k4P2J8q5mP2M3j06j0J02Nj20J3
3927f2J05M2j29j8J26k2p6%N9J9j01j5J05L0r4NQ6j4o6k6O9L1r7nQ7j9q0K3P9
3956D2k0n2j8P1K1o8j2N3J5n7l8Q8L3n2l2P2mo9QM7Po3k6O8K2n2k6N3mj5j3K9
3988HK5o0JL9km2J3K8J9k9k7M6pk8RO0l6l4LJ5M3n5k1M6J1n6lM5J1l6mL5Rn4J7
$$ y = [-76, -51, 93, 65, -78, -55, 82, 53, -61, -54, 84, 44, -62, -44, 78, 58, -48, -44, 77, 56, -66, -78, 34, 15, -81, -55, 59, 61, -76, -66, 61, 50, -80, -51, 67, 42, -66, -60, 82, 80, -59, -37, 61, 71, -45, -53, 73, 67, -66, -32, 81, 86, -44, -71, 22, 51, -67, -57, 51, 49, -66, -77, 61, 58, -68, -55, 42, 17, -38, -62, 10, 28, -57, -61, 11, 54, -52, -62, 40, 45, -75, -62, 43, 85, -44, -62, 64, 42, -34, -34, 25, 44, -57, -72, 33, 63, -31, -26, 60, 46, -20, -46, 23, 54, -43, -48, 39, 20, -60, -37, 42, 22, -30, -48, 23, 44, -24, -36, 17, 32, -25, -63, 25, 58, 6, -26, 46, 42, -27, -19, 28, 35, -28, -54, 14, 36, -16, -42, 11, 7, -8, -21, 8, 33, -27, -26, 13, 11, -31, -18, 10, 29, 0, -27, 19, 12, -16, -7, 53, 17, -17, -14, 1, 44, -11, -32, 14, 25, -31, -34, 11, 22, -14, -18, 17, 26, -28, -11]
$$ [...]
8191a0
##END NTUPLES=NMR FID
##END=
