##TITLE=1H_ES-prec-AC-nmpta
 D2O
 8 sc, 
 13.04.2022
##JCAMPDX= 6.0         $$ Bruker NMR JCAMP-DX V2.0
##DATA TYPE= NMR FID
##DATA CLASS= NTUPLES
##ORIGIN= UXNMR, Bruker Analytische Messtechnik GmbH
##OWNER= root
$$ XWIN-NMR		Version 3.5
$$ Wed Apr 13 14:42:54 2022 Russian Standard Time (UT+4h)  she@DPX200
##.OBSERVE FREQUENCY= 200.13135
##.OBSERVE NUCLEUS= ^1H
##.DELAY= (6, 6)
##.ACQUISITION MODE= SIMULTANEOUS
##.ACQUISITION SCHEME= undefined
##.AVERAGES= 8
##.DIGITISER RES= 18
##SPECTROMETER/DATA SYSTEM= spect
##.PULSE SEQUENCE= zg30
##.SOLVENT NAME= D2O
##.SHIFT REFERENCE= (INTERNAL, D2O, 0, 15.7039)
##AUDIT TRAIL= $$ (NUMBER, WHEN, WHO, WHERE, WHAT)
$$ ##TITLE= Audit trail, XWIN-NMR		Version 3.5
$$ ##JCAMPDX= 5.01
$$ ##ORIGIN= Bruker BioSpin GmbH
$$ ##OWNER= she
$$ F:/spectra/data/she/nmr/H-F/1/audita.txt
$$ ##AUDIT TRAIL=  $$ (NUMBER, WHEN, WHO, WHERE, WHAT)
(   1,<2022-04-13 14:40:02.25 +0400>,<she>,<DPX200>,
      <created by zg, POWCHK disabled, PULCHK disabled
       configuration hash MD5:
       00 E9 B6 7A A2 85 ED C7 34 08 36 98 17 FE 4E 26
       data hash MD5: 16K
       D0 7D 1E 3C 4E 14 12 22 C8 EF FA CE 54 E9 F2 A3>)
$$ ##END=
$$ 
$$ hash MD5
$$ 15 39 1D 59 74 00 F3 3D 0B 21 76 89 B4 CD C3 84
##$RELAX= 
##$RELAX= 
##$RELAX= 
##$RELAX= 
##$RELAX= 
##$RELAX= 
$$ Bruker specific parameters
$$ --------------------------
##$DU= <F:/spectra>
##$EXPNO= 1
##$NAME= <H-F>
##$PROCNO= 1
##$TYPE= <nmr>
##$USER= <she>
##$AMP= (0..31)
100 100 100 100 100 100 100 100 100 100 100 100 100 100 100 100 100 100 
100 100 100 100 100 100 100 100 100 100 100 100 100 100 
##$AQSEQ= 0
##$AQ_mod= 1
##$AUNM= <au_zg>
##$AUTOPOS= <>
##$BF1= 200.13
##$BF2= 200.13
##$BF3= 200.13
##$BF4= 200.13
##$BF5= 200.13
##$BF6= 200.13
##$BF7= 200.13
##$BF8= 200.13
##$BYTORDA= 1
##$CFDGTYP= 0
##$CFRGTYP= 5
##$CHEMSTR= <none>
##$CNST= (0..31)
1 1 145 1 1 1 1 1 1 1 1 1 1 1 1 1 1 1 1 1 1 1 1 1 1 1 1 1 1 1 1 1 
##$CPDPRG= <>
##$CPDPRG1= <>
##$CPDPRG2= <>
##$CPDPRG3= <>
##$CPDPRG4= <mlev>
##$CPDPRG5= <mlev>
##$CPDPRG6= <mlev>
##$CPDPRG7= <mlev>
##$CPDPRG8= <mlev>
##$CPDPRGB= <>
##$CPDPRGT= <>
##$D= (0..31)
0 1.2 0 0 0 0 0 0 0 0.06 0 0.03 0 0 0 0 0.0002 0 0 0 0 0 0 0 0 0 0 0 0 
0 0 0 
##$DATE= 1649846401
##$DBL= (0..7)
120 120 120 120 120 120 120 120 
##$DBP= (0..7)
150 150 150 150 150 150 150 150 
##$DBP07= 0
##$DBPNAM0= <>
##$DBPNAM1= <>
##$DBPNAM2= <>
##$DBPNAM3= <>
##$DBPNAM4= <>
##$DBPNAM5= <>
##$DBPNAM6= <>
##$DBPNAM7= <>
##$DBPOAL= (0..7)
0.5 0.5 0.5 0.5 0.5 0.5 0.5 0.5 
##$DBPOFFS= (0..7)
0 0 0 0 0 0 0 0 
##$DE= 6
##$DECBNUC= <off>
##$DECIM= 32
##$DECNUC= <off>
##$DECSTAT= 4
##$DIGMOD= 1
##$DIGTYP= 9
##$DL= (0..7)
0 120 120 120 120 120 120 120 
##$DP= (0..7)
150 150 150 150 150 150 150 150 
##$DP07= 0
##$DPNAME0= <>
##$DPNAME1= <>
##$DPNAME2= <>
##$DPNAME3= <>
##$DPNAME4= <>
##$DPNAME5= <>
##$DPNAME6= <>
##$DPNAME7= <>
##$DPOAL= (0..7)
0.5 0.5 0.5 0.5 0.5 0.5 0.5 0.5 
##$DPOFFS= (0..7)
0 0 0 0 0 0 0 0 
##$DQDMODE= 0
##$DR= 18
##$DS= 0
##$DSLIST= <SSSSSSSSSSSSSSS>
$$ [...]
##$SUBNAM2= <"">
##$SUBNAM3= <"">
##$SUBNAM4= <"">
##$SUBNAM5= <"">
##$SUBNAM6= <"">
##$SUBNAM7= <"">
##$SUBNAM8= <"">
##$SUBNAM9= <"">
##$SW= 18.05172834244
##$SWIBOX= (0..15)
0 0 2 0 0 0 0 0 0 0 0 0 0 0 0 0 
##$SW_h= 3612.71676300578
##$TD= 16384
##$TD0= 1
##$TE= 0
##$TE2= 300
##$TE3= 300
##$TEG= 300
##$TL= (0..7)
0 120 120 120 120 120 120 120 
##$TP= (0..7)
150 150 150 150 150 150 150 150 
##$TP07= 0
##$TPNAME0= <>
##$TPNAME1= <>
##$TPNAME2= <>
##$TPNAME3= <>
##$TPNAME4= <>
##$TPNAME5= <>
##$TPNAME6= <>
##$TPNAME7= <>
##$TPOAL= (0..7)
0.5 0.5 0.5 0.5 0.5 0.5 0.5 0.5 
##$TPOFFS= (0..7)
0 0 0 0 0 0 0 0 
##$TUNHIN= 0
##$TUNHOUT= 0
##$TUNXOUT= 0
##$USERA1= <user>
##$USERA2= <user>
##$USERA3= <user>
##$USERA4= <user>
##$USERA5= <user>
##$V9= 5
##$VALIST= <valist>
##$VCLIST= <CCCCCCCCCCCCCCC>
##$VD= 0
##$VDLIST= <DDDDDDDDDDDDDDD>
##$VPLIST= <PPPPPPPPPPPPPPP>
##$VTLIST= <TTTTTTTTTTTTTTT>
##$WBST= 1024
##$WBSW= 4
##$XGAIN= (0..3)
0 0 0 0 
##$XL= 0
##$YL= 0
##$YMAX_a= 680543
##$YMIN_a= -664372
##$ZGOPTNS= <>
##$ZL1= 120
##$ZL2= 120
##$ZL3= 120
##$ZL4= 120
##$ABSF1= 10
##$ABSF2= 0
##$ABSG= 5
##$ABSL= 3
##$ALPHA= 0
##$AQORDER= 0
##$ASSFAC= 0
##$ASSFACI= 0
##$ASSFACX= 0
##$ASSWID= 0
##$AUNMP= <proc_1d>
##$AZFE= 0.1
##$AZFW= 0.1
##$BCFW= 1
##$BC_mod= 2
##$BYTORDP= 1
##$COROFFS= 0
##$CY= 11.3945322036743
##$DATMOD= 1
##$DC= 2
##$DFILT= <>
##$DTYPP= 0
##$F1P= 2.36226072786647
##$F2P= -0.459571619588291
##$FCOR= 0.5
##$FTSIZE= 0
##$FT_mod= 4
##$GAMMA= 1
##$GB= 0.15
##$INTBC= 1
##$INTSCL= 1
##$ISEN= 128
##$LB= 0.24
##$LEV0= 0
##$LPBIN= 0
##$MAXI= 10000
##$MC2= 0
##$MEAN= 0
##$ME_mod= 0
##$MI= 1.114404
##$NCOEF= 0
##$NC_proc= 0
##$NLEV= 6
##$NOISF1= 3.799351
##$NOISF2= 2.8
##$NSP= 1
##$NTH_PI= 0
##$NZP= 0
##$OFFSET= 15.70392
##$PC= 1
##$PHC0= -18658.73
##$PHC1= 5.200779
##$PH_mod= 1
##$PKNL= yes
##$PPARMOD= 0
##$PSCAL= 0
##$PSIGN= 0
##$REVERSE= no
##$SF= 200.130013532006
##$SI= 16384
##$SIGF1= 3
##$SIGF2= 2
##$SINO= 400
##$SIOLD= 16384
##$SREGLST= <1H.CDCl3>
##$SSB= 0
##$STSI= 0
##$STSR= 0
##$SW_p= 3612.71676300578
##$SYMM= 0
##$S_DEV= 0
##$TDeff= 0
##$TDoff= 0
##$TI= <>
##$TILT= no
##$TM1= 0
##$TM2= 0
##$TOPLEV= 0
##$USERP1= <user>
##$USERP2= <user>
##$USERP3= <user>
##$USERP4= <user>
##$USERP5= <user>
##$WDW= 1
##$XDIM= 8192
##$YMAX_p= 0
##$YMIN_p= 0
$$ End of Bruker specific parameters
$$ ---------------------------------
##NTUPLES= NMR FID
##VAR_NAME=  TIME,          FID/REAL,        FID/IMAG
##SYMBOL=    X,             R,               I
##VAR_TYPE=  INDEPENDENT,   DEPENDENT,       DEPENDENT
##VAR_FORM=  AFFN,          ASDF,            ASDF
##VAR_DIM=   8192,          8192,            8192
##UNITS=     SECONDS,       ARBITRARY UNITS, ARBITRARY UNITS
##FACTOR=    0.0002768,     1,               1
##FIRST=     0,             0,               0
##LAST=      2.2672688,     0,               0
##MIN=       0,             -664372,         0
##MAX=       2.2672688,     680543,          0
$$ Real data points
##PAGE= N=1
##DATA TABLE= (X++(R..R)), XYDATA
0@%%%%%%%%%%qJ6j6J6k1K9l2L6m4N2o0P2q8J04j20J43j67J89k17K52k90L26l67
33a95M17m72N29n92O65p44Q28r21J025j136J253j385J533j691J861k051K261k490
51a305K741l023L339l692M089m543N070n682O407p285Q371r751J1573j4098J7830
66A0041k3894L5364o4239K64609M58662q08284m36636O92770M47231p32890m93663
77f50929O88638N94014o00671n81264N40199N86400n41817o37644M70365O79464
87E46755l87652o55746L47318O66289l21045o98540K44179P00112j81349o74300
97d13979J49102O81446j06068o89058L7314O68150Q353o44200l9117O41749Q6064
108C79756o27650j38802N95031J70057n69892j98652N53755K39943n23060k75625
$$ y = [0, 0, 0, 0, 0, 0, 0, 0, 0, 0, 0, -8, 8, -8, 8, -13, 16, -16, 20, -24, 28, -32, 40, -48, 56, -64, 79, -88, 101, -116, 136, -154, 172, -195, 222, -250, 279, -313, 352, -392, 436, -485, 540, -596, 657, -728, 805, -886, 975, -1076, 1185, -1305, 1436, -1587, 1752, -1940, 2149, -2394, 2676, -3006, 3401, -3884, 4487, -5264, 6309, -7789, 10041, -13853, 21511, -42728, 221881, 680543, -127741, -564377, 128393, 575624, -157266, -650929, 37709, 631723, 31052, -550212, -10013, 576387, 34570, -603074, -132709, 546755, 159103, -496643, -149325, 516964, 195919, -502621, -258442, 441670, 260321, -413979, -264877, 416569, 310501, -378557, -341243, 326907, 335260, -308940, -348057, 293692, 379756, -247894, -386696, 208335, 378392, -191500, -390152, 163603, 403546, -119514, -395139]
118c95139M84798K96290m56172l19468M27881L46987l88521l64099L49767L73476
128C55800l18522l86626K84122L98299k44624m00678K09493M00540j78364m02813
138b83373J43904M01323j08756l94036P8823L86890n0893l80289K1331L69357
148A84281O033l55545k9118L43213N1518l30300p3760L14426R2269k98111j07883
159b02977K82715J23740k65942j38570K47299J50629k29095j61122K11342J70823
169A88842j92487j78384J72986J83504j54288j87264J35838J90037j17005j90801
179a49022R8661J89611q1716j87439O5418J84099m9509j79037L4877J73071k1522
190G7492j66782Q957J59573K576j51534j2578J43314K1433j34866k9456J25978
$$ y = [-395139, 89659, 385949, -70223, -389691, 38190, 385177, -3344, -367443, -17676, 355800, 37278, -349348, -65226, 333073, 88449, -312229, -102736, 297804, 119440, -283373, -139469, 261854, 153098, -240938, -162115, 224775, 173882, -206407, -185076, 184281, 190314, -165231, -194349, 148864, 200382, -129918, -203678, 110748, 203017, -95094, -202977, 79738, 203478, -62464, -201034, 46265, 196894, -32201, -193323, 18019, 188842, -3645, -182029, -9043, 174461, 20173, -167091, -31253, 158784, 41779, -149022, -50361, 139250, 57534, -129905, -64487, 119612, 70103, -108934, -74057, 99014, 77492, -89290, -80333, 79240, 81816, -69718, -82296, 61018, 82451, -52415, -81871, 44107]
201D4107L6451j16997m2411J08081M7572r9197n1783R0263N5008q1485n7262P2919
213E266N8800o4677n9567N6590N9478m8971n8515M1910N6903l5100n4671K8708
225a3846N1767k2952m8475J7696M4841j3030m0695R043L6313n664l1793K888K7056
238A3149p67k2317p02J7672J562j3081j747Q639J367m401m67L62r84L317K834
253D436o577n126R545P875j1966j1075J3971J4459j5604j8094J6721K1929j7323
266C171k5809J7431K9833j7012l3946J6078L8004j4661m2026J2783M5887j0393
278A9340m9495P507N2873m093n5918K53N8610L808o0940q169O2777J2814o4095
291b4728j7678O4968K2826o5363k8176O5202L3630o4535l9184O3328M4715o1519
$$ y = [44107, 80558, -36439, -78850, 29231, 76803, -22394, -74177, 16086, 71094, -10391, -67653, 5266, 64066, -611, -60178, -3588, 55890, 6919, -51596, -9686, 47217, 12117, -42554, -13846, 37921, 14969, -33506, -15810, 29031, 16001, -24694, -15651, 20662, 14998, -16795, -13907, 13149, 12382, -9935, -10637, 7035, 8597, -4484, -6231, 2408, 3775, -626, -1093, -731, -1715, 1602, 4436, -2141, -7267, 2278, 10153, -1813, -12888, 1083, 15542, -62, -18156, -1435, 20494, 3171, -22638, -5207, 24626, 7614, -26332, -10254, 27750, 13089, -28937, -16154, 29733, 19340, -30155, -22648, 30225, 26132, -29786, -29533, 29077, 32885, -28055, -36224, 26553, 39367, -24728, -42406, 22562, 45388, -19975, -48151, 17051, 50681, -13854, -53038, 10290, 55005, -6514]
303f514n0213N9170N5673n6286o0996N2911O6055m9042p0942M4735P5569m0114
315B0006p9720L5111Q3561k9682q7075K3888R0119j7692r2741J1166R4816m299
327D7458r6361k675R7262R867r7569j7160R7136K4435r6034l1659R4176L8956
339F7832r1638m5987Q8379N2807q4544n9343Q0029O5503p4885p1345O9338P6633
351G2779o3326q1431N7144Q5585n0689q9210M3909R2336l6908r4935K9764R7025
363F2043k2370r8603J4825R9652p291j00167j85J00044P615r9274j5065R8000
375C9224K2405r6084k9620R3536L6614r0492m3231Q6821M9526q2520n5514P7727
387H392O1082p2339o6290O6558P0863o0402p4830N3909P8234m7268q0958M0557
$$ y = [-6514, -56727, 2443, 58116, 1830, -59166, -6255, 59800, 10758, -60184, -15449, 60120, 20006, -59714, -24603, 58958, 29276, -57799, -33911, 56208, 38516, -54225, -43059, 51757, 47458, -48903, -51578, 45684, 55551, -42018, -59178, 37958, 62393, -33641, -65300, 28876, 67832, -23806, -69793, 18586, 71393, -13151, -72494, 7535, 73038, -1847, -73192, -3854, 72779, 9453, -71978, -14834, 70751, 20062, -69148, -25239, 67097, 30189, -64746, -34982, 62043, 39673, -58930, -44105, 55547, 48256, -51911, -52096, 47948, 55563, -43711, -58776, 39224, 61629, -34455, -64075, 29461, 66075, -24417, -67648, 19173, 68699, -13821, -69335, 8392, 69474, -2865, -69155, -2597, 68266, 7864, -66966, -13057, 65177, 17909, -63049, -22492]
399b2492Q3074l3775q4599K6934Q5596k0182q6003J3446Q5968o763q5446K16Q4363
412D0337O276q2956j2503Q1092J8504p8795k4299P6159K9868p3185l5094O9725
424A5129M0124o6004m4820O1908M9122n7465n3044N2728N6590m7753n9602M2574
436a0513O2112l7363o4081L2032O5500k6567o6474K1123O6961j5646o6952J0209
448b9659O6512m891o5639l08O4398N253o2679j0067O0633J4734n8368j9022N5661
461A6558K3147n2799k6973M9725L0415m6453l3529M3145L6265l9699l8711L6190
473b719M0780l2587m2582K8885M4129k5074m5397K1269M6296j7401m6892J3549
485a7744M7164r749m7087N969M6697k222m5994j380M4966M855m3727q103M2209
$$ y = [-22492, 60582, 26807, -57792, -30858, 54738, 34556, -51447, -38001, 47967, 41204, -44242, -44026, 40337, 46613, -36343, -48846, 32246, 50750, -28045, -52344, 23815, 53683, -19502, -54596, 15129, 55253, -10751, -55571, 6337, 55459, -2006, -55050, -2322, 54268, 6515, -53087, -10513, 51599, 14236, -49845, -17813, 47687, 21120, -45354, -24231, 42730, 27084, -39868, -29659, 36853, 31962, -33677, -33985, 30413, 35666, -27013, -37080, 23553, 38287, -20081, -39103, 16558, 39705, -13094, -40067, 9658, 40073, -6380, -39909, 3236, 39501, -198, -38909, -2719, 38061, 5474, -37108, -8223, 35906, 10832, -34565, -13296, 33000, 15599, -31293, -17744, 29420, 19671, -27416, -21447, 25250, 23028, -22966, -24346, 20620, 25475, -18252, -26355, 15854]
498A5854J1169m0438j4070L8459J6776l6285j9264L3938K1524l1377k3591K8714
510A409K5365k5980k6918K3217K8226k0492k9212J7768K9961j5047l0540J2351
522i892L0919r746l0987P138L0920m613l0650K152L0213J95k9579k479K8746M700
536A7037k7818o719K6692Q657k5474j0369K4100J1945k2662j3342K1021J4675
548A7743j9318j5766J7484J6689j5600j7475J3685J8092j1823j8437R961J8605
560A3840q133j8633O341J8529m678j8212L043J7868j568j7369J92J6732J101j6062
574g009k252J5329L339j4543m312J3691N175j2771n949J1862O568j0869p074R819
588A004P555q852p857P811Q048o826q126N881Q077m940p949M063P701l192p419
$$ y = [15854, 27023, -13415, -27485, 10974, 27750, -8535, -27799, 6139, 27663, -3714, -27305, 1409, 26774, 794, -26124, -2907, 25319, 4827, -24385, -6617, 23344, 8297, -22243, -9892, 21027, 11281, -19706, -12568, 18352, 13739, -16911, -14759, 15454, 15649, -13930, -16409, 12337, 17037, -10781, -17500, 9192, 17849, -7625, -17994, 6106, 18051, -4611, -17953, 3068, 17743, -1575, -17341, 143, 16832, 1232, -16243, -2558, 15534, 3711, -14726, -4765, 13840, 5707, -12926, -6585, 11944, 7266, -10946, -7903, 9965, 8397, -8972, -8780, 7952, 9053, -7009, -9261, 6068, 9407, -5136, -9448, 4243, 9418, -3353, -9302, 2560, 9128, -1741, -8815, 1004, 8559, -293, -8150, -339, 7709, 883, -7243, -1362, 6715, 1775, -6174, -2111, 5590, 2398, -5021]
603e021K425P055j769o589J135O124o13n559J22N018K35m402n47L803P20l224
619a087p92K682P65k100o72J566M85j107k36O97o6l36M21N4q71K10J323m27j784
638a275N18K318n31k869M86L370l06l917P7M449K30m951n57N316J035n668j584
655c859O019K176o320k786O502L474o681m118O723M861o706n592O554O383o334
670B96p186O044P956n693q721N290R447m779j0101M162J0790l569j1359K791J1960
685G328k037j2467J199J2893k54j3285p06J3572J714j3757k771J3861L863j3899
699d746n005J3856O114j3624p214J3341Q252j2953r287J2467J0337j1934j1277
712a1673J1293J2204j0592j3085R792J3899q857j4695P814J5465o816j6073N672
$$ y = [-5021, -2596, 4459, 2690, -3899, -2764, 3360, 2747, -2812, -2690, 2328, 2563, -1839, -2386, 1417, 2137, -1087, -1879, 803, 1568, -532, -1204, 362, 847, -260, -496, 201, 135, -201, 220, 274, -597, -387, 936, 509, -1275, -757, 1561, 1030, -1839, -1353, 2017, 1711, -2206, -2129, 2320, 2550, -2401, -2958, 2358, 3393, -2275, -3859, 2160, 4336, -1984, -4770, 1732, 5206, -1475, -5593, 1130, 5991, -715, -6307, 247, 6630, 296, -6890, -846, 7110, 1417, -7304, -2014, 7433, 2654, -7447, -3285, 7505, 3936, -7423, -4632, 7328, 5291, -7176, -5977, 6916, 6662, -6623, -7329, 6243, 7957, -5800, -8571, 5290, 9153, -4746, -9751, 4105, 10219, -3405, -10619, 2722, 10974, -1979, -11266, 1201, 11538, -396, -11673, -380, 11824, 1232, -11853, -2061, 11838, 2981, -11714, -3900, 11565, 4749, -11324, -5652]
725e652J6622m490j7081L328J7450k136j7746Q93J7957L86j8084j641J8125K904
739A0835j8065m228J7928N573j7664o906J7345Q164j6911r430J6336J0666j5649
752b006j1831J4850J2936j3915j4007J2908J4962j1855j5800J0752J6587r623
764C958j7256Q417J7813p191j8276N894J8701m574j9027L249J9262j899j9334
777a0263M59J9350R12j9244k350J9075L773j8847n074J8464O414j8012p667J7438
791D428Q948j6859j0124J6140J1333j5395j2398J4506J3401j3586j4335J2610
803a331J5168j1518j5971J0393J6665r229j7214Q021J7657o754j8029N410J8303
816A1571m068j8456K712J8516j370j8428QJ8296J279j8030k584J7686L852j7283
$$ y = [-5652, 10970, 6480, -10601, -7273, 10177, 8041, -9705, -8812, 9145, 9531, -8553, -10194, 7931, 10835, -7230, -11458, 6470, 12043, -5621, -12527, 4818, 12982, -3929, -13359, 2977, 13643, -2006, -13837, 1013, 13949, 34, -13973, -1065, 13897, 2042, -13758, -3006, 13581, 3958, -13298, -4881, 12932, 5741, -12535, -6641, 12060, 7486, -11541, -8292, 10970, 9071, -10263, -9804, 9546, 10458, -8786, -11136, 7939, 11712, -7135, -12209, 6255, 12669, -5343, -13010, 4428, 13376, -3483, -13607, 2533, 13866, -1529, -13927, 579, 13980, 394, -13941, -1331, 13837, 2319, -13652, -3259, 13406, 4177, -13037, -5016, 12641, 5887, -12142, -6732, 11571, 7503, -10953, -8241, 10275, 8905, -9523, -9515, 8781, 10060, -7970, -10554, 7132, 10984, -6299]
830f299m995J6741O165j6182p285J5556Q322j4831r309J4051J0246j3263j1049
843a2132J2326J1891j1440j2567J0448J3198r445j3690Q360J4127p249j4519O141
856d551J4803n019j4964L838J5045k669j5032J507J4915l92j4679o72J4363J732
870H225j3995k728J3550L643j2985m560J2432N358j1807o062J1106O737j0394
883a480p343R640P910q925q354Q112Q770p300r116O475R430n700r615M891R747
898G142m077r865L352R833k570r815J867R707j157r537M21R343K48r046q96Q745
914C695J509q409k025P986K566p573l069P129L467o625l840O097M196n598m443
929d937N079M660m591m793M045M930l542n014L029N070k592n015K088N053j714
$$ y = [-6299, -11294, 5447, 11612, -4570, -11855, 3701, 12023, -2808, -12117, 1934, 12180, -1083, -12132, 194, 12085, 645, -11922, -1474, 11724, 2279, -11411, -3051, 11076, 3827, -10692, -4551, 10252, 5233, -9731, -5893, 9152, 6483, -8549, -7042, 7873, 7481, -7198, -7870, 6493, 8225, -5770, -8498, 5052, 8695, -4290, -8850, 3582, 8940, -2867, -8929, 2177, 8914, -1480, -8823, 817, 8727, -198, -8552, -440, 8330, 1030, -8086, -1611, 7819, 2119, -7496, -2605, 7142, 3065, -6800, -3448, 6385, 3815, -6000, -4133, 5574, 4417, -5120, -4699, 4644, 4892, -4154, -5050, 3695, 5204, -3205, -5230, 2756, 5322, -2251, -5320, 1809, 5276, -1349, -5189, 908, 5104, -494, -4937, 142, 4802, 211, -4582, -537, 4393, 851, -4163, -1134, 3936, 1344, -3671, -1583, 3470, 1756]
944A756m962J254M908q97m741M89M640j67m470j49M266M65m049p29L806R95l615
961a200j159L335J358l089j492K804J635k574j741K352J774k065j848J830J831
976A751j555j814J329J772j094j746Q85J659o62j619N12J509l45j410K47J287
992G06j39j150K4J051M2r23q7P89J22o43j43N02J70m21j20K92J01j98p1J14J4
1013C2m3Q4n0j53J01K12j06l17J43L95j49n33J81N96j57o92J14Q24j01q89K7R86
1035E05P0j068j70J159K38j189l51J220N02j287n93J313P09j309q49J289R97j240
1053e4j212J261J288j151j448J064J648j026j757Q96J877p79j970O13K114m89
1069H75k185K82K290q1k415n1K421K93k470m97K502P10k496r37K504J130k447
$$ y = [1756, -3206, -1952, 2956, 2059, -2682, -2193, 2447, 2280, -2190, -2339, 1927, 2392, -1657, -2386, 1420, 2415, -1200, -2359, 976, 2334, -755, -2247, 557, 2192, -382, -2123, 229, 2003, -62, -1910, -80, 1751, 196, -1618, -289, 1483, 389, -1357, -472, 1187, 525, -1094, -582, 927, 582, -828, -581, 706, 567, -583, -559, 492, 534, -389, -476, 313, 435, -208, -351, 151, 321, -100, -220, 72, 173, -25, -96, 18, 32, -11, 73, 23, -130, -29, 183, 77, -240, -97, 298, 149, -384, -203, 393, 236, -456, -342, 482, 381, -508, -481, 505, 575, -493, -663, 496, 734, -455, -806, 414, 916, -371, -964, 349, 1058, -251, -1100, 189, 1186, -54, -1266, -5, 1283, 132, -1316, -252, 1396, 370, -1387, -491, 1386, 607, -1363, -750, 1364, 875, -1310, -1028, 1262, 1181, -1234, -1285, 1136, 1429, -1041, -1538, 964, 1674, -822, -1759, 745, 1875, -572]
1086e72j361K350J595k277j782K146K019k037k195J847K401j677k610J498K780
1101B125j308k921J110L063r03l183O79L257m13l348J37L447J04l468m12L485
1117A451P11l476r92L455J304l423j543L282J840l186k137L072K405k919k635
1132b791K734K851k478l124K264L341k000l529J725L668j401l846J091L978p57
1147A726m088M24M150r7m191k25M216N53m169r68M183J274m099j554L963J905
1163C003l864k221L720K501l546k753L357L048l192l278K954L492k683l741K445
1178g58L904k112m086J767M243j437m370J106M471p55m529L94M568n9m549l33
1194b535M543O43m475r95M386J357m269j679M170J988m032k311L880K583l670
$$ y = [-572, -1933, 417, 2012, -265, -2047, 99, 2118, 81, -2114, -267, 2134, 457, -2153, -655, 2125, 817, -2104, -994, 2069, 1166, -2017, -1338, 1919, 1506, -1842, -1705, 1742, 1846, -1622, -2034, 1451, 2162, -1314, -2306, 1149, 2453, -970, -2513, 769, 2609, -577, -2714, 358, 2763, -156, -2791, -57, 2794, 316, -2808, -544, 2797, 797, -2732, -1007, 2661, 1260, -2586, -1495, 2483, 1726, -2362, -1938, 2212, 2115, -2076, -2301, 1915, 2468, -1701, -2669, 1514, 2788, -1311, -2865, 1098, 3003, -861, -3082, 638, 3139, -407, -3160, 197, 3245, 53, -3225, -271, 3221, 538, -3203, -758, 3146, 1034, -3052, -1285, 2958, 1521, -2849, -1743, 2728, 1973, -2556, -2162, 2406, 2347, -2202, -2535, 2008, 2651, -1824, -2819, 1567, 2924, -1345, -3024, 1146, 3134, -898, -3209, 671, 3254, -416]
1209d16k875L478L129l218l380K955L583k681l801K394L997k080m151J784M254
1224B972j454m350J109M411p51m489M33M485r6m446k65M400O34m330r82M257J279
1241B817m136j605L997J873l796k163L645K387l411k641L170K904k979l076K727
1256b87L252k463l421K249L518j934l685J684L777j424l832J137L894q68l944
1271b347O35L918l44l915P9L873J85l821m34L742O94l658r61L576J174l424j430
1288b458L290J646l114j851K955K007k769k158K598K295k386k455K200K556k004
1303C52k606J744K751j612k769J369K842j181k873R67K910q07k870N99K836m10
1319A242k807K05K781J5k754j68K664L29k586m85K531N96k390p71K286Q83k158
$$ y = [-416, -3291, 187, 3316, 98, -3282, -327, 3256, 575, -3226, -832, 3165, 1085, -3066, -1282, 2972, 1518, -2832, -1723, 2688, 1937, -2552, -2119, 2366, 2270, -2176, -2441, 1959, 2593, -1737, -2719, 1538, 2817, -1319, -2924, 1073, 2946, -850, -3013, 632, 3019, -392, -3033, 137, 3041, 62, -3014, -287, 2965, 502, -2919, -670, 2848, 914, -2771, -1087, 2690, 1266, -2566, -1429, 2465, 1597, -2347, -1712, 2206, 1862, -2053, -1974, 1899, 2084, -1737, -2171, 1571, 2265, -1393, -2354, 1222, 2396, -1028, -2458, 832, 2478, -636, -2487, 468, 2475, -294, -2452, 146, 2441, 55, -2400, -200, 2356, 352, -2254, -510, 2241, 629, -2140, -771, 2071, 890, -1983, -1016, 1894, 1087, -1783, -1184, 1652, 1242, -1565, -1360, 1421, 1436, -1318, -1486, 1178, 1507, -1079, -1564, 967, 1563, -827, -1598, 688, 1571, -587]
1336e87r68K000J112j882j215J769J279j629j345J492J380j311j431J163J465
1351A292j040j420Q33J470p50j437O11J402m93j351L87J272k37j232J35J177m5
1368E74j097k4J009Q7r26j43Q34J82p56k05O52K43n33k67M63J90k92k10K15J96
1388A92j78j36J03O8pln1q6J22J38j54k08J39L31j98m42K20N38k04o34J75P55
1410D80j22q33M0R43k7j015m7J112J29j166k43J259L07j282m66J356N75j354p47
1429a101J430Q65j442j016J441J182j464j284J360J512j367j618J257J812j205
1444C62j951J074K118r43k258P94K386o52k516N17K580l03k689J22K760R8k818
1461a319l03K855N37k901p40K898J006k933j180K868J390k786j635K716J890k676
$$ y = [-587, -1555, 445, 1557, -325, -1540, 229, 1508, -121, -1466, 26, 1406, 95, -1336, -173, 1292, 252, -1168, -335, 1135, 385, -1052, -441, 961, 468, -883, -496, 776, 539, -693, -558, 619, 574, -523, -547, 462, 549, -377, -520, 314, 496, -260, -465, 187, 430, -103, -370, 93, 283, -9, -219, -4, 192, 14, -122, -19, 49, 42, 39, -12, -98, 24, 162, 8, -200, -61, 270, 72, -370, -150, 388, 184, -450, -275, 480, 358, -475, -435, 508, 481, -534, -581, 531, 660, -506, -749, 510, 817, -465, -931, 425, 1000, -354, -1101, 329, 1194, -248, -1264, 177, 1359, -105, -1389, -29, 1483, 116, -1502, -245, 1567, 362, -1589, -515, 1603, 660, -1598, -804, 1582, 930, -1586, -1069, 1511, 1208, -1481, -1359, 1401, 1499, -1319, -1622, 1233, 1770, -1131, -1871, 1027, 2033, -900, -2080, 788, 2178, -608, -2243, 473, 2363, -313]
1477c13k079K542K326k448k514K290K701k133k904J982L055j796l224J598L370
1492B453j357l481J090L625q70l709O15L769l08l838L5L855K48l877n15L830Q61
1509B426l828j113L754J398l680j689L584J936l432k183L271K453l109k682K912
1524A8K889k717l090K490L288k266l453K003L640j766l762J503L871j235l981
1539b568R47M052o45m083L45M088l7m112k51M097N50m042q59M020J110l866j474
1556b728L797J712l624j973L432K251l267k500L089K725k873k951K658L122k428
1571D42l252K141L409j896l536J669L624j413l709J164L774q99l841O66L852m03
1587A792l833R5L844J54l799m23L756O55l666r22L613J168l483j440L383J648
$$ y = [-313, -2392, 150, 2476, 28, -2486, -196, 2505, 372, -2532, -550, 2505, 709, -2515, -917, 2453, 1096, -2385, -1295, 2330, 1460, -2249, -1634, 2135, 1827, -2011, -1976, 1879, 2127, -1750, -2265, 1565, 2426, -1402, -2515, 1239, 2637, -1043, -2732, 852, 2788, -644, -2827, 444, 2897, -212, -2894, 18, 2907, 190, -2900, -410, 2878, 612, -2841, -838, 2802, 1036, -2726, -1223, 2648, 1413, -2568, -1621, 2431, 1786, -2297, -1952, 2136, 2099, -2013, -2264, 1833, 2383, -1659, -2518, 1502, 2612, -1254, -2728, 1069, 2781, -843, -2816, 616, 2867, -400, -2900, 189, 2914, 41, -2910, -252, 2870, 442, -2810, -669, 2740, 844, -2692, -1023, 2601, 1188, -2521, -1357, 2417, 1518, -2323, -1657, 2195, 1792, -2041, -1946, 1898, 2052, -1747, -2170, 1586, 2241, -1425, -2347, 1266, 2434, -1049, -2489, 894, 2542]
1603B542l226j901L085K067k845k288K651K490k468k639K237K830k075k960J841
1618f59L064j590l150J337L232j093l315Q79L353o35l364L73L358j36l284j63
1634a793L313L42l226n75L194P58l078j016L015J170k830j430K731J609k591j798
1650b205K447J926k236k082K086K203j903k331J702K417j467k495J252K561j071
1665H04k563Q02K643o17k649L88K638j69k608k4K585J95k539l60K467N27k348
1682h28p05K231Q71k106j051K052J139j921j238J742J395j626j502J506J529j370
1698A18j543J151J629j021j711R29J715p94j652N83J713m68j693L19J701k13j609
1715h46P0J521P5j479j66J397K85j347l60J242M57j161n42J110N64j021o25R24
$$ y = [2542, -684, -2585, 500, 2567, -278, -2566, 85, 2575, 107, -2532, -295, 2535, 460, -2500, -659, 2405, 815, -2335, -998, 2234, 1141, -2174, -1295, 2058, 1423, -1941, -1568, 1790, 1654, -1630, -1793, 1520, 1862, -1364, -1939, 1255, 2013, -1065, -2081, 934, 2104, -726, -2156, 575, 2184, -407, -2205, 242, 2168, -68, -2150, -64, 2139, 236, -2095, -393, 2024, 557, -1938, -686, 1875, 804, -1759, -957, 1686, 1069, -1580, -1192, 1446, 1277, -1331, -1355, 1230, 1425, -1114, -1474, 993, 1520, -828, -1533, 698, 1569, -537, -1588, 464, 1603, -318, -1556, 186, 1581, -45, -1547, -41, 1488, 118, -1425, -274, 1355, 334, -1377, -448, 1267, 473, -1179, -596, 1117, 649, -1044, -725, 976, 763, -846, -776, 745, 820, -659, -825, 572, 857, -490, -850, 392, 849, -312, -854, 256, 820, -201, -826, 98]
1733I8O60p93o75O68P24o09o90N24O89m51p14L79O89l13o51K43N86j48n81J23
1753b42N17m6m91M4M33Kl86qL12K7k30o4K12L2j44j7J02l3l2M4m0o3M9J29q0j54
1779a27Q0K11j16k72J59K94j24l73J27M24q9n08Q6N61p3n99K8O63Op04q7P94J13
1802D74p96k13Q77K52r03l29R25L93r11m87R15N99r33p04R24Q07r17q85Q40J015
1822I43q25j087P47J234p63j265O70J345o28j388N19J494m30j593L37J662k05
1839G67j727P8J788M6j808j39J803L05j867m33J887N69j855p04J815Q54j817r91
1857a429J794J122j742j266J684J375j604j526J535J643j422j783J308J928j194
1872D23k037J050K142r18k205O95K361n85k385M08K438k12k510O6K529J01k520
$$ y = [98, 758, -35, -710, -42, 682, 73, -617, -93, 596, 145, -569, -190, 499, 186, -465, -222, 364, 216, -365, -242, 275, 229, -262, -218, 215, 217, -169, -177, 135, 162, -68, -132, 80, 112, -32, -49, 53, 20, -12, 32, -8, -71, -22, 107, 27, -127, -47, 164, 48, -224, -65, 229, 105, -268, -141, 283, 194, -314, -228, 333, 260, -339, -311, 352, 358, -346, -433, 361, 474, -322, -535, 342, 594, -309, -638, 287, 680, -231, -718, 197, 796, -137, -841, 83, 890, -27, -912, -72, 943, 118, -969, -222, 1012, 249, -1016, -346, 999, 371, -1017, -498, 996, 566, -1027, -690, 972, 767, -960, -882, 906, 952, -856, -995, 808, 1113, -754, -1187, 700, 1269, -586, -1290, 525, 1379, -438, -1429, 365, 1487, -255, -1521, 163, 1538, -66, -1592, -57, 1586, 164, -1619, -311, 1617, 423, -1614, -564, 1578, 660, -1545, -850, 1511, 926, -1459, -1051, 1387, 1175, -1335, -1269, 1260, 1361, -1159]
1889a159l09K527N11k530p09K495Q98k464j039K384J241k325j423K250J593k164
1905b23j756K086J893j956k042J810K180j655k302J465K431j309k534J139K636
1920A863r59k718P72K765n61k817L62K832j22k897j0K871K38k888m26K828O72
1937A805k841q20K759J058k708j248K613J442k527j583K379J779k296j924K155
1952D3K058j962k256J833K377j649k503J478K592j300k692J132K735q94k824P08
1968a124K856m84k877K85K892q4k913q4K880K87k819n25K785P38k761q91K659
1985H20J114k571j334K476J485k304j673K179J805k023j959J858K089j713k193
2000a944J541K308j359k421J207K429r64k516P78K546n84k543L74K596k36k547
$$ y = [-1159, -1468, 1059, 1570, -960, -1669, 826, 1724, -740, -1779, 605, 1846, -479, -1902, 348, 1941, -223, -1979, 107, 2000, 44, -1998, -188, 1992, 337, -1965, -500, 1931, 622, -1912, -773, 1863, 904, -1814, -1042, 1723, 1162, -1655, -1293, 1539, 1417, -1480, -1490, 1381, 1619, -1269, -1695, 1133, 1805, -1036, -1856, 903, 1961, -747, -1995, 618, 2060, -467, -2050, 329, 2108, -188, -2112, 43, 2101, 139, -2117, -284, 2093, 444, -2059, -581, 2011, 711, -1981, -849, 1886, 992, -1832, -1124, 1732, 1248, -1629, -1344, 1548, 1464, -1449, -1533, 1347, 1634, -1185, -1710, 1075, 1813, -948, -1839, 820, 1934, -637, -1971, 505, 1990, -314, -1987, 192, 1997, -26, -1985, -127, 1962, 249, -1944, -403, 1905, 546, -1875, -668, 1761, 797, -1719, -941, 1605, 1021, -1522, -1148, 1448, 1212, -1335]
2016a335pK578J52k505l11K423N08k376o92K334Q11k187r79K089J123k001j244
2033a619J829J425j736j502J554J629j434j697J284J752j117j815R68J844q21
2048E44j881O91J893n09j909L62J884k34j845P9J854J6j790j81J783K81j705m10
2066a077J658M95j526o32J475P00j367p95J307Q63j254r11J128R76j004j060R18
2083a06J091q34j103P17J139o12j141M86J155m27j110K94J129k08j090J22J057
2100E59k3j025k1R75J02r91j35R24K00q57k45P98K95p35l68O88L91o20m22N58
2120D8M14n01l83M28M04m02m02L17M48k71m40K57L53j73l42J41L19r4k99M9K81
2141A52j5k59K5K11k6j57J8J23J2j32K1N4k1k0M8j1m4K4M8o2p2R1J20j26j42J10
$$ y = [-1335, -1342, 1236, 1388, -1117, -1428, 995, 1503, -873, -1565, 769, 1580, -607, -1586, 503, 1626, -375, -1619, 210, 1635, -101, -1603, -49, 1580, 146, -1551, -267, 1485, 368, -1447, -479, 1365, 544, -1337, -646, 1247, 738, -1171, -809, 1075, 841, -1004, -925, 929, 945, -845, -1026, 757, 1038, -667, -1077, 581, 1076, -450, -1082, 393, 1093, -274, -1069, 238, 1101, -153, -1064, 64, 1040, 36, -1024, -106, 985, 151, -952, -235, 904, 292, -849, -363, 792, 365, -745, -451, 678, 470, -620, -498, 559, 536, -489, -510, 465, 567, -424, -559, 365, 565, -292, -537, 261, 556, -179, -547, 141, 532, -88, -510, 48, 462, -39, -422, 6, 410, 8, -394, -77, 371, 100, -340, -83, 270, 97, -245, -104, 215, 121, -178, -129, 152, 137, -122, -97, 114, 88, -69, -51, 72, 84, -48, -27, 27, 6, -14, 34, 23, -21, 3, 51, -11, -83, 8, 128, 2, -140, -30]
2167c0J85j22k29J47K52j43l03J64L02j09l61Q9M27p5m89P3M87l6n15lN47Q2o17
2190b77j03O36J80o49k35O47L07o83l33O72L81o37m79O41N37o51n93O29O71n87
2210G4p62N44Q37n20q67M46R39m05r79L28J057k95j054J86J116j19j168N5J203
2229F16M1j228j40J259K20j252l35J311L71j241n24J238O40j258o84J149Q54j155
2247a18r36J091J050j040j150R82J200q59j332Q31J364o96j453O08J497n09j544
2264a014L79J604k56j625J52J639m0j679r6J690K56j654l95J660M88j645o19J603
2282D48P57j568q80J526J009j465j130J400J219j294j350J166J484j089j525R51
2298c41J663r15j679P49J758o37j797N04J841l15j924K05J911p7j888r2J930K10
$$ y = [-30, 155, 33, -196, -49, 203, 60, -243, -79, 223, 114, -247, -158, 269, 194, -295, -222, 265, 229, -286, -289, 258, 340, -277, -380, 256, 436, -213, -448, 199, 506, -177, -510, 162, 543, -94, -573, 68, 605, -46, -639, -10, 661, 74, -688, -144, 693, 173, -694, -248, 691, 286, -693, -365, 692, 397, -657, -471, 645, 526, -642, -587, 616, 657, -571, -711, 548, 768, -484, -819, 492, 863, -378, -902, 336, 976, -282, -966, 183, 1037, -118, -1054, 37, 1087, 47, -1103, -121, 1079, 220, -1112, -281, 1083, 387, -1066, -458, 1039, 530, -1014, -635, 969, 713, -912, -760, 879, 839, -840, -936, 754, 1010, -644, -1039, 621, 1109, -536, -1155, 448, 1205, -363, -1243, 283, 1292, -173, -1303, 97, 1316, 22, -1328, -162, 1322, 233, -1292, -341, 1322, 407, -1272, -523, 1235, 598, -1199, -695, 1146, 831, -1093, -888, 1023, 946, -942, -1034, 896, 1106]
2316A106j916l53J911M91j876o32J843P72j790q86J727R95j660j136J599J227
2332A422j486j352J362J460j263j554J143J688j103j703R19J812p80j833N86J895
2348A213m52j923L40J924k04j938O4J946P6j928k06J897L77j885n05J810O37j739
2366d96p71J707Q75j643r91J533J128j450j222J351J298j273j359J143J453j039
2382B44j524R07J595p66j650P17J619n64j669M27J705l20j716J92J725o0j683
2399h21q6J673K11j657l09J614M03j544n22J493O36j424p60J355Q20j246r16J210
2417A30R91j134j090J056J129r52j180Q68J226q09j248P34J268o17j266M59J295
2434H60l39j365L39J286j93j327J09J321n2j261n4J234J41j189k21J130L21j093
$$ y = [1106, -810, -1163, 748, 1239, -637, -1269, 574, 1346, -444, -1330, 397, 1392, -268, -1404, 195, 1422, -64, -1416, -54, 1406, 143, -1411, -268, 1420, 317, -1386, -467, 1345, 565, -1268, -682, 1213, 761, -1162, -822, 1102, 898, -1040, -976, 970, 1046, -882, -1088, 809, 1186, -699, -1204, 606, 1243, -496, -1267, 440, 1315, -328, -1319, 214, 1342, -108, -1330, 21, 1319, 46, -1313, -170, 1283, 244, -1280, -373, 1222, 456, -1194, -477, 1142, 578, -1091, -664, 1041, 721, -995, -803, 922, 862, -821, -907, 766, 977, -680, -989, 625, 1028, -516, -1038, 455, 1091, -333, -1093, 262, 1082, -164, -1080, 130, 1121, -13, -1103, -47, 1082, 130, -1050, -182, 1044, 235, -1013, -279, 989, 372, -894, -435, 860, 521, -844, -505, 781, 588, -739, -630, 691, 639, -622, -676, 558, 699, -490, -711, 419, 740, -353]
2452c53l82J099M02j010n23R64N56q72o42Q51O81p92o87O80P25o21p43N36P77
2471F46m63p98L68Q07k95p98K58P79k29p08J04P39p7p02L2O64M8o73o8O30J15
2492C79n82j50N63J65n16j92M29K40l91k79M08K20l15k61K82K75k48k89K22K58
2512B18j73k46J34K28j03j92N6J72j0j74K0J40kr8l2R5Ql0m3L1K1j4k3j0K2N1
2538D6j0j01J9Q0N9j38o3J50Q4j61r7J49J58j76j94K33J65k03k32K04K69k02l10
2561b71J89L57j47m34J78M35j33m93J06N17n1n34j2N61M3n63p2N79J29o36j78
2582d30O51K24o38k74O31L23o26l83O20M56o17m85N65N40n48n72M99O43m65p32
2602f18M41P73l92q01L45Q57l01q71K20R36j62r72R6R51J1j019l8J011J28j019
$$ y = [-353, -735, 364, 766, -244, -767, 197, 753, -119, -761, 90, 771, -21, -708, -28, 697, 76, -667, -131, 646, 183, -615, -247, 560, 265, -533, -275, 504, 275, -433, -329, 410, 333, -369, -337, 327, 375, -298, -366, 264, 379, -203, -353, 210, 375, -141, -333, 96, 336, -55, -334, 74, 294, -21, -282, 0, 275, 27, -262, -40, 218, 45, -201, -67, 161, 58, -134, -78, 94, 84, -90, -70, 70, 68, -30, -62, 33, 41, 11, -32, -1, 20, 6, -17, -27, -5, 46, 36, -65, -46, 34, 93, -45, -108, 42, 126, -35, -132, 17, 175, -1, -195, 38, 203, 0, -232, -28, 241, 39, -271, -82, 275, 128, -306, -128, 307, 174, -319, -213, 304, 253, -281, -293, 268, 311, -252, -324, 255, 384, -252, -430, 221, 445, -193, -467, 164, 487, -139, -522, 98, 554, -63, -548, 17, 557, 9, -563, -64, 579, 114, -618, -177, 596, 204, -597, -252, 605, 304, -567, -347, 589, 427, -545, -449, 502, 513, -506, -544, 467, 595, -424]
2622d24k09J017K79r82l77J002M34r74n12R35O02r29o74R12P09q43p95P83Q72
2641H26p61q94O57R81n86j039N40J065m42j130L96J128k67j187K07J196j10j249
2659f69Q2J200M7j208j54J220K37j207l49J195M31j134n59J127O24j117o92J054
2677A28Q18j021q47R41Q89q82r65Q38J026p49j079O72J119n93j154M72J244m25
2695D32j231L23J260k40j268J41J302n8j312l8J289J22j271k12J279K75j252l75
2713h34J231M69j189n78J162O58j126p10J038Q01r85q77R00R54q36r91P56J062
2731I05p07j108O36J137n24j146M02J232m07j190K75J222j52j241Q3J216oj219
2749e92n4J180J94j196k52J107L76j121m29J083N07j018o13R86O37r21p21Q97
$$ y = [-424, -633, 384, 663, -319, -696, 306, 740, -234, -746, 189, 791, -138, -812, 100, 809, -34, -829, -46, 826, 65, -829, -172, 809, 223, -816, -276, 789, 347, -783, -387, 741, 474, -713, -506, 690, 580, -669, -587, 613, 660, -548, -702, 518, 755, -452, -801, 394, 825, -309, -868, 259, 883, -234, -926, 128, 946, -75, -922, 19, 908, 26, -939, -101, 925, 176, -903, -231, 888, 295, -859, -387, 857, 432, -799, -476, 784, 544, -724, -583, 719, 661, -651, -689, 600, 722, -549, -761, 518, 793, -459, -834, 397, 866, -323, -901, 261, 919, -207, -917, 121, 922, -63, -940, -40, 914, 78, -913, -157, 905, 198, -910, -274, 863, 339, -807, -405, 827, 420, -770, -495, 727, 575, -666, -583, 633, 627, -592, -646, 534, 728, -468, -720, 387, 763, -358, -787, 296, 803, -215, -828, 158, 795, -126, -847, 50]
2767E0P80q29q04P71Q34o82r09O30R40n78r28M85R28l78r75L05J012k80r41J26
2787d43J010q4r86OR77L4r41j30R35J72q89k41Q95L01q67l73Q06M10p58m60P28
2808A02M97o71n39O21N84n73o03N24N88m36o40M06O58l28o77K52P04k25o62J51
2828b67P02j59o32N6O43Ro51k3O11N1n89r3N46J86n41k02M94K24m71k74M52K80
2850C52m23k94L79L29l60l04K84L39k70l19K11L79k22l42J98K93j26l33J38K93
2870B02p2l30N7L08k0k87PK60Pk43j8K19L2j68r4J91N9j59p7J88L9j24q3J21P6
2895I1j06p9Q5O8o6m4O5L0j9n5J8L0k8j4J3K0Mkllj3K5K1n7qL4K0o4KP4K8p8m6
2928e7Q4N5j02j01J19R8j22j19J46J27j26j29J08J36j07j57J17J88j12j99Q6K26
$$ y = [50, 830, 1, -803, -32, 802, 120, -789, -159, 781, 203, -725, -240, 688, 310, -665, -360, 652, 372, -569, -443, 567, 483, -503, -497, 480, 514, -427, -557, 378, 550, -339, -580, 315, 616, -251, -624, 182, 592, -166, -626, 102, 599, -72, -611, 10, 594, 21, -582, -58, 530, 94, -546, -140, 518, 190, -487, -235, 469, 244, -418, -267, 435, 276, -356, -300, 343, 352, -299, -322, 289, 340, -249, -342, 204, 390, -151, -353, 141, 365, -106, -380, 72, 352, -71, -365, 14, 343, -17, -321, -37, 302, 32, -287, -76, 303, 81, -261, -63, 230, 104, -229, -91, 202, 130, -200, -143, 165, 145, -142, -135, 125, 132, -111, -129, 90, 122, -46, -140, 51, 110, -49, -126, 62, 101, -23, -106, 15, 91, -15, -94, -9, 59, -7, -51, 14, 44, 25, -30, -12, 18, -10, -24, -11, 9, 13, 11, 8, 5, -8, 17, 38, -19, -27, 7, 27, -37, -35, 39, 67, -11, -57, 27, 82, -20, -121, -2, 96, -26, -145, 1, 128, 2, -127, -19, 117, 10, -147, -30, 158, 46, -153, -67, 159]
2950A59o6k55R7K26o7k50K1L05k6l02qL13K8l07n6L25M7l21p6L68P3l41j42L24
2974F9J87l40j81L33K30l39k69L26K85l22k99K94L33k87l44K82L93k76l99K02
2994a22M45j75m53J28M98j18n09O5N45m2n43K5N20M5n65n9N59J04n85j12N27K00
3016C78n46k36N47K73n37l17N22L60m99l86M57M32m77m47M39N17m31n03L57N56
3036D59l16o10K95O11k29o37K02O39j63o34R6O75m8o94K0O91J9o95q6O90J38p00
3058b77j55O76J89o29l14O76L18o24l89O25M10n79m45N34N15n19n52M80N88m48
3078H0n76L58O48l57o29L07O38k22p20K26P03j23p38O5P39l7p56M7O82N6p13j01
3100d23P07J81p23k06O91K39o69l27O99L46o37m13O07M28n45m73N06N31n03n36
$$ y = [159, 93, -162, -65, 161, 94, -156, -135, 170, 144, -158, -166, 147, 175, -132, -188, 137, 184, -137, -213, 155, 228, -113, -255, 69, 256, -84, -265, 68, 298, -41, -310, 16, 301, -21, -320, -26, 307, 20, -324, -42, 351, 75, -324, -122, 323, 148, -305, -177, 321, 203, -306, -241, 304, 262, -281, -256, 264, 309, -256, -315, 244, 348, -237, -349, 178, 378, -168, -404, 143, 416, -121, -438, 84, 444, -55, -441, 16, 448, -29, -476, -37, 480, 49, -454, -97, 459, 143, -467, -172, 439, 210, -427, -225, 414, 251, -383, -287, 388, 340, -354, -334, 357, 376, -319, -405, 285, 423, -277, -432, 244, 433, -196, -510, 166, 484, -140, -529, 96, 506, -73, -518, 16, 531, 12, -540, -60, 528, 80, -496, -138, 510, 153, -476, -169, 469, 247, -473, -247, 456, 333, -405, -340, 399, 362, -394, -347, 335, 391, -322, -423, 284, 465, -258, -464, 227, 466, -203, -530, 169, 515, -122, -535, 72, 500, -45, -518, -12, 519, 16, -520]
3120e20M56N94m05o23L78O03l02o39K57O61j98p07J87O99j42o96O3P00k8o85m0
3141c87O95P9o80j14O43J96o41k21O08K70n88l14N70L36n51l52M91L88m51m62
3161d85M55M82l91n04L60M95k91n35L13N15k53m99J73N35j62n49J30N27q4n22
3181b90K2N81j9n56j4N15N6n09r9M92J37m54j80M60J92m31k53M29K63m06k77L64
3203B3L15l32l24K92L57k88l17K33L29k10l43J82L68j55l57J17L60j12l44O1L66
3224B21m5l52%L24Rl18JK76O1k92n8K56J24l09q8K46J30k59j17K22J45j78j74
3247a75J85J50j86j32J43J72j20j78J16J70j10j32O3J73p6j76N6J37k9j40L5J29
3269G5l4j36L8J04Oj18%R4nm1m3Q0j2k0l4M4M7n2k2M0J8l5RlK0Jl2J2PPJ3lo1
$$ y = [-520, -64, 530, 125, -498, -120, 483, 181, -458, -201, 460, 262, -445, -258, 441, 299, -397, -334, 366, 338, -347, -387, 308, 387, -293, -407, 236, 432, -209, -430, 178, 448, -140, -454, 116, 452, -99, -451, 40, 428, -23, -485, -30, 452, 61, -443, -83, 412, 121, -414, -101, 414, 161, -338, -165, 370, 208, -341, -211, 316, 232, -290, -268, 313, 294, -262, -276, 239, 295, -214, -313, 179, 316, -138, -318, 142, 334, -97, -350, 79, 342, -64, -341, 23, 338, 6, -318, -26, 331, 43, -274, -41, 288, 78, -265, -83, 285, 130, -227, -110, 250, 138, -206, -145, 221, 176, -176, -176, 148, 157, -161, -160, 116, 177, -115, -173, 83, 207, -102, -190, 56, 186, -73, -190, 32, 177, -1, -175, 10, 160, -26, -158, -15, 157, 37, -141, -25, 145, 35, -97, -34, 139, 63, -113, -57, 80, 51, -89, -54, 75, 41, -95, -57, 47, 53, -65, -65, 29, 24, -17, -60, 20, 8, -12, -46, -2, 45, -7, -29, 11, 29, -6, 3, 0, 20, 21, -11, 1, 8, 15, 28, 25, -36]
3302c6L8J7Pn9L1M6l7l6K3N3%j05K2R8Mj25OR5J2r6k3J03M5j33k7J15N3j41o5
3331a15J44R6j64p9J43J12j05j51J42J26j23j77J52J70j46j81J29J72j14j84Q3
3352g0K41r0k49P2K49m4k39LK62J0k86jK79L9k82p3K92P7k96r9K85J13k66j40
3376b13K96J41k81j58K80J79k74k04K29K56k24k79K00L01j81l21J86K97j31l39
3396b40J43L42j15l42O4L55o0l74N1L90m6l30l8L70K4l08r7L34J33l74j33L53
3418A02J72l54j76L28K10l13k29K70K93l03k59K46L23k52l12J97L26j89l30J44
3438a06L55j10l82J13L47n7l93N1L95j8l99j0L98K7l72q8M10P1l61j18L44J69
3460B66l59j65L07K32l00k21K80K42k83k75K81K77k48k82J96K98j64l29J80L12
$$ y = [-36, 2, 19, 26, -33, -2, 44, 7, -29, -6, 47, 47, -58, -36, 62, 66, -59, -53, 42, 54, -42, -65, 38, 83, -50, -77, 38, 91, -50, -115, 29, 125, -39, -118, 25, 137, 32, -119, 23, 149, 26, -151, 1, 171, 25, -156, -27, 145, 31, -153, -70, 171, 81, -168, -96, 153, 109, -130, -127, 135, 145, -141, -142, 137, 176, -106, -179, 113, 190, -106, -205, 80, 193, -73, -213, 83, 224, -57, -215, 65, 244, -30, -234, -5, 251, 27, -252, -52, 249, 68, -253, -67, 230, 99, -240, -97, 245, 130, -212, -148, 207, 147, -227, -176, 214, 168, -162, -200, 170, 194, -114, -211, 123, 256, -118, -251, 102, 274, -80, -256, 72, 282, -31, -260, 10, 303, 0, -259, -13, 310, 58, -254, -57, 269, 80, -250, -106, 249, 139, -243, -130, 217, 160, -233, -182, 213, 195, -204, -214, 184, 211, -161, -249, 161, 232, -129, -247, 97, 266, -93, -258, 49, 281, -19, -240, 40, 282, -1, -276, 5, 282, 34, -248, -52, 246, 82, -247, -67, 245]
3480B45j34l34J11L13j01l27R2K98k3l52M6L23J1l09p0L52O4l16j01L28Q9k88
3502h3j29K46J81k68j75K79J98k83j84K50J91k02k46K06K54j83k54J45K89j52
3522H0k96J23L08j37k68M5L26m2k94L6K56K0k93l1K76N0k75k3K27N5k10r4K41
3545H0J08k37j21K17J41k26j53K31J53j80j81J71J69j27j96J48J88j35j99J08
3565d1J85r4k13J11J87m7k16L0K15mk30OJ73N0j80o5J99O6j97p6J95R8j81r7J69
3590D3P2j52p2J29J13j20j10J12J18j15j34R2J33o7j36N4J09l9j21M2J07j0j24
3613g6K9J20k6j10J1R0M4j29%R1Rq8m7R2M9q6n3J02M9p6m3O9M5m2o4M3P5m9n6
3642b7J3P4l0j08P6K5j8k7L3rK0o8J9L9rl6NM6pk8J7j5J0Nj9L1j0Mj4K6j5OOj6
$$ y = [245, 111, -223, -112, 201, 100, -227, -135, 163, 140, -212, -166, 157, 168, -141, -211, 141, 205, -111, -212, 116, 205, -83, -212, 34, 215, -53, -228, 51, 249, -34, -218, 32, 223, 21, -225, -19, 235, 52, -202, -57, 232, 80, -216, -93, 215, 78, -190, -145, 181, 139, -155, -119, 137, 157, -136, -167, 109, 159, -116, -139, 88, 143, -67, -161, 80, 188, -49, -170, 47, 188, -38, -191, 40, 193, 13, -168, 3, 172, 45, -151, -3, 185, 50, -149, -41, 144, 50, -163, -52, 135, 88, -128, -98, 117, 113, -117, -111, 62, 112, -68, -133, 66, 132, -65, -141, 54, 152, -29, -126, 43, 115, -37, -109, 20, 133, 13, -97, 15, 133, 18, -116, -24, 109, 42, -94, -40, 69, 30, -91, -49, 58, 48, -76, -47, 73, 47, -63, -52, 38, 82, -47, -47, 44, 53, -35, -82, 10, 59, -27, -80, 22, 71, -5, -48, 21, 66, 24, -40, 3, 78, 29, -27, -14, 60, 30, -78, -2, 23, 5, -22, 11, 2, 22, -46, -27, 12, 3, -33, -28, 18, 11, -17, 0, -15, -5, 0, -19, 12, 2, 6, -8, 18, 3, 9, 15, -1]
3676aLOJ9n6QM5J2l3j9K2J8k7J0QNj6m5N6JPn7L6J4rm4NO6pn1JL2Ml3j0N6K4k1
3713B9o4N1J8k5o1P6N4o1l6K4Q2p4n9M3M9k8n8N1M4j5j00J4J07l5q5PJ27m0q1
3742d6J1P7J6j14j2J04K6r4k0Q2M4r2m4Q2O3r4l2O3P5j21l1P5R6j15p5O9R3p9
3770Gq0P6Q0o6q2M2J00o5j01N8J08k3j40N8J15k5j48KJ58k8j41K1J21K6j26m9
3796a02J47L2j28l1J19M3j29l9J35O0j26o9J08J05j20q8Q4J22j32j05J16J07q3
3819B6j63J34J20o8j29N7J01k7j64P5J29n0j32L7J63n7j36%J68K1j84J1J48K1
3843A01j67nJ33M8j33p3J56O7j56m4J20N6j38o0J17J21j50q7J12Q5q7j26J26Q8
3867A04p8j28Q4J24r2j20P3J16o0j23N7J40m7j36M4J43j4j58oJ61lj23k2J28j1
$$ y = [-1, 2, 8, 27, -29, -21, 24, 36, 3, -16, 6, 24, -3, 7, 15, 20, 4, -41, 15, 16, 23, -34, 2, 16, 7, -37, -32, 34, 27, -24, -23, 9, 13, -20, -30, 26, 50, 29, -35, 16, 34, 9, -52, 24, 78, 17, -19, 5, 87, 13, -46, -3, 46, 18, -40, 11, 55, 40, -60, -46, 61, 26, -59, -52, 75, 35, -46, -35, 42, 58, -56, -68, 36, 62, -32, -52, 30, 74, -18, -62, 20, 83, -11, -43, 20, 95, -26, -57, 18, 114, -1, -76, -7, 86, 7, -73, 3, 83, 17, -65, -23, 77, 12, -89, -31, 77, 54, -86, -28, 87, 62, -86, -84, 74, 46, -95, -74, 47, 73, -53, -102, 45, 77, -51, -82, 37, 80, -49, -88, 47, 107, -19, -88, 20, 125, 5, -83, 1, 123, -9, -114, 2, 109, 26, -137, -3, 117, 49, -80, -23, 78, 51, -113, -38, 91, 41, -91, -54, 109, 52, -84, -84, 84, 105, -79, -68, 80, 101, -66, -71, 62, 110, -23, -96, 60, 127, -29, -73, 47, 103, -35, -95, 22, 143, -7, -94, 18, 103, 16, -110, 16, 104, 26, -102, -18, 106, 14, -106, -33, 83, 23, -100, -43, 97, 50, -86, -42, 101, 87, -71, -77, 84, 81, -42, -64, 64, 53]
3892E3j03k9J40L1j37l5J36J8q7q5J26N6j24l7J09L9j09n2Q1R2q6p1P4N9n9r3
3918i3N2J15o6q2P0Q2m9r5L2J00o4o0K6J03m6j07M6J18k1j07M9N6j8p5lP0K0q2
3946b9J1N2K4r2l8Q1K3n2m1Q3J4o1j3L7M7n5m5L7O2n4m1P8Ol3m9K0Q1k7n7RQ5
3977F3k4m9QO9l9n3K7O1l9q4N9M8qo8j2J06k3o8mL4J5l9j2N5k0k8pM7J9n2Q%L0
4010B0l2k2O0K9m5qK3K1l2l2QK8j1j2J3ML5o9L8Qj8j7L1j3j2Oj0K5k5lPL1k9l
4044fmJ3k0K2oqJ7J6pLqj5J0J7j8pJ8Kj4J3J0j4Lj5K9l4J3rM7l5k2PJ6pl1M1o
4081A1K6n5L6mj8j9QL7Ml7J5K7j0j9j5J8M4o1kK2lj3J4OM9n7j1J6jmqML0l9j2
4116b1K9J1j2m3L1J0ok1MJ6J8o5O0j2j1m9K6O1k7roM0jl1K4L4l3k5%N5k6k7j0
$$ y = [53, -50, -79, 61, 92, -45, -80, 56, 74, -13, -98, 28, 84, -40, -77, 32, 71, -38, -90, -9, 83, -3, -74, 0, 59, 0, -93, -41, 74, 8, -74, -4, 78, 29, -66, -34, 66, 2, -58, -32, 71, 25, -82, -36, 82, 61, -46, 3, 59, 41, -34, -37, 33, 53, -29, -18, 34, 58, -34, -72, 9, 32, -20, -61, 22, 36, -25, -38, -1, 46, -9, -54, -17, 45, -9, -50, 28, 34, 1, -48, -28, 53, 26, -31, -22, 63, 39, -10, -2, 67, 28, -25, 2, 63, 24, -60, -1, 47, 39, -29, -41, 65, 42, -26, -30, 4, 19, -20, -32, 23, 3, -25, -32, 15, 34, -18, -10, -10, 20, -12, -34, 26, 55, 10, 2, 25, 46, 14, -18, -10, 18, 7, -5, 8, 12, 47, -22, 16, 24, 6, -11, 20, 7, -5, 1, -9, 16, -9, -12, -5, 26, -3, -6, -10, 3, -17, 5, -1, -9, 8, 24, 17, 20, 12, -3, 7, 24, 6, -1, 17, 19, 5, 18, 28, 14, 17, 2, 31, -3, 10, 1, 48, 13, -9, -2, 14, 7, -24, 17, 11, 37, -18, 18, 14, -4, -23, -15, 22, 26, -11, 4, 31, 21, 2, -13, 5, 49, -12, -14, 8, 5, -8, 6, 12, 61, 4, -7, 9, 8, 4, -4, 0, 30, -9, -21, 8, 19, 7, -36, -5, 5, -1, -22, -18, -2, 16, -49, 11, -1, -12, -61, -35, 26, -1, -10, -16, 24, 23, -8, 16, 50, 17, -8, -8, 47, 21, -6, -16]
4149a6L4J1k1j0QQl9J4N4j0k8j4NMPl7M1Kk0n1O4L1m4k3L8Rk5j3M0J7%k4k3M2
4183C1l6k8K5L9om2K4L4rm3J5OJ6l8%M2j8k1j8L6Pm1J8L0m1Kk7J2N4k4m7M8L3
4216C3m9k1K8L7m3KJ3L9n7j3K7N1m9Oj5M0k1k6K3L8k5l2L0L6k4j6k0J3J4k6j1
4247a8L4pk3mL9j9n0K3L7J2m7JL0K0o2J1L8J0l1%PLqk0N7rl2NOK2%l3K0Rk2j1
4283a2K8pjm2J4M9j2l2J2K0j6lLj9J2NmK6j4J7l0jPj7J7N4m2j5J9RoMj0KJj1l
4320BlNjrJ2ljLlpj8K1nRj0mK9j9oqK7j8j5L4qK4k3Lk3M4j5j3MJ7k3J3jK3k2%
4360A2KJ1j8nL5j4Rm0K9%k4%J0Pk3Lj3RlJ5lj7L4k7J5j1KMk1L2k2K1lj3J8j5J5
4397A1NJ2l9L6%qk0J%k1L6LqL4m5LPpJ1k1J9Ok4pJK6j0j6jK0J7k1KL3l3Ok6J3
$$ y = [-16, 18, 29, 8, -2, 6, 14, -25, -11, 43, 33, 5, -9, -4, 0, 7, -30, 11, 13, -7, -58, 6, 37, -7, -30, 8, 17, -8, -21, 19, 36, 36, 12, -11, 31, -5, -33, -8, 31, 25, -17, 7, 41, 32, -11, 4, 10, 26, -12, -12, 30, 12, -9, -27, 9, 16, -25, -7, 23, -18, -16, -43, -31, 23, -1, -48, 0, 33, -16, -37, -9, 28, -15, -13, 0, 39, -18, -31, -4, 47, -2, 4, -11, 29, 8, -18, 5, 43, 18, -14, 16, 52, 28, 12, -8, 5, 19, -7, -18, 16, 9, -14, -18, 21, 2, -48, -25, 12, 24, -23, -22, 8, 28, -34, -23, 15, 25, -6, -6, 1, 4, -4, -24, 33, 24, -8, -3, 3, 25, 25, -8, 12, 21, -1, -12, 16, 9, 8, -34, -20, 29, 17, -15, -3, 17, 1, -2, 1, -18, -6, -1, -5, 21, 7, 24, -6, -7, 0, -17, 0, 54, 12, -3, 16, 25, 19, 23, 13, 15, 16, 5, 2, -1, 4, 3, -6, 6, 3, 2, 5, 2, -5, -23, -2, -7, 2, -8, -12, 17, -2, -8, -16, 11, -7, -22, 12, 4, 28, 5, 8, -15, 29, 14, 1, 5, 22, -1, 12, 11, 34, 12, 12, 14, 25, 7, 2, 37, 23, 32, -8, 21, 21, -3, -3, 7, 14, -9, -6, -19, -10, -13, 2, -1, -18, 16, -11, 4, -7, -5, -1, -22, 10, -12, 9, 6, -7, 11, -4, 11, 16, 28, -11, 25, 25, 17, -3, -2, -2, -23, 13, 16, 8, 42, -3, 0, 7, 0, 11, -10, 9, 15, -9, -16, -15, 11, 1, -15, -16, 4, 21, 0, 2, 35, 2, 8, -18, -5]
4435e%K7k4K2ok4K8LJ6j4Qk9N3n5L9n2M6Kk0j1Lj2J0%jK3ql1PJ2k3qL4j2qOkl
4473iKJ5k0J6L2m5j6K2L7k2m7L0J3kl5K3K3rk4K5kJ2j6nQK7l7PK3kl7jL6K1p1
4508b8J4RJk6J0K6K3k8jj1M1l9J5OKJl6L5norL0J0k3j1j3N4j3l4k9N8kk9j3K6
4543EOk1l1M2K1m3j4N1mm7mK8N3n5oKN5j3m4J3N2l1m7K0L9nm4J3M5oo2KM4j0j5
4578a1KK7Km0pN0ll8NL2j4l7K8K1J3m3l2O4J9o9qN8L0o3k5N6K8l6m2K4N0k1m2
4611b2L8J4j6m6N0Rj1l3pM0J5p8J5N3lk9NN9j4p6J6N0qm5j6O0mm1QNM8n0m6N1
4645iM7m5n0M9N5k6n3L7L3k2k8J1N4k7n3L3M5o4jnO1m5qj3M6On9J1M2j3m4J5M0
4678B0on5j2P6ol5j9L3M5o6j1M4J6j6j8J1N3n9j4J7L0Pn5J7M0l0m0K9L4j4m1O
$$ y = [-5, -5, 22, -2, 20, 14, -10, 18, 21, 37, 23, 31, 2, 55, 0, 39, -13, 33, 35, 15, 4, 7, -5, 5, 5, 4, 27, 19, -12, -5, 7, -16, -24, 10, -2, -10, -4, -6, -9, -7, 8, -12, 4, 36, -9, -25, -3, 34, 12, -35, -5, 8, 6, -29, -6, 17, 8, -16, 9, 7, 19, 3, -2, 6, 33, -4, 3, 26, 24, -13, -14, 22, 43, -28, -14, -5, -4, -30, -20, 6, 29, 1, 0, -11, 30, -9, 6, 12, 14, 15, -21, 14, 9, 3, -6, 24, 34, 11, 0, -13, 41, 28, -6, -35, 23, 21, -8, -21, 5, 11, -10, -41, 1, 22, -21, -35, 16, 12, -35, -39, -11, 42, -13, -19, -17, 38, 25, -19, -6, 46, 15, -32, -12, 27, 22, -22, -9, 36, 30, -32, -30, 14, 4, -11, -9, 18, 20, -20, -27, 23, 20, -18, -13, 19, 5, -32, -4, 17, 30, -13, -45, 19, 38, -31, -39, 19, 49, -14, -39, 17, 45, 9, -33, -9, 41, 20, -22, 16, 30, 14, -32, 18, 27, 16, -17, -24, 16, 31, -47, -32, 21, 18, -11, -6, 53, 39, -37, -21, 29, 21, -24, -40, 20, 16, -25, -17, -12, 36, -14, -60, -9, 38, -7, -57, -8, 47, 21, -32, 5, 38, 16, -12, -1, 53, 26, -27, 6, 51, -13, -14, -19, 42, -3, -11, -24, 22, 28, -31, -20, 22, 9, -35, -20, 20, 14, -41, -53, 23, 17, -18, -37, -4, 41, -25, -36, 8, 24, 8, -10, 1, 54, -5, -19, -2, 28, 35, -20, -3, 37, 7, -33, -4, 30, 16, -25, -19]
4710a9M7mm4k6O7j3k7J5J9J0n6J4OK6m4J6J5L0l6j4L9mol0J7K1l1QK3MJ5p4L3
4743cK5mm6K4K2J3k2KOll7K1L8l1j4k6O1rj9k6M6j1l4K0K0Mj2j0M2k9k3kK9pk4
4778a9pN9Km4k0L2J0%j3NJ3Qk9KK9kl9J0qK4Nr%MkJ0j8r%mOj0J3j3RPjK7m4K3
4818Gl1K7k6J4K3k6J3j2M8j6l2J2qJ8j4j0J7%J1k7J5K1k8Ll6M3j9JQPnK6m9M3
4852A8mm4K8RK7m9J4%J4Ok3J5K1l8J4qK7l4OKM2k1l0L4K7k2n1L8%Ll3J0L2Nm0
4887ej4J0K9l6k5L1K9k9J2Pnmk5O2%l9l5K4N4m8k5M3N3n9j0N0K5q4j5N4M0l8o4
4920c7J5O0j8m0K2M9k9o5L4N4no2RM8Qo4k9M6N3p3j2N6J9n7j5M1K9l1k6J8M0n1
4952a3l6N2M5j8n1L3M8l6l0JM6l1n1L0M9lq2J0P6k5n5nN1On4QQ2Kp8l2Q3K1m4
$$ y = [-19, 28, 24, -20, -46, 21, 8, -19, -4, 15, 25, -31, -17, -11, 15, -29, -13, 2, 32, -4, -18, 21, 17, 11, -19, -2, 19, -12, -4, 19, 23, 38, -36, -3, 22, 18, -28, -4, 18, 31, 9, 11, 17, 14, -23, -2, 36, 5, -9, -35, 26, 17, -2, -28, 18, 7, -27, -7, 13, 17, 5, -5, 37, 8, -15, -17, 12, 5, -19, -26, 33, 35, -9, -29, 3, 13, 13, 0, 5, 18, 26, -3, -1, 28, 26, -13, -3, -11, 13, 18, 9, 9, 13, 11, 21, 3, -6, -6, -10, -4, -14, -1, -14, -5, 2, 1, 28, -16, 7, -24, 3, -23, -9, 14, -12, 1, -11, 37, 21, -11, 1, -7, 11, -3, -13, 4, 4, 15, -12, 3, 24, -4, -1, -37, 6, -13, -12, -4, 3, -2, 24, -25, 18, 14, -30, -2, 7, 34, -15, -1, -1, 13, 19, -4, 11, 32, -6, 8, 0, 27, -7, -1, 1, 43, 22, -8, 26, 53, 31, -20, 18, 18, 21, -12, -2, 30, 35, -5, -19, -9, 20, -16, -41, -10, 19, -10, 2, 9, 4, 0, -25, 37, 37, -2, -37, -13, 41, -7, -32, 11, 64, 5, -5, 45, 70, -14, -29, 25, 65, 27, -37, -22, 38, 20, -20, 2, 51, 22, -43, -9, 45, 40, -22, -13, 35, 43, -21, -50, -4, 49, -24, -36, 20, 39, -18, -33, 8, 37, 6, -20, -2, 38, -13, -49, 3, 48, 30, -21, 12, 60, 24, -6, -5, 41, 10, -41, -11, 38, 35, -47, -37, 39, 14, -41, -46, 5, 11, -43, -35, 47, 49, -29, -61, 22, 43, -1]
4985an1P1L2n6m5N1O2m9l5M8K0j1p5N8M7n2m1L2M9m3n6L9P0j8q8K4Q5k0q1J8L1
5016A5J2l6m6Q7J6p7l4J03Mp4k8R0K5n2m1L5M8n2l6N6L6m4n4N8O2p0n1L4N8l5
5046Im4J5Q1k9p8J8Q3l9n1jN4Ko4JP8K0r8J8K3L9m3j3L3K8p3j0M4L1m9j7M4M5
5078E7k2p6M5N3m6k0MP3n3k5J4M1l1m4lQ8j6q3M5M0j6l0rL4k1j9k0N0L5o4k5M8
5110DK5m7rJ7N5m9k5N0jJl0J5L5j7n1M9L4p3L1%k0L4m7KK4%k6M0j3JJ0kj5nl8
5145d1K4L1lk3qMK5j0l1M3Oj5l5M1L8n3QMqK7l9K8Pk8mj4J4J3j0K4Kl0k0N4l3
5180a2K9l9J6J1lK5k8oJ6j9K5j9KjrM3m7K3jJJ1j7J1j9L3j0%NoqJ6j6LqJ7j6p
5217dQJ6j4KjMrJ3k7PNj2rOJ4k0l%M8k1k5L1j7oOnM9k8k3K9J6l5jK0K4l6k5J7
$$ y = [-1, -52, 19, 51, -5, -50, 1, 63, 14, -21, 27, 47, 36, -39, 19, 66, 14, -27, 5, 54, 11, -45, -6, 64, 46, -42, -18, 67, 47, -34, -16, 15, 27, -9, -55, 32, 48, -29, -63, 40, 44, -30, -58, 32, 57, 5, -36, -1, 47, -5, -41, 15, 51, 7, -47, 11, 73, 3, -48, -14, 44, 9, -35, -20, 61, 32, -46, -28, 55, 16, -35, -36, 18, 20, -44, -43, 35, 55, -43, -25, -2, 37, -6, -19, 14, 42, -31, -41, 3, 34, -15, -32, 12, 57, 35, -41, 4, 57, 11, -9, -5, 68, 15, -10, 4, 45, 14, -30, -33, 55, 39, -44, 1, 41, 25, -5, -14, 20, -1, -20, -40, 10, 45, -19, -44, 4, 29, -18, -27, -10, 45, -4, -29, 21, 20, 21, -9, 6, 41, 24, -27, 22, 56, -17, 14, 14, -6, 28, -19, -17, 7, 7, -19, 21, 8, 9, 19, 17, 2, -3, -41, -17, 14, 11, -12, -20, -16, 9, -1, -32, 11, 17, 2, -33, 8, 46, -7, 1, 5, -3, 24, -15, 13, 20, -8, -12, -26, -12, 1, -9, 15, 17, -13, -33, 21, -12, 17, -22, -6, 5, 2, 27, -1, -7, 9, -10, 15, -4, -2, -3, -12, 31, -16, 7, 6, 7, 18, 1, 12, -7, 26, 16, 16, 21, 15, 7, 23, 7, 10, 2, 19, 3, -4, 4, 20, 6, 8, 7, 11, 2, 15, -12, -5, 0, -12, -21, -15, -1, -21, -24, -24, 24, 3, -22, 9, -8, -14, -8, -13, 36, 8, -15, 14, 30, -5, -6, 14, 38, 2, -23, -6]
5255fL4j8k8J1J9Km2mO0ol6J1M3k5nl2N6m1LmQJ4n3K9M4k2j5j8L9j8K5j7K4J0
5289D2l0k4J1L2k3k9J6N1l9MOL7n0m0N1M8n3l5L1L6j8n6JO4j4m1jN5oo4%O0lm5
5323b6l6Q3Lj5k2L8K6n2l3L3M2m0k2M8M1n7%K7K4m7l9M2K8l9m1J8N1k1ok3O8m7
5355Fl0pN1J7o5RL3M7p0j1K8L2l7k8M2J9k5k6L9Lj8l9M0M5m8l3O0Ol0l0J3L0J
5388B4n5J7K1%j5l1N5Pl2k3O1j7l5%K0om3K7M1J4o6J0P2nl9j9K4L9l0j3J6J1l2
5421bk2M3M3n4m5K4O5l7n8L3L4k1l8J9M3Rm4m2P5k5k9MK9Mm0J3L0j0k2pJ8K4l0
5454a6k7N3N1p4lK6M4m6k6L3K8k9m4M5K8l1k8L9Prk0%K2oj8qL0rk9JK2Ql2j3L9
5489HRl8LML4l2k2O5k0lj9K2Lj4qPN2l9l4L5Qk9K0k3L0ok6oL2ll3J0M7k5j2j1
$$ y = [-6, 28, 10, -18, -7, 12, 14, -28, -32, 28, 22, -14, -3, 40, 15, 10, -22, 34, -7, -4, -8, 0, 14, -39, -10, 34, 12, -3, -21, 18, 0, 25, 8, 32, 42, 12, -12, -1, 31, 8, -21, -5, 46, 7, 11, 17, 54, 4, -36, 15, 63, 10, -25, 6, 42, 24, -32, -31, 33, 19, -22, -23, 32, 26, -38, -38, 22, 19, -26, -62, 21, 24, 9, -13, 25, 51, -1, -34, -1, 41, 1, -21, 27, 68, 11, 11, 38, 62, 15, -24, 18, 46, 7, -34, -16, 35, 14, 8, -15, 53, 6, -24, -31, 20, 37, -28, -19, 14, 61, -9, -20, 8, 40, 3, -25, 17, 36, 11, -15, 24, 27, 9, -30, 10, 55, 7, -26, 34, 40, 10, -20, -7, 23, 24, -31, -14, 7, 7, -8, -39, 16, 23, -9, -32, 29, 12, -23, -23, -3, -9, -52, -25, 16, 30, -36, -26, 46, 41, 2, -17, 7, 46, 16, 3, 19, 30, -2, -24, 19, 62, 8, -37, -13, 52, 15, -43, -10, 24, 3, -35, -16, 27, 36, -8, -50, 25, 0, -29, -25, 4, 8, -32, -19, 11, 1, -21, -28, -10, 14, -16, -43, 10, 61, -13, -16, 10, 54, 8, -18, 15, 43, 14, -30, 15, 43, 12, -16, 23, 30, 21, 1, 1, 23, 17, -1, -9, 21, 12, -17, -16, 6, 14, -18, -31, 8, 17, -21, -18, -14, 20, -12, -34, 31, 11, 8, -11, 11, 14, 0, -8, -1, 51, 12, -22, 13, 21, -8, 12, -11, 19, 13, -13, -19, 13, 10, -23, -13, 34, 9, -3, -14]
5525a4L5k5jNK4n0qK4L8k4j1JJ1Oj6jQkRj2LL1j4pK6pk9K2oONk4k4K6lOkLMLl0
5566a4L6j4m4kL6MlQk2J5qRroK0PrqJ7J3j2Jj3J2Oj8K4j3k9L9l8M2Rn9N1nk1P
5604Ij4rK0J5j7J8j2k4J1J7Kj8j2mJ1%oJ9J9m4K8rjJ6k1L9%m8J3L9j7k2LK9k4
5639FJ5k2K6Nk0QRNk9l0L8lJl1qM3j5j5j3N8o3J3J8J3J8k7j1K8J1l6%J1L1k3q
5674CJ9K4n8kL1J5j1k0K5L3p6j4L0J0j9k6L0K1Ko6M6K7ml1K4j3K6n1rN9l1J7k7
5707a6K7K2k9LM8m8qk3M1j8j4K3L4j2m3oJ7K9j0k8K0J7l3J8j7J3mn4M4K6k1j8
5739b0K5J0l6j5K8O5n4l3L0Nnm3QM0J7o0K4N3l8LOJ6K7r3K8M3J9n1OJ5MNo9M8
5773Hkpj8J0M5k1l2K9Rj1m9J7L8j2p2M8M4k1k8J7L4J4p0K7N6l2j9pJ6K5n5K5J5
$$ y = [-14, 21, -4, -5, 0, 24, -26, -34, -10, 28, 4, -7, -6, 5, 11, -5, -6, 2, 0, 9, -3, 0, 31, 17, 10, 36, 29, 0, 22, 16, 22, 27, 3, -21, 5, 2, 8, 6, 9, 13, 16, -14, 22, 8, -36, -38, -2, 2, -1, 7, -15, 0, -8, 1, -8, -14, 6, 13, 4, -4, 13, 26, 14, 15, 2, 14, 20, 2, 26, 13, -16, 23, -15, 27, 36, -23, 28, 23, 2, 9, -5, -14, 6, 21, 4, 22, 10, -14, -3, 14, 16, -2, -14, -18, -7, -7, -13, 6, 25, -19, 9, 0, -1, 15, -6, 33, 33, -15, -2, 37, 20, -2, 1, 30, 6, 21, -1, 25, 30, 10, 18, 27, 32, 3, -27, 11, 8, 9, -22, -30, 13, -2, -17, -30, 28, -35, -22, -4, 9, 27, 0, -11, 17, 28, -8, -8, 3, 34, 11, 3, 22, 46, -12, -14, 17, 32, 21, 1, 26, 59, -17, -31, -1, 9, -10, -36, -6, 15, 17, -49, -3, 24, 20, -11, 13, 0, 26, -25, -34, 25, -6, 11, -16, 11, 33, 4, 7, 55, 7, -1, -24, 17, -1, -15, 8, 42, 30, -13, -19, -2, 27, 17, -11, 9, 26, -7, 11, -6, 7, 3, -51, -7, 19, -2, -20, 5, 15, -21, -36, -8, 57, 3, -30, 0, 5, 0, -43, -35, 5, 22, -38, -14, 39, 1, 4, 10, 26, 53, -40, -12, 31, 50, -1, 5, 20, 24, 29, -40, 8, 6, -1, -19, -9, 36, 15, -17, 12, 21, 10, -39, -22, 16, 4, -68, -20, 24, 3, -25, -8, 26, 40, -30, -3, 53, 21, 2, -5, 11, 36, -19, 6, 21]
5806B1Mj8l4L7J4l9nK7J8j7k3L7Lk0l3O5%n5KJ6QNm8J0N3m4j0J6J9k3k1K0K3K
5840A0k1j8M0j3rRK1Mm8J6K8J6m2jJ4J1j0l1N1ok4l2M4J1k8j9M1pj8j1M4kj5n1
5874d6L3K6Kl8K1OJ2j1j2J8j0nK4LJ5l2OJ8k0ll5M6J2m2%L7l1M4m8KL3l7OK7Q
5909B9l6j7J7K4j8k9K8K4jl8J1L8j2k6L4rm0L1J4MRj9k3j8K6JNJ0K4m1J4lrK1
5943B5j5J5oj4Ql3M0l5OKlj6L8LNk8MJ8l4K9oj2OqM2k9kLLJ5l1K2kK1k4J6rJ9
5981C3k4j6J4JLmk4K8j8JkOrJ5kj0L1j2k2K3l0K7mkJ9Kj9J6nj1L8k4J7m3OM2k1
6018B0j7K2J3k3pj5M4jm6L1nJ9m1Pj0L6j9qj2K3k9PL5Jl5pNL3k7l5L8K3ml7L0
6053IRJ3m2NK7l9MQK4J8j9J0Nlrk2K6j6rj1QQj0l1J1L7jk4J1J4j7j5L3Rj4k0L4
$$ y = [21, 25, 7, -27, 10, 24, -15, -20, 7, 25, 8, -15, 22, 25, 5, -28, 37, 37, -18, -16, 0, 8, 13, -35, -25, 28, -16, -26, -10, 9, -14, -35, -15, 8, 10, -11, -29, 11, -2, -11, -2, 19, 23, -25, -9, 19, 35, -7, -8, 6, 17, 7, -24, 27, 21, -3, -35, 9, 20, -8, -27, 14, 7, -11, -22, 22, 20, 5, -46, -13, 13, 15, -23, -2, 4, 16, 5, -7, 11, 1, -4, 20, 23, 38, 6, 12, 30, 10, 7, -28, 18, 30, -12, -12, 25, -6, 38, -10, -8, 25, -12, -6, 21, 29, -7, -24, -7, 17, -1, -30, -2, 22, 21, -17, -6, 32, 20, -6, 28, 19, -21, 10, 24, 28, 37, 18, -5, -23, 3, 4, 9, 19, 43, 2, 16, 13, 4, 25, 10, 25, 19, 5, 13, -20, 20, -15, -9, -7, -10, -26, 12, 15, 20, -8, -4, 14, -20, 9, 3, -9, -3, -11, 31, 2, 0, 3, 6, 21, -10, 12, 10, 31, 7, 23, 14, 33, 9, -7, 7, 8, 11, 7, -17, 11, -7, -6, -8, -2, -11, 4, 2, -8, 23, 11, -11, 12, -18, 9, 5, 3, 22, 24, 5, 21, 16, 5, 43, 19, 36, -7, -1, 41, 20, 3, 25, 38, 15, 8, -7, 37, 36, -10, 21, 16, 35, -6, 1, -9, 27, 8, 0, -12, 11, -18, -11, 24, 25, -10, -17, -12, 21, -6, -41, -3, 20, 16, -21, 9, 18, 31, -11, -6, 21, -18, -14, -6, 18, 36, 17, 27, 32, 29, 20, -2, 24, 8, -1, -12, -4, 4, -6, -37, -26, 11, 10, -14, -3, 11, -6, -21, 12, 21, 7, -13, 21]
6090B1J9l9r%L7j3l0L1J5Nm1K0M3l1l6qM5K0k8oK9j1k3k1L7mk1k2L3J9k9k0K0
6123BKLl1M0J2m2jJ5Nj0l0K5K8ll2RN4pl5OJ5Jn1L3K4Ol0jJ5K9m4J2j2K0l9PK2
6160A7j6j2JJ6J8l4k3K6K6j6j1RJJ3m6K9L3k3lK7Jjl8j1N4j6j5nJ4nl5QM4rnj4
6196aJ5J4m7K5J3Lk8MJ7ml5KK7L3k5m1J4M4o7N5j4K9j3j2jJ4kmJ2j0K1n0NK3R
6231B5k2K3J5k5j9oM6k4l2M3k9K3l1K1J7j6k5J3pL7l7RJ4J1l1k6M3K5m6J7jJ9
6263B4k6QM0m1J2lJ3Jl9L3k1K3Pk0J1Kj3j8OJ3Lpl0J8RJJ4j3J5l2j3K5j7MPk2
6299b6N4pl0J4K2l3J8KL1j5oLJ8l0pL8n0RJ0Nk5NoL0k8K6j8k3J2J0J6k3J5qMq
6335aj5J0R%k1J0j%J0jlNk1J4J7PJl1JJ4Lj%J9k3oLK2J5l9J5l1K9L1rl2K0k1j9
$$ y = [21, 40, 1, -8, -8, 29, 16, -14, 17, 32, 37, -4, 16, 59, 28, -8, -16, 29, 49, 21, 15, 44, 33, 10, -11, 26, 22, 1, -21, 12, 31, 2, -18, 2, 4, 7, -24, 16, 28, -14, -15, 0, 5, -5, -35, -10, 18, 15, -17, -8, 46, 39, 4, 10, 25, 26, -25, 8, 32, 38, 8, 7, 22, 51, 7, 19, 7, 27, -12, -5, 17, 1, -11, -10, 6, 24, -10, -33, -7, 19, 3, -8, 1, 2, 15, -31, -2, 31, 8, 5, 32, 33, 32, -6, -17, 37, 21, 6, 1, 15, 10, -25, -17, 27, 18, 13, -1, 14, 28, -19, 6, 19, 22, -6, -2, 15, 11, -24, -22, 5, 38, 13, -28, -14, 30, -37, 18, 4, 33, 20, 8, 7, 21, 19, 15, 27, 17, 38, -12, -7, 16, 25, 3, 26, 41, 16, -3, -9, 37, 13, -19, 24, -5, 18, -13, 8, 25, 9, -16, -3, -10, 27, -10, -1, 13, 24, -7, -33, 10, 35, -11, 6, 5, 24, -2, 6, 46, 5, 17, 14, 27, 28, -11, 22, 1, 24, 31, 11, 22, 24, 11, -7, -1, 12, 15, 8, -22, -4, 5, 6, 20, 7, 22, -10, -23, 2, -15, -11, -4, -26, 28, 21, -9, 5, 27, -6, 12, 14, 45, 30, 24, 27, 45, 15, 8, 46, -4, 5, 15, 20, -5, 0, -6, 24, -4, 22, 4, -19, -7, 3, 19, -4, 11, 3, 7, -1, -16, -6, 3, 3, -18, -8, -9, -9, 1, 0, -3, 2, -19, -5, 12, 19, 20, -11, -10, 4, 7, 6, 6, 25, 2, -4, -1, 21, 36, -3, 12, -19, 10, 41, 32, 0, 20, -1, -20]
6374b0j2K8j2J1K0l5N8o3J8RJ0oRk2K2Rjj0j2J8pJ0Qj3l0M8oj1j4J0KljLKoM%
6412A5Ll6jlJ9j2kL3j0Ml9M1LPj9pk1J9J3qOonQJ9j2qJ7Jj5k2L3qL0k4k1K3J0
6450B5m7J5J3J4j6k4J4J8n0NK9Lj0j2J6nRNj7M7j8k8JJ6rQL9j9Km5K7K4rk2%L3
6486C2ok2%L6l4k1KL0LK2m8KqJ2kj%k0J4L4qpk1PJ1Mll2L2%k5K7Pj9nK6Qj1j3
6525CJ7Mj6OplL6n1K2J4k1Mk4K3J4nLQk8Lk3L7Pl3jNJ2J2l8KK8Kl6jL5j6Kj0M2
6564B8%l1J7KMl3L0rJ6j9j2L3Nk4l2K6MLl2RL9k4j7J1K7j7nk2L5mk6J7L7p4M0
6599BnRk6JJ6K2k0J1MqJ7j3jK3k0RkKm0M5nj1J3m2M1l7J8j2mJ5jJ0mJk5PoK4K5
6638C3k9kj3KJK7rkPj3kJ5PPj2J8k3J9j2J6l1KMJ1m%j7OK3l8J0j9J3opK9j6J5
$$ y = [-20, -32, -4, -16, -5, 15, -20, 38, -25, -7, 2, 12, 6, 15, -7, 15, 24, 23, 13, 1, 19, 12, 22, 30, 17, -13, 35, 29, 18, 4, 14, 16, 13, 12, 15, 17, 11, 15, 15, 18, -18, -19, -22, -3, -15, -17, 16, 6, 10, -29, 12, 15, 22, 3, -4, -25, -6, 7, -1, 5, -1, -6, 2, 21, 9, 1, 18, 19, 4, -18, 15, 7, 37, 13, -8, 15, 25, -22, -7, 6, 20, 4, -20, -6, 12, -38, -33, -4, -1, -11, -23, -7, -12, -3, 2, -15, 32, 14, -14, -13, 3, -6, 2, 41, 22, 24, -21, 6, 30, 21, -1, -1, 32, 26, 4, 4, 40, 6, -15, -13, 17, 20, 42, -6, -4, -12, 0, -2, -3, -3, -23, -9, 25, 17, 10, -11, -4, 7, 11, 8, -24, 8, 8, -17, 10, 17, -2, -7, 19, 27, 16, 3, 20, 24, 8, 14, 7, 4, 40, -11, 11, 25, 4, 8, -16, 7, 21, 16, 19, 27, -1, 2, -21, 16, 23, -10, -11, -6, 6, 18, -20, -18, 10, 12, -24, -25, 10, -6, -4, -14, 28, 28, -3, 14, 16, 20, -13, 17, 8, 24, 5, -7, 26, 31, 7, -25, 1, 5, 8, -24, -15, 24, 0, -17, -6, 21, 4, -1, -23, 12, 8, -18, -1, 36, -38, 2, -3, 6, -20, -19, -3, 19, -1, 10, 14, 6, 23, 10, 9, 32, 12, 21, 19, 21, -19, 26, 21, 10, 23, -19, 22, -15, 3, -9, -13, 2, 1, 11, 7, 8, -17, -10, -16, 8, 33, 4, 2, -11, -9, -8, 19, 10, 8, 15, 2, 0, 15, 22, 29, 17, 35, 12, 31, 19, 35, 4, 6, 10, 21, 17, 17, 0, 6, 29, -9, 1, -18, -5, -11, -18, 11, -5, 10]
6676A0lk2J1Rj8J1j2J9Oj2L1m2J6nLpPj%Lj1pK0j0J3KnK0n0M5k2J1K6l9Pj3J7
6713Hk0PRjj8L5mj6j8J0J0jj9KJ4oK8j4j5lJ9Mj1oNMnJ5K0moQm8K5jk1K6J0nl0
6753a3J1J0Lk7L6k6Kj3RkQnJ5J2k7%%kRj5J8pMJ1k6N4l4moJ4J0k3J3J6lk8K3k4
6791gL6l0pJ5j0%j3L3jj0k7J6NqK9m0MJ1oNK4Ql1jOK2m1K2K7mLl6J5K5n1L0J2
6828B5J4l6k6N5nj4j4J0Rpl5J4L1m2J6NNm2K9oL8l2j6mK3jOj0NK8k8J2K3j3k3
6863fL8k0Mj3J3j2J4Mm7M0Ok7OJ2K3m7MJ1KLj4j2L7Nl3l0N1j5j1QJ9Mm2kJ0K6
6899Ij1lJ2Kj8LK6oj2RK8Ql8J3Nk1pmM1j9j0k5L3lj5J5k0K5ok3J9Pnj6j3M4Ol5
6937eJ5Jj0J1pJ5om0J8J3Jj0qL1J0k4JJ3J9n8K4J2Mrl4L4J9ll7%J9k4J0qJ7j2
$$ y = [10, 7, -15, -4, 5, -13, -2, -14, 5, 11, -1, 30, -12, 4, -1, 2, -5, 2, 1, 1, 4, -7, -14, 6, -4, 9, 11, 6, 26, -24, 21, -1, 10, 36, -3, 4, -9, 8, -12, -5, 4, 3, -15, 20, 16, 0, -18, -8, 2, 1, -18, -16, -2, -8, 20, 6, -9, -12, 7, 11, 0, -6, -1, 3, -2, 13, 33, 29, 23, 31, -17, 8, 7, -14, 12, 22, 17, -13, -2, 8, 11, -16, 20, -6, -4, -17, -8, -10, -2, -7, 8, 20, -7, -7, -7, -9, 0, -15, 3, -4, 0, 11, -15, 39, 5, 1, -5, 9, 19, -4, 9, 25, 22, -6, 17, -7, 29, -1, -8, 7, -3, -3, -16, 17, 16, 6, -21, -5, 0, -8, 21, -19, -15, -4, -10, -5, 19, 27, -4, -5, 1, 23, -18, 4, 31, 27, 30, -6, 9, 34, -17, 13, 25, 39, 3, -23, 32, 27, 13, -1, 9, 18, 11, -24, -10, 21, -21, -5, 0, 5, -37, -8, -14, 24, -8, -24, -28, -5, -6, 0, -10, -5, 23, -5, 7, 30, 17, -6, 32, 12, 16, 3, 16, 4, 18, 22, -25, 15, 21, -6, 0, 12, 35, -12, -8, 3, 5, 8, -6, -18, 19, 24, -9, -39, 12, -3, -14, -6, 13, 17, -25, -27, -17, 9, -2, -5, 7, 9, -9, -6, 20, 14, 2, 11, 39, 47, 9, 22, 27, 6, -1, -5, 36, 17, 7, -18, 15, 12, -3, 12, -8, 17, 11, -12, 7, 14, 9, -7, -20, 24, 30, -5, 10, 11, 1, 12, 5, 20, 14, -26, -8, 5, 6, -4, -12, 19, 29, 5, 6, 19, 38, -20, 4, 16, 20, 11, -23, 11, 30, 27, -10, -10, 9, -15, -5, -13, 4, -8]
6973hPJ1j3nqK7Jj2j6LK4Ql5J0K6j2Jjj9M2m3L7L2m2k4J0j0M0k9j8N1l8K2k1K3
7008B1k3J1k9K1J1kk4nL8lm3K2j5L3k0j7L6J0jk2NNPj4kQkj4J8L0m8K0%RpOj7
7045CQJ4j8J0j2K1m1K0k4L2l2L8k0oPRj1plJ5J7l0L6k0jMpl2O4k0j4jJ7rK0l8
7081a1L5j9K6mk5J9Jj1qJ2k6K5Kl1K8j4KJj5Jj8J0M5j0l4K7j8NJ0K1j1k5L4k7
7115cK1k5J2K6k3j1J0MRj7K2Rl7J2lkJ9k3K3j0J3j2l4L1rkoj0pJ5NomK4J3k4l
7152cJ2jJ0k0QN7k6k9k1M9qk7K4qK3k9Pj8J5Ll1M1pJ0l1oj5K8l4KM1k5J4qk3N8
7188C2l2NKJ8m3K5Qk3NkJ6J0Jj6j2ONKK1Pl9J0J3k2J5Lk2M2k8j2K4j3j9J8JMj
7225Ik4LQqNK5Pl2K%L1j4j5J2K6j3l0JPJ8Nk1K7k3ONJ3kl6PK3k2Nk1%K5lj3N%
$$ y = [-8, -1, 10, -3, -8, -16, 11, 12, 0, -16, -13, 11, 19, -16, -6, 20, 8, 9, 8, -11, 31, -12, 25, 57, 15, -9, 1, -9, 31, 2, -16, 35, -3, 19, -2, 21, -2, 9, -20, 1, 12, 10, -14, -19, 19, 16, -27, -5, -20, 13, -7, -24, 12, 22, 21, -1, 4, 9, 16, 2, 0, 8, 6, -8, 10, 40, -8, 12, 12, 21, 14, 20, 3, 11, 25, 7, 17, 5, 26, -15, 5, -19, 13, -19, 19, -1, -7, 0, 9, -2, -9, -12, 3, 20, -10, 26, 6, 5, 9, 2, -30, 34, 14, 0, -1, 16, 7, 27, -11, 24, 5, 31, 27, 2, 21, 22, 11, 3, 15, -11, 14, 16, -15, 13, -1, 1, 2, -13, -12, -30, -20, 25, 15, -19, 8, -10, -5, 5, 26, 15, -10, 24, -3, 18, -7, 5, 31, 8, -3, 7, 11, 20, 3, 25, 34, -3, 9, 6, 4, 23, 0, 23, 13, 26, 14, -20, 11, 2, 0, -6, -16, -23, -8, -3, -9, -13, 11, 24, 0, -3, 9, 8, 18, -2, 6, 63, 37, 8, -13, 36, 28, 1, 25, 17, 40, 11, 18, 0, 15, 18, -13, 28, 21, 31, 0, -6, -21, 7, -27, -25, 16, -9, 5, -3, -26, 32, 0, 5, 7, 25, -18, 7, 15, -8, -3, -5, 11, 21, 22, 6, -6, 0, 5, 7, 28, 35, -4, 6, 19, -3, 12, 15, -7, 35, 7, -5, 19, 6, -13, 5, 6, 10, 9, -15, -12, -4, -12, -7, 18, 25, -7, -5, -5, 26, 12, -3, 9, 35, 22, -8, -7, 0, 18, 23, 2, 29, 6, 12, 17, 30, 28, -8, -1, 22, 0, 5, -16, -16, 9, 6, -7, -2, -2]
7265bpj8K7j5j2rJ1J1Kk9L9j2NRJ2qMMj1J9k2J9MJ6pk7pK9Nk9%J9kj6Mk1L8Lj2
7304A4J1j9j7j8L0J9l0MNL0l9J3j2J9Nl7K2J2j8j9NM1%j3j7K8j4lmJ1J3l2j0N3
7338C3j3j8j3K6J1k8k9NL3PKk2K7k6Qj8J5lJ1j0J7k7J%K1Jk4J3K6j7qL3k2j8J8
7373A2LoM3m9L4m5M9k0OOk7LnPrL1j6KPj1j7K2j7k1k2M1J6j8j0PPJ7j5j1j8LL8
7410A7j5kJ7k1K6j4K4m0K1J7m1M9k3j3K7j6J1j6qN%KJ0l0pK4l5J7K3k0K2qOj6
7444grML6k2oJ2K8k8j5%j1L2qK0jj0J1j3%k0K0QklJ3Qk2q%ojj1K0o%jj5ojJ3k7
7485c4J1K2pqL3j7Ol8L8oqPOJ4j2LJ1j3J5J0jl1NjJ0J2k8M0m4m%Oj6M0l2J8qo
7523glLj4J9J8l1J8J2jRk3J7k8J8K2k8mRLk1L6j2K0j7k1J9J3n3M8j8J6Lk5K3k3
$$ y = [-2, -9, -27, 0, -15, -27, -36, -25, -14, -12, -41, -2, -14, -9, 0, 12, 4, 8, 12, 1, 20, -2, 17, 21, 37, 30, 3, -4, 25, 30, 1, 1, 20, 18, 2, 6, -15, 23, 26, 14, 25, 6, -11, -29, 1, 20, -10, -6, -1, 29, -10, 3, -9, 10, 15, -22, 0, 12, -6, -25, -20, 21, 21, 8, -9, 19, 5, 2, -2, 9, 22, -10, -20, 33, 20, 2, -11, 15, 26, -2, -31, -26, 7, 14, 16, -6, 21, -5, 3, -15, 0, -3, 8, -2, 15, -12, -11, -11, 10, 11, -13, 0, 26, 9, 1, 34, 12, -6, 12, 15, 9, 52, 3, 37, -8, 41, 21, 27, 33, 6, 9, 4, 11, 2, 33, 17, 19, 26, 15, -2, 20, 3, -18, -40, 1, 17, -1, -11, -4, 3, 20, 5, -6, -24, -21, 17, 2, 0, 17, -4, 22, 8, 32, -8, 13, 30, -11, 38, 15, 2, 29, 13, 24, 8, 0, 5, 5, 7, 17, -13, -20, 4, -31, -14, 9, -11, 11, 3, 9, -7, -16, -12, 24, 2, -4, 8, 36, 8, -7, -7, -18, 14, 6, 26, 25, 15, 26, 13, 13, -7, 13, 21, 19, 16, 29, 37, 15, 7, 7, 1, 0, -11, 9, 3, 3, 2, -13, -19, -20, -7, -34, -23, -1, -8, -16, 17, 0, 6, -32, 6, 0, -8, -1, 5, 19, 7, 10, 21, 8, 23, 33, 32, 1, 6, 5, 15, 27, -1, 39, -5, -9, -9, -3, -19, 21, -11, 7, -1, -7, -10, -7, -21, -2, 16, -15, 3, 15, 14, 23, 0, 17, -11, 7, 29, 1, -3, 6, 9, -12, 24, 12, 32, 15, -6, 13, 26, -27, 21, 3, 19, 22, -3, 20, -3]
7558cJ8l6jmMM0j8j7K5K0k9rL8m0MJJ1j0jK5ll8K2PJ9nk1L1j8j0J0Ok2njL1nJ1
7596B7jLqk4ROLk4OoKJ8k1J7Rl1L7k3K4k3J6j1j1OMk0L2Rj9rL4k6RJ8nJ8m7j3
7634a5K6kJ1j7NlNk3PrJ0ol4M8j3kK9j6Rj8NlJ6rlj3J4j4JL8l2Kj0N1j7kj4KJ5
7673A9j8j0%KJ8J2Kj8k1L5j5J2kk1K9j8Moll1M0rj4RmQj0PJ5l1j8L9j2nJ7NNK4
7711C6k6l1K1J4k4QL7l5mj3M5l3K8j1j5J6k1J3pOj8K0%k7POJ3k1N3n3rL1J1k5
7745hOPj6Nj2J4K5l4L2j6j2kK1J1k8J1L%J0oQj2MJ0j3J1k7L4k5k1Rj2OQOoRj7
7783a7K3k0PL5J0l2K1k0qpJ4rLJ0oNK0l4K9Jj6K4l2nJ1QqJRkLj8J9j2Jj9J7Po
7822GJJrk1OJ4j4L3k8lL5k7L0k4qK7pnJ2mk2K9k3K3Mk6J8k3J8NLoj4mJ1l0K3P
$$ y = [-3, 15, -21, -22, -26, -22, 18, 0, -17, 8, 28, -1, -10, 28, -12, -8, -7, 4, -6, -7, 18, 15, -23, -1, 6, 25, 20, -1, 30, 12, 2, 12, 18, -4, -9, -10, 21, 16, 27, 26, 29, 21, -3, 6, 12, 15, -9, -3, -9, -7, 11, -10, 7, 16, -15, 22, -1, 23, 0, 16, 5, -6, 0, 4, -16, 16, 25, 6, -3, 31, 5, 14, 32, 27, 45, -2, -15, 11, 9, 20, 3, 8, 5, 10, -13, -6, -15, -5, -11, -45, 3, -10, -12, 17, 1, 10, -8, -3, -6, 10, 1, -2, -15, -1, -15, -14, 24, -8, -6, -16, 35, 18, 16, 2, 4, 19, 1, -9, -9, -7, 11, 23, 25, 7, -14, 21, 6, 18, 16, -5, 24, 6, 10, 4, 1, -30, 10, 1, -13, -4, -8, 0, -10, -3, 12, -19, -37, 2, -10, -15, 2, 7, 12, 36, 10, -21, 0, 14, -10, -2, 35, 0, -4, -17, 28, -5, 23, 12, -3, 13, -8, 5, -2, 4, -14, 6, 6, -21, -14, -8, 5, -16, 37, -16, -25, 6, 17, -8, -2, 5, -11, -6, -18, -4, 21, -13, 19, 3, -9, -11, 10, 21, -7, 4, 7, 7, 17, 11, 19, 7, 11, 21, 8, 19, -8, 26, 1, -20, -11, -23, -17, -9, -3, -9, 0, -17, 6, -14, -7, 28, 38, 6, 27, 7, -1, -8, 6, -3, 0, 10, 4, 9, 29, -5, 24, 25, 9, 33, 1, -4, 7, 15, 7, 8, 17, 15, 18, 0, 19, 7, 8, -11, 6, 13, 7, 8, 9, 0, -21, -15, -1, -15, 18, -10, -13, 22, -5, 25, 1, -7, 20, 13, 8, 20, 16, -6, 23, 0, 23, 27, 1, 19, -4, 14, 19, 22, 16, 2, -2, 9, -21, 2, 9]
7860Io%j3K2oOJj2J5k4%J4lmJj6J4jOJ4pl3K6L0l7M4j6rlmJ3J7j9Rj5qJ5k1J9
7899A8Jj3Nqj6K0JNj8LlOJ0k6J1Jj2J9l2K8K9k4%KJ5Rk8rJ8j2qJ6J1j7QQj9J0
7937Ik7J0K4mk0JK7k0J8qJ0k6kQnJ0J4Ql2J1j4PROj8J1j%L2m1K7Lk0J7j5K8j5
7974B2j0J4j6j7J5J5J1pl2J8kOk2K6j8o%Mj4K3J0l0OlK2pqqjRJL9l5k2L1%mJ3
8012B3l3M6kn2L6oJ4j6K1l0L6l6OKrkjKJl0QoK6J2m4K9J4mj3%KJ0RmJ0qRPj0J4
8052C1j0j4Mk5M1j9J7J1j1j7qJ6k2L0j5Nmj0lJ6j0lj2LL1ok8RJ5k9K8l9N1l9K6
8087A0Lj9MJ1j9J3OLOQQl1M1k4LlJ6m2MK8j7k1mJ4nM0l6%RLJj0jrolM8k5mm%R
8129Ej9J4J3j2QJ2nj1Jj5M1Ml2MkOJ4jPj4k2j2J4LJ3lk0J2k6L1k3J3oooK9j2r
$$ y = [9, 3, 3, -10, 12, 6, 12, 13, 1, 16, -8, -8, 6, 3, -1, 0, -16, -2, -3, 3, 17, 10, -23, 3, 33, -4, 40, 24, 15, 12, 8, 21, 38, 19, 28, 13, 5, 20, -1, 18, 19, 6, 11, 3, -13, 7, 8, 13, -5, -2, -5, 1, 11, -15, -4, -3, -15, 4, -28, 0, 29, 5, 5, 7, 22, 31, 3, -6, 12, 0, -8, 8, 19, 2, 10, 18, -1, 9, -18, -8, 16, 12, -8, -7, 20, 0, 18, 10, 20, -6, -8, 0, -5, 5, 19, 27, -5, 6, -8, -1, 8, 14, -4, 7, 6, 6, 38, -3, 24, 27, 7, 24, 9, 37, 22, 12, 26, 10, -7, 8, 23, 34, 27, -5, 13, 11, 17, -5, 21, 3, -3, -3, 1, -13, 10, 20, -10, -4, -7, 15, 8, 0, -8, -9, 0, 1, 40, 5, -17, 14, 14, 10, 23, -10, 36, 34, -18, 18, 12, 26, 10, 31, 1, 37, 1, 7, 9, 0, -2, -3, -1, 0, -30, -22, -28, -2, 10, -34, -5, 9, 5, -8, -8, -6, 4, 13, 9, 19, 11, 20, 27, 17, 31, 21, 7, 11, -14, 27, 8, 25, 36, 25, 8, 0, 16, -6, 24, 9, 14, 10, 0, -3, 13, 3, 0, -12, -9, 22, 16, -12, -3, 12, -17, 11, -28, 23, -16, 10, 13, -6, -2, 9, -10, 3, 9, 12, 18, 26, 34, 3, 44, 20, 23, 20, 36, -6, -2, 26, 9, -12, -16, -2, -7, 33, -3, -3, 6, 9, 10, 0, -1, -10, -16, -19, 29, 4, 0, -4, -4, 5, -14, 0, 13, 1, 9, 21, 16, 5, 6, -9, 32, 36, 4, 8, 6, 12, 26, 25, 32, 18, -4, -16, -2, 1, 14, 11, -9, 3, -23, 8, -15, -2, -8, -14, -20, 9, -3, -12]
8167a2%j4L5J2%k2J2jQmj6kL1k7K6l7L2j5L0k3j0J6Kj7
$$ y = [-12, -12, -26, 9, 21, 21, -1, 11, 10, 18, 14, -2, -4, 27, 0, 26, -11, 21, 6, 36, 13, 3, 19, 21, 4]
8191D
$$ Imaginary data points
##PAGE= N=2
##DATA TABLE= (X++(I..I)), XYDATA
0@%%%%%%%Qq%qJ6k4L2m0M8n6P2q8J08j32J52j82K22k56K96l49M07m67N35o16P06
32C76q00R04j024J160j304J461j638J831k038K264k518K793l088L413l771M161
48B182m584N051n570O137o759P453q231R102j0085J1211j2512J4031j5832J8015
62I609k0727K4193k8802L5276m5094O1897r8234L10831l50747n62574Q01557L91599
74E28784o71931m87386P48448N31285o28062o12475N73470N63523n32022o17675
84f04041N24090O58967m17742o76645L67216O48681l33905o87739K90557P01864
94D71303k04223o88744J66012O71288j29937o90332P3582O80167q869o54626k1905
105c36284O40744O0715o38735j13582O11422J57221n80664j82369N62039K18666
$$ y = [0, 0, 0, 0, 0, 0, 0, 0, 8, 0, 0, -8, 8, -16, 16, -24, 24, -32, 40, -48, 60, -72, 80, -102, 120, -136, 160, -189, 218, -249, 286, -330, 376, -424, 480, -544, 616, -688, 773, -865, 966, -1072, 1192, -1326, 1467, -1621, 1792, -1979, 2182, -2402, 2649, -2921, 3216, -3543, 3910, -4321, 4781, -5304, 5907, -6605, 7426, -8406, 9609, -11118, 13075, -15727, 19549, -25545, 36352, -61882, 248949, -101798, -664372, 137185, 528784, -143147, -630533, 117915, 649200, 21138, -591337, -17867, 545656, 13634, -604041, -79951, 579016, 161274, -515371, -148155, 500526, 166621, -521118, -230561, 471303, 267080, -421664, -255652, 415636, 285699, -404633, -331051, 349116, 340247, -314379, -336284, 304460, 365175, -273560, -387142, 224280, 381501, -199163, -381532, 180507, 399173]
115C99173n40819k59625N03146K87012m69392l06657M43109L33704m09286l57154
125c76789L68105L68822l33652l79393L02274L93411k64453m00553K26085M00254
135C04111j94040m01527J61714M03007j25852l98018R3143L90152o5040l83969
145b16319L6157L75450p098l62440j7865L49244M0219l37047o2908L22643Q3607
156B03643l06224j00239K90421J15734k74686j31393K56801J44981k38052j55983
166a94997K20304J66144k02194j75035J82685J81221j63545j85445J45182J88914
176A63234j26400j90741J07653J90344r0112j88678P3517J85975n7362j81712
186a14282M2065J76174k8079j69977J5109J63257l023j55694p780J47419J7198
$$ y = [399173, -141646, -401271, 101875, 388887, -80505, -387162, 55947, 389651, -19635, -376789, -8684, 360138, 26486, -352907, -50633, 342778, 78325, -322228, -96143, 304111, 110071, -291456, -129742, 273265, 147413, -250605, -157462, 232690, 167650, -216319, -180162, 195288, 188190, -174250, -192115, 157129, 197348, -139699, -202607, 120036, 203643, -102581, -202820, 87601, 203335, -71351, -202744, 54057, 199038, -39014, -194997, 25307, 191451, -10743, -185778, -3093, 178128, 14583, -170862, -25680, 163234, 36834, -153907, -46254, 144090, 53978, -134700, -61183, 124792, 67430, -114282, -72217, 103957, 75878, -94099, -78990, 84267, 81244, -74450, -82230, 65189, 82387]
197H2387j39084k5543J30522L3107j21540l9564J12512M5026j03657m9808R4734
208A9092N3564q5801n6197P7202N8100o8770n9348O0541N9645n2738n9096M5398
220h408N7831l8421n5849L1876N3252k5766n0203K0206M6720j5324m2805J0934
232a5957L8608p267l4062M245K9428j774k4702j03J9944J229j5363j690J0851
245C387J667o475r80K330k32J496J863n017l931Q083O517j0761r423J3036J2702
260A4262j4831j6295J6240J9964j7125k3859J7469K7824j7280l1862J6623L5974
272B7104j5423m0060J3755M3975j1668m7720R024N1236n851n4415K255N7331J705
285C1248n9849n983O1909J0455o3522j5202O4616K0250o5238k5464O5361L0902
$$ y = [82387, -56697, -82240, 48282, 81389, -40151, -79715, 32797, 77823, -25834, -75642, 19092, 72656, -13145, -69342, 7860, 65960, -2810, -62158, -1617, 58028, 5290, -53806, -8408, 49423, 11002, -44847, -12971, 40281, 14515, -35688, -15482, 31238, 15914, -26891, -15957, 22651, 15384, -18678, -14433, 14995, 13221, -11481, -11584, 8360, 9589, -5774, -7464, 3387, 5054, -1421, -2401, -71, -303, 1193, 3056, -1961, -5892, 2191, 8708, -2053, -11476, 1560, 14262, -569, -16864, -624, 19340, 2215, -21644, -4175, 23649, 6369, -25493, -8870, 27104, 11681, -28379, -14624, 29351, 17683, -30037, -21013, 30223, 24372, -30043, -27788, 29543, 31248, -28601, -34584, 27325, 37780, -25742, -40944, 23672, 43922, -21316, -46780, 18581, 49483]
297D9483o4956l6427O4021M1931o2527m7474O0425N3045n7813n8358N4661O3555
309E9566n1051o8578M6930P3343m2490p7726L7661Q1770l2433q5418K6825Q8697
321E7096k0859r1513J4419R3887p751r5727Q84R6933O273r7514j3514R7434K0787
334F0835r6679k8072R5181L5313r2976m2464R0120M9452q6574n6130Q2365O2503
346G2874p7574o8524P2151P4112o6373p9129O0321Q3596n3914q7522M7277R0879
358F8174m0481r3707L3393R6060k6102r7895J8649R9224j1061r9986L498J00199
370D9965L891r9772j1340R8754J8761r7095k6039R4846L3202r2104l9999Q8725
382B1795M6436q4784n2534Q0200N8373p5067o3789O9494O8663o3518p2941N7145
$$ y = [49483, -15473, -51900, 12121, 54052, -8475, -55949, 4476, 57521, -292, -58650, -3989, 59566, 8515, -60063, -13133, 60210, 17720, -60006, -22345, 59425, 26992, -58426, -31601, 57096, 36237, -55276, -40857, 53030, 45279, -50448, -49564, 47369, 53642, -43872, -57386, 40048, 60835, -35844, -63916, 31265, 66578, -26398, -68862, 21258, 70710, -15864, -71994, 10371, 72874, -4700, -73224, -1073, 73039, 6666, -72463, -12142, 71454, 17540, -69982, -22705, 68174, 27693, -66014, -32621, 63439, 37337, -60558, -41909, 57315, 46254, -53732, -50234, 49965, 53856, -45916, -57256, 41498, 60259, -36836, -62875, 31971, 65173, -26931, -66930, 21795, 68231, -16553, -69087, 11113, 69486, -5581, -69370, 124, 68787, 5269, -67672, -10527]
394a0527P6642n0620p9664M3892Q2101l7114q3902L0325Q5173k3544q5907J6769
406c6376Q6088j0080q5757L481Q4969L048q3728r410Q2069J5553q0023k1416P7544
419B5962K7080p4705l2515P1493L7674o7899m2515O3936M7017n9675n1165N5130
431a82N4878n0259n8134M5164O0926l9969o3152L4678O4863k9342o6045K3854
443b2720O6783j8380o7000J2908O6806p547o6100K238O5083K754o3561p709O1741
456B5296J2419n9535j6902N7042K1128n4260k5088N1245K8729m8109l1998M4812
468D779L4942m1407l7494L7895L9784l4402m1680L0729M3378k7011m4777K3192
480a2072M5861j9317m6628J5495M7052j1695m7146P897M6855m072m6333L81M5522
$$ y = [-10527, 66115, 15495, -64169, -20277, 61824, 24710, -59192, -28867, 56306, 32762, -53145, -36376, 49712, 39632, -46125, -42644, 42325, 45373, -38355, -47765, 34304, 49857, -30166, -51582, 25962, 53042, -21663, -54178, 17315, 54989, -12910, -55425, 8511, 55528, -4147, -55312, -182, 54696, 4437, -53697, -8533, 52393, 12424, -50728, -16050, 48813, 19471, -46574, -22720, 44063, 25683, -41317, -28409, 38397, 30850, -35250, -33012, 32071, 34825, -28736, -36445, 25296, 37715, -21820, -38722, 18320, 39448, -14812, -39900, 11345, 40074, -8035, -40033, 4779, 39721, -1686, -39180, -1285, 38499, 4097, -37583, -6854, 36524, 9513, -35264, -12072, 33789, 14472, -32156, -16661, 30391, 18696, -28450, -20553, 26302, 22230, -24103, -23722, 21800]
493B1800L151m4382o519M2966R701m1343j2649L9435J5437l7349j8018L5086K0398
506B7714l2618k2604L0066K4530k7378k6190K4609K7598k1858k8710J9091K9651
518B3901j6392l0304J3689L0722j1042l0940Q423L0984n891l0787L407L0411r74
531A5207k9894j360K9171L610k8312n729K7276P722k6087r552K4815J1181k3405
544e357j2640K1850J3969k0174j5205J8418J6233j6500j7132J4663J7768j2776
556C117j8229J0852J8539r028j8617P223J8571n507j8373L855J8027k298j7580
569i448Q96J7001M99j6454j692J5711K827j4911l862J4118M745j3227n569J2290
583B924O273j1349o836J0362P323r325p721Q332P940p321q073O342Q096n382q026
$$ y = [21800, 24951, -19431, -25950, 17016, 26717, -14626, -27275, 12160, 27597, -9752, -27770, 7316, 27714, -4904, -27508, 2558, 27088, -290, -26480, -1871, 25727, 3869, -24841, -5750, 23901, 7509, -22795, -9106, 21616, 10574, -20366, -11943, 19041, 13150, -17637, -14230, 16181, 15207, -14687, -16047, 13124, 16734, -11578, -17307, 9969, 17691, -8396, -17948, 6867, 18048, -5357, -17997, 3853, 17822, -2352, -17557, 861, 17094, 594, -16538, -1875, 15893, 3117, -15112, -4260, 14279, 5251, -13366, -6143, 12428, 6921, -11452, -7597, 10430, 8132, -9448, -8552, 8449, 8948, -7506, -9198, 6513, 9340, -5571, -9433, 4685, 9430, -3797, -9366, 2924, 9197, -2152, -8988, 1374, 8697, -628, -8349, -17, 7923, 602, -7471, -1129, 6967, 1585, -6441]
598f441M510P798l586p586K848P203k098o831J430O360q34n848L68N263R7m721
614b068l89M103O32l542p47K940Q03k384p50J868N80j319m21R09J05n17K61J71
632B35o53J09J068k98j579M96K036n22k584N20L133m23l662K00M186Q3m696l98
650b749N139P86n541j284N883J864o171k466O395L146o608l812O723M500o771
665i66n195O670N963o467o773O223P548n860q366N518R069n023r792M487J0454
680G490l871j1074L182J1628k395j2218J641J2646p10j3129j65J3433J174j3664
694f032k213J3799L328j3895m441J3858N565j3740o649J3501P691j3118q788J2716
708A582R829j2223j0805J1639J1709j0932j2652J0220J3503r363j4295Q396J5074
$$ y = [-6441, -1931, 5867, 2281, -5305, -2457, 4746, 2648, -4183, -2753, 3607, 2773, -3075, -2707, 2556, 2653, -2068, -2457, 1646, 2278, -1264, -2011, 929, 1732, -652, -1402, 466, 1046, -273, -694, 215, 320, -197, 64, 235, -418, -309, 759, 461, -1118, -622, 1414, 892, -1692, -1172, 1961, 1538, -2124, -1924, 2262, 2345, -2351, -2749, 2390, 3176, -2365, -3649, 2234, 4098, -2073, -4539, 1856, 5002, -1606, -5418, 1305, 5805, -966, -6161, 509, 6472, 5, -6768, -545, 7003, 1143, -7223, -1705, 7364, 2341, -7451, -2964, 7490, 3619, -7455, -4273, 7355, 4960, -7258, -5617, 7029, 6319, -6810, -6975, 6458, 7632, -6032, -8245, 5554, 8882, -5013, -9454, 4404, 9969, -3771, -10420, 3081, 10772, -2346, -11134, 1582, 11411, -812, -11617, 22, 11731, 799, -11853, -1633, 11870, 2507, -11788, -3392, 11682]
721A1682p358j5782O247J6354n056j6879L894J7299k738j7596J527J7835k70j8012
735h853j029J8096K328j8114l595J8013M920j7835o256J7561P541j7168q783J6628
749C454J0066j6049j1219J5273J2389j4412j3443J3398J4489j2415j5398J1326
761b541J6245j0206j6955R047J7566p834j8106O599J8493n235j8886L929J9125
774A1241k556j9300J230J9316K13j9321j619J9185L026j8966m432J8629N806j8290
788e838p013J7732Q318j7181r551J6532J0715j5750j1846J4962J2859j4034j3841
801a3936J3086J4745j2056j5580J0956J6291r777j6947Q605J7459p368j7850O058
814f314J8178m729j8396L379J8503k030j8528P26J8383O13j8186j917J7855L221
$$ y = [11682, 4324, -11458, -5211, 11143, 6087, -10792, -6898, 10401, 7663, -9933, -8406, 9429, 9159, -8853, -9882, 8214, 10542, -7572, -11167, 6846, 11766, -6069, -12325, 5236, 12777, -4391, -13174, 3454, 13520, -2529, -13748, 1525, 13914, -498, -13941, -543, 13946, 1531, -13867, -2541, 13704, 3498, -13457, -4410, 13156, 5322, -12784, -6185, 12308, 7073, -11813, -7884, 11241, 8685, -10615, -9385, 9931, 10144, -9177, -10796, 8389, 11415, -7551, -11983, 6646, 12452, -5838, -12851, 4881, 13199, -3982, -13533, 2999, 13714, -2036, -13882, 1080, 13939, -95, -13936, -850, 13895, 1839, -13741, -2785, 13506, 3729, -13218, -4613, 12846, 5478, -12372, -6314, 11864, 7135, -11261, -7882, 10621, 8591, -9937, -9211, 9172, 9785, -8401, -10318, 7537, 10758]
828A0758j7499m425J7049N587j6477o716J5853P829j5218q798J4418R775j3657
841a521j0667J2824J1471j1909j2179J0921J2882r955j3440Q919J3918p811j4341
854a0888O713J4645n561j4845M350J5022l241j5030K090J4969r78j4813j36J4547
868F844J229j4205k245J3782L194j3286m102J2706M979j2133n734J1478O411j0741
882a823p065J0065P595r273q136Q508Q576p707q972O914R286o119r517N314R696
897G342m521r797L712R853k946r835K208R752j488r631P66R489j08r217n68Q908
913C919J206q586j764Q214K300p793k799P327L262o888l640O352M055n859m307
928e001N324M537m807m722M276M845l765m947L274N042k821n041K336N049j898
$$ y = [10758, -6741, -11166, 5883, 11470, -5007, -11723, 4130, 11959, -3259, -12057, 2361, 12136, -1521, -12188, 636, 12107, 198, -11981, -1060, 11822, 1867, -11573, -2654, 11264, 3453, -10888, -4175, 10470, 4909, -9936, -5586, 9436, 6195, -8835, -6745, 8224, 7246, -7567, -7703, 6844, 8073, -6132, -8377, 5405, 8599, -4687, -8789, 3917, 8896, -3237, -8971, 2507, 8918, -1823, -8888, 1177, 8772, -501, -8637, -129, 8447, 740, -8232, -1318, 7968, 1849, -7668, -2354, 7342, 2821, -6976, -3264, 6589, 3643, -6192, -3984, 5768, 4280, -5351, -4585, 4904, 4796, -4421, -4989, 3919, 5125, -3461, -5225, 2989, 5289, -2504, -5303, 2024, 5286, -1602, -5242, 1110, 5165, -694, -5001, 323, 4860, 53, -4669, -393, 4452, 687, -4260, -986, 4056, 1235, -3806, -1470, 3579, 1681]
943A681n006J475M902j037m825O83M683l14m544k2M385L42m228n79L937Q47l716
960a336j049L474J240l208j438K985J553k688j669K434J736k184j791J906J865
975A830j660j858J413J837j185j786R76J722p88j648O00J523m03j454L07J318
991G44j87j210J02J085or74q2Q62J37p43j39O15J57n13j53L69J42k58r8J95%n3
1013hK4Jr2M0J84q4k84J59L45j71m65K04N46j84o65J70P58j31q31M7R16K9j001
1036d93j05J108J89j175k93J199M29j265n42J274O69j300q14J314R73j312j068
1053a212J234J257j221j378J129J545j052j667R15J820p78j953O74K067n59k144
1069a323L78K264k40k368Q0K397J57k453l67K486O01k511p82K427J073k483j246
$$ y = [1681, -3325, -1850, 3052, 2015, -2810, -2127, 2556, 2242, -2302, -2324, 2061, 2403, -1825, -2404, 1533, 2380, -1336, -2385, 1089, 2329, -879, -2317, 668, 2221, -467, -2136, 298, 2034, -150, -1941, -35, 1830, 170, -1688, -275, 1562, 377, -1409, -433, 1289, 501, -1147, -547, 976, 573, -881, -574, 744, 557, -653, -551, 534, 528, -446, -528, 334, 471, -272, -411, 204, 361, -152, -305, 64, 206, -52, -150, 45, 45, -8, 16, 17, -75, -35, 149, 65, -219, -60, 285, 114, -351, -147, 399, 215, -450, -280, 478, 347, -484, -437, 479, 508, -493, -598, 510, 699, -476, -769, 430, 859, -406, -948, 326, 995, -305, -1119, 195, 1168, -144, -1212, 22, 1279, 58, -1320, -191, 1354, 302, -1365, -450, 1370, 592, -1361, -687, 1380, 821, -1323, -945, 1319, 1079, -1289, -1209, 1188, 1345, -1108, -1475, 1011, 1612, -899, -1681, 746, 1819, -664, -1910]
1086a910K405J483k347j684K192J915k065k134J964K328j798k518J634K690j430
1101G25k840J217K963r89l129Q08L222n33l340L13L367k0l447k65L497N25l494
1118a420q23L480J122l426j411L343J728l258k011L128K268l026k475K792K815
1133B826k628l009K371L228k109l442J869L588j563l780J274L931r57m036O26
1148a811M084k47m190q1M202M54m202p51M150J088m096j419M009J779l958k060
1164c049L783K378l603k679L457K903l262l143L059L371k813l601K515L848k265
1179H99m035J977M159j617m278J221M469r41m495N58M545k00m567j32M553M99
1195B615m531q28M419J230m389j524M262J841m118k131L925K467l822k692L552
$$ y = [-1910, 495, 1978, -369, -2053, 139, 2054, -11, -2145, -181, 2147, 349, -2169, -535, 2155, 725, -2115, -898, 2065, 1076, -2053, -1245, 1977, 1444, -1896, -1583, 1784, 1764, -1683, -1948, 1549, 2074, -1420, -2243, 1237, 2359, -1067, -2478, 865, 2593, -665, -2676, 452, 2720, -306, -2781, 11, 2826, 198, -2811, -440, 2788, 679, -2763, -894, 2694, 1131, -2649, -1375, 2556, 1599, -2437, -1811, 2273, 2026, -2164, -2245, 1957, 2411, -1791, -2542, 1608, 2696, -1400, -2819, 1190, 2969, -989, -3049, 734, 3112, -491, -3170, 287, 3190, -72, -3215, -156, 3215, 402, -3199, -684, 3164, 899, -3136, -1159, 3000, 1383, -2895, -1674, 2795, 1854, -2641, -2083, 2462, 2262, -2305, -2437, 2116, 2615, -1916, -2744, 1675, 2905, -1484, -3008, 1254, 3095, -1023, -3154, 771, 3238, -584, -3276, 276]
1210B76L006l320l280L087L504k809l730K548L899k246m049J895M211j582m317
1225b907J271M387r12m442N82M455k41m455j05M447M36m362q08M304J105m166
1241a411j471M082J742l913k033L754K275l516k537L262K807l093k981K853L148
1256B968k584l330K323L520k080l634J802L750j574l778J263L847r87l892P55
1271a631L885m78l915K25L889O2l870k96L753N93l664q69L632J063l494j328L374
1288I31J525l198j724L025J921k872k077K676K227k497k362K324K420k060k587
1303b328J903K660j672k759J500K792j288k829J072K869q73k852O78K846m83k838
1319a602L08K804j41k734q0K694K51k635l84K503N60k422p01K337Q11k222r33
$$ y = [276, 3282, -38, -3318, -231, 3273, 464, -3266, -718, 3181, 935, -3114, -1219, 2992, 1410, -2907, -1636, 2751, 1839, -2603, -2021, 2434, 2193, -2262, -2367, 2080, 2516, -1846, -2654, 1650, 2755, -1411, -2882, 1200, 2942, -971, -3004, 750, 3025, -491, -3028, 234, 3041, -52, -3033, -180, 2968, 384, -2946, -623, 2897, 817, -2817, -1015, 2735, 1161, -2617, -1354, 2493, 1506, -2386, -1631, 2254, 1776, -2139, -1914, 1975, 2037, -1833, -2129, 1624, 2217, -1447, -2316, 1316, 2379, -1115, -2443, 931, 2456, -742, -2466, 559, 2480, -392, -2469, 207, 2434, -63, -2425, -101, 2319, 259, -2328, -425, 2235, 563, -2196, -696, 2096, 808, -2021, -949, 1920, 1047, -1805, -1127, 1719, 1236, -1602, -1294, 1510, 1369, -1365, -1445, 1249, 1500, -1135, -1519, 984, 1544, -878, -1579, 758, 1569, -653, -1586]
1336a586K088J058j958j143J792J237j673j315J563J371j415j381J247J411j077
1351B19j460R47J461q19j443O83J400n43j346M00J328l15j266K16J188j11j107
1368e68K7J048J7r26j03Q50J57p71j98O93J92n66k46M67K63m17j94K65K20k10
1388@j38J24P5l2l2l9k0Q3J07j40k00K00K70j94l90K04N02k06n77J91O73j65p92
1411d96J18Q80o0r77j5J065J04j122k14J233K57j239l99J304N33j382o75J430
1429C45Q06j468r14J432J114j437j268J411J411j336j562J275J725j256j824J104
1445d42K055j046k162Q81K294p18k437N67K568m04k645J95K731Mk831j79K828
1462A259M44k905o23K882Q71k874j095K869J315k847j523K779J769k729j982K605
$$ y = [-1586, 502, 1560, -398, -1541, 251, 1488, -185, -1500, 63, 1434, 19, -1362, -115, 1296, 219, -1241, -294, 1167, 348, -1095, -412, 988, 445, -901, -501, 827, 512, -754, -538, 650, 539, -568, -541, 507, 524, -402, -505, 345, 502, -269, -467, 226, 418, -148, -394, 73, 336, -81, -275, -10, 210, 0, -138, -14, 61, 29, -3, -42, -62, 21, 128, -12, -212, -12, 258, 64, -326, -122, 380, 174, -403, -212, 461, 296, -496, -378, 502, 442, -535, -550, 515, 619, -503, -717, 516, 773, -466, -865, 439, 972, -410, -1085, 345, 1151, -317, -1231, 201, 1315, -122, -1390, 21, 1432, 96, -1466, -191, 1534, 278, -1546, -442, 1613, 567, -1595, -714, 1580, 862, -1575, -1008, 1560, 1156, -1489, -1294, 1437, 1441, -1390, -1569, 1259, 1703, -1202, -1825, 1057, 1928, -946, -2041, 828, 2143, -704, -2227, 552, 2321, -408, -2390, 215]
1478B15K199k483k403K379K582k191k809K057K956j868l141J696L310j476l436
1493b413J207L567r80l646P15L745m78l812K07L834J17l915l77L872O90l845r59
1510b471L767J273l710j500L560J783l451k064L341K327l196k546L010K784k837
1525G0k988K629L200k413l365K137L517j862l676J611L814j345l935J079M012
1540B485p86m081N04M119j98m155j01M125M20m102p05M032R98l937j288L858J559
1557B747l721j840L550K102l353k370L200K572k978k816K766K982k477l207K272
1572e71L343k031l487J849L542j589l606J255L750j031l796P75L841m93l859K38
1588a870L823N5l830l20L783N74l735q05L651J069l591j264L408J550l280j789
$$ y = [215, 2414, -69, -2472, -93, 2489, 298, -2511, -454, 2502, 634, -2507, -811, 2499, 1023, -2413, -1206, 2361, 1381, -2265, -1550, 2195, 1717, -2095, -1888, 1946, 2063, -1852, -2229, 1643, 2333, -1512, -2471, 1296, 2569, -1141, -2641, 919, 2702, -749, -2813, 528, 2855, -341, -2887, 123, 2907, 70, -2918, -289, 2911, 498, -2867, -730, 2787, 925, -2751, -1140, 2674, 1329, -2606, -1527, 2485, 1699, -2382, -1878, 2241, 2043, -2112, -2213, 1912, 2332, -1770, -2475, 1557, 2555, -1382, -2670, 1188, 2747, -974, -2814, 736, 2838, -515, -2885, 315, 2887, -91, -2907, -141, 2841, 364, -2843, -571, 2772, 741, -2746, -897, 2645, 1056, -2550, -1295, 2455, 1424, -2372, -1597, 2244, 1751, -2108, -1870, 1953, 2008, -1822, -2142, 1641, 2215, -1520, -2325, 1326, 2395, -1196, -2460, 948, 2498, -782, -2571]
1604b571L166J981k976k203K801K373k583k572K400K755k211k874J950L005j704
1619G37l142J524L179j233l285R80L342p35l344M81L346k48l295k7L297K23l222
1636a422m92L226O63l122r10L054J104k976j250K795J497k694j654K499J864k351
1652a69j988K149K126j950k270J759K388j583k450J363K557j153k587R18K632
1667A742p30k658N13K660l09k615Q5K591R5k547k86K505M60k405o36K283Q18k215
1685f49r38K081J093j959j220J850J284j667j392J508J503j414j522J265J586
1700A409j089j680R71J700q34j723O95J680n16j659L70J659k61j636J29J604K1
1717H40j549j44J483K30j406l23J309M22j234m92J120N81j061o15R68O46q33p00
$$ y = [-2571, 595, 2576, -400, -2603, 198, 2571, -12, -2584, -184, 2571, 360, -2514, -564, 2441, 737, -2405, -881, 2298, 1065, -2220, -1240, 2102, 1367, -1977, -1496, 1850, 1602, -1693, -1720, 1577, 1800, -1422, -1914, 1312, 1975, -1147, -2057, 997, 2101, -875, -2125, 670, 2167, -527, -2181, 318, 2182, -169, -2157, -8, 2118, 168, -2102, -343, 2045, 462, -1988, -625, 1932, 779, -1808, -890, 1742, 1012, -1646, -1133, 1527, 1218, -1397, -1312, 1279, 1374, -1173, -1459, 1046, 1506, -899, -1535, 748, 1566, -649, -1587, 494, 1587, -372, -1592, 258, 1542, -125, -1517, -9, 1494, 80, -1442, -177, 1409, 320, -1360, -389, 1311, 477, -1246, -551, 1129, 613, -1046, -676, 983, 722, -914, -785, 819, 840, -709, -853, 630, 860, -546, -869, 440, 862, -372, -864, 256, 837, -224, -839, 129, 775, -58, -758]
1735g58P69O93o75p04N87P10m78p10M19O88l51o52K73O06j79o20J46N27o7n06
1755b82M2M48j7l67j9L28K1k90PK18J8j48m4J04Jm6J6K0o7M5P6o7j35J09J79j12
1781C8k41J27L19j54l26J04M26j31m71J01N30q3n96O2O55k0o99k6P41R1p93j63
1803e09Q17K23q57k85R09L61r38m50R40N55r47o46R66P21r35q44R06R17q35j019
1823i50Q26J107p78j226P30J317o25j405N46J479m84j541L45J665k90j702J85
1840h01J737m1j779j09J810K55j842l73J870M77j840o33J845P60j870q74J803
1857C95J033j758j176J716J327j624j509J574J651j495j753J361J880j233j997
1872a608J122K096j000k180Q30K258o49k349M82K416k88k484J32K479R8k568j98
$$ y = [-758, 11, 704, 29, -675, -88, 622, 144, -566, -147, 541, 190, -462, -189, 417, 238, -382, -236, 291, 224, -282, -240, 208, 191, -176, -195, 133, 154, -136, -129, 89, 107, -41, -85, 19, 20, -26, -10, 10, -57, -12, 64, -3, -138, -29, 150, 38, -203, -76, 243, 89, -237, -133, 293, 162, -309, -208, 322, 239, -357, -295, 360, 340, -359, -385, 356, 447, -346, -509, 308, 531, -326, -611, 298, 659, -279, -729, 211, 766, -181, -827, 139, 860, -75, -919, -13, 904, 69, -950, -124, 983, 205, -1021, -291, 1026, 401, -1004, -458, 1021, 537, -1004, -659, 1006, 716, -986, -801, 936, 895, -884, -993, 817, 1072, -770, -1143, 727, 1204, -636, -1269, 576, 1336, -534, -1408, 395, 1428, -330, -1506, 210, 1537, -87, -1596, -22, 1629, 134, -1619, -258, 1622, 389, -1608, -486, 1610, 610, -1570, -740, 1518, 869, -1480, -998, 1418, 1130, -1354, -1222, 1257, 1355, -1213, -1411]
1889a411K507M24k542n95K511Q07k484j000K456J146k392j307K297J514k238j653
1905a960K129J818j986j994J850K106j679k271J593K356j427k453J230K579j051
1920H40k695Q68K739o57k792M68K842k81k871O7K912J03k886l13K853N13k836
1937a126p14K785R65k718j178K650J351k576j524K487J698k376j864K245K027
1952B132k073k158J918K272j757k398J555K546j372k637J196K703j017k753P84
1967a059K859o24k881M09K885j99k882k5K904K14k865m37K837O25k775q05K646
1984H27J080k646j234K520J412k371j609K292J751k143j886J987J990j783k130
1999a943J620K264j460k361J248K450j073k503R09K514o54k589M96K564l01k557
$$ y = [-1411, 1096, 1520, -1022, -1617, 894, 1701, -783, -1783, 673, 1819, -573, -1880, 417, 1931, -307, -1960, 169, 1987, 1, -1993, -143, 1963, 284, -1987, -394, 1962, 535, -1918, -688, 1891, 840, -1855, -987, 1752, 1095, -1697, -1229, 1613, 1332, -1539, -1472, 1440, 1543, -1343, -1656, 1197, 1710, -1126, -1840, 945, 1910, -808, -1986, 664, 2015, -561, -2085, 402, 2100, -276, -2140, 105, 2132, 59, -2099, -181, 2091, 334, -2064, -509, 2037, 665, -1972, -776, 1927, 910, -1843, -1059, 1800, 1176, -1705, -1296, 1589, 1390, -1492, -1517, 1387, 1601, -1264, -1701, 1136, 1761, -1014, -1819, 827, 1907, -739, -1973, 547, 1959, -412, -2021, 271, 2022, -121, -2007, -20, 1970, 187, -1943, -323, 1941, 481, -1880, -632, 1818, 745, -1758, -849, 1665, 1011, -1578, -1082, 1482, 1181, -1376]
2015a376R7K536J03k529k31K436M43k410o05K352P45k244r21K154J067k028j217
2032a628J884J349j740j483J647J565j517j640J358J701j168j792J022J867q96
2047E29j841P17J879n91j886M30J887l33j865J91J844j9j806j13J794K24j751
2064g10l41J688M49j604n75J525O74j486p40J396Q11j245r18J135J002j059j028
2081a026R78J056q59j102P49J127o67j128N63J150m56j153L40J146k66j109J75
2098d82J085n7j074rJ031N7r80j00Q86J91q91k16Q08K99p53l41P11L40o44l67
2118e06N85M13n23m25M76M07m26l89L35M32l08m10K76L88k34l46J33L44j07l10
2138a95O2L01o1k51L6K06Lk14K6J23J6r5J1O6j3m4Pj6lL1P5p5p6P1J06j09r9R9
$$ y = [-1376, -1279, 1257, 1360, -1169, -1400, 1036, 1479, -931, -1536, 816, 1561, -683, -1604, 550, 1617, -411, -1628, 256, 1605, -135, -1618, 29, 1594, 77, -1563, -205, 1496, 328, -1464, -442, 1425, 529, -1312, -595, 1284, 693, -1193, -763, 1124, 791, -1074, -883, 961, 942, -864, -977, 817, 1041, -710, -1051, 637, 1086, -518, -1093, 432, 1106, -380, -1120, 276, 1087, -158, -1076, 59, 1061, 2, -1026, -48, 1008, 149, -953, -204, 923, 256, -872, -309, 841, 385, -768, -428, 718, 452, -657, -482, 603, 546, -528, -537, 494, 551, -429, -529, 357, 548, -343, -559, 249, 548, -205, -546, 165, 505, -139, -506, 79, 492, -31, -456, 20, 427, 1, -388, -53, 379, 71, -339, -63, 325, 91, -255, -122, 222, 115, -195, -133, 168, 107, -144, -108, 98, 101, -113, -87, 36, 52, -43, -32, 34, 21, -23, -16, -32, -35, -4, 71, -4, -80, -9, 97, -12, -111, -12]
2166a2J53j11j96J47K18j23k89J53K79r9l53R9L99q3m48M6N06n0n04oN34M4n77
2189b73r6O39J20o41j96P04K03o82l08O87L69o54m69O94M97o65n39N96O65n99
2209E2o98N37Q24n63q34M77Q88m41r36L85J001l27j046K44J100j55j173R2J174
2228F01K1j246q6J267J83j279k45J246L70j242m79J233N88j255o33J156P94j152
2246a58q76J098R85j039j082R75J189r19j264Q37J325o98j434O17J487n37j527
2263a021L95J618l09j609J58J665l2j729j8J655J77j674l33J680M46j654n75J663
2281E03O99j615q41J549R57j478j074J427J170j337j299J263J355j095j506J053
2297b69J597r36j668P99J724o73j784N31J874m22j893K56J923j36j902k4J902
$$ y = [-12, 141, 30, -166, -19, 199, 76, -213, -60, 219, 120, -233, -134, 265, 182, -266, -220, 286, 236, -268, -274, 260, 304, -273, -369, 270, 390, -251, -447, 257, 460, -222, -530, 157, 526, -128, -597, 97, 594, -71, -610, -14, 651, 52, -646, -109, 715, 152, -682, -205, 683, 242, -694, -309, 692, 365, -681, -437, 663, 508, -665, -573, 601, 622, -624, -710, 557, 740, -539, -784, 462, 832, -410, -889, 344, 932, -323, -956, 200, 994, -158, -1034, 64, 1049, 10, -1072, -97, 1092, 173, -1091, -254, 1071, 373, -1061, -444, 1043, 506, -1021, -626, 992, 683, -926, -768, 897, 865, -864, -882, 773, 950, -724, -1057, 623, 1069, -585, -1160, 503, 1202, -413, -1254, 295, 1252, -226, -1300, 127, 1297, -40, -1339, -76, 1279, 184, -1322, -269, 1328, 392, -1276, -477, 1247, 574, -1210, -679, 1195, 773, -1120, -864, 1059, 923, -979, -1003, 899]
2314H99J61j891k91J893M10j867n56J826P27j835q07J742R47j677j069J574J220
2331A406j537j314J433J425j323j532J222J643j132j693J012J739q66j777O87
2346f07J867n57j907M02J937k81j908J17J920J1j906j53J879L33j911m48J880
2363F68N61j794p25J747Q49j688r49J603J044j514j150J391J295j332j321J210
2379a05J395j063j488R72J539q51j616P59J601o00j640M59J705l67j698K04J736
2396I42j05j716oJ676J39j661k50J608L83j575m79J520N90j473o84J405P89j332
2414b29q68J237R70j201j021J111J115j047j140R32J195q23j275P74J258o54j274
2431i40N27J317m53j304L55J334k80j305J70J279p3j289j3J267Q7j224j75J180
$$ y = [899, 1060, -831, -1122, 771, 1181, -686, -1242, 584, 1311, -524, -1331, 411, 1358, -319, -1388, 186, 1406, -131, -1445, -12, 1413, 90, -1442, -220, 1423, 291, -1402, -390, 1349, 483, -1294, -607, 1260, 703, -1204, -802, 1135, 854, -1054, -937, 983, 994, -912, -1065, 814, 1147, -764, -1212, 668, 1229, -565, -1290, 457, 1306, -382, -1331, 272, 1316, -198, -1348, 43, 1338, 6, -1315, -105, 1290, 227, -1261, -289, 1250, 399, -1217, -458, 1143, 543, -1097, -638, 1067, 700, -998, -794, 942, 837, -879, -885, 791, 930, -731, -981, 627, 1010, -565, -1044, 476, 1066, -407, -1091, 314, 1103, -229, -1097, 140, 1110, -91, -1112, -1, 1114, 67, -1073, -141, 1054, 231, -1044, -270, 988, 334, -940, -413, 904, 451, -853, -498, 836, 556, -749, -579, 700, 627, -662, -675, 592, 679, -545, -720, 460]
2449D60K66j142l23J081M02j056m53R77N51r38o02Q84O20p68o79P32P12o80p21
2468f77N77P54n18p63M22Q00l77p92L09P70k09p90J78P74j36p26N3P06Mo85k7
2489c53O23J01o14j30N50J74n09j99M90K12m32k85M34K23l13k53K82K70k64k63
2509b56K55K27j64k56J36K45j01k31P4K03n7j64J6J59k2j40QJ00K0r5PL4J7Rm0
2534a6j7rN5Qo6j9J02N2j74k7J43O5j47j00J77J60j89j90K06K14k21k32K20K30
2558B25j75k97J84L26j65l77J52M14j21m40J10M44o4m80KN43qn40p3N96J14o06
2580b36j83O40K06o40k53O65K80o19l63O23M07n93m61N66N25n63n71N31O18m89
2600I0o87M74P42m30q05L78Q39l16q82K50R33k00r46J16R65n5r71k6J006Q8j021
$$ y = [460, 726, -416, -739, 342, 744, -312, -765, 212, 763, -175, -777, 107, 727, -41, -720, 12, 724, 44, -677, -100, 654, 136, -627, -205, 595, 218, -574, -265, 505, 296, -494, -316, 458, 322, -404, -351, 355, 359, -326, -353, 270, 371, -243, -373, 177, 351, -158, -357, 133, 345, -87, -372, 62, 285, -28, -281, 1, 271, 7, -256, -1, 226, 62, -194, -58, 187, 86, -145, -71, 132, 75, -89, -73, 86, 64, -76, -68, 32, 52, -43, -36, -2, 15, 24, -16, -33, -42, 13, 21, -45, -64, 38, 90, -84, -111, 32, 97, -50, -150, 27, 187, -2, -192, 14, 228, 7, -225, -5, 225, 50, -247, -63, 263, 98, -279, -127, 287, 166, -274, -164, 280, 216, -264, -262, 281, 273, -267, -340, 256, 370, -236, -419, 221, 427, -213, -466, 199, 479, -140, -503, 120, 527, -66, -527, 39, 564, 1, -570, -39, 579, 90, -597, -123, 619, 189, -616, -238, 601, 285, -597, -347, 586, 386, -560, -444, 521, 466, -505, -531, 475, 563, -458]
2621d58j19R67K71j032l10R90M05r87m90R69N48r34o32R27P04q62p64Q26P92p47
2641F4q93P11R43o49j023O02J074n08j068L78J144l51j180K65J200j63j230P8
2659f06J246Kj243j24J241K16j227k96J214L94j199m34J122N58j104o55J072P52
2677I29j033q17R82Q74r24r36Q45J000p90j034P00J124o29j172N38J205m78j232
2695h48L98J255l03j281K14J274q5j322L9J274Q2j288j73J285K50j249l44J230
2713D08M41j216n01J181N94j123o67J029P78j013q21R55Q81q91r50Q04J025p23
2731A91j098O61J101n43j166N20J150m28j163L12J195k05j223J16J225j8j243
2748f16n8J207J54j191k41J176L12j138l83J106M73j081n26J025N85r58o56Q95
$$ y = [-458, -577, 390, 661, -371, -681, 309, 714, -273, -763, 206, 754, -180, -812, 115, 819, -43, -807, 19, 811, 64, -829, -118, 825, 176, -847, -245, 829, 321, -747, -369, 775, 424, -756, -491, 709, 546, -684, -606, 640, 642, -601, -725, 516, 732, -495, -791, 423, 817, -382, -816, 306, 864, -240, -895, 177, 929, -104, -921, 61, 935, 11, -925, -80, 920, 130, -904, -204, 920, 291, -881, -343, 862, 384, -848, -450, 805, 502, -779, -565, 709, 624, -698, -659, 615, 697, -591, -764, 521, 771, -478, -822, 408, 849, -367, -868, 313, 907, -216, -883, 146, 924, -89, -910, 45, 926, 35, -915, -111, 914, 191, -907, -246, 855, 312, -854, -334, 816, 388, -775, -463, 732, 527, -696, -580, 645, 627, -616, -674, 533, 687, -504, -745, 431, 743, -395, -778, 328, 801, -280, -806, 219, 804, -154, -810, 85]
2766H5P37q53p81P69Q64p40q67O45R28n69r61N15R57m25r93L43J000k95j000J99
2786d42J033j40j002O6R65L9r83q4R50J45r08k06Q70K72q51l13Q40L57q05m13
2806f10P41M64o55n14O14N55n85n87N34O11m83o07M22O12l60o48L04O78k45p07
2826d66K17O69j65o51R6O56k4o80L8N91L8n76r2N67J36n64j60N03K52n20k16M49
2848I8K62m09l10L95K89l22l31L12L23k76l39K52L43k04l52J95L50j77l31J05
2868a27L32p8l34R1K82m9k71J7K46L5k60rK07L0j96o0K08P2k18m0J85M9j60n9
2892a07J27P5j14n8R0O2p6o1O8P0o9m3J4M9j9j7j0N2m0qRj1j0K7K1n2nN5J0o4
2922c5k0R6Jq5l6J04L1r9m1J12O6r8j04J10J34j24j47J34J36j15j96J48J92j17
$$ y = [85, 822, -31, -812, -43, 821, 81, -786, -141, 787, 218, -743, -228, 729, 304, -689, -346, 654, 359, -641, -442, 591, 451, -551, -485, 480, 519, -464, -548, 402, 547, -361, -567, 303, 575, -276, -589, 251, 608, -197, -610, 131, 595, -60, -574, 40, 595, 10, -577, -43, 568, 85, -522, -100, 512, 152, -496, -192, 486, 241, -466, -249, 420, 255, -396, -300, 356, 332, -348, -310, 281, 319, -257, -349, 218, 354, -210, -370, 133, 385, -135, -351, 98, 360, -49, -359, 36, 325, 3, -328, -16, 307, 31, -308, -56, 287, 83, -269, -74, 276, 99, -232, -127, 205, 127, -207, -116, 166, 117, -154, -137, 109, 144, -116, -125, 82, 112, -84, -144, 64, 136, -82, -122, 63, 112, -48, -107, 20, 95, -19, -77, 13, 75, -1, -62, 6, 76, 7, -36, -22, 27, 8, -9, -19, 33, -7, -15, -6, -17, -27, 0, 21, -31, -36, 19, 29, -35, -55, 41, 42, -43, -79, 25, 56, -43, -84, 28, 94, -4, -108, 2, 136, 12, -135, -1, 135, 20, -176, -28, 164, 47]
2946D7k11J19K09j00k19P4K55r7k42O1K60j5l13J3K83M2l07o3L46L3l25o1L36
2969A25J10l43j35L55J34l24j78L31J85l08k46L30K67k84l36L14L08k64l67K86
2989d0L47k30m05K16M38k26m31J92M40j21n03Q5N24m7n29L0N54k3n39n0N62N9
3011C03n45j20N57J69n59j96N45K55n33l11N47L09m95l85M94L98m33m60M57M60
3031D57l89n66M17N34l47n63L06N68k33o35K14O49j83o50J22P03r8p00N7O87K4
3052C74o91p8O88J11o76j55O71K19o92k37O74K93o50l17O00L91n92m43N44M74
3072E08n26m95M74N43m33o02M18O11l75o59L60O46k70p02K20P38j75p20J24P02
3092C87p2p03kP46M0p45n6P14J32p19j83P03K19o65k66O51L35o54l42O12L83n92
$$ y = [47, -164, -45, 164, 64, -155, -81, 174, 77, -165, -104, 156, 141, -172, -159, 124, 166, -141, -204, 142, 175, -150, -211, 125, 235, -108, -243, 112, 246, -78, -256, 75, 260, -48, -294, 36, 303, 19, -317, -3, 305, 41, -326, -40, 307, 77, -328, -112, 326, 100, -331, -139, 301, 180, -323, -238, 286, 239, -290, -260, 294, 271, -268, -318, 244, 303, -242, -362, 195, 364, -195, -391, 154, 409, -124, -435, 112, 421, -74, -459, 35, 433, 0, -460, -3, 457, 68, -498, -81, 453, 106, -457, -151, 417, 184, -451, -237, 412, 229, -421, -299, 404, 306, -394, -337, 350, 374, -317, -395, 293, 404, -272, -427, 244, 463, -229, -466, 208, 501, -149, -466, 134, 525, -67, -510, 34, 508, -18, -513, -39, 504, 71, -531, -113, 498, 123, -536, -176, 470, 200, -502, -282, 456, 281, -439, -315, 387, 315, -388, -390, 356, 396, -349, -405, 309, 441, -278, -461, 242, 461, -204, -470, 181, 516, -138, -480, 132, 515, -77]
3114g7m26N81M48n12n31M71N70m53n88L87O22l56o09K81O57k52o56J89O71j33
3134B84o76P2O99l0p10QO71N7o55j12O63J35o35j99O23K35n83k60N70K90n30l54
3156d37N33L58m85m24M80M10l91m92M01M78l50n27L40N24l09n04K00N77j83n41
3176c42J14O10j35n73Q2N49l6n64jN30J04n26j05M83J36m81j48M27K17m49k32
3197c40M48K31m14k49L99K56l67k92L25L30k94l26K69L02j94l71K08L36j48l64
3217b55J52L44j03l72P3L81p5l42J6L54j4l14k1L12M3k89p0L05M7k52j15K78Q4
3240A67k13j40K47J41k32j42J81J42j79j37J56J54j48j50J13J73j12j58Q5J47
3260I5m2j64O9J60o2j67N6J15j3r6k7J39Lj25J0J11J4j09k3Q1J6n1j9K7L1m9j3
$$ y = [-77, -503, 78, 526, 14, -517, -46, 524, 71, -517, -130, 492, 136, -473, -192, 465, 213, -443, -254, 417, 284, -392, -320, 379, 349, -361, -353, 318, 375, -280, -392, 271, 406, -229, -428, 195, 430, -153, -413, 157, 447, -83, -437, 96, 454, -31, -455, 25, 435, 44, -448, -47, 431, 81, -446, -106, 418, 109, -395, -195, 382, 199, -342, -228, 382, 247, -326, -244, 305, 269, -295, -296, 234, 338, -188, -293, 190, 326, -155, -303, 124, 341, -108, -340, 108, 339, -75, -324, 75, 331, -36, -328, -3, 327, 33, -293, -24, 278, 84, -287, -79, 257, 109, -255, -103, 241, 138, -234, -161, 220, 145, -197, -181, 173, 159, -155, -176, 136, 179, -110, -180, 125, 172, -80, -195, 83, 167, -46, -186, 61, 202, -30, -172, 9, 151, -28, -165, -9, 145, -3, -153, -40, 133, 21, -137, -52, 95, 53, -111, -42, 118, 56, -111, -55, 60, 47, -49, -76, 63, 66, -59, -49, 62, 76, -33, -56, 25, 41, -10, -29, -2, 29, -20, -33]
3287c3M7K6l3l7J2J3k3L0k5j7J1PLk1L2L1j3l9J1M4k8l5J1O8k2q2M7P5k5r0J4
3318d1Q8J1j13j3J31K0j18l5J01P6j56n7J38O9j33q5J43Q3j49j12J42J41j44j28
3342a41J14J53j37j29J22J89j46j83J26J82p7k51Q3K52n0k81P4K59l7k55JK78
3364A46K1l03m0L06L4k78p1L01J05l22j09K75J49k74j85K75J84k40k27K45K45
3385B37k43k60K37K56k11k64J84K99j78k81J35L14j04l51Q9L76r5l40N1L38J2
3406B01l89j5L79L8l91l4L69R0l62j46L47K03l72j88L25K24l18k36K86K67l09
3427c1k60K58K91k21l24K28L21j93l48J84L50j38l58J49L43q4l73N8L60l3l41
3448a62m4L83O9m10m7L60R2l67j16L76J00l15j90L45J75l00k26L03K29k68k58
$$ y = [-33, 14, 40, 7, -30, -18, -5, -28, 2, -23, -40, -29, -22, -19, -40, -8, 23, 10, -29, -18, 26, -2, -37, -26, 42, 20, -62, -15, 60, 35, -55, -41, 47, 58, -55, -68, 63, 83, -35, -70, 31, 107, -49, -106, 32, 101, -32, -117, 26, 109, -40, -152, -10, 131, -13, -141, -27, 126, -11, -140, -18, 171, 25, -158, -32, 150, 73, -178, -95, 157, 107, -174, -100, 159, 122, -133, -132, 146, 167, -136, -176, 130, 164, -114, -185, 116, 221, -101, -210, 65, 214, -60, -245, 30, 214, -26, -253, -8, 237, -6, -266, -29, 227, 16, -248, -64, 235, 57, -224, -89, 225, 121, -230, -141, 235, 140, -200, -149, 189, 201, -188, -203, 176, 214, -177, -211, 158, 248, -114, -260, 87, 290, -82, -270, 55, 279, -39, -275, 11, 278, -31, -291, -33, 258, 37, -287, -59, 262, 69, -279, -95, 255, 117, -241, -92, 251, 167, -206, -148, 212, 179, -162, -206, 177, 246, -164, -211, 149, 241, -126, -242, 134, 234, -81, -271, 74, 249, -51, -277, 26, 255, -13, -271]
3469b71K69K67k44k98K46K50j60l04J75K96j56k86J02L39j28l18J02L35o1l28
3489a73J5L37kl33l7L33O1l11r9L48O8l10j33L46J05k93j61K80J74k70j78K63
3511C0J81k15k14K10K41j95k48J50K81j51k86J14L26j25l12J31K59n7k88M6K73
3532A51k5k64j0K72N1k82m6K35Q2k67p5K44R4k21j24K28J55k15j37J66J78k09
3554a9j63J56J67j28j99J64J78j22j90J25J86r3k08Q7J85l1k29L4K23k8j87j2
3576a04J95J3j81l9K05J2j61l9J53Q3j86p2J64N6j31r0J40J14j63p8J14J01r5
3599A1q8L2J38p9j00M0J39m6j32O5Q8j7j35N6P8Kj04j4J65l1j17qQ7N2j19k0P9
3626B2O1j18k7J05J9j10k4Q7L2o3l7M8K8l7m3M0L8j9l4QQ0n3l2J0N6k0k4mL5J3
$$ y = [-271, -2, 265, 21, -277, -31, 219, 59, -245, -70, 226, 70, -216, -114, 225, 97, -221, -119, 216, 155, -173, -158, 179, 177, -156, -193, 140, 201, -110, -209, 139, 207, -103, -236, 110, 215, -78, -239, 41, 215, -55, -233, 30, 211, -4, -218, -8, 233, 38, -210, -60, 221, 70, -216, -102, 224, 99, -213, -82, 177, 120, -168, -122, 151, 126, -138, -148, 124, 175, -107, -153, 82, 164, -103, -178, 66, 160, -61, -185, 43, 198, -17, -154, 12, 190, -19, -182, -26, 141, 13, -186, -22, 156, 34, -156, -31, 155, 62, -146, -59, 126, 95, -134, -100, 123, 95, -92, -104, 91, 104, -77, -116, 89, 101, -60, -99, 54, 137, -49, -121, 43, 99, -32, -122, 18, 132, -31, -109, 5, 106, 11, -77, -45, 93, 14, -86, -46, 93, 47, -85, -20, 68, 51, -84, -28, 50, 52, -52, -66, 99, 68, -49, -57, 30, 82, -37, -57, 22, 83, -35, -62, 43, 62, -48, -72, 15, 47, -16, -53, -5, 23, -14, -57, -17, 21, 2, -32, -24, 56, 3, -29, -19, 37, 17, -7, -11, 24, 37]
3656C7m1j0K5J6k8J7KK2l9oJ3jJk3K1j2J1qoKJ2ppJ8J4j8l1K3j3L8k2k4L7j1K9
3691C1o0K3K8j8pl2N5lm6K9K4qm3lN7%l8mL5Jl5k9L6L7l7k8M3L6n0m6N6N0p7m3
3725f6Q1K7l2n6O1L9m3p3K9J17l1j25L7R7rj05K9P6k2o9j8R0J4q1k0J08J6j15
3753d4j1P8N1j20k2R0O8r1r1P2Q1q2o9R8N6o0q4Q0P2l2j25P8R7m6j27N1J25pj85
3782i9N5J12j0j35M3J12%j38J7J24qj48j2J48K5j09n6J08M8j39l2J40L8r7n9Q9
$$ y = [37, -4, -14, 11, 27, -1, 16, 18, 40, 1, -5, 8, 7, 8, -15, 6, -6, 5, -3, -9, -7, 5, -2, -9, 9, 23, 5, -26, -3, -16, 22, 0, -24, 13, 2, 31, -29, -6, 22, 4, -3, -35, 20, 17, -29, 0, 24, 16, -27, -30, 27, 27, -11, -15, 20, 21, -14, -43, -7, 30, -7, -35, 8, 44, -6, -52, 4, 54, -23, -66, 15, 42, 10, -46, 15, 54, 11, -62, -33, 84, 53, -72, -35, 62, 53, -52, -23, 53, 31, -38, -56, 34, 48, -33, -53, 55, 71, -44, -55, 23, 74, -46, -68, 22, 90, -1, -92, -20, 61, -21, -90, 8, 64, 4, -80, 0, 72, 40, -85, -7, 90, 44, -83, -32, 93, 86, -99, -44, 68, 58, -77, -34, 78, 78, -60, -43, 81, 73, -75, -87, 61, 86, -23, -79, 29, 77, -62, -94, 46, 84, -13, -72, 17]
$$ [...]
8191h
##END NTUPLES=NMR FID
##END=
