##TITLE=1H_ES-prec-AC-DMSO
 D2O
 8 sc, 
 13.04.2022
##JCAMPDX= 6.0         $$ Bruker NMR JCAMP-DX V2.0
##DATA TYPE= NMR FID
##DATA CLASS= NTUPLES
##ORIGIN= UXNMR, Bruker Analytische Messtechnik GmbH
##OWNER= root
$$ XWIN-NMR		Version 3.5
$$ Wed Apr 13 14:56:12 2022 Russian Standard Time (UT+4h)  she@DPX200
##.OBSERVE FREQUENCY= 200.13135
##.OBSERVE NUCLEUS= ^1H
##.DELAY= (6, 6)
##.ACQUISITION MODE= SIMULTANEOUS
##.ACQUISITION SCHEME= undefined
##.AVERAGES= 8
##.DIGITISER RES= 18
##SPECTROMETER/DATA SYSTEM= spect
##.PULSE SEQUENCE= zg30
##.SOLVENT NAME= D2O
##.SHIFT REFERENCE= (INTERNAL, D2O, 0, 15.7039)
##AUDIT TRAIL= $$ (NUMBER, WHEN, WHO, WHERE, WHAT)
$$ ##TITLE= Audit trail, XWIN-NMR		Version 3.5
$$ ##JCAMPDX= 5.01
$$ ##ORIGIN= Bruker BioSpin GmbH
$$ ##OWNER= she
$$ F:/spectra/data/she/nmr/H-F/1/audita.txt
$$ ##AUDIT TRAIL=  $$ (NUMBER, WHEN, WHO, WHERE, WHAT)
(   1,<2022-04-13 14:55:17.56 +0400>,<she>,<DPX200>,
      <created by zg, POWCHK disabled, PULCHK disabled
       configuration hash MD5:
       00 E9 B6 7A A2 85 ED C7 34 08 36 98 17 FE 4E 26
       data hash MD5: 16K
       70 7B BB FE 8F 91 85 07 80 17 2B 19 50 8F 4B E6>)
$$ ##END=
$$ 
$$ hash MD5
$$ FF 2D 7C 38 04 65 EA 05 F8 68 60 28 1C 1B 3F 04
##$RELAX= 
##$RELAX= 
##$RELAX= 
##$RELAX= 
##$RELAX= 
##$RELAX= 
$$ Bruker specific parameters
$$ --------------------------
##$DU= <F:/spectra>
##$EXPNO= 1
##$NAME= <H-F>
##$PROCNO= 1
##$TYPE= <nmr>
##$USER= <she>
##$AMP= (0..31)
100 100 100 100 100 100 100 100 100 100 100 100 100 100 100 100 100 100 
100 100 100 100 100 100 100 100 100 100 100 100 100 100 
##$AQSEQ= 0
##$AQ_mod= 1
##$AUNM= <au_zg>
##$AUTOPOS= <>
##$BF1= 200.13
##$BF2= 200.13
##$BF3= 200.13
##$BF4= 200.13
##$BF5= 200.13
##$BF6= 200.13
##$BF7= 200.13
##$BF8= 200.13
##$BYTORDA= 1
##$CFDGTYP= 0
##$CFRGTYP= 5
##$CHEMSTR= <none>
##$CNST= (0..31)
1 1 145 1 1 1 1 1 1 1 1 1 1 1 1 1 1 1 1 1 1 1 1 1 1 1 1 1 1 1 1 1 
##$CPDPRG= <>
##$CPDPRG1= <>
##$CPDPRG2= <>
##$CPDPRG3= <>
##$CPDPRG4= <mlev>
##$CPDPRG5= <mlev>
##$CPDPRG6= <mlev>
##$CPDPRG7= <mlev>
##$CPDPRG8= <mlev>
##$CPDPRGB= <>
##$CPDPRGT= <>
##$D= (0..31)
0 1.2 0 0 0 0 0 0 0 0.06 0 0.03 0 0 0 0 0.0002 0 0 0 0 0 0 0 0 0 0 0 0 
0 0 0 
##$DATE= 1649847316
##$DBL= (0..7)
120 120 120 120 120 120 120 120 
##$DBP= (0..7)
150 150 150 150 150 150 150 150 
##$DBP07= 0
##$DBPNAM0= <>
##$DBPNAM1= <>
##$DBPNAM2= <>
##$DBPNAM3= <>
##$DBPNAM4= <>
##$DBPNAM5= <>
##$DBPNAM6= <>
##$DBPNAM7= <>
##$DBPOAL= (0..7)
0.5 0.5 0.5 0.5 0.5 0.5 0.5 0.5 
##$DBPOFFS= (0..7)
0 0 0 0 0 0 0 0 
##$DE= 6
##$DECBNUC= <off>
##$DECIM= 32
##$DECNUC= <off>
##$DECSTAT= 4
##$DIGMOD= 1
##$DIGTYP= 9
##$DL= (0..7)
0 120 120 120 120 120 120 120 
##$DP= (0..7)
150 150 150 150 150 150 150 150 
##$DP07= 0
##$DPNAME0= <>
##$DPNAME1= <>
##$DPNAME2= <>
##$DPNAME3= <>
##$DPNAME4= <>
##$DPNAME5= <>
##$DPNAME6= <>
##$DPNAME7= <>
##$DPOAL= (0..7)
0.5 0.5 0.5 0.5 0.5 0.5 0.5 0.5 
##$DPOFFS= (0..7)
0 0 0 0 0 0 0 0 
##$DQDMODE= 0
##$DR= 18
##$DS= 0
##$DSLIST= <SSSSSSSSSSSSSSS>
$$ [...]
##$SUBNAM2= <"">
##$SUBNAM3= <"">
##$SUBNAM4= <"">
##$SUBNAM5= <"">
##$SUBNAM6= <"">
##$SUBNAM7= <"">
##$SUBNAM8= <"">
##$SUBNAM9= <"">
##$SW= 18.05172834244
##$SWIBOX= (0..15)
0 0 2 0 0 0 0 0 0 0 0 0 0 0 0 0 
##$SW_h= 3612.71676300578
##$TD= 16384
##$TD0= 1
##$TE= 0
##$TE2= 300
##$TE3= 300
##$TEG= 300
##$TL= (0..7)
0 120 120 120 120 120 120 120 
##$TP= (0..7)
150 150 150 150 150 150 150 150 
##$TP07= 0
##$TPNAME0= <>
##$TPNAME1= <>
##$TPNAME2= <>
##$TPNAME3= <>
##$TPNAME4= <>
##$TPNAME5= <>
##$TPNAME6= <>
##$TPNAME7= <>
##$TPOAL= (0..7)
0.5 0.5 0.5 0.5 0.5 0.5 0.5 0.5 
##$TPOFFS= (0..7)
0 0 0 0 0 0 0 0 
##$TUNHIN= 0
##$TUNHOUT= 0
##$TUNXOUT= 0
##$USERA1= <user>
##$USERA2= <user>
##$USERA3= <user>
##$USERA4= <user>
##$USERA5= <user>
##$V9= 5
##$VALIST= <valist>
##$VCLIST= <CCCCCCCCCCCCCCC>
##$VD= 0
##$VDLIST= <DDDDDDDDDDDDDDD>
##$VPLIST= <PPPPPPPPPPPPPPP>
##$VTLIST= <TTTTTTTTTTTTTTT>
##$WBST= 1024
##$WBSW= 4
##$XGAIN= (0..3)
0 0 0 0 
##$XL= 0
##$YL= 0
##$YMAX_a= 282962
##$YMIN_a= -265582
##$ZGOPTNS= <>
##$ZL1= 120
##$ZL2= 120
##$ZL3= 120
##$ZL4= 120
##$ABSF1= 10
##$ABSF2= 0
##$ABSG= 5
##$ABSL= 3
##$ALPHA= 0
##$AQORDER= 0
##$ASSFAC= 0
##$ASSFACI= 0
##$ASSFACX= 0
##$ASSWID= 0
##$AUNMP= <proc_1d>
##$AZFE= 0.1
##$AZFW= 0.1
##$BCFW= 1
##$BC_mod= 2
##$BYTORDP= 1
##$COROFFS= 0
##$CY= 11.3945322036743
##$DATMOD= 1
##$DC= 2
##$DFILT= <>
##$DTYPP= 0
##$F1P= 2.36226072786647
##$F2P= -0.459571619588291
##$FCOR= 0.5
##$FTSIZE= 0
##$FT_mod= 4
##$GAMMA= 1
##$GB= 0.15
##$INTBC= 1
##$INTSCL= 1
##$ISEN= 128
##$LB= 0.24
##$LEV0= 0
##$LPBIN= 0
##$MAXI= 10000
##$MC2= 0
##$MEAN= 0
##$ME_mod= 0
##$MI= 1.114404
##$NCOEF= 0
##$NC_proc= 0
##$NLEV= 6
##$NOISF1= 3.799351
##$NOISF2= 2.8
##$NSP= 1
##$NTH_PI= 0
##$NZP= 0
##$OFFSET= 15.70392
##$PC= 1
##$PHC0= -18659.63
##$PHC1= 5.200779
##$PH_mod= 1
##$PKNL= yes
##$PPARMOD= 0
##$PSCAL= 0
##$PSIGN= 0
##$REVERSE= no
##$SF= 200.130013532006
##$SI= 16384
##$SIGF1= 3
##$SIGF2= 2
##$SINO= 400
##$SIOLD= 16384
##$SREGLST= <1H.CDCl3>
##$SSB= 0
##$STSI= 0
##$STSR= 0
##$SW_p= 3612.71676300578
##$SYMM= 0
##$S_DEV= 0
##$TDeff= 0
##$TDoff= 0
##$TI= <>
##$TILT= no
##$TM1= 0
##$TM2= 0
##$TOPLEV= 0
##$USERP1= <user>
##$USERP2= <user>
##$USERP3= <user>
##$USERP4= <user>
##$USERP5= <user>
##$WDW= 1
##$XDIM= 8192
##$YMAX_p= 0
##$YMIN_p= 0
$$ End of Bruker specific parameters
$$ ---------------------------------
##NTUPLES= NMR FID
##VAR_NAME=  TIME,          FID/REAL,        FID/IMAG
##SYMBOL=    X,             R,               I
##VAR_TYPE=  INDEPENDENT,   DEPENDENT,       DEPENDENT
##VAR_FORM=  AFFN,          ASDF,            ASDF
##VAR_DIM=   8192,          8192,            8192
##UNITS=     SECONDS,       ARBITRARY UNITS, ARBITRARY UNITS
##FACTOR=    0.0002768,     1,               1
##FIRST=     0,             0,               0
##LAST=      2.2672688,     0,               0
##MIN=       0,             -265582,         0
##MAX=       2.2672688,     282962,          0
$$ Real data points
##PAGE= N=1
##DATA TABLE= (X++(R..R)), XYDATA
$$ [...]
2558A16j667J135J923q03k055M09K151l0k138l59K058P18j925j063J710J384j465
2575I9j651J185J854q62j982M77K083j24k073k73K014O50j904j013J724J299j459
2592D4j577J224J752q74j893N13K022j61k072j82J984N62j883q93J725J192j486
2609cj501J229J703q96j904O16J943k35j980j41J973M58j829q33J731J130j516
2626e5j442J259J662r61j803N84J960k75j955r3J941M44j891p60J766J050j546
2643a15j326J303J552j009j752P24J853l41j960L8J901L64j895o64J723J002j580
2660a82j258J317J516j045j689P57J763l98j862L9J930K86j872n91J752Q87j556
2677b06j192J342J431j093j598P79J781n12j798J33J873J52j808n15J718Q23j567
$$ plain form
2558 116 -1551 -416 1507 704 -1351 -942 1209 1179 -959 -1318 740 1458 -467 -1530 180 1564 99
2575 99 -1552 -367 1487 625 -1357 -880 1203 1079 -994 -1267 747 1397 -507 -1520 204 1503 44
2592 44 -1533 -309 1443 569 -1324 -811 1211 1050 -1022 -1204 780 1342 -541 -1434 291 1483 -3
2609 -3 -1504 -275 1428 532 -1372 -756 1187 952 -1028 -1169 804 1262 -567 -1400 331 1461 -55
2626 -55 -1497 -238 1424 463 -1340 -756 1204 929 -1026 -1119 822 1266 -625 -1385 381 1431 -115
2643 -115 -1441 -138 1414 405 -1347 -623 1230 889 -1071 -1033 868 1232 -663 -1327 396 1398 -182
2660 -182 -1440 -123 1393 348 -1341 -584 1179 781 -1081 -1042 888 1174 -698 -1289 463 1350 -206
2677 -206 -1398 -56 1375 282 -1316 -537 1244 732 -1066 -933 940 1092 -716 -1231 487 1310 -257
2694b57j092J373J343j148j520Q60J652n36j771K26J818P9j770m80J762P30j568
2711b99j030J394J268j186j442R06J638o43j775L53J796oj768l26J707O38j573
2728c48r46J428J180j229j368R55J561o74j695L75J751n0j771k54J696N76j591
2745d04q33J438J096j249j329J000J503p73j586M44J708j46j733j65J706M63j605
2762d65p33J427J000j277j221J079J417p96j578N75J610k43j687m4J658L50j591
2779e19o32J450R07j300j131J110J336q98j453N92J582l24j637L4J639K82j633
2796e95n51J505P99j343j004J109J263r36j402O70J530l75j625J20J637J83j629
2813f44m73J568P30j428r16J195J152j012j306P59J471m68j599J81J610P5j557
$$ plain form
2694 -257 -1349 24 1367 219 -1301 -441 1211 675 -1096 -870 948 1027 -743 -1223 539 1269 -299
2711 -299 -1329 65 1333 147 -1295 -389 1249 606 -1169 -816 980 974 -794 -1120 587 1225 -348
2728 -348 -1294 134 1314 85 -1283 -328 1233 559 -1136 -761 990 940 -831 -1085 611 1187 -404
2745 -404 -1237 201 1297 48 -1281 -281 1222 449 -1137 -693 1015 869 -864 -1029 677 1140 -465
2762 -465 -1198 229 1229 -48 -1269 -190 1227 431 -1147 -572 1038 795 -892 -936 722 1072 -519
2779 -519 -1151 299 1206 -94 -1225 -115 1221 323 -1130 -538 1044 720 -917 -883 756 1038 -595
2796 -595 -1146 359 1158 -185 -1189 -80 1183 247 -1155 -485 1045 670 -955 -835 802 985 -644
2813 -644 -1117 451 1181 -247 -1163 32 1184 172 -1134 -375 1096 628 -971 -790 820 895 -662
2830f62l68J518O33j403q79J235J097j043j280Q10J415n31j547L07J580l9j559
2847g16k61J507N23j393p53J239J014j096j200Q85J376o51j503M00J534r7j562
2864g54j56J496M36j416o92J277R52j126j159R14J330p14j405M36J487j73j535
2881h02r7J529L46j420o43J343Q58j172j076R72J231p30j363M81J463k37j488
2898h05l5J519K66j447n31J365P77j217j011J012J189p89j345N80J440l29j477
2915h38K7J513J81j429m73J353P49j246r40J052J134q37j293O10J428l97j440
2932h46O9J521J60j477m35J370P20j265r22J131J072q93j238O64J399m45j457
2949h72J79J477J11j501l64J405N90j292q19J125J069r47j214O99J346m81j434
$$ plain form
2830 -662 -1030 488 1121 -282 -1161 74 1171 128 -1152 -342 1073 542 -1005 -698 882 843 -716
2847 -716 -977 530 1053 -340 -1093 146 1160 64 -1136 -251 1125 474 -1029 -629 905 808 -754
2864 -754 -910 586 1022 -394 -1086 191 1143 17 -1142 -228 1102 388 -1017 -581 906 733 -802
2881 -802 -899 630 976 -444 -1087 256 1114 -58 -1134 -162 1069 339 -1024 -543 920 683 -805
2898 -805 -840 679 945 -502 -1033 332 1109 -108 -1119 -107 1082 293 -1052 -472 968 639 -838
2915 -838 -811 702 883 -546 -1019 334 1083 -163 -1103 -51 1083 246 -1047 -437 991 594 -846
2932 -846 -777 744 904 -573 -1008 362 1082 -183 -1105 26 1098 205 -1033 -369 1030 585 -872
2949 -872 -693 784 895 -606 -970 435 1025 -267 -1086 39 1108 161 -1053 -354 992 511 -923
2966i23K15J463P2j479l04J410N67j324p78J139J035r65j201P58J334n05j422
2983i08K31J496jj478k83J426N69j341p78J187R95j017j161P55J307n15j421L05
3001f32J438l9j454k26J409N24j363p05J130R96j034j070P48J272n45j387L30
3018f08J427n0j460j85J398M76j366o64J194R20j029j098Q37J224o19j289L10
3035e82J398q7j398j74J379M19j331o32J177Q95j038j092Q44J208o11j323L93
3052e55J380j44j388j23J355L74j296o00J189Q42j058j013Q58J144o23j292M37
3069e13J333j46j416m9J340L48j281n65J203P59j023r90Q30J166o79j243M49J298
3087H21j94j359k7J318L00j276n00J151P59j069r31Q67J117p09j238N09J263k16
$$ plain form
2966 -923 -708 755 827 -652 -956 454 1021 -303 -1081 58 1093 128 -1073 -315 1019 514 -908
2983 -908 -677 819 818 -660 -943 483 1052 -289 -1067 120 1115 98 -1063 -308 999 484 -937 -632
3001 -632 806 767 -687 -913 496 1020 -343 -1048 82 1078 44 -1026 -278 994 449 -938 -608
3018 -608 819 769 -691 -876 522 998 -368 -1032 162 1082 53 -1045 -208 1016 397 -892 -582
3035 -582 816 729 -669 -843 536 955 -376 -1008 169 1064 26 -1066 -222 986 375 -948 -555
3052 -555 825 681 -707 -830 525 899 -397 -997 192 1034 -24 -1037 -179 965 342 -950 -513
3069 -513 820 674 -742 -791 549 897 -384 -949 254 1013 -10 -1000 -170 996 317 -926 -477 821
3087 821 627 -732 -759 559 859 -417 -917 234 993 -76 -1007 -140 977 268 -970 -461 802 586
3105E86j320OJ323K52j299m77J200O80j051q52Q93J036p27j186N40J226k78j299
3123g47O9J305J74j299l92J208O33j119q14R36J025p82j169O20J217l39j317J14
3141f77J328J03j259l55J200N82j124p59R85R80q31j117O32J173l79j298J59J325
3159F68Q4j285l29J256M92j115p31J015R04q38j054O35J169m35j234J86J310L9
3177G37j327k29J238M96j191o75J025Q65q25j070O79J153m54j248K44J302j0j302
3195e92j77J220M28j185o21J058Q22q97r83P04J123n14j221L01J253o4j278j44
3213g67J226M05j175n85J031P94r26r38P31J101n63j168L14J267j42j250p8J217
3231D94L36j220n10J096P33r42q94P50J058n79j169L90J237j67j271l7J221K71
$$ plain form
3105 586 -734 -728 595 847 -452 -929 271 951 -100 -952 -59 977 250 -936 -396 830 552 -747
3123 -747 -678 627 801 -498 -890 318 951 -168 -982 -46 979 197 -972 -352 865 526 -791 -677
3141 -677 651 754 -505 -860 340 922 -202 -961 24 1004 173 -944 -312 861 482 -816 -657 668
3159 668 752 -533 -862 394 886 -229 -960 55 959 121 -933 -298 871 436 -798 -612 698 737
3177 737 -590 -819 419 915 -276 -951 74 939 114 -956 -277 876 422 -826 -582 720 710 -592
3195 -592 -769 451 879 -306 -927 131 953 56 -927 -223 900 386 -835 -534 719 655 -623 -767
3213 -767 459 864 -311 -896 135 929 3 -935 -204 897 334 -834 -520 747 605 -645 -723 494
3231 494 830 -390 -900 196 929 -13 -907 -157 901 322 -847 -457 780 613 -658 -695 526 797
3249G97j160m90J094O33r10q93Q20J006o42j090M03J181k00j217j9J232K51j219
3267d23m59J114O45r78q19Q40R55o62j032M18J179k54j212O9J194J79j168l81
3285g95J054O13r49q20Q57R23o72j048M97J132l05j188P9J202J17j167l45J103
3303B88N70j022p07Q66Q62p32r82N35J085l40j161J31J202Q2j186k79J157M72
3321H41j028o81R13Q04p42r59N97J061l77j153K00J162L0j174k38J095M46r96
3339a99o57R33P71p53r20N84J027m18j127K46J143l1j153j74J125L92j054n73
3357h38R72P21q02r05O50J001n11j006K65J127p8j141j33J128L41j092n28J007
3375A78O81q62q51O99R70n21j047L27J091j16j150n5J112K47j029m94R86O78r00
$$ plain form
3249 797 -363 -853 241 874 -36 -929 -109 897 255 -835 -432 749 549 -668 -687 545 796 -423
3267 -423 -882 232 877 -101 -920 -80 875 213 -819 -401 778 524 -688 -619 575 754 -414 -795
3285 -795 259 872 -77 -897 -40 883 211 -837 -340 792 487 -701 -622 580 697 -470 -815 288
3303 288 858 -164 -871 -5 857 125 -857 -322 763 423 -738 -607 595 677 -509 -788 369 841
3321 841 -187 -868 45 849 107 -852 -255 806 429 -724 -524 638 668 -506 -744 351 797 -199
3339 -199 -856 77 848 95 -825 -241 786 368 -759 -513 630 599 -554 -728 397 789 -265 -838
3357 -838 134 855 53 -852 -202 799 288 -718 -453 674 596 -545 -678 450 791 -301 -829 178
3375 178 859 -3 -854 -155 815 294 -753 -426 665 549 -601 -656 456 703 -326 -820 166 844 -56
3394e6p91P41R20n64j012L42J128j73j142l3J126K52j089m32J005O06q99p66P68
3413f9R21o21j004M30J076k34j136K7J128J80j098l57J022N32r15p57Q37Q52o31
3432A83r87M51J086k79j112P8J124J35j112l26J067N15r61o97Q35Q45o85r58N11
3451b87J054l26j113J24J142O7j091l22J070M80r48o85Q58P95p06r61N82J021
3469G54l74j082J80J113L0j097k57J073M48r99o28Q85P85p58q99N82J009l85j078
3488f98J81J134K4j126k04J051M21j021n92R57P39p86q93O04R97m34j075K43J122
3507F44l9j139j72J090L80j012n83R28P16q29q31O26J011m84j047K52J133n9j123
3526e38j30J074L32j039n17R66O96q50q44P13R48m79j088L01J132j07j142q1J099
$$ plain form
3394 -56 -847 -106 814 250 -762 -420 708 535 -607 -640 486 738 -351 -783 222 828 -71 -837 -69
3413 -69 852 231 -773 -343 733 499 -637 -610 518 698 -400 -757 265 797 -118 -875 -38 814 183
3432 183 -804 -353 733 454 -658 -580 544 679 -433 -759 308 823 -138 -835 0 845 160 -798 -287
3451 -287 767 441 -672 -548 594 661 -430 -752 318 798 -150 -835 23 818 112 -849 -267 754
3469 754 380 -702 -522 591 621 -476 -733 340 788 -211 -839 46 831 73 -826 -244 765 380 -698
3488 -698 -517 617 641 -485 -689 362 783 -238 -830 127 866 80 -813 -209 788 354 -721 -478 644
3507 644 605 -534 -706 384 764 -248 -831 97 813 -16 -847 -221 790 306 -741 -489 644 585 -538
3526 -538 -668 406 738 -301 -818 148 844 -6 -850 -137 811 332 -756 -455 677 570 -572 -653 446
3545D46L13j086m75R91O42q62p85O86R56n76j015L66J080j54j122m7J121K24j027
3564c24m59R63O57q98p86P50R41o21j014M22J078k20j103j4J142K06j100l65R99
3583B54N71r25p53Q24Q79o48j019M92J074k83j143R7J138J17j108l53J084M83
3601G81r44o65Q15Q52p25r53N06J104l35j144J47J159P4j153k49J058N08j018
3619a82o83R09P95p32r45N75J051l76j117J79J144L1j146k31J109M28j021o30
3637h42Q84P99p52r37N87J064m24j103J99J151K7j158k20J115L98j017o38R65
3655I8P64q16q99O27J047m48j117K44J199p5j179j84J196L64j106n60R89P63q88
3674A9q89O71J029m70j146K96J201r7j187j69J199L39j122n66J023P65q99q99
$$ plain form
3545 446 759 -327 -802 189 831 -31 -816 -130 826 250 -765 -399 681 527 -595 -642 479 703 -324
3564 -324 -783 180 837 -61 -847 -97 844 223 -791 -369 709 489 -614 -628 514 720 -380 -745 254
3583 254 825 -100 -853 -29 850 202 -817 -325 749 466 -677 -580 558 675 -433 -786 298 781
3601 781 -163 -828 -13 839 114 -839 -333 771 436 -708 -561 598 672 -481 -730 328 836 -182
3619 -182 -865 44 839 107 -838 -263 788 412 -705 -526 618 649 -497 -728 381 809 -212 -842
3637 -842 42 841 89 -848 -261 803 379 -724 -525 626 653 -505 -725 390 788 -229 -867 98
3655 98 862 46 -853 -226 821 373 -744 -500 699 624 -555 -739 457 821 -285 -845 144 907 19
3674 19 -870 -199 830 360 -786 -490 711 614 -573 -742 457 796 -326 -892 131 896 -3 -902
3692i02P03J041m87j174L29J202j13j176j38J191L52j164n21J029P38r15q84P50
3710a39R91n35j137L86J175j45j239o6J206L21j204m82J076O93r15r16Q18J019
3728I07o60j103M21J203k03j267j3J283J89j173m72J134O46r95q54Q63J007o64
3746B49j101M47J218k64j241jJ264K29j257m32J163O52j052q33Q98R78o72j134
3764h89M96J226k85j294Q0J276J70j271l79J192N96j084p99R33R81p57j113N77
3782c44J182l49j256J30J254J53j301l49J239N83j120p93J013R38q14j092N89
3799c37J228l92j266J24J334J03j321l41J249N50j134p65R92R79q66j106O65J221
3817I17m47j313K36J340L4j343k79J279N20j227p10J086R09q87j081O83J197m50
$$ plain form
3692 -902 -199 842 355 -819 -490 712 599 -577 -715 476 828 -336 -857 172 910 -5 -889 -139
3710 -139 852 317 -820 -434 741 596 -643 -709 497 818 -386 -868 208 901 -14 -930 -112 907
3728 907 247 -856 -435 768 565 -702 -715 568 757 -416 -888 246 892 -103 -957 -94 913 249
3746 249 -852 -405 813 549 -692 -693 571 800 -457 -889 274 926 -126 -959 -61 917 245 -889
3764 -889 -393 833 548 -746 -666 610 780 -491 -870 322 918 -166 -965 -32 949 192 -921 -344
3782 -344 838 489 -767 -637 617 770 -531 -880 359 942 -178 -971 42 980 166 -926 -337
3799 -337 891 499 -767 -643 691 794 -527 -868 381 931 -203 -968 24 1003 137 -969 -304 917
3817 917 470 -843 -607 733 767 -576 -855 424 944 -283 -993 93 1002 115 -966 -283 914 464
3835D64j329K48J349J0j316l01J341M74j205p08J062R09q83j102P27J215n22j296
3853h63K50J366Rj378k54J336M77j253o94J127Q74r27j107P47J266n39j330L35
3871e58J339n2j372k06J319M73j261o71J134Q91r92j073P94J223n62j335L18J404
3889H13p5j438j61J389M16j279o84J192Q68j011j074Q21J224o28j305L47J393
3906H08j00j421j32J378L96j302o24J177Q67j050j047Q64J224o57j347M02J427
3923H63j61j422j39J457L65j355o17J201Q69j071j046Q82J203o84j316M21J421
3940H71j60j465r8J429L43j325o09J239Q36j098j032R07J193o74j347M83J382
3957H75j39j459j20J461L43j390n96J269Q57j135j042R26J220p21j362N07J396
$$ plain form
3835 464 -865 -617 732 742 -574 -875 466 940 -265 -973 89 998 115 -987 -260 955 433 -863
3853 -863 -613 753 762 -616 -870 466 943 -310 -1004 123 997 70 -1037 -290 976 437 -893 -558
3871 -558 781 729 -643 -849 470 943 -318 -989 145 1036 44 -1029 -235 988 426 -909 -591 813
3889 813 738 -700 -861 528 944 -335 -1019 173 1041 30 -1044 -223 1001 373 -932 -585 808
3906 808 708 -713 -845 533 929 -373 -997 180 1047 -3 -1050 -186 1038 381 -966 -564 863
3923 863 702 -720 -859 598 963 -392 -1009 192 1061 -10 -1056 -174 1029 345 -971 -550 871
3940 871 711 -754 -852 577 920 -405 -1014 225 1061 -37 -1069 -162 1031 357 -990 -507 875
3957 875 736 -723 -843 618 961 -429 -1025 244 1101 -34 -1076 -150 1070 349 -1013 -506 890
3974H90j99j475o8J501L06j424n67J309Q01j160j039R86J229p48j382N30J448
3991I38k68j506NJ485K79j400n61J320Q01j165j027R97J191p88j350N63J477l37
4009F54j500K6J507K54j447n31J379P74j226j004J034J180p94j359N36J474l34
4026F23j464L8J489K29j466m89J389P57j230j001J041J181q26j336N67J487l41
4043F48j486K8J546K27j515m88J396P53j242r96J103J153q67j331N95J470l22
4060F72j538O1J548K07j493n09J406P37j244j003J093J191q84j308O28J428l64
4077F28j521P7J558K00j513m77J438P16j259j008J126J180q98j351O70J462m16
4094F12j511J12J540J82j530m14J416P15j343r36J117J205r41j336O70J476m15
$$ plain form
3974 890 691 -784 -852 649 955 -469 -1036 273 1074 -86 -1125 -139 1090 342 -1040 -510 938
3991 938 670 -836 -831 654 933 -467 -1028 292 1093 -72 -1099 -102 1089 301 -1049 -486 991 654
4009 654 -846 -820 687 941 -506 -1037 342 1116 -110 -1114 -80 1100 306 -1053 -517 957 623
4026 623 -841 -803 686 915 -551 -1040 349 1106 -124 -1125 -84 1097 271 -1065 -498 989 648
4043 648 -838 -810 736 963 -552 -1040 356 1109 -133 -1129 -26 1127 260 -1071 -476 994 672
4060 672 -866 -805 743 950 -543 -1052 354 1091 -153 -1156 -63 1128 244 -1064 -436 992 628
4077 628 -893 -816 742 942 -571 -1048 390 1106 -153 -1161 -35 1145 247 -1104 -434 1028 612
4094 612 -899 -787 753 935 -595 -1009 407 1122 -221 -1157 -40 1165 224 -1112 -442 1034 619
4111F19j566J51J570J61j543m51J463P18j348r62J177J184r58j349P21J459m27
4128F19j550J21J600J46j535m52J472P22j342r51J153J168r68j344P23J488m39
4145F31j575J52J569J57j549m63J521O92j361r46J195J145r83j354P38J506m73
4162F02j545J76J587P6j544l98J513O71j382r34J240J136j024j305P77J460n20
4179E86j536J93J606P5j591l63J528O42j425q96J250J136j023j361P92J487n40
4196E60j551K16J592Q9j608l42J506O52j387r07J244J107j028j296P98J456n31
4213E70j556K55J560Q8j585l48J526O02j421q56J258J099j031j319Q08J445n59
4230E36j535K32J643L3j604l31J535O18j446q58J237J130j077j285Q34J452n69
$$ plain form
4111 619 -947 -796 774 935 -608 -1059 404 1122 -226 -1188 -11 1173 215 -1134 -413 1046 619
4128 619 -931 -810 790 936 -599 -1051 421 1143 -199 -1150 3 1171 203 -1141 -418 1070 631
4145 631 -944 -792 777 934 -615 -1078 443 1135 -226 -1172 23 1168 185 -1169 -431 1075 602
4162 602 -943 -767 820 896 -648 -1046 467 1138 -244 -1178 62 1198 174 -1131 -354 1106 586
4179 586 -950 -757 849 924 -667 -1030 498 1140 -285 -1181 69 1205 182 -1179 -387 1100 560
4196 560 -991 -775 817 906 -702 -1044 462 1114 -273 -1180 64 1171 143 -1153 -355 1101 570
4213 570 -986 -731 829 917 -668 -1016 510 1112 -309 -1165 93 1192 161 -1158 -350 1095 536
4230 536 -999 -767 876 909 -695 -1026 509 1127 -319 -1177 60 1190 113 -1172 -338 1114 545
4247E45j555K84J587L9j609k97J542N74j435q40J274J080j075j295Q64J440o17
4264E06j544L37J611n1j590k44J529N37j445q03J279J055j079j284Q73J428n76
4281E39j571L28J596l5j589k65J544N36j429q31J315J035j096j263R13J403o33
4298D97j524L42J577m5j582k49J543N30j448p75J277J063j100j253Q53J406n93
4315E19j525L19J589n8j559k78J537N65j466p99J318J011j102j241Q67J424o52
4332D69j476L38J564m5j612k38J560N35j471p76J300J033j078j251Q62J398o18
4349D94j507L61J517j2j578k78J579M84j418p92J305J007j089j253R03J361o00
4366D84j501L53J574r9j593j94J538M73j397p93J314R76j083j213Q64J398o22
$$ plain form
4247 545 -1010 -726 861 900 -709 -1006 536 1110 -325 -1165 109 1189 114 -1181 -317 1123 506
4264 506 -1038 -701 910 859 -731 -975 554 1091 -354 -1157 122 1177 98 -1186 -313 1115 539
4281 539 -1032 -704 892 857 -732 -997 547 1083 -346 -1177 138 1173 77 -1186 -273 1130 497
4298 497 -1027 -685 892 847 -735 -984 559 1089 -359 -1134 143 1206 106 -1147 -294 1112 519
4315 519 -1006 -687 902 844 -715 -993 544 1109 -357 -1156 162 1173 71 -1170 -303 1121 469
4332 469 -1007 -669 895 850 -762 -1000 560 1095 -376 -1152 148 1181 103 -1148 -286 1112 494
4349 494 -1013 -652 865 853 -725 -1003 576 1060 -358 -1150 155 1162 73 -1180 -277 1084 484
4366 484 -1017 -664 910 811 -782 -976 562 1035 -362 -1155 159 1135 52 -1161 -297 1101 479
4383D79j527M15J521o7j576j97J521M71j416p42J310R58j115j162Q39J405o43
4400D74j499L56J573j04j574j94J533M79j462o99J294J000j146j166R07J336o81
4417D27j469M27J525j35j543j42J514M34j453o84J324R25j143j146R04J306o63
4434D08j458M54J541j72j552j21J530L76j413o81J311Q96j151j131R65J315p45
4451C72j403M54J500j79j540j02J522L66j429o33J272R26j148j118R57J263o98
4468C82j404M97J459j98j499r4J490L59j410o27J267Q67j128j064R43J245p23
4485C62j389M92J453k28j484q8J485L59j432n96J297Q51j114j079R32J222p06
4502C37j347M55J453j81j470q7J463L18j390n82J295Q40j162j024R46J210p20
$$ plain form
4383 479 -1048 -633 888 821 -755 -952 569 1040 -376 -1118 192 1150 35 -1127 -288 1117 474
4400 474 -1025 -669 904 800 -774 -968 565 1044 -418 -1117 177 1177 31 -1135 -228 1108 427
4417 427 -1042 -615 910 775 -768 -910 604 1038 -415 -1099 225 1150 7 -1139 -235 1071 408
4434 408 -1050 -596 945 773 -779 -900 630 1006 -407 -1088 223 1119 -32 -1163 -198 1117 372
4451 372 -1031 -577 923 744 -796 -898 624 990 -439 -1072 200 1126 -22 -1140 -183 1080 382
4468 382 -1022 -525 934 736 -763 -857 633 992 -418 -1045 222 1089 -39 -1103 -160 1085 362
4485 362 -1027 -535 918 690 -794 -882 603 962 -470 -1066 231 1082 -32 -1111 -179 1043 337
4502 337 -1010 -555 898 717 -753 -840 623 941 -449 -1031 264 1104 -58 -1082 -136 1074 354
4519C54j365M92J435k26j492l5J476L24j411n92J276Q27j111j040R42J182p14
4536C22j337M61J459k35j455l4J449K95j397n78J304Q12j151j006R54J184p21
4553C26j331N27J386k43j455NJ400K93j355n36J249P80j114j026J012J140p61
4570B97j275M71J403k57j418j4J432K58j388m99J298P39j164r53R53J160p60j276
4588i93N01J389k61j439K6J414K35j369m89J284P46j158r45R61J130p25j313N33
4606d73J380k77j379k7J391K84j370n20J284P28j120r44R61J088p21j243M76J388
4624I06k92j394k3J415K87j377n05J270P28j124r18R39J097p47j202M79J324k39
4642F24j401J8J390K31j330m83J245P13j110r08R36J067p21j228N19J294k48j376
$$ plain form
4519 354 -1011 -519 916 690 -802 -837 639 963 -448 -1040 236 1063 -48 -1088 -146 1036 322
4536 322 -1015 -554 905 670 -785 -819 630 925 -472 -1050 254 1066 -85 -1091 -137 1047 326
4553 326 -1005 -478 908 665 -790 -785 615 908 -447 -983 266 1046 -68 -1094 -82 1058 297
4570 297 -978 -507 896 639 -779 -793 639 897 -491 -990 308 1047 -117 -1070 -117 1043 283 -993
4588 -993 -492 897 636 -803 -777 637 872 -497 -986 298 1044 -114 -1059 -98 1032 307 -1006 -473
4606 -473 907 630 -749 -776 615 899 -471 -991 293 1021 -99 -1043 -82 1006 285 -958 -482 906
4624 906 614 -780 -803 612 899 -478 -983 287 1015 -109 -1027 -88 1009 262 -940 -461 863 624
4642 624 -777 -759 631 862 -468 -951 294 1007 -103 -1011 -75 992 271 -957 -438 856 608 -768
4660g68J7J351K29j278m98J231P18j106r00R12J075p47j190N39J260k44j358K2
4678g35J342K23j297m48J199P03j081q90R34J033p10j192M84J311l02j319M0J304
4696E99K17j297m23J194O51j042q49Q88R94o90j174N16J253l03j272L5J326J66
4714G89j280m10J224O03j076q16R22J000p17j131N22J218l10j269P1J287J42j232
4732d63l87J171O04j067q07R32R78p52j118N56J195l33j216N2J270J24j194m16
4750h71J168O03j037p97R04R63p27j099N04J220l26j237Q6J219J75j228l54J152
4768C18N68j030p89R24R32p30j064N06J179l10j231J12J221J35j195l59J131N49
4786H67r96p92Q79R36p11j077N36J139k82j237J19J211J52j200l62J127N50r93
$$ plain form
4660 -768 -751 600 829 -449 -947 284 1002 -104 -1004 -92 983 236 -954 -415 845 601 -757 -735
4678 -735 607 830 -467 -915 284 987 -94 -984 -50 983 273 -919 -435 876 574 -745 -705 599
4696 599 816 -481 -904 290 941 -101 -950 -62 932 242 -932 -416 837 534 -738 -703 623 789
4714 789 -491 -901 323 926 -150 -966 -44 956 239 -892 -370 848 538 -731 -660 627 769 -463
4732 -463 -850 321 925 -142 -949 -17 961 209 -909 -353 842 509 -707 -655 615 739 -455 -871
4750 -871 297 900 -137 -934 -30 933 206 -893 -389 831 505 -732 -646 573 748 -480 -834 318
4768 318 886 -144 -933 -9 923 193 -871 -365 814 504 -727 -615 606 741 -454 -813 318 867
4786 867 -129 -921 -42 894 183 -894 -358 781 499 -738 -619 592 744 -456 -818 309 859 -134
4804a34p74Q82Q99o84j036N23J089k72j165O6J171J72j188l44J090N66r99p52
4822h90Q81Q84p06j024N31J107k92j184P6J191J26j153l29J065N69j011p13Q47
4840b5Q75o68j010N22J076k84j176R6J166J34j128l66J083N32r67p12Q37Q82o78
4859A89j015M93J067k83j091O5J123J09j113l05J048N22r55o97Q15Q64o76r68
4877h08M99J046l07j100J09J107J07j117k75J025N37r90o59Q07Q30o71r11M61
4895c10J041k92j111J33J088J15j080l03J004N03r36o40Q00Q14o76r23M85J006
4913G18k91j068J02J100J06j088l27J028M84r38o28Q01Q17o76q98M94R71k82j072
4932f47J23J046J14j070l05J042M83r44o15P76P98o22r26M68R87k72j057J23J036
$$ plain form
4804 -134 -908 -26 873 189 -847 -324 765 493 -672 -606 565 737 -451 -795 295 861 -138 -890
4822 -890 -9 875 169 -855 -324 783 491 -693 -617 574 700 -453 -782 283 852 -159 -872 -25
4840 -25 850 182 -828 -306 770 486 -690 -594 572 706 -422 -788 295 827 -140 -852 -15 867 189
4859 189 -826 -333 734 451 -640 -575 548 657 -456 -761 287 809 -146 -843 -28 836 160 -808
4877 -808 -309 737 430 -670 -561 546 653 -464 -739 286 823 -167 -826 -19 811 140 -771 -310
4895 -310 731 439 -672 -539 549 664 -416 -719 285 788 -148 -788 12 826 150 -773 -288 718
4913 718 427 -641 -539 561 667 -421 -748 280 764 -174 -802 -1 816 140 -758 -264 707 425 -647
4932 -647 -524 522 636 -434 -739 303 786 -158 -773 3 801 179 -747 -279 708 436 -621 -498 538
4951E38R1j018l48J032M50q99o55Q07P69o17r15M57R81k62j045J04J038J01j025
4970d16k74R68M73q73o56P59P94o34q75M45R40k25j039P2J064Q0j009k87R74M34
4990G15q77n88P64P45o39q30M42R42k93r72Q1J000J02r99k52R11M55q58n92P42
5010aP27o16q16M40R45k77j024J13R93J17r93k56R14M44q35o15P50P13o00q23
5030g00M47R21k88r84J24R69J04r74k96R45M08q40n64P31P47o28q07M27R14l01
5050C55r45O4R93Q8r65k29R08L96q20n62P63O56n78p83M52Q41k67r30P5R79O2
5071E53r26k22Q70M17q17n47O75P18n93q10M48Q79k92r22J32R11R1r55k21Q67
5091B56M00q05n48P17O61n73p63M09Q69k80q83P7R17J06r10k19Q44L75p66n26
$$ plain form
4951 538 629 -389 -737 295 745 -154 -809 -2 767 150 -765 -308 673 411 -634 -530 508 609 -416
4970 -416 -690 278 751 -122 -778 -19 775 141 -734 -289 651 426 -613 -541 523 603 -406 -693 281 715
4990 715 -162 -750 14 759 120 -710 -268 674 381 -591 -510 490 592 -407 -659 252 707 -151 -743 -1
5010 -1 726 110 -706 -266 679 402 -622 -509 484 601 -392 -648 266 710 -125 -740 10 723 123 -700
5030 -700 -253 668 380 -604 -480 489 593 -381 -677 268 676 -164 -728 3 750 122 -685 -258 656 355
5050 355 -590 -526 467 555 -410 -639 269 665 -155 -717 46 702 124 -659 -207 634 367 -563 -488 491 553
5071 553 -373 -595 275 692 -125 -672 3 721 128 -682 -234 645 353 -569 -437 474 565 -390 -611 256
5091 256 656 -149 -697 20 681 108 -655 -246 623 343 -540 -463 454 560 -350 -569 275 650 -116 -642
5111f42O58O58n64p46M12Q24k38r08J21Q96P6r04k45Q68L61p29n59O64O36n26
5131A13p49L79Q39k47q66R5Q77Q5q66k33P80L75p01n32O11O77n16p26L67Q27k52
5152C37q60J00Q48R2q61k44Q19M02p46n21O31O36n19p18L71Q18k48q54J02Q24
5172D09R5q51k18P61M08p09n30O24O45n36o91L56P65j90q24P6Q21J12q27k30P54
5193B20L72o93n12N98O34n06o82L40P63k11q19K8Q64R6q19k04P59L46o92m98O04
5214a2O04m80o82L33P68k04q20P8Q37M0p83k13P32L65o94m50N47O45m67p00L71
5235a85P00j85p75K9P96J09p94k12O98L76o35n03N97N57m29o83K84P54j47q14
5255d62K6Q05Q5p35k57P22L40o13m95N70N70m46o50L00P18j48p78K6P94P1p16
$$ plain form
5111 -642 16 674 110 -636 -224 600 362 -546 -425 471 547 -357 -602 266 627 -102 -661 3 639 113
5131 113 -636 -257 582 335 -531 -436 441 526 -340 -573 207 582 -119 -651 -40 637 121 -605 -238 589 337
5152 337 -523 -423 425 517 -344 -588 231 633 -113 -634 -3 633 114 -604 -233 585 337 -517 -415 409
5172 409 504 -347 -565 196 604 -105 -635 -11 634 98 -593 -237 528 338 -486 -410 411 523 -304 -534 220
5193 220 592 -101 -613 -15 619 113 -569 -229 534 323 -496 -468 396 492 -327 -531 228 574 -118 -616 -12
5214 -12 592 112 -570 -237 531 327 -493 -415 422 462 -321 -534 198 563 -131 -581 -34 611 144 -556 -185
5235 -185 515 330 -445 -416 380 489 -305 -517 181 557 -78 -581 16 573 144 -539 -255 499 352 -462
5255 -462 -436 369 454 -281 -538 184 524 -89 -584 -14 556 110 -540 -240 478 330 -448 -422 372 443 -273
5276b73k29O87L65o43m69N26N90m28o44L06P17j87p32O5P13R2p21k49O84L86o43
5297h7m63N49N38m24o32L09O75j55p38J5P72O2o98k28O79L72o23m65N05N63m00
5318A26o44K96O95j66o86J1P43Q7p31k17O56L60o13m30M85N62l96o38L16O53j72
5339B97o91MP41Q2p02k28O40L63n70m67N05N16l65o24K80O68j77o91L2P05J09
5360D27o88k19O27L69n86m89N37N42l95o11K78O42j39p08N3O88J07o84k37O30
5380A44L57n81m63N01N26l68o25K93O24j36o80M6O70J11o66k48O74L04n59m04
5400d80M45N32l76o07K78O49j23p03RP00J04o83k15O03L42n17m62M36N68l60n91
5421d51K09O74j31o91l0P31J16o48k54N66M09n61m30M32N46l49n97K31O71j28
$$ plain form
5276 -273 -502 185 550 -93 -562 -36 554 126 -518 -212 505 318 -414 -349 364 456 -265 -514 170 556 -87
5297 -87 -550 -1 537 113 -519 -210 465 310 -428 -413 359 421 -277 -505 174 546 -77 -542 -37 526 126
5318 126 -518 -222 473 307 -379 -368 375 462 -269 -486 170 530 -83 -513 -28 534 138 -500 -184 469 297
5339 297 -394 -390 351 433 -269 -497 143 506 -64 -531 -26 490 125 -499 -219 449 272 -419 -387 318 427
5360 427 -261 -480 147 516 -70 -559 -22 520 125 -486 -208 434 295 -413 -360 328 435 -249 -486 144
5380 144 501 -80 -543 -42 484 116 -509 -216 408 272 -408 -362 308 419 -247 -495 179 483 -76 -480
5400 -480 -35 497 121 -486 -208 441 318 -385 -376 324 428 -255 -470 133 475 -42 -504 -68 500 140 -451
5421 -451 -242 432 301 -390 -420 311 427 -221 -475 91 500 -61 -491 -59 487 138 -459 -228 443 315
5441C15o92l3O76J56o08k96N99L76n19m85M47N71l67n81K20O18j17o33j0O53J57
5462D47o51k76N87L74n21m78M38N57l44o05K17O41o1o93k5O98J10o18k73O02L51
5483D77m90m81M31N30l11o10K27O34j02o27n3O57J76o48k57N51M02n47m27L97
5503g1N35l02o05K07O29n4o93k9O42J79o40k84N72M11n32m30L64N53k74o23J85
5524b60O47p0o67l0O43J68o21k52N16L87m99m45M19N40k87o16J91O36o9o64m5
5545c78O24J90o17l20O02L52m71m53L84N38k81o11J80O45o8o49m1O18J77n98l01
5566d78N52L92n02m54M00N64l28n82J92O25m7o84k8O44J65n94k97N51L75m84m69
5587d87L86N82l25n92J87O20m3o78m9O46J83n90k96N31M02m90m58L87N47l13n91
$$ plain form
5441 315 -377 -410 266 422 -186 -482 117 493 -26 -511 -64 507 140 -441 -221 397 280 -353 -363 290 447
5462 447 -204 -480 107 481 -40 -518 -80 477 133 -472 -255 386 325 -368 -393 305 415 -203 -476 126 477
5483 477 -13 -494 -63 467 156 -454 -227 407 305 -322 -375 282 458 -190 -447 104 506 -41 -468 -71
5503 -71 464 162 -443 -236 393 339 -354 -383 259 438 -202 -486 86 497 -35 -465 -101 452 178 -445 -260
5524 -260 387 317 -350 -380 263 431 -190 -442 74 461 -38 -483 -64 476 189 -427 -236 400 331 -333 -378
5545 -378 246 436 -181 -501 101 453 -18 -471 -87 451 170 -441 -261 384 316 -333 -374 244 421 -177 -478
5566 -478 74 466 -36 -490 -90 474 146 -436 -244 381 334 -350 -378 266 431 -163 -460 91 466 -18 -487
5587 -487 -101 481 156 -436 -249 371 328 -350 -399 247 430 -160 -456 75 477 -13 -471 -84 463 150 -441
5608d41J77O43q0o56k0O43J64o11k77N61L86m99m51L78N60k73o02J60O22n6o50
5629c22m4O02K19o38k84N56L74m65m56L49N44k74n55J41O23n0o32p4O34J68o19
5650b03k58N40L85m56m72L73N50k64o09J55O42l8o58n3O27J74n91l12N50L97m53
5671B6n15M08N44k98n72J60O42q5o28n1O40J55o12k69N21M00m98m24L34N52k52
5692A78o15J70O62p2o42m1N94J90n79l05N22M44m74m96L82N35k62o10J54O50n6
5713C29o28r1O45J48n62l17N34M25m85m63L52N40k28n85J06O66o6o23q0N82K12
5734D11n91k48M88M00m39m69L42N53k70n45P1O58j1o49q9O01K10n66l04N16M19
5755D88m47m88L29N79k70o05J38O37oo66p4O08J94n65l40N50M02m24m92L50N35
$$ plain form
5608 -441 -264 379 299 -357 -377 266 430 -181 -458 103 489 -10 -461 -83 477 204 -398 -238 384 328 -322
5629 -322 -366 236 455 -183 -467 89 463 -2 -458 -109 435 161 -394 -253 370 320 -312 -386 248 416 -203
5650 -203 -461 79 464 8 -464 -91 459 195 -414 -259 383 345 -313 -366 261 435 -156 -468 82 479 26
5671 26 -489 -81 463 165 -407 -247 395 310 -318 -369 271 426 -186 -455 66 466 -32 -456 -122 430 178
5692 178 -437 -267 395 323 -319 -360 234 424 -155 -460 62 506 32 -464 -82 453 191 -419 -265 385 329
5713 329 -299 -390 255 403 -159 -476 58 483 -2 -465 -113 427 199 -386 -280 386 320 -303 -383 199 411
5734 411 -180 -428 60 460 21 -448 -106 447 177 -368 -297 361 350 -299 -388 213 423 -143 -447 69 488
5755 488 41 -447 -118 461 191 -414 -276 361 355 -311 -385 223 417 -148 -488 62 464 40 -452 -102 433
5776D33k58n92J50O15j9o37q1O03K17n94l21N53M22m67m98M00N05k18o21J41O16
5797C49l4o03j12O35K23n69l55N17M04m15m96L35N59k12o24J24O33k7n98j31O12
5818B15K09n99l10N39M16m35n18L62N56k50n95J39O19Oo42q7O15J81n68l00N28
5839H1M20m41n21L26O13k87o29J49O41l5o19j02O38J91n64l45N44L89m55n01L75
5860a32N91k81o04J63O09j5o22j01O11J98n85k72N11M05m43n01L53N87k58o46
5880d32J61O49l4o32r7O32K03o01l15N18M39m87m83L81N54k92n77J37O04ko31
5901c05p4O23J78n75k94M94M09m55m89L51N84k55o27J71O62o1o38p8O35J87o23
5922a80k78N35M16m93m84L97N16k53o22J92O28n7o29p3N95K17n97k92N21L91m50
$$ plain form
5776 433 175 -417 -267 348 329 -308 -389 214 431 -163 -484 69 491 24 -474 -74 431 213 -408 -267 349
5797 349 315 -288 -400 235 458 -111 -466 51 455 40 -456 -121 438 226 -398 -274 359 332 -266 -397 215
5818 215 424 -175 -485 54 470 35 -483 -121 435 185 -410 -271 348 354 -288 -375 240 421 -147 -447 81
5839 81 501 60 -461 -135 478 191 -438 -289 352 317 -302 -404 234 425 -139 -484 60 449 -6 -507 -132
5860 -132 459 178 -426 -263 346 331 -291 -392 219 417 -168 -440 71 476 33 -468 -115 472 214 -432
5880 -432 -271 378 344 -288 -385 247 450 -151 -466 52 491 4 -479 -98 456 164 -413 -276 328 326 -305
5901 -305 -379 244 422 -153 -447 47 456 1 -488 -137 447 192 -435 -264 398 337 -301 -379 256 443 -180
5922 -180 -458 77 493 0 -484 -87 429 176 -446 -254 374 317 -312 -385 210 427 -170 -462 59 450 0
5943@m85L84N53k74o11J70O19j5o53n7N89J98o01k99N89L69m87m69L81N68k82
5964A87o12J54O49q3o26n3O54J38n59l24N74L74m75m53L55N52k67o22J49O54m4
5985C22o69k9O09K09o11l05N63L99m80m97L84N81k96o03J60O43jo85q3O13K30
6006D54o18k80N26L94m62n01L92N55k74o17J60O30k3o60m4O18J66n81l00N24L79
6027D38m31m96L90N63l15n60J57O51o6o65l7O01K16o07k99N47M00m79m68L49N96
6048D85k83o40J59O47k8o51q0O26K15o19k98N40M18m80m99L62N70k57o34J54O62
6069C69n4o43q1O65K02n95l68N72M08m63m79L35N89k61o16J57O51m8o57p9O35
6090B39K02n95l39N59M28m91m63L57N37k38o20J75O02m4n99j12O24K09o01k89
$$ plain form
5943 0 -485 -101 452 178 -433 -263 356 341 -312 -369 220 418 -183 -482 107 476 -11 -480 -99 469 187
5964 187 -425 -271 378 295 -331 -384 270 408 -151 -475 99 473 -2 -455 -100 452 185 -437 -288 366 322
5985 322 -347 -376 233 442 -169 -474 89 488 8 -489 -105 476 180 -423 -263 380 379 -306 -389 224 454
6006 454 -164 -444 82 476 14 -487 -95 460 186 -431 -271 359 336 -324 -368 250 416 -165 -465 59 438
6027 438 7 -489 -99 464 149 -411 -254 397 331 -334 -371 230 446 -161 -460 87 487 8 -460 -111 485
6048 485 202 -438 -279 368 340 -311 -391 235 450 -169 -467 73 491 11 -488 -126 444 187 -447 -293 369
6069 369 315 -328 -409 256 458 -137 -505 67 475 12 -467 -132 457 196 -420 -263 388 340 -317 -396 239
6090 239 441 -154 -493 66 494 3 -460 -103 434 196 -424 -249 353 309 -290 -402 222 431 -170 -459
6110d59N12L91m61m58L74N40k71n81J43O40m7o40r2O52J84o20k56N12M36m82m94
6131d77L63N65k47o31J60O72n9o40j08O36J98n95k99N50L87m76m86L81N29k39
6151A84n94J69O07p0n96q5O50J60n89l00N30L93m35m84L91N20k67o24J95O21o3
6172C13o08p4O08J71o01k52N48L76m79m53L92N14k92n94K25N82n8o35n2O21J42
6193C94n87k47N61L42m97m13L64N53l51n53K28N90j07n80m7O18J29n97k48N66
6213A18L25m77m10M00M99l23n30J78O07j01o26lO24P8o05j80N37L22m82m02M04
6234d7N08l69n34K37N75j20o01%O38Q7o23j74N72K90m94l74L77N12l25n49K17
6255a97O03j23o23L8N77J34o34k00N72K98n00l72M14M67l50n42K48N80j40n94
$$ plain form
6110 -459 53 444 -17 -475 -101 439 168 -413 -270 370 323 -317 -409 243 427 -193 -449 63 499 17 -477
6131 -477 -114 451 204 -427 -267 405 346 -294 -402 234 432 -163 -462 88 475 -1 -487 -106 423 184
6151 184 -410 -241 366 296 -300 -385 265 425 -164 -464 66 459 24 -460 -69 451 184 -440 -245 376 313
6172 313 -295 -369 239 410 -191 -443 105 481 2 -451 -59 455 163 -431 -206 376 318 -317 -369 252 394
6193 394 -193 -440 121 463 -34 -447 -83 470 119 -434 -206 384 277 -303 -350 268 397 -200 -448 118
6213 118 443 -34 -444 -44 455 132 -398 -220 387 286 -340 -343 281 359 -246 -426 111 433 -49 -451 -47
6234 -47 461 92 -442 -205 370 250 -351 -351 287 374 -249 -423 149 439 -55 -429 -52 460 135 -414 -197
6255 -197 406 283 -340 -302 275 409 -225 -425 147 445 -55 -427 -13 454 104 -438 -190 390 250 -344
6275c44J3O32N2n88j82N53L15n18l90M36M95l99n43K95N80j53o21M1O23L1n92
6296b64j42N75K77n20l75M27N01m13m99K55N84j58o06P7N84Q3o19j53N28L06n40
6317i2l66M46M47l39n48K67N82j47o21P9N91N2n90j54N42K98n24l92M65M56l81
6338G1m90K58N58j53n94M9O14M9n86j64N61K47m96l61M47M40l67n20K94N56j66
6359B47o01N3N98K4n59j58N46K61n21l53M62M47m00m90K84N77j87o18J14N88K1
6380C35n58j86N83K26m99l26M63M08m02m91L04N43j99n65P1O07J8n87j42N60K53
6401D16n26l17M70L63l62m82K94N37k12n66J19N81J3n95r0N44K33n29k96M35M15
6422D45m29m56L16N40k31n35J31N06L5n68j18N41K29n30k83M70L75m19m48L21
$$ plain form
6275 -344 -331 301 353 -235 -417 136 451 -67 -457 -21 474 75 -468 -173 407 254 -367 -326 297 328 -264
6296 -264 -406 169 446 -74 -449 -22 479 66 -433 -178 406 248 -358 -281 303 386 -233 -386 142 448 -92
6317 -92 -458 -12 435 96 -452 -185 397 250 -371 -292 299 351 -239 -393 149 447 -77 -469 -4 452 71
6338 71 -419 -161 397 244 -350 -301 313 362 -224 -388 173 420 -76 -437 10 450 83 -437 -143 413 247
6359 247 -354 -301 297 321 -238 -396 150 411 -110 -463 -1 446 46 -444 -160 417 230 -388 -274 314 335
6380 335 -223 -409 174 400 -99 -425 38 446 44 -447 -143 400 201 -364 -293 314 332 -255 -397 163 416
6401 416 -110 -427 43 406 44 -438 -144 393 181 -385 -266 315 328 -267 -357 187 420 -109 -405 30 445
6422 445 16 -440 -124 416 185 -350 -219 287 322 -246 -364 177 406 -124 -407 63 438 19 -429 -108
6442a08M89k08n53J22O00m0n70p6N52J58n01k93M77L81m18m54L03N34k37n19J10
6463b51N60j1n53j03N66J95n22k90M68L35l74m35L18M85k42m94J03N51j7n25j00
6484c36N21J99n07k88M46L74m10m33L45M72k35n44J72N32m7n56m5N47J73n45k23
6505c88M40L70m25m08L79M14k22n17J58N16m4n36l5N13J47m99k44M54L16m08l97
6526d16L42M43k44n12J81N24n1n57m2N49J42n17k38N09K71m14l97L50M56k70n01
6547c92K24M71n5n22m0N64R8n37j87M72L12m38l41L69M30k95m83J57N21q5n30
6568b87J7M95R6n11k01N04K75m18l60L47M47k98m78J83N12p8n28k6N57O7n16j54
6590c55M47K79m18l34L66L97k96m58K32M93j21n19M5N10K6m46j67M33K54m10l29
$$ plain form
6442 -108 381 173 -380 -258 342 302 -268 -344 208 366 -135 -428 49 430 12 -442 -139 395 158 -361 -251
6463 -251 309 298 -255 -358 208 403 -119 -409 59 394 20 -415 -97 388 146 -348 -245 306 289 -236 -336
6484 -336 185 384 -123 -411 35 409 -1 -434 -89 383 148 -396 -224 308 261 -295 -340 207 380 -165 -388
6505 -388 52 422 -3 -411 -32 382 160 -357 -199 317 273 -263 -298 215 362 -137 -381 73 389 -19 -416
6526 -416 -74 369 125 -387 -206 318 267 -290 -332 217 359 -158 -396 113 384 -30 -427 -77 379 109 -392
6547 -392 -168 303 248 -274 -314 250 348 -189 -376 96 408 -30 -371 -2 428 133 -350 -193 328 243 -287
6568 -287 -270 225 321 -190 -391 113 388 -30 -390 -43 404 106 -372 -189 323 245 -283 -309 248 315 -201 -355
6590 -355 92 371 -47 -381 -15 382 86 -372 -140 353 232 -287 -242 268 294 -152 -319 114 368 -42 -371
6611c71L48L93k94m68K55M50j22n02P3M88N4n31j23M78K21m06l36L87L76l26m11
6632c67K30M65j29n02Q8M57L6m73j31M75J98m24k86L81L55l04m06K07M52j23n03
6653c04N9N19km89r1M60K12m50l13M25L24l26l74K31M56j77m92J06N00rm83r7
6675c15M68J82m30k79M44K62k96m07K58M36j69m50O3M86J1m71r4M76J49m12k79
6696c67M25L02l54l60K82L92j65m79J07M71Qn00o1M56J49m33k24L82L29l48l85
6717c73K82M40k07m52J06M78n2m72lM10J88m74k10L91L02l53l45K62M17j84m49
6738b98R5M88n4m61n2M62J30m40k29M27K87l62l34K68M17k25m44J16M72m7m93
6759b77l3M87J26m48k08M13K72l27l49L02L73k24l90J03M44l7m64l6M72Q7m31
$$ plain form
6611 -371 -23 370 76 -392 -137 313 191 -311 -238 250 304 -227 -350 128 349 -57 -393 -6 370 44 -367
6632 -367 -137 328 199 -303 -215 242 278 -195 -326 149 347 -77 -363 18 373 69 -337 -130 322 199 -304
6653 -304 -245 274 272 -217 -308 152 364 -86 -399 26 350 24 -350 -119 337 160 -332 -226 274 265 -218 -315
6675 -315 153 335 -95 -374 70 332 36 -371 -113 323 154 -296 -233 253 264 -207 -301 175 324 -88 -367
6696 -367 58 360 6 -354 -72 320 155 -324 -217 254 262 -238 -299 157 306 -127 -351 31 360 12 -373
6717 -373 -91 349 142 -310 -204 274 222 -250 -253 157 345 -129 -339 52 354 1 -344 -82 335 151 -298
6738 -298 -203 285 231 -230 -282 180 310 -130 -359 68 355 -7 -341 -73 344 119 -325 -209 263 216 -277
6759 -277 -310 177 303 -145 -353 60 332 5 -344 -42 331 107 -283 -180 264 227 -237 -273 199 286 -145
6780a45k13M06K83l45l19K46L94k08m00J31M26n5m43l5M86Q3m46j71M02K55l52
6801b0l14K81L72k16m05J26M58r4m32j6M58R0m35j68L97K28l42k90K85L69k60
6822G2l75J68L98o6m36l2M47Q3m05j57L62K42l33l14L04L59k63l55J82L95j10
6843A66m32KM28J21m40j70M36J85l46k81L03L52k30l91J40M23r5m17J9M42L6m28
6865a77q4L72K03l77k45K74L71k83l63J96L73r1m36K9M32O7m41j02M06J54l35
6886e7k87L43K71k34l24J80L83j08m10M6M03L6m28p7L84J87l46k46K89K92k68
6907B9l65K25L77j09m38O4M17L9m30p3L86J65l72k09L00L07k81l52K11M06j53
6928A44m02N1M19K7m25q5M13J32l54k29L31K91k84l20K01L67j44l90M6M52j2m06
$$ plain form
6780 -145 -358 48 331 -14 -333 -87 307 99 -301 -170 256 201 -242 -277 209 292 -154 -325 77 332 -20
6801 -20 -334 -53 319 103 -302 -176 282 188 -244 -260 198 288 -147 -315 82 310 -32 -322 -37 332 72
6822 72 -303 -135 263 197 -239 -271 176 259 -146 -303 59 301 -32 -346 -42 317 54 -301 -119 276 166
6843 166 -266 -264 164 285 -155 -325 111 296 -50 -331 -28 324 94 -297 -157 266 171 -246 -227 215 251 -177
6865 -177 -261 111 314 -63 -308 -34 337 54 -309 -113 260 169 -267 -238 194 261 -180 -282 124 278 -57
6886 -57 -344 -1 270 36 -288 -108 275 167 -243 -197 206 242 -186 -263 121 308 -38 -284 5 297 29
6907 29 -336 -111 266 157 -281 -217 200 239 -191 -264 122 287 -85 -294 6 313 32 -320 -109 297 144
6928 144 -258 -207 212 239 -186 -271 142 274 -80 -309 22 313 29 -291 -90 277 133 -257 -211 241 229 -177
6950a77p3L95J32l73k14L52K43k99k83K13L55j50l75P3L65L7m12o1M01J26m13
6971a38j51L35K81k91l39K17L65j62l75J10L50J9m23n9M29J05l61k03L17K57k65
6992A8l10K21L59j50l93P0L95k0l82o4L88J27l70j94L51K30k81k82K34L22j49
7013A20l88R6M03k3m18j2L49J26l54j73L27K30k72l00K17L65j55l87J10L64m5
7034A80l56n2L57R1l24j58K94K52k82k83K13L25j47l53R0L87o2l56m1L65Q2l33
7056a11j35L12K11k71k96K31L05j51l17P7L79m2l83rL56Q8l64j51L43K06k84k36
7078b42J89K99j66l29J36L03k5l70kL21R3l26j27K91K05k57k72K33K73j72l22
7099b67J43L03k7l37k6L54J02l38j32K99J77k59k51K07L14j86l00J34K70k2l63
$$ plain form
6950 -177 -250 145 277 -96 -310 42 285 -14 -297 -84 271 121 -254 -181 184 221 -191 -252 149 275 -138
6971 -138 -289 46 327 36 -303 -86 279 117 -258 -148 202 221 -202 -261 168 273 -88 -291 26 283 18
6992 18 -292 -71 288 138 -255 -185 210 190 -192 -256 132 259 -111 -305 46 276 -5 -287 -53 269 120
7013 120 -268 -172 231 208 -210 -222 127 253 -101 -274 53 283 11 -289 -72 293 138 -249 -139 225 180
7034 180 -176 -228 129 220 -104 -262 32 284 2 -281 -68 257 110 -243 -153 234 172 -184 -225 140 222 -111
7056 -111 -246 66 277 6 -290 -59 246 95 -222 -145 234 192 -191 -200 156 244 -120 -271 72 278 -6 -242
7078 -242 -53 246 80 -249 -113 190 165 -205 -207 114 207 -119 -246 45 250 -7 -279 -46 227 55 -267
7099 -267 -124 179 152 -185 -211 143 245 -93 -225 74 251 -8 -259 -52 262 76 -224 -90 180 158 -205
7120b05J1L50M6l20r7K96J61k81k02K12K48j82k80J17L38q9l17lL46M1l11q2K65
7143F2J89k94j86K22K45j86k92J30L04m3l43J9L27K3k89r0K78J54k87j75K11K42
7165B21j78k58J26K76n9l20J9L24K8k86j21L16J49l01j61K32K16j78k62J26K87
7186A96p2l15N1K99J2k76r9L04J25k78j67K41K11j94k52J66K51q5l15N5K81M3
7208A82l21n7K79J19k54j75K28K15j84k69J42K83j12k63L7L12%k99m5K65J38k90
7230f9j38K27J96j91k28J25K52p9k79R3K57j9k93m8K90J16l10j39K66J74j85k37
7252b19J49K75j14l04Q5K77K0l21m2L02R1k69j60K51J56j49k25J51K36j08k72
7273a90N8K93j8k86k8K79J08k68j63K55J62j92k10J92K22j70k16P3K52k8k57l9
$$ plain form
7120 -205 -194 156 202 -118 -215 81 242 -39 -241 -29 219 37 -243 -126 212 123 -194 -197 149 190 -121 -203 62
7143 62 251 -43 -229 -7 238 52 -240 -110 194 151 -192 -173 154 177 -112 -202 76 230 -57 -232 -21 221
7165 221 43 -215 -89 187 128 -192 -173 151 179 -107 -228 88 237 -64 -225 7 223 45 -217 -91 196
7186 196 124 -191 -140 159 171 -105 -204 100 225 -53 -220 21 232 38 -214 -48 203 118 -197 -142 139 182
7208 182 -139 -196 83 202 -52 -227 1 216 32 -237 -95 188 76 -187 -150 162 162 -137 -182 83 221 -69
7230 -69 -207 20 216 25 -203 -78 174 95 -184 -91 166 147 -146 -194 96 212 -98 -237 29 203 18 -219
7252 -219 -70 205 91 -213 -128 149 169 -152 -194 108 199 -70 -230 21 177 28 -197 -46 190 82 -190
7273 -190 -132 161 143 -143 -171 108 216 -52 -215 40 202 10 -200 -8 214 44 -172 -99 153 125 -132 -171
7295a71K71N1k58r4K35J70k13k02J65K52j43k63Q3K80m4k70LK48P9k60j34K60
7317D5J59k27j91K02K09j46k36J05K46m7k55j4K74L4k38j11K49J23j79j83J68
7338a3J84j42k05P0K70m7k69pK98J9k38j13K36J52k25j48J83J76j48k18J06K56
7360A77p4k49J1K85J4k55j12K63J31k01j68J76J91j48k06Q4K32m0k36j4K47K2
7382A30k19p9K21J27k02j91J92K05j75k10J34K35p8k37J7K55%k27n7K15J30k13
7404b7j63J96J67j37k14J09K30o8k34K1K53K0k51p3K31J28k15j50K08J54j70j96
7426a81J07K24p5k16M3K19nk27m6K17J10k08j30J69J86j53j93J02K21p5k35M6
7448a00K38qk28n9K24J06j95j43J87J64j66j89J12K17r2k24P4K00Jk13n3K09R3
$$ plain form
7295 -171 100 151 -107 -201 34 204 -9 -211 -46 206 63 -200 -117 163 119 -151 -148 100 179 -81 -215 45
7317 45 204 -23 -214 -12 197 51 -185 -80 166 119 -136 -150 124 158 -80 -191 58 181 2 -181 -13
7338 -13 171 29 -176 -106 164 117 -152 -159 139 158 -80 -193 43 195 -30 -178 5 181 33 -185 -79 177
7360 177 103 -146 -135 150 164 -91 -203 60 191 -10 -178 -2 189 41 -165 -81 151 111 -125 -139 108 130
7382 130 -89 -168 53 180 -22 -213 -21 184 9 -201 -67 168 90 -147 -130 125 125 -102 -159 56 186 -27
7404 -27 -190 6 173 36 -178 -69 161 93 -141 -120 133 153 -98 -171 60 188 -27 -177 31 185 15 -181
7426 -181 -74 150 75 -141 -98 121 116 -111 -157 60 170 -38 -168 1 187 34 -159 -57 164 89 -146 -100
7448 -100 138 130 -98 -157 67 173 -22 -165 22 186 20 -169 -57 160 68 -156 -82 118 119 -94 -147 62 155
7471A55k18q6J67J37j50j53J02K18q1k56P5K31j0k40j7J97Q2k27q3J85J43j82
7493a1j64J58J56o2k20N5K07K2k50k5K29O7k32q5J84J16j73j42J12J88p1k13M9
7516a05K09j0j82k5J96L1j58j24J60J41j32j64J26J63p4j94N9K06pj96m6K15N9
7539A48j97r1J72J02j12j85J41J60p6k15O2J90j7j76l8K21M3j94q1J75Q5j19j47
7562a49J13J71p4k01O4J74rj88k4K27J0j62j05J67J15j36j51J22J77q7j99O4J93
7585A12j4k01oJ91N2j94q3J59J23j66j40J50J42j02j77O7K03j2k21J4K05Rk00
7608h9k0J57Q5j79j03J44J52j11j67Q3J55l2j91J7K01Pj82n3J41J14j31j27J16
7631a3J43j11j39P1J69o0j92NK00M7j86o2J49J20j72j08J06J46j02j60R1J76n0
$$ plain form
7471 155 -63 -149 18 155 5 -148 -46 172 91 -165 -90 141 131 -109 -126 71 153 -74 -157 28 171 -11
7493 -11 -175 -17 139 77 -143 -88 119 141 -109 -134 95 162 -70 -155 29 145 -28 -170 -58 130 59 -154 -105
7516 -105 104 94 -88 -113 83 114 -44 -168 -8 133 1 -163 -37 126 52 -142 -83 123 116 -80 -126 89 148
7539 148 -49 -140 32 134 22 -163 -22 138 62 -153 -91 99 82 -94 -132 89 132 -62 -143 32 117 -2 -149
7562 -149 -36 135 61 -140 -76 98 89 -99 -123 104 114 -48 -153 14 129 -7 -158 -36 141 54 -145 -81 112
7585 112 98 -103 -109 82 134 -60 -143 16 139 -27 -167 -17 125 23 -154 -87 116 104 -117 -103 102 111 -89
7608 -89 -109 48 133 -46 -149 -5 147 36 -131 -48 107 75 -116 -99 102 109 -73 -126 15 129 -2 -129 -13
7631 -13 130 19 -120 -49 120 60 -132 -127 73 120 -66 -128 21 141 -31 -139 -33 113 11 -149 -58 118 68
7654F8j77J5J79L0j75q2J76Q7j34r6J09J36r8j70Q2J51k4j92K5J62J1j55rJ48
7678F7Q1j83j15J61R7j03j33R2J44p3j48M0J42K2j58m9J88M3j77p3J37J26j19
7701Ij52J01J65o8j33rJ78K3j96k6J64Q8j82p7J08J11j05j31R3J62j04j19L3J66
7725I9pj90j3J73O2j70r7J64J02j22j38J26J06m7j55P2J39m7j35mJ32L9j18p2
7749a01J00J11r8j07O9J40p2j37J6J85m7j33j5J32M1j39p4J30J22j31j13J18J01
7772I8o8j42M9J33pj50nJ45J9j26p4J59P3j15j11R2J57r4j32L5J51j0j55j0J65
7797G7L3j67o0J21R1j22q4P2J65j09j65P3J55k0j47j8J51Rj28k0J07J13j33j22
7821a28J27R4o7j29L5J57j5j65nJ72K4j38q6J57P3j20j01Q0J50j02j13O4J39o3
$$ plain form
7654 68 -109 -94 85 115 -60 -142 34 121 -13 -109 0 136 38 -132 -50 101 77 -115 -90 72 83 -72 -81 67
7678 67 148 -35 -150 11 108 5 -128 -36 108 35 -113 -73 69 91 -67 -116 72 115 -62 -135 2 128 9
7701 9 -143 -42 123 55 -78 -87 91 114 -82 -108 56 144 -38 -115 -7 104 -1 -132 -39 123 19 -100 -67 99
7725 99 92 -98 -111 62 124 -46 -143 21 123 1 -137 -11 95 48 -107 -35 104 57 -78 -82 50 89 -29 -101
7749 -101 -1 110 12 -95 -26 114 42 -95 -79 106 59 -74 -89 43 84 -55 -129 1 123 -8 -121 -3 98
7772 98 30 -112 -63 70 63 -87 -92 53 72 -54 -128 31 104 -11 -122 -30 127 33 -99 -64 87 77 -78 -88 77
7797 77 110 -57 -117 4 95 -27 -111 -39 126 17 -148 -75 80 60 -87 -105 46 55 -73 -93 14 127 -6 -128
7821 -128 -1 93 26 -103 -68 89 74 -91 -96 76 100 -38 -124 33 106 -14 -115 -35 115 13 -100 -36 103 40
7845D0j08kJ18K7j15o7J34N9j23q8J12J06q5j21O9J26m3j41J4J40M2j68kJ32L0
7870H6r9r6J03R7r5j06N0J55l6j26kJ31Nj30j1J22K1j02q1J55O2r2j41J14Q6m8
7896B2j20K6J43k3j33k0J45K7j22n4P7R3o5j07P2J07l5j14K4J35mj39QJ05L6j08
7922b4o7J29N6r8j06P9J52q6j40M8J18mj29LJ23L7j09p5J15Q2j28q0Q1J33q7j09
7948h6J6J16Rj32l3J35N4j25p0J57M1p7j05Q5J07p8j10N4J24l8j23jJ28Qj02m7
7974i3Q2Q0p2j29J23Q1n4j31O2J15k5j20L0R4J9p9o4R4O9j18n8Q2P1o2r1Q7J11
8001A04n5j22NJ30J5j13l3R6N6j04n6Q7Q0l9j47P4P3k5r6K7R1nr1j8Q3M7p0r7
8029a03P9J10o3j14L3J34k1j21J4Q7Pj03JQ8M3p6p7J02P6j16o6O6J04l9j13J6
$$ plain form
7845 40 -68 -70 48 75 -40 -107 27 86 -37 -125 -13 93 8 -113 -44 82 39 -102 -88 52 94 -74 -76 56 86
7870 86 -13 -109 -6 91 -4 -110 -60 95 59 -67 -69 62 67 -63 -74 48 69 -33 -114 41 103 11 -130 -16 70 22
7896 22 -98 -72 71 48 -85 -105 40 67 -55 -109 -32 61 -4 -111 -39 68 33 -81 -57 78 74 -65 -57 48 84 -24
7922 -24 -91 38 94 -4 -110 -31 121 35 -105 -57 61 57 -72 -69 54 91 -18 -93 22 104 -24 -104 -23 110 23 -86
7948 -86 -70 46 55 -77 -110 25 79 -46 -116 41 82 5 -100 -15 92 14 -96 -42 82 44 -79 -80 48 56 -46 -93
7974 -93 -11 69 -3 -132 -9 72 18 -113 -51 64 39 -81 -51 43 62 -17 -81 13 82 -36 -94 -12 59 -3 -94 -7 104
8001 104 49 -73 -68 62 77 -36 -69 27 83 -21 -77 10 90 51 -96 -22 51 26 -70 -43 48 43 -48 -66 17 64 -6 -103
8029 -103 -24 86 23 -91 -58 76 55 -66 -52 35 42 -61 -60 28 71 -5 -82 20 96 -20 -86 -20 84 45 -68 -52
8055e2J08op3n6J11M3j18m6O1J04p0q7M3J20o7o9k4J36pr5l0J05L0r0m1M0J09
8082G9q6q9Q6Q0l8j09K3J10k1m8l7J00L4j19k0P5M8o3q8Q1O7p3o4L5Q3Nj15qJ11
8111C9J4q1m0O9O3p9o0O2P8m7q5QR3J2r9k1J12Jp2l9J00N0p3q1Q0P7p5p1K3J04
8141F2l2p4j2J20k4q3l6R2M4p1m9N4P1n8j07Q6O1k4r7L9O5J7q2m0R8N2r6m9R8
8170B5M3o6m2L1N7k4p6J5J24l2r4l4J16K8j15QJ0P0m2p6L6
$$ plain form
8055 -52 56 50 -23 -79 32 75 -43 -89 -28 76 6 -81 -38 82 15 -54 -78 58 51 -44 -74 31 61 -29 -70 -30 79
8082 79 -7 -96 -10 70 32 -77 -54 56 35 -13 -50 50 84 -35 -55 20 68 5 -83 -2 65 -8 -72 -37 46 51 -64 -72 39
8111 39 53 -28 -68 1 64 -15 -75 -13 65 18 -67 -59 34 46 -53 -74 38 39 -33 -72 28 78 5 -76 4 81 6 -65 -42 62
8141 62 30 -44 -56 64 40 -43 -79 13 57 -14 -63 -9 62 4 -103 -17 44 20 -77 -38 27 44 -38 -78 20 72 -24 -73 25
8170 25 68 2 -40 -9 48 24 -52 -37 87 55 -39 -73 43 71 -44 -36 -26 44 2 -74 -38
8191c8
$$ Imaginary data points
##PAGE= N=2
##DATA TABLE= (X++(I..I)), XYDATA
0@%%%%%%%%%%%Qj6J6j6J6k2L0l3M1m9N7p2Q8j04J20j37J60j84K10k42K75l15L60
34A91m06M56n12N78o49P23q05Q96r94J100j219J350j490J643j812J997k198K421
52A270k670K942l246L592l984M429m939N539o255P120q192R565j1398J3973j7884
67a0138K4622l9332J27330j20811k47253K61736J89902j87623k36861K07062K86626
78B55260j16254l30958L8446K87704M833k92349k8551L04699J14752k79782j71311
89b13511K14624J89844j92561k12724J66222K65418j04556k78506L6895K65360
99A36505n391k66266l6994K74005J00341k44707j48291K04937J69689j81036k02579
110a99787J51207K40625r5796k53780M4466K50244q122k55426l6548K54220R1847
$$ plain form
0 0 0 0 0 0 0 0 0 0 0 0 0 8 -8 8 -8 8 -14 16 -17 24 -25 32 -40 48 -56 64 -73 87 -97 113 -129 146 -169 191
34 191 -215 241 -271 307 -342 381 -424 472 -522 578 -641 709 -781 862 -950 1047 -1151 1270
52 1270 -1400 1542 -1704 1888 -2096 2333 -2606 2933 -3322 3798 -4394 5171 -6227 7746 -10138
67 -10138 14484 -24848 102482 -18329 -265582 -3846 186056 -1567 -238428 -31366 255260
78 255260 139006 -191952 -153506 134198 139031 -153318 -181869 122830 237582 -42200 -213511
89 -213511 1113 190957 -1604 -214328 -48106 217312 112756 -165750 -128855 136505
99 136505 131114 -135152 -172146 101859 202200 -42507 -190798 14139 183828 2792 -199787
110 -199787 -48580 192045 96249 -157531 -113065 137179 129057 -126369 -162917 91303 183150
121A83150k29529j32621J98481J60302j74085j93060J40081K23224r1506k34575
131a50138M6376K36213q076k39282l6731K33046Q4565k10663j21344J84002J50507
142A68475j58004j80662J23076K04758p9923k14930L9335K18270j399k19161m0592
153a40757K10638Q1893j90895j15020J67680J43119j42276j69729J09444J89571
163A43668p1635j99266L5248K03300O50k03041l8623J94230P4734j77278j04995
174a43008J56775J31494j32793j55221J03002J72484o9772j82194L6891J86775
184A04433l399j86434l1246J78711O3942j64489r2633J46465J18334j24357j40732
195a31405R7287J57508o7398j68168L6745J74006m985j74548k7505J68437N8454
$$ plain form
121 183150 -46379 -179000 19481 179783 5698 -187362 -47281 175943 84437 -150138
131 -150138 -103762 132451 124375 -114907 -151638 81408 165973 -44690 -166034 17968 168475
142 168475 10471 -170191 -47115 157643 77720 -137210 -97875 120395 118996 -100165 -140757
153 -140757 69881 151774 -39121 -154141 13539 156658 14382 -155347 -45903 143668
163 143668 72033 -127233 -91985 111315 111965 -91076 -129699 64531 139265 -38013 -143008
174 -143008 13767 145261 12468 -142753 -39751 132733 62961 -119233 -82342 104433
184 104433 101034 -85400 -116646 62065 126007 -38482 -131115 15350 133684 9327 -131405
195 -131405 -34118 123390 55992 -112176 -75431 98575 93590 -80958 -108463 59974 118428
206A18428j56527q6612J40224J12126j19118j34213R3463J50872o4857j61860
216a08074L4701J67665l354j67575k8205J61000N8006j48782q4994J31845J08953
227A21186j10411j28757Q5137J43173n7635j52127K9049J55898R8j54189k8732
238i7310J46980N5393j35034p9391J19133J00371r9581j17625P7131J30402n2731
249D7738j38759K7149J42786r86j42059k4996J36764M9536j27157p2290J13668
260A1394R2769r6588j10102P6378J23698n3770j33273K9392J38543l934j39061
271f4554k1672J34763M6383j25853o9500J12680R0160r5620j07460P5253J20864
282I5444n2571j29919K8379J34352l449j34048k1257J29066M4880j19758o6602
$$ plain form
206 118428 -38099 -124711 15513 127639 8521 -125692 -32229 118643 53786 -108074
216 -108074 -73373 94292 90938 -76637 -104842 56158 114164 -34618 -119612 12233 121186
227 121186 10775 -117982 -32845 110328 52693 -99434 -70385 85513 85611 -68578 -97310
238 -97310 49670 105063 -29971 -109362 9771 110142 10561 -107064 -29933 100469 47738
249 47738 -91021 -63872 78914 77928 -64131 -89127 47637 97173 -29984 -102274 11394
260 11394 104163 7575 -102527 -26149 97549 43779 -89494 -60102 78441 74507 -64554
271 -64554 -86226 48537 94920 -30933 -100433 12247 102407 6787 -100673 -25420 95444
282 95444 42873 -87046 -58667 75685 72236 -61812 -83069 45997 90877 -28881 -95483
293i5483J06536Q5695q9764j01566P0113J13737m8469j21785K5479J25612k084
304F8021j25076k0940J20305M2982j11659o3315R9341Q1290q3819r6280O5717
315b3433J07907m5753j15750K4418J19728k495j19701j9228J15692M0087j07930
326b6458n9423R6621P6666q2260r1159O5367J02461m6544j10214K6264J14364
337F5685n323j14629j5597J11037L5822j03772n4711R2996P1604p9067q5949O2577
349a9327R7211m4106j04991K4301J09083l848j09396j6581J05936L6326r8871
360b4263n4655Q8393P1002p4920q4772N8906R5514m0873j02881K1562J06517j626
372E7904j06455j8058J02628L6891r5339n4152Q4912O9237p1708q1797N6331R1361
$$ plain form
293 -95483 11053 96748 6984 -94582 -24469 89268 40799 -80986 -55507 70105 68021
304 68021 -57055 -77995 42310 85292 -26367 -89682 9659 90949 7130 -89150 -23433
315 -23433 84474 38721 -77029 -52611 67117 64622 -55079 -74307 41385 81472 -26458
326 -26458 -85881 10740 87406 5146 -86013 -20646 81815 35271 -74943 -48679 65685
337 65685 60362 -54267 -69864 41173 76995 -26777 -81488 11508 83112 4045 -81904 -19327
349 -19327 77884 33778 -71213 -46912 62171 58323 -51073 -67654 38282 74608 -24263
360 -24263 -78918 9475 80477 5557 -79215 -20309 75205 34332 -68549 -46987 59530 57904
372 57904 -48551 -66609 36019 72910 -22429 -76581 8331 77568 5860 -75937 -19606 71755
384G1755l9286r7657K1149J00574k590j00147j5613R6336L2925q9395m8863P9735
396H923O2843o7583p4550N3492Q3670l7941q9908K1305R3289m366r3549j2627
408e7002R0879K9043q5310m4417P7001N8338o6252p0340N3391Q0009l8760q7062
420f0482K2854R1166o109r2198j0863R0098K7429q4885m3032P6824N7027o6107
432A722o8979N3185P8369l8415q5053K2528Q8578n898q8962j0772Q6213K6811
444E9327q0436m1623P1912N4647o0960o5541M8103P3913l3788p9575J8643Q2342
456D6964l159q2257j2107P9452K6591p4104l9899O6463N1652n6792o1595M5500
468a3291O9484l2872p5105J9223P8326n123p8971r110P7055K3030p2684l6088
$$ plain form
384 71755 32469 -65188 -44039 56535 53945 -46202 -61815 34521 67446 -21949 -70812 8923
396 8923 71766 4183 -70367 -16875 66795 28854 -61054 -39749 53540 49174 -44375 -57002
408 -57002 33877 62920 -22390 -66807 10194 68532 2280 -68060 -14669 65340 26580 -60482
420 -60482 -37628 53538 47429 -44769 -55632 34466 61895 -22990 -66022 10802 67829 1722
432 1722 -67257 -14072 64297 25882 -59171 -36643 51935 46037 -42925 -53697 32516 59327
444 59327 -21109 -62732 9180 63827 2867 -62674 -14571 59342 25554 -54021 -35378 46964
456 46964 43805 -38452 -50559 28893 55484 -18620 -58519 7944 59596 2804 -58791 -13291
468 -13291 56193 23321 -51784 -32561 45765 40642 -38329 -47439 29616 52646 -20038 -56126
480e6126O5901M7955n6967n8131M6147O6317l3902p2166K0569P5598o655p6387
492c7847p432P4607K1107p0286l3917O3632M5405n4941n5168M4388O3052l2448
504B0152o8686J9548P1915o153p2638p307P0903K0371o6799l2616O0489M3626
516E2805n2234n3009M2217O0588l0873o6065J8603O9214n805p0009p042O8385
528B6775J9537o4441l1251N8407M1724n0429n0657M0773N7780k9839o2881J8124
540b6378O5701n939o6246o287O4594J8007o0695k8990N4904L8755m7366m7067
552d7007L8398N3731k8394n8475J7532O1248o152o2061n264O0827J6393n7597
564a6821k6912N2499L6462m5738m4759L7455N1585k7915n6673J7479N9803o436
$$ plain form
480 -56126 9775 57730 763 -57368 -11221 55096 21194 -50972 -30403 45195 38540 -37847
492 -37847 -45279 29328 50435 -19851 -53768 9864 55269 328 -54840 -10452 52600 20152
504 20152 -48534 -28986 42929 36776 -35862 -43169 27734 48105 -18694 -51310 9179 52805
516 52805 571 -52438 -10221 50367 19494 -46571 -27968 41246 35441 -34568 -41610 26775
528 26775 46312 -18129 -49380 9027 50751 322 -50335 -9562 48218 18379 -44502 -26378
540 -26378 39323 33384 -32862 -39149 25445 43452 -17243 -46233 8671 47426 60 -47007
552 -47007 -8609 45122 16728 -41747 -24215 37033 30881 -31180 -36444 24383 40776 -16821
564 -16821 -43733 8766 45228 -510 -45269 -7814 43771 15856 -40817 -23338 36465 30029
576C0029o0931m747N9964J5778n6942k6237N1917L5752m5027m3992L6612N0605
588D2781k7020n5306J6541N7996n654n8560n265N7073J5761n3614k5494M8325
600G564L4217m1582m1461L3442M7190k4331n1252J4593N3500m611n3801n413N2376
613B0431J5050m9211k4013M4461L2039l8354l8864L1065M4386k2938m8317J4079
625b0186N0724m869n1480m464N0530J3617m7912k2308M3735L0219l8122l7058
637c7574L1185M2650k3221m6757J4503M9223n308m9910m034M8850J3124m6066
649a3335k1678M1758K9253l5970l5746K9130M0779k1287m4412J2827M6457m080
661B3696m6838m655M5568J3113m2792k1023L8657K8029l3182l3985K6632L8785
$$ plain form
576 30029 -30902 -35649 24315 40093 -16849 -43086 8831 44583 -444 -44436 -7824 42781
588 42781 15761 -39545 -23004 34992 29338 -29222 -34487 22586 38347 -15267 -40761 7564
600 7564 41781 199 -41262 -7820 39370 15039 -36213 -21620 31880 27269 -26532 -31945 20431
613 20431 35481 -13730 -37743 6718 38757 403 -38461 -7396 36990 14052 -34265 -20186
625 -20186 30538 25669 -25811 -30275 20255 33872 -14040 -36348 7387 37606 -516 -37574
637 -37574 -6389 36261 13040 -33717 -19214 30009 24701 -25209 -29243 19607 32731 -13335
649 -13335 -35013 6745 35998 28 -35718 -6588 34191 12904 -31508 -18681 27776 23696
661 23696 -23142 -27797 17771 30884 -11908 -32931 5726 33755 573 -33412 -6780 32005
673C2005j9369m2097J1455M3981l275m4352m948M3243J2853m0604k0284L6687
685E295K6876l1577l2456K5444L6910j8556m0034J1133M1750l435m2047m272M0917
698A5948J1748l8452j8707L4709K4917k9798l0187K3968L4392j7469l7360J0457
710a5834L8993l153l9346m108L8345J1163l6070j7772L2630K3727k8092k8872
722b8389K2675L2946j6507l5895R842L7614k897l8009m192L7116J1070l4924j7512
735b7062L1500K3336k7044k8213K1625L2041j5520l4667Q974L6069k248l6219
747a7428m399L5032J0839l2665j6792K9192K2062k4809k6394J9621K9769j3893
759A0135l2006P805L3150j671l3116m405L2008J0209k9853j5620K6802K0367k2884
$$ plain form
673 32005 12636 -29461 -18006 25975 22700 -21652 -26600 16643 29496 -11108 -31392 5295
685 5295 32171 594 -31862 -6418 30492 11936 -28098 -16965 24785 21350 -20697 -24969 15948
698 15948 27696 -10756 -29463 5246 30163 365 -29822 -5854 28538 11069 -26291 -15834
710 -15834 23159 20006 -19340 -23448 14897 26060 -10010 -27782 4848 28575 483 -28389
722 -28389 -5714 27232 10725 -25170 -15328 22286 19389 -18620 -22812 14304 25374 -9550 -27062
735 -27062 4438 27774 730 -27483 -5858 26183 10663 -24004 -15030 21039 18791 -17428
747 -17428 -21827 13205 24044 -8621 -25413 3779 25841 1032 -25362 -5741 24028 10135
759 10135 -21871 -14066 19084 17413 -15703 -20108 11900 22109 -7744 -23364 3438 23805 921
772I21k4421J8281K7661j3173k9933P682L1216k007l1444l753L0710R321k8911
785g850j4602K6137J9399k2584k3398J8131K6739j3172k9058P735L0367k070l0549
798a4775l639K9679R130k7748j4260K4873J8798k1131k2589J6635K5556j1730
810H799k7446O408K8420j013k8322m305K7212R372k5207j4014K2382J8031j8783
823A534k1412J4681K3976j0173k5666N388K6480n13k6379m369K5490Q949k3678
836e692j3210K1139J6978j7973k0112J4190K2600j0011k4280N530K5130q93k5117
849a1721l675K4209Q103k2561j2168K0161J5722j7086j8785J3590K1067r620k2600
862a5364N335K3428r69k3422l402K2597P612k1009j1489J8732J4908j5822j7782
$$ plain form
772 921 -23500 -5219 22442 9269 -20664 -12982 18234 16227 -15217 -18970 11740 21061 -7850
785 -7850 -22452 3685 23084 500 -22898 -4767 21972 8800 -20258 -12523 17844 15774 -14775
798 -14775 -18414 11265 20395 -7353 -21613 3260 22058 927 -21662 -5027 20529 8799
810 8799 -18647 -12239 16181 15168 -13154 -17459 9753 19125 -6082 -20096 2286 20317 1534
823 1534 -19878 -5197 18779 8606 -17060 -11672 14808 14295 -12084 -16453 9037 17986 -5692
836 -5692 -18902 2237 19215 1242 -18870 -4680 17920 7909 -16371 -10841 14289 13396 -11721
849 -11721 -15396 8813 16916 -5645 -17813 2348 18070 984 -17801 -4211 16856 7236 -15364
862 -15364 -10029 13399 12430 -10992 -14394 8203 15815 -5194 -16683 2049 16957 1135 -16647
875a6647J2417J9990q601k1457M480K2209l34k2139l778K1328P749j9843j1343
888a5969J7610J4571j4831j7232J1529J9272p888k0581L994K1172k8k0993l850
901a3224K0084P512j8495j0851J6276J3757j3545j6129J0425J7863o981j8998
913a2306L469J9401J62j9186l683J8319P031j6893j0064J4818J2795j2392j4958
926a3487R514J6653o391j7744L077J8223L38j8090l684J7328O885j6002r833J4163
940I50J2391j1806j4509R022J6170n996j7206K751J7627N53j7397l827J6525O946
954A2194j5086r744J3089J2152j0657j4073P892J5395m857j6161J755J6345J331
967I575j5897m316J4907P039j3387r490J1504J1496r212j3123O698J4255m006
$$ plain form
875 -16647 -4230 15760 7159 -14298 -9818 12391 12057 -10082 -13860 7468 15217 -4626 -15969
888 -15969 1641 16212 1381 -15851 -4322 14950 7062 -13519 -9525 11647 11619 -9374 -13224
901 -13224 6860 14372 -4123 -14974 1302 15059 1514 -14615 -4190 13673 6692 -12306
913 -12306 -8837 10564 10726 -8460 -12143 6176 13207 -3686 -13750 1068 13863 1471 -13487
926 -13487 -3973 12680 6289 -11455 -8378 9845 10183 -7907 -11591 5737 12622 -3380 -13213 950
940 950 13341 1535 -12974 -3952 12218 6222 -10984 -8233 9394 9947 -7450 -11277 5248 12194
954 12194 -2892 -12636 453 12605 1948 -12125 -4233 11162 6305 -9856 -8101 8244 9575
967 9575 -6322 -10638 4269 11308 -2079 -11569 -65 11431 2219 -10904 -4206 10049 6043
980F043j4874J251J4978J456j4579m123J3747O620j2474q831J0736J0795q735
993B010j2304O396J3403l877j4083J320J4187J342j3854l889J3029O307j1806
1006a819q419J0104J0282q132j1703N873J2692l411j3215Q53J3270J688j2821
1019d758m121J1916O363j0600q371Q908J0013o941j1221M726J2037k392j2380
1032f821j6J2332K304j1765m534J0816O602r521q371P876R755n921j0827L849
1046d242J1474j622j1722n87J1506K739j0867m791R869O599q528q113O880R366
1060G961n063j0214L054J0706j020j0744j075J0425L075r743m878Q694O492p361
1074C09p871N814Q926m086r602K191R949k87r970j566R593L441q933n097P915
$$ plain form
980 6043 -8831 -7580 7398 8854 -5725 -9848 3899 10519 -1955 -10786 -50 10745 2010
993 2010 -10294 -3898 9505 5628 -8455 -7135 7052 8394 -5460 -9349 3680 9987 -1819
1006 -1819 -10238 -134 10148 2016 -9687 -3814 8878 5467 -7748 -6895 6375 8063 -4758
1019 -4758 -8879 3037 9400 -1200 -9571 -663 9350 2409 -8812 -4086 7951 5559 -6821
1032 -6821 -6837 5495 7799 -3966 -8500 2316 8918 -603 -8974 -1098 8657 2736 -8091 -4242
1046 -4242 7232 5610 -6112 -6699 4807 7546 -3321 -8112 1757 8356 -172 -8285 -1405 7961
1060 7961 2898 -7316 -4262 6444 5424 -5320 -6395 4030 7105 -2638 -7516 1178 7670 309
1074 309 -7562 -1748 7178 3092 -6510 -4319 5630 5343 -4627 -6193 3400 6841 -2092 -7189 726
1089G26O579o677p767N139Q764l542r352J774R649L7r610j812R196L560q468n162
1105f966P425O577o123p677M547Q535k879r004J073R129P12q908k468Q364M046
1120F383p490n423O345O626n031p548L557Q192j994q465L36Q497J234q188k762
1135e731P595M218o801n458N731O498m500p292L120P858j617q165J01Q146J433
1150E136p853k922P310M255o471n489N446O472m212p218K789P782j346p981j61
1165d463P872J735p559l152O874M495n994n615M848O578l597p208K195P581p11
1180C879p715p76P554K202p102l527O344M791n432n801M340O563l057p140J682
1195c195P466l12p476j075P220K459o759l727O053M868n115n830M046O512k752
$$ plain form
1089 726 7305 628 -7139 -2000 6764 3222 -6130 -4356 5293 5330 -4280 -6092 3104 6664 -1804 -6966
1105 -6966 459 7036 913 -6764 -2217 6318 3439 -5565 -4492 4637 5349 -3559 -6027 2337 6383
1120 6383 -1107 -6530 -185 6441 1410 -6138 -2581 5611 3617 -4848 -4512 3985 5219 -2969 -5731
1135 -5731 1864 6082 -719 -6177 -446 6052 1552 -5740 -2620 5238 3621 -4544 -4443 3703 5136
1150 5136 -2717 -5639 1671 5926 -545 -6034 -588 5884 1672 -5546 -2757 5025 3679 -4302 -4463
1165 -4463 3409 5144 -2415 -5567 1307 5802 -192 -5807 -959 5619 2022 -5186 -2991 4590 3879
1180 3879 -3836 -4612 2942 5144 -1958 -5485 859 5650 218 -5583 -1243 5320 2263 -4877 -3195
1195 -3195 4271 3959 -3517 -4592 2628 5087 -1672 -5399 654 5522 407 -5423 -1377 5135 2383
1210B383p033J394P266L1p301j362O976K736o469l935N673N017m675n913L536
1225a676O571k264p023R26P213M35p115j776O737L071o108m299N353N246m299
1240I92o121L155O738j906p056N09P223Q08p055k132O647L370n999m508N104N524
1256E293m060o295K910O794j575p122K26P141J138o911k467O403L757n693m844
1271e305M769N702l591o440K311O913r93p073l51O949J747o648k987O037M145
1286E185n247n143M300N927l200o531K003O893o96p042n99O916J893o562l135
1301e038O035M218n229n245M288O064l154o660J901P037n86p149p75P006K125
1316D838o622l406N982M558n122n529M015O346k836o871J483P191j22p187j261
$$ plain form
1210 2383 -4650 -3256 4010 4041 -3260 -4622 2354 5090 -1379 -5314 359 5376 701 -5212 -1676
1225 -1676 4895 2631 -4392 -3466 3747 4182 -2933 -4709 2028 5099 -1009 -5308 45 5291 992
1240 992 -5129 -1974 4764 2858 -4198 -3689 3534 4342 -2713 -4845 1802 5172 -827 -5335 -231 5293
1256 5293 1233 -5062 -2152 4642 3067 -4055 -3829 3312 4450 -2461 -4928 1475 5232 -461 -5305
1271 -5305 -536 5166 1575 -4865 -2554 4359 3366 -3707 -4058 2891 4638 -2010 -4997 1040 5185
1286 5185 -62 -5205 -905 5022 1822 -4709 -2706 4187 3491 -3551 -4150 2766 4659 -1903 -5038
1301 -5038 997 5215 -14 -5259 -971 5093 1939 -4721 -2820 4217 3631 -3518 -4293 2713 4838
1316 4838 -1784 -5190 792 5350 228 -5301 -1286 5060 2224 -4647 -3164 4027 3905 -3282 -4543
1331d543O946K607o467l835N747M937m839n831L700O549k459o997J114P232K26
1346D087p226j543O919K866o425m012N662N087m727n986L662O611k400p058J075
1361c408P294K22p235j581O926K935o456m080N670N129m692o036L573O715k291
1376B685p177R69P333M71p291j833O948L150o374m329N557N356m551o261L424
1391a923O925k120p328P46P461O79p376k026O999L325o368m549N530N597m527
1406A045o404L301P052k042p407O43P524P85p424k128P035L434o397m617N514
1421h6N657m444o495L232P106j923p452N36P507R15p354k266O947L523o252m729
1437e578N395N733m302o577L092P134j761p430L26P542J057p354k418O886L749
$$ plain form
1331 -4543 2403 5010 -1457 -5292 455 5392 553 -5278 -1578 4971 2512 -4485 -3371 3861 4087
1346 4087 -3139 -4682 2237 5103 -1322 -5334 328 5415 688 -5298 -1636 4975 2575 -4483 -3408
1361 -3408 3886 4108 -3127 -4708 2218 5153 -1303 -5383 287 5416 724 -5312 -1739 4976 2685
1376 2685 -4492 -3523 3810 4281 -3010 -4843 2105 5255 -1119 -5448 109 5465 914 -5347 -1923
1391 -1923 5002 2882 -4446 -3700 3761 4440 -2936 -4962 2037 5362 -1006 -5555 -25 5572 1045
1406 1045 -5359 -2058 4994 2952 -4455 -3812 3712 4497 -2927 -5055 1980 5414 -983 -5600 -86
1421 -86 5571 1127 -5368 -2136 4970 3047 -4405 -3869 3638 4553 -2801 -5067 1880 5403 -849 -5578
1437 -5578 -183 5550 1248 -5329 -2237 4897 3136 -4294 -3968 3574 4631 -2723 -5141 1745 5494
1452E494o266m878N353N877m263o660L004P254j689p559K93P618J168p477k502
1467e233O982L779o196n021N312N982m170o779K910P354j557p605J07P592J349
1482D806p401k690O854M003o108n132N132O105l992o847K724P324j324p606p4
1497d226P584J487p319k836O805M045o019n146N087O074l964o814K680P353j365
1512C426p589m0P611J433p361k755O803M069o103n144N113O127m007o867K733
1527b551P377j393p614m8P612J477p312k850O747M168n999n288M997O217l805
1542A735o980K519P437j132p631k84P555J719p203l159O707M350n880n422M880
1557g89O293l718o982K467P392j079p617k88P543J711p237l025O672M243n897
$$ plain form
1452 5494 -772 -5650 -297 5580 1317 -5343 -2339 4915 3226 -4333 -4040 3578 4746 -2731 -5233
1467 -5233 1749 5528 -668 -5689 -377 5605 1435 -5344 -2434 4920 3363 -4242 -4135 3457 4806
1482 4806 -2595 -5285 1569 5572 -536 -5668 -536 5569 1577 -5270 -2546 4778 3454 -4152 -4226
1497 -4226 3358 4845 -2474 -5310 1495 5540 -479 -5625 -538 5536 1572 -5242 -2562 4791 3426
1512 3426 -4163 -4203 3408 4841 -2520 -5275 1528 5597 -506 -5650 -537 5590 1583 -5284 -2551
1527 -2551 4826 3433 -4181 -4229 3383 4860 -2452 -5302 1445 5613 -386 -5674 -677 5540 1735
1542 1735 -5245 -2726 4711 3579 -4052 -4336 3219 4938 -2265 -5424 1283 5633 -247 -5669 -789
1557 -789 5504 1786 -5196 -2729 4663 3584 -4033 -4321 3222 4933 -2304 -5329 1343 5586 -311
1572c11n324M929O212l779o912K512P352j153p554k34P463J646p163k971O610
1587A323M196n840n252M838O184l711o838K406P287j053p489l26P442J672p107
1602b268k988O555M220n786n288M817O171l687o870K442P320j091p538k59P446
1617C196J641p149k969O636M176n878n243M892O145l735o854K469P280j077p483
1632c953k81P405J651p098k952O517M151n706n237M758O079l600o745K356P193
1647D538j081p337k49P234J608o955k848O413M011n689n039M731N936l693o549
1662d969K477P025j226p229j11P217J422o930k707O428L913n738m932M827N788
1677E255l742o496K534O972j245p199r5P180J407o881k708O392L896n643m939
$$ plain form
1572 -311 -5635 -706 5506 1727 -5185 -2673 4679 3526 -4028 -4262 3201 4847 -2316 -5287 1323
1587 1323 5519 -321 -5573 -735 5449 1738 -5100 -2694 4593 3540 -3949 -4275 3167 4839 -2268
1602 -2268 -5256 1299 5519 -267 -5555 -738 5433 1746 -5124 -2682 4638 3547 -3991 -4250 3196
1617 3196 4837 -2312 -5281 1355 5531 -347 -5590 -698 5447 1712 -5142 -2673 4607 3530 -3953
1632 -3953 -4234 3171 4822 -2276 -5228 1289 5440 -266 -5503 -745 5334 1734 -5011 -2655 4538
1647 4538 3457 -3880 -4129 3105 4713 -2242 -5090 1323 5334 -355 -5394 -663 5273 1580 -4969
1662 -4969 -2492 4533 3307 -3922 -4033 3184 4606 -2324 -5031 1397 5310 -428 -5360 -533 5255
1677 5255 1513 -4983 -2449 4523 3278 -3921 -4016 3164 4571 -2310 -5018 1374 5270 -373 -5312
1692e312M700N816l601o511K393O956j113p136j84P020J566o797k773O241L929
1707E194n502m950M630N763l572o432K436O813j147p036j36O998J398o717k619
1722d879O216L805n571m743M636N579l581o256K461O689j262o892J3O877J294
1737D386o681k484O190L620n495m632M633N473l640o128K482O597j283o809JO838
1753C068J241o600k432O110L595n460m593M596N440l600o092K485O496j259o718
1768c723K1O748J210o520k383O041L514n410m493M624N279l610n975K512O423
1783D258j325o644J02O648J115o451k230N979L311n332m308M553N102l550n817
1798d589K515O228j330o482J75O505R79o271k162N888L242n287m222M511N062
$$ plain form
1692 -5312 -612 5204 1603 -4908 -2515 4441 3328 -3808 -3992 3028 4594 -2203 -4976 1265 5194
1707 5194 -308 -5258 -628 5135 1563 -4869 -2433 4380 3233 -3803 -3939 3059 4457 -2260 -4879
1722 -4879 1337 5142 -429 -5172 -536 5043 1462 -4794 -2333 4356 3094 -3798 -3785 3092 4386
1737 4386 -2295 -4779 1411 5031 -464 -5096 -463 5010 1370 -4758 -2276 4321 3038 -3771 -3770 3068
1753 3068 4309 -2291 -4723 1387 4982 -478 -5071 -475 4965 1365 -4727 -2242 4254 2995 -3723
1768 -3723 -3702 3046 4256 -2264 -4647 1394 4908 -502 -4995 -371 4908 1298 -4677 -2165 4258
1783 4258 2933 -3711 -3609 3039 4154 -2297 -4527 1452 4763 -569 -4877 -324 4778 1228 -4589
1798 -4589 -2074 4154 2824 -3658 -3483 3022 4001 -2270 -4432 1456 4698 -589 -4811 -300 4762
1813D762l629n669K569O122j428o426L42O397Q77o272k000N899L105n359m035
1828d745M593M875l725n539K722O032j620o310M48O394P06o236j857N889K916
1843D543n353l881M643M691l727n375K715N860j650o138N25O228O30o128j740
1858d157N796K784n250l739M563M581l731n256K769N724j702o053N96O157N40
1873C622o032j622N737K624n238l585M580M411l777n074K804N610j770n951P27
1888b934O011M29n957j505N670K546n214l493M580M309l788m976K872N486j854
1903B182n828Q32N944K73n897j359N613K374n184l295M549M166l830m811K946
1918a325N320j944n706R37N835J43n806j176N562K182n127l141M550L960l832
$$ plain form
1813 4762 1133 -4536 -1967 4155 2727 -3699 -3357 3040 3917 -2355 -4355 1544 4649 -710 -4745
1828 -4745 -152 4723 998 -4541 -1819 4213 2593 -3717 -3269 3125 3831 -2405 -4262 1627 4543
1843 4543 -810 -4691 -48 4643 916 -4459 -1744 4116 2466 -3672 -3147 3081 3711 -2417 -4157
1858 -4157 1639 4423 -827 -4566 -3 4578 847 -4409 -1640 4084 2382 -3671 -3075 3082 3622
1873 3622 -2410 -4032 1705 4329 -909 -4494 86 4497 720 -4354 -1550 4060 2290 -3661 -2934
1888 -2934 3077 3506 -2451 -3956 1714 4260 -954 -4447 133 4442 654 -4322 -1450 4036 2182
1903 2182 -3646 -2814 3130 3403 -2494 -3853 1760 4134 -1050 -4345 204 4370 540 -4271 -1325
1918 -1325 3995 2051 -3655 -2718 3117 3260 -2546 -3722 1840 4022 -1105 -4246 304 4264 432
1933D32m632K977N169k041n513J024N706on642j057N432K054n048k989M544L754
1949D164l801m458K993M996k109n322J095N517p6n554q94N316J885m965k754M437
1965D70L577l800m295L070M769k161n172J238N377k40n410p23N276J665m938k576
1981c873M425L432l804m116L056M635k161n067J271N220k50n311o74N157J608
1996C548m815k511M360L269l727l945L000M474k140m875J274N019k82n098o30
2011c079M967J509m642k385M215L126l609l799K953M282k147m688J320M854m06
2026B471m912m78M817J371m574k190M207K886l655l522K969M093k284m454J469
2041a786M708o18m807k52M786J084m580j924M225K662l699l359L104L908k381
$$ plain form
1933 432 -4200 -1223 3946 1905 -3608 -2584 3122 3116 -2526 -3583 1849 3903 -1145 -4134 410 4164
1949 4164 363 -4095 -1102 3894 1785 -3537 -2442 3075 2999 -2555 -3449 1867 3752 -1213 -3967 470
1965 470 4047 247 -4048 -978 3791 1630 -3542 -2304 3073 2833 -2577 -3300 1976 3641 -1297 -3873
1981 -3873 552 3984 180 -3936 -880 3755 1594 -3473 -2202 3018 2768 -2543 -3217 1940 3548
1996 3548 -1267 -3778 582 3851 124 -3821 -821 3653 1513 -3362 -2088 2931 2649 -2449 -3079
2011 -3079 1888 3397 -1245 -3630 585 3711 102 -3697 -744 3538 1391 -3297 -1977 2877 2471
2026 2471 -2441 -2919 1898 3269 -1305 -3495 712 3598 -57 -3579 -610 3483 1199 -3255 -1786
2041 -1786 2922 2304 -2503 -2755 2031 3115 -1465 -3389 836 3498 -201 -3560 -456 3452 1071
2056A071m333J592M575p32m713j08M690R47m450j812M161K509l671l166L114L701
2072C375k420m127J661M416q65m562K7M559P77m403j544M106K256l676k904L145
2088a79L466k511l913J813M206j053m368K55M422N29m303j328M077K040l685k688
2104c220L172L264k594l694J866M053j139m245L79M299M05m243j155M030J882
2119C060l670k537L215L080k643l550K015L898j310m132N65M209K12m173r83L997
2135A253J697l685k338L251K936k724l432K107L800j436m006O76M125R6m094q46
2151b620L923J549l620k191L199K785k746l226K118L607j431l872P37L979j7l943
2167a769p04L790J409l573k017L170K590k685l051K088L454j483l694P81L856
$$ plain form
2056 1071 -3262 -1670 2905 2173 -2540 -2648 2042 2989 -1461 -3273 888 3397 -274 -3440 -326 3375
2072 3375 955 -3172 -1511 2905 2040 -2522 -2495 2064 2841 -1562 -3106 1000 3256 -420 -3324 -179
2088 -179 3287 776 -3137 -1324 2882 1829 -2539 -2284 2138 2667 -1636 -2964 1113 3153 -532 -3220
2104 -3220 -48 3216 622 -3072 -1206 2847 1708 -2537 -2158 2141 2546 -1697 -2852 1178 3060
2119 3060 -610 -3147 68 3148 505 -3045 -1030 2868 1558 -2574 -2009 2200 2412 -1761 -2744 1253
2135 1253 2950 -735 -3073 178 3114 390 -3042 -935 2865 1429 -2577 -1901 2224 2320 -1774 -2620
2151 -2620 1303 2852 -768 -2959 240 3025 279 -2947 -829 2778 1347 -2525 -1788 2191 2174 -1769
2167 -1769 -2473 1317 2726 -847 -2864 306 2896 211 -2840 -752 2702 1219 -2475 -1694 2162
2182B162r8l867n99L764J257l518j883L179K450k727k948K200L312j571l566Q81
2198a572L770k22l783m62L649J131l451j763L141K341k711k827K179L212j571
2213A061l485R47L593k52l672l79L582J035l406j629L076K183k666k666K203L069
2229B594j635l356J018L509l75l552k74L511Q78l358j461L071K014k689k496K239
2245c62K899j735l173J105L409n23l457j24L424P42l301j315L055J863k718k327
2261b538K259K782j810l024J200L246o02l386PL373O14l251j194L020J736k688
2277b56k212K267K616j794k916J234L170o82l266J00L284N13l209j055K938J622
2293B354k676k057K281K469j833k800J341L009p67l160J79L200L55l082r27K908
$$ plain form
2182 2162 2064 -1803 -2402 1362 2619 -899 -2782 397 2847 120 -2828 -628 2684 1113 -2453 -1572
2198 -1572 2198 1976 -1807 -2269 1380 2511 -940 -2703 438 2779 68 -2759 -580 2632 1061
2213 1061 -2424 -1477 2116 1864 -1808 -2187 1395 2430 -976 -2605 471 2654 -12 -2678 -475 2594
2229 2594 959 -2397 -1379 2130 1755 -1797 -2071 1440 2318 -1040 -2501 570 2584 -105 -2601 -362
2245 -362 2537 802 -2371 -1266 2143 1620 -1837 -1961 1463 2205 -1096 -2411 644 2507 -211 -2538
2261 -2538 -279 2503 693 -2331 -1131 2115 1513 -1873 -1866 1507 2121 -1130 -2324 696 2432 -256
2277 -256 -2468 -201 2415 621 -2295 -1061 2109 1427 -1839 -1739 1545 2058 -1151 -2206 732 2354
2293 2354 -322 -2379 -98 2371 538 -2262 -921 2088 1321 -1839 -1660 1540 1895 -1187 -2114 794
2309G94J459k642j935K298K324j853k672J380K873q28l029K88L077K54l007q16
2325b035K866J340k624j787K331K160j882k537J445K789r66k931M02L017J27k980
2341a265o53K829J179k630j629K301K087j957k410J532K655j021k863N13K911
2356A579M1k902n88K839J047k591j527K272J970j915k321J505K552r97k746N05
2372a277K842j5k833m84K731R53k499j455K269J849j968k161J567K449j123k632
2388a787O24K735j47k748l60K702Q27k529j255K254J694j964k033J601K306j167
2404G53k533P17K652k62k668k20K618O97k476j169K302J531j966j932J608K238
2420A890j203k424P76K534l01k603j68K558O32k428j071K218J451j918j831J614
$$ plain form
2309 794 2253 -389 -2324 -26 2298 445 -2227 -847 2026 1198 -1831 -1543 1534 1788 -1219 -2035
2325 -2035 831 2171 -453 -2240 91 2251 369 -2168 -723 2066 1100 -1831 -1429 1588 1715 -1265
2341 -1265 -1918 911 2090 -540 -2169 132 2219 262 -2148 -616 2039 1018 -1845 -1332 1579
2356 1579 1620 -1282 -1870 969 2016 -575 -2102 170 2140 225 -2096 -591 1961 964 -1782 -1277
2372 -1277 1565 1550 -1283 -1767 964 1917 -582 -2037 232 2081 113 -2048 -481 1968 845 -1787
2388 -1787 -1163 1572 1425 -1323 -1683 1019 1846 -683 -1938 316 2010 46 -1987 -386 1920 753
2404 753 -1780 -1063 1589 1327 -1341 -1561 1057 1754 -722 -1891 411 1942 -24 -1956 -348 1890
2420 1890 687 -1737 -961 1573 1272 -1331 -1499 1059 1691 -737 -1808 410 1861 -57 -1888 -274
2436b74K112j240k306Q21K448l97k499o9K484N25k384r50K203J312j940j684J653
2453a85J981j328k172R18K338m83k423M8K404M08k343q09K184J188j949j528J679
2470g2J803j322k089R80K254n51k360J32K360L04k327o97K185J080j997j420J714
2487b3J734j407j929J031K134o63k256K32K338J40k279n44K127R75j969j322J773
2504I2J625j487j860J108K078p51k186L24K282N1k251m77K178Q25j980j189J787
2521A69J489j525j752J170J978p96k154M49K188m4k174l87K144P47k014j059J794
2538B23J412j570j655J227J892q86k071N37K147j34k174k56K139O24j998j004
2554a547J848J286j579j628J334J804r69j989O21K107k31k161j50K101N54k001
$$ plain form
2436 -274 1838 598 -1708 -887 1561 1164 -1335 -1404 1080 1605 -779 -1729 474 1786 -154 -1838 -185
2453 -185 1796 468 -1704 -786 1552 1069 -1354 -1306 1098 1506 -837 -1646 538 1726 -223 -1751 -72
2470 -72 1731 409 -1680 -700 1554 1003 -1357 -1225 1135 1439 -888 -1585 600 1680 -317 -1737 -23
2487 -23 1711 304 -1625 -594 1540 877 -1379 -1147 1191 1331 -948 -1492 635 1610 -359 -1681 92
2504 92 1717 230 -1630 -522 1556 805 -1381 -1057 1225 1276 -975 -1452 726 1551 -429 -1618 169
2521 169 1658 133 -1619 -449 1529 733 -1421 -972 1216 1172 -1002 -1389 755 1502 -512 -1571 223
2538 223 1635 65 -1590 -363 1529 643 -1428 -891 1256 1122 -1052 -1308 831 1455 -543 -1547
2554 -1547 301 1587 8 -1620 -286 1518 549 -1440 -819 1288 1057 -1104 -1254 847 1401 -600
2570f00r04J841J232j598j534J332J774j008j961O63K027k69k087r2K088M45j988
2587f39q30J833J183j654j438J391J631j014j886P27J973l81j998m0K048L83j972
2604f83p16J849J032j628j333J359J592j106j769P70J918m01k020N9K009L19j948
2621f97o67J810J000j653j279J416J546j130j739P74J926m94j929J07J962K62
2637A215j970n58J800R41j679j176J437J423j168j665Q62J802n05j893J53J925
2653I44J89j908m93J798Q66j676j150J473J389j217j602R29J766o25j857K74J881
2670I81J03j866m31J802P29j642j054J441J347j230j539R39J727o47j815L14J854
2687A013K2j847l55J780O81j657r96J500J208j241j462J004J629o84j773L82J820
$$ plain form
2570 -600 -1504 337 1569 -29 -1563 -231 1543 535 -1426 -763 1264 995 -1092 -1184 904 1349 -639
2587 -639 -1469 364 1547 -107 -1545 -154 1477 463 -1423 -696 1277 896 -1102 -1142 906 1289 -683
2604 -683 -1399 450 1482 -146 -1479 -120 1472 366 -1403 -633 1285 884 -1136 -1077 932 1251 -697
2621 -697 -1364 446 1446 -207 -1486 -70 1476 346 -1393 -619 1307 813 -1116 -1009 953 1215
2637 1215 -755 -1313 487 1428 -251 -1427 10 1433 265 -1400 -538 1264 759 -1134 -981 944
2653 944 1133 -775 -1268 530 1396 -280 -1430 43 1432 215 -1387 -458 1308 683 -1174 -900 981
2670 981 1084 -782 -1213 589 1318 -324 -1378 63 1410 180 -1359 -420 1307 660 -1155 -841 1013
2687 1013 1035 -812 -1167 613 1294 -363 -1359 141 1349 108 -1354 -350 1279 595 -1178 -796 1024
2704A024m0j813k93J773O15j705q74J511J145j291j380J049J559p47j714M47J796
2721A062j66j774j62J742M73j669p63J511J037j307j283J089J509q60j619N38
2737f42J680j82j767r0J722M20j655o98J533R44j326j261J183J408q97j555N94
2754e89J671l00j707j6J703L17j641o09J559Q47j374j142J210J323r56j485O86
2771e03J578l65j692R9J696K11j665m78J564P46j393j008J212J223j001j439P96
2788d19J534m68j652K13J643J29j657l93J547O79j428r15J243J145j052j335Q08
2805c78J484n44j597K85J647K1j628l18J532O21j465q43J328J052j118j279R05
2822b95J418o14j542L59J559l9j597k19J563M70j446p60J328R80j131j203R18
$$ plain form
2704 1024 984 -829 -1122 651 1266 -439 -1313 198 1343 52 -1328 -279 1280 533 -1181 -734 1062
2721 1062 896 -878 -1040 702 1175 -494 -1257 254 1291 -16 -1299 -210 1299 439 -1180 -642
2737 -642 1038 856 -911 -1001 721 1141 -514 -1212 321 1265 -61 -1322 -139 1269 372 -1183 -589
2754 -589 1082 782 -925 -941 762 1079 -562 -1171 388 1235 -139 -1281 -71 1252 296 -1189 -503
2771 -503 1075 710 -982 -883 813 1024 -641 -1119 445 1191 -202 -1210 2 1225 224 -1215 -419
2788 -419 1115 647 -1005 -792 851 980 -677 -1070 477 1156 -272 -1187 56 1201 149 -1186 -378
2805 -378 1106 562 -1035 -750 897 918 -710 -1028 504 1125 -340 -1183 145 1197 79 -1200 -295
2822 -295 1123 509 -1033 -674 885 846 -751 -970 593 1063 -383 -1143 185 1165 34 -1169 -251
2839b51J397o94j504M23J602j86j573j29J536M14j470o65J355R05j190j144R85
2856a89J308p47j425M88J523k14j568l4J527L25j480n82J389P83j210j032J034
2873a04J213q06j344N54J448k89j541Q2J502K34j468n18J373P91j255r89J032
2890h5J188q17j337O11J434l79j505J07J509J85j497m40J432P00j312r23J145
2907A6J080r10j286P36J374m54j465J94J521N2j491l39J392O29j310q42J148J069
2925A114r61j249P69J351m85j466K31J495M6j482l20J433N70j355p95J192J016
2942A104j021j178P84J338n44j424L07J467o9j455k34J444M85j340p42J218R60
2959A100j058j125Q12J312o05j413L60J462q9j446j86J399M71j373o59J207R07
$$ plain form
2839 -251 1146 452 -1052 -629 973 787 -786 -915 621 1035 -435 -1100 255 1160 -30 -1174 -189
2856 -189 1119 372 -1053 -565 958 744 -824 -858 669 994 -486 -1068 321 1104 -106 -1138 -104
2873 -104 1109 303 -1041 -487 961 672 -869 -787 715 949 -519 -1037 336 1127 -128 -1117 -85
2890 -85 1103 286 -1051 -440 994 615 -890 -783 726 911 -586 -1026 406 1106 -206 -1129 16
2907 16 1096 186 -1100 -364 1010 556 -909 -715 806 858 -633 -972 420 1049 -261 -1103 45 1114
2925 1114 153 -1096 -327 1024 539 -927 -696 799 845 -637 -957 476 1046 -309 -1104 88 1104
2942 1104 83 -1095 -311 1027 483 -941 -634 833 764 -691 -925 519 1004 -336 -1078 140 1100
2959 1100 42 -1083 -271 1041 436 -977 -617 845 756 -690 -876 523 994 -379 -1038 169 1076
2976A076j042j105Q52J270o28j384L92J430j01j477j49J439M10j376o54J237Q53
2993A043j047j076Q91J237o70j335L91J428j16j484j17J460L51j364o22J252Q58
3010A080j122j030R14J194o92j326M53J394j72j467j4J412L10j363n47J233P73
3027A030j101r90R28J131o76j288M85J347k07j427l8J423K78j343n36J250P71
3044A037j118r61R18J158p59j264N27J344k59j393j1J404K33j295m89J207P65
3061A044j158r39R77J066p52j195N16J323l35j340N4J360K33j357m15J222O94
3078I98j159q36R29J087p83j201N50J311l27j325M7J360J67j304m29J260O31j113
3096a37q68R81J014q07j133N88J242l61j309J14J357J15j312l74J250N87j135
$$ plain form
2976 1076 34 -1071 -219 1051 423 -961 -569 861 760 -717 -866 573 983 -393 -1047 190 1043
2993 1043 -4 -1080 -189 1048 378 -957 -566 862 746 -738 -855 605 956 -408 -1030 222 1080
3010 1080 -42 -1072 -158 1036 344 -982 -529 865 693 -774 -788 624 934 -429 -976 257 1030
3027 1030 -71 -1061 -133 998 322 -966 -481 866 659 -768 -806 617 895 -448 -984 266 1037
3044 1037 -81 -1042 -124 1034 275 -989 -462 882 623 -770 -781 623 856 -439 -928 279 1044
3061 1044 -114 -1053 -76 990 238 -957 -441 882 547 -793 -739 621 854 -503 -918 304 998
3078 998 -161 -997 -68 1019 236 -965 -415 896 569 -756 -709 651 818 -486 -915 345 976 -137
3096 -137 -1005 -24 990 183 -950 -362 880 519 -790 -676 681 796 -516 -890 360 947 -188
3113a88p71R83R57q44j110O40J245m38j257J69J301Q4j342k91J270M94j161o83
3131i42J007R15q86j075P16J182m84j254K52J288lj287k72J279M62j204o27J038
3149A05Q50q96j027P36J159n06j250K83J259l1j289j91J274L80j162o19J055Q36
3167I66r33r77P48J112n40j229K75J328j08j288j29J261L79j216n69J099P60r28
3185A1r33P60J076n99j174L77J226j20j276r2J259L02j192n46J132P04r46r18
3203i49P93J087o40j151M09J230j95j257k6J236K88j245m69J125O82r73r12Q52
3221a15J036o71j120M55J244k73j252NJ272J85j210m13J131O50j030q31Q74R62
3239H99o61j115M97J194k82j225J6J268J75j211l78J111O17j067p65R13R55p46
$$ plain form
3113 -188 -959 24 981 137 -973 -333 912 474 -783 -614 687 771 -571 -862 408 902 -259 -942
3131 -942 65 980 94 -981 -265 917 433 -821 -569 719 716 -571 -843 436 898 -306 -933 105
3149 105 955 59 -968 -232 927 421 -829 -546 713 682 -607 -798 476 856 -306 -925 130 966
3167 966 33 -944 -196 916 376 -853 -578 750 642 -646 -775 486 865 -351 -920 179 939 11
3185 11 -922 -162 914 315 -859 -482 744 624 -652 -744 515 817 -375 -921 211 915 -31 -949
3203 -949 -156 931 291 -860 -451 779 584 -673 -699 537 825 -420 -889 236 918 -55 -967 -115
3221 -115 921 250 -870 -415 829 556 -696 -691 581 766 -444 -857 274 924 -106 -937 -63 899
3239 899 238 -877 -380 814 532 -693 -677 591 766 -445 -823 288 905 -162 -927 -14 941 195
3257A95j088N56J149l09j218J18J193J34j213l08J116N50j032p22Q84Q87p46j015
3275h69N57J099l32j208J63J199Q6j187l28J152N40j080o66Q89Q67p88r74N90
3293b90J112l90j193K29J152M1j203k04J134M52j091o20R57P82p98r18O09J053
3311H14m21j148K68J150l8j165j71J101M49j108n89R65P49q11q87O57R80m46j100
3330g51K70J168r7j139j63J144L55j089n32R72P17q71q27O58R78m89j070L04J156
3349F94j28j170o6J155K71j109m49R82O66q79q04P28R47n81j020L58J132j78j155
3368f06m1J152K00j054m55J028N85q80p81P75R17o11j024M14J120k58j113M2J126
3387E36J79j098l84J030N41r12p26P62Q89o51r55M66J078k82j105M7J129J69j145
$$ plain form
3257 195 -893 -337 812 503 -715 -597 596 730 -483 -791 325 875 -157 -879 5 892 146 -869
3275 -869 -312 787 455 -753 -590 609 695 -492 -820 332 872 -208 -874 15 882 94 -880 -290
3293 -290 822 432 -761 -532 620 661 -542 -746 388 840 -251 -871 86 868 70 -848 -239 814
3311 814 393 -755 -487 663 625 -540 -711 390 839 -269 -858 107 856 45 -842 -185 795 349 -751
3330 -751 -481 687 590 -549 -712 432 787 -302 -834 138 855 -16 -843 -185 793 304 -766 -462 694
3349 694 566 -604 -670 485 756 -353 -802 180 846 -33 -837 -109 838 257 -763 -405 727 549 -606
3368 -606 -647 505 705 -349 -804 224 809 -71 -852 -77 840 229 -795 -381 739 481 -632 -590 536
3387 536 715 -383 -767 263 804 -108 -834 -72 817 166 -789 -323 755 473 -632 -585 544 713 -432
3406d32l25J069M98r71o73Q47Q01o51r60M85J070l44j067J13J108Q3j101k83J057
3425C24M93r90o83Q79Q42p30r40N38J016l57j105J80J143O0j161k33J120M13j005
3444a96o16Q88P62p59r18N91J054m47j095K38J129Qj165j64J078L73r93n85Q74
3463E7P99q21q71O34R86m55j077K69J125o3j102j90J123L69j057n41R68P01q37
3482A7q45O59R68m66j055K78J110j08j126r5J126K97j066m98R72O78q66q23O83
3501a60R86n47j042L23J118j28j122o7J109K74j088m43R90O15q40q17P24R59n52
3520B92j060L90J072j70j123m0J167K07j096m20R90O13q76q19Q16Q81o09r85M06
3539c64J103k24j130RJ126J50j078l63J001N74r18p36Q20Q55o54r90M70J082k80
$$ plain form
3406 -432 -757 312 810 -161 -834 13 814 163 -797 -312 758 414 -653 -540 568 651 -450 -733 324
3425 324 817 -173 -856 23 865 135 -805 -267 749 392 -713 -533 610 670 -491 -724 396 809 -196
3444 -196 -812 76 838 79 -839 -248 806 359 -736 -498 631 639 -526 -690 388 761 -232 -817 57
3463 57 856 35 -836 -202 784 329 -748 -479 646 583 -519 -709 414 783 -274 -815 153 854 17
3482 17 -828 -169 799 333 -722 -444 666 558 -568 -663 463 760 -306 -804 168 846 -20 -843 -160
3501 -160 826 279 -763 -440 678 550 -572 -639 470 744 -344 -787 203 818 -22 -839 -115 844 292
3520 292 -768 -378 694 524 -599 -639 528 735 -361 -781 209 822 -54 -873 -57 824 215 -770 -364
3539 -364 739 515 -615 -606 520 670 -408 -771 230 804 -114 -850 -30 825 171 -819 -349 733 453
3558D53j098L4J166J39j128l33J046N23r32p05Q28Q50o74r52M83J077l38j116
3576f77J17J170M8j122k75J073M87j016o40Q54Q29p17r70N65J028l68j121K10
3594e25J171j5j125k26J095L98r99o03R01P64p57r14O03J033m25j105K19J159
3612F49jj173j64J082L91j023o23R77P61q26q98O61J008m87j096K65J157o4j143
3631e47j44J134L36j059n69R99P13q68q38O78J005m93j127L05J171j11j186q0
3649f81J138L08j088n01R88P09q92q52P30J013n76j103L87J107j38j170n6J195
3667E18K34j116m79J050O73r35q49P80R98n94j092L83J158j60j212k8J195K16
3685G40j107m78J086O46r62q21Q02R65o11j090M42J160k19j206oJ205K22j175
$$ plain form
3558 453 -645 -611 555 694 -434 -767 279 802 -130 -835 -7 843 169 -783 -300 777 439 -677
3576 -677 -560 610 658 -464 -739 334 821 -195 -835 19 848 131 -839 -274 754 386 -735 -525
3594 -525 646 631 -494 -720 375 773 -226 -829 72 836 79 -835 -232 801 376 -729 -510 649
3612 649 648 -525 -689 393 784 -239 -862 115 876 50 -848 -187 821 334 -762 -497 660 596 -547
3631 -547 -691 443 779 -280 -849 150 863 -5 -843 -165 840 347 -780 -475 696 585 -601 -681
3649 -681 457 765 -323 -824 164 873 -19 -871 -141 872 296 -807 -420 687 549 -621 -677 518
3667 518 752 -364 -843 207 880 -55 -904 -124 874 280 -812 -429 729 569 -643 -671 524 740
3685 740 -367 -845 241 887 -75 -896 -94 871 260 -830 -388 772 553 -653 -659 546 768 -407
3703d07m23J084O31r67q29Q68R42o78j080M74J159k33j260Q0J169K25j207m18
3721h70J156N61r69q05Q81R58p12j075N06J169l02j214Q9J245J33j227l53J140
3739C11N65j047p72R38R24p77j033N58J145l35j237J53J274P4j261k97J166N61
3757I10j118p20R61R22q04j068N88J195m13j249J73J301N1j282k80J236M91j127
3775b33p22J022Q95q23j067O55J157m56j266K36J315J2j300k29J238M31j131p00
3793i66J062Q71q95j029P16J141m80j274K43J353p5j292j90J274M33j213o31J083
3811A31Q26r02j042P59J155n38j250L01J306p7j297j82J279M48j263o22J154Q07
3829I93r54j025P99J122n51j283L47J336j13j330j59J336L74j274n72J121Q19
$$ plain form
3703 -407 -830 254 885 -82 -911 -43 899 221 -859 -385 774 541 -719 -639 530 755 -452 -870
3721 -870 286 847 -122 -927 -46 912 200 -875 -369 800 498 -716 -627 618 751 -476 -829 311
3739 311 876 -171 -943 -5 919 142 -891 -333 812 477 -760 -607 667 741 -520 -817 349 910
3757 910 -208 -928 33 955 151 -917 -329 866 453 -796 -623 678 729 -553 -833 403 894 -233
3775 -233 -955 67 962 139 -928 -273 884 428 -838 -602 713 725 -575 -804 434 865 -266 -966
3793 -966 96 967 72 -957 -241 900 420 -854 -611 742 667 -625 -815 459 892 -321 -952 131
3811 131 957 55 -987 -228 927 389 -861 -560 746 669 -628 -810 469 917 -346 -968 186 993
3829 993 39 -986 -187 935 384 -899 -552 784 671 -659 -818 518 892 -382 -954 167 986
3846I86r97j006Q11J171n96j267L79J338j52j354j18J366L62j312n98J227P36
3863I76j001r79Q33J174o60j269M19J360j88j383o8J354L26j284n77J172Q09j045
3881c1j018R10J147o73j296M16J402j91j407k2J361K92j319n39J187Q08j122r39
3899a034R13J142p07j268M78J336k00j425l1J417K88j366n10J231P89j140r51
3916a038R24J153p52j268N09J386k82j422J2J426K39j359n14J263P70j182r31
3933a066J002J120p91j274N44J385l13j429N2J445K10j364n19J322P35j203r23
3950a067R94J131q05j297N78J395k97j467P3J453K36j458m76J366P18j225r28
3967a076J031J123q24j300O14J389l42j487R5J474K03j439m59J360O66j217r22
$$ plain form
3846 986 -11 -1017 -206 965 369 -898 -519 819 667 -687 -805 561 923 -389 -987 240 976
3863 976 -25 -1004 -171 1003 343 -926 -507 853 665 -718 -786 568 894 -390 -967 205 1014 -31
3881 -31 -1049 -139 1008 335 -961 -545 857 666 -741 -763 598 890 -429 -968 219 1027 -95 -1034
3899 -1034 -121 1021 314 -954 -476 860 660 -765 -796 621 909 -457 -967 264 1053 -87 -1038
3916 -1038 -114 1039 287 -981 -472 914 632 -790 -778 648 887 -472 -986 277 1047 -135 -1066
3933 -1066 -64 1056 265 -1009 -465 920 607 -822 -770 675 885 -479 -998 324 1059 -144 -1067
3950 -1067 -73 1058 253 -1044 -466 929 632 -835 -762 691 927 -531 -1007 359 1077 -148 -1076
3967 -1076 -45 1078 254 -1046 -432 957 615 -872 -777 697 900 -539 -998 362 1028 -189 -1111
3984a111J089J104q39j318O58J409l98j474J12J516J40j484m05J408O62j271r18
4001a120J150J081r22j256O74J413m20j495J49J504J32j505m04J416O73j276r36
4018a142J162J106r51j262O93J399m37j452J63J493J18j500m20J454O46j287q85
4035a102J129J085r27j266P09J400m52j489J61J543Q4j496l83J449O04j310q87
4052a148J188J093r63j288P26J398m73j458J94J553O3j556l31J470O05j347q54
4069a128J178J086r74j299Q08J384n19j494K14J571N5j540l12J438O15j374q59
4086a150J207J096j019j258P94J398n34j505K60J570J0j547l19J479O12j398q53
4103a157J253J052j039j268Q30J399n63j506L03J556j9j580k76J538N66j398q34
$$ plain form
3984 -1111 -22 1082 243 -1075 -417 992 594 -880 -768 748 888 -596 -1001 407 1069 -202 -1120
4001 -1120 30 1111 189 -1067 -393 1020 600 -895 -746 758 890 -615 -1019 397 1070 -206 -1142
4018 -1142 20 1126 175 -1087 -394 1005 568 -884 -721 772 890 -610 -1030 424 1070 -217 -1102
4035 -1102 27 1112 185 -1081 -372 1028 576 -913 -752 791 875 -621 -1004 445 1049 -261 -1148
4052 -1148 40 1133 170 -1118 -392 1006 533 -925 -731 822 885 -671 -1002 468 1073 -274 -1128
4069 -1128 50 1136 162 -1137 -329 1055 536 -958 -744 827 882 -658 -970 468 1083 -291 -1150
4086 -1150 57 1153 134 -1124 -330 1068 534 -971 -711 859 869 -678 -997 482 1094 -304 -1157
4103 -1157 96 1148 109 -1159 -329 1070 507 -999 -696 860 841 -739 -1015 523 1089 -309 -1143
4120a143J238J083j052j255Q05J397n52j498K82J563k3j541l01J509N88j433q24
4137a157J264J069j096j240Q43J403n81j507L06J564%j581l14J557N67j433q17
4154a153J261J059j082j235Q52J402n87j547L52J558k5j586k60J562N26j475p88
4171a166J316J039j135j209Q83J399o51j510L53J574l5j614k31J550N23j460p80
4188a154J318J005j120j257R26J401o44j533L92J613j04j609j95J552M91j476
4204c94p65J336J003j141j211R20J393o62j528L91J596j08j587j92J559M50j474
4221d14p07J323R50j109j249R58J378o84j489L82J596j11j623j64J573M80j510
4238d20p36J335J001j151j187R32J344o72j496M13J567j08j601j63J552M63j508
$$ plain form
4120 -1143 95 1178 126 -1129 -324 1073 521 -977 -695 868 845 -696 -997 512 1100 -333 -1157
4137 -1157 107 1176 80 -1160 -317 1086 505 -1002 -696 868 868 -713 -1027 530 1097 -336 -1153
4154 -1153 108 1167 85 -1150 -298 1104 517 -1030 -678 880 855 -731 -991 571 1097 -378 -1166
4171 -1166 150 1189 54 -1155 -272 1127 476 -1034 -681 893 858 -756 -987 563 1086 -374 -1154
4188 -1154 164 1169 49 -1208 -282 1119 475 -1058 -666 947 843 -766 -961 591 1082 -394
4204 -394 -1159 177 1180 39 -1172 -252 1141 479 -1049 -658 938 830 -757 -949 610 1060 -414
4221 -414 -1121 202 1152 43 -1206 -248 1130 446 -1043 -661 935 824 -799 -963 610 1090 -420
4238 -420 -1156 179 1180 29 -1158 -226 1118 446 -1050 -637 930 822 -779 -942 610 1073 -435
4255d35p07J369R75j226j170R55J412p52j498M56J555j39j628j46J633L58j464
4272d52o91J369R27j174j170R81J356p40j499M87J570j82j601j37J610M02j508
4289d52o97J392R40j199j179J006J338p30j505M92J552j81j594j05J559M03j503
4306d63o53J372R37j235j135R85J349p70j464M80J540j69j588j12J560M16j488
4323d38o98J368R24j164j179J022J319p44j481M68J547j89j582q1J588L26j479
4340d73o40J355R24j196j133R89J308p63j421M75J536j97j595p4J538L88j480
4357d59o57J355R03j170j145R80J326p50j454M91J516j98j571o9J565L54j475
4374d58o70J405Q64j182j137J031J284p92j402N05J501k07j575o2J558L35j473
$$ plain form
4255 -435 -1142 227 1202 -24 -1194 -239 1173 421 -1077 -621 934 795 -833 -979 654 1012 -452
4272 -452 -1143 226 1153 -21 -1191 -210 1146 406 -1093 -606 964 782 -819 -956 654 1056 -452
4289 -452 -1149 243 1183 -16 -1195 -189 1149 419 -1086 -594 958 777 -817 -922 637 1040 -463
4306 -463 -1116 256 1193 -42 -1177 -192 1157 387 -1077 -597 943 774 -814 -926 634 1050 -438
4323 -438 -1136 232 1156 -8 -1187 -165 1154 410 -1071 -603 944 755 -827 -908 680 1006 -473
4340 -473 -1113 242 1166 -30 -1163 -174 1134 371 -1050 -575 961 764 -831 -905 633 1021 -459
4357 -459 -1116 239 1142 -28 -1173 -193 1133 383 -1071 -580 936 738 -833 -902 663 1017 -458
4374 -458 -1128 277 1141 -41 -1178 -147 1137 345 -1057 -552 949 742 -833 -895 663 998 -475
4391d75o04J372Q72j235j117J036J271p92j400N19J508k31j571l4J554L13j488
4408e02n90J363Q54j189j085J008J266p92j410N43J509k75j535m3J542L30j475
4425d81o14J401Q26j249j045J046J240q17j377N71J457k71j542mJ577K47j480
4442e15n51J404P53j203j044J071J192q32j364O03J483l41j542L7J577K26j490
4459e36n18J381P72j257r88J068J160q03j341N89J456l24j512N5J488K44j462
4476e28m96J374P34j223r30R87J188q42j333O10J423l01j531P2J502K26j464m87
4494a019J353P67j236r63J048J140q30j334O22J410l38j442K5J489K12j434m75
4511a005J358P09j203r72J052J135q22j277O13J383l77j439P9J434K02j420m47
$$ plain form
4391 -475 -1079 293 1165 -70 -1187 -151 1120 328 -1072 -553 955 724 -847 -881 673 986 -502
4408 -502 -1092 271 1125 -64 -1149 -141 1125 333 -1077 -534 975 700 -835 -878 664 994 -481
4425 -481 -1095 306 1132 -117 -1162 -116 1124 307 -1070 -499 958 687 -855 -859 718 965 -515
4442 -515 -1066 338 1091 -112 -1156 -85 1107 275 -1089 -486 997 656 -886 -849 728 954 -536
4459 -536 -1054 327 1099 -158 -1146 -78 1082 279 -1062 -473 983 659 -853 -798 690 934 -528
4476 -528 -1024 350 1084 -139 -1069 -82 1106 264 -1069 -459 964 663 -868 -796 706 932 -532 -1019
4494 -1019 334 1101 -135 -1098 -50 1090 260 -1074 -452 958 620 -822 -797 692 904 -530 -1005
4511 -1005 353 1062 -141 -1113 -61 1074 252 -1025 -412 971 594 -845 -766 668 870 -550 -997
4528i97J379O77j235r40J072J121q43j282O12J404l82j441R6J447J96j421m53
4545i90J351O92j219r12J045J099q36j254O24J356l91j436J33J469J31j424m31
4562i93J369O39j235q71J059J088q84j229O75J334m05j395J35J400J60j402m25
$$ plain form
4528 -997 382 1059 -176 -1116 -44 1077 234 -1048 -436 968 586 -855 -759 688 884 -537 -990
4545 -990 361 1053 -166 -1078 -33 1066 230 -1024 -400 956 565 -871 -738 731 862 -562 -993
4562 -993 376 1015 -220 -1091 -32 1056 172 -1057 -382 952 547 -848 -713 687 847 -555 -980
$$ [...]
8191F4
##END NTUPLES=NMR FID
##END=
