##TITLE=1H_ES-aq-iPrOH-st
 
 8 sc, 
 14.1.2022
##JCAMPDX= 6.0         $$ Bruker NMR JCAMP-DX V2.0
##DATA TYPE= NMR FID
##DATA CLASS= NTUPLES
##ORIGIN= UXNMR, Bruker Analytische Messtechnik GmbH
##OWNER= root
$$ XWIN-NMR		Version 3.5
$$ Fri Jan 14 10:41:03 2022 Russian Standard Time (UT+4h)  she@DPX200
##.OBSERVE FREQUENCY= 200.131346
##.OBSERVE NUCLEUS= ^1H
##.DELAY= (6, 6)
##.ACQUISITION MODE= SIMULTANEOUS
##.ACQUISITION SCHEME= undefined
##.AVERAGES= 8
##.DIGITISER RES= 18
##SPECTROMETER/DATA SYSTEM= spect
##.PULSE SEQUENCE= zg30
##.SOLVENT NAME= D2O
##.SHIFT REFERENCE= (INTERNAL, D2O, 0, 15.7039)
##AUDIT TRAIL= $$ (NUMBER, WHEN, WHO, WHERE, WHAT)
$$ ##TITLE= Audit trail, XWIN-NMR		Version 3.5
$$ ##JCAMPDX= 5.01
$$ ##ORIGIN= Bruker BioSpin GmbH
$$ ##OWNER= she
$$ F:/spectra/data/she/nmr/H-F/1/audita.txt
$$ ##AUDIT TRAIL=  $$ (NUMBER, WHEN, WHO, WHERE, WHAT)
(   1,<2022-01-14 10:39:45.56 +0400>,<she>,<DPX200>,
      <created by zg, POWCHK disabled, PULCHK disabled
       configuration hash MD5:
       00 E9 B6 7A A2 85 ED C7 34 08 36 98 17 FE 4E 26
       data hash MD5: 16K
       CC 1B 18 80 CF A9 D3 31 53 D0 EB 2F F4 16 73 B4>)
$$ ##END=
$$ 
$$ hash MD5
$$ FB B4 E5 8B 4D 40 2E F1 DF 43 CB 1F 4D 98 73 10
##$RELAX= 
##$RELAX= 
##$RELAX= 
##$RELAX= 
##$RELAX= 
##$RELAX= 
$$ Bruker specific parameters
$$ --------------------------
##$DU= <F:/spectra>
##$EXPNO= 1
##$NAME= <H-F>
##$PROCNO= 1
##$TYPE= <nmr>
##$USER= <she>
##$AMP= (0..31)
100 100 100 100 100 100 100 100 100 100 100 100 100 100 100 100 100 100 
100 100 100 100 100 100 100 100 100 100 100 100 100 100 
##$AQSEQ= 0
##$AQ_mod= 1
##$AUNM= <au_zg>
##$AUTOPOS= <>
##$BF1= 200.13
##$BF2= 200.13
##$BF3= 200.13
##$BF4= 200.13
##$BF5= 200.13
##$BF6= 200.13
##$BF7= 200.13
##$BF8= 200.13
##$BYTORDA= 1
##$CFDGTYP= 0
##$CFRGTYP= 5
##$CHEMSTR= <none>
##$CNST= (0..31)
1 1 145 1 1 1 1 1 1 1 1 1 1 1 1 1 1 1 1 1 1 1 1 1 1 1 1 1 1 1 1 1 
##$CPDPRG= <>
##$CPDPRG1= <>
##$CPDPRG2= <>
##$CPDPRG3= <>
##$CPDPRG4= <mlev>
##$CPDPRG5= <mlev>
##$CPDPRG6= <mlev>
##$CPDPRG7= <mlev>
##$CPDPRG8= <mlev>
##$CPDPRGB= <>
##$CPDPRGT= <>
##$D= (0..31)
0 1.2 0 0 0 0 0 0 0 0.06 0 0.03 0 0 0 0 0.0002 0 0 0 0 0 0 0 0 0 0 0 0 
0 0 0 
##$DATE= 1642142385
##$DBL= (0..7)
120 120 120 120 120 120 120 120 
##$DBP= (0..7)
150 150 150 150 150 150 150 150 
##$DBP07= 0
##$DBPNAM0= <>
##$DBPNAM1= <>
##$DBPNAM2= <>
##$DBPNAM3= <>
##$DBPNAM4= <>
##$DBPNAM5= <>
##$DBPNAM6= <>
##$DBPNAM7= <>
##$DBPOAL= (0..7)
0.5 0.5 0.5 0.5 0.5 0.5 0.5 0.5 
##$DBPOFFS= (0..7)
0 0 0 0 0 0 0 0 
##$DE= 6
##$DECBNUC= <off>
##$DECIM= 32
##$DECNUC= <off>
##$DECSTAT= 4
##$DIGMOD= 1
##$DIGTYP= 9
##$DL= (0..7)
0 120 120 120 120 120 120 120 
##$DP= (0..7)
150 150 150 150 150 150 150 150 
##$DP07= 0
##$DPNAME0= <>
##$DPNAME1= <>
##$DPNAME2= <>
##$DPNAME3= <>
##$DPNAME4= <>
##$DPNAME5= <>
##$DPNAME6= <>
##$DPNAME7= <>
##$DPOAL= (0..7)
0.5 0.5 0.5 0.5 0.5 0.5 0.5 0.5 
##$DPOFFS= (0..7)
0 0 0 0 0 0 0 0 
##$DQDMODE= 0
##$DR= 18
##$DS= 0
##$DSLIST= <SSSSSSSSSSSSSSS>
$$ [...]
##$SUBNAM2= <"">
##$SUBNAM3= <"">
##$SUBNAM4= <"">
##$SUBNAM5= <"">
##$SUBNAM6= <"">
##$SUBNAM7= <"">
##$SUBNAM8= <"">
##$SUBNAM9= <"">
##$SW= 18.0517287032376
##$SWIBOX= (0..15)
0 0 2 0 0 0 0 0 0 0 0 0 0 0 0 0 
##$SW_h= 3612.71676300578
##$TD= 16384
##$TD0= 1
##$TE= 0
##$TE2= 300
##$TE3= 300
##$TEG= 300
##$TL= (0..7)
0 120 120 120 120 120 120 120 
##$TP= (0..7)
150 150 150 150 150 150 150 150 
##$TP07= 0
##$TPNAME0= <>
##$TPNAME1= <>
##$TPNAME2= <>
##$TPNAME3= <>
##$TPNAME4= <>
##$TPNAME5= <>
##$TPNAME6= <>
##$TPNAME7= <>
##$TPOAL= (0..7)
0.5 0.5 0.5 0.5 0.5 0.5 0.5 0.5 
##$TPOFFS= (0..7)
0 0 0 0 0 0 0 0 
##$TUNHIN= 0
##$TUNHOUT= 0
##$TUNXOUT= 0
##$USERA1= <user>
##$USERA2= <user>
##$USERA3= <user>
##$USERA4= <user>
##$USERA5= <user>
##$V9= 5
##$VALIST= <valist>
##$VCLIST= <CCCCCCCCCCCCCCC>
##$VD= 0
##$VDLIST= <DDDDDDDDDDDDDDD>
##$VPLIST= <PPPPPPPPPPPPPPP>
##$VTLIST= <TTTTTTTTTTTTTTT>
##$WBST= 1024
##$WBSW= 4
##$XGAIN= (0..3)
0 0 0 0 
##$XL= 0
##$YL= 0
##$YMAX_a= 243308
##$YMIN_a= -327657
##$ZGOPTNS= <>
##$ZL1= 120
##$ZL2= 120
##$ZL3= 120
##$ZL4= 120
##$ABSF1= 10
##$ABSF2= 0
##$ABSG= 5
##$ABSL= 3
##$ALPHA= 0
##$AQORDER= 0
##$ASSFAC= 0
##$ASSFACI= 0
##$ASSFACX= 0
##$ASSWID= 0
##$AUNMP= <proc_1d>
##$AZFE= 0.1
##$AZFW= 0.1
##$BCFW= 1
##$BC_mod= 2
##$BYTORDP= 1
##$COROFFS= 0
##$CY= 11.3945322036743
##$DATMOD= 1
##$DC= 2
##$DFILT= <>
##$DTYPP= 0
##$F1P= 2.36226072786647
##$F2P= -0.459571619588291
##$FCOR= 0.5
##$FTSIZE= 0
##$FT_mod= 4
##$GAMMA= 1
##$GB= 0.15
##$INTBC= 1
##$INTSCL= 1
##$ISEN= 128
##$LB= 0.24
##$LEV0= 0
##$LPBIN= 0
##$MAXI= 10000
##$MC2= 0
##$MEAN= 0
##$ME_mod= 0
##$MI= 1.114404
##$NCOEF= 0
##$NC_proc= 0
##$NLEV= 6
##$NOISF1= 3.799351
##$NOISF2= 2.8
##$NSP= 1
##$NTH_PI= 0
##$NZP= 0
##$OFFSET= 15.70392
##$PC= 1
##$PHC0= -15948.13
##$PHC1= 9.800789
##$PH_mod= 1
##$PKNL= yes
##$PPARMOD= 0
##$PSCAL= 0
##$PSIGN= 0
##$REVERSE= no
##$SF= 200.130013532006
##$SI= 16384
##$SIGF1= 3
##$SIGF2= 2
##$SINO= 400
##$SIOLD= 16384
##$SREGLST= <1H.CDCl3>
##$SSB= 0
##$STSI= 0
##$STSR= 0
##$SW_p= 3612.71676300578
##$SYMM= 0
##$S_DEV= 0
##$TDeff= 0
##$TDoff= 0
##$TI= <>
##$TILT= no
##$TM1= 0
##$TM2= 0
##$TOPLEV= 0
##$USERP1= <user>
##$USERP2= <user>
##$USERP3= <user>
##$USERP4= <user>
##$USERP5= <user>
##$WDW= 1
##$XDIM= 8192
##$YMAX_p= 0
##$YMIN_p= 0
$$ End of Bruker specific parameters
$$ ---------------------------------
##NTUPLES= NMR FID
##VAR_NAME=  TIME,          FID/REAL,        FID/IMAG
##SYMBOL=    X,             R,               I
##VAR_TYPE=  INDEPENDENT,   DEPENDENT,       DEPENDENT
##VAR_FORM=  AFFN,          ASDF,            ASDF
##VAR_DIM=   8192,          8192,            8192
##UNITS=     SECONDS,       ARBITRARY UNITS, ARBITRARY UNITS
##FACTOR=    0.0002768,     1,               1
##FIRST=     0,             0,               0
##LAST=      2.2672688,     0,               0
##MIN=       0,             -327657,         0
##MAX=       2.2672688,     243308,          0
$$ Real data points
##PAGE= N=1
##DATA TABLE= (X++(R..R)), XYDATA
$$ [...]
1447G20q05m85J523j849J331k21r67J666j569P70L40j252J579j160K34P41j355
1464g59J326o79k43J007j290R65k20n85J086j054N37J72p76R94p38J66M62q36
1482d65P94m14j26N81p42N50j34l12N98n81L04R6m01M97l75R2K13l88L67j86n2
1503h4K46l05K24n3j30J96j51O5L8r8P2j2l1M0lm6O7m8l2J33j81J29Jj55K70k44
1529i2Q6J30l32L89k41l6L19m80M23j52k27N20n81L57N8m57O95n95J97K98o84
1550d05P76m94m3N69q74P77k96l38Q34r74O44lo63J053r60M02L71r89J165p98
1570b46N2P45j212J131n13l61J089j329R54j16q04J363j299O30L54j189J488j090
1588c53J66Q57j505J452p10l84J302j630J216k36q91J633j598Q27L32j363J778
$$ y = [720, -85, -570, 953, -896, 435, 214, -753, 913, -656, 114, 454, -798, 781, -379, -145, 596, -759, 567, -112, -355, 652, -638, 327, 107, -478, 608, -446, 91, 263, -513, 481, -257, -91, 371, -465, 329, -85, -211, 370, -372, 178, 44, -268, 330, -251, 53, 149, -252, 245, -130, -38, 175, -213, 154, -32, -84, 162, -143, 81, 28, -102, 94, -57, 8, 46, -52, 20, 8, -23, 17, 14, -32, 35, -13, -45, 88, -93, 36, 37, -118, 152, -92, -6, 124, -208, 181, -60, -96, 223, -257, 166, 14, -213, 307, -274, 83, 141, -316, 379, -216, -19, 279, -405, 371, -123, -166, 403, -471, 306, 10, -328, 506, -468, 176, 173, -490, 563, -397, 5, 376, -613, 552, -246, -194, 551, -661, 470, -43, -404, 685, -644, 310, 194, -610, 753, -546, 84, 438, -751, 737, -353, -187, 670, -835, 617, -93, -477, 825, -805, 411, 175, -716, 917, -681, 146, 478, -885, 893]
1605H93j365K99R04j711J750r67k89J430j930J552m47q90J826j932J154J94j477
1622a006K079j731N77Q69j927K108j313r8J481k186J882p08q10J984k236J436
1638D01J5j492K288j994P76Q01k018K312j528J1J512k318K071q89p67K086k401
1655a134J601p2j490K393k204R54P63k090K465j753K09J505k508K306j082o12
1671g49K093k635J908k77j435K484k471J305N63k151K670k016N05J319k632K635
1687A116j354m56K011k758K256n73j394K588k588J539K74k107K884k175N69J172
1703A004k524K812j612m13K058k714K303q09j269K704k680J521J49j897K943k442
1719h66O56J232k436K767j894j29K100k837K311r96q85K633l028J774J03j698
$$ y = [893, -472, -173, 731, -980, 770, -197, -486, 944, -986, 566, 119, -771, 1055, -877, 277, 471, -1006, 1073, -658, -81, 788, -1139, 969, -344, -442, 1039, -1147, 735, 27, -783, 1201, -1035, 401, 416, -1076, 1212, -782, -6, 795, -1223, 1089, -439, -428, 1084, -1234, 837, -52, -819, 1267, -1134, 467, 395, -1095, 1298, -906, 48, 811, -1279, 1186, -567, -358, 1147, -1361, 945, -137, -749, 1344, -1291, 617, 340, -1095, 1389, -1082, 223, 786, -1365, 1305, -711, -206, 1113, -1519, 1116, -238, -694, 1317, -1441, 815, 242, -1152, 1436, -1152, 387, 661, -1446, 1438, -737, -168, 1004, -1520, 1292, -320, -733, 1325, -1389, 914, 105, -1164, 1540, -1140, 381, 530, -1367, 1576, -866, -210, 1022, -1414, 1353, -541, -670, 1430, -1407, 904, -92, -977, 1656, -1372, 402, 505, -1193]
1735a193K793k788J173J104k536K731k032L92J815l112K597j036o45K256l147
1750a628K282p2j797K639k654J562O91k673K932j879M16J378k969K947j152q58
1766h35K117k768K425n26j840K844k411J408K42k319L219k100K24J248k450K972
1782A450j718p08K312k577K208j001j242K991k763J301J64j706L041k707N98J406
1798A049k303K596k063M6K264k942K087q97o41K522l145J678L54j626K462k681
1814a240J229J231k597K389j660M14J656l052K379o27p74J945k811K113J08j917
1830a214K345k136J351N93k550K723j459J50J169k547K697j008r81J928k279K099
1846H81n77j639K635k073J074J74j888K874j942J04J179k025K477j590n38K120
$$ y = [-1193, 1600, -1188, -15, 1089, -1447, 1284, -748, -356, 1459, -1653, 944, -92, -737, 1519, -1628, 654, 582, -1215, 1424, -1230, 332, 1023, -1650, 1282, -597, -181, 1197, -1772, 1175, 23, -835, 1282, -1486, 939, 413, -1427, 1417, -994, 414, 656, -1663, 1556, -544, -320, 928, -1522, 1450, -268, -976, 1336, -1241, 967, -34, -1276, 1715, -1048, 253, 417, -1289, 1752, -955, -357, 1049, -1254, 1342, -721, -675, 1589, -1353, 734, -163, -804, 1718, -1427, 251, 605, -1021, 1441, -1240, -11, 1220, -1377, 1012, -648, -234, 1422, -1630, 749, 122, -652, 1293, -1518, 595, 703, -1214, 1131, -1005, 346, 939, -1611, 1112, -347, -197, 972, -1575, 1122, 114, -867, 1061, -1218, 881, 304, -1335, 1300, -773, 301, 475, -1413, 1461, -481, -377, 802, -1223, 1254, -336, -874, 1246]
1862A246k266J726p66r56K527k430J021L39j454K405k206M85J324k038K001j442
1878d84m8J859k455J615m26p57J995k412J274M68j544J962j881P90J030k159J953
1895G80j124M4J364k329J890m58q34J656k061J513P4j539J984j626P92N62j877
1912a189K116j203j9J096j903J918p97p36J652j800J376k50j201J969j625O70
1928G4M18j465J947j334K1J093j646J624q57m81J553j723J143k01r13J714j606
1945f39O56M66j285J625j270K04R78j556J406p48k58J263j630J145k06p36J408
1962H23j478P91K96j157J444j161L74O60j371J379p76j27R65j392J140l33n79
1979e02J184j273P91Q3r10J268j021L42M74j100J211p30p1Q01j170J007l63m46
$$ y = [1246, -1020, 706, -60, -1016, 1511, -919, 102, 441, -1013, 1392, -814, -329, 995, -1043, 958, -484, -532, 1327, -1128, 487, 61, -696, 1299, -1113, 161, 629, -915, 1047, -834, -44, 986, -1173, 780, -344, -300, 1064, -1265, 625, 167, -667, 989, -1072, 441, 515, -1024, 960, -666, 126, 688, -1189, 927, -276, -295, 801, -1102, 816, 19, -717, 935, -865, 511, 261, -940, 1029, -596, 74, 492, -973, 974, -360, -339, 754, -892, 732, -125, -606, 947, -776, 367, 166, -747, 967, -639, 17, 483, -802, 823, -447, -243, 735, -821, 585, -163, -421, 842, -788, 357, 151, -585, 823, -655, 136, 432, -725, 719, -442, -68, 592, -779, 600, -176, -303, 662, -730, 410, 77, -502, 682, -591, 200, 283, -627, 641, -380, -38, 436, -664, 547, -183, -254, 547, -623, 384, 21, -425]
1997d25J015j083O82J7p17J073r08L35L69q89R96o39j1O39r63Q45l50l07Q04r12
2017d29O19o7n19Q49p90L72K15o79Q29o00R7M23p36P20l61j59N71p13N32j03l48
2038b77O26o20L39R7m72O27m84J19K71n26N27k84p1L87n06L86r0k19M19m43K43
2059D9M4k86L89l25J10J56l30L36k01lJ96k91K39q0r1K08k48J76k3j16J82j61
2081g0Q5L8j35J62j15K9N5j02R5o0J2M4o4N1l8J1J2j7K3m7N1l9J8L7r1R4o5JP3
2110D8j38J32o7l6J43j64J30l7j02K13k22J28K8j88K75k34Q7J09k67L14k12oK32
2133A66l57L18j27j10L06m00L00l3k60M22m01J97J13l83M88l68N8K79m97N00k54
2154d3j19M43n73M46j07k95N78n92L26R8m94O62n17J26L38o41O67l77j09N42p33
$$ y = [-425, 590, -493, 189, 206, -511, 562, -346, -11, 358, -531, 465, -174, -185, 454, -509, 336, -14, -321, 483, -429, 190, 123, -396, 453, -337, 35, 250, -429, 400, -200, -103, 320, -416, 304, -57, -216, 355, -358, 174, 71, -277, 349, -271, 68, 165, -307, 320, -164, -45, 226, -300, 227, -57, -128, 259, -247, 139, 49, -170, 249, -194, 49, 93, -193, 196, -129, -19, 137, -193, 143, -58, -61, 135, -156, 83, 3, -88, 120, -128, 48, 25, -91, 91, -70, 15, 53, -82, 80, -35, -6, 49, -53, 42, -18, -6, 38, -26, 25, -13, -2, 10, -7, 16, -31, 20, -19, -1, 36, -55, 39, -26, -25, 48, -90, 42, -25, -61, 82, -82, 48, 11, -91, 122, -100, 28, 56, -132, 143, -91, -4, 105, -162, 152, -60, -66, 166, -191, 127, 0, -110, 196, -204, 96, 63, -197, 225, -176, 21, 134, -249, 239, -129, -71, 208, -289, 211, -43, -162, 281, -292, 154, 47, -248, 330, -262, 64, 162, -332, 330, -187, -61, 277, -364, 303, -74, -183, 359, -374]
2175c74N89j72l27O98p49M45O5n68Q13o75K17L39p37Q06n02n2N87q69P43k61l36
2196c20P89q92N87on93R38q32L39L17q43R70o49L8O01r81R04l94k98Q64j029P22
2217B32p1o27J035r57M38K86r00J092p76R2O39j085J038n04k79R37j154Q27j48
2236A15o20J141j102N42K58r33J211r38J86O47j155J153o38j97R72j282R91k64
2254H7n73J176j253P10J63r34J278j075L63N72j237J288p63p1R11j373J159l72
2272E6n54J201j348Q89O0r75J376j174M89M63j276J446q64m1Q86j407J298n06
2290A9n47J256j384R78r5r38J509j277N19L82j196J551j089M7R03j390J368p36
2308a20l83J312j506J042k35p54J521j501O88L28j107J515j293L12Q61j453J375
$$ y = [-374, 215, 43, -284, 414, -335, 110, 175, -393, 420, -255, -38, 301, -436, 370, -132, -184, 403, -466, 277, 16, -320, 469, -423, 164, 158, -435, 503, -329, 10, 327, -516, 454, -195, -157, 444, -537, 367, -27, -325, 539, -490, 232, 161, -466, 569, -388, 50, 336, -564, 528, -248, -156, 483, -602, 436, -68, -347, 590, -564, 263, 115, -505, 636, -466, 76, 334, -599, 612, -326, -140, 507, -648, 505, -133, -330, 642, -640, 351, 87, -486, 690, -563, 147, 310, -624, 654, -421, -58, 514, -723, 565, -198, -269, 642, -731, 428, 56, -498, 703, -645, 244, 304, -671, 705, -469, 20, 483, -793, 653, -211, -252, 634, -773, 525, 19, -528, 728, -656, 322, 227, -711, 798, -479, 40, 422, -774, 777, -312, -265, 638, -752, 616, -120, -503, 809, -697, 345, 110, -644, 877, -624, 64, 392, -715, 800, -493, -181, 680, -773, 602]
2325F02q41j18J216j695J197k45o37J370j622R49K78j182J464j278N43O77j589
2342i11J525p96p0J006j688J452l62p29J320j513J133J2j243J636j243N57M09
2359D95j471J766r95r2R13j480J572p24o25J440j472J090k75r50J763j470N41
2376B6L30j155J729j349R8J015j432J429r48k58J458j663J052k91o33J596j730
2393g26P48M38j137J505j426M40R40j600J378q22k4J188j838J300k06o55J311
2410H14j661J094K55j282J476j238O27N63j617J608p97m7Q60j599J557m81p08
2427e76J274j430J186j82j114J641j248N58K69j267J729j069o3Q39j310J468q17
2444a12m71J360j402J003l09p56J600j448N57L17j021J511j278J99R07j337J268
$$ y = [602, -239, -357, 859, -836, 361, 116, -521, 849, -773, 176, 454, -728, 736, -542, 1, 678, -911, 614, -182, -252, 754, -934, 518, 156, -573, 747, -766, 367, 379, -864, 772, -471, 86, 495, -976, 790, -205, -297, 616, -864, 708, -16, -641, 799, -673, 417, 142, -808, 955, -515, 26, 356, -799, 930, -419, -321, 694, -738, 691, -257, -515, 943, -720, 332, 41, -592, 1004, -726, 22, 460, -677, 828, -598, -158, 782, -818, 560, -262, -286, 902, -936, 364, 158, -497, 814, -847, 247, 502, -780, 696, -542, 85, 648, -969, 639, -158, -205, 655, -944, 613, 132, -576, 698, -732, 454, 272, -842, 799, -449, 109, 378, -889, 840, -229, -292, 547, -763, 705, -112, -583, 777, -625, 378, 69, -687, 913, -535, 22, 339, -682, 829, -449, -250, 657, -680, 588]
2461E88q24j53J234j555J005k05n87J326j510P79L19j028J293j193M64O67j375
2478g55J277p40%Q90j481J202k94n49J098j330R53M8r68J272j060N16L54j199
2496g66J374p91qP03j216J219n05m61J061j168Q71j61p66J274j061M55K56r41
2514f31J253q86O2O85j080J076n95k56R70j128P88j88n49J106j082N16K19p93
2532e13J065q74K10N70j003R62n54j07P78j060P94k10m09Q82r88N94J06o88R25
2551D80p93L04L66q66R14n46k5N85r14P95k72l32P43q40N71j7n57Q34p17K95K53
2572B61o94Q11n32J7M71p45O94l12k20O33p39N19p4m01O98o53K99J74n57O74m89
2593a65Q4L64o24N94k94j25M73o09M38r0k88N45n57L01R1m11N46m36J17K39m64
$$ y = [588, -236, -389, 845, -710, 295, 90, -497, 829, -681, 98, 417, -611, 682, -511, -47, 620, -755, 522, -218, -218, 672, -809, 393, 99, -450, 648, -682, 271, 319, -649, 623, -437, 79, 433, -766, 608, -183, -191, 512, -704, 515, 10, -451, 610, -558, 313, 152, -614, 660, -401, 54, 310, -631, 622, -264, -202, 483, -597, 479, -116, -372, 598, -530, 258, 70, -479, 627, -455, 61, 280, -513, 552, -322, -112, 458, -545, 417, -137, -244, 534, -526, 268, 58, -351, 531, -457, 137, 243, -445, 480, -313, -9, 357, -509, 405, -141, -166, 419, -495, 300, 28, -304, 439, -401, 170, 153, -404, 430, -287, 8, 261, -433, 378, -154, -137, 334, -411, 283, -29, -249, 384, -355, 164, 90, -311, 387, -266, 33, 207, -350, 324, -165, -81, 283, -341, 253, -41, -166, 307, -302, 136, 46, -242, 303, -254, 47, 138, -273, 273, -163, -46, 193, -271]
2614b71M78k70n8L51m75L94j30j83L94m27K67J9k83M09l40J18J40l21L49k24R
2635e4K18l40K89j01j14K64l03J90Lj79K71k39R8Q4k17K38j70K5J21j91J73p2
2657fo1J40j58J16j2q3J27j13O2J2p8R8p1K3L5o0N9l5JJ9l1K7pj0J3rKlK3l2R
2688cJj7M8o9L8J6o0R4r2L7M5j12J36q4oR3j51J41m7o9J64j81J16Lj36K20k07
2715h2R8O1j99K52j94K4J70k76K47j28o7K48l09K19k7j85L32l30J65P2k91L79
2737A79k81M7K14l69L65k08n9L26m30L30q5k07M26m46K48O8l60M95m07J31K06
2758A83m52N04l14m0L70n35M60j68k14M98n53L50J7l94N99n26K11J94n28O22m06
2779a22J6L81o21N75k57j84N59o81M82o0l93O77o45L11J72n77P17n30Q9M00p02
$$ y = [-271, 207, -63, -121, 230, -245, 149, 19, -164, 230, -197, 70, 89, -194, 215, -125, -7, 133, -188, 161, -63, -54, 164, -176, 113, 12, -102, 162, -141, 49, 52, -127, 144, -95, 3, 87, -130, 108, -62, -37, 84, -107, 66, -6, -67, 73, -85, 31, 19, -64, 63, -50, 12, 24, -54, 44, -27, -4, 31, -29, 30, -5, -4, 15, -16, 11, 4, -6, 7, -2, 0, -3, 20, -12, -3, -2, -19, 29, -40, -2, 14, -46, 48, -44, -7, 38, -74, 62, -22, -28, 65, -86, 55, 8, -61, 103, -78, 38, 41, -95, 125, -82, 16, 77, -122, 130, -64, -40, 130, -146, 101, -27, -94, 154, -155, 64, 37, -148, 184, -146, 19, 91, -200, 179, -102, -55, 159, -210, 155, -53, -112, 214, -216, 114, 29, -178, 248, -198, 50, 118, -242, 253, -154, -23, 183, -269, 235, -79, -119, 251, -284, 176, 8, -206, 292, -261, 89, 106, -288, 311, -215, -4, 190, -338, 284, -122, -106, 275, -346, 229, -28, -212, 347, -334, 148, 88, -305, 372, -273, 38, 210, -367, 350, -180, -91, 309, -393]
2800c93O91l55j61N91p50N78j26l94P35p49M20J13o00Q14o54J77L74p55P90m69
2820a23p6O06q59P03k15l55P73q39N23M5o00Q74p51K77L33p90Q80n65oN86r09
2841d88Q11l33k98P83r17O41n2n71R21q53M08K41q09R84o79Q1N38r30R12m52k42
2862c04P88r64P29j52n34R82r36M64J83p67J041q02J68N04r37R80n75j25P89j041
2882e09Q11k66m18R55j029N66J14o96J020r01L19M39r48R96o65J7P11j092R03
2901C27l33l25Q89j096P35J8o89J000r45M64L27r57J071p07J02N84j074J028m25
2920fl12Q33j062Q47j27o78J056r44N14J56q71J163q00J06N36r93J090o06k37
2939c35Q57j030Q49l20m94J087j047N53P4p03J131r66K36N05r12J006p24pP99
$$ y = [-393, 298, -57, -218, 373, -377, 201, 75, -319, 416, -333, 87, 200, -400, 414, -240, -63, 311, -444, 346, -123, -199, 407, -452, 251, 36, -319, 454, -385, 138, 183, -417, 457, -294, -17, 316, -474, 406, -159, -165, 421, -488, 323, -10, -308, 475, -442, 199, 147, -424, 497, -356, 52, 293, -516, 468, -211, -130, 408, -522, 390, -62, -304, 484, -480, 249, 97, -437, 545, -391, 73, 256, -511, 530, -272, -104, 400, -537, 443, -132, -257, 532, -509, 302, 36, -382, 573, -456, 110, 224, -472, 548, -353, -34, 405, -543, 453, -212, -195, 516, -576, 327, -6, -331, 558, -538, 197, 215, -474, 526, -419, 45, 372, -585, 486, -221, -119, 465, -609, 419, -6, -318, 515, -547, 300, 173, -505, 551, -393, 121, 277, -594, 569, -231, -125, 411, -582, 508, -98, -335, 522, -508, 341, 21, -473, 614, -433, 120, 194, -509, 622, -344, -108, 397, -515, 491, -233, -240, 559]
2958E59j085Q37l41l05R71j158O56Q3o42R94j022M58M14r65R96o98J36O32j145
2977f25R57l35k80Q03j108Q53o1o69R58r27N64K01r39J095o99J27M84j019J087
2996D67m89k85P59r62Q62k65n74J034r14N24M4p41J131q31J42M36q46J014o82
3015a76j11P79r55P95l75l40R75j023N35N4n88J000r42L09M21q26R04o86Q4O70
3035E04j013P98l22k27P97j043O66L2n79Q66q81M65K89q50R14o36J37N01r69Q99
3055C48l68k23O82r38P56j32n29Q51p98M77R5p20R50o61J33L88q11R00m84j70
3075b54O47q26P22k69l82Q30q06M46M6n60Q78p41K13L53p17Q08n49j9N93q17O64
3096B60k68k60P19q25M88J9m91P78p24L01K67o58P41n25P4M52p61O70k79j98N96
$$ y = [559, -526, 311, -30, -335, 636, -522, 134, 217, -425, 569, -453, 5, 419, -546, 450, -248, -112, 520, -625, 332, -3, -283, 520, -588, 265, 204, -465, 493, -434, 130, 331, -608, 487, -212, -85, 399, -620, 467, -22, -307, 452, -510, 352, 87, -487, 547, -367, 157, 201, -540, 591, -240, -98, 338, -508, 506, -176, -287, 492, -463, 332, -43, -383, 592, -431, 104, 158, -430, 570, -372, -63, 358, -468, 436, -250, -166, 504, -509, 289, -33, -260, 537, -506, 160, 192, -387, 479, -402, 63, 352, -498, 416, -220, -83, 418, -551, 348, -20, -243, 439, -499, 257, 125, -404, 447, -351, 126, 221, -499, 451, -210, -77, 311, -500, 400, -84, -254, 393, -433, 289, 20, -362, 468, -338, 108, 154, -406, 472, -269, -56, 297, -420, 388, -161, -180, 413, -404, 260, -8, -268, 451, -374, 114, 133, -358, 420, -304, -3, 264, -394, 347, -178, -104, 348, -413, 257, -22, -220, 376]
3117C76p48N35o4l99O72o63L58J48n79O95n06J15L31o47O60l32j27N11o75N31
3137A92j38l09N93o01L40O0m61O50n03J38K62n38N79l41n7L98n57M63j59k19N03
3158B95n51L48J8l64N32m59J77J88m48N06l48J7L15m89M41j89j39L95m70L30l2
3179G3k63M24l95J84J09l45M15l09M9K21l93L81j91p5L02l72K81o2j84L31l25
3200a44J80N1k60L37k47O1J39k73K88j69l6K27k96K31o6j15K42k59J46K1j75K57
3222A40k07P4Q5j92J95j27%J31j88J48o2n8J54j70J00Nq9J36j27M1M7j12J31p1
3246a6NM7r9J08m2l0P0o3M1j1k4M4m2J1J7l5K8j3%J0j0J0joLKj6J4jk9L8k4J0
3279dK7o0P3m6j8P5q4N5j1l8Q9r8M5M3j07J29r4J9P8j39J36q0l3J32j71J32k4
$$ y = [376, -372, 163, 99, -300, 372, -291, 67, 215, -364, 331, -175, -60, 271, -376, 284, -48, -175, 336, -339, 192, 54, -255, 338, -263, 77, 137, -324, 326, -177, -39, 223, -315, 264, -77, -134, 264, -293, 170, 11, -208, 295, -256, 92, 110, -254, 278, -181, -4, 184, -264, 242, -106, -89, 226, -263, 178, -11, -150, 245, -225, 105, 73, -190, 234, -161, 23, 132, -213, 202, -107, -58, 163, -230, 151, -40, -115, 187, -185, 96, 34, -150, 181, -144, 36, 87, -173, 164, -83, -22, 117, -156, 132, -37, -73, 154, -142, 89, 23, -92, 150, -109, 37, 58, -117, 140, -67, 7, 92, -100, 95, -32, -32, 99, -89, 59, -3, -61, 93, -77, 23, 28, -61, 75, -52, -11, 36, -76, 55, -16, -11, 36, -63, 45, 3, -27, 43, -20, 21, 10, -14, 30, -12, -1, 16, -19, 9, -4, -4, 6, -4, 6, 5, -1, 2, 4, -12, 2, 1, -28, 10, -14, -4, 23, -37, 36, -10, -28, 47, -37, 18, 7, -31, 58, -40, 5, 48, -59, 70, -24, -5, 73, -66, 70, -10, -43, 89, -82, 50, 26]
3306B6r4J72j84R9M0j64K20j74L8J05k16K38j43l0J88k38J95o0j13K36k61J56
3328C6L5k14K94k41Q4J24k78K92j74j5K20l37K96j15j24L20l57K26jk38L65l26
3350a28J36J22l33L95k74J8K40l91L63j63j22L46m18L01l2k58M32m16K05J17l74
3371b34M69l45O1K38m40M43k30r2L87n03L96j02k49M85m93K73P5l98N29m08J09
3392b9K44n05N29l13n7M06n66M66j66k19N15n67L60K1l95N81m96J96K07n27N98
3413B83l87J0L83o03N37k31k00N36o21M34l4l91O39n88K64J75n34O63m79N8L72
3434B86o39O20l05j60N57o91N01r5l65O68o60L32J39n35P06n51J30L68o79O80
3454C07l85r9N41p25N68j53l14O63p19M06R8n43P32o06K10L15o88P24m33m2N11
$$ y = [26, -68, 104, -80, 19, 59, -105, 115, -59, -21, 84, -132, 106, -37, -67, 121, -117, 78, 18, -95, 141, -120, 36, 71, -143, 151, -90, -6, 118, -160, 132, -42, -57, 163, -174, 122, 7, -117, 203, -154, 72, 71, -167, 198, -128, 8, 130, -203, 192, -82, -64, 176, -215, 148, -15, -137, 209, -209, 92, 60, -198, 234, -182, 23, 140, -234, 235, -110, -49, 189, -251, 192, -38, -130, 257, -246, 150, 48, -201, 284, -209, 64, 139, -259, 270, -138, -29, 215, -290, 239, -74, -131, 275, -291, 175, 9, -210, 305, -262, 98, 119, -276, 305, -191, 5, 212, -315, 283, -104, -94, 289, -314, 223, -8, -208, 328, -293, 141, 107, -284, 355, -233, 31, 206, -328, 335, -144, -86, 286, -353, 267, -38, -198, 359, -332, 169, 74, -291, 377, -283, 49, 188, -347, 359, -192, -62, 306, -373, 307, -78, -177, 364, -361, 207, 54, -260, 403, -316, 90, 188, -355, 377, -229, -19, 296, -392, 332, -101, -143, 368]
3475C68p72O59k11l08O51p48N11Mn21P61o52K78K20o62P92n13lM83p51P18l15
3496a1k64O78p60N46p7m70Q07p29K99J98o16Q17o02O0M79p65P40l96j76O82q27
3517c87N80j31l92P92q10L86J79o05P99o71J87M28p77P52m43p1O05q58O51j51
3537F3l50P25q26N06J06o11P88o74K75L18p77Q18m67k7N12q26P34k33l45O90p74
3558c75N61k8n73Q43o97K97K21p11Q67n51rM92p63P62l72k54P07p68N45j19m39
3579c64Q24p49L07J98o06Q20o40R9M69p51P19m19j21O49q19N66j23l57P60q16
3599c54M23J57n87P59o61K17L80p60P27m04l9N33q25O65j77l21O60p62N08M7n57
3620c71P43o18K66K55p06P82m35l1M56p55P10k72k86O40p17N11n3m74P48o31K65
$$ y = [368, -404, 255, 44, -264, 387, -361, 150, 154, -367, 394, -258, 20, 240, -422, 370, -143, -146, 337, -414, 304, -11, -275, 403, -357, 189, 112, -358, 449, -280, 19, 217, -399, 418, -184, -124, 355, -410, 330, -66, -242, 440, -387, 193, 62, -330, 462, -348, 38, 217, -388, 411, -260, -73, 355, -422, 330, -113, -184, 421, -437, 214, 63, -287, 438, -388, 118, 224, -387, 401, -273, 2, 320, -457, 361, -106, -133, 379, -447, 287, 54, -291, 399, -375, 186, 158, -415, 428, -269, 28, 249, -462, 405, -146, -155, 337, -426, 336, -36, -290, 417, -351, 194, 75, -364, 460, -289, 18, 216, -390, 430, -210, -111, 358, -393, 326, -93, -214, 435, -384, 182, 59, -298, 462, -354, 69, 226, -361, 398, -263, -46, 334, -426, 301, -103, -142, 391, -434, 231, 54, -267, 393, -369, 139, 186, -371, 372, -246, 20, 275, -431, 351, -84, -115, 341, -414, 296, 24, -262, 378, -339, 172, 119, -355, 393, -238, 27]
3641B7J84n85P52n22K3M21o69O62l46j74N87o83M81j06l34O74o63L00J56n04O72
3662C53n47J09L70o26O14l49p8M97o77N09j26k77N80o32L55J08m79O13n07J67
3682b3K73n87N96l40l5M10o17N15j60k44N19n90L94j0l84N70m75J96J80m86N58
3703B60l52NL35n28M90k18j71M52n00L39l3l06N09m59J92J37m11N03l58M5K80
3724B11m50M24k19j12M01m90L41n6k35M23m26K01J05l47M37l29P7K23m02L94k07
3745c6o9L07m09L20q5j81L60l68K05N6k78L75l08J02J63l39L41j94l4K40l46K86
3767A08r3j30K87l11J87K5k15K88k40R1Q7k40K80j77NJ72k56K30j08q2K27k48
3789a13J69pj54K27k00Q2O1j77K18j54J8J17j85J69p6n4J52j69J14j6r1J60j54
$$ y = [27, 211, -374, 378, -144, -121, 300, -369, 293, -53, -227, 360, -323, 158, 52, -282, 392, -271, 29, 185, -319, 353, -194, -85, 285, -341, 273, -76, -154, 343, -334, 175, 49, -228, 352, -280, 75, 183, -296, 317, -190, -23, 250, -337, 259, -81, -116, 294, -323, 192, 32, -212, 307, -283, 111, 101, -283, 287, -188, 8, 188, -298, 260, -92, -87, 248, -280, 210, -8, -179, 273, -227, 112, 79, -227, 282, -177, 15, 152, -259, 244, -114, -69, 211, -239, 185, -34, -146, 255, -235, 106, 50, -185, 238, -188, 13, 118, -229, 208, -121, -44, 179, -223, 171, -36, -105, 202, -207, 113, 28, -153, 207, -161, 44, 100, -178, 197, -111, -9, 154, -185, 156, -38, -72, 168, -178, 108, 15, -115, 172, -139, 48, 73, -142, 146, -94, -3, 84, -156, 124, -53, -48, 124, -132, 98, -10, -92, 135, -113, 56, 49, -105, 122, -78, 4, 65, -112, 106, -48, -30, 87, -98, 71, -5, -59, 93, -76, 38, 22, -69, 91, -63]
3812f3P5K1j16J56j05MP4j21J28p2k0R3j17Q8k2n2R6q0M3J5o6Q5o2J0K9n4O6k0
3840A3j5K2m0L5j0k8L6k3NPlO%j2m%pK6oqK2k7MJ8m1M8l5PK4m6O0m7kN7p8O7j4
3877A1m4Q8r7N2J6q1J08q8L0N4j23J29o6k2R6j42J26m6p0J39j50R2L2j39J79j44
3903f0N1O9j66J88j13j4J41k12J83o4q5J90j97J22J0j55K35j96P6Q4k13K45j73
3926e4KJ68k53K40j01j06K46k73J87pj87K92k64J08R4k69L20k18K3J86l10K96
3948A20j47o4K61l36K41l6j88L37l32J74P5k90L73k77M5K10l60L54j91o4L00m05
3970b00L14q4j88L79l89K23M2l12M26l46J03J81l74M08k49n4L30m49L83j21j89
3991a66M08m51K79L0l27M68l82J21J84m23M87l17LL17m78M23j76j68M27m94L33
$$ y = [-63, 12, 33, -83, 73, -32, -28, 46, -75, 53, -19, -39, 54, -63, 25, 3, -49, 47, -33, 10, 25, -41, 44, -18, -8, 21, -33, 33, 13, -2, 20, -20, 15, 5, -23, 13, -10, -5, 2, -1, 5, 5, -7, -11, -11, -18, 8, 2, -6, 16, -11, -7, 11, -30, 18, -17, -10, 14, -32, 28, -19, -21, 36, -42, 25, 11, -33, 55, -42, 10, 26, -55, 53, -35, -5, 49, -74, 55, -11, -33, 63, -79, 47, 1, -69, 70, -80, 12, 44, -95, 84, -60, -9, 60, -106, 82, -31, -45, 96, -116, 67, 3, -82, 108, -89, 33, 43, -112, 123, -73, 3, 87, -126, 119, -54, -52, 116, -137, 103, 2, -104, 142, -131, 56, 49, -138, 154, -110, -2, 92, -177, 143, -75, -52, 134, -176, 120, -27, -91, 170, -166, 75, 39, -149, 188, -144, 30, 105, -185, 188, -89, -44, 166, -194, 160, -31, -95, 205, -200, 114, 30, -158, 221, -168, 55, 97, -215, 211, -135, -32, 149, -225, 183, -66, -120, 210, -239, 144, 23, -166, 242, -209, 70, 100, -227, 241, -141, -20, 164, -259, 228, -89, -86, 231, -247, 176, 0, -168, 259, -235, 98]
4012I8k7k96M96m51K06J39m20N11l70L9K98m98M71k37j12M30n29L77n9k88N08
4033B86m96K53J20m33N44m19R8K81n31N15k68r6M20n63M48j05k75N14n39L21P1
4054A46m25N72m54J44K35n26N59l23n1L86n60N07j92k37N21n57L53Ql93N98m92
4075a81J79J94n00O01l98jL79n70N08k26j90N22n97L93l2l35N88n59K37J83m86
4096b91N92m52O9L63o02N44k71j12M84o31M43n0l15N55n88L13J29m76N81m55J27
4117d3L03n94N70k91p6M20o05M96j14l02N46n68L59N5m60O08m59J39K30n41O09
4138B82l42p3L99n74N27k02k58N58n66L55j4l79O18n06J58J90m84O04m12j0M00
4159B71n66N07k50j55N14n94L81l0l14N70n64K41J84m62N46m30P9L51n79N09k47
$$ y = [98, 71, -225, 271, -180, 26, 165, -255, 256, -114, -75, 223, -275, 196, -41, -153, 277, -252, 125, 66, -222, 286, -210, 43, 163, -270, 274, -145, -47, 234, -297, 218, -50, -146, 274, -289, 159, 54, -221, 293, -246, 75, 146, -279, 293, -161, -17, 218, -308, 251, -72, -123, 263, -297, 210, 18, -219, 302, -255, 98, 106, -287, 311, -181, -2, 192, -308, 293, -105, -106, 273, -297, 211, -15, -205, 317, -280, 113, 81, -254, 334, -225, 12, 195, -291, 301, -151, -82, 281, -321, 223, -48, -160, 324, -307, 136, 86, -229, 326, -262, 51, 180, -296, 285, -170, -43, 260, -334, 236, -55, -131, 289, -316, 180, 66, -236, 310, -258, 101, 156, -304, 304, -155, -16, 214, -327, 282, -60, -133, 266, -308, 219, 17, -241, 317, -249, 106, 92, -287, 331, -175, -17, 173, -311, 293, -119, -129, 271, -295, 212, -38, -193, 321, -273, 108, 78, -236, 334, -230, 11, 195, -267, 279, -151, -72, 279, -300, 209, -38]
4180c8j03M45o08M37n6k95N13n35K94J12m44N41m10J22K53n43N27k52q8L72n44
4201c00M64j05k82M96n05L21L6m00N57m18J26J92m55N33l25n2L53n06M56j74k09
4222a97M74m95L07j3l15N23m64J64J79m16M92l50RL32m79M15j91j36M22n02L27
4243H6j0k77M58m49K11J34l87M48l29O8K59m62M21j94q2L40m62L49n8k35L99m09
4265a81K43O7l46M41l34Q8J87m00M01k04o1K86m00L48j12j97L81l83K33K5k73
4286a91M02l22J05J42l32L71k33j5K52l62L11j28j26L27l64K31Ok23L45l15J31
4307A2J05k95L36k21J0K00l31L03j30r2K74l25K17j8j77K96k79J35O8k38K98k19
4329g1M2J54k78K71j34n6K03k68K13n1j21K32k30J21L9j82K37j97N9J14k20K29
$$ y = [-38, -141, 304, -304, 133, 77, -218, 295, -240, 54, 166, -278, 263, -147, -25, 228, -315, 212, -40, -128, 244, -300, 164, 59, -223, 273, -232, 89, 125, -275, 282, -136, -10, 182, -273, 260, -65, -117, 236, -270, 186, 12, -197, 277, -218, 89, 76, -239, 284, -180, -16, 163, -253, 239, -111, -102, 230, -249, 166, -25, -161, 261, -241, 86, 76, -201, 257, -192, 19, 153, -234, 214, -115, -47, 212, -250, 171, -23, -105, 235, -227, 122, 64, -171, 228, -181, 62, 129, -217, 224, -110, -22, 165, -235, 166, -38, -99, 187, -213, 135, 23, -174, 207, -176, 57, 82, -191, 211, -111, -6, 136, -196, 175, -58, -73, 179, -183, 128, 0, -126, 201, -163, 68, 74, -149, 196, -119, 12, 117, -178, 158, -63, -53, 147, -184, 119, -11, -103, 171, -154, 63, 45, -132, 164, -115, 20, 88, -150, 148, -71, -29, 125, -153, 118, -16, -72, 131, -137, 76, 25, -96, 136, -94, 27, 66, -116, 121, -76, -17, 97, -123, 106]
4351A06j40k2J56k12J72o0r9K08k01J29Kj41K02j67N6P6j66J81j09j3J25j77J47
4374E3o0n4J48j60J05jr9J49j33N8M0j25J51j00J7P2j46J30n6k3R8j29R1ro3R6
4400E0r1M3J8p3R1o5J7M5p3O5l6j5N7q2P6k8k8O4n9L4Nl2N1m3KL1m3L6j3k0L5
4431A9m2L5j5MJ0k0J1oNlMJj5J6j3J3jk0K3j8J3J1k2K2k3pM1m8M1j5j2L6n4N0
4465B1lm2O0n5L0Pn5Q2p7L4L7q6P3l2j6O9r6O7j7m0R6j01N5K1r5J12q3J9O1j09
4495f3J20p9j1J09j49J23m3o5J42j39Q0J1j13J60j30N3N2j40J55j09J1J09j70
4518h6J49o5o1J50j67J20j9j03J86j66P4N3j81J96j29J0J28k03J91q8n2J83k24
4541a04J63l8j13K14k10J11M2j82K40j94N6J09k21K32j28m1J80k42K04n9j17K36
$$ y = [106, -34, -56, 100, -112, 60, 0, -99, 109, -92, 37, 39, -102, 100, -67, -11, 65, -101, 80, -29, -42, 83, -94, 53, -7, -61, 87, -73, 32, 31, -68, 81, -52, 6, 46, -79, 72, -28, -11, 61, -85, 45, -11, -34, 64, -65, 26, 17, -46, 50, -41, 2, 20, -53, 38, -27, -10, 35, -38, 27, -9, -24, 33, -49, 27, -1, -29, 35, -24, 10, 15, -17, 34, -9, -7, 24, -19, 17, 4, -16, 19, -23, 12, -3, 1, 11, -9, 2, -4, 1, -2, 2, 3, -12, 4, -9, 4, 3, -17, 6, -12, 1, 12, -10, 12, -11, -18, 23, -25, 16, 1, -11, 25, -29, 21, 18, -24, 36, -19, 11, 18, -37, 45, -32, 2, 39, -47, 26, -6, -22, 47, -49, 18, 1, -39, 57, -44, 11, 32, -63, 49, -34, -15, 46, -63, 57, -22, -33, 76, -73, 50, 7, -58, 84, -55, 25, 36, -77, 83, -47, 6, 58, -82, 73, -36, -25, 84, -86, 63, -2, -63, 87, -80, 40, 21, -82, 104, -62, 12, 65, -116, 80, -49, -39, 89, -114, 77, -11, -63, 120, -104, 59, 21, -92, 122, -88, 23, 65, -117, 123, -71, -15, 94, -127, 105, -23, -64, 116, -126, 78, 19, -98, 138]
4563A38k50J45J7j76K53k17P5J07k43K68j53k3J80k73K35p1j14K41k59J72Kj80
4585a26K78k47J02Q3k31K68j81J1J75k79K65j23r3K51k95K14l1j72K85k62J19
4606A1P5k37L00k22K9J79k99K89j47o4K39l17K48n2j72L01l00J77N3k55L23k42
4628h3O5J46k98L13j82m1K42l29K77q4j56L18l31K07Ok33L38k73P6J42k99L38
4650A59k07l1K44l40K90j12j13K94l35K05lk01L33l11J29J14k85L38k49L3K17
4671A69l38K83j37p3K80l57K51k5j99L32l24J61R5k88L34k55O2J80l47L29j65
4692c2n7K59l63K93n7j83L12l21K03L9k77L57k66O7J56l24L61j93o0K52l51L15
4714A30j03j66L36l42K11Mk56L82l09J08J19k93L55k35j7K47l47K96j38j08L17
$$ y = [138, -112, 33, 50, -126, 127, -90, -15, 92, -151, 117, -36, -59, 121, -152, 83, 12, -102, 139, -120, 52, 54, -126, 152, -95, 7, 90, -141, 127, -54, -43, 132, -147, 118, -5, -98, 153, -142, 72, 41, -131, 154, -108, 11, 86, -151, 149, -73, -44, 135, -164, 125, -22, -86, 153, -164, 84, 32, -140, 161, -139, 38, 91, -164, 159, -83, -18, 128, -170, 143, -39, -80, 162, -167, 110, 26, -130, 188, -143, 64, 70, -163, 175, -98, -22, 120, -179, 159, -48, -79, 165, -175, 115, 3, -110, 184, -151, 54, 51, -150, 183, -128, 1, 115, -170, 168, -81, -48, 169, -169, 114, -23, -96, 184, -173, 78, 53, -146, 186, -138, 23, 118, -170, 164, -91, -29, 151, -196, 133, -32, -89, 170, -193, 100, 43, -140, 172, -149, 54, 93, -184, 173, -93, -26, 130, -194, 167, -26, -86, 166, -185, 130, 27, -139, 197, -145, 66, 70, -186, 196, -113, -5, 114, -179, 176, -59, -76, 171, -176, 120, -18, -126, 191]
4735A91l57K20rj82L39l26J21J18k81L36k66M8K16l43L00j51n2K60l58K52k4j83
4757a31L04l27J85P7k82L33k45P1J48l32L34j60n0K27l34K87p6j76L15l07J93
4778E4J8k58L60k69P9J18k94L52j99m6K33l14K75r8j46L11l06J97j2j95L15k78
4800a03R2J22k57L06k29J0K10l02K56j28n9K60l30K10j6j68K90k85J32O8k33K91
4822A37k16N2J64k94K60j23n6K20l03K21l3j39K50k63J59M3k21K83k14O8J14k65
4844a56K79j47m5J92k63K32p4j15K32k44J48Qj67K49j98O2Q4k05K43j68QJ56k30
4867a19K04q6q4K09k29J49j0j34K21k06R7P3j99K19j55K3J34k27J99r0l8J58k11
4890a02J52k2j17K00k01J07M1j59J98j51M1R6j92J79r4l0J42j93J62m9p9J60j70
$$ y = [191, -166, 54, 45, -137, 202, -124, -3, 115, -166, 170, -96, -48, 168, -175, 125, -26, -78, 182, -176, 76, 52, -131, 173, -154, 31, 108, -174, 159, -86, -15, 133, -199, 135, -25, -75, 152, -182, 105, 29, -147, 168, -139, 54, 72, -186, 174, -95, -16, 102, -192, 160, -39, -85, 148, -166, 109, 11, -135, 176, -130, 67, 55, -140, 175, -103, -11, 111, -146, 160, -69, -59, 151, -151, 105, -23, -82, 178, -152, 58, 42, -126, 164, -121, 11, 79, -154, 137, -79, -27, 137, -157, 103, -20, -76, 144, -159, 62, 29, -110, 140, -123, 36, 79, -142, 141, -73, -5, 109, -156, 123, -24, -69, 123, -140, 92, 18, -97, 135, -109, 39, 47, -120, 129, -69, -7, 77, -128, 115, -53, -45, 111, -119, 85, -1, -85, 124, -105, 44, 34, -100, 121, -85, 12, 85, -114, 105, -50, -27, 107, -120, 79, -11, -49, 109, -102, 50, 28, -89, 111, -90, 17, 58, -101, 97, -54, -13, 83, -109, 70, -24, -54, 88, -105, 57, 8, -71, 89, -81]
4913h1J10J3j26J70j42N3P0j50J51q9nJ00j41J26n2o6J37j40P8J5r1J34j34N5
4937eM7j17J40r4J6O6j26J28o2l3J10j31Q4op2J18j02M2L0q9J07q1J8O8j11R3
4963C8n7qP9r4P8k4n2P6p0M6J2n1O3o3QM3o7O2k8j6M4n7M7j8k0N4n4L8%l2M9l9
4995a3PK0m1M4j7OJ2l4J8mj0L7l7J3Mj3K1qkJ0k9J7o%J5j4JmjKpJjOpJ4ppJ5j6
5035a5J7j0JJ2k1K2j4lK5j4J1J2l4K0rj4K9l1M1k1k6M6n3L3Rl9N1m2LK5m5N3m0
5068b1J0L0n5M9k3j6N9p6N6om5P6p8L1L3p7R1n7ON5q9Q5m1k3P6r2N1On7J03j10
5099d9O1J4q1J15p4QM8j00J04o3j7R0j17R7k4o6J25j31O7L5j05J26j03L9N8j34
5125g7J28p2j3J02j36J11m1n6J36j59R9J5j06J52j34N1N2j35J52j04j1J22j67
$$ y = [-81, 29, 42, -84, 86, -56, -3, 67, -83, 68, -21, -26, 74, -67, 59, 7, -59, 78, -62, 16, 31, -60, 74, -60, -5, 42, -75, 65, -29, -13, 53, -73, 55, -7, -40, 70, -61, 23, 17, -55, 63, -39, 3, 33, -56, 51, -30, -12, 56, -55, 38, -19, -27, 52, -42, 36, 12, -40, 36, -34, 12, 24, -27, 36, -27, -19, 24, -43, 19, -9, -25, 19, -38, 9, -9, -29, 25, -29, 9, 9, -23, 26, -13, -6, 14, -27, 17, 0, 6, 18, -16, 2, -2, -12, 25, -12, 1, 5, -8, 13, 5, 3, 13, -16, 1, -5, -5, 10, -4, -3, -7, -8, -6, -13, -12, -13, -7, -14, 0, -7, -14, 1, -15, 2, -8, -7, 5, -16, 6, -8, -11, 14, 0, 11, 23, -11, 9, 0, -14, 15, -16, 25, 4, -22, 24, -29, 4, 13, -26, 25, -17, -14, 11, -34, 19, -21, -11, 19, -36, 13, -10, -26, 33, -43, 13, 7, -38, 38, -40, -9, 24, -53, 38, -19, -13, 42, -47, 38, -3, -26, 50, -42, 9, 15, -42, 61, -49, 12, 26, -55, 60, -14, -6, 42, -58, 46, -17, -34, 56, -61, 36, 12, -54, 71, -60, 7, 42, -63, 63, -40, -1, 57, -77, 51, -21, -34, 68, -68, 43, 2, -54, 82, -77, 22, 37, -69, 83, -51, 0, 52, -83, 69, -35, -46, 76, -91]
5148i1J38n8n9J44j55J09pr7J63j52O0N3j40J79j26RR9j75J74q6l8J45j76J26
5172C9oj19J87j74R8M0j63J98j49L1J01k07J98r0l2J49j99J56l3j04J75j87J12
5195B1K2j63K24j66N2Q3j99K17j24j7J47k09J86p4p9J96k10J23J9j47K08j77Q2
5218A5O6k00K28j53lJ57k29K04q4q6K14k40J51pj38K29j98Q1P0j99K33j71J8J51
5242A09k32K09j03m9J90k45J71k1j26K29k32J29N0k01K36j79N7J10k37K40j20
5263a5m6J83k52K05n2j28K24k30J42K9j86K40j85N4R6k18K48j46j8J73k44K08
5285H2p4j11K33k45J58kj58K56k18P8Q2j99K46j73j1J82k47K13j04p1K30k62J63
5308D8j3j43K50k45J00R1k03K44j94L7J49k60K25j13m3J97k69J99k0j38K27k37
$$ y = [-91, 47, -11, -70, 74, -81, 28, 21, -76, 87, -65, -5, 48, -92, 87, -39, -30, 69, -106, 68, -18, -56, 89, -87, 39, 33, -86, 101, -73, 25, 65, -98, 100, -49, -18, 83, -124, 74, -16, -48, 101, -98, 58, 25, -79, 96, -91, 21, 43, -120, 104, -62, -10, 73, -126, 91, -33, -50, 97, -112, 74, 0, -79, 117, -93, 30, 49, -98, 110, -67, 15, 81, -119, 109, -44, -47, 110, -119, 85, 1, -85, 129, -111, 40, 33, -105, 124, -74, 7, 77, -122, 111, -60, -42, 109, -123, 86, -17, -66, 124, -121, 50, 29, -97, 132, -100, 29, 79, -122, 114, -65, -8, 102, -135, 105, -15, -61, 122, -130, 75, 23, -105, 119, -111, 31, 60, -126, 114, -71, -17, 79, -139, 109, -37, -55, 118, -126, 82, 8, -103, 130, -115, 43, 41, -117, 139, -79, -1, 81, -118, 128, -45, -56, 126, -121, 92, -12, -83, 147, -115, 48, 35, -108, 142, -103, -3, 88, -115, 129, -65, -28, 121, -139, 86, -27, -70, 127, -142, 57, 37, -101, 126, -111]
5330a11J35M8k15K69j89M6J22k48K42j17l9J72k50K07m1j31K21k21J41J6j80K52
5352A29j97O3R0k22K52j60j5J70k35K08q0j09K34k29J42oj46K37k08N9J03j87
5374a07K32j72OJ53k27K02r8o3K04k51J62j0j16K09k17R3P4j85K10j52K4J34k34
5397a29K19j12n3J84k32J75k5j12J98k06J13M4j79K15j56L8R9k08K17j03m4J62
5419A05k23J89m7j06J95j90J06K1j53K12j54M2P7j82K08j26k3J36j90J70o4p1
5441f8J76k00J14J1j23J97j79O0Q5j72J89j32PJ09j72J57o3n0J54j88J29pj11
5464g7J81j65O9N4j58J82j35K6J03j63J50q1l0J30j69J24k3q5J53j54Q1K3j15
5487g9J57j25K9Q5j56J52p8k3J12j47J18l1p4J38j39P8K0j00J50j22L8M6j24J46
$$ y = [-111, 24, 72, -143, 126, -63, -17, 105, -143, 99, -18, -57, 115, -135, 72, 31, -100, 121, -100, 41, 57, -123, 129, -68, -5, 85, -137, 115, -45, -60, 110, -125, 83, 3, -106, 128, -101, 41, 35, -111, 126, -82, -23, 80, -107, 125, -47, -41, 112, -115, 87, -11, -74, 130, -121, 41, 31, -85, 124, -93, 0, 74, -111, 99, -53, -29, 105, -129, 90, -22, -75, 109, -123, 52, 27, -85, 113, -93, 20, 64, -115, 100, -56, -18, 81, -127, 90, -13, -57, 105, -118, 71, 24, -82, 113, -77, 29, 50, -103, 109, -45, -3, 74, -108, 100, -26, -49, 87, -103, 67, 3, -68, 108, -92, 22, 33, -90, 107, -72, -12, 73, -99, 90, -42, -35, 74, -98, 59, -4, -54, 100, -88, 41, 34, -77, 104, -61, 8, 62, -96, 86, -49, -23, 80, -83, 67, -14, -44, 86, -83, 41, 18, -67, 86, -68, 13, 36, -79, 78, -47, -18, 67, -89, 63, -15, -38, 74, -73, 45, 14, -60, 78, -61, 17, 37, -63, 87, -35, 3, 49, -75, 71]
5511G1r2lR0j41J10l2n3J08j18Q9qp8J21j03L1L8j01J21p9J0P3j10R1l0m4R0j00
5538d9P3j0n0R0j01N5K3p2Q4o6J4M2p4Q2l7j7N2p3N6j7l5O8p7M9J2n7O5l8%L7
5568B9o3O2l5j0K7l6L6ok0M5m8J9J2k9N9n5J5J4l4L8j7j1K6k8K1j5J3Rk0RJk6
5600a8K5j6J5%j6J7%j0J0j0MKmqNMnPj7J5mrL8l1RJ3j6J1j7RKk1L2k1QK0l7L7
5638B3k6oL1l6K2%k1M8o1L1ok7O5n2J1L1o3O1l3kM2o3N7k6k8O7o9N0rm2Q0p3L6
5671A2J9p6R1o2PN3q9R1m2k1P6j01P0nn8R3r8N0K3q7J05p6RO9j20J10n4j9Q5j17
5701f2Q8po9J18j22P7J2r9J34j09L4N5j15J24p2k3J07j48J21l6n9J32j52J00P
5726C6r9J51j39N4M3j31J52r8PJ13j64J28o0l8J38j69J17j6r8J69j64P6M3j36
$$ y = [71, -21, -24, 66, -75, 35, 3, -50, 58, -60, 29, 21, -57, 64, -39, -8, 30, -71, 50, -29, -19, 54, -56, 35, 5, -39, 51, -49, 24, 14, -36, 54, -47, 8, 31, -41, 43, -23, -9, 33, -41, 41, 4, -13, 39, -34, 22, 5, -30, 38, -39, 10, 22, -35, 30, -8, -8, 29, -34, 28, -7, -17, 10, -26, 10, 4, -16, 29, -19, 0, 12, -17, 42, -13, 2, 16, -18, 20, 3, -8, 18, -10, 11, -4, 9, 18, -2, 7, 8, -18, 7, -9, 6, 6, -10, 7, 7, -3, 7, -3, 1, 3, -1, -9, -4, 0, -5, 2, -15, 0, -4, -13, 25, -6, 3, 16, 0, 11, -6, 3, 5, -16, 16, -5, 3, 23, -14, 23, -3, -9, 22, -14, 8, 8, -13, 35, -26, 5, -1, -28, 37, -15, -4, 27, -36, 25, -8, -10, 32, -31, 26, 0, -28, 39, -30, 20, 11, -31, 49, -24, 12, 31, -45, 46, -16, -9, 44, -45, 46, 4, -17, 59, -42, 28, 23, -35, 58, -40, 10, 33, -54, 51, -25, -16, 53, -67, 43, -11, -30, 55, -62, 26, 19, -50, 68, -54, 23, 35, -64, 70, -39, -5, 50, -65, 59, -13, -36, 71, -77, 44, 8, -51, 81, -71, 29, 36, -63, 88, -51, 3, 46, -85, 67, -31, -24, 89, -75, 53, -7, -45, 93, -76, 41, 25, -73, 96, -68, 8, 51, -85]
5750h5J74j20J2R2j60J62q1m0J38j87J57l1j01J70j71Q9M1j58K03j48K9Q7j79
5773a07J82r5m2J59k09J70m0r4J81j91J05J8j36K10j67N2Q5j84K04j31j5J43k00
5796a02J83p7q0J92k06J34lj47K24j91Q3P0j97K20j47K2J27k19J99q5p0J85k30
5819a15J63j8j20K13k10R8M4j79K31j71N1J18k32K24j06n2J76k31J74l9j13K27
5841A33k25J30K4j79K42j86M4J06k09K24j34k8J69k35K06p1j08K15k13J31J3j64
5863a15K34j89O3R4k09K31j63MJ67k29J91q1q7K22k43J49J4j56K32k14R3P3k00
5886a19K40j78K3J54k49K13j01n3K04k50J68k2j33K23k14J15M8j96K47j88L8J26
5908I6k23K28j21m8J88k44K01n2j21K21k26J35K2j82K44j90O8R2k13K43j43k3
$$ y = [-85, 89, -31, -19, 73, -87, 75, -6, -46, 92, -95, 62, 31, -70, 100, -71, 18, 59, -99, 104, -44, -15, 72, -107, 75, -20, -62, 97, -112, 58, 18, -76, 105, -86, 19, 37, -99, 111, -56, -4, 81, -103, 101, -30, -45, 98, -102, 81, 4, -76, 116, -90, 44, 41, -106, 118, -73, 10, 80, -117, 103, -44, -22, 105, -114, 85, 0, -70, 115, -115, 48, 30, -90, 123, -87, 11, 55, -124, 107, -64, -13, 105, -127, 97, -9, -61, 115, -116, 58, 19, -94, 133, -92, 38, 62, -117, 125, -61, -17, 89, -120, 104, -30, -58, 111, -124, 82, 11, -97, 118, -95, 36, 49, -115, 119, -70, -7, 87, -122, 109, -54, -50, 117, -112, 79, -2, -89, 133, -110, 39, 53, -103, 129, -85, 8, 81, -119, 121, -57, -34, 120, -129, 84, -17, -70, 134, -116, 52, 30, -103, 120, -94, 21, 69, -127, 120, -68, -30, 96, -127, 101, -20, -68, 120, -124, 77, 25, -96, 125, -101, 34, 56, -126, 118, -72, -4, 88, -125, 118, -25, -48]
5930d8J53k25K05p7j04K12k04J22jj45K36k08O7R3j94K23j50RJ38k18J87q3n7
5953f9J88k34J52Kj41K21j94Q1P1j85K16j60L9J20k18K00j06l3J68k29J66k2j23
5976i0K02j95J03L9j69K16j57M3R1j89J94j06l0J33j96J77o2q1J79j78J16Qj46
5999i8K07j63N2O9j66J94j28nJ32j80J52n6p2J71j93J24k0j05J87j60O3O1j58
6022i2J75j24J7J00j70J52o9m8J54j75J26k1r6J56j61Q7L3j30J71j33K6R2j49
6045g9J45o7l6J19j53J23l8o1J39j51Q9J3j08J52j28L6N9j13J19q4KQ3j27J07
6069D1k8n3J14j25P9Jp7J13j02L6L6r7J27q6kQ0j22J08m2l0Q8j07P7j1o2J12j07
6096c9M3K9p0R1o5QM8r3Q5m5k1Q2r9O7j7n1R0q9N3J4n8P9p6K4L0o4P1l0pM9q8
$$ y = [-48, 105, -120, 85, 8, -96, 116, -88, 34, 33, -112, 124, -84, -17, 76, -118, 105, -45, -36, 102, -116, 71, -12, -69, 119, -115, 37, 39, -102, 119, -75, 6, 77, -108, 108, -52, -13, 107, -111, 89, -17, -50, 118, -111, 55, 33, -90, 112, -83, 20, 59, -110, 106, -51, -8, 83, -106, 88, -18, -48, 85, -111, 66, 4, -77, 102, -76, 40, 48, -98, 109, -54, -2, 67, -99, 95, -33, -38, 94, -86, 66, 10, -62, 109, -84, 40, 20, -85, 102, -58, 5, 66, -92, 83, -41, -24, 76, -94, 58, -11, -59, 95, -80, 46, 25, -71, 85, -76, 11, 44, -86, 85, -48, -22, 70, -79, 66, -1, -37, 82, -71, 52, 14, -47, 92, -59, 30, 43, -65, 87, -41, -5, 54, -59, 60, -24, -22, 61, -66, 41, 13, -40, 74, -51, 28, 29, -48, 65, -37, -1, 35, -62, 65, -21, -23, 57, -65, 43, 1, -29, 59, -48, 29, 18, -44, 68, -39, 4, 33, -37, 54, -11, -3, 45, -48, 37, -8, -29, 53, -46, 21, 4, -47, 43, -46, 7, 21, -37, 42, -34, -10, 20, -44, 27, -3, -10, 39, -49]
6127d9P7k2k9O8p9M3Ml8N7m2NK8n5O4m2OL0n4M7j4k2L7l4K3jl6N0m5K1J2k2L4
6159B2l2jK8l5K9j2qL0l9J9Oj7K2j8J3jj9J5mKRk2J4qJK7k3LkpK0j2qJ3ojonK
6198a1OjQqkQoMLqRj3MJ0mJ1mqJ9k9K6qj2K4k1%J3k0J5k0J1K8m9M1k0j6L7m2L3
6237Hpk5M1l3J3J1k9L4k7J2K7n8M7k6JM1n2M4j7k0L8m9L5Ol5N4n5J3L4n8P3n1
6269a0j2N7p0M4nk7N5p0M1Om8P4q3M3K7o2Q5n6lN5q7P8l2k1O2q8N6jo0J03q9M0
6301BK3p8R8o8OO1r5R1l9l6Q1j02Q6j8n2R1j04O4J4p8R6q2J8O4j08J11o0pP7j15
6331e9R2k7n1J08j09N6J3p0J15j01L5M5j10J28o9j2P5j20J12m7m5J12j26P7%q1
6357e9J31j20M6N6j16J18q6jQ6j23J20o2l7J12j30R8j0p2J20j25O0L8j07J36j08
$$ y = [-49, 28, 6, -23, 45, -34, 9, 13, -25, 32, -10, -5, 23, -32, 32, -10, -4, 26, -28, 19, 5, -17, 20, -14, 9, 8, -28, 22, -23, -2, 10, -12, 22, -10, -11, 17, -18, 11, -1, -9, 21, -18, 1, 7, -10, 12, -6, 7, 6, -13, 2, -2, 0, 9, -13, 1, -7, -6, 21, -2, 1, -1, -8, 12, 0, -8, 5, -1, -2, -8, -13, -11, -5, -6, 2, -6, -8, 0, -6, -2, 1, -7, 2, -11, -7, 3, -1, 10, 6, -2, 17, -12, 14, 6, -6, 18, -3, -3, 10, -10, 5, -15, -4, 24, -25, 16, -4, -20, 17, -25, 8, 1, -24, 17, -16, -3, 8, -21, 13, -14, -2, 25, -33, 14, -12, -11, 30, -22, 22, 5, -15, 23, -26, 9, 15, -20, 34, -21, -8, 26, -32, 41, -10, -22, 35, -35, 9, 4, -23, 32, -38, 3, 9, -39, 35, -48, -5, 22, -40, 45, -11, -14, 41, -46, 32, 0, -21, 41, -47, 9, 8, -52, 51, -38, 2, 25, -53, 45, -23, -17, 44, -51, 40, 1, -35, 46, -56, 30, 12, -40, 51, -53, 11, 25, -53, 43, -39, -21, 43, -65, 46, -14, -21, 56, -59, 33, 6, -45, 63, -46, 10, 23, -47, 68, -33, 2, 47, -63, 65, -4, -16, 59, -61, 51, 4, -41, 71, -55, 22, 22, -59, 72, -48, -2, 54, -62, 56, -30, -31, 55, -68, 52, -10, -47, 65, -65, 33, 23, -49, 71, -54, 6, 44, -63, 73, -35]
6382c5J2Q9j34J14n0l0J13j50J18k5p1J23j35P8J1r9J45j19L5N9j36J45q9lR2
6407E8j43J18l0o4J34j43R6Mj03J53j26N3N3j25J47j15K2R0j58J37n7m9J39j60
6431f9J08j7r3J52j49P9K9j20J64j14PQ5j42J48q4k5J19j57J08j7p5J47j42N6
6455bL9j18J60j24M4O4j36J42q5k0J17j63J33m2o2J47j50R5kj09J53j26M8M9j22
6480g0J50j13J2Q9j47J29m6n0J17j45J14pj05J49j24N0L5j12J55j13J1P9j27J26
6504E7o4m0J22j41J12l5o3J26j33P6J5r9J39j07L0O6j28J16o9j5R5j35J14m2n5
6529e8J19j43J00Rq3J22j19M8N9j30J29p8nR3j40J23l9n6J23j45R6Jq0J27j16
6554d3N1L2j13J41q5mP3j20J28o2k8R5j31R8j5p4J24j14N3K7r7J26r9K7M6j05
$$ y = [-35, -23, 66, -68, 46, -4, -34, 79, -71, 47, 22, -49, 74, -61, 17, 28, -71, 74, -45, -10, 49, -87, 58, -31, -34, 58, -85, 33, 3, -61, 73, -70, 26, 30, -73, 80, -46, 7, 60, -65, 82, -33, -11, 79, -79, 58, 1, -48, 91, -69, 39, 22, -71, 81, -68, 11, 40, -80, 84, -30, -23, 62, -80, 68, -16, -41, 78, -79, 29, 12, -63, 84, -58, -2, 37, -81, 79, -45, -1, 63, -73, 69, -16, -36, 81, -82, 51, 9, -53, 94, -56, 39, 37, -72, 81, -45, 3, 52, -70, 80, -33, -21, 68, -79, 50, 4, -46, 71, -74, 40, 33, -72, 77, -47, 3, 38, -74, 81, -32, -21, 58, -69, 57, -7, -47, 75, -66, 46, 11, -52, 74, -59, 17, 32, -67, 72, -35, -5, 61, -67, 49, -20, -35, 60, -75, 39, -3, -58, 61, -82, 18, 27, -56, 66, -53, -5, 54, -76, 53, -25, -30, 63, -77, 46, 7, -49, 74, -71, 25, 26, -54, 73, -43, 8, 40, -73, 68, -17, -21, 52, -68, 60, -2, -30, 65, -66, 32, 17, -57, 67, -47, 6, 33, -64, 62, -37, -10, 36, -69]
6580f9J22p0j8J02j21Q9k4n9J07j05N6K6j00J30q7J9M9j05J09p0rR3j16R6m2l9
6606c6J01j17P0Rp9J08r1L2M0r6J07p4JP3j15R5k5m1R7j03O3ln5R8r3M4L0p7Q9
6635E2o9NM7q4Q8m6k6Q6r7P3k4m7R6q2L3K6p5Q0n7K4K8p9Q7m3j3N6q6P5k0l9Q1
6666E0q3M4%m8P3o3K1M1q5Q6n0jN6o5M5j3l9N9n4M1Om4N8n3K3J3n8O1l7LL1n5
6698c7M7k1pM0n1L5Kl5N5l9QQl6N8m2RL1n5M5l0LL6m6L0qj0L4l7K8kl3K7j0kJ4
6733Il0L0j4pK3l3K1onJ5l0K9mj3K1k0J3Lj1K0rmNj1J9pj6J9k3K0Kj0PrJ%Nmj
6772eJLo%lJ1nj0LJ7j0jJJ0no%oJ3JQrQj5lRj4J6Kj5J6j0PnrJ0K%Rl0K4rj5K4
6816Dk6K1Pj2Oj9J8Nk1K1qj0K0k5K2mk1L5k3QJ2k6L2l2RJ7l0K6j4pM1m7K6oj3
$$ y = [-69, 53, -17, -35, 67, -54, 35, 11, -48, 59, -46, 10, 36, -64, 66, -21, -2, 47, -58, 51, -19, -28, 65, -51, 45, 3, -36, 65, -52, 18, 27, -52, 56, -35, -3, 37, -59, 48, -26, -25, 48, -67, 28, 3, -38, 59, -44, 19, 16, -39, 59, -34, 10, 40, -37, 52, -17, -12, 35, -49, 39, -7, -33, 53, -44, 29, 5, -42, 54, -28, 5, 31, -44, 36, -21, 3, 31, -48, 39, -4, -17, 39, -47, 28, 8, -31, 50, -33, 11, 11, -37, 36, -27, -6, 35, -50, 36, -14, -15, 41, -24, 21, 8, -31, 28, -26, 15, 21, -23, 35, -18, 5, 18, -40, 21, -16, -13, 18, -37, 10, -11, -18, 22, -29, 6, 8, -27, 28, -11, -3, 5, -31, 27, -15, -6, 25, -30, 15, -15, -12, 24, -22, 8, 0, -10, 24, -13, 15, 13, -20, 7, -3, -5, 9, -21, 9, -5, -12, 11, -22, -1, -7, -12, 3, -27, 2, -2, -15, 6, -14, -1, 2, -9, 11, 2, -2, 3, -8, 11, 4, -12, 7, -16, 4, 6, -4, 3, -6, -5, -5, 0, -4, -5, -4, -1, -7, -7, -10, 1, -4, -14, -11, 6, -4, -5, -4, 6, 1, -5, -5, -11, 2, 3, 11, 2, 10, -5, -8, 1, -13, 3, 5, -10, 6, -4, 3, -2, -11, -1, 1, 1, 10, -20, 4, -5, -20, 4, -22, -1, 6, -6, 0, -19, -1, 4, -17, 4, -4, -14, 6, -19, 3, -1, -22, 13, -10, -2, 10, -16, 16, -16, -7, 10, -20, 6, -8, -15, 26, -21, 5, -1, -14]
6851a4L7l1L0j7k7M5l6J2J3m3N2l3OK8n1N3l3jL0n0L6pk7M7l9J9J8l9M3l5J7K6
6883B9n9N2k9j1M1n5O4j7m5O1o2L6J3m4N5m3OK7o0N7k9qN1o7M6j7k5N0m8M6ln0
6915c8P1o1K9K5o7P9n0NM1o9N6k2k1O6q4O0j3l5O7p3L6K8o4O9m6j4N2o4O1l1j7
6946b4N2p7P0j1m6P5q1L6K1o2R6p8K5M5q3P8m0rO6r7N7ql6Q3q8N1jn7Q5o3K5K4
6978B8p8Q4n3nO3r4Q2k9l2Q0r8O6Kn9Q6q4M0L0p5R3o7mO2q2Q2l5k5P4r6P6k1m9
7010c8R1q8L9L3q1R6o8J6L8r4R6n4j5P8r8Q2k6m4Q2r7O1Po4Q8p1K3M1r0R6n5M
7041a2O5j04Q4k7l9P8r6O5Mo8R9q1L8L2r0R9p2KN6p8R2m7m0P5q0N7qn3R3q2M0
7072BJ4o7R6o9OM8q3Q6m4j4P8j00O7j1n3R1r1N7Ro1Q9q2K1M7p8P5m6k0P3r6Q6
$$ y = [-14, 23, -8, 22, 5, -22, 23, -13, -1, 12, -31, 21, -12, -6, 22, -29, 24, -9, -10, 20, -30, 6, -1, -28, 19, -20, -1, 17, -22, 21, -14, 3, 29, -30, 22, -7, -18, 23, -32, 32, 15, -30, 31, -31, 5, 18, -26, 29, -14, -8, 19, -41, 16, -13, -21, 30, -37, 9, -8, -33, 17, -31, 15, 12, -38, 33, -28, 1, 26, -41, 38, -12, -7, 34, -35, 21, -1, -22, 44, -40, 20, 7, -28, 39, -34, 2, 30, -34, 35, -11, -25, 27, -37, 24, -7, -24, 28, -49, 21, 10, -36, 39, -42, -6, 15, -47, 49, -29, -4, 41, -42, 36, -4, -13, 53, -44, 13, 5, -31, 52, -36, 15, 14, -43, 42, -21, 4, 28, -50, 34, -19, -24, 39, -55, 27, -2, -34, 46, -52, 14, 16, -43, 43, -41, -1, 29, -46, 47, -20, -24, 38, -44, 38, 3, -22, 52, -44, 32, 11, -38, 53, -35, 4, 37, -44, 52, -16, 0, 38, -56, 40, -14, -29, 49, -49, 33, 7, -37, 45, -52, 9, 16, -48, 40, -31, -8, 33, -57, 39, -16, -12, 53, -51, 33, 6, -33, 45, -51, 14, 18, -50, 49, -32, 6, 38, -52, 47, -25, -23, 33, -45, 47, 0, -40, 35, -45, 12, 4, -49, 44, -38, 2, 16, -51, 45, -24, -18, 30, -53, 33, -11, -25, 53, -47, 20, 9, -44, 47, -44, 13, 22, -39, 50, -32, -11, 36, -42, 33, -13, -33, 40, -56, 30]
7103C0j9n0Q2q9N1Kn8R6p2K1M2r4Q3m7JM2o0O7l3k4Q3j00O6lo1Q9o8K1L2o8Q0
7134D2n9KN6q6P4m0j2O6q7O4k6k7P6q4M7J5o3Q6o0OL6o7O5l1k0P1p5M8k0l8R0
7165D9q9N8Jm9P4p3L1K7o4O9l7j4N1q0Q2l5j2O0q1M6nm4O6m8J7K8p1P6m1LL4p3
7197d4P2k9k0N5o1L7ol6O7o4L2J6n3P5n7J7K6o4O5k4j8L7m9M1j2k4N3m4L3km6
7228b7N7m5J5K6n1M6k8pL4n3N5k2k2M6n2L0jk7N7m9J4J7l9M1k5lL2m2L7j0j8L3
7260A9m3K8Kk3L7k5MJ1l0M8l5KJ7l3L5j6k1L7l8K8qnL2l4J5Jk6L2k0J1Rk9K9j6
7294eJJ5k6K2pmK2m1L6jl1L4j6j4L7k4J5j5MJ4k5J2j1OQk0J4LkJ5j9LLqJ2lj6
7331a2J9j4J1%j1J4lJjoJ2j3J4orJ3pLjnJj3OQKj1J0kOj4NoJ6j2MqmJ2OKpLmQ
$$ y = [30, 11, -39, 43, -46, 5, 7, -51, 45, -27, -6, 36, -58, 25, -22, -21, 21, -39, 28, -5, -29, 54, -46, 20, 17, -44, 45, -23, -2, 30, -38, 42, -17, -15, 41, -45, 29, -11, -23, 43, -44, 20, -6, -33, 43, -41, 6, 21, -42, 44, -16, -10, 26, -41, 24, -7, -27, 44, -31, 17, -3, -41, 49, -40, 18, 19, -30, 44, -29, 2, 29, -35, 34, -3, -17, 34, -46, 36, 1, -11, 49, -32, 14, 9, -35, 31, -17, 0, 28, -43, 33, -8, -5, 29, -44, 28, -1, -21, 34, -27, 10, 4, -32, 35, -29, 3, 19, -34, 41, -16, 1, 27, -37, 28, 4, -14, 23, -26, 15, 3, -21, 32, -12, 21, 19, -27, 30, -15, 0, 26, -25, 21, -7, -14, 20, -33, 22, 0, -22, 24, -28, 2, 1, -26, 31, -18, -4, 13, -26, 15, -10, -13, 19, -23, 14, 4, -14, 19, -24, 4, 6, -17, 20, -5, -1, 10, -20, 28, -7, -5, 12, -21, 14, -2, -23, 14, -24, 4, -4, -9, 23, -11, 4, 5, -21, 11, -9, 2, 11, -18, 11, -5, -4, 11, -15, 7, 0, -4, 18, -23, 13, 12, -19, 15, -1, -15, 22, -2, 13, -2, 2, 16, -9, 3, -8, -2, 6, -14, 0, 3, 1, 16, -3, 0, 3, -5, 7, 4, -12, 7, -7, 4, 4, -7, 7, 4, 5, 4, -2, 10, -3, 11, 5, -4, 9, 2, 5, 4, -1, 0, -13, -7, 1, 3, -8, 2, 0, 6, -8, -3, -9, 7, -5, -1, -9, -13, -1, 5, 7, 0, 3, -1, 7]
7375Gj7J1oJ2qK3j5nKkqRj0J1lj3J5pJ1op%kJ0Ok1K5j3OqoJ2npJ4onPqK4j9jJ0
7418Gj2J9j9nJ9j4K0roJ1k3K3mj6K5k2J1Mj9J3j6kJ5j4K6k1j0K5k7J7Lj1K2k5
7452a5RQj6L8m2OL2n0M2j3mQk0K8j0j8L3l7K0Jk3M4l0NJ5l5M3l1mK9m1L5rk2L9
7487A5m1L0Pl0N1m7OK4m8M6k8jL1m3M7k2j6L9m0K5kk4M0l6J4J5l1M6l7KL7n4N2
7520B7k4k2M7n2L9pl7N9n3J5K0m2M5l6J1K1m9M6j7pL3m1M0ll3M6m5K0K4m6L7l4
7552a8QL1m9N6l8kL7m9M7j6l4N4n7L5J2n6Q0o1J6J9m2N5m4lM3n9M9j6j4M3n5K7
7584aRl2O2n3J3K6n3N4l1NL3n7M0pk8M2m9M1mm5O4n7K8J9n4O0m8RM1p3O2k2j7
7617b3M3n6N9j7l5N8n6K7J5m9P0n9J2L2n1N8l8nM7o7N1k6j8O0o1L6Kl8N3n2K7
$$ y = [7, -10, 1, -5, 7, -1, 22, 7, 2, 4, 2, -6, 3, -7, 4, 1, -12, 3, -4, 7, 1, -6, -6, -8, 2, 8, -13, 12, -1, 5, -3, -9, 3, -2, -9, 5, -1, -6, 1, -7, 17, -2, -3, 7, -5, 14, -5, -10, 9, -5, 15, 6, 0, 11, -12, 11, 7, -9, 16, -6, 5, 9, -10, 3, -13, -15, 0, -14, 12, -9, -19, 6, -21, -4, -1, -12, 10, -15, -6, 2, -14, 24, -18, -12, 20, -30, 12, -1, -5, 3, -17, 11, 1, -17, 16, -21, -1, 0, -23, 21, -9, -4, 11, -24, 19, -12, -16, 13, -28, 7, -2, -24, 15, -26, 4, 11, -19, 32, -15, -9, 15, -33, 13, -15, -16, 15, -28, 19, -3, -19, 20, -20, 5, 3, -21, 19, -17, -3, 12, -19, 27, -10, -8, 29, -25, 27, 3, -19, 28, -24, 15, 8, -29, 30, -23, -8, 12, -30, 15, -21, -10, 11, -38, 8, -9, -16, 17, -24, 16, 13, -20, 26, -19, 1, 25, -21, 16, -18, -10, 21, -28, 28, -10, -12, 25, -24, 23, 7, -27, 27, -30, 5, 17, -39, 41, -20, -4, 15, -27, 28, -16, -19, 24, -35, 14, -2, -16, 27, -28, -1, 8, -24, 38, -15, -2, 24, -29, 25, -6, -1, 32, -25, 15, 8, -20, 22, -27, 14, 10, -35, 29, -28, 0, 19, -35, 25, -23, -14, 27, -46, 16, -6, -23, 20, -36, 23, 6, -29, 29, -27, 0, 15, -34, 36, -23, -11, 21, -30, 28, -10, -15, 32, -35, 16, -10, -28, 32, -29, 7, 9, -29, 24, -28, -1]
7648aK1n1N6l6jL8o9O3k3j2N2o3L7kl3N0n7L4Pm9O0k0pL2o6N0nk0M6n3L4kk7M7
7682C0m8J4K1m1N7n3RK3m5N4k0j1K5l5L7j6k9N2m8K7Ml8N6l9ML1n2N0k4kL7n2
7714b2L7nl8M7l0K0Jl5N3m5J2K7n6M9k6LK4m1L3Kk3L4m7M6ml5L4k1jK0l7K8%j4
7748a0K2n1N6k2oL2l8K5Jk8M6l2J1J3m2M4k4JJ3l2L6j0k1L8m0K3qj8M1l4J5Rk8
7781a8M8m7J1J6k7K6j5mL2m1K5Lk1L1k8RJ2l0M2m0J8Ql2L6k0%K1k3J9j1KJ6l6
7814a8L2rj6K4k2NJ6l1K3j6J0J3l2K8j1oK5j7R%j6K6k4RNj7K5k0JK4k5K6j1j3
7848cK0k7K3nk0J9pQqrJ1j8J5Jj5J6r%J1j8J9qoJ3rNkoK0oKJ1k6K3k1LJ7k3J4
7887EKj0PMQmk2K0j5pJ7j6J9j4MMqLJ0j7J9j7QLk0J7kljKNJj%rJ7j2OLljOmKp
$$ y = [-1, 20, -31, 25, -11, -12, 26, -43, 20, -3, -15, 37, -26, 11, 9, -24, 26, -31, 3, 10, -39, 21, 1, -6, 26, -40, 10, 5, -15, 31, -22, 12, 10, -17, 30, -18, -4, 17, -24, 33, -20, -11, 12, -33, 21, 1, -10, 15, -20, 17, 1, -28, 24, -24, 3, 7, -31, 25, -14, -10, 21, -31, 19, -5, -7, 30, -22, 15, 10, -28, 19, -11, 9, 10, -25, 28, -17, -5, 22, -34, 15, -11, -8, 16, -25, 8, 10, -13, 21, -26, 20, 16, -19, 15, -6, -7, 13, -24, 4, 4, -10, 12, -39, 17, -5, -11, 21, -17, 8, 9, -19, 27, -5, 6, 19, -23, 21, -3, -2, 11, -21, 15, 5, -16, 22, -18, 5, -3, -21, 20, -14, 1, 10, -18, 30, -17, -6, 10, -17, 9, -6, -10, 22, -19, 6, 9, -12, 19, -9, 0, 12, -18, 24, -16, 2, 10, -22, 14, -6, -6, 15, -8, 11, 0, 2, 18, -18, 14, 5, -11, 13, -9, -4, 12, -19, 4, -12, -2, 11, -21, 7, -4, -10, 15, -2, 7, 7, -9, 17, -7, 2, 7, -10, 15, -5, -4, 20, -5, 21, 10, -3, 17, -10, 13, 8, -12, 7, 0, 8, 0, -9, 2, -16, -1, 0, -15, 1, -8, -8, 3, -15, 4, -4, -10, 3, -6, -1, -3, -9, 11, 5, 7, 18, -8, 15, -6, -3, 14, -9, 5, 7, -3, 4, 8, 16, 12, -10, 10, -5, -12, 5, -11, 8, -6, -2, 2, -6, -3, 7, -10, 9, -8, 0, 3, -17, 0, -2, -5, -6, -4, 1, 2, 1, 1, -8, 9, -3, 3, 6, 3, 2, 8, 4, 6, -1]
7932aQjjj0J5j3QkpPpMpLkOJMj0MojJ1rRkmQj4JJ0oLlJMj2PJ1koPjpJ4JomQj0
7982AoJ0j0J1j2KJ1j9POrNj0J0kNKmKmkQoLkPPj2j0J0qJ7qkNj2OJ0qPj2MNj9K3
8027Gj0MLk4K9j6qK6k5J3%j1K4j7POj1PpoK8l5J6Qj3J4k0J2%k7L0j1J2Pk6J3j
8064b%Qk1L3j9j3K7k8J5roK3j3OJk6K6j0kK7l8K8rpJ2k1RJ1j6J8j0J3Lk6K5j6
8100gNJ1k1J7j4rL1k3J1lj5K9k6OJ9k7K2j6MJ5k8K3j9NL0l7L4k2LJ6k6NJ2j4K6
8135A7k7RJ9k6K0k1JL3m6K5jj8K7l8K5Nj8L1k8PRk4L8l4RK0l3K3rlK4l5K4kj7
8170a4L1l2K5j2j7K8j8NJ4k3J4omK3l2L5j5k7L7k8J9
$$ y = [-1, 7, 6, 5, -5, 10, -3, 5, 3, -4, 3, -4, 0, -7, -4, -6, 0, 1, 5, -5, -1, -7, -8, 3, -6, 3, 1, -3, 5, -9, -8, 2, -4, -1, -4, -3, 1, -11, -4, 7, 5, -1, 6, 5, -2, 12, 13, 7, 3, 11, 1, -5, 5, -5, 6, -6, -4, 7, -12, -5, 1, -8, -3, -13, -3, -5, 0, 2, -2, 0, -4, -6, 2, -4, -1, -3, 4, 11, -1, -11, -1, -9, 8, 0, -2, 3, -9, -3, 7, -1, 6, -6, -2, 3, -16, 7, -3, 1, 4, -20, 9, -7, -15, 11, -14, -1, -1, -12, 12, -5, 2, 8, -3, 4, -3, -9, 19, -16, 0, 8, -5, 9, -11, 1, 1, -26, 4, -7, 5, 12, -14, -1, -2, -2, 6, -15, 18, -1, -14, 13, -15, 0, -9, -15, 8, -5, 1, 2, -24, 2, -8, -10, 17, -21, 7, -2, -9, 3, -18, -9, 2, -14, 4, -6, 7, 10, -16, 9, -7, -2, 9, -12, 5, -9, -18, 13, -10, 1, -2, -17, 12, -14, -8, 11, -16, 6, -10, -6, 9, -19, 4, -15, -10, 20, -17, 17, -5, -2, 14, -12, -7, 5, -9, 17, -10, -1, 18, -8, 12, -9, -8, 25, -21, 4, 3, -15, 12, -26, -1, 4, -14, 17, -11, -4, 5, -19, 19, -15, -6, 14, -19, 4, -5, -8, 16, -19, 5, 3, -14, 17, -15, 10, -2, -19, 9, -9, -4, 10, -13, 1, -5, -9, 14, -18, 17, 2, -25, 12, -16, 3]
8191C
$$ Imaginary data points
##PAGE= N=2
##DATA TABLE= (X++(I..I)), XYDATA
0@%%%%%%%%%qJ6j6J6k4L2m0N6o4P5r9J20j39J63j92K30k70L12l68M30m94N66o44
32c42P32q31R40j062J195j342J502j677J870k080K311k561K834l135L462l817
48b001M208m638N107n623O193o826P532q323R213j0225J1390j2745J4342j6259
62h655J8614k1582K5451l0736L8453n0943P5692k01433K81050n3759j15129K40720
74A97743n25400M69651j00455j74784L52731m05784K56916k932k92808M68430
84B43308l59784J16046J12923l23026M15523k89056j1712K88827l58552L09168
94A43665k07242q5741L86871l67606J90045n5257j68218L95715l58020J16174
104i614J05960k52439L35125k84962M9847K24012l29109K76873j60912l7390K67032
$$ y = [0, 0, 0, 0, 0, 0, 0, 0, 0, 0, -8, 8, -8, 8, -16, 16, -24, 32, -32, 43, -56, 64, -75, 88, -104, 126, -144, 168, -200, 230, -264, 302, -342, 390, -441, 499, -563, 632, -710, 792, -885, 985, -1095, 1216, -1345, 1489, -1646, 1816, -2001, 2207, -2431, 2676, -2947, 3246, -3580, 3952, -4371, 4842, -5383, 6007, -6738, 7604, -8655, 9959, -11623, 13828, -16908, 21545, -29398, 46294, -155139, 125911, 72152, -42977, 197743, -327657, 141994, 41539, -133245, 219486, -186298, 70618, 67686, -225122, 243308, -116476, -430, 112493, -210533, 204990, -84066, -95778, 193049, -165503, 143665, -63577, -149318, 237553, -130053, 59992, 4735, -163483, 232232, -125788, -9614, 96346, -156093, 179032, -105930, -56083, 167929, -161180, 115693, -45219, -82609, 184423]
115A84423l54314K36251k4785j52681K70107l12630J87149P6390k56321K71290
125A24879k22482R6650J36434l06248K73456j26178k5242J79351k93097K47324
135H4847m9591j36303K23723k43706J73688J2671k01134K57782j89712O9115P7723
146G9103k18131K55582j41455k8840J47861k11122K08008q7922r5164K04491k00172
157h7761J32887j7550j32895K25506j83723N8692O2372j58998K07005j47771L44
168d1892J29741j81421J65596q7027m7189J67344j91002J19848j3655r3518J74914
179A01739j74171P5473N1660j36257J64006j30328K8419R6070j63008J44892p3297
190a4802k3976J21187j63980J17976j8865p4667J33845j40831P9685K5242j11181
$$ y = [184423, -169891, 66360, 41575, -111106, 159001, -153629, 33520, 109910, -146411, 124879, -97603, -953, 135481, -170767, 102689, -23489, -48731, 130620, -162477, 84847, 35256, -101047, 122676, -121030, 52658, 65329, -135805, 121977, -67735, 1380, 79103, -139028, 116554, -24901, -53741, 94120, -117002, 91006, 3084, -92080, 112411, -87761, 45126, 27576, -105319, 120187, -63536, -4844, 57528, -101470, 105535, -42236, -41892, 87849, -93572, 72024, -15003, -62192, 105152, -85850, 33998, 20343, -73175, 101739, -72432, 3041, 54701, -81556, 82450, -47878, -19459, 76611, -86397, 58495, -14802, -38778, 82409, -81571, 36405, 17540, -57127, 76718, -64113, 15572, 40814, -70367]
201g0367J36614j04860L2319N9721j26932J27443o6724j5630Q7348j24574J04171
212C8529l0017n5045J06836j10736O9420N677q0971J13806r0562L0704L9569r4490
224e7280J06384o5396n025O7872r8632Q7101l5217l4578Q5720r4079O0924k714
236A5080n7152R0931q0506L2652K6945p2085Q5007n9063N206M9325p8241P1081
248B9180l3070j9397O2360p4803N2076p241l8793O6359o3138L0637J4731n1078
260c2177O2887m6291R205L1122n5615N3524k7432r777M1323n3129M0146r315k4288
273a9817M5447m5386K4828O356l3450M4166l4438R583J8620l7272L8243k1811
285d931l801K6528l6206K9070r142j3930K9606l1149J8522J783k0135K8399k3430
$$ y = [-70367, 66247, -38613, -6294, 53427, -73505, 53938, -12786, -28416, 58932, -65642, 38529, 8512, -46533, 60303, -50433, 18987, 24664, -56307, 57499, -33063, -2359, 37210, -57280, 49104, -16292, -21317, 46555, -52077, 35024, -193, -34771, 50949, -43130, 17794, 15080, -42072, 48859, -31647, 1005, 27950, -44135, 40872, -18191, -12985, 36340, -41901, 29180, -3890, -23287, 39073, -35730, 16346, 9105, -29688, 36671, -26467, 4170, 18901, -32177, 30710, -15581, -6376, 24746, -30869, 22655, -4777, -14554, 26769, -26360, 13786, 4471, -19817, 25630, -19756, 5072, 11428, -22022, 22144, -12294, -2711, 15909, -21363, 16880, -4931, -8732, 17796, -18410, 10660, 1518, -12412, 17194, -13955, 4567, 6350, -13785, 14614, -8816]
298h816Q180R863k2285K3793j4519n93J4316k0525J6967o126o406J4904j5982
311g229R811J23q859J2581j0281L748L616q357Q569m837l73M376n559L910q08
326D31j789K582j627K8R64o61p21K053k078L94K268m421M575k092k220O226p595
343c683N196K45o364J0100r171L490M548j1161J2928q538m39R997j5483J3883
357E548n438o250J5780j8335J2222J23j3141K0628j8671P693P499j9847K3354
370A1165j5968O87J5607k5193K3237j0235q088K3258k7997J9702j822j7490K9161
383A6024k7483J2853Q218k6026L2146k3382L406J8702l2650L1674j5851p798K8403
396A8236l6215K7261n335j9575L5892l5810J9032O972l0283L9964l1218P732J9820
$$ y = [-8816, -636, 9227, -13058, 10735, -3784, -4377, 9939, -10586, 6381, 255, -6151, 8753, -7229, 2582, 2705, -6154, 6427, -3854, -106, 3510, -4847, 3722, -1115, -1488, 2888, -2671, 1239, 431, -1358, 1224, -403, -375, 589, -72, -793, 1260, -818, -424, 1844, -2577, 1998, -94, -2314, 3912, -3683, 1513, 1758, -4606, 5494, -3677, -187, 4361, -6800, 6128, -2410, -2849, 7148, -8335, 5548, 110, -6140, 9640, -8695, 3527, 3650, -9491, 11137, -7534, 159, 7658, -12189, 11165, -4803, -4116, 11491, -13702, 9535, -700, -8788, 14470, -13527, 6175, 4353, -13137, 16024, -11459, 1394, 9612, -16414, 15732, -7650, -4244, 14458, -18192, 13482, -2369, -10167, 18236, -17979, 9282, 3947, -15628, 20264, -15546, 3486, 10458, -19825, 20139, -11079, -3347, 16473]
409A6473l8663L9883k2548n635L1711m3452L5112j0293j9675M0928m3456K5816
421F201M071l2432M6034l8425J2944J8847m2278M6316k8874k131L2426m7989M1448
434A6158j5553j7802M3106m8623L1700P1l2127M9510m4021J8154J6238m3483N0922
447B4250l4721K197L1528n0894M7008k1344j4638M4165n3268L7811m939l0593
459b3438N2537n0197K4351J2768m4073N5529m1564P893K9860n3639N2637k7782
471e118j0087M4068n7736M4173j0350k7800N3600n5290L0912Q364m3207N7715
483B9244m6367J3869K6014n4074N6099l2225n422M0836n8511M8644j5194k4490
495b1577N1822n6309L5712K730m0668N8301m8566J8134K0595n1786N8882l6795
$$ y = [16473, -22190, 17693, -4855, -10490, 21221, -22231, 12881, 2588, -17087, 23841, -19615, 6201, 10272, -22160, 23874, -14551, -1607, 17240, -25038, 21278, -7596, -9727, 22699, -25290, 16158, 605, -17197, 25909, -22714, 8986, 9057, -23070, 26440, -17581, 573, 16811, -26672, 24250, -10471, -8274, 23254, -27640, 19368, -1976, -16614, 27551, -25717, 12094, 7155, -23438, 29099, -21098, 3253, 16021, -28052, 27477, -14087, -6194, 23666, -29973, 22664, -5118, -15205, 28863, -28873, 15300, 4950, -22850, 30750, -24540, 6372, 14736, -28471, 29244, -17123, -3254, 22760, -31314, 24785, -7440, -12862, 27974, -30537, 18107, 2913, -21577, 30245, -26064, 9648, 12378, -28290, 30011, -18555, -421, 20174, -31612, 27270, -9525]
507i525j694L7493n7138N2382k1940k0475N1660n7654L9393l972l6139O0381n3823
520b1051K2285J6478m8295O1110m4538M204L6273n7111N4156k8806j3012N0952
532C2645o1615M2375p828k9598N7862n9202K8502J4183m5510N7758m7770J2810
544e388L1944n7857N3527k9256n725M3284o2396M6781r093k6430N0209n7066L5737
557H271Q181m5060N5272m4299J8057K1891n5890N7608k9677m614L4943n7011N3146
570B0818j6637k6294M8964n1929L8795l343m0827O0237m5657J7351J3963m7237
582c1796O2162l9151l578L4737m9963N2135k8237j8337N2300n2877L4913r144
594C164k8138N9088n3752J8474J5030l7993N4065m6439O361L5454m9481M3622
$$ y = [-9525, -11219, 26274, -30864, 21518, -422, -20897, 30763, -26891, 12502, 8530, -27609, 32772, -21051, 1234, 17712, -30583, 30527, -14011, -9807, 26466, -30645, 23511, -5295, -18307, 32645, -28970, 13405, 5577, -24021, 33841, -25361, 3141, 17324, -28186, 29572, -18198, -5388, 26556, -31301, 22226, -7030, -12755, 30529, -31867, 14914, 5821, -20609, 29600, -27466, 8271, 16452, -28608, 26664, -17635, 422, 22313, -33577, 24031, -5646, -10260, 24683, -32328, 20818, 4181, -22113, 26851, -25078, 13717, 10374, -30453, 29784, -15873, 1478, 15441, -31796, 30366, -8785, -12363, 22374, -27589, 24546, -3691, -22028, 30272, -22605, 12308, 3164, -24974, 34114, -19638, -1164, 13866, -24127, 29938, -16501, -10140, 25314, -24167, 19455]
606A9455k8445m797M5376n7662L4724m792k0091M5774n5310K7996J4990l8710
618b1492M3749m0996J7778K5637n3085M4508k1694n86L0756n5577M4738o308k3499
631a6071L7484m6555L6753K809m1019M7316l4247J7958J1302m6787N3615k5621
643c063n095K4922m3661M8533j9402k2504M1361l9358L1900r118l0024N1867l7943
656a1585J2081Q421l2150N0007l5669k272K8393l5772L7900k5790r867M1491m1733
669a6545K4142p255j6287M2901m3991J5188J2982k6726L6887l6466R377K6300
681B0507l8976L1257k0195J90L0613m5350K8837k939j4729L1002m1149K5412Q609
694A3089l0400L3084k9426J5504J4729l9370L6412j7154p91K0327l8752L5523
$$ y = [19455, -8990, -13787, 31589, -26073, 8651, 3859, -16232, 29542, -25768, 2228, 17218, -21492, 22257, -18739, -961, 24676, -28409, 16099, -5595, -6181, 24575, -31002, 13736, 7428, -16071, 21413, -25142, 11611, 14420, -26599, 20717, -13530, 4428, 15730, -31057, 22558, -3063, -8158, 16764, -26897, 21636, 2234, -20270, 21091, -18267, 13633, 4515, -25509, 26358, -11585, 496, 8917, -23233, 26774, -8895, -11167, 17226, -18546, 19354, -6436, -16303, 25188, -16545, 7597, 342, -15945, 26956, -17035, -1847, 11135, -15591, 21296, -15170, -5793, 20507, -18469, 12788, -7407, -7217, 23396, -21954, 6883, 3944, -10785, 20217, -20932, 4480, 13089, -17311, 15773, -13653, 1851, 16580, -22790, 13622, -3532, -4323, 16004, -22748, 12775]
706A2775q493j7134K8215l2282K6562j838k7073L5756k5726J1642O905k9563L7549
719A7295k0956k930J8457k8528L1189j5220j2361K8774k7967J9977n555j7183
731a5008L3147k7632R291P189k1062L0624k4122J654J8540k5744K4562j5591m418
744h570K4775k9279J8677m057j1559K6144k8477J3551O540j9612K5147k2443P347
757a816J3723k5698K3557j3505j026J7901k7266K0961m837j0310K0727k4244J5845
770D012K165j7673K2634j8625P919P939k1194K2557j2619r05J3216k1168J9397
783G655o925q252J7624j9257J3570r91j3068J9903j6474O666N262j5715J9267
796I265j2790L35J0937j7016J6279p939m834J4859j7148J2035k149r117J6534
$$ y = [12775, 4282, -12852, 15363, -16919, 9643, 7805, -19268, 16488, -9238, 2404, 9309, -20254, 17295, -3661, -6591, 11866, -16662, 14527, -693, -13054, 15720, -12247, 7730, 2175, -15008, 18139, -9493, -202, 6987, -14075, 16549, -7573, -5919, 12621, -13123, 11439, -4152, -8570, 16205, -13074, 5603, 1546, -10013, 16131, -12346, 1205, 7745, -11867, 13280, -9163, -1816, 11907, -13791, 9766, -3739, -4765, 13136, -14130, 6831, 1994, -8316, 12411, -11833, 4012, 6177, -11496, 11138, -7487, 432, 8371, -12823, 9734, -2885, -3790, 9426, -11742, 7655, 730, -7522, 10102, -9155, 4415, 3424, -9644, 10259, -6215, 451, 5713, -10002, 9265, -3525, -3190, 7747, -9269, 7010, -929, -5763, 9096, -8052, 3983, 1834, -7283, 9251]
809I251j5684P341L606j2517J6129j2396K534Q279j4595J4227p817k207J1373
822G524j4896J1246k798o493J2850j3329P445J768r664J2870j0331L154N443j1249
836f460J1590o707r65Q036j1320R240k944m397R460j0133O201M91o770R704q132
851c106K963L401q074Q926n686m9N582q408P362k995k617O872p870N268l70m545
867c346P258o612K992J873n710O808m797P08L568o069N689k734j287M551n614
882b722M073p80k686M731m538K329Q18l426M303l170P10J893l482L382j742n62
898h69K402l004K229n31j271K324k223J165K92j475J877j393L53P13j322J262
914E29o41j74P63q70N76j10k81M30l19P1R3o0q2K01j77n4M03o44N59j12n21J011
$$ y = [9251, -6433, 908, 4514, -8003, 8126, -4270, -1736, 6543, -8052, 6175, -1642, -3849, 7524, -7372, 3874, 1076, -5417, 7433, -5896, 1549, 3317, -6347, 6523, -3808, -654, 4789, -6460, 5130, -1577, -2542, 5494, -5826, 3414, 470, -3927, 5533, -4600, 1601, 2092, -4678, 5026, -3106, -143, 3258, -4816, 4110, -1576, -1625, 3957, -4451, 2911, -84, -2701, 4171, -3699, 1569, 1199, -3346, 3912, -2700, 292, 2165, -3545, 3263, -1534, -826, 2742, -3327, 2362, -372, -1659, 2892, -2722, 1351, 571, -2115, 2616, -1922, 407, 1225, -2201, 2102, -1068, -358, 1535, -1947, 1435, -307, -869, 1533, -1471, 758, 227, -1044, 1280, -943, 222, 514, -961, 916, -477, -124, 589, -733, 529, -112, -286, 477, -393, 183, 73, -208, 222, -97, -26, 67, 7, -75, 126, -51, -105, 298, -346, 213, 101, -420, 591]
936E91j094O12K93j178J582j261K59R92j891J957j071m08J841k506J997m81j382
953a148K700k808J588M86k429L318k686P40J651l376L584k095m40K882m080L395
969A282j080j825L991m349K667L12l267M792m114J480J936m539N089l299r1L553
985B538n441M848j986j912N023n855L970j89l765O048n551K453J858n366O437
1000C110m549N02L870o500O140k917j717N623o971N067p72l914O844o641L341
1015E16J567n815P377n529J110L883p138P119l797j333N914p806O095j538l780
1030c155P423p671M350J030n984Q237o714K064L602p665Q224m993n85N980q669
1045d526P345k608l359P850q763N593K12n916Q895p834L166L063p951R086o004
$$ y = [591, -503, 109, 402, -776, 806, -455, -196, 796, -1095, 862, -209, -617, 1224, -1282, 715, 234, -1148, 1552, -1256, 332, 818, -1611, 1707, -979, -239, 1412, -1964, 1620, -475, -915, 1967, -2113, 1282, 202, -1623, 2368, -1981, 686, 998, -2269, 2523, -1591, -111, 1825, -2714, 2375, -924, -1015, 2538, -2903, 1945, -41, -1953, 3070, -2785, 1185, 996, -2769, 3279, -2272, 181, 2039, -3327, 3110, -1439, -937, 2933, -3567, 2573, -344, -2061, 3562, -3409, 1658, 886, -3028, 3816, -2825, 516, 2083, -3732, 3645, -1884, -774, 3109, -4029, 3090, -707, -2040, 3874, -3932, 2163, 625, -3155, 4268, -3403, 947, 1977, -4007, 4230, -2484, -420, 3182, -4483, 3741, -1252, -1837, 4143, -4526, 2819, 211, -3148, 4702, -4061, 1532, 1744, -4172, 4723, -3111, 55, 3118, -4833, 4253, -1751]
1060a751K19N700r097Q255l468k881P793r191O434n71n643R105q308L826K419
1075B841p728R479o633P46N289q995Q770m331k322P729r420P012j498n029R366
1090E276r081M572J713p302R940p881J799M939r075R345n628j087P598j0183P891
1105B836k482m001R225j0206N888J038o891R809q787L327M222r308R634o113J18
1120a691O613j0496Q753k875l484Q264j0074P000J63o811R479q356M097K797r000
1135e621J0142o120L15N329r643R590l923l414P962r237P431j574o111J0142q562
1150c294M120J466p655J0868p688O95N148q638R677n953k010Q458r604P233k806
1165A7m093J0175j0161M633J428o279R953r224K437N314q747Q606o268K04P558
$$ y = [-1751, -1532, 4168, -4929, 3326, -142, -3023, 4770, -4421, 2013, 1442, -4201, 4904, -3404, 422, 2841, -4887, 4592, -2041, -1295, 3994, -5001, 3769, -562, -2884, 4845, -4575, 2437, 939, -4090, 5276, -3805, 767, 2480, -4822, 5118, -2763, -964, 3975, -5100, 4245, -1383, -2470, 5128, -5055, 2836, 354, -3647, 5578, -4628, 1260, 2298, -4593, 5216, -3571, -244, 3978, -5330, 4304, -1809, -1691, 4922, -5574, 3179, 304, -3180, 5084, -4990, 2010, 2173, -4638, 4841, -3515, 582, 3379, -5621, 4521, -1599, -1284, 4045, -5598, 3992, 69, -3345, 4617, -4620, 2811, 1237, -4874, 5268, -3294, 826, 2292, -5363, 5505, -2183, -1488, 3660, -4978, 4699, -1254, -3264, 5194, -4410, 2823, 17, -4076, 6099, -4062, 571, 1999, -4280, 5673, -3551, -1114, 4200, -4547, 4059, -2209, -2005, 5553]
1180E553j0611P301k100k851Q149j0541O132J623o526Q249q261M186L864r422
1194e255Q644m941P80N139j0216Q840k188l471O696q995P585m16o922Q785p073
1209c008M321J298q365J0294n698J47L989q229R802m705l245P397p888P087k844
1224C53n018R890p993L494O05n819J0043p862O72M737o920Q115o138r71P711q494
1240c595N654k487k523Q430r253L927J670m866P568p998K737M574p561O642m895
1255a976Q87N695r188O366j460k177N992q700N893R33n566O652o587M108K226
1270C098p733P680m296Q81L470q005P975k689k644N385p017O489j435m997P402
1285C564n954L517M22n837Q291n269L82L120n946P317m275j785N741o153N065
$$ y = [5553, -5058, 2243, 143, -2708, 5441, -5100, 1032, 2655, -3871, 4378, -3883, 303, 4167, -5255, 3389, -1552, -772, 4367, -5849, 2991, 803, -2668, 4028, -4967, 2618, 2202, -4720, 4065, -3008, 1313, 2611, -5754, 4540, -1158, -1011, 2978, -5251, 4551, -154, -3399, 3998, -3890, 3197, 353, -4665, 5225, -2768, 726, 1331, -4488, 5555, -2307, -1635, 3102, -3818, 4297, -1841, -2812, 4899, -3595, 2059, -428, -2951, 5479, -3774, 153, 1823, -3043, 4525, -3473, -736, 3838, -3723, 2919, -1976, -1089, 4606, -4582, 1784, 324, -1853, 4139, -4561, 1332, 2265, -3301, 3351, -3236, 872, 3098, -4635, 3045, -1251, -370, 3100, -4905, 3070, 381, -2263, 3122, -3895, 2594, 1159, -3838, 3564, -2390, 1127, 1549, -4288, 4003, -1266, -884, 2236, -3710, 3607, -668, -2453, 3288, -2865, 2200]
1300B200k222l021P076o397K781O73m041O808n902J142L369n306N649m193j64
1315a548M995o410M512j689j752N466o566L626O75l681N431n510K477K354n381
1330c001N391l692O98L397o098N173j862j494M227n730M370l64l417N026m718
1345b094K714R91m548N408l530O22K391m802M976k338j248L706m596L785r91k558
1361b112M565m170K198N54l341M683l498O75K063l835M140k464n80L197m075L231
1377A231j131j646L790l966K229L01k613L896l413J200J512l334L653k444N9K428
1393A752l679L138j271j069K995l569K386j22k053L244l006J393R12k721L169
1408A499k196K85J754k964K746j254p43K332k833K035k88j548K598k427J172N74
$$ y = [2200, -22, -3043, 4033, -2364, 417, 1090, -2951, 3857, -2045, -903, 2466, -2840, 2809, -1384, -1548, 3447, -2963, 1549, -140, -1892, 3574, -2992, 634, 1309, -2372, 3059, -2451, 26, 2380, -3001, 2390, -1302, -604, 2793, -3305, 1868, 6, -1488, 2739, -2991, 1379, 1015, -2402, 2624, -2094, 620, 1611, -2937, 2471, -1059, -437, 1954, -2848, 2128, -210, -1458, 2248, -2348, 1437, 446, -2112, 2453, -1717, 481, 1035, -2306, 2377, -1121, -446, 1617, -2218, 1922, -542, -1122, 2075, -2000, 1231, 100, -1546, 2244, -1722, 507, 808, -1805, 2091, -1322, -122, 1390, -1944, 1709, -735, -676, 1752, -1927, 1211, -60, -1129, 1866, -1703, 683, 561, -1492, 1752, -1254, 139, 1051, -1670, 1499, -697, -412, 1342, -1622, 1124, -130, -873, 1459, -1374, 661, 373, -1175, 1423, -1004, 168, 742]
1424G42k031K535j837L20J278k269K219j147m42J768k254J712m06j064K027k040
1440h89J110K74j486K015j625M97Q45j751J833j080j40J261j778J477n08o57J480
1457H78j606J008K7j013J489j263M76M84j199J339q44j1P98j181J026m08l86R53
1475E67j037O46%o24R34q08L16K92p12P90n15J4M50o73N80k34j89N06n56L49j4
1496H2l01M69l93J58J15l06L31k05J3J60k40J92o3o7J41j27M0K6n8M3J3n7M4K7
1520C7r9J29p9l8J56k27J88l3j68L01l05J67Q4l31M45l37N1K95n23M97k44j44
1542a78N13o54M80q0l93P05o87L49J77o53Q38o33J20M75q81Q76m66j81P85j044
1562e32Q08k06n16J039j091O30J61q88J212r88K87N70j179J266p45j40R71j369
$$ y = [742, -1289, 1246, -591, -271, 1007, -1262, 957, -190, -632, 1136, -1118, 594, 188, -876, 1151, -889, 221, 495, -991, 1024, -601, -104, 741, -1010, 823, -257, -397, 864, -914, 563, 55, -602, 878, -728, 280, 307, -706, 783, -480, -4, 480, -719, 620, -224, -235, 563, -618, 408, 0, -386, 567, -470, 176, 176, -448, 486, -322, -6, 286, -426, 364, -151, -137, 313, -360, 220, -14, -203, 303, -253, 96, 82, -219, 250, -143, 15, 130, -176, 155, -50, -37, 123, -117, 75, 12, -55, 86, -41, -1, 25, -33, 10, 23, -34, 10, 37, -62, 67, -12, -50, 106, -121, 67, 34, -134, 167, -138, 29, 113, -218, 227, -110, -59, 236, -287, 210, -34, -178, 335, -319, 161, 81, -312, 393, -294, 55, 232, -421, 417, -216, -96, 379, -502, 374, -92, -273, 512, -532, 276, 70, -446, 593, -498, 132, 293, -595, 617, -371, -84, 486, -693, 573, -172, -312, 659, -710]
1580g10J145l71o01J309j426Q72J19j067J528j278M30O35j429J570r76q2J114
1597G82j653J425n30o42J542j728J118J2j171J804j601O53O14j609J868j265O3
1614c18J197j922J772p97n66J693k046J466j90j197K032j947R59N05j752K190
1630A079j617K99J171k125K099j089m37J765k288J746l87j178K193k191J176L94
1646F10j801K383j824M32J144k230K294j256l86J837k435J940n44j148K326k383
1662a041J342K79j785K533k094O22J123k314K494j570j51J848k634K177p91r66
1678i28K376k690J679P7j732K641k421R97R79k411K679j818J35J732k804K457
1694I48r68q37K295k823J969p3j757K665k453J209P50k463K850j858K07J530k764
$$ y = [-710, 435, 64, -537, 772, -654, 218, 337, -730, 798, -480, -50, 585, -844, 726, -250, -332, 782, -871, 554, 24, -618, 924, -804, 314, 326, -845, 959, -642, 11, 625, -984, 884, -381, -318, 879, -1043, 729, -68, -634, 1059, -987, 479, 289, -908, 1124, -823, 136, 641, -1111, 1079, -538, -239, 932, -1193, 906, -183, -620, 1145, -1143, 603, 216, -962, 1231, -960, 216, 610, -1191, 1192, -632, -200, 944, -1286, 1008, -248, -634, 1203, -1232, 708, 164, -984, 1342, -1041, 301, 580, -1205, 1328, -766, -144, 979, -1335, 1159, -411, -562, 1286, -1348, 829, 38, -928, 1448, -1242, 437, 514, -1218, 1423, -998, -1, 978, -1433, 1246, -572, -437, 1295, -1509, 948, -20, -857, 1438, -1385, 584, 511, -1246, 1419, -1034, 175, 925, -1538, 1312, -546, -339, 1191, -1573]
1711a573K680j131q68K253k730K133l73j722K825k494J238M95k275L044k128K43
1727c83J473k598K806j586o36K373k777K171p52j326K941k878J395L74j946L008
1743A659k624O42J527k614K690j873p9K293l103K237p21r55K611l151J763M56
1759G58j981K665k582J102J313k839K663j602J34J827l178K555o13j095K242k882
1775a513K143J25k178K709k250J226P15k732L056j633k5J431k748K942j180j143
1791a055K331k548K190o09j803L061k408J068L47k112L205k263O5J551k339K679
1807A360j760o06K521k653J828p13j104K883k855J102O23j741K651k508N63J681
1823A272k479K195j525m2K175k977J865l12r22K238k864J592O40j972K253k120
$$ y = [-1573, 1107, -24, -892, 1361, -1369, 764, 391, -1331, 1494, -1000, 238, 733, -1542, 1502, -626, -383, 1090, -1508, 1298, -288, -924, 1449, -1328, 843, 91, -1235, 1706, -1172, 223, 597, -1349, 1659, -965, -323, 1204, -1410, 1280, -593, -672, 1621, -1482, 755, 34, -921, 1690, -1461, 302, 758, -1223, 1442, -1140, -38, 1275, -1564, 1099, -503, -369, 1458, -1720, 835, 222, -873, 1369, -1513, 630, 755, -1423, 1286, -964, 262, 977, -1755, 1301, -332, -357, 1074, -1674, 1268, 88, -1055, 1276, -1272, 918, 309, -1494, 1567, -841, 227, 574, -1538, 1667, -596, -531, 1020, -1319, 1360, -400, -1006, 1515, -1138, 690, -23, -1127, 1756, -1099, 3, 626, -1115, 1536, -972, -409, 1272, -1207, 988, -537, -579, 1596, -1381, 484, 172, -750, 1488, -1376, 216, 856, -1116, 1137, -983]
1839i83J027J162k681K367j205K5J493k797K402n12j119J939k392J933l7j968
1855a346K465j853R72N07k285K728j434j63J282k209K428j060j007K108k093J617
1871F57m14j474K592k017O80N25j714K474j771o4J485j971J944j174n78K112k226
1888i34J326k36j042K213k189Q03P06j584K018j751L62J337k077J763r78k20J653
1905A170k279J523j76r58J790k043J169M43j609J869j512N71Q91j983J896r24
1921a62k08J282j985J665l80r48J643j717J144J29j439J882j377M30O58j619J814
1938H12r79k64J196j644J459m92p83J577j556R30N1j120J709j373L94O26j360
1955h17J586j051n6J081j508J293n61m83J350j519R48l2q68J433j327N54M51j176
$$ y = [-983, 44, 1206, -1475, 892, -313, -288, 1205, -1592, 810, 298, -821, 1118, -1274, 659, 622, -1346, 1119, -734, 238, 745, -1540, 1188, -246, -409, 873, -1336, 1092, 32, -975, 1133, -960, 657, 243, -1231, 1361, -656, 24, 549, -1165, 1309, -462, -526, 959, -1012, 932, -242, -820, 1292, -934, 392, 156, -886, 1327, -862, -59, 647, -937, 1081, -670, -308, 1029, -1048, 715, -263, -483, 1170, -1109, 414, 238, -720, 1070, -973, 196, 639, -970, 899, -613, -42, 849, -1134, 762, -162, -370, 912, -1073, 592, 212, -736, 907, -810, 334, 463, -976, 906, -471, -41, 617, -1002, 812, -167, -431, 765, -879, 580, 88, -695, 882, -674, 256, 307, -813, 896, -477, -83, 543, -817, 769, -282, -338, 743, -765, 528, -33, -516, 834, -685, 263, 231, -637, 796, -531, 23, 474, -702]
1973g02J375j002J43Q06j344J213n65l16J077j328R32j11p03J172j137N77K76
1990C63r70J176q51J53O30j112J055n15k38Q68j100Q22j48n68R84r57N15J70p73
2009d96R94p50J67M70q94Q97m87j18O61r03P16k20l56P74q16M80M3n45Q01o72
2029b54K30K97o61P28m63rM56o66N77k34k19N66o33M17k8l74N81n06K16J66m55
2050b68N21l53J8K98m63M26j90j14L40m15K89l8k13L64l37J55P3k68L41k37L7
2071c4J50k67K63j38l0J68k18J72n4q1J73j71R8Jr2J35j17O1J4p0Q8p3L1J1l2
2096a2N0n3L6k5%L1o2P1o6L1K6q0J17j01L0N8j30J56j06PJ17k02J93q2p7K04k42
2123a11J75k1j57K81k85J46P3k49L23k67O0J84l61L77k12m4K97m32L49j13j80
$$ y = [-702, 673, -329, -186, 620, -724, 489, -76, -392, 685, -643, 289, 178, -525, 647, -490, 87, 363, -607, 569, -282, -129, 501, -611, 444, -71, -309, 559, -541, 281, 133, -435, 549, -408, 107, 277, -496, 498, -252, -85, 385, -509, 388, -99, -217, 444, -459, 257, 37, -319, 455, -361, 119, 162, -383, 418, -254, -24, 273, -388, 340, -123, -132, 324, -342, 235, 1, -218, 348, -285, 132, 104, -270, 311, -195, 21, 187, -268, 253, -100, -82, 216, -247, 179, -11, -125, 215, -200, 89, 51, -162, 202, -135, 20, 93, -175, 166, -71, -34, 116, -151, 112, -26, -56, 112, -106, 66, 12, -69, 104, -67, 31, 32, -60, 75, -42, 19, 33, -37, 51, -22, 9, 20, -12, 38, -15, 21, -4, -4, 27, -35, 36, -30, 1, 27, -53, 64, -37, -7, 51, -79, 77, -29, -22, 95, -107, 86, 4, -73, 131, -111, 64, 43, -114, 167, -118, 28, 101, -148, 175, -92, -32, 152, -209, 168, -44, -88, 209, -223, 126, 13, -167]
2144a67M10m49K71K9l35N03m34J51K07m80N47l45j2L79n80N23k25j93N39o25M02
2165A16Qm14O46n92K53K16n82O97m87L1M49p38O86l19k07O47p84N61o9m65P88
2186D41p51L62K06o92Q56o41J15M78q42Q21m26j79P29r38P21j66m75R04r20N06
2206A09J44p35R85p95K17M76r36R79n60j24P61j060Q58k50m80R85j054O34R7p84
2226e33J113r28L09M61j029J126o72r0P99j168J003l64m56J064j165P49J6q12
2244e77J234j062M08M06j051J252q46J0Q02j228J121n04l81J109j295Q72r3p34
2262e57J283j231N61L55j072J325j012J64P96j331J240o30k68J099j436J035j60
2279A61p13J298j349P20L00j131J403j080K91P10j426J395o91k24J036j485J225
$$ y = [-167, 243, -206, 65, 94, -241, 262, -172, -21, 186, -294, 253, -92, -104, 275, -305, 218, -7, -200, 339, -286, 116, 124, -290, 356, -236, 17, 233, -349, 348, -139, -108, 341, -397, 289, -30, -237, 410, -374, 187, 118, -347, 441, -310, 52, 258, -434, 422, -219, -104, 374, -468, 353, -73, -252, 477, -461, 260, 94, -381, 523, -397, 109, 253, -482, 503, -292, -75, 401, -535, 444, -116, -240, 521, -539, 319, 69, -411, 574, -480, 154, 251, -533, 580, -348, -39, 422, -607, 519, -153, -243, 556, -612, 391, 27, -429, 635, -530, 219, 235, -577, 657, -405, 3, 409, -642, 610, -236, -226, 576, -652, 469, -35, -416, 693, -602, 270, 177, -557, 726, -505, 56, 411, -661, 664, -348, -184, 612, -719, 521, -109, -377, 722, -714, 321, 161, -552, 746, -603, 117, 417, -714, 689, -391, -100, 610, -816, 579, -112, -336, 700, -785, 440]
2296D40k84p35J324j371Q70J27j141J531j162L73N56j373J554r00j53J021j451
2313g74J348n55o31J417j447R42q5r65J637j385M68M93j224J565j156L2J046j463
2331g37J316p09l81J428j642J006q6q12J542j587O65N38j270J483j215K75R82
2348G96j649J386o62k27J230j771J237q7q43J389j568R66L44j390J555j146M44
2365DO52j640J638p30k39J016j610J502m12q54J436j431J056o2j226J764j241
2382c77L84M39j347J778j079k16J089j429J433p42o14J587j507Q99j67q88J766
2399A009j552M44N62j186J580j317J11J150j539J274p38k57J441j775J029l3p48
2416e45J452j653P88N41j298J417j221M45Q51j673J417o48j35J057j726J356j84
$$ y = [440, 156, -579, 745, -626, 244, 371, -770, 761, -401, -28, 528, -845, 709, -191, -344, 677, -774, 574, 19, -612, 805, -642, 300, 215, -750, 887, -498, -30, 463, -761, 804, -352, -320, 726, -737, 579, -130, -511, 917, -725, 281, 195, -617, 925, -662, 3, 541, -729, 754, -461, -186, 796, -853, 533, -129, -356, 874, -897, 340, 253, -590, 799, -769, 197, 541, -849, 706, -440, 4, 656, -984, 654, -76, -315, 701, -909, 593, 181, -673, 763, -668, 388, 326, -900, 864, -377, 7, 446, -901, 877, -202, -418, 671, -758, 675, -67, -681, 906, -601, 298, 131, -757, 1009, -543, -99, 463, -723, 857, -460, -349, 801, -738, 536, -202, -459, 982, -793, 236, 203, -545, 907, -746, 42, 583, -715, 702, -519, -74, 777, -896, 521, -127, -262, 795, -931, 425, 241]
2433B41p96J273j453J047J44j296J529j094M65M82j475J618p85k13R12j411J420
2450F08n07p41J379j319R22j17j007J611j214L51M36j154J551j041j11J004j310
2467f59J228o74m24J352j420Q40j14p13J421j375N02M74j054J311j094J85Q75
2484F61j344J152o21j70J061j432R76j31o07J136j289P49K58j010J198r67L55
2501b5N75j264J208o02j28Q19j262J082k79n77J043j115P53N8q99J212r24L17
2519hM00j035J191o85j19P42j049R71l99m29R94j030O72m5o70J098r50L40L43
2538C32q51J045p51M9O49r68Q72m39k38Q33r86O72j01n07R05q83M16K28p17Q82
2558D42o88J57M76q53Q07m17j44O47q61O64j38m15P57p74M29J23o10P89o09J74
$$ y = [241, -555, 718, -735, 312, 456, -840, 689, -405, 60, 542, -933, 685, -100, -313, 599, -812, 608, 101, -640, 739, -580, 342, 225, -782, 829, -385, -34, 402, -752, 799, -242, -353, 651, -659, 569, -105, -529, 823, -597, 243, 129, -584, 837, -538, -36, 438, -616, 695, -399, -214, 661, -683, 469, -152, -322, 739, -693, 283, 152, -455, 681, -608, 141, 399, -611, 587, -380, -25, 550, -714, 494, -108, -236, 583, -679, 403, 124, -453, 590, -525, 228, 286, -613, 599, -325, -8, 392, -643, 548, -137, -256, 486, -563, 408, 9, -420, 574, -456, 216, 171, -499, 599, -351, -11, 332, -519, 526, -225, -176, 473, -495, 377, -62, -300, 533, -453, 219, 118, -389, 516, -367, 49, 277, -440, 442, -246, -89, 387, -466, 341, -76, -220, 427, -434, 230, 92, -323, 434, -340, 89, 212, -398, 391, -218, -44]
2578d4L50p09P43m19r4N33p22N94j90k89O22o70M13K5m55O54n41J86K39n48O06
2599B84l92%L91n82N07k11j89M91n56L68j7l32N09m58K01J38m00M82l39N7K38
2620A90m36M23k00j10L54m03K88m4k27L74l49J69P7k75L47k59N5J71l01K94j71
2641c3m2K10k75K04m1j37K49k40J22M2j55K00j63N3P7j60J58r6KJ04j51J19l4
2664A3n1J02j01N9Kn7P8o6M3Rn4M5l3J1J3j1J4k2J3j7K5k4mK7l5K8j3k3O6p5O1
2695B3ro2J23j21O0K9j13J47j17K5R1j62J69r5k7J51k13J84n2j06K14k34J22L8
2719F5j81K59k20O3J32k85K93j77j2K19l23K76j04j28L15l63K27Qk40L93l58J35
2741fJ50l55M09k70J1K71m35L96j78j30M04m91L32l1k86M90m73K24J35m54N46
$$ y = [-44, 306, -403, 340, -79, -173, 360, -362, 232, 42, -247, 375, -295, 118, 143, -312, 342, -199, -13, 226, -322, 284, -108, -108, 283, -299, 208, -3, -192, 299, -257, 111, 94, -238, 271, -187, 14, 152, -248, 234, -105, -48, 190, -246, 177, -23, -133, 221, -182, 106, 62, -165, 209, -140, 29, 106, -169, 178, -81, -26, 145, -156, 138, -33, -75, 135, -140, 64, 23, -114, 135, -105, 17, 59, -96, 104, -59, -6, 71, -89, 69, -27, -25, 79, -72, 47, 13, -38, 64, -37, 22, 24, -33, 45, -21, 22, 31, -23, 22, -11, 0, 13, 2, 16, -6, 7, -10, 15, -9, -13, 14, -21, 7, -6, -29, 37, -38, 23, 14, -48, 75, -46, 14, 43, -70, 77, -40, -15, 76, -86, 83, -12, -39, 112, -101, 83, 31, -75, 139, -95, 27, 65, -116, 143, -77, -14, 118, -167, 126, -51, -63, 156, -167, 109, 5, -123, 192, -171, 56, 64, -176, 217, -141, -6, 144, -211, 198, -72, -61, 210, -225, 171, -7, -137, 267, -224, 108, 77, -209, 281, -192, 32, 167, -287, 259]
2762B59l81O1L02n34N24k73j15M63n94M44j01l00N67n74L21R7m80O34m94J41K88
2783B55n90O23l67n9M74o79N66j97k80O42o97M28L1m94P31o23K30K67o53P52m80
2804a20j9M97p63O76k61k81O90p89N27l2n02Q29p45L18K37o94Q47n98O3M97q30
2825d53P81l81j96P03q79O53j29m47Q35q39M37J60o79Q94p10J80M58q67Q71n08
2845a16r7O78r45P56k02m19Q66r40N48R2o82R51p97K89L78q92R65n85l7O49r93
2866e33Q78l19l77Q67r74O64oo73J010q66L58K91q49J040o94K8O06r84R55m75
2886e3k94Q87j031P42j50n56J040r84M69K02p91J074q46J61N65r69R66n72j44
2905b84Q40j084P95k02m61J002j097N94J80p60J023r12L31M85j035J026n99j6
$$ y = [259, -122, -61, 241, -293, 231, -42, -157, 306, -288, 156, 55, -245, 322, -252, 69, 166, -314, 320, -174, -33, 255, -335, 288, -79, -138, 336, -343, 223, 26, -254, 388, -309, 119, 150, -344, 387, -236, -6, 261, -392, 360, -120, -139, 358, -405, 271, 10, -271, 419, -370, 157, 125, -377, 452, -293, 25, 262, -432, 415, -183, -120, 377, -453, 328, -53, -249, 454, -425, 228, 99, -348, 487, -352, 85, 245, -434, 460, -250, -70, 388, -479, 392, -116, -213, 465, -480, 276, 74, -345, 521, -419, 129, 221, -461, 490, -307, -18, 360, -532, 433, -152, -189, 460, -533, 345, 26, -351, 516, -458, 206, 200, -473, 537, -329, 29, 320, -529, 511, -183, -155, 451, -533, 422, -53, -347, 540, -491, 251, 101, -455, 585, -399, 70, 272, -519, 555, -291, -130, 435, -534, 432, -140, -284, 556, -528, 267, 65, -396, 606, -491, 103, 283, -477, 546, -366, -35, 450, -585, 441, -158, -174]
2923a74P23j150R23k53m16Q88j079P55M2p86J051q90M27L16j007J134o66QN92
2942D38j057J053m37l79Q93j012Q01j66o73J127r48M40J69q28J175q23N9N88r48
2961e28J023o15k28R21j054P68k66m62J082j081M92J94p19J054r51K42N83r67
2979e12R41o33k5Q19j159Q34k32l56R10j138O81J47p35R64q99M17M22j026R98
2998D18n87M5O03j087R82l17l72Q01j011Q03o6p18R97q42M54J82q72J093o79M2
3018a31M96r27J026n18l00Q26r28P51k36n12J017r19M19J46o98J035q11J29N29
3037C94q52Q99n95j07P84r78P08k26l64R05r95N05J53o33R04q52L11M30q66Q60
3057C85n61L7O11r70P63k49k89P39r26O28K5o02Q54p76L80K53p86Q77n40M3M71
$$ y = [-174, 549, -601, 322, 69, -347, 541, -538, 217, 259, -527, 524, -366, 61, 377, -630, 504, -162, -154, 438, -619, 434, -3, -382, 511, -501, 300, 134, -539, 588, -360, 80, 249, -579, 596, -227, -168, 420, -528, 495, -120, -348, 573, -481, 287, 21, -441, 641, -440, 52, 246, -473, 581, -370, -128, 455, -512, 429, -204, -229, 590, -569, 265, 33, -323, 587, -551, 130, 277, -458, 506, -393, 24, 446, -580, 418, -169, -124, 479, -608, 374, 57, -315, 486, -525, 278, 212, -506, 491, -351, 103, 285, -587, 506, -173, -131, 365, -562, 464, -54, -354, 472, -456, 295, 59, -453, 564, -355, 64, 210, -488, 547, -264, -135, 394, -458, 441, -154, -261, 523, -455, 253, 27, -337, 568, -427, 78, 231, -402, 502, -350, -39, 391, -475, 385, -176, -139, 472, -498, 265, 16, -273, 466, -460, 168, 193, -409, 445, -331, 49, 302, -484, 393, -147, -104, 367]
3078C67q54Q31l40k74O73q16O51j20n04Q34p37L62J48o49Q68o21Q1M22p45P83
3098C60m28j65O34p75N93j75l66P68p60L79J14n52P79o47J84L51o76P02m44l7
3118a61N15p19N88k06k52O21p18M53K5m54O73o03K51K41o05O57m21K9L99o54N70
3139B29k26j98N20o25M39m2l68N88n42K56J50n01O11m24O0L21n57N30k57j27M49
3160B86n58M15q9k78N13m88K55P3l79N18l84P4K47m46M49k65m7L44m67L61j08
3181B6j86L89m20K46L8k85M02l56J35J53l47L72k34PK32l65L24j32j12K88l42
3202a67K38jk16L17k85J19Q7k45L04k03K3J57k76K51j10o7K16k70J89k9j29K19
3224A22k11J13L2j60K04j46L4Q1j62J60q2m1J33j53J08k4o7J34j26P5J1r0J15
$$ y = [367, -487, 344, 4, -270, 403, -413, 238, 118, -386, 448, -289, 73, 221, -428, 440, -181, -100, 322, -423, 360, -68, -233, 401, -374, 219, 44, -322, 446, -314, 65, 179, -373, 406, -241, -57, 294, -382, 320, -124, -161, 354, -365, 223, 17, -235, 386, -332, 121, 146, -308, 365, -238, 13, 254, -351, 306, -115, -86, 313, -341, 229, 3, -195, 325, -300, 139, 97, -271, 317, -225, 31, 181, -320, 291, -133, -73, 248, -309, 221, -36, -163, 286, -272, 143, 54, -224, 289, -199, 56, 129, -250, 268, -116, -42, 205, -241, 208, -57, -104, 240, -227, 134, 26, -160, 229, -191, 55, 93, -192, 210, -146, -11, 142, -205, 167, -67, -60, 172, -193, 131, -1, -113, 175, -167, 71, 70, -146, 171, -114, 5, 92, -153, 151, -52, -29, 128, -148, 103, -7, -74, 142, -128, 61, 32, -97, 122, -89, 24, 56, -104, 100, -46, -12, 69, -93, 67, -15, -56, 77, -76, 32, 8, -59, 75, -51, 24, 35, -55, 60]
3247F0q2J2N3q0Q6n5RM2o6N2k0k6M4m0J3Qj7J7j2RlJj3J5rNJ1k9K3qk8N5m3J4
3281bL0o7P2l5k0O1p4P5k8n1J11j26Q0J6j01J38j16M0N3j34J59r3j3J12j74J46
3307E9n0p7J84k07J24jj39K22j88Q3P0k10K44j67RJ69k75K55j06q5K42k89J97
3330F4j4j78K93k76J31Q0k57L31k41J4J99l25L29j81o4K83l70K90o5j96L67l74
3352a60J95O7l02M02l10R3J76l79M01k41m3L15m36L57j14j93M20m49K73K3l09
3373b14M64m03J59J76m37M92l08pL12m93M46j94j53M48n24L60l3l31N29m94K24
3394A9J53m49N41l93N5L26n56N20k48j37M71n97M44p1l25N75n57K81J30m70O10
3415C22m85J15L13n90N99l27q7M65o48N26j48k89N86o12L58P0m90O74n49J77K61
$$ y = [60, -22, -10, 43, -37, 49, -6, 3, 45, -21, 31, 11, -15, 29, -11, 2, 10, -7, 10, -2, 7, 4, 5, -8, 7, -2, 3, 14, -15, 8, 0, -28, 27, -16, -2, 28, -39, 33, -2, -22, 39, -35, 40, 12, -39, 72, -54, 26, 42, -59, 79, -37, 3, 56, -78, 81, -12, -25, 87, -87, 59, 9, -68, 116, -91, 33, 32, -107, 115, -73, 10, 80, -130, 114, -53, -44, 125, -150, 105, -1, -86, 156, -133, 64, 50, -128, 165, -111, 20, 100, -157, 174, -67, -53, 146, -179, 150, -31, -95, 188, -182, 108, 43, -153, 214, -160, 35, 102, -200, 202, -108, -15, 161, -218, 183, -58, -101, 214, -222, 135, 21, -172, 248, -201, 72, 95, -214, 250, -153, 6, 182, -255, 237, -71, -78, 234, -259, 187, -7, -160, 288, -236, 124, 91, -240, 289, -205, 19, 172, -277, 264, -129, -74, 252, -304, 216, -32, -169, 302, -295, 149, 78, -247, 328, -229, 52, 182, -288, 322, -163, -48, 265, -325, 274, -53, -140, 325, -323, 203, 55, -234, 352, -260, 98, 168, -322, 352, -197, -20, 241]
3436B41o05O72m11m4M72o76N84k28k47O21o94M52k0m37P01o22K45K36o02P24n04
3457a42J8M61p03O38k91k08O22p35N00p0l93P15p09L39J96o08P33n60J09M32p44
3478d00P01l62j36N86p96N94r4m06P18p36M19J39o22P82n95J73L65p67P79m09
3498f7j08N64q03O80k03l75P18p40M79L5n89Q28o45K23K84p12Q37n29n8N46p79
3519d14P23l09l05P52p97N07m3n01Q64p60K77K60o52Q17o01M4N23p94P16l62j90
3540b45P04q55N70o3m24P76q11L98K20o67P92o19J53M41q24P62l67j37O11q62
3560d47O63j18m14P38p99M93J15o55Q12o16K09L34p88Q33m30j05N46q06P32k32
3580F5l83P31p47M94rn58Q61o81K28K60o85Q32n45l9N40p60P02l32k62P33p96
$$ y = [241, -364, 308, -103, -147, 325, -351, 233, 5, -242, 379, -315, 137, 117, -320, 381, -241, 4, 240, -362, 362, -142, -124, 337, -366, 272, -19, -227, 395, -340, 160, 90, -303, 412, -297, 42, 238, -370, 363, -197, -88, 344, -400, 301, -61, -197, 389, -407, 187, 93, -313, 405, -331, 88, 227, -395, 387, -208, -35, 330, -437, 342, -67, -175, 389, -414, 266, 63, -312, 406, -334, 145, 180, -409, 419, -226, -3, 281, -431, 406, -123, -181, 365, -414, 309, 0, -305, 447, -350, 157, 114, -387, 477, -283, -6, 254, -398, 419, -182, -138, 385, -409, 307, -55, -245, 459, -396, 174, 111, -313, 463, -348, 50, 270, -397, 395, -224, -71, 370, -454, 308, -59, -196, 415, -447, 216, 98, -316, 422, -377, 116, 231, -424, 388, -228, -19, 315, -473, 360, -70, -175, 371, -435, 297, 65, -318, 413, -334, 160, 151, -407, 454, -227, 1, 261, -424, 408, -137, -176, 364, -396, 306, -26, -288, 445, -351]
3601c51M93n0m41Q12p56K85K47o13P70o07Q1M93p61O74l34j56O44q26N55n5l92
3622b88P11p52M03J78o21P37n76J75L70p47P03l50j09N34p67O22j33l76O60o79
3642c05M25O2n37P20n64J92K50o41P19m20n9M67o72O10k33k80O40o57M26j6m45
3663c18P02n95K14K18n50O66m55QM31o35N53k56j87N64o54M37n2l48O08n94K59
3684A6J85n06N98m40P7L41n88N45k82r9M64o01M45q1k93N13n32K97R8m21N44m23
3706a43J12K56n19N19k68p2L80n18M24j24k45M76m82K86L4l59M99m05J33J92m20
3727b44M62k85k7L10m43L74j32j75L95m27K76j6k65M33l80J40J51l57M05k66J0
3748f1K50l82L38j53j07L21l75K51j7k13L55l30J57P8k88L52k47L6J81l26K98
$$ y = [-351, 142, 92, -349, 463, -293, -8, 239, -374, 396, -211, -130, 363, -398, 276, -58, -214, 430, -396, 159, 104, -288, 423, -329, 74, 252, -369, 368, -208, -33, 337, -410, 293, -57, -166, 368, -399, 223, 90, -286, 374, -305, 120, 182, -355, 365, -199, -7, 243, -398, 321, -99, -158, 309, -363, 247, 14, -266, 374, -283, 143, 127, -318, 384, -211, 3, 221, -329, 337, -118, -110, 321, -314, 239, -17, -204, 360, -294, 143, 91, -257, 351, -243, 16, 201, -305, 293, -147, -70, 271, -317, 228, -54, -153, 311, -290, 155, 74, -219, 294, -238, 59, 157, -264, 280, -143, -31, 225, -294, 225, -43, -115, 265, -253, 171, 47, -198, 278, -204, 82, 116, -243, 256, -149, -16, 176, -244, 218, -67, -94, 216, -227, 147, 15, -160, 235, -192, 84, 68, -197, 236, -144, -4, 147, -210, 195, -71, -61, 189, -193, 145, -8, -115, 206, -169, 82, 65, -148, 207, -123, 34, 112, -176, 176, -71, -35, 146, -180, 118]
3769A18j38o7K47l11K20l4j64K95k89J44N2k27K97k06M0J32k45K43j30l5J85k34
3791a07J93n2j14K11k15J18J7j44J98j52M3R3j90J87j05j7J18j64J40o0o5J54
3813H7j53R3mq5J32j26M2N2j04J16o3qO8j03Q8k9k6O9p5N1mm6O3m5J6J5m7N1j7
3842Hj4L7l9K1j0pJ0j4oJ7qJ0Nj1JOj5L2k8j1L8m2K5Ll0M1l0K2J4n4P5n3KN5q6
3877c6Q1m1l6R9r7O8pp6J06r7M8L6j22J51j10J1R3j51J49p7m6J34j61J18j5j03
3903h1J81j66P3N9j68K02j48K1J26k08K03j04n2J75k27J73k9j20K23k29J24L8
3925F6j99K73k14M9J25k48K69j53l4K07k92K23n6j42K83k90J73K8k28L25k59Q2
3947a2J39k99L30k06k2K40l46K99j07j36L15l54K29J6k48L71l30J24J39l42L84
$$ y = [118, -20, -87, 160, -151, 69, 35, -129, 166, -123, 21, 73, -154, 143, -63, -23, 109, -136, 107, -23, -58, 127, -107, 86, 34, -80, 131, -84, 34, 51, -93, 105, -47, -4, 89, -101, 86, -19, -36, 82, -82, 58, -2, -67, 87, -66, 27, 23, -62, 70, -56, -14, 38, -66, 50, -13, -21, 47, -56, 32, 3, -23, 46, -29, 22, 18, -28, 35, -10, 6, 21, -26, 25, 8, -6, 31, -8, 13, 3, -4, 6, -8, -14, 3, -5, 5, 10, -1, 0, 6, -9, 23, -5, -16, 22, -20, 5, 8, -22, 19, -11, 11, 25, -29, 46, -7, -5, 50, -36, 45, 4, -32, 67, -30, 38, 31, -45, 61, -36, 12, 48, -74, 77, -33, -22, 71, -80, 69, -8, -54, 80, -81, 37, 22, -81, 100, -66, 7, 66, -102, 100, -48, -27, 99, -109, 94, -10, -62, 113, -114, 59, 30, -90, 133, -96, 28, 66, -133, 140, -74, -25, 100, -148, 121, -32, -66, 141, -151, 72, 16, -126, 157, -133, 40, 68, -160, 165, -94, -12, 127, -172, 158, -48, -70, 170, -176, 123, 16, -120, 195, -159, 70, 86, -162, 209, -121, 3, 142, -200, 184]
3968A84k50QK48m10L66j59j21L43m05K82k2k56M13l78J75J10l66M43l05L5K58
3989A93m44M29k15r1L68m62L44o3k58M62m42K30R2l85M95l69R2K41m67M71k68
4010d7p8L64m81M05j17k35M70m96K78N9l87N41m35J25K27m68N00l06l6L66n31
4031b82M64j70k01M89n49L37J6l37N31m72J72K05m82N50l80J5L62n58M97k19j59
4052a71M78n84L94k8l29N40n17K52J46m72N60m18R1L12n72N47k60j20M44n83M54
4073A64r1l20N59n48L17P9m56O04m44R9K70n54N93l28r7M53n93M99j61k74N56
4094C27n77L43L1m26O40n20J42K46n09N88l99j5M26o01M96k04k01N55o15L59J4
4115A00l60N85n52K29K19n19N83m22N6L76o08N28k30j44M86o31M34l3l45N63n54
$$ y = [184, -66, -58, 190, -220, 146, -13, -134, 209, -196, 86, 64, -192, 221, -157, 18, 128, -238, 205, -100, -65, 193, -251, 178, -37, -128, 240, -222, 122, 59, -199, 263, -179, 51, 143, -242, 253, -116, -24, 217, -250, 221, -47, -125, 239, -242, 163, 46, -189, 281, -215, 63, 122, -265, 276, -159, -34, 193, -275, 225, -81, -117, 249, -282, 182, 12, -189, 300, -249, 88, 104, -233, 298, -174, -2, 203, -279, 271, -109, -94, 268, -290, 207, -12, -171, 307, -277, 117, 89, -240, 300, -217, 35, 181, -291, 269, -149, -58, 254, -318, 229, -31, -151, 293, -290, 164, 73, -247, 312, -236, 81, 160, -296, 308, -136, -37, 233, -321, 272, -56, -153, 300, -293, 206, 45, -229, 327, -250, 93, 124, -302, 338, -182, -40, 206, -303, 285, -114, -129, 297, -304, 192, -12, -213, 342, -273, 86, 100, -260, 325, -227, 2, 221, -298, 285, -137, -81, 295, -313, 215, -15, -159, 327, -304, 130, 97, -248, 315, -239]
4136b39K93J46n18N89m11J00K86n94N80k51j43M44n90M87j06l25N58n36L15N2
4156A37m51O27m51R2K56n17N81l27j04M40n60M70j78k51N67n62L13K3l64N83m85
4177a61J20K55m91N42l66k0M04n59M47j80j75M99n75L38K1l38N37n16K13K14m83
4198b74N14l64N1L30n57M84j86j47M21n46M05k4l29M81m69K72J12m55N32l56M7
4219e8K56m96N06k23j32L88m86L93r9k66M78m46K37P4l79N15l86P5K16m29M94
4240B32k80p5L62m70L76j36j89M44m54K42M4l04M59l93J37J87m07M40l01lL12
4261B23m44L74j60j38L86m52K95k0k55M05l79J76J38l77M17k82L3K33l96L75j65
4282a3r9L10l94K81l7k03L64l53J77P8l10L87k70N2J87l52L58j85p9K81l56K69
$$ y = [-239, 54, 200, -318, 271, -140, -40, 246, -348, 232, -19, -162, 282, -308, 179, 73, -252, 306, -230, 85, 137, -314, 313, -138, -46, 210, -307, 274, -53, -157, 283, -277, 193, 15, -236, 331, -231, 82, 105, -259, 324, -161, -41, 214, -277, 265, -101, -121, 283, -276, 171, -9, -184, 315, -260, 78, 99, -239, 298, -218, -5, 209, -274, 240, -124, -73, 257, -300, 184, -2, -149, 272, -274, 131, 107, -222, 259, -210, 62, 174, -281, 251, -105, -58, 198, -298, 208, -15, -147, 241, -245, 148, 49, -217, 261, -185, 52, 126, -253, 262, -124, -49, 167, -262, 232, -48, -123, 239, -231, 145, 9, -180, 264, -190, 52, 96, -208, 251, -142, -5, 182, -225, 215, -86, -89, 223, -221, 153, -7, -145, 241, -211, 84, 64, -191, 214, -165, 11, 149, -228, 189, -93, -60, 173, -223, 152, -13, -112, 198, -196, 85, 48, -155, 209, -144, 33, 111, -199, 188, -82, -30, 157, -195, 163, -22, -101, 180, -176, 93]
4304I3o4j73L31l34J83M3k51L42k69P1J47k82K97j77k9K30l25K62r6j14K71k91
4326a35J72K4j94K86k53J05J05k50K69j78J3J62k67K23p6q1K06k49J68nj46K29
4348A28k22J01O2j91K28j46OJ29k07J87q8m3J60k08J50l0j10K03j93R6M7j51J84
4371I2j37J8Q9j37J50p9l0J14j60J22k5p0J28j26P3J0r5J43j09L2N2j13J09p8
4395b7mQ5j12R9l9m0J04j00M8Pp9R5o9L5K1o4Q5n9J1M8p6O9k4l1M8m3K7Kk6L2
4425B3k9J6Pk4K1k2MJ7j4Rj2Nk%K%Lj2Qj6%J1NQlj5K8l3K9Ll5M3k9QK9n7N5k7
4463DoL3n3O0k6k8O2p2M9nn6Q3p7K8K8p4R3o6JO0j02R1l5m4J11j05P5%p6J11j13
4494d9O2L3j05J29r9J9P6j49J50p4l0J19j46J05k2q2J51j55Q3K2j22J63j28K6
$$ y = [93, 29, -144, 187, -147, 36, 79, -172, 170, -99, -28, 119, -163, 134, -43, -72, 158, -167, 95, -1, -115, 156, -135, 37, 61, -133, 153, -100, 5, 110, -140, 129, -49, -36, 126, -141, 82, 6, -75, 131, -118, 50, 45, -101, 128, -94, 7, 69, -122, 106, -40, -34, 95, -112, 75, -13, -56, 104, -104, 46, 16, -94, 109, -84, 12, 59, -92, 92, -45, -27, 62, -75, 75, -4, -34, 80, -80, 42, 17, -53, 75, -51, 22, 32, -63, 80, -29, 3, 55, -58, 51, -27, -31, 54, -58, 41, 2, -38, 66, -34, 14, 21, -58, 37, -32, 3, 24, -40, 45, -14, -3, 45, -31, 38, 14, -17, 31, -12, 15, 17, -9, 23, -6, 10, 17, -7, 14, -8, -4, 13, -1, 8, -4, 1, -1, -1, 1, 1, 4, -8, 0, -16, -16, -5, 0, 8, 5, -10, 18, -15, 14, 17, -18, 25, -4, 4, 33, -24, 31, 4, -2, 31, -22, 38, 12, -16, 46, -26, 23, 18, -38, 45, -32, -4, 24, -50, 43, -23, -22, 38, -64, 27, -8, -52, 59, -46, 29, 29, -47, 64, -49, 13, 46, -59, 70, -29, -10, 66, -83, 67, -7, -37, 82, -64, 41, 19, -63, 88, -67, 16, 38, -84, 79, -49, -23]
4518b3R0j58J61r3k7J39j89J47m3q7J85j81J05J1j23J97j76O0P4j78K13j25k1
4541d2J43k07J83p2p0J84k26J59qj47K29k10Q7P3k04K32j58LJ47k38K23r0q2K04
4565A13k38J74k7j36K54k51J22O6k17K64j81K3J43k54K54j29m7K02k78K20n5j33
4587a11K62k61J44M3k05K72k19N7J21k67K97j80k0K08l03K48p3j33K78l00J77
4608C5K6k11L06k52Q0J26k75K96j89pK17l14K70j07j16K88l25K14%j98L11k83
4630a08J24J00k81L18k15K8J83l30L05j32p5K35l25K37k7j95L27l07J54P1k75
4651a88L46k51M7J74l26L50j77o9K57l42K90r3j57L30l27J75L2k39L59k91P8J56
4673A34l02L31k13l5K55l52K93j02j40L26l58K04K5k40L53l19J27J33l03L39k38
$$ y = [-23, 67, -91, 70, -23, -50, 89, -100, 47, 4, -83, 102, -79, 26, 37, -86, 111, -65, -5, 69, -109, 104, -21, -42, 101, -106, 77, 5, -65, 119, -107, 52, 44, -103, 126, -84, 3, 76, -128, 104, -54, -51, 96, -142, 81, -9, -91, 113, -125, 49, 22, -114, 140, -111, 11, 77, -140, 124, -57, -34, 109, -145, 109, -20, -67, 135, -143, 77, 22, -111, 151, -110, 34, 77, -128, 144, -75, -18, 103, -164, 133, -47, -67, 141, -162, 86, 13, -120, 158, -142, 35, 61, -150, 156, -96, -16, 110, -165, 131, -58, -65, 152, -162, 108, 1, -115, 173, -152, 62, 62, -136, 175, -108, 16, 116, -165, 153, -62, -34, 149, -181, 124, -8, -83, 152, -173, 64, 37, -158, 169, -138, 16, 87, -188, 158, -93, -46, 128, -198, 152, -25, -94, 163, -179, 111, 18, -139, 191, -136, 39, 71, -168, 191, -100, -22, 134, -168, 163, -50, -85, 170, -182, 111, 9, -131, 195, -163, 41, 66, -174, 179, -140, -13, 120, -183, 156, -82]
4694h2J9K31l63K96j15r7K99l65K40Lk16L28l28J69J05l17L59k42N1J81l70L54
4716A40j43r7K70l56K94n6k16L36l11J72M7k76L77k67N0J58l21L60k02o7K67l28
4738a69K87j00j65L33l29J84J6k31L77l11Q9J56l03L35k38mK57l33K70j23j15
4759a17L16l57K17Rk05L25l23J34J32l06L27k36L9K14l66L08j23r2K72l63K68
4780G3j5k04L13l10J74P8k88L30k21M2J58l15L19j49o5K22k99K59p4j70L16k89
4802a15J64L2k51L30k39M4J46k77L05j81m0K23k89K41j04j15K96l03J60L3k05
4823a45L07k70R4J22k51K75j91J2J95k83K31j00p3K27k82J87Qj74K54k42J20P3
4845I4k42K70j84K7J37k56K48j11o1K00k64K00l6j41K49k47J39L7j88K55j92L8
$$ y = [-82, -63, 168, -195, 101, -14, -111, 188, -177, 63, 66, -150, 178, -150, 19, 124, -193, 166, -76, -25, 156, -214, 140, -3, -100, 170, -186, 108, 52, -164, 172, -139, 33, 80, -196, 181, -86, -36, 122, -199, 161, -41, -108, 159, -169, 118, 18, -147, 186, -143, 41, 57, -174, 203, -108, -19, 137, -166, 169, -69, -73, 184, -149, 121, -2, -117, 199, -158, 59, 68, -137, 188, -135, -1, 131, -175, 152, -84, -45, 169, -197, 111, -12, -104, 168, -195, 73, 58, -146, 167, -143, 31, 109, -179, 151, -70, -28, 130, -185, 134, -15, -80, 142, -157, 102, 28, -142, 174, -115, 49, 81, -170, 160, -79, -35, 111, -166, 139, -42, -82, 141, -148, 93, -11, -126, 170, -133, 27, 60, -145, 162, -108, -14, 108, -143, 132, -59, -47, 148, -135, 96, -4, -77, 150, -132, 55, 63, -111, 143, -99, 21, 94, -148, 122, -62, -35, 102, -154, 94, -17, -78, 122, -142, 58, 22, -119, 130, -117, 22, 59, -129, 126, -66, -28]
4867b8J24k36K41j21l9J76k19J84o0j06K02k06J27J5j61K19j87N6J05j92K11j36
4889c1j4J44k09J71p0p0J79j99J20J6j33J92j73N7O9j52J87j13KJ01j72J59o0
4912An0J41j77J21j3q8J62j58Q5M0j44J61j08J2Q5j51J46p0l5J15j50J05j8p6
4936f4J36j27O9K0j03J27j00K7M9j02J29p8j7Q9j21J01k9n3J20j16P4Jq1J09q8
4961b8L8K6q4Q9n3ON4q7O0k1l1P6q8N1Lm7Q5q0K5K2n7O1l7kM2n1M2k4rL7n0L6
4993Dmk3M6m8L0J5l9L8j8oK3k6K3pk1K3k9J7J2k0K0j9PQj3J2j5kJ0j0MMjjmKJ
5030gJ1j2J0%oQrJ7j6MK0k6J4oj1K7l8K2J2l4L9k7KK7m0K9rqK6n0L7ll4N9n8L0
5066@J2m5M9l9J8K8o7P3l9qO4p7N4j5l5Q0q6M7L1q5R1o8J4M7q5Q4m9j3O5r4Q3
$$ y = [-28, 96, -140, 101, -20, -59, 117, -102, 82, 22, -84, 118, -88, 39, 54, -107, 112, -75, -19, 86, -106, 105, -31, -45, 99, -110, 61, -9, -79, 100, -99, 21, 37, -96, 96, -77, -20, 49, -103, 84, -29, -27, 74, -98, 61, 1, -49, 92, -85, 36, 23, -65, 97, -61, 24, 64, -80, 81, -27, -15, 70, -81, 65, -5, -40, 75, -75, 30, 12, -64, 72, -55, 14, 34, -69, 58, -42, -15, 34, -68, 61, -17, -34, 55, -66, 35, 6, -47, 73, -43, 31, 32, -49, 60, -28, 10, 36, -48, 41, -12, -6, 48, -39, 21, 0, -31, 45, -43, 8, 11, -36, 49, -31, -6, 16, -41, 20, -17, -19, 23, -28, 14, -10, -19, 18, -32, 4, 0, -23, 23, -25, 5, 20, -19, 19, 1, -5, 18, -8, 15, 8, -13, 10, -19, -2, 10, -10, 10, -9, -2, 6, -7, 5, -10, -12, -2, -12, -8, -4, -5, -6, -10, -8, -7, 4, -8, 2, 2, -4, 4, -5, 12, -4, 0, 20, -6, 8, 2, -9, 18, -20, 2, 14, -20, 19, -8, -6, 21, -19, 10, 1, -7, 19, -31, 6, 3, -31, 28, -30, 0, 12, -33, 16, -23, -5, 23, -44, 29, -10, -18, 46, -31, 23, 8, -27, 53, -33, 14, 45, -40, 51, -17, -3, 44, -41, 43, -6, -19, 46, -48, 35]
5097C5k5m5Q2j02O9Qp1J06j02M1M3j10J12p4QO9j17J12l8m5J21j42Q9no5J19j18
5124d5N6L6j14J35r0J0Q1j44J32p2k2J25j70J21j7r0J61j65P1M4j31J58j19K7
5148b2Q2j48J50q5k2J22j73J38k1j02J74j71R8K8j33J77j44M9P2j55J82j22qJ38
5172A04k02J62o7o2J69j93J11J8j29J90j76O6P8j84K06j41LJ34k09J89p6n8J81
5195A14k16J45k3j29K07j87J04N5j78K18j66L6J24k21K11j05m7J69k09J65m1j26
5217a00K20k11J08M7j85K36j79M5J06k13K20j19m2J79k41J83m1j09K25k37J42
5238C4Oj68K59k11O3R6k14K47j50j4J78k50K14q8p7K24k54J53Nj61K45k20P7R5
5262H9k23K38j68K2J61k59K18q7p8K17k65J83j0j49K24k17J13O8k08K32j68L8
$$ y = [35, 10, -35, 47, -55, 14, 22, -49, 57, -45, -4, 39, -71, 41, -33, -25, 44, -73, 39, 1, -44, 77, -65, 24, 19, -46, 73, -45, 11, 47, -67, 68, -22, -12, 69, -75, 57, -15, -37, 88, -82, 39, 22, -68, 93, -72, -1, 43, -88, 70, -49, -22, 60, -88, 62, -23, -45, 77, -96, 42, 21, -81, 93, -78, 20, 48, -85, 92, -52, -3, 69, -86, 96, -26, -34, 104, -98, 64, -3, -65, 104, -89, 22, 40, -89, 101, -75, -9, 69, -115, 91, -50, -47, 87, -122, 67, -9, -67, 114, -102, 43, 20, -109, 98, -89, 15, 70, -108, 110, -56, -20, 104, -117, 94, -11, -58, 111, -98, 67, 26, -100, 120, -91, 17, 64, -121, 115, -64, -19, 87, -126, 94, -25, -67, 112, -129, 54, 13, -96, 129, -108, 34, 40, -128, 131, -80, -17, 79, -135, 112, -38, -52, 126, -124, 90, 2, -75, 149, -105, 48, 53, -108, 137, -83, -6, 89, -134, 104, -64, -42, 119, -140, 78, -9, -87, 130, -135, 48, 38, -111, 113, -104, 9, 77, -131, 101, -67, -29]
5284b9J38k50K43j05o3J88k50J96l9j26K42k34J20M1j98K57j94M2J09k31K57j43
5306b9m5J92k39J99q0j03K31k27J27J7j78K61k07O4R6k11K43j60rJ95k63K00o6
5329Hr3K35k64J48J9j58K36k20J02R2k32K38j57KJ65k56K21r6n4J84k36J59Qj59
5353a08K26k19J19N3k18K67j70K8J17k41K38j05o4K06k44J89m0j41K37k13J14
5374C1K2j72K49j81L4J11k13K31j40m2J91k27J77o2r8K13k18J11L3j54K25k08
5396h7N8J08k03K11j32j2J70k34J81o3p3J91k26J57%j37K06j97Q2Q1j89K12j34
$$ y = [-29, 109, -141, 102, -3, -66, 122, -128, 68, 29, -97, 145, -89, 31, 72, -126, 131, -63, -21, 88, -143, 114, -29, -74, 118, -121, 78, -2, -105, 126, -101, 26, 43, -135, 126, -81, -17, 79, -132, 111, -49, -58, 137, -126, 74, 8, -85, 150, -114, 34, 53, -105, 131, -89, 13, 105, -127, 111, -46, -44, 121, -135, 86, -10, -64, 120, -116, 43, 51, -108, 118, -101, 18, 71, -147, 120, -50, -22, 95, -146, 92, -13, -77, 129, -115, 74, 34, -107, 130, -83, 31, 53, -119, 130, -51, -17, 94, -119, 112, -28, -70, 121, -106, 71, 9, -89, 124, -94, 17, 50, -104, 121, -87, -29, 79, -124, 87, -45, -57, 113, -121, 60, -3, -76, 115, -111, 46, 46, -91, 115, -82, 0, 81, -108, 104, -30]
$$ [...]
8191A0
##END NTUPLES=NMR FID
##END=
