##TITLE=1H_ES-aq-iPrOH-c2
 
 8 sc, 
 14.1.2022
##JCAMPDX= 6.0         $$ Bruker NMR JCAMP-DX V2.0
##DATA TYPE= NMR FID
##DATA CLASS= NTUPLES
##ORIGIN= UXNMR, Bruker Analytische Messtechnik GmbH
##OWNER= root
$$ XWIN-NMR		Version 3.5
$$ Fri Jan 14 10:44:57 2022 Russian Standard Time (UT+4h)  she@DPX200
##.OBSERVE FREQUENCY= 200.131346
##.OBSERVE NUCLEUS= ^1H
##.DELAY= (6, 6)
##.ACQUISITION MODE= SIMULTANEOUS
##.ACQUISITION SCHEME= undefined
##.AVERAGES= 8
##.DIGITISER RES= 18
##SPECTROMETER/DATA SYSTEM= spect
##.PULSE SEQUENCE= zg30
##.SOLVENT NAME= D2O
##.SHIFT REFERENCE= (INTERNAL, D2O, 0, 15.7039)
##AUDIT TRAIL= $$ (NUMBER, WHEN, WHO, WHERE, WHAT)
$$ ##TITLE= Audit trail, XWIN-NMR		Version 3.5
$$ ##JCAMPDX= 5.01
$$ ##ORIGIN= Bruker BioSpin GmbH
$$ ##OWNER= she
$$ F:/spectra/data/she/nmr/H-F/1/audita.txt
$$ ##AUDIT TRAIL=  $$ (NUMBER, WHEN, WHO, WHERE, WHAT)
(   1,<2022-01-14 10:43:57.76 +0400>,<she>,<DPX200>,
      <created by zg, POWCHK disabled, PULCHK disabled
       configuration hash MD5:
       00 E9 B6 7A A2 85 ED C7 34 08 36 98 17 FE 4E 26
       data hash MD5: 16K
       A4 A9 B1 77 DB BA 9B 57 3E 47 E6 71 03 D5 D9 C8>)
$$ ##END=
$$ 
$$ hash MD5
$$ A3 AE 38 1D EB 53 48 28 76 46 B5 D0 96 19 30 00
##$RELAX= 
##$RELAX= 
##$RELAX= 
##$RELAX= 
##$RELAX= 
##$RELAX= 
$$ Bruker specific parameters
$$ --------------------------
##$DU= <F:/spectra>
##$EXPNO= 1
##$NAME= <H-F>
##$PROCNO= 1
##$TYPE= <nmr>
##$USER= <she>
##$AMP= (0..31)
100 100 100 100 100 100 100 100 100 100 100 100 100 100 100 100 100 100 
100 100 100 100 100 100 100 100 100 100 100 100 100 100 
##$AQSEQ= 0
##$AQ_mod= 1
##$AUNM= <au_zg>
##$AUTOPOS= <>
##$BF1= 200.13
##$BF2= 200.13
##$BF3= 200.13
##$BF4= 200.13
##$BF5= 200.13
##$BF6= 200.13
##$BF7= 200.13
##$BF8= 200.13
##$BYTORDA= 1
##$CFDGTYP= 0
##$CFRGTYP= 5
##$CHEMSTR= <none>
##$CNST= (0..31)
1 1 145 1 1 1 1 1 1 1 1 1 1 1 1 1 1 1 1 1 1 1 1 1 1 1 1 1 1 1 1 1 
##$CPDPRG= <>
##$CPDPRG1= <>
##$CPDPRG2= <>
##$CPDPRG3= <>
##$CPDPRG4= <mlev>
##$CPDPRG5= <mlev>
##$CPDPRG6= <mlev>
##$CPDPRG7= <mlev>
##$CPDPRG8= <mlev>
##$CPDPRGB= <>
##$CPDPRGT= <>
##$D= (0..31)
0 1.2 0 0 0 0 0 0 0 0.06 0 0.03 0 0 0 0 0.0002 0 0 0 0 0 0 0 0 0 0 0 0 
0 0 0 
##$DATE= 1642142637
##$DBL= (0..7)
120 120 120 120 120 120 120 120 
##$DBP= (0..7)
150 150 150 150 150 150 150 150 
##$DBP07= 0
##$DBPNAM0= <>
##$DBPNAM1= <>
##$DBPNAM2= <>
##$DBPNAM3= <>
##$DBPNAM4= <>
##$DBPNAM5= <>
##$DBPNAM6= <>
##$DBPNAM7= <>
##$DBPOAL= (0..7)
0.5 0.5 0.5 0.5 0.5 0.5 0.5 0.5 
##$DBPOFFS= (0..7)
0 0 0 0 0 0 0 0 
##$DE= 6
##$DECBNUC= <off>
##$DECIM= 32
##$DECNUC= <off>
##$DECSTAT= 4
##$DIGMOD= 1
##$DIGTYP= 9
##$DL= (0..7)
0 120 120 120 120 120 120 120 
##$DP= (0..7)
150 150 150 150 150 150 150 150 
##$DP07= 0
##$DPNAME0= <>
##$DPNAME1= <>
##$DPNAME2= <>
##$DPNAME3= <>
##$DPNAME4= <>
##$DPNAME5= <>
##$DPNAME6= <>
##$DPNAME7= <>
##$DPOAL= (0..7)
0.5 0.5 0.5 0.5 0.5 0.5 0.5 0.5 
##$DPOFFS= (0..7)
0 0 0 0 0 0 0 0 
##$DQDMODE= 0
##$DR= 18
##$DS= 0
##$DSLIST= <SSSSSSSSSSSSSSS>
$$ [...]
##$SUBNAM2= <"">
##$SUBNAM3= <"">
##$SUBNAM4= <"">
##$SUBNAM5= <"">
##$SUBNAM6= <"">
##$SUBNAM7= <"">
##$SUBNAM8= <"">
##$SUBNAM9= <"">
##$SW= 18.0517287032376
##$SWIBOX= (0..15)
0 0 2 0 0 0 0 0 0 0 0 0 0 0 0 0 
##$SW_h= 3612.71676300578
##$TD= 16384
##$TD0= 1
##$TE= 0
##$TE2= 300
##$TE3= 300
##$TEG= 300
##$TL= (0..7)
0 120 120 120 120 120 120 120 
##$TP= (0..7)
150 150 150 150 150 150 150 150 
##$TP07= 0
##$TPNAME0= <>
##$TPNAME1= <>
##$TPNAME2= <>
##$TPNAME3= <>
##$TPNAME4= <>
##$TPNAME5= <>
##$TPNAME6= <>
##$TPNAME7= <>
##$TPOAL= (0..7)
0.5 0.5 0.5 0.5 0.5 0.5 0.5 0.5 
##$TPOFFS= (0..7)
0 0 0 0 0 0 0 0 
##$TUNHIN= 0
##$TUNHOUT= 0
##$TUNXOUT= 0
##$USERA1= <user>
##$USERA2= <user>
##$USERA3= <user>
##$USERA4= <user>
##$USERA5= <user>
##$V9= 5
##$VALIST= <valist>
##$VCLIST= <CCCCCCCCCCCCCCC>
##$VD= 0
##$VDLIST= <DDDDDDDDDDDDDDD>
##$VPLIST= <PPPPPPPPPPPPPPP>
##$VTLIST= <TTTTTTTTTTTTTTT>
##$WBST= 1024
##$WBSW= 4
##$XGAIN= (0..3)
0 0 0 0 
##$XL= 0
##$YL= 0
##$YMAX_a= 256219
##$YMIN_a= -315239
##$ZGOPTNS= <>
##$ZL1= 120
##$ZL2= 120
##$ZL3= 120
##$ZL4= 120
##$ABSF1= 10
##$ABSF2= 0
##$ABSG= 5
##$ABSL= 3
##$ALPHA= 0
##$AQORDER= 0
##$ASSFAC= 0
##$ASSFACI= 0
##$ASSFACX= 0
##$ASSWID= 0
##$AUNMP= <proc_1d>
##$AZFE= 0.1
##$AZFW= 0.1
##$BCFW= 1
##$BC_mod= 2
##$BYTORDP= 1
##$COROFFS= 0
##$CY= 11.3945322036743
##$DATMOD= 1
##$DC= 2
##$DFILT= <>
##$DTYPP= 0
##$F1P= 2.36226072786647
##$F2P= -0.459571619588291
##$FCOR= 0.5
##$FTSIZE= 0
##$FT_mod= 4
##$GAMMA= 1
##$GB= 0.15
##$INTBC= 1
##$INTSCL= 1
##$ISEN= 128
##$LB= 0.24
##$LEV0= 0
##$LPBIN= 0
##$MAXI= 10000
##$MC2= 0
##$MEAN= 0
##$ME_mod= 0
##$MI= 1.114404
##$NCOEF= 0
##$NC_proc= 0
##$NLEV= 6
##$NOISF1= 3.799351
##$NOISF2= 2.8
##$NSP= 1
##$NTH_PI= 0
##$NZP= 0
##$OFFSET= 15.70392
##$PC= 1
##$PHC0= -15948
##$PHC1= 9.80079
##$PH_mod= 1
##$PKNL= yes
##$PPARMOD= 0
##$PSCAL= 0
##$PSIGN= 0
##$REVERSE= no
##$SF= 200.130013532006
##$SI= 16384
##$SIGF1= 3
##$SIGF2= 2
##$SINO= 400
##$SIOLD= 16384
##$SREGLST= <1H.CDCl3>
##$SSB= 0
##$STSI= 0
##$STSR= 0
##$SW_p= 3612.71676300578
##$SYMM= 0
##$S_DEV= 0
##$TDeff= 0
##$TDoff= 0
##$TI= <>
##$TILT= no
##$TM1= 0
##$TM2= 0
##$TOPLEV= 0
##$USERP1= <user>
##$USERP2= <user>
##$USERP3= <user>
##$USERP4= <user>
##$USERP5= <user>
##$WDW= 1
##$XDIM= 8192
##$YMAX_p= 0
##$YMIN_p= 0
$$ End of Bruker specific parameters
$$ ---------------------------------
##NTUPLES= NMR FID
##VAR_NAME=  TIME,          FID/REAL,        FID/IMAG
##SYMBOL=    X,             R,               I
##VAR_TYPE=  INDEPENDENT,   DEPENDENT,       DEPENDENT
##VAR_FORM=  AFFN,          ASDF,            ASDF
##VAR_DIM=   8192,          8192,            8192
##UNITS=     SECONDS,       ARBITRARY UNITS, ARBITRARY UNITS
##FACTOR=    0.0002768,     1,               1
##FIRST=     0,             0,               0
##LAST=      2.2672688,     0,               0
##MIN=       0,             -315239,         0
##MAX=       2.2672688,     256219,          0
$$ Real data points
##PAGE= N=1
##DATA TABLE= (X++(R..R)), XYDATA
0@%%%%%%%%%%%%%qJ6j6J6j6K4l2L2l6M4n0N8o8P6q8J00j12J28j44J60j79K03k25
36a17K49k78L06l36L70m08M48m92N43n97O53p14P85q66R52j047J156j282J427
55G52j589J778k005K277k613L035l575M289n272O688q858J2481j9378L6151j32625
70a08464j34072L95732k82711L18691j47767k83262M43935l45625J91459N0931
80I8847k93995M17922l39021O5454J91429l43874L80650k12688k6919K35067m22376
91b49504L32573k5119j05241K38477m47949K64377J11813k00239K59388l66843
101a88267J73997J62387l04117K91600k23232O8844J85224l64270K86649j07281
111a8466m2077K44379l44829K20684n3171j43630L27648k72230J17077j0868k14687
$$ y = [0, 0, 0, 0, 0, 0, 0, 0, 0, 0, 0, 0, 0, 0, -8, 8, -8, 8, -8, 16, -16, 16, -20, 24, -26, 32, -36, 40, -48, 52, -60, 68, -76, 84, -95, 108, -117, 132, -146, 160, -176, 194, -214, 234, -258, 285, -312, 341, -373, 412, -454, 498, -549, 607, -675, 752, -837, 941, -1064, 1213, -1400, 1635, -1940, 2349, -2923, 3765, -5093, 7388, -11990, 24161, -108464, -242536, 153196, -129515, 189176, 41409, -241853, 202082, -143543, 47916, 98847, -195148, 222774, -116247, -50793, 140636, -203238, 177412, -35276, -62195, 172872, -249504, 83069, 57950, -47291, 191186, -256763, 7614, 119427, -80812, 178576, -188267, -14270, 148117, -156000, 135600, -87632, -18788, 166436, -197834, 88815, -18466, -60543, 183836, -160993, 59691, 6520, -137110, 190538, -81692, 35385, 24517, -190170]
122a90170L68734k05234J5213P4953k41415L30354j66344o6346J89037k33194
132a24412K43559j23506j31869K65203k13639J62022m0312j86487K65693j93717
142g7465J03413P0605k26243K18100j59566M7798J57207k46366J74095r3711k1943
153e4076J86516k47020J49343l718r5459J76436k27611J17780P7831j49459J66532
164I7095j85577N6399J25435j73817J68949j24893k2590J46009j76031J59514
174G0493n9258q8059J63413j64300J14878l905j23652J84821j38880M4970L7559
185C8080j38688J93069r9777j9007P3168j47379J70064n3138n9717J07358j48646
196h4613J20496q189q4856J31168j32986O7956L1066j08373J32335j00096K9180
$$ y = [-190170, 178564, -26670, -11457, 63496, -177919, 152435, -13909, -80255, 108782, -124412, 119147, -4359, -136228, 128975, -84664, 77358, 37046, -149441, 116252, -77465, 25948, 96553, -129690, 88410, -71156, -23358, 133849, -112517, 61578, -32133, -54076, 132440, -114580, 34763, 31045, -64414, 112022, -115589, 2191, 80022, -69437, 97095, -88482, -32083, 93352, -80465, 88484, -36409, -58999, 87010, -89021, 70493, 11235, -76824, 86589, -77711, 37167, 33262, -90390, 94431, -44449, 521, 38080, -100608, 92461, -7316, -26323, 46845, -100534, 69530, 16392, -43325, 64033, -84613, 35883, 27694, -57162, 74006, -58980, 8976, 40042, -68331, 64004, -36092, -6912]
207f912O6380j29976J10634o0660J64R6570j37145P9171k4092l0781J14432j23633
219d5848N0997Q742o3897J14989r7737K6870M0650q7517J02336p0958r34O9149
231D6842r2429Q4804m5813l3868Q6794q2293O6279j8437o2704R0363o7583M4175
243A6130J1384p7902Q4341n2579J6123L6687p9092P4379l3964j2813N0447p3446
255d0305O1422r961l4227N3630o6288M3126J4438m4703N1978n6052K0497L1873
267B5428m7861M8135l9784m32M0308m8605M0122j9758j4462M3797m7183K6423
279F128k162k2091M5745m0435J0114R288k6902M4651k7961l297J5979l0036L7855
292A6876j4328j1519K1020k9410K6496m016j6794K4275k3154J5013K410k0934
$$ y = [-6912, 59468, -70508, 40126, -20534, -20370, 76200, -60945, 18226, -5866, -36647, 77785, -45848, 5149, 13891, -50006, 64983, -32754, -5884, 34766, -52751, 49585, -21373, -22307, 46842, -45587, 39217, -6596, -40464, 46330, -35963, 30316, 11879, -50825, 39538, -28045, 16130, 27514, -50388, 33953, -18626, -2503, 34184, -44908, 29471, -4493, -17306, 33141, -40305, 21117, 11156, -23071, 30559, -35729, 7397, 21835, -22868, 29110, -26942, -6445, 25428, -22433, 25702, -14082, -14514, 25794, -22811, 17311, -2447, -16909, 26888, -20295, 6128, 3966, -18125, 27620, -12815, -2701, 6587, -20315, 24336, -3625, -6922, 9057, -20979, 16876, 2548, -8971, 12049, -17361, 9135, 5119, -11675, 12600, -10554, 4459, 6869, -14065]
304a4065K2941j3455P024O848k2642J6599n050K366J0189j9992Q681o7j197J0920
318I100j3673K879K726l694P564p004N1M729l161J752l028j205N254Q07l059j614
334a576j878K910N901n148j132q44k161R501n384j559L210p455J0527m678m254
349d020R146j0608R878k607r694J4497j1470Q248K073j6387J7551j0756M527R341
363I719k1837J8260q351k112J7027k4782J7169l323j0789K2998k5483J3843M784
376G123j9414K6520k4042P287J4582k6084K7673j9723k210K3782l0305K6366j1982
389d27j3031L1185l2281K1726j260k3326L6465l1288J3143J0751l1975L9134k6237
402g421J616K2154l8468L8337j7160j1056L2174m2212L3107n015k3551M0170m1861
$$ y = [-14065, 8876, -4579, 2445, 9293, -13349, 3250, -1800, 566, 10755, -9237, -556, -623, -1820, 9100, -4573, -1694, 1032, -2662, 4902, -2102, -2051, 2678, -483, 1269, -1759, -2964, 2290, 3097, 38, -1576, -3454, -544, 5357, 209, -923, -1767, -3928, 5573, 189, -1370, 1840, -5615, 4912, 234, -4020, 5126, -5482, 4396, 1789, -7905, 6592, -4878, 3370, 5443, -10944, 6607, -4149, 378, 9719, -12118, 6142, -2209, -4321, 12706, -12076, 5093, 1770, -9019, 13979, -11504, 2339, 7123, -12291, 14229, -9813, -2526, 12056, -14028, 13645, -6078, -8288, 15494, -14811, 11555, -427, -13458, 17727, -14554, 7172, 5912, -17414, 19051, -12237, 906, 11657, -20318, 18816, -7421, -5805, 16349, -22119, 16218, -942, -11998, 20176, -22036, 11071, 6056, -17495, 22675, -19186]
415a9186K3362Q630l4849M4754l6398J0437K2178m3821M4702k6431l881L4539
427B4036m9169L9531j3334j8459M4646m9605K9738J551l2173N0866m4668J6590
439d50J6920m3439N2080l5243J453L1584n0833M8219k2452j4727M4222n3328L9594
452A3600p055l0613N3091n0618K6983R871m4272N6927m3130J1309K6958n4253
464c1202N5320l1206o251M2200n9407M8257j5317k3965N3451n9100L6361L161
476A2302l9907N9304n2979K0676K1903n2413N9461m1176K470L8415n9946N4121
488B2231k4775j6626N0972o1392M3722o113l4477N8945n6496K8859J2467m9027
500c1710O2277m6157J0395K9703n8469O0229l1958r632M4820o1965N2026j5480
$$ y = [-19186, 4176, 12806, -22043, 22711, -13687, -3250, 18928, -24893, 19809, -6622, -10503, 24036, -25133, 14398, 1064, -17395, 27251, -22354, 7384, 8935, -23238, 27628, -17040, -450, 16470, -26969, 25111, -10132, -8679, 22905, -27928, 20291, -2161, -16888, 27334, -25994, 13600, 6545, -24068, 29023, -21595, 5388, 15259, -29013, 27914, -15216, -3907, 23051, -31202, 24118, -7088, -13339, 28861, -30546, 17711, 2394, -21571, 31880, -27220, 9141, 12302, -27605, 31699, -21280, -604, 21299, -31114, 28347, -12829, -10359, 28056, -31890, 22231, -2544, -19170, 31802, -29590, 14132, 8019, -26458, 32487, -24009, 4850, 17317, -31710, 30567, -15590, -5195, 24508, -33961, 26268, -5690, -15322, 29498, -32467, 19559, 4079]
512D079k8439N6967o0198L7906K818m3990O4224n3865J9663K2462n5304O4203
524C0526m2798L21M1276o2415N6627k6721j7761N5765o5064M3703o247l4297O3218
537C6133o1648K8128J5639m9142O3261n0526J1230L4387o0502N8164l2836p248
549a4960M7358o5376M9996j2483k7118N5216o1653L8268O390m5514N9900n0453
561b0429K1326K2193n7897O1549l5942q7L6317o1946N7694k1446k1843N0179n9316
574b9648M5594o615l8789O1592n3659K6461J0929m8868O5642m6478N784L1137
586B3082n4526N9555l5328j1485M9369n8518M5856j7452k4957N9578n9717L0240
598E697N259l7337N9802n4051J6339K6381m9922N3805l9246K619M0335n9430M6590
$$ y = [4079, -24360, 32607, -27591, 10315, 13133, -30857, 33367, -20498, -835, 21627, -33677, 30526, -12272, -11951, 29325, -33090, 23537, -3184, -20945, 34820, -30244, 13459, 7212, -27085, 36133, -25515, 2613, 18252, -30890, 32371, -18155, -6925, 27462, -33040, 25124, -7712, -14960, 32398, -32978, 17018, 4535, -22583, 32633, -29020, 9248, 15638, -29876, 30024, -20429, 897, 23090, -34807, 26742, -9200, -9287, 27030, -34916, 22778, 1332, -20511, 29668, -29648, 15946, 9331, -29458, 32134, -21525, 4936, 15865, -33003, 32639, -13839, -8055, 23082, -31444, 28111, -7217, -18702, 30667, -27851, 18005, 553, -24404, 35174, -24543, 5697, 10956, -26381, 33421, -20630, -4291, 22090, -27832, 25973, -13273, -10654, 29681, -29749, 16841]
611A6841j8509j3953M6525o0450L9263J249l2901M9302n1427K8503J5482m8907
623b8982N2297l6747J1094K5823n6142N3429k2555j0567L6545n3971M7416j1134
635F506k9386M8493m7494L2317Q45m0437N6966m1237J2340J6744m4653N6165l4461
648g292n520L4562m6509M5497k3163j7711M7889m8300L0456n661k6467N1824m7313
661a7708J6904J4307l5545M7285l9135O085K9948m4761L9573k3443m946L7544
673B6108m9753L2908n378j8844L9494m6490K6149R232l3469M0376l5822J5445
685d4J8751m3266M1397k2883n7K6053m5100L9540j1841j6535L3961m0768L1337
698A0545k451k8782M1262l4392J7348P954l4657M3857k8054K057K0173l6205L9259
$$ y = [16841, -1668, -15621, 30904, -29546, 9717, 10966, -21935, 27367, -24060, 4443, 19925, -28982, 23315, -13432, -2338, 23485, -32657, 20772, -1783, -12350, 24195, -29776, 17640, 6506, -22880, 25613, -21881, 10436, 11281, -29156, 27810, -13427, -1087, 15657, -28996, 27169, -7292, -12812, 21750, -24759, 20738, -2425, -20136, 27753, -20547, 9909, 4248, -22219, 29605, -17708, -804, 13503, -22042, 25243, -13892, -7807, 22141, -22620, 16953, -6490, -11436, 26108, -23645, 9263, 3885, -14959, 24535, -21955, 4194, 13426, -20043, 20333, -15489, -44, 18707, -24559, 16838, -6045, -6102, 19951, -25149, 14391, 2550, -13985, 19976, -20792, 10545, 8094, -20688, 20574, -13818, 3530, 11484, -23173, 20684, -7370, -5313, 14860, -21345, 17914]
711A7914k0494j0196L1470l6271K9083r650j8446L7710l5210J7503L910k4631
723a7308L7394l1029P525J6657l0259L2686k2350j091K5277l4357K6755j0494
735e94j0026K9157l4426K0720J208j9364L0158k9665J3654J0337k7086L0038k1747
748g636M471J7088l1024K8430j3002o017K2500l0545K3944m802j5368K6736k6991
761a2216J6334K945k1703K8801k1947O892J0639k4745K7387j5910k244J7589k5255
774a3433K2510q816r545K2292k3951J5662r14j4867K3892k1007Q480O805j8639
787a1531K2585j6160J752J3009k0826J9382r878m386J6956k1069J5183l172r853
800h008J8851j9247J0324L047j4328J9143j5635M856Q232j7126J7936j0848q85
$$ y = [17914, -2580, -12776, 18694, -17577, 11506, 1856, -16590, 21120, -14090, 3413, 7323, -17308, 20086, -10943, -3418, 13239, -17020, 15666, -6684, -7775, 17502, -16855, 9900, -594, -10620, 18537, -15889, 4831, 6039, -13325, 16833, -12832, 822, 11159, -15927, 14111, -7636, -3165, 13923, -17101, 11329, -1673, -7690, 14810, -15735, 8209, 3407, -11961, 14775, -12216, 4118, 7063, -14640, 14161, -7786, -894, 9745, -15000, 12387, -3523, -5767, 11822, -13433, 9077, 261, -9284, 13008, -10943, 4719, 3805, -11062, 12830, -8177, 303, 7108, -11531, 11054, -5106, -3354, 9655, -11171, 8211, -1667, -6053, 10903, -10166, 5017, 1845, -8008, 10843, -8404, 1920, 4967, -9361, 9782, -5853, -997, 7235, -9891, 8045, -2803, -3688]
813c688J2194j7910J5276n655o146J4817j6826J1273m91j0292J5913j4252O418
826F31M218j2856J5301j0624J468Q038j3798J3149o443k925J0609j3345R979k164
840A238o366J1732j1653O292J727q677J1539r150K636M855r874J0330o174o88
854b233P087j0042Q388l080l485Q327r235N968j61n562Q659p699L339K299o785
869d215Q148n737Q31M233p238O938l488j423N412o821N137j213l092N764n725
884b489L169O86m027N331m225J314K063m289M415k592k36K801l927L157j074j272
900a195K908l125J903N1j749K545k176Q42P19j745J913j225O6R58j386J160m75
917a1l16P79p88M77n4k74L29j65KK1Q2k62L62j95k33O58q56O62j7q20J351j290
$$ y = [-3688, 8506, -9404, 5872, 217, -5929, 8888, -7938, 3335, 2844, -7448, 8465, -5787, 631, 4849, -8007, 7294, -3330, -1862, 6176, -7622, 5527, -916, -3841, 6768, -6577, 3402, 1238, -5128, 6604, -5049, 1243, 2970, -5707, 5832, -3318, -682, 4173, -5701, 4629, -1545, -2233, 4854, -5188, 3200, 120, -3365, 4962, -4273, 1695, 1534, -4028, 4631, -3068, 271, 2570, -4215, 3933, -1804, -973, 3260, -3978, 2960, -528, -1951, 3461, -3360, 1777, 564, -2528, 3236, -2489, 680, 1366, -2661, 2670, -1555, -241, 1822, -2467, 1948, -644, -880, 1921, -2006, 1151, 77, -1195, 1713, -1412, 491, 542, -1207, 1338, -838, 4, 723, -1022, 891, -334, -268, 690, -696, 464, -11, -327, 452, -336, 141, 87, -187, 142, -23, -21, 0, 82, -180, 182, -13, -246, 412, -444, 218, 201, -619, 732, -558]
939e58N92N38j575J948j417J54J349k353K297j131o52K312k981K261m23j734L222
956A849l281J774O48k869L885l148Q61J935l939M208k546m21L320m767M048j427
972A30j983M582n137L338O3l554N508m958K101J811n027O035m262M72L651o220
988c450N988k940j547N408o862N183j062l637O760o832L760J122n574P519o036
1003b200J750L433p124P564m535o50N609q033O778k399l140P313q173N266R5n473
1019c919Q426p543L173K712p437Q808o137N98N295q822Q361m037k207P511r433
1034d651P081j456m929R160r233N071J475p445J0078q116K402M466r366J0031
1048D568o108o61P206j0515R007l385l827R364j0654P022j52o793J0677r707M236
$$ y = [-558, 34, 572, -1003, 945, -472, -318, 1031, -1322, 975, -156, -808, 1504, -1477, 784, 361, -1373, 1849, -1432, 342, 990, -1879, 2006, -1142, -281, 1654, -2285, 1923, -623, -1044, 2276, -2491, 1557, 130, -1853, 2729, -2408, 930, 993, -2561, 2947, -2011, 90, 1901, -3126, 2909, -1353, -881, 2770, -3450, 2538, -402, -1949, 3459, -3403, 1780, 718, -2919, 3841, -2991, 769, 1891, -3683, 3836, -2200, -450, 2983, -4141, 3423, -1112, -1762, 3847, -4186, 2592, 193, -2947, 4366, -3807, 1459, 1554, -3919, 4507, -3036, 137, 2849, -4588, 4220, -1917, -1319, 3976, -4846, 3515, -522, -2729, 4782, -4651, 2430, 974, -3955, 5205, -4028, 1043, 2518, -4927, 5151, -2965, -563, 3903, -5463, 4568, -1540, -2201, 5005, -5510, 3497, 112, -3715, 5649, -5005, 2017, 1865, -4928, 5749, -3958, 278]
1063B78L229r200J0948p727R70O319j0736J0186m951k499Q857j1234Q449j706
1077A183n815J0625j0639N851J721q603J1496r094K626N042j0591J1356o796r02
1091b540Q086j1685J0120l830m406J0570j1828P812l02p553J2067j0920M746L433
1105C770j0085J2381r000J261P020j1881J1446n986k411R906j2629R436k172n968
1119d912J1667j2076O634J840r122J2275j0148L257N444j1455J1886p145n97Q376
1133E924j2527J0568l622m561J0566j2193Q239n3q077J2068j0740M948L383j0608
1147f685J2667q597J026O763j1985J1954n916k918R872j2382R855k666o317J2198
1161F869j2004O679J221r027J3124j0689L063N354j1106J2439q176n14Q899j2490
$$ y = [278, 3507, -5693, 5255, -2472, -1502, 4817, -5919, 4267, -684, -3183, 5674, -5560, 2889, 1183, -4632, 5993, -4646, 1205, 2926, -5677, 5819, -3275, -649, 4393, -6198, 5158, -1638, -2540, 5546, -6139, 3981, 151, -4255, 6315, -5513, 2299, 1997, -5556, 6511, -4409, 337, 3770, -6315, 6066, -2934, -1673, 5347, -6534, 4912, -1074, -3485, 6421, -6208, 3228, 1056, -4912, 6755, -5321, 1313, 3153, -5969, 6306, -3842, -585, 4859, -6596, 5290, -1855, -2452, 5924, -6603, 3965, 343, -4218, 6348, -5845, 2394, 2341, -5736, 6332, -4408, 540, 3923, -6685, 5982, -2615, -1589, 5174, -6811, 5143, -773, -3691, 6181, -6201, 3654, 988, -5329, 6869, -5135, 1544, 2765, -6262, 6862, -3827, -764, 4590, -6516, 5923, -2253, -2767, 6132, -6358]
1175f358J0520m454l929J1122j2782Q005j26p287J1960j1503N074L878j0244J1795
1189E671q749J683O938j2156J1024n214k228R127j2481R530j712o165J0823j1329
1203e238O932J467r297J2024r336L274M502j1065J2216p066p78P637j1674J0910
1217D508m440m451J0484j1487Q138j178p209J2188j0727M627K723r198J2205r094
1231b911J211O526j0702J0726o249j870R329j1594Q464k355m847J0628j1275N961
1245A042J635p695J0717r455L269M868j0006J0200o513R3P129j1140R248l254
1259A38l431Q741j0784P560k66o645R974r343M908K381q895J0659p394J502N016
1274D121r941J0247n214j962P579j0043Q493k670m786R535r533N743L72o849J0296
$$ y = [-6358, 4162, -292, -4221, 6901, -5881, 2124, 1998, -5289, 6671, -4832, 242, 4120, -6124, 5671, -3078, -1395, 5543, -6613, 4411, -803, -3031, 6096, -6385, 3145, 1433, -4732, 6091, -5238, 1694, 3161, -6136, 5888, -3448, -174, 4328, -6737, 5479, -1587, -2365, 5272, -6402, 4508, 68, -4383, 6101, -5386, 2752, 1574, -5635, 6553, -4174, 453, 3176, -6022, 6183, -2911, -1700, 4826, -5876, 4850, -1399, -3269, 6060, -5534, 2930, 575, -4272, 6356, -4919, 1042, 2677, -5018, 5699, -3756, -487, 4381, -5625, 4575, -1938, -1845, 5284, -5856, 3392, 138, -3293, 5448, -5336, 2224, 1958, -4687, 5287, -4056, 852, 3233, -5662, 4997, -2397, -895, 4121, -5820, 4427, -787, -2749, 4830, -5213, 3280, 610, -4176, 5359, -4174, 1569, 1941, -4908, 5388]
1289E388q426K680L619q255R661o475j50O377r151Q049l696k686Q067r273O016
1304A745n28n015Q682q391L814K400p021Q528o549J408M667q303P849m139j188
1319b041O276q633O719j670l743P405q027M952O78n842Q033o717K617K822p144
1334d315P978n045P9M781p656P093l078k342O392p499N412q27m288P257o721L259
1350D80J489n624P240n379J027L558o412O469l573j051N091o602N139j473k868
1365b489N921o155L514O07m316O115n162J790K366n300N783l723J6L746n757N050
1381B006k109j691M724n633L929m47l149N250n001K500J130m211N296l964R03
1396d67K532m812M844k659o56L595m864L913j180k030M237m457K680K80l059M381
$$ y = [5388, -3038, -358, 3261, -4994, 4667, -1808, -1958, 4419, -4732, 3317, -379, -3065, 5002, -4271, 1745, 1217, -3798, 4884, -3507, 307, 2707, -4314, 4214, -2335, -927, 3740, -4563, 3286, -853, -2041, 4235, -4398, 2321, 651, -3092, 4313, -3714, 1238, 1916, -3926, 4107, -2610, 7, 2829, -4315, 3663, -1382, -1303, 3478, -4178, 2915, -163, -2505, 3887, -3612, 1800, 973, -3315, 3942, -2779, 480, 1969, -3655, 3585, -1794, -767, 2791, -3621, 2848, -725, -1776, 3315, -3287, 1852, 379, -2489, 3432, -2723, 791, 1398, -2918, 3197, -1965, -175, 2191, -3109, 2674, -1049, -1033, 2713, -3044, 2006, -103, -1794, 2930, -2703, 1226, 779, -2370, 2880, -2121, 379, 1509, -2702, 2594, -1370, -467, 2065, -2747, 2097, -562, -1218, 2377, -2487, 1426, 246, -1784, 2453, -2004, 676, 956, -2103, 2278]
1412B278l659J308J574l679M057k586k9K555l850L379j396j165L138l646K464
1427G43k18k072L382l128J453Q17k665L279k403M56J653k960K905j545m63K218
1443A452k940K332o82j234K547k668J590J63j785K571k152P84Q71k082K322j497
1459d08L3J371k126J888q04n97J678j957J325j40j056J716j554P02M15j294J527
1476G19j072J60P73j299J226n99k55R26j149Q31j50n31R30q85M47J70o49P98n73
1495a82J26L29n99N81k92q4L74m77L30o3j77L00k62J01O6j54J37m9n2Q3l2p7J46
1518G3j24j6J80k74K38n7j98M09m28K26J29m67O22m82R1L90p26P39l76j90P09
1539D68r31P28j55n35J019j036N58K12r24J231r95K60O23j259J333p82j65J083
$$ y = [2278, -1381, -73, 1501, -2178, 1879, -707, -736, 1819, -2031, 1348, -48, -1213, 1925, -1721, 743, 525, -1547, 1835, -1293, 160, 977, -1688, 1591, -812, -356, 1297, -1663, 1242, -303, -766, 1452, -1488, 844, 162, -1072, 1475, -1193, 397, 560, -1225, 1346, -806, -22, 849, -1233, 1089, -408, -375, 996, -1130, 758, -46, -643, 1035, -922, 403, 263, -793, 923, -631, 71, 486, -808, 719, -353, -193, 580, -719, 507, -92, -347, 579, -570, 261, 111, -420, 510, -375, 72, 242, -407, 391, -182, -56, 273, -326, 255, -37, -121, 253, -224, 106, 43, -134, 166, -96, 5, 71, -83, 54, 5, -47, 36, 4, -73, 73, -51, -67, 113, -161, 77, 20, -178, 231, -197, 29, 158, -309, 313, -169, -78, 312, -414, 325, -51, -241, 468, -463, 265, 110, -425, 594, -442, 116, 328, -596, 635, -360, -100, 523, -736, 597, -185, -350, 733]
1557G33j537J295m57o44J489j667J063O4j187J808j605O32O56j667J963j352R7
1574c16J243k034J921r10n70J822k248J642k58j276K267k229J144M86j925K488
1590A247j914M41J269k422K474j395l50J961k715K211o79j204K554k746J692J79
1606F03j986K915k528R69J065k638L035k046R8J942l121K879j310q71K700l311
1622a605K410m00j826L259l208J678O37k696L530k764P06J703l361L474j997m04
1638h64K642l689L047j001j524L357l667K284J72k566L792l278J261J357l364
1653b041L843k544P5K436l847L519j561j137L325l999K870m11k275L938l796J921
1669C16Q29l243M210l244P75K046l951M082k372m78L137m340L572j193j767L972
$$ y = [733, -804, 491, 34, -610, 879, -788, 275, 339, -848, 960, -645, -13, 643, -1024, 939, -413, -316, 927, -1107, 814, -96, -666, 1156, -1092, 550, 292, -984, 1283, -946, 198, 684, -1241, 1247, -667, -226, 1043, -1379, 1095, -300, -650, 1311, -1404, 807, 128, -1076, 1478, -1268, 424, 603, -1383, 1532, -996, -27, 1038, -1600, 1435, -611, -513, 1429, -1692, 1187, -123, -994, 1706, -1605, 805, 405, -1421, 1838, -1370, 308, 945, -1751, 1779, -985, -279, 1424, -1937, 1537, -460, -864, 1778, -1911, 1136, 135, -1389, 1968, -1699, 585, 757, -1809, 1983, -1295, -34, 1323, -2041, 1802, -742, -667, 1769, -2078, 1441, -120, -1257, 2068, -1931, 939, 528, -1747, 2191, -1605, 316, 1145, -2098, 2112, -1132, -357, 1689, -2262, 1820, -552, -1030, 2107, -2233, 1339, 146, -1621, 2351]
1685B351m364K732J33k924M425l918J561J528l888M481l058K18K768m462M092
1700A675j852j197L741m599L302m74k548M385m244K191R40l641M607l500Q14K269
1716A869m376M454k451o43L398m664L844j202k031M288m582K846J91l218M790
1731B513m117J586J601m111M824l283J91K946m703M398k112j227M041m915L545
1746A177o40k567M706m651K380R23l732M890l885J009K380m577M622k665m92L535
1762B413m953L985j215j999M319m770K970L00l338M754m105J656J673m294M811
1777B207l097J11K918m759M421j916j401L960m788L557o11k716M700m467K322
1792D41Q26l750N005l831R06K291m464M723k789n39L542m809L976j436j881M403
$$ y = [2351, -2013, 719, 852, -2072, 2353, -1565, -4, 1524, -2364, 2117, -941, -723, 2045, -2417, 1675, -177, -1374, 2367, -2232, 1070, 596, -1952, 2433, -1811, 380, 1320, -2321, 2286, -1214, -400, 1869, -2507, 1947, -504, -1147, 2251, -2413, 1431, 229, -1802, 2486, -2096, 750, 941, -2277, 2513, -1604, -18, 1583, -2528, 2296, -987, -796, 2150, -2553, 1845, -267, -1494, 2547, -2368, 1177, 537, -2030, 2676, -1975, 405, 1328, -2404, 2486, -1399, -390, 1990, -2587, 2035, -630, -1122, 2413, -2540, 1445, 230, -1769, 2550, -2220, 750, 1050, -2288, 2466, -1639, 17, 1690, -2604, 2207, -890, -779, 2139, -2620, 1801, -115, -1516, 2444, -2344, 1213, 602, -2114, 2586, -1881, 441, 1267, -2483, 2522, -1309, -403, 1888, -2576, 2147, -642, -1181, 2361, -2448, 1528, 92, -1789, 2614]
1808B614m768K902J39l087M752m232J618J691m068M628l198K34K953m662M134
1823A650j823j217L832m739L321l71k582M343m252K194J003l680M548l426Q55
1838c44K193m330M365k341o17L235m515L771j175j971M068m337K766R9l024M494
1854B337l819J494J428l787M480l026J53K665m217L965j886j165L648m336L072
1869A006n24k297M148m008J962Q88l255M195l247P40K112l888L859k170n30L052
1885B043m121L214r09j715L625l924K340L26k756L885l317J262J439l479L844
1900A757k474P4K378l802L460j491j087L118l772K760m31k099L601l440J781O77
1916A010k873L719k830O91J712l344L462j973m29K575l515K869r44j432L137l349
$$ y = [2614, -2154, 748, 887, -2200, 2552, -1680, -62, 1629, -2439, 2189, -1009, -775, 2178, -2484, 1650, -173, -1390, 2442, -2297, 1024, 653, -1929, 2414, -1838, 356, 1359, -2321, 2227, -1199, -344, 1849, -2481, 1884, -457, -1074, 2161, -2354, 1417, 242, -1729, 2339, -1998, 768, 867, -2157, 2337, -1482, 12, 1440, -2347, 2133, -893, -740, 1925, -2292, 1673, -213, -1378, 2270, -2066, 1006, 482, -1815, 2333, -1675, 287, 1175, -2080, 2115, -1132, -392, 1720, -2168, 1691, -479, -1009, 2043, -2078, 1136, 227, -1488, 2137, -1787, 553, 879, -1877, 2008, -1309, -47, 1392, -2087, 1757, -717, -643, 1735, -2067, 1393, -98, -1185, 1933, -1839, 921, 490, -1609, 1992, -1448, 333, 1010, -1863, 1856, -974, -283, 1429, -1915, 1547, -426, -855, 1720, -1795, 1074, 130, -1302, 1835, -1514]
1932a514K024J58k262L338k867J057J197k839L184k096M1K028l118K780j196q99
1948i84K597l098K171k58j719K900k780J389O40k340K946k227N33J403k702K740
1964A211j539l40K035k800K286p40j119K445k650J657P4j772K620k275R12Q48
1980H53k195K530j703J12J492k394K189r80o41J950k337J646k22j275K162k044
1996h57J008M71j702K140j599L55J041j942J934j043l03J471j949J531m43q33
2012g20J708j792J062J22j235J763j489N50O20j488J664j094M2J014j583J417
2028E61o22m15J254j500J057j39p98J350j285O41K78j038J307r79K23O22j150
2045f33J120o01j71Q44j114Q56k46m50R27r60N44P8o47Q99p20K24L46p29P60m53
$$ y = [-1514, 510, 668, -1594, 1744, -1123, -66, 1131, -1708, 1476, -620, -579, 1449, -1669, 1111, -85, -984, 1613, -1485, 686, 428, -1291, 1609, -1171, 218, 858, -1482, 1464, -763, -230, 1173, -1529, 1211, -328, -668, 1367, -1433, 853, 113, -1006, 1439, -1211, 446, 520, -1252, 1368, -907, 5, 853, -1342, 1188, -515, -403, 1089, -1305, 884, -96, -737, 1213, -1124, 522, 300, -975, 1187, -857, 151, 622, -1080, 1060, -539, -184, 857, -1085, 849, -194, -497, 974, -975, 556, 113, -720, 988, -804, 258, 380, -855, 908, -581, -31, 589, -899, 765, -329, -287, 727, -856, 561, -61, -476, 778, -722, 335, 196, -602, 748, -537, 104, 382, -656, 651, -328, -105, 517, -633, 487, -114, -285, 559, -555, 301, 55, -395, 532, -428, 116, 194, -453, 446, -274, -50, 296, -433, 327, -126]
2065a26l5M91p03N75j93k29N33n75L63j0l17M96m37J82J29l44L94k67K3K09l06
2086a47K66j18o9J92k12J28nr4J29j01J2L7l6lM4n3J7N1j22J20l4q5J91k18J32
2111B2M5k12L11k63Q8J54l62M10k47m9L54n04M32j49k39N38n98L78M9m80P08o23
2133b37K38K70o88P98n32J2N40q85Q00l52k62P82r78P08p0o15J030r96N09K55
2153C27r16J168q89J84O36j181J195o52k04J001j353J078k88o42J303j379Q15
2170B03J42j064J515j283M39O36j434J570r94n6J104j657J459o02n70J512j768
2187h48J197p7j102J803j681P76N05j570J949j417K32J072j912J898r99l68J595
2204A053k106J657m50r92J992k085J220K39j606K252j884O36R26k077K265j421
$$ y = [-126, -161, 330, -373, 202, 9, -220, 313, -262, 101, 91, -226, 270, -167, 15, 144, -200, 194, -73, -50, 159, -147, 119, 1, -68, 124, -88, 40, 35, -59, 70, -31, -19, 18, -18, -21, 23, -30, -13, 38, -84, 36, 2, -83, 108, -110, 22, 67, -145, 166, -97, -9, 145, -217, 193, -54, -103, 251, -253, 179, 30, -209, 329, -269, 109, 158, -322, 386, -237, 1, 271, -417, 381, -151, -139, 401, -484, 316, -36, -298, 484, -494, 214, 144, -471, 559, -437, 72, 327, -589, 579, -310, -126, 510, -671, 524, -128, -332, 669, -684, 394, 106, -536, 767, -612, 203, 345, -719, 796, -487, -48, 588, -846, 724, -270, -326, 778, -879, 580, -22, -592, 920, -848, 349, 272, -830, 973, -708, 68, 573, -997, 952, -465, -233, 839, -1073, 825, -174, -542, 1053, -1053, 604, 154, -838, 1154, -931, 289, 528, -1078, 1174, -710, -74, 852, -1225, 1040, -381]
2220c81r3J590k377K068q08q45K124k441J641p8j548K471k256J007P27k145K603
2237A259j849K49J472k549K475j242n66K130k729K094m87j380K628k672J498L64
2253F95k070K857k348P41J204k614K847j789j25K000k966K573j001j042K630l024
2269a432K021q5j892L011k771J249Q81k607L143k243L07J791l073K940j445p07
2285i12K554l245K447n15j660L086l086J689M93k484L330k644P58J487l092L273
2301A479j941k82K366l384K865j048j268L015l388K212k6k190L443l112J332J023
2317A096k917L517k503L21K019l406L253j630p69K845l587K686n72j798L380l421
2333a486J866N64k720L620k897Q39J640l358L510k069l07K565l663L042j040j427
$$ y = [-381, -474, 1116, -1261, 807, -1, -846, 1278, -1163, 478, 400, -1148, 1323, -933, 74, 801, -1344, 1259, -590, -341, 1131, -1418, 1057, -185, -751, 1379, -1350, 744, 257, -1123, 1505, -1167, 331, 695, -1375, 1482, -866, -125, 1079, -1535, 1312, -477, -602, 1398, -1568, 1005, 4, -1038, 1592, -1432, 589, 504, -1388, 1623, -1148, 101, 982, -1625, 1518, -725, -418, 1373, -1700, 1240, -205, -912, 1642, -1603, 844, 329, -1331, 1755, -1331, 358, 851, -1633, 1697, -947, -189, 1298, -1794, 1479, -462, -744, 1622, -1762, 1103, 55, -1213, 1802, -1586, 626, 600, -1590, 1853, -1259, 73, 1096, -1821, 1696, -807, -486, 1533, -1873, 1380, -250, -1019, 1826, -1761, 925, 353, -1445, 1935, -1486, 380, 944, -1776, 1844, -1053, -214, 1426, -1932, 1578, -491, -798, 1767, -1896, 1146, 106, -1321]
2349a321L239l590K315N3k416L646l214J338J158l150L696k530K28K154l578L395
2365A423j630q91K974l686K761n64j940L552l504J875N68k784L756k979Q22J676
2381A429l395L604k172k90K633l734L103j116j389L305l679K323O1k392L657l271
2397a323J335J218l162L662k508K10K213l615L329j519r40K991l705K699m35j984
2413a534L478l409J801O70k826L648k825P49J677l368L502k016l67K544l591L007
2429A140j038j409L186l509K254%k275L517l117J294J087k963L510k428K21K059
2445A529l370L149j516q21K802l444K510m69j778L237l205J658O34k577L356k615
2461i20O64J583l090L166j817l52K362l295K696q72j313K893l178J985J18k132
$$ y = [-1321, 1918, -1672, 643, 696, -1720, 1926, -1288, 50, 1208, -1942, 1754, -776, -548, 1606, -1972, 1423, -207, -1098, 1876, -1810, 951, 387, -1553, 1999, -1505, 370, 938, -1846, 1910, -1069, -247, 1429, -1966, 1638, -534, -824, 1809, -1925, 1178, 62, -1327, 1978, -1701, 622, 683, -1709, 1948, -1323, 12, 1230, -1932, 1730, -778, -568, 1645, -1970, 1359, -160, -1100, 1891, -1814, 885, 450, -1534, 1944, -1465, 336, 1006, -1820, 1828, -997, -248, 1429, -1939, 1563, -453, -820, 1724, -1867, 1140, 102, -1307, 1879, -1630, 624, 624, -1651, 1866, -1251, 43, 1130, -1833, 1677, -751, -530, 1529, -1841, 1308, -208, -1029, 1773, -1671, 839, 370, -1408, 1829, -1376, 282, 916, -1661, 1695, -920, -256, 1327, -1763, 1403, -414, -766, 1596, -1699, 997, 125, -1188, 1705, -1473, 512, 630, -1502]
2477a502L143k744J112J025k697L118k101J69J836l009K814j305p80K469l030
2492a482K228m11j587K848k790J474M98k231K932k274N83J334k627K747j603l01
2508f62K019k808K315p63j113K472k698J668J09j811K665k308Q93R18k271K577
2524A202j715P5J591k515K291j014p02K075k492J768k40j362K332k244J145M77
2540F72j867K383j807M41J098k145K204j250k46J603k234J821n95q79J934k101
2556i68J305P4j401K063j781O92O87j736J986j312N5J198j898J721p44n45J563
2573I59j853J317j79j012J719j633Q09L75j367J724j285K70Q43j559J536q34k18
2590c88J161j565J238l58o72J375j451Q71Q8r76J397j192M39M96j172J307q56
$$ y = [-1502, 1641, -1103, 9, 1034, -1663, 1455, -646, -477, 1359, -1650, 1164, -141, -921, 1548, -1482, 746, 335, -1252, 1596, -1194, 280, 778, -1453, 1479, -795, -212, 1122, -1505, 1242, -361, -662, 1357, -1451, 864, 101, -1012, 1460, -1238, 430, 539, -1272, 1393, -915, -22, 896, -1375, 1202, -513, -438, 1153, -1362, 929, -85, -787, 1288, -1204, 564, 324, -1038, 1294, -950, 195, 672, -1195, 1188, -619, -178, 920, -1225, 979, -271, -517, 1086, -1148, 673, 78, -801, 1133, -968, 337, 411, -990, 1073, -708, -16, 671, -1065, 921, -391, -336, 862, -1036, 685, -59, -604, 959, -894, 423, 244, -768, 951, -682, 127, 502, -865, 859, -426, -156, 687, -872, 664, -170, -388, 773, -792, 446, 88, -584, 791, -660, 211, 299, -677, 720, -472, -33, 463, -709, 598, -258]
2607b58L7P86j227J102m88l26R68j150Q17j06o35J069j001M81K30q19J028p52
2625b44J59M82q85Q79m71j39O60q72O64j72l84P33p45M23O9n06P05n75J81K61
2645B23n73O10l64k6L82n45M59j76j75M26m58L03j8k39L74l38J53R0k59K94k07
2666f4L6J36k23K06r8m6J44j57R4jp3Q6o7K4K0l0kJ3k2jL9p6Q3j9o2J33j45Q5
2694A3K4j53K24j81M4J33k53K71j53n5K66l54K85p4j92M00m36K61L8l48M95m29
2716a74J64K13n12N68l73j3M22o56N93k52k22N99p12M89l2m58P58p09L34K07o84
2737d50Q70o38J18M82q76Q68m40j85P48r91P84j94n01R72j007N73J42p99J101
2756E77r16K83M82j050J154p19o0Q00j206J079m35m33J102j280Q76n4q01J306
$$ y = [-258, -221, 565, -662, 440, -48, -374, 594, -556, 261, 155, -480, 589, -412, 69, 299, -520, 508, -244, -85, 397, -488, 391, -80, -219, 441, -431, 233, 61, -323, 410, -335, 88, 157, -349, 356, -219, -38, 223, -350, 260, -104, -130, 252, -293, 166, -10, -185, 241, -217, 86, 68, -171, 203, -135, 18, 108, -151, 143, -64, -28, 108, -115, 91, -7, -53, 91, -66, 28, 27, -46, 40, -27, -3, 17, -13, -15, -2, -24, -25, 14, -62, 21, 2, -60, 73, -72, 13, 37, -116, 108, -73, -29, 104, -149, 122, -31, -86, 180, -174, 111, 37, -155, 245, -191, 70, 108, -240, 255, -174, -10, 203, -309, 259, -114, -127, 295, -361, 232, -20, -242, 357, -355, 134, 102, -356, 402, -307, 27, 234, -450, 420, -218, -100, 382, -494, 374, -66, -251, 497, -494, 290, 96, -405, 567, -440, 133, 275, -524, 577, -339, -56, 426, -624, 530, -189, -249, 551, -655, 424, -11, -444, 658, -622, 254, 200, -601, 705]
2774G05j217N66L57j129J395j029J85P61j364J357p25k53J139j498J183l13p10
2791e90J417j489Q58J68j128J590j325M38O69j482J629j032n6J116j681J467n81
2808a2n74J493j731J170q1j071J742j610P44M70j483J823j323K19J004j775J747
2825G52r12l44J448j900J494l90q91J778j858J085J96j405J969j636N53P89j778
2842a050J954j253l1J318k007J766p28o61J764k058J403j05j245K031j889Q84
2858I3N34j716K118j542K59J154k045K006j046m06J669k172J697m28j033K032
2874A174k097J209K31j592K228j831O05Q85k001K200j392n7J466k215J950p85
2890b2p40J932k238J524j42j327K197k062R80N58j822K266j690L29J191k163K157
$$ y = [705, -512, 54, 411, -718, 677, -352, -167, 594, -770, 587, -138, -391, 748, -750, 433, 120, -590, 827, -662, 196, 364, -764, 826, -499, -61, 608, -874, 755, -277, -333, 783, -898, 569, -12, -586, 907, -824, 346, 265, -806, 936, -674, 70, 540, -943, 880, -443, -224, 780, -995, 752, -160, -504, 944, -956, 538, 148, -743, 1035, -823, 262, 458, -947, 1022, -614, -61, 728, -1050, 904, -349, -380, 938, -1069, 697, -31, -692, 1072, -986, 417, 312, -933, 1098, -791, 93, 627, -1089, 1029, -513, -254, 900, -1145, 861, -185, -591, 1078, -1094, 603, 175, -858, 1174, -923, 286, 517, -1075, 1153, -678, -73, 812, -1189, 1011, -381, -438, 1028, -1187, 763, -22, -762, 1170, -1068, 456, 314, -1013, 1184, -878, 102, 660, -1162, 1104, -586, -257, 934, -1229, 928]
2907I28j146l86J751k305J807m76j066K128k226J300K28j646K300j921O51R25
2923H46k069K273j426p1J526k305K020q15p51J979k304J562j18j400K268k106
2939h91R90N81j893K345j716L09J234k205K200j168l98J758k319J836n21j024
2955h82K123k227J302J95j604K295j935O72Q87k033K253j439k0J469k258J985
2971G83q19p14J924k252J535j34j328K195k057R70N54j819K250j651L13J184k129
2988a195K084j097l77J697k234J762m75j021K031k114J255J85j550K177j810O29
3004e3Q31j918K132j363j5J370k107J873p96o45J777k105J463j58j216K027j907
3021h10R25M66j637K066j544L04J066j929J906j022l30J550k038J596m32r05J838
$$ y = [928, -218, -604, 1147, -1158, 649, 173, -893, 1235, -991, 309, 537, -1109, 1191, -730, -79, 846, -1223, 1050, -376, -447, 1079, -1226, 794, -21, -772, 1207, -1097, 465, 347, -1053, 1215, -891, 99, 680, -1213, 1132, -584, -275, 959, -1246, 954, -214, -612, 1146, -1173, 663, 142, -882, 1241, -986, 316, 511, -1093, 1202, -733, -61, 826, -1207, 1046, -393, -413, 1056, -1202, 783, -36, -750, 1174, -1078, 457, 323, -1005, 1190, -867, 103, 657, -1162, 1088, -563, -250, 934, -1195, 889, -208, -585, 1112, -1122, 640, 165, -856, 1175, -939, 316, 501, -1049, 1128, -682, -53, 778, -1140, 992, -371, -386, 984, -1123, 750, -46, -691, 1086, -1019, 444, 286, -930, 1097, -810, 115, 581, -1056, 1010, -534, -230, 836, -1093, 813, -209, -539, 1011, -1027, 569, 137, -768, 1070]
3038A070j913J117J77j386J958j643N70P55j727J906j217l2J247j888J672p05
3054c9n93J601j874J290j28j074J783j682Q18M09j446J806j337K76R17j685J678
3071G20r04k59J306j740J385m14p50J566j648R88J20j162J672j419N12O23j456
3088h60J630j048j1J041j600J408n88m96J348j575J079j06q96J488j411O73L62
3105D38j215J494j103K25P54j389J377p43k01J062j412J122l33o11J271j320P88
3122B04R3r34J330j122M13M85j140J265q34K1P89j227J106m78l61J019j217Q54
3140B66j12o72J133j073N25K43q97J131q48J82N67j036J031n60j73Q10j056Q45
3158C06k47m45R37r77N70P0o71R64q10K95L46q13R01n81QN61q67P64l35k46P01
$$ y = [1070, -843, 274, 451, -935, 1023, -620, -50, 705, -1022, 884, -333, -365, 882, -1006, 666, -39, -632, 969, -905, 385, 257, -817, 966, -716, 102, 511, -935, 871, -466, -190, 727, -958, 720, -184, -443, 863, -877, 508, 94, -656, 910, -738, 250, 370, -792, 880, -539, -27, 596, -860, 770, -278, -289, 752, -848, 560, -28, -524, 824, -751, 328, 222, -674, 814, -597, 76, 438, -777, 717, -386, -161, 593, -796, 581, -162, -363, 699, -713, 409, 76, -535, 736, -584, 204, 297, -637, 693, -429, -16, 469, -671, 594, -240, -219, 570, -657, 449, -29, -390, 629, -588, 266, 154, -518, 615, -458, 67, 310, -587, 544, -304, -122, 445, -591, 440, -120, -293, 517, -539, 306, 59, -386, 551, -426, 144, 214, -457, 507, -303, -8, 338, -475, 426, -155, -147, 414, -453, 311, -24, -270, 431]
3179D31q39N96q9m52P52p08L52J64n93P42n59J17L68o49O44l56r8N01o54N24j62
3200C2k64N69n94L53L9m01N66m71J74K01m70N20l35KL18m92M14j63j46L81m38
3221b05K79j7k42L80l49J64Q5k97L59k60N1J73l00L01j53n5K18k74K03m9j08K15
3243A19k12J22K4j35J89j56N0P2j37J35q4qQ3j17R3l8k7P1p9L3J0l4M2l0nK3k5
3270b1J3J2j6OQk6K3jl3P0o9L6L6q8J10q9J6P2j35J38n9m8J47j82J26j6r8J81
3298A13k04J22L7j90K42j91M0J26k39K64j72l1K10k85K50r6j27L01l31K05K0k38
3320a74L60l24J17J47l33L95k67J4K62m21L87j67j32L75m52L23m2k71M73m53K21
3341C8J09m01M99l76P3K71n09N03k78o8M13n75M58j39k50N33n66L46M4m26O13
$$ y = [431, -408, 188, 99, -353, 399, -309, 43, 207, -386, 356, -203, -86, 282, -367, 277, -79, -177, 324, -330, 194, 32, -232, 337, -257, 96, 135, -266, 300, -171, 3, 204, -266, 254, -81, -79, 239, -253, 161, -2, -148, 233, -205, 74, 57, -185, 195, -154, 10, 95, -202, 157, -103, -52, 121, -179, 122, -31, -86, 132, -142, 61, 12, -96, 119, -93, 29, 53, -82, 107, -49, 1, 73, -64, 71, -13, -21, 62, -55, 38, 0, -27, 44, -35, -2, 8, -26, 16, -14, -19, 4, -21, -8, 4, -12, -6, 2, -24, -1, -2, -35, 35, -34, 2, 38, -50, 60, -29, -13, 59, -76, 62, 3, -45, 102, -80, 46, 30, -68, 113, -91, 31, 68, -122, 120, -71, -31, 95, -144, 120, -52, -83, 127, -158, 92, -4, -131, 170, -161, 44, 64, -174, 186, -138, -21, 126, -207, 188, -79, -65, 197, -224, 163, -4, -136, 239, -213, 110, 68, -203, 270, -183, 38, 147, -254, 245, -131, -58, 213, -296, 207, -71, -139, 274, -301, 157, 18, -232, 301, -265, 81, 125, -301, 312]
3362C12n23J96K29n53O32m13J0L97o30N95k67k02N81o92M85m4m04O69o44L16J66
3383B16n74P21n53J11L89p10P03l88j26N82p72O09j59l61P14p58M48P8n56P92
3403D06o69K48L03p21Q12n23J3N12q05P21l10k44P02q40N79o3m88Q28p83L89J85
3424B52o91Q76o62J30M52q35Q24m45j43O75r09P25k08l99Q36q92N31P4o36R10
3444D65p74K81L50q15R10n89mO04r22Q33l50k92Q05r60O71p2n48R21q67M20K12
3465B79p60R54p22J47M92r08R08m89j52P17r65P70k19m29Q77r38N70O7o71R66
3485D94q20L01L78q72R58o21OO35r78Q71l69l02Q38r76O66o3n73R53q91M30K32
3506B97p98R92p36J42N19r39R27m96j68P38r87P84k21m36Q91r53N73P1o75R68
$$ y = [312, -211, -15, 214, -339, 293, -120, -110, 287, -343, 252, -15, -217, 364, -328, 157, 113, -291, 378, -266, 50, 216, -358, 363, -190, -79, 310, -400, 303, -85, -211, 371, -401, 208, 49, -312, 402, -356, 92, 170, -386, 406, -263, -15, 288, -433, 379, -144, -131, 381, -424, 297, -13, -257, 445, -395, 184, 121, -367, 461, -322, 67, 252, -439, 437, -225, -95, 357, -478, 346, -99, -242, 433, -476, 249, 41, -358, 478, -414, 117, 191, -445, 465, -309, -28, 322, -493, 417, -172, -176, 428, -494, 339, -11, -303, 502, -458, 213, 141, -407, 514, -353, 67, 279, -481, 473, -249, -102, 390, -518, 390, -99, -251, 466, -499, 271, 52, -377, 500, -438, 132, 199, -472, 494, -326, -25, 353, -519, 439, -182, -176, 459, -519, 352, -17, -319, 519, -457, 209, 146, -427, 526, -365, 65, 297, -501, 491, -245, -103, 416, -523, 404, -92, -260, 478, -509, 275, 54, -382, 509, -444, 129, 200, -475, 493]
3526D93q14K92L67q50R48o13MO16r60Q76l70k84Q02r62O80q4n40R25r01M34K20
3547B79p65R61p20J48M88r04R02m91j51P12r56P56k16m19Q66r14N38P3o41R28
3567D74p83K79L53q12Q92n80J8N75r04Q11l41k66P62r01O29p1n24Q63q08M06J79
3588B51o92Q85o68J45M39q23Q13m49j08O18q57O93k18l69P75q14M94O0n87Q27
3608D15p10K67L13p35Q25n25kN24p95P20l21k27O71p90N54n5m71P72p22L41J77
3629B26o06P71n78J19L86p22P12m01r5N58p52N93j88l04O59p02M32K3m84P16o00
3650b37K16K56n98O78m51K3M18o71O10k65j80N65o78M81o5l75O13n84K94J47n03
3671c06O28m81J09L11n85N79l21q5M47o06M81j50k58N37n70L47L4l86N58m83J79
$$ y = [493, -321, -29, 338, -512, 436, -177, -173, 443, -517, 359, -11, -295, 507, -455, 225, 141, -399, 526, -375, 59, 279, -486, 475, -245, -97, 391, -513, 389, -102, -253, 459, -497, 259, 43, -376, 490, -424, 114, 187, -454, 474, -309, -30, 323, -489, 403, -177, -159, 416, -488, 323, -18, -284, 478, -423, 206, 135, -389, 474, -334, 72, 251, -441, 444, -224, -79, 360, -463, 350, -99, -207, 411, -446, 247, 29, -340, 435, -379, 115, 175, -412, 415, -295, -28, 285, -450, 375, -150, -152, 372, -423, 297, -24, -251, 420, -370, 184, 129, -342, 430, -292, 49, 226, -380, 391, -187, -68, 318, -404, 308, -93, -188, 370, -382, 211, 23, -281, 378, -324, 108, 131, -353, 363, -237, -21, 235, -363, 315, -136, -113, 305, -366, 244, -21, -201, 364, -314, 167, 102, -273, 340, -244, 50, 197, -306, 322, -159, -50, 261, -324, 255, -66, -151, 296, -310, 171, 21, -237, 300, -270, 77, 111, -275, 283, -200, -21]
3692b1K10m92N49l59J5L41n19M79k11j49M20n10L74n4k76M79m62K31J01l80M80
3713B46l61P6K39m44M28k30o8L39m58L57r9j91L90m18K47L1k96M19l43J27J44
3734A35l64M00k50J6K29l80L54j47j06L18l66K49k8k02L34l24J67O3k79L59k63
3755h5N8J59l00L02j70l5K25l02K38p9j35K68k76J65Mj75K64k22Q0J01k30K57
3777A12j68OJ58k44K26r9o5J97k23J60k2j14K08k04R2M7j63K06j55K9R6j81J81
3800H0j09k4J41j88J41m0p2J40j47Q9J9j11J41j22N1N4j19J26q6MP7j20J09m7
3824a3k8R5j03O8Kn9Q7p4K9L5o8P0n5J5L4n7O0l7j1L5o1M8pk7K7l0OK7l8L0j2
3855a2oJ4j8J5qmJ6p%PjpJ6rJ4mrJ7k0J6Rk9L6k3j3M0m5K6ok2M4n0J9J4m2N7o5
$$ y = [-21, 189, -303, 246, -113, -98, 243, -276, 203, -8, -157, 263, -247, 127, 73, -203, 276, -186, 45, 146, -234, 246, -115, -39, 200, -244, 184, -46, -114, 225, -233, 124, 25, -166, 224, -194, 53, 84, -212, 207, -136, -9, 135, -229, 171, -79, -63, 166, -214, 140, -7, -113, 205, -161, 88, 60, -142, 192, -132, 35, 98, -181, 178, -85, -27, 132, -168, 134, -36, -71, 154, -148, 90, 11, -124, 144, -132, 33, 37, -138, 126, -96, -16, 85, -145, 112, -56, -50, 108, -136, 90, -9, -74, 123, -100, 60, 38, -76, 132, -72, 20, 67, -96, 110, -45, -16, 80, -101, 80, -29, -53, 88, -100, 41, 1, -71, 69, -78, 11, 30, -81, 60, -62, -11, 43, -76, 50, -36, -32, 45, -75, 34, -13, -41, 54, -49, 19, 21, -38, 49, -25, 4, 39, -29, 41, -14, 1, 35, -22, 38, 1, -10, 25, -36, 12, 5, -22, 5, -25, -19, 8, -30, 0, -12, -18, -4, -22, -7, -15, -19, -3, -10, -10, -3, -4, -11, 5, -4, 10, 6, -3, 14, -6, 10, 19, -10, 26, 3, -10, 30, -15, 11, 5, -17, 27, -23, -4, 10, -32, 25, -40]
3892d0K2K9p0P1l2j6O8q3O6k2m2R7r3N4J6p9J27j11M5L8j03J14p0qQ2j16J14n2
3920Fm9J16j30Q6Kr4J33j21M8L6j27J59j16K2P7j53J61q0l7J31j69J30k8q9J76
3945I0j74R7L1j38J88j56N2Q5j85J99j12lJ22k06J96p5n9J58k07J42j1j35K17
3968A16k01R0O0j92K30j70L6J18k20K23j20l4J62k35J92m6j09K19k38J42K4j77
3990a30K57k03P4J03k32K53j55j3J69k48K22j05p7K29k59J77j3j65K61k35J04
4011A4P1k22K64k11M9J39k61K66j50m1K19k87K09n2j31K71k75J64K4k00K87k45
4033i8R9J07k54K86j85lJ99k91K60j14r7K64l04K00j5j81K87k79J39O5k46L08
4055A47k35N5J49k90K92j61n0K19k93K44p7j25K73k85J71J2j86K99k73J10J24
$$ y = [-40, -18, 11, -59, 12, -20, -36, 32, -51, 15, -7, -49, 48, -45, 9, 25, -54, 73, -38, 7, 45, -58, 56, -14, -22, 60, -56, 58, 6, -43, 73, -57, 29, 31, -63, 70, -51, -3, 33, -94, 65, -51, -29, 48, -105, 56, -24, -61, 70, -99, 31, 3, -86, 90, -84, 13, 44, -94, 94, -62, -10, 75, -110, 89, -23, -26, 96, -110, 86, 11, -48, 110, -97, 45, 34, -101, 116, -85, 5, 65, -127, 103, -67, -31, 87, -133, 90, -30, -64, 98, -137, 55, 9, -100, 119, -119, 23, 47, -130, 127, -76, -2, 101, -131, 122, -33, -46, 123, -125, 97, -8, -85, 144, -115, 62, 49, -116, 145, -90, 14, 85, -137, 127, -84, -35, 104, -157, 109, -41, -82, 137, -150, 59, 7, -124, 147, -128, 36, 60, -140, 147, -98, 1, 108, -146, 140, -45, -48, 151, -140, 120, 6, -91, 173, -131, 69, 54, -127, 160, -119, 20, 85, -161, 147, -88, -33, 116, -174, 118, -43, -93, 126, -167, 77, 0, -125, 148, -137, 34, 46, -140, 159, -114, -4, 120]
4076A20k79L00j95K3J75l02K81j19r5K66l24K34l6j79K93k77J36O2k39L09k42
4097h8N5J53k96K96j57m2K25l21K56q0j28K80l00J90J8k16L04k65J06J26k83L19
4119A52k08NK07l09K82j27r3K73l25K31m4j65L05l00J43N9k30K96k33M0J48k80
4141a73K99j78l3K34l23K65q4j38K82k99J87J0k10L29k75J08J17k82L13k04J1
4162d4J90k97K62j16q4K54l11K26m1j63K89k78J46O4k51L11k38N2J49k79K82j65
4184d2l8K28l11K43q0j25K68k84J76K0j98K91k44Q7J18k70K93j91PJ91k79K52
4206A12j09q0K40l04K15l6j64K82k69J43N7k36K85k06N5J29k74K79j55m0K02k84
4228a58K28o4j15K41k67J71Pj81K78k34Q9R0k27K63j82K9J45k51K42j10o9K27
$$ y = [120, -159, 141, -54, -31, 144, -158, 123, 4, -91, 175, -149, 85, 49, -130, 163, -114, 22, 84, -155, 154, -88, -33, 120, -176, 120, -37, -79, 146, -175, 81, 1, -127, 153, -147, 43, 61, -155, 149, -116, -10, 116, -167, 152, -56, -51, 156, -153, 129, 2, -91, 182, -143, 88, 44, -121, 184, -116, 27, 86, -144, 152, -81, -41, 107, -173, 126, -52, -85, 149, -174, 91, 7, -131, 151, -148, 39, 49, -161, 168, -107, 1, 118, -164, 149, -55, -44, 146, -151, 111, -5, -89, 165, -146, 80, 39, -124, 165, -113, 33, 97, -154, 157, -81, -29, 120, -159, 123, -42, -80, 148, -163, 80, 0, -125, 143, -141, 35, 55, -143, 148, -96, -9, 109, -161, 132, -59, -52, 139, -140, 112, 3, -77, 163, -141, 74, 38, -126, 156, -113, 30, 87, -149, 136, -70, -15, 114, -160, 119, -36, -76, 126, -158, 70, 6, -109, 132, -135, 36, 43, -138, 140, -94, -5, 85, -142, 121, -61, -32, 113, -138, 104, -6, -75, 152]
4250A52k65J90k9j41K42k48J30M2j93K50j94M7J19k37K33j42j2J71k46J97p2r7
4272a03K22k39J48J5j66K42k02P6P8k01K28j52J9J37k13K05j00m9J72k10J59k8
4294C8j16J99j96R5N6j78K13j71L8J04k01K03j13k5J48k01J59n8q6J84j89J20
4316B3J6j32J86j63O6O4j58J83j07rJ16j74J61o0n8J43j68J22j3r4J62j55O9K8
4340D8j13J54j24L6O1j45J48q7j7J07j49J13l8n5J31j35O8K2r4J31j04L9N9j18
4364f2J21q2%Q9j27J06m3l5J07j19O6Qo2R7q9M1J7p6J06p3PM8q3P2m1j2O2r3O2
4393A2j5m4Q1p9M3On3Q0m8J4K8o1O1m0PL7n4M1j0j9N9n8K3J8m5N0m2K4J0m0L2
4424A8k3OJ7l5K3j1j3L6l6J9Mj7K9k7jRjnMqJ6j8J2%j0J3Qj8K1Mj1J4j8J3Kj4
$$ y = [152, -113, 77, 48, -93, 149, -99, 31, 73, -120, 130, -64, -17, 102, -135, 98, -44, -56, 115, -131, 66, -6, -103, 119, -120, 28, 43, -123, 119, -83, -7, 71, -130, 98, -54, -35, 102, -111, 94, -6, -55, 117, -93, 66, 38, -78, 121, -75, 20, 76, -102, 111, -60, -22, 82, -119, 84, -29, -54, 94, -107, 52, -6, -92, 92, -97, 23, 39, -93, 93, -70, -4, 60, -98, 85, -22, -31, 85, -89, 72, 12, -46, 97, -71, 51, 38, -56, 106, -49, 20, 48, -65, 89, -35, 1, 62, -83, 65, -22, -39, 68, -81, 32, -6, -61, 70, -65, 3, 25, -69, 62, -42, -3, 56, -62, 59, -23, -23, 66, -61, 45, 2, -33, 74, -45, 21, 29, -33, 64, -25, 16, 33, -43, 63, -10, -3, 45, -38, 34, -7, -19, 43, -50, 12, -3, -47, 34, -45, -2, 4, -49, 31, -17, -3, 25, -36, 25, -15, -8, 29, -25, 16, 6, -13, 46, -12, 11, 29, -16, 34, -8, 16, 26, -14, 18, -5, 1, 18, -17, 6, -5, -18, 18, -18, 1, 5, -12, 17, -10, -11, -2, -3, -8, -4, -12, 4, -14, -2, -2, -12, 1, 9, -9, 12, 16, 5, 19, 1, 14, 16, 2]
4460BL1k9jJ9k7K0j2rK9m3K3Lk7L7m4K9Ll6M8k9pK9n1M7j6j8M8n1M5kl5O2o8L2
4494BK8o1P7n5J0M0p2P2m6rO4r1P2j8m8Q9r9N8Op4R8q4L1K6p9J06p1j4P9j08J04
4525C3l9l9R8j21Q9op4J23j15N6K9j00J39j08K1Q9j44J27o8k1J19j51J12k2q9
4550f2J42j34O8K5j28J66j29M4O5j50J54r1k0J23j68J40o2n5J63j78J15kj07J62
4574H1j45P1N7j51J67j08NJ17j81J74r0n3J65j89J42l3j05J79j77R2K9j47K02
4597A02j73N7Q9j92K00j22k3J41j93J70o4q7J95k04J34J7j61K33j97Q8O8j87K23
4620A14j57K0J29k14K07j02m3J78k37J78l1j27K20k20J17K9j93K57j85M2J07k13
4642a24K28j51k0J79k46K05p8j00K23k34J42J3j63K56k31J06Q3k17K56j82L1J53
$$ y = [2, 33, 4, 3, 22, -5, 15, 3, -6, 23, -20, 3, 6, -21, 16, -28, 1, 4, -32, 16, -13, -20, 9, -42, 5, -11, -29, 19, -32, 13, 11, -24, 38, -30, 2, 30, -31, 46, -9, 1, 41, -31, 41, -5, -14, 50, -41, 31, 13, -35, 54, -45, 13, 19, -55, 43, -41, -10, 16, -63, 43, -28, -42, 37, -71, 33, -6, -45, 53, -68, 21, 15, -59, 64, -51, 5, 34, -66, 73, -35, -14, 75, -69, 58, -10, -31, 88, -63, 49, 27, -62, 80, -54, 14, 39, -89, 77, -52, -8, 57, -93, 61, -30, -50, 73, -95, 45, -17, -72, 91, -87, 28, 26, -81, 81, -64, 7, 64, -87, 80, -28, -23, 94, -87, 87, -3, -56, 109, -80, 62, 29, -76, 103, -74, 18, 47, -100, 102, -71, -14, 75, -117, 83, -39, -62, 79, -114, 56, -8, -95, 100, -104, 30, 47, -114, 119, -78, 10, 78, -109, 114, -43, -23, 106, -108, 99, -3, -46, 132, -105, 73, 42, -85, 135, -85, 32, 61, -132, 125, -60, -18, 89, -124, 104, -47, -67, 112, -134, 71, -7, -107, 116, -118, 24, 37, -126, 130, -101, 5, 88, -129, 127, -55, -24, 129]
4664A29k51K23j00o3K14k77J97l7j41K55k46J29N1k12K58k15O6J23k43K53j56
4685d3k4J78k67K38q4j08K41k67J81pj60K70k50J01R3k37K78j97K8J60k69K65
4707A20j35n2K14k80K18n5j34K52k62J51L4k09K89k44P6J18k59K85j81j9J92k71
4729a52K48j02j04K49k69J75jj79K94k58J12P2k35K97k16M9J50k66K51j43l4K10
4751A48k72K03n2j23K64k87J52L5k08K83k29O6J16k53K82j77j0J76k65K37r6r4
4773a04K40k77J86j8j58K69k46J17P4k23K70j99M4J51k67K63j33n1K17k76K00
4794G9n1j21K57k64J39J8j80K71k39Q4J01k39K57j56k3J76k52K20q2r8K17k42
4816a28J91l1j54K55k36J13N7j98K61j86K5J44k49K47j26m5J86k40K00o0j04K24
$$ y = [129, -122, 101, 1, -62, 152, -125, 72, 35, -106, 149, -97, 32, 83, -129, 129, -86, -20, 103, -140, 113, -43, -67, 111, -156, 82, -2, -110, 131, -136, 45, 38, -122, 148, -102, -1, 92, -145, 133, -64, -36, 124, -145, 120, -15, -67, 147, -133, 85, 30, -104, 148, -114, 37, 71, -138, 151, -93, -17, 101, -158, 127, -54, -73, 119, -152, 96, -6, -110, 139, -130, 45, 44, -135, 159, -99, 13, 85, -150, 147, -69, -20, 130, -136, 115, -28, -62, 148, -124, 79, 27, -96, 168, -119, 33, 68, -140, 143, -86, -20, 96, -157, 125, -52, -62, 114, -151, 86, -10, -104, 136, -141, 45, 27, -131, 138, -108, 9, 83, -140, 130, -69, -25, 126, -141, 122, -11, -62, 155, -121, 79, 28, -93, 164, -100, 39, 57, -123, 148, -91, -7, 94, -145, 112, -44, -67, 109, -143, 77, -5, -103, 114, -128, 63, 32, -122, 133, -103, 10, 67, -131, 130, -56, -31, 113, -136, 111, -15, -60, 126, -114, 86, 26, -78, 146]
4838A46k40J36K1j68K48k17O5R0j98K23j56LJ44k17K02r1p0J88k17J51k3j25K18
4861A13k08J06M9j72K12j50K9J12k06K09j01k9J45k09J74n5q4J83j91J15J6j48
4883i0J85j47N5P5j77J83j16nJ20j89J57o3n2J47j77J22rj06J79j61Q0K7j20J58
4907G6j20L1Q3j47J45p8k7J28j62J24m0o7J46j46Q6Nj02J50j29N8M3j30J41r1
4931b3%Q8j43J25n4l6R7j23Q5j1o9J24j07N7J9r5J22q7K5N8j07R7n4kQ0r6P6l5
4959A1l3Q5r3N5Ko5Q6o9K4K2p8Q4m4KL8p6O1j5k1N3p5O2j8k6M8n6L2K2n1N6m1
4990a8J3L3m4M5l2mK7m0L7j2rL2m1K3Mk0K2j5jJ7k1J9j6oK1k1NojOj6QlMnJ6j0
5027iKpQPpOOnRr%J7j1OJ1l0L6k1KK0l8L4k8JL3m9L0j0j6L6n0L2rl1O2n4J3K0
$$ y = [146, -94, 42, 63, -105, 143, -74, -9, 81, -117, 106, -50, -47, 97, -120, 82, -9, -79, 109, -108, 43, 20, -105, 113, -95, 11, 60, -112, 100, -50, -21, 91, -115, 94, -7, -36, 109, -100, 74, 19, -65, 118, -73, 42, 58, -90, 95, -52, 3, 78, -99, 84, -32, -37, 83, -106, 51, -12, -64, 83, -94, 28, 19, -87, 92, -69, 11, 38, -82, 76, -44, -13, 70, -77, 68, -10, -37, 91, -71, 53, 13, -54, 92, -54, 32, 37, -65, 85, -44, 14, 57, -73, 68, -23, -23, 65, -78, 47, -7, -43, 54, -69, 16, 5, -64, 60, -47, 10, 29, -66, 56, -31, -6, 52, -55, 42, -12, -14, 66, -30, 46, 11, -22, 63, -30, 25, 27, -38, 48, -21, 3, 25, -53, 31, -13, -11, 27, -49, 12, -3, -24, 29, -46, 16, -2, -28, 20, -36, -4, 18, -33, 23, -18, -5, 28, -16, 29, -3, -7, 20, -20, 17, 5, -4, 28, -13, 10, 14, -6, 16, 1, 0, 17, -4, 15, -1, -7, 14, -7, -2, -8, -9, -3, -19, -11, -14, -10, -15, 1, -9, -7, -14, -6, 1, -6, 0, 6, 1, 10, 1, 1, 18, 7, 13, 24, -6, 30, 9, 11, 31, -7, 27, -1, 0, 33, -16, 14, 4, -12, 24, -26, 6, -3, -34, 28, -26, -13, 7]
5065Gn6O6k3oL9p0O2j9k4O2o7N1ln6Q7p0M0K2p7R1o4J5M0q7Q7m3qN9j01O6j0o6
5097e6J08j01M8K2q7J19j00L2N4j21J31p6JQ8j34J10m0l7J12j46J06qr3J45j27
5122e0P2L3j32J65j19K6P5j54J55p3m4J39j71J20j8r4J54j56Q8K7j32J65j42N5
5146a1O5j65J78j10j1J44j94J60n6o3J61j84J17Nj18J97j83Q2O3j68J98j45K3
5169a5J17k11K02r8n1J72k26J77m2j13J96j97J12K6j65K26j97O9Q2j98K33j50
5191e1qJ52k30K10p9q0K03k26J51Jj44K43k29R8P4j99K43j78L4J47k62K40j22
5214a2m8J94k57K02n8j23K29k38J46K1j96K75k30Q0R3k23K57j62rJ71k71K48r9
5237a0q1K34k65J76j0j71K86k51R9R5k27K84k11L0J44k61K59j35n7K25k90K29
$$ y = [7, -49, 17, -6, -12, 27, -43, 19, 0, -24, 38, -29, 22, 19, -37, 50, -20, 20, 42, -35, 56, -8, 7, 47, -40, 47, 4, -4, 55, -46, 20, 10, -56, 52, -49, -1, 21, -66, 53, -47, -15, 39, -82, 49, -27, -26, 62, -72, 38, -2, -39, 73, -73, 33, 25, -68, 77, -50, 22, 55, -77, 88, -31, -5, 70, -84, 71, -2, -46, 93, -78, 42, 24, -70, 84, -72, 16, 43, -89, 76, -66, -11, 54, -111, 67, -43, -54, 90, -104, 56, 0, -63, 98, -86, 31, 36, -82, 115, -68, 14, 77, -91, 107, -38, -15, 102, -109, 93, -5, -56, 116, -110, 67, 25, -88, 108, -89, 23, 49, -116, 110, -87, -18, 64, -134, 99, -51, -59, 93, -137, 73, -6, -86, 117, -109, 42, 43, -101, 142, -87, 11, 85, -114, 129, -49, -15, 132, -130, 110, -12, -60, 134, -123, 79, 21, -102, 127, -111, 35, 56, -140, 135, -95, -15, 78, -145, 112, -50, -59, 112, -159, 89, -10, -91, 143, -122, 54, 44, -127, 159, -92, 7, 102, -125, 159, -52, -22, 122, -139, 120, -15, -72, 153, -137, 92]
5259I2n9j48K80k78J50M4k20K86k36P0J15k66K91j72j4K04l02K61j02j03K63k98
5281a42J99mj77K80k68J37Q0k46K93j97K2J70k93K75j29p2K39l14K41m9j70K89
5303A64k93J62M6k36L13k53Q1J26k87L05j90pK02k93K57r8j09K57k93K02j3j84
5325a41L10k71J20Q8k63L20k18K6J81k98K86j54o0K37l00K30n4j51K86l00J66
5346D0L4k17L00k53Q0J24k75K99j84j9K06l00K65r6j12K70k92J82Rj93L13k76
5368i5J13Q8k48K89k08L2J66k76K68j30o3K25k85K08m7j57K76k60J41L9k21K88
5390A43k26N3J36k57K67j62k0J95k91K50q7j02K51k85J85nj64K69k38J03P6k26
5412a35K77j86J8J56k61K49j21o3K19k66J89m6j26K44k50J36L2j85K51j96M4J10
$$ y = [92, 33, -115, 165, -113, 37, 81, -139, 147, -89, -19, 96, -170, 121, -51, -65, 139, -163, 98, -4, -107, 156, -142, 57, 53, -124, 156, -112, 25, 105, -141, 152, -45, -23, 147, -146, 129, 0, -72, 167, -147, 94, 45, -125, 164, -129, 33, 79, -157, 156, -97, -16, 110, -177, 128, -62, -69, 133, -160, 97, -1, -110, 147, -146, 56, 43, -141, 169, -102, 18, 106, -157, 163, -55, -29, 152, -146, 140, -14, -74, 163, -137, 93, 39, -112, 174, -126, 40, 74, -143, 157, -96, -16, 108, -167, 132, -52, -71, 135, -165, 100, 4, -108, 162, -130, 52, 61, -132, 181, -95, 18, 106, -142, 147, -61, -29, 137, -139, 129, -1, -64, 161, -124, 84, 37, -120, 156, -104, 37, 76, -145, 143, -83, -30, 106, -151, 116, -46, -66, 129, -162, 88, 1, -101, 150, -135, 50, 45, -119, 150, -88, 15, 91, -135, 142, -44, -26, 130, -131, 118, -3, -66, 153, -113, 76, 30, -96, 148, -102, 34, 66, -119, 132, -64, -20, 90]
5434I0k33K44j35l7J86k49K03p6r4K33k42J39J5j50K34k03Q8P8j98K24j50J2J42
5457A21k29K14j15m3J78k19J67m6r8J96k18J21K8j61K02j58L7R2j73J90j15j9
5479d8J28k01J77o2p8J81j93J32mj21J84j62Q0M9j52J91j36K2J12j76J55p7m2
5502d1J39j71J30l3q8J62j52P8K7j22J49j18K4P9j42J47r4pR8j42J13l3m9J14
5526F8j30Q5Kr4J28r7M9M1j05J23q7J6P8j31J13m5l9R2r6O7qn8Q7q4L8J7p4R7
5554E3p2J7M2r3Q6m7j2O5r4O7pl5N9n9L4Rm7N9n1K8J6l9O6n2J1K4m2M9j9k0K3
5585A9k5L9pk9L0j7kJ2k8K9k2KJj2J2kj2J7j1NKj2%J4nlPlNj2J2Nj0J2opK1k0
5623aJ6mkJ3j0kJ8k8K1k0j8M2m9M2k8j0M0n4M2Jl0L7m0J9K0n6P1n4PM7o7N4k2
$$ y = [90, -143, 101, -34, -71, 115, -134, 69, -7, -101, 132, -110, 29, 44, -106, 128, -75, 13, 91, -107, 117, -33, -21, 121, -108, 106, -9, -52, 126, -93, 74, 28, -70, 126, -92, 29, 57, -104, 98, -60, -23, 69, -104, 86, -29, -48, 80, -121, 56, -6, -84, 97, -96, 36, 32, -89, 95, -67, 13, 62, -90, 101, -35, -13, 99, -77, 78, 1, -41, 98, -73, 57, 24, -64, 98, -54, 24, 51, -71, 78, -40, -16, 63, -79, 68, -26, -33, 65, -77, 36, 3, -46, 68, -62, 23, 25, -69, 59, -38, 11, 52, -53, 70, -17, -1, 77, -54, 59, 14, -25, 67, -29, 38, 30, -28, 59, -25, 13, 30, -44, 53, -19, -2, 40, -53, 33, -14, -26, 39, -55, 12, 5, -30, 29, -30, 4, 13, -34, 25, -26, 2, 18, -21, 45, -7, 4, 28, -14, 35, 16, -4, 19, -6, 33, 26, -3, 27, 10, 8, 20, -8, 21, -1, 1, 2, -10, 2, 0, -12, 5, -6, -1, 1, -11, -11, 3, -2, -5, 2, -1, 4, -8, 4, 9, -1, 11, 5, -2, 19, -1, 15, 11, 9, 22, 12, 10, 28, 0, 21, 1, -17, 25, -24, 18, -10, -20, 20, -34, 8, 9, -21, 16, -24, -5, 15, -41, 30, -24, -17, 30, -37, 17, -5]
5656ej5O7p8N2jm9P9p5M3J8p2R8q0K5M2q8Q6m5qO6j00P4k6m0Q7r5O0mp5J25j10
5687d4L5M9j10J20p3LO9j15J10m9m0J08j17Q6nq2J34j34O7L6j11J44r7jR6j39
5713f0J38p4k8J11j56J20m5o5J47j60Q8K4j19J59j29L6O8j55J65r4j0J13j76J59
5737E7o2o1J64j75J14jj12J77j50P4M6j55J83j36K2J07j86J84r5l3J42j94J45
5760E5l1j01J86j93J06K0j41J94j58M5Q1j80K00j21k4J56k10J79o2p8J81k03J39
5783D0Nj43K14j85Q7N7j71K13j48J7J30k19J98q9o5J83k21J55l1j06K20k43J20
5806A8L9j71K16j65M7R8k05K11j28j9J67k36K02p8q8K19k36J52Jj54K45k08R1
5829A8P3j94K24j68K2J36k26K30j21m8J92k43J76m5j15K36k44J15N1j93K45j97
$$ y = [-5, -20, 47, -31, 21, 20, -29, 50, -25, 18, 36, -36, 62, -18, 7, 49, -39, 47, 2, -6, 60, -40, 34, 8, -32, 55, -40, 20, 16, -59, 66, -44, -9, 40, -70, 50, -23, -20, 49, -66, 44, -5, -45, 63, -54, 32, 27, -55, 79, -55, 12, 48, -63, 81, -16, -17, 79, -60, 78, 4, -24, 87, -69, 51, 6, -59, 88, -72, 16, 40, -79, 80, -49, -13, 55, -100, 65, -29, -39, 74, -102, 57, -5, -66, 98, -77, 37, 36, -76, 101, -49, 25, 71, -84, 99, -37, -15, 92, -94, 90, -5, -38, 104, -90, 55, 24, -77, 109, -84, 22, 42, -99, 95, -63, -18, 63, -117, 83, -38, -62, 94, -116, 63, 1, -77, 104, -99, 40, 45, -98, 116, -69, 18, 75, -96, 117, -31, -14, 116, -103, 95, 6, -59, 124, -97, 58, 27, -79, 141, -102, 18, 57, -114, 102, -63, -16, 82, -123, 88, -40, -59, 108, -128, 74, -4, -92, 127, -109, 43, 44, -110, 135, -73, 18, 91, -103, 121, -47, -25, 111, -115, 115, -6, -54, 138, -105, 71, 26, -89, 147, -97, 18, 69, -124, 121, -76]
5851g6N5J11k26K43j55j4J64k44K15p5r0K16k35J59lj60K48k13R3P9k08K47j63
5874c2J3J36k44K34j10n1J92k50J91m8j18K29k44J32M0j86K40j99N4J10k27K39
5896A01j44j9J75k49K07p4q1K12k42J53J2j68K56k12Q6P5j90K29j73J7J52k36
5918a13K17j12n0J88k41J83l8j33K28k16J22K9j75K32j90N6J03k27K27j27j7J66
5940A12k30J79n8r7K09k21J42Nj46K30j94P0Q0j93K30j57J0J35k14K07q9o1J78
5963A27k24J60k7j26K06j99R8M0j70K24j78N6R7k04K11j21k4J55k09J67o4p8J91
5986A08j96J23kj37K18j89Q0O3j58J95j43K5J20j98J74p2m8J47j89J51l7j05J84
6009A14j95J11K7j42J78j49K9J01j81J81j05k7J36j77J39m0p5J50j58J17mj02
$$ y = [-76, -21, 90, -136, 107, -48, -62, 102, -142, 73, -2, -92, 124, -111, 48, 45, -115, 133, -80, 13, 92, -116, 131, -32, -19, 117, -127, 107, -3, -54, 138, -112, 79, 31, -87, 142, -102, 30, 70, -116, 124, -75, -21, 89, -138, 101, -43, -62, 113, -136, 71, -3, -84, 128, -114, 39, 51, -117, 139, -73, 13, 88, -102, 127, -46, -29, 123, -113, 104, -8, -58, 130, -111, 72, 34, -99, 129, -87, 35, 64, -111, 121, -69, -13, 90, -137, 90, -37, -54, 112, -118, 61, 3, -94, 115, -106, 36, 41, -105, 125, -69, 1, 81, -112, 118, -39, -29, 106, -108, 99, 10, -51, 127, -97, 63, 36, -90, 116, -83, 15, 55, -115, 109, -69, -13, 84, -120, 91, -30, -54, 101, -108, 59, -5, -83, 108, -88, 35, 33, -104, 114, -75, 5, 68, -90, 105, -38, -13, 107, -91, 83, 11, -37, 110, -79, 72, 35, -70, 114, -81, 30, 57, -85, 93, -56, -27, 74, -107, 74, -31, -58, 78, -99, 40, 0, -75, 75, -83, 34, 30, -72]
6031g2J62j46N7N3j29J54j05J4R2j64J62q0l3J29j54J09k5q5J44j37P1K1j13J40
6055F5r8K2O1j32J30q1oR5j34J11m7n1J19j30R2Rq8J28j05M2L9r1J16q4PO7j16
6082f0J20m9l9R9j23Q5qo5J03j02N8J4q9J05q5J9N0r5R7n8j1P3r9P9k4m5Q8q6
6110d8N6jo5R1o9L5K5p0P9m6KN1o7O9l1k1N8p8O6j9l9P0p1L6J1o0O8n5J6L1o1
6141c7N0l5jL3o3N8j0k7N9n4K8mk5M6m3K2J2l7M2j1lJ5k5L6j9pK5l0K2mj7L3l3
6174dJ4KnKj1kJ7j8J1j0mJ0j3J2rK%mLJ0lKqOrJ4plK0k4J7PoNkLprJ0pJ7j5N%
6218Ij5QOj9K6k5QJ1k0K8k5kJ5k3K7k4kK6l6L3qqL5m2J6Mj5L3k7J4Oj8M5m8KL3
6254B8n4N8j5l5N6o0M5j7k7N7o5L1J2o0P1m6J7J7n4O1m5LL3n6O2k1k2N9o8N5p
$$ y = [-72, 90, -56, 1, 54, -75, 79, -26, -12, 80, -84, 78, -2, -35, 94, -60, 49, 24, -61, 83, -54, 17, 38, -75, 65, -33, -11, 50, -82, 48, -33, -39, 56, -78, 33, -14, -65, 54, -76, 16, 25, -63, 65, -40, 2, 41, -50, 66, -18, -11, 56, -60, 60, 11, -28, 71, -52, 33, 25, -40, 63, -39, 19, 33, -56, 49, -36, -17, 33, -62, 35, -23, -34, 39, -60, 19, -5, -50, 38, -48, 8, 7, -58, 33, -36, -1, 24, -46, 33, -13, -11, 40, -27, 42, 11, -10, 48, -30, 36, 17, -22, 48, -23, 13, 24, -36, 32, -23, -7, 24, -37, 13, -22, -23, 10, -53, 5, -5, -32, 27, -27, 1, -3, -28, 18, -25, -3, 9, -28, 14, 3, 0, 15, -10, 26, 7, 0, 25, -5, 17, 13, -4, 29, -4, 10, 12, 7, 9, -2, -4, 13, -5, 6, -4, -8, 2, -11, 1, -8, -6, -6, -10, -7, 3, 0, 2, -6, 0, -9, 5, -2, -5, 15, -9, 8, 15, 9, 14, 12, 15, 8, -1, 9, 2, 19, 4, 9, 9, -6, 2, 8, -11, 15, -10, -2, 9, -11, 17, -8, -10, 5, -18, 9, -15, -17, 9, -27, 6, -2, -10, 25, -17, -1, 3, -12, 21, -6, 8, 14, -4, 41, -7, -5, 28, -26, 32, 17, -18, 38, -22, 23, 6, -21, 36, -29, 2, 14, -46, 25, -21, -4, 13, -41, 20, -25, -22, 11, -45, 17, -4, -26, 33, -35, 20, 13]
6285A3m5P6o2K8K0o0P7m9J1K8o9P5m2k0P2r0O2k4m4R6q4M9Jo6R2q8L5M2j01R4
6315B7n2JO2r5Q8m6k2R0r8N5%m7R3q5M6K4q4J06p8J7N9j11R6m7j9Q0j03Q7l1n1
6345c8R5j00O8kp8J16j09M1M6j05J13p3PO6j10R6m1m3J03j11Q2po9J24j20O7J4
6372C2q9J30r8K7N6j06J17o7k3Q8j18R7l0o4J22j23O3J1q4J14j05N4L6j19J37
6397E8q0j6R0j31J23n8l2J10j25P9Lp9J22j03M4L9r8J28r5J5O1j15J21p2j2R4
6423G1j34J07l5n1J10j17P3Lj03J40j09M2M5j31J30q5kR8j35J27n7k8J03j35R9
6448B6pp8J30j26O5L5j10J34j02K5P3j23J15o2k3J15j35R3k9n9J16j25P3Or3J41
6474G5j20L8M3j04J25q9nQ6j25J04m2k9J15j35Q2jq7J55j24N8J8j02J40r8K6N9
$$ y = [13, -32, 44, -18, 10, 30, -30, 47, -2, 9, 37, -32, 43, 1, -19, 53, -37, 25, 1, -43, 53, -31, 18, 19, -47, 45, -43, -8, 34, -67, 27, -25, -24, 38, -57, 31, -15, -37, 53, -45, 10, 10, -37, 56, -29, 17, 41, -43, 63, -15, 2, 61, -50, 46, -1, -20, 60, -43, 44, 13, -38, 57, -43, 25, 23, -55, 61, -48, -7, 39, -66, 47, -26, -19, 47, -63, 33, -8, -51, 52, -59, 23, 16, -53, 71, -49, 18, 32, -57, 73, -25, 2, 58, -48, 69, 2, -21, 67, -51, 46, 16, -48, 74, -49, 14, 25, -59, 55, -50, 4, 40, -79, 58, -22, -38, 52, -79, 44, -14, -46, 64, -61, 18, 21, -58, 64, -39, 5, 44, -54, 74, -21, -6, 55, -60, 61, -11, -23, 71, -63, 44, 9, -42, 68, -49, 24, 27, -76, 64, -45, -3, 42, -89, 41, -44, -46, 52, -83, 44, -13, -41, 62, -73, 26, 19, -59, 71, -55, 10, 45, -65, 69, -33, -8, 65, -58, 57, -5, -28, 87, -48, 45, 16, -43, 73, -52, 21, 27, -66, 75, -45, -7, 36, -68, 57, -32, -37, 49, -76, 28, -14, -43, 72, -63, 19, 18, -69, 86, -38, 20, 38, -64, 76, -22, 4, 63]
6500F3j06R9n7k7R6j21J01l4o2J12j18O9J8r1J32j18M2L9j10J21q3NQ2j30J17
6525C9n4k6Q5j08P5Kp3J31j10M7K6q6J16r3K9O6j17J07m9k5R9j37J02l3n6J25
6551H2j23P0Qr5J24r8L6L7r8J07p7JP9j22J00l5l6R9j14P1No9J08r6M3L2q5J10
6579F4p5PO2r8R8n0j3P3j13Q6k3l7Q0r8N3J0p7J12q6K5L4p7Q7o3pP1r4Q1l6l0
6609c4Q6j00O9j1n4R6p5L4K2p1Q6n8MN7q3Q4m1k4P9r1N6k1k8P5q0M8No7P9o5K3
6640@K1p1Q0n3oN8p1N2j9k0O2p9O4j0m1P2o0K5J7m4O0n1J8L5n9P0m6j2O0o7N6
6671D1l4k5N6n6L5J0m3N7n7J8J6n2N9m3RL4o1N2k5j3L7m9L9nj8M5m9K4J1m0O0
6702C3l4J1K1l9L6j3k7M0m3L6j8lL5k8PNk9K8k8jK8l0K9k4oK5l6L0qj3K4l4K0
$$ y = [63, -43, 56, -1, -28, 68, -53, 48, 14, -48, 64, -54, 15, 33, -58, 74, -44, -2, 37, -73, 48, -35, -30, 52, -78, 39, -15, -41, 44, -64, 11, 13, -60, 71, -39, 8, 34, -52, 64, -29, 0, 66, -51, 56, 7, -18, 81, -56, 46, 13, -43, 82, -41, 29, 37, -58, 66, -32, 4, 41, -57, 50, -27, -26, 53, -69, 31, -4, -40, 59, -55, 16, 21, -48, 60, -36, 7, 39, -46, 64, -11, -4, 58, -40, 58, 8, -5, 68, -45, 41, 18, -19, 61, -37, 16, 26, -51, 61, -25, 0, 34, -43, 44, -19, -26, 45, -49, 32, -4, -34, 52, -48, 21, 10, -44, 52, -23, 11, 33, -38, 48, -10, -6, 51, -32, 52, 11, -13, 66, -25, 31, 10, -18, 57, -23, 25, 30, -37, 42, -23, 0, 21, -50, 30, -23, -29, 29, -42, 10, -9, -29, 33, -46, 18, 8, -33, 39, -21, 4, 21, -23, 37, -14, 4, 39, -20, 50, 4, -8, 52, -15, 41, 7, -18, 38, -18, 17, 27, -16, 41, -16, 2, 18, -34, 25, -18, -9, 25, -36, 16, -9, -22, 15, -34, 5, 0, -18, 27, -22, 2, 13, -27, 33, -1, 10, 31, -8, 28, 15, -12, 28, -15, 21, 3, 0, 35, 7, 14, 19, -10, 18, -10, -11, 17, -13, 16, -8, -14, 11, -25, 5, -3, -16, 8, -26, -6]
6735fMlK0k8PJ7k2K4j2KJ5k2K3j4OJ3j7J9j2nRqJ3oj8K9k4nJ8j7Nrj3J9j3K2k0
6772ikjjJ1lrJ0J3j2lJ2Lk%Lj0PJ1Oj9J3kmQj2J3j1kOj1O%klkJ2j4j4J8j8LK5
6814A4k5J0j5J5Kj4K5k0KK2j6J6j3JK4l2J7J4k4K3k1NJ5k4K2j3j1K8l3J5rnL4
6847B9l9J1lpK6k8J1Kk7L8l7J5Rl2L5j0pK9l2K9j2k2M7l5K5J1l2L7l0J0J6k5K5
6880B7j9rL5m7M0k4j4M3m7K3Ol1L6l4OJ7l5L8k3lL1n2N0j2rL4n1L8lk8N4m1J5
6913A1J6m4N4l8J8K6o3O0l1j5N2n9M8k8j5M4n3L5nm0N2n7K7J7n3O1l8%M5o1M3
6944Il0%M9o9M8Pl8N3n5M2J6n7P0m7J7K6o6N8k0pM1p3N2pl0N3o1L4Km5O4o4K5
6977cK2o9P9m5kM5p2O3k5j8N5p1O3j0m5P6p6L8J0m3O8n2J5L1o5P5m1lM9p7O3j8
$$ y = [-6, -2, -5, 15, -13, -6, 11, -11, 13, 1, 3, 18, -4, 19, 5, 11, 24, 7, 26, 14, 9, 18, 10, 23, 17, -1, 28, 4, -1, 17, 0, 5, -4, -17, 2, -11, 11, -9, -11, -12, -13, -2, -5, -14, -4, 9, -3, -6, 6, 9, 7, 7, 10, 0, 7, 18, 24, 5, 18, 16, 12, 20, 8, 21, 10, 8, 14, 3, 9, 9, 7, 4, 2, 14, 0, -14, 4, -14, -11, 14, -11, -1, -16, -1, 1, -13, 12, -8, -6, 16, 0, 16, 3, 4, 28, -4, 13, 27, 3, 26, 5, 10, 25, 1, 23, 10, -1, 27, -6, 9, 0, -5, 29, -10, 1, -2, -9, 17, -11, 0, 2, -25, 13, -24, -9, 0, -32, 3, -7, -14, 15, -17, 12, 0, -22, 25, -10, 15, 26, -6, 31, 1, 11, 27, 2, 27, 8, -1, 34, -13, 27, 3, -11, 32, -15, 8, 14, -17, 19, -15, -9, 8, -27, 11, -12, -15, 16, -36, 14, 2, -7, 27, -24, 14, 11, -17, 37, -4, 11, 27, -17, 37, -1, 17, 43, -20, 40, 9, -6, 46, -13, 35, 7, -8, 36, -17, 18, 13, -27, 25, -32, -5, 12, -41, 20, -18, -18, 27, -34, 9, -21, -21, 28, -41, 7, 14, -24, 29, -26, 16, 32, -25, 45, -2, 15, 41, -25, 33, 13, 6, 47, -26, 26, 19, -11, 42, -19, 15, 17, -28, 36, -28, -3, 19, -50, 29, -16, -18, 27, -45, 18, -7, -25, 30, -41, 22, 12, -33, 43, -33, 5, 15, -28, 40, -12, 3, 34, -31, 44, 3, 0, 49, -28, 35, 17]
7009A7l0N1o1N1j0n4O6n3J8L7o1N9n7QN4p6O8k8k2O8q2O5j8k9N5o5L7K5p1R1n1
7040B%L9p0P7m4oO0q6M7j0k9P4q2N5nn4P5p4K8J8n9P1n1MM8q0Q0m0j4P3r6O4%
7073A5m4Q0q0M7Qn9R3p1J1M7q3P2l6lO4q0M8j0m1P3p0L6J2n9O8o0J9L1p9P5m7
7104b3JN2q5Q1m0j0N8p3N9j6l3O9o8M4Qn7Q0n6J4L4p3Q3m1j0N2p6N5k2j8N2p1
7135c0M3Ml5N3n9K1K9o8P5n3J1L4p0O7l6j6N3o6N7ok9O3p5M3J2n3P2n2PL7o5P2
7167D0l3j4M7o7O5j4l7O2p4N5Lo1P3p7L3J9n3M8l9LM6o4N2rl7N7n1M0mm4O1n2
7199b6M2Qm8O3m6RL6n8N4l8mM8m7M4j9k3N5o1L0ll8N6m5J6J4n0N0m1J1L1o0N2
7231A2k1j7N2n9L3J4l7M8n3M6ll2M9l7J2L1n9N4k7lL4m5L9k1qL4l9K7Mm2M7m3
$$ y = [17, -13, 38, -23, 28, 18, -36, 30, -23, -5, 32, -29, 30, -27, -19, 35, -41, 27, -1, -23, 45, -37, 28, 10, -19, 36, -29, 8, 33, -38, 53, 2, 2, 41, -29, 48, 4, -2, 58, -28, 19, 9, -20, 54, -28, 27, 22, -32, 43, -31, -3, 15, -44, 27, -24, -20, 28, -52, 28, -12, -26, 47, -49, 15, 15, -29, 51, -29, 18, 26, -33, 60, -11, 0, 47, -36, 36, 0, -3, 61, -19, 29, 19, -22, 51, -19, 17, 29, -30, 38, -22, -3, 28, -51, 24, -23, -22, 30, -55, 26, -14, -24, 34, -39, 20, 4, -29, 40, -28, 16, 24, -33, 47, -9, 5, 39, -34, 49, 8, -2, 50, -26, 29, 7, -11, 41, -30, 13, 17, -18, 35, -24, -3, 26, -42, 33, -20, -9, 25, -45, 22, -14, -30, 23, -43, 14, 8, -21, 42, -33, 10, 22, -31, 41, -11, -4, 33, -32, 40, 7, -7, 40, -27, 38, 24, -13, 49, -25, 30, 33, -28, 45, -32, 1, 20, -33, 15, -24, -21, 25, -39, 13, 4, -33, 24, -27, 13, 9, -35, 26, -26, 16, 24, -24, 39, -7, 2, 38, -20, 34, -4, -8, 40, -7, 37, 18, -5, 50, -11, 19, 16, -22, 34, -11, 5, 19, -31, 19, -22, -11, 20, -40, 12, -9, -26, 26, -33, 0, 14, -23, 25, -28, 18, 15, -17, 32, -5, 7, 38, -21, 33, 6, 3, 37, -8, 31, 10, 2, 36, -3, 24, 28, -14, 33, -10]
7263a0J8J6n1N4l4j0K6m2L9jk7L3l7L4nj7K6k0MRk6M0k7J7J3k7K2j0OK8m1K6j1
7296A5j2L1l1J2Qk6J1j8RJ7l1K3j6j6L7k7J8qj9K3rMLrJ8rPOj4J4j1LJ9j9J8j1
7332A0LJ7l1K2j2jJ6k0JJ2j4J4j8ROj0Nj4jQj4P%rJ3%krKRpkmJ4nKJ1J0qKMon
7375EJ0j5PPLkmlNoNojJjJj2KLj4KN%Rj1LlKJ2nj4J7nPMqNj1J6Mj8K7j6J0%rJ5
7422B3k1RNj7K4k0mJ3k0J4mj7L2l9K5Kk9L5k6J2J4l4L4j6j4L6k8K4j1qL1m3L7
7455A9lk5L3l3K3J6l9M5l2MK6m3L4j1k0L2m5L3kk4L4n2M1%m4L9k6OK6m5M6k4m
7488a5L7m7L7j9nL6l9K3J0l6M8l1J2K5n0N5k8rM7p2N6l8JL9n9M3j1l8N1m7K2J5
7520A3n3P0n2PL2n3M8l5MN6o4M4j3l0O7o5M6Ln0P5n8K2J7n7P6n4KM4o3O3m1j2
$$ y = [-10, 8, 24, -27, 27, -7, -17, 9, -33, 6, 5, -22, 11, -26, 8, 3, -14, 12, -8, -4, 5, -21, 19, -8, 9, 22, -5, 17, 7, 13, 41, 0, 26, 15, 3, 34, 3, 15, 23, -3, 8, -10, -1, 16, -15, 8, -8, -24, 13, -14, 4, -4, -23, 0, -9, -5, -2, -11, 7, -2, 5, 11, -3, 11, 0, 3, 22, 3, 21, 10, 13, 30, -1, 21, 9, 8, 24, 4, 5, 17, 3, 17, -1, 8, 14, 4, 9, -5, -6, 2, -12, -5, -5, -14, -1, -1, -3, -12, -10, -1, -8, -10, -14, 0, -5, -3, 8, 18, 10, 12, 16, 10, 5, 15, 0, 7, 14, 17, 15, 11, 8, 13, 7, 12, 6, 5, 6, 5, 6, -6, -4, -1, -15, -13, -8, -8, 1, -10, -7, -10, -8, 4, -1, -15, 2, -3, 4, 8, 0, 5, -6, 10, 14, -4, 23, 7, 17, 17, 8, 23, 2, 11, 16, -1, 23, 3, -1, 12, -8, 6, 2, -15, 17, -22, 3, 5, -24, 11, -15, -3, 11, -23, 11, -5, -19, 17, -11, 13, 2, -6, 25, -18, 19, 16, -9, 24, -9, 14, 30, -9, 36, 4, 8, 34, -9, 25, 14, -6, 26, -19, 14, 12, -12, 22, -30, 11, 11, -33, 6, -20, -14, 12, -33, 13, -11, -15, 22, -25, 12, -7, -12, 24, -15, 8, 18, -18, 30, -1, 11, 36, -14, 41, 13, 4, 51, -21, 35, -3, -2, 37, -22, 21, 10, -28, 23, -24, -2, 13, -40, 30, -22, -15, 17, -36, 12, -23, -19, 37, -27, 17, 4, -26, 41, -24, 22, 25, -25, 50, -8, 14, 31, -26, 50, -4, -2, 42, -21, 42, 1, -11]
7552a1N2o9L7lm2Q1p1L5Mm4O0o1L4K4p6P6m8QN1p7N7j7l0P6p7M2Ml8P6o4K9J9
7584C7o7O5m4J1L8p2O9l7j4O0q1N9k0m0P3q5N2J4p1Q6o7K0L7p2Q5n5pO7r2P3k5
7615ck4O5p7N9rl4P7p9L4K4o1P9n7NL9p3P2l9j6O4q5O2mn2P5p8M8Oo2Q3p0J7L6
7648B2p2Q3m7j5O0q8Q9m2k3Q0r3O0Rn8Q2p2L5K4p1R2n1lM4q2P7l3j8O9r8O9j3
7679A6n8Q6p4L1J2o0R2q6L3K8p5Q9n1qN3p8P3k5l0P9q4N1Jn4R3o4K0L3q8J02o8
7710a1QN4q7Q5m3k0O5q2N7j0m9Q0p5L3J3o3P3n9J8M4p2P4n7jN4q2P1k6l0P2p1
7741c7M7J0n3Q1p7L9K8o8Q2n7NN2p9P5l7k3N6q6P5k0m3Q5q6L9J0n5P9o2RL1o2
7772d2P2n2nN5o5N8k7k0O0q3N9Nm0O7o5L2J6n0O5l5JL6p2O7k4k1N8o9N3rn5O9
$$ y = [-11, 41, -28, 9, 6, -36, 45, -26, 9, 13, -31, 29, -32, 2, 26, -50, 26, -22, -14, 37, -40, 17, 0, -30, 46, -31, 11, 15, -23, 53, -11, 18, 37, -30, 35, -9, 2, 40, -32, 37, 0, -14, 46, -35, 24, 4, -36, 37, -48, 4, 18, -53, 33, -34, -14, 23, -49, 36, -19, -26, 41, -51, 22, -3, -27, 38, -39, 20, 11, -23, 54, -25, 9, 33, -28, 51, -6, -1, 38, -35, 37, -2, -18, 46, -39, 23, 19, -33, 42, -36, 12, 18, -44, 39, -31, -14, 22, -50, 33, -14, -29, 31, -57, 32, -10, -33, 47, -46, 14, 23, -35, 47, -25, 10, 34, -37, 55, 4, 1, 45, -37, 40, 7, -11, 58, -40, 29, 16, -42, 44, -30, 1, 13, -47, 45, -41, -8, 20, -55, 34, -17, -25, 28, -50, 23, -2, -32, 47, -37, 14, 15, -39, 54, -10, 10, 43, -45, 57, -11, -3, 51, -36, 49, 6, -14, 51, -31, 26, 16, -33, 47, -28, 5, 18, -45, 28, -31, -13, 31, -41, 33, -24, -25, 29, -53, 18, -8, -38, 34, -37, 10, 20, -33, 48, -29, 10, 38, -30, 52, -5, 0, 52, -27, 48, 11, -12, 44, -42, 33, 13, -30, 55, -31, 8, 18, -37, 42, -20, -11, 20, -42, 30, -22, -27, 28, -37, 21, -6, -26, 34, -49, 10, 15, -25, 42, -23, 9, 25, -25, 40, 5, 6, 42, -30, 37, 13, -8, 50, -19, 34, 25, -30, 39]
7804C9o8M7nn4O5m4QK8n1N6l5kM6o3M6j0l9O2o1M9Om5O8o0L0Qm6O9m6J4K3n0O2
7837D7l4k0L9m6L0j2j9M5n3K8J0m0O4o2K1J9l6L3j3j1K3m5L7pj8L7l9L8Jk8L0
7868A9k5QJ9l0L5k4J0J4l3M3k3k1L7k7K1j6j2L2l4J1J1k5L0k9kJ7k6K2j4KOk0
7900b4K2mj2K3j5QLqK8k2J4Qk9L1j9QOj2J2qkMkKjL%pJ1j3qJ0%KnoJkpJ5j1%Q
7943BJmMNj1PMjMqJ3Rj0oKJ3j8J3MkLk5J8Qk5J4Kj6PlNj1%Rj4RlmNqNMj5J8rN
7989@Rk1J6Kj6L5k5QlMJ9k6J1Nj0K4k7J1Kj8K5k8PJ7l8K3Mj6K1k6J8lk1M0l7Q
8025fRl4M4k3oL4m8M4j3rL4l5L8rk9M6m9K9Ok8L6l6PL6m4K2j0k0M0m8L3Qm4M7
8059B2n0L1Pl5M5l8J4J3m8N7l5%L3n2N8k7j2M2m9L9nk4N1n6K4K2m8N2k4mM2o4
$$ y = [39, -29, 18, 13, -41, 24, -20, -12, 16, -35, 21, -14, -16, 30, -33, 13, 3, -36, 26, -35, 14, 20, -25, 43, -17, 13, 21, -25, 44, -2, 12, 35, -15, 47, 13, -7, 32, -14, 16, 4, -15, 30, -23, 5, 15, -25, 39, -23, -2, 17, -19, 14, 1, -10, 13, -32, 5, -2, -20, 17, -22, 16, 17, -11, 19, -6, 2, 21, -9, 26, 2, 12, 26, -7, 36, 13, -8, 29, 2, 23, 7, -5, 27, -7, 4, 15, -10, 20, -9, -11, 6, -20, 2, -12, -10, -4, -24, -2, -6, -18, 5, -10, -2, 1, -7, 21, -1, 13, 21, -8, 23, 4, 12, 18, 6, 18, 10, 8, 12, 10, 12, 11, 14, 14, 7, 18, 5, -3, 7, 7, 9, 4, -2, -1, -3, -10, 5, -6, -6, 2, 3, -1, 3, 8, -3, 4, 8, 7, 11, 3, 16, 25, 15, 9, 11, 24, 6, 19, 23, 21, 24, -1, 17, 25, 0, 14, 16, 0, 7, 4, 9, -2, -2, 7, -7, 2, -1, -5, 0, -8, -3, 1, -14, 4, -5, 0, 9, -12, 4, 6, -10, 25, 0, 8, 5, 9, 28, 2, 13, 18, 8, 32, 5, 16, 18, 0, 25, -3, 4, 21, -17, 6, 10, -6, 15, -11, 7, 4, -17, 23, -14, -6, 3, -31, 13, -10, -16, 18, -30, 14, 1, -8, 26, -9, 29, 20, -9, 37, -12, 17, 23, -5, 31, -5, 2, 38, -6, 16, 6, -14, 26, -22, 11, 19, -25, 22, -28, 3, 10, -25, 20, -18, -4, 9, -39, 18, -17, -17, 16, -36, 22, -5, -17, 25, -24, 15, 10, -14, 37, -19, 5, 27, -21, 31, 7, 3, 45, -19]
8091a9N1l4j1N5o6N2k6k9N1o1M0Ml9N8n1K0K7n9O4l8j2N1p2O7k5j4N7o6M9km7
8122b5O6o1L4Pm4Q1o8J6M1o6O2m3mN2p8O0j5m5P2q0M4Pn2P1o5K3L8p0P9o1J2M6
8154C4p6P8l5k0P7r7O1nl8Q1p4K7K9o6Q0p2K2M5p4O6l8k6P0p9O0kn9Q8q6M3Po7
8186d6Q2p4K8L3p6
$$ y = [-19, 32, -2, -13, 42, -24, 28, 2, -27, 24, -37, 3, 7, -32, 26, -25, -5, 22, -37, 27, -11, -23, 28, -44, 23, -2, -16, 41, -25, 24, 22, -25, 41, -20, 14, 21, -23, 58, -10, 6, 47, -19, 43, 0, -4, 48, -30, 30, 15, -30, 42, -38, 6, 13, -39, 32, -33, -10, 28, -42, 37, -24, -12, 34, -42, 36, 1, -19, 58, -39, 22, 17, -21, 60, -14, 13, 42, -24, 56, -16, 6, 51, -23, 43, 5, -21, 49, -30, 30, 28, -31, 57, -29, 14, 21, -46, 36, -38, -10, 23, -53]
8191e3
$$ Imaginary data points
##PAGE= N=2
##DATA TABLE= (X++(I..I)), XYDATA
0@%%%%%%%%%qJ6j6J6k4L2m0M8n6P2q8J12j36J60j90K22k56K96l49M05m64N34o12
32c26O94p87Q92j007J135j275J426j591J774j975K193k431K692k976L287l627
48a902L997m401M847n338N880o481P150p901Q748r710J0815j2102J3619j5440
62h219J7675k0492K4169k9192L6530m8418P2025j92537K63690m0725j05391K09612
74A78727m93966M52371r8161j56003L13885l79947K67050j8535k74861M18458
84B09018l39944J62939R3701l17188L55656k91436O7447K78724l54877K53995
94A18035k42251l196L83631l59006J68286j12771j03568L85767l57411J35434
104A2950M9922j99072L23390l16196Q5252J78504k68497K89523k27899j5977K22903
$$ y = [0, 0, 0, 0, 0, 0, 0, 0, 0, 0, -8, 8, -8, 8, -16, 16, -24, 24, -32, 40, -48, 64, -72, 88, -102, 120, -136, 160, -189, 216, -248, 286, -326, 368, -419, 473, -534, 601, -674, 752, -839, 935, -1040, 1153, -1278, 1414, -1562, 1725, -1902, 2095, -2306, 2541, -2797, 3083, -3398, 3752, -4149, 4599, -5111, 5704, -6398, 7221, -8219, 9456, -11036, 13133, -16059, 20471, -27947, 44078, -148459, 115231, 74506, -30885, 178727, -315239, 137132, 38971, -117032, 196853, -183094, 83956, 65421, -209440, 209018, -130926, 32013, 125714, -191474, 164182, -127254, -59807, 218917, -135960, 118035, -124216, -127412, 256219, -102787, 65499, -47272, -150840, 234927, -122484, 12950, 62872, -136200, 187190, -129006, -43754, 134750, -133747, 155776, -72123, -88100, 134803]
115A34803k90109K90804j06992j46060K23789k72046K68526p84k43600K40494
125I8825k24408J74839O5243k81644K79173j58925L9632J07002k80577K87936
135A07096q7240o9544J55933k70008K27752j9099j22264K13188k53846J22012
145C980M4738j44119K44283k19169K9365J09679j70274K21015j61637k1768J73659
156A09752k00966J56489r1555n3636K19251k08842R1248k1646r8491K29173j78633
167d7856M8561M1579j54247K06824j24164J3870R4844j89854J73105o8223l7086
178d2647J31641j84146J42751j9445j01571J47017j49079J11017K6787j51883
188h9558J44830j10420O4720P2273j67707J32932p7413M562J08506j55792J13560
$$ y = [134803, -155306, 135498, 28506, -117554, 106235, -165811, 102715, 101931, -141669, 98825, -125583, 49256, 114499, -167145, 112028, -46897, -7265, 99737, -180840, 107096, 19856, -49688, 106245, -163763, 63989, 44890, -77374, 135814, -118032, 3980, 48718, -95401, 148882, -70287, -40922, 68757, -101517, 119498, -42139, -63907, 109752, -91214, 65275, -26280, -79916, 139335, -69507, 21741, 95, -98396, 130777, -47856, 705, 42284, -111963, 94861, -29303, -15433, 79411, -110443, 62662, -5561, -42647, 88994, -95152, 47599, 28154, -73417, 73600, -75479, 35538, 62325, -89558, 55272, -55148, 9572, 81845, -85862, 47070, -30343, -25781, 82725, -73067, 40493]
199D0493m1304n0343J26962j37276Q2971L835q2493J29553j21860M0248M9558
210D0344r2880J22920j01046n960Q2565r5192J08546o6019m2646R9046r7334Q3968
222C6312k2767o5152J05669r3582N0330J4672p9604J07365p4942J5121L9139r1578
234e9017J00960m3350j3787N4656r8203Q2636j0939l5204O6775r2519N5814J3600
246B1422n2826P3614p3372K8957L1276o6911O9333m8352P380M6695p2841N3997
258A8372k6292j0366N9685o7397L4629q933k6724O4985n3649J7698P038l9398
270c0352N9887l8543L620K2785m4058M8545k5843j0467L4657m0270L6872j3704
282C129k4352L8481l2237K6641l04l3696L5046k4203J5739J2153l5528K8993j6582
$$ y = [40493, -811, -51154, 75808, -61468, 21503, 25338, -57155, 72398, -49462, -9214, 40344, -52536, 70384, -30662, -36622, 45943, -49249, 59297, -6722, -49368, 49678, -47656, 36312, 13545, -51607, 54062, -39520, 10810, 25482, -54122, 53243, -21699, -6578, 32561, -59017, 41943, -1407, -15194, 39462, -58741, 23895, 12956, -22248, 44527, -47992, 7822, 21422, -31404, 42210, -31162, -2205, 29071, -37840, 31493, -16859, -9479, 37216, -35625, 18372, -7920, -18286, 41399, -25998, 8631, -302, -27026, 37959, -15690, 2008, 9046, -30352, 29535, -9008, -5388, 17397, -26661, 21884, -3959, -14426, 20231, -20039, 16833, 3129, -21223, 17258, -14979, 11662, 11358, -22338, 12708, -11495, 4244, 16397, -19131, 9862, -6720]
295f720L428J9534l1948K3186p323p252K0327k6820J6646K979j2402J7114k1787
308a1038Q329J0493j1820J3357j5936J12J2687q991R737q702m766J0808o313M877
322B834k259m879P708l370p38K88k063M988O31m461j282R38J973M647m374m526
338c945L568j942O330j073p726O872n120M218L292j0888J0508n183n06P497j4611
353h709J2559j737n851J1913j8090J1142L844j1239J6725j9113O239J0074j6969
366i212K0351j6259n10J6520k2534K0777j0266p889K3371k6204J7219k466j5903
379a3005K9587k6086J0541O271k4123L3130k2000K182J5695l1216L2812j5064
391a276p475K5406l5391K8618o010j8382L3672l5403K1296M903k9315L8469l1483
$$ y = [-6720, -3292, 16242, -15706, 7480, 157, -7095, 13232, -13588, 3058, 6037, -6365, 10749, -11038, -2709, 7784, -4036, 9321, -6615, -6503, 6184, -2807, 6930, -1772, -6538, 4270, -2043, 2834, 575, -4304, 3404, 34, -704, -416, -2479, 2509, 3140, -1321, -2603, -1665, 308, 4955, 581, -3945, -377, -2319, 4011, 2938, -4788, 2084, -3036, 1182, 4474, -6414, 4094, -1089, -1595, 5902, -8709, 3850, 2113, -3738, 8175, -9915, 1227, 5071, -6168, 10557, -8556, -2317, 7757, -9212, 11139, -5120, -5630, 10890, -11644, 9133, -1133, -9022, 14349, -11855, 5364, 2898, -13005, 16582, -9504, 1037, 7308, -16815, 16315, -5685, -3503, 12192, -19024, 13788, -1276, -8751, 16655, -18736, 9882, 3872, -14510, 19162, -16241, 5055, 9958, -19357, 19112, -12371]
404a2371J1536J7134l8400L9160k4339n30K9377m3992L5805j4038j4287L9570
416B4625m5217K8559q79k7761M5885m2087J7701J3847l8808M7801l4883L904K8126
429B0813m6127M5343k3673j1593M0075m9140L8392r103k6714M8324m7529K7177
441F245P040l9578N2448m1295J2608K2869m9243N2133l0458m004L6965n4905M6801
454A7626j5838k0818M8147n5678L6466Q34l6121N5471n1131K1868J8113m8653
466b9714N7845m1333M485L4607n6994N4117k7103j3655M8645o0058M4350r759
478E433l0688N8344n7353K9925R162m5195O2097m8783J2670K7647n5836N9357
490B6780l4951n657M3343o1362N1139j7379k3818N4375o0889L8861J911m0696
$$ y = [-12371, -835, 16299, -22101, 17059, -7280, -7810, 21567, -22425, 13380, -658, -14945, 24625, -20592, 7967, 7088, -20673, 25212, -16875, 826, 14673, -24135, 23666, -11217, -7313, 20813, -25314, 20029, -3644, -15237, 24838, -24302, 14090, 4987, -21727, 26597, -20932, 6245, 13285, -26293, 26155, -15140, -2532, 20337, -28906, 23227, -7231, -11235, 25730, -29175, 17626, 1788, -19030, 29117, -26561, 9905, 10739, -25382, 30089, -21042, 826, 18939, -29714, 28131, -13202, -8717, 25890, -31104, 23013, -4090, -17745, 30900, -29158, 15192, 5433, -25255, 33089, -24264, 5661, 14823, -30372, 31725, -17058, -4388, 23259, -32577, 26780, -8171, -13828, 29515, -31847, 19292, 1913, -21905, 32470, -28419, 10442, 12353, -28343]
502b8343O0160n3974K3237K0612n4325O0853m1476M791L6874o2491N6893k5535
514b724j5348N0256o4069M7626p917l4688O0344n9307L2339J0417m9871O5592
526C2650m9789J2492K8820n8926O3886l6861q375M6181o2484N4281k0353k6846
538b5324N9595o1595L8337j71m1331O5498n6043K0007K1408n2474O2974m4563
550a3682K402M0227o0851N4408k6687j4426N2585o4595M3150n048l1603N7892
562C3772o0614L0458J5379m8312N8691m8291J4905L1144o0788N7348l0976m942
574a2226M2712o4778N2598j3399k6863N2596n9713M1096K038m4966O1157m9578
586a9326K1894J7098n4803O4570l8483q16L3947n7008N8464k6534k0432N0386
$$ y = [-28343, 31817, -22157, 1080, 21692, -32633, 28220, -13256, -8465, 28409, -34082, 22811, -2724, -18072, 32184, -31885, 15741, 7824, -26864, 33480, -25827, 6512, 16929, -32942, 32650, -17139, -4647, 24173, -34753, 29133, -7728, -16103, 30078, -32406, 21875, 1522, -25324, 34271, -27324, 11013, 10842, -30489, 35009, -21034, -1027, 20381, -32093, 30881, -13682, -11280, 28947, -31904, 22504, -4183, -18609, 33976, -30619, 12531, 7483, -24120, 33772, -26842, 3616, 18995, -29317, 29374, -18917, -4012, 27132, -33656, 23692, -7284, -12226, 30486, -34292, 18306, 4907, -21956, 30640, -29073, 12023, 14061, -30905, 30252, -19326, 2568, 19666, -35137, 29433, -9050, -9866, 24081, -32927, 25537, -997, -21429, 28957]
598B8957n5594M3047j0958l3422O0751n3037K3930R360m1931O0910m7229P060
610h156L0503m9569N2179l4327o142M5744n6470M0534j4420j8872N1676n8310
622b5630L0389P137l4116N1081n0669K0289K3802m9226M9118l4714N964L3625
634B7050n7716M7373j6895j3506M0332n5891M2038k447l3058M7541m6385K8812
646G248Q886m5742N3616l5045Q942K0765m9059N3281k5230j1017L4671m6700M3519
659A8135j5005k5061M6945m3459K6987q13l2481N1768m0065J0219J6854l7103
671b3079M7132l3251k186L2723m2145L6993k0065j1560M1587m6003K6825k441
683D530k1710M2816m4024J8408J3841l3357M0295l4364R212K4625m2774L7632
$$ y = [28957, -26637, 16410, 5452, -27970, 32781, -20256, 3674, 13034, -28897, 32013, -15216, -8156, 22347, -27222, 24957, -9370, -15512, 30232, -26238, 14296, -124, -18996, 32680, -25630, 4759, 11896, -22220, 28861, -21808, -1519, 22283, -26943, 22175, -12539, -6575, 27050, -30666, 16707, -188, -13694, 26638, -29253, 12785, 10338, -22720, 24821, -21564, 7248, 16134, -29608, 24008, -11037, -2095, 18670, -30389, 22892, -2338, -13355, 21316, -25384, 18135, 3130, -21931, 25014, -18445, 8542, 7729, -24752, 27016, -13049, -2830, 14024, -23079, 24053, -9198, -11384, 21339, -20806, 16187, -3878, -15438, 26149, -19854, 6971, 4530, -17180, 25636, -18388, 20, 13861, -19496, 20799, -13565, -4353, 20272, -22502, 15130]
695A5130k0156l592L0666m5491L4167o401j8611L4942m0603K6732M309l1107L8762
708A8747l1533J4110J3133l7354M0078k2178j060K2122l7423L5871j3564j4141
720a3192L0847l4383K5996m238k2458L6369l0648J3667O902k6967L6351k5898
732g652K539J8308k9927L1219j8287o167K6832l1919K3801p727j3549L0707l1546
745a3368J6404L640k0762L0743k7240R032J3245k7058K8655j9295P40J9815l0310
758a5759K5252r853q356K3783k9445K0205r73j6788K6063k5044J2876O590k2564
771a4013K6444j8712L974J2978k4773K4231j1878m672J8170k4087J9346n017j1537
784i546K1662k1648J2624J946j6127K2615j7954N490Q493j8757K0966j3131r91
$$ y = [15130, -5026, -8618, 22048, -23443, 10724, 4323, -14288, 20654, -19949, 6783, 11092, -20015, 18747, -12786, 1324, 14457, -22897, 17181, -4997, -6057, 16065, -21358, 14513, 949, -13192, 17655, -16728, 9268, 5030, -17428, 18941, -11707, 1960, 8862, -18105, 18246, -7652, -5113, 13195, -16732, 14487, -3800, -9967, 16865, -15054, 8747, 1020, -12529, 18178, -13368, 3036, 6676, -14086, 16657, -10583, -1551, 11694, -15364, 13291, -6004, -5264, 14551, -15759, 9493, -360, -8716, 15067, -14378, 5827, 4854, -11934, 14129, -10915, 1961, 8551, -14013, 12431, -6281, -2307, 10671, -14102, 10129, -1749, -6421, 11749, -12338, 7008, 1991, -9546, 12116, -9532, 3092, 5038, -11089, 11526, -6428, -938, 7555, -11202, 9764, -3367, -4358]
797d358J3813j9877J7484p370o533J7277j9481J2969j146j1215J8654j7299P905
810H23M665j4750J8189j3471K590R390j6731J6240q614k634J2686j6858J3044
823D569l408p275J4463j5146Q843J449j0644J4661j2125M216N546j2463J3437
836F123q392k61Q588j2776J1039m396m044J0393j1802P881n76o822J0943r938
850d040M499K731q563J0428p474J229N322r303R035m664j707P045r085P053j868
865F38m000P821q054M714O85n616P821o457K292K801o474P028m396l5M262o419
881c389N557k247j855M930n674L815l71l010M887m465K031J126l545M252l011
896i69M68K072l425L183j584o22K366k853K065m88j190K193k073J063K58j345
$$ y = [-4358, 9455, -10422, 7062, -308, -6841, 10436, -9045, 3924, 2778, -8437, 10217, -7082, 823, 5488, -9262, 8927, -4544, -1954, 7436, -9295, 6945, -1669, -4303, 8383, -8475, 4569, 1161, -6114, 8349, -6797, 2046, 3495, -7149, 7512, -4613, -397, 5149, -7314, 6123, -2269, -2530, 6058, -6718, 4321, -75, -4119, 6274, -5528, 2353, 1777, -5045, 5898, -4040, 459, 3190, -5373, 5055, -2419, -1190, 4132, -5171, 3864, -800, -2507, 4538, -4547, 2506, 638, -3362, 4459, -3595, 1119, 1804, -3812, 4009, -2448, -156, 2645, -3829, 3199, -1197, -1232, 3030, -3389, 2168, -79, -1934, 2996, -2678, 1137, 766, -2244, 2643, -1822, 209, 1335, -2210, 2042, -969, -501, 1571, -1854, 1329, -255, -877, 1489, -1364, 701, 213, -977, 1216, -857, 206, 464, -881]
912h81J711j238L20N65j079J023n06r1M83n67L67n5j18P0L5j12Q2J62n02O11l69
933h9j43P64j158R74k32p27J505j659R88K59j506K178j880O27J051k378K687j733
951d72j54K110l171K814j105j248L142l637K462r0k484M009l706J684J212l710
967b344M574l310M60K696m739M662k382j091M155n411M212j004k772N369n583
982b508L239P21m465O238n188J701K679n938O532m115k63M634o953O100k425k452
998b463O301p320M979k82m616P483o954L181K099o489P954n763Q75M470p806P606
1014C255l898j661O527q444O501j555m198Q105q311M719J098o505Q979p354K334
1029d08L834q334R064n637m27O368r480Q307l301l291Q463r837O716m52o109R933
$$ y = [-881, 830, -408, -88, 477, -602, 421, -85, -176, 307, -260, 107, 52, -66, 4, 39, -73, 9, 171, -331, 280, -89, -232, 532, -626, 348, 116, -611, 894, -765, 223, 482, -1024, 1154, -726, -99, 952, -1426, 1261, -472, -626, 1484, -1687, 1127, 22, -1226, 1916, -1721, 741, 651, -1833, 2176, -1530, 154, 1366, -2344, 2230, -1080, -620, 2076, -2663, 1999, -383, -1474, 2681, -2730, 1482, 478, -2294, 3075, -2508, 731, 1452, -3013, 3225, -1963, -262, 2417, -3521, 3011, -1104, -1367, 3267, -3686, 2414, -11, -2463, 3838, -3482, 1497, 1215, -3401, 4082, -2872, 309, 2408, -4081, 3873, -1890, -1015, 3455, -4351, 3255, -643, -2304, 4223, -4221, 2280, 725, -3473, 4632, -3679, 1040, 2138, -4367, 4612, -2742, -408, 3426, -4908, 4156, -1481, -1908, 4460, -5020, 3287, -14, -3305, 5158, -4679, 2037, 1585, -4524, 5409]
1045E409r249M329K626q459J0477p707J367N643j0110R998n318j867Q269j0872
1059e464Q489k237n087J0143j0534O063J169p851J1021r168L025M538r977J0863
1073D993o832l57P483j1189R683l786l795R739j1311P632l79o991J1165j0380
1087d325M877L034r635J1732q506J518O287j1425J1266n818k186R133j2111R649
1101C490k586n757J1327j1739P015R59q768J2541j0362L558M678j0949J2415p981
1115b159k86Q169j2178J0887m702l933J0794j2374Q313p94p193J2198j1442N141
1129D41L276r899J2270r245J662O859j1856J1299o013j977R527j2672R560k217
1143A015n695J1250j2128P159J477r074J2239j0300L895M838j1528J2417p600
$$ y = [5409, -3840, 489, 3115, -5344, 5133, -2574, -1207, 4436, -5674, 4324, -994, -2861, 5408, -5464, 3025, 788, -4299, 5844, -4690, 1373, 2542, -5309, 5712, -3456, -431, 4107, -5870, 4993, -1839, -2196, 5287, -5902, 3781, -5, -3800, 5939, -5372, 2260, 1881, -5110, 6055, -4325, 552, 3586, -6049, 5683, -2823, -1305, 4982, -6443, 4823, -995, -3181, 5952, -6159, 3490, 904, -4853, 6474, -5265, 1750, 2709, -6059, 6482, -3880, -322, 4356, -6593, 5822, -2159, -2445, 5724, -6454, 4433, -269, -4202, 6592, -5782, 2531, 1737, -5456, 6742, -4700, 441, 3717, -6182, 6088, -3157, -1495, 5364, -6492, 4807, -1206, -3183, 6344, -6328, 3232, 1015, -4680, 6570, -5558, 1601, 3078, -5996, 6243, -4057, -162, 4676, -6852, 5565, -2035]
1156b035j01P861j2661J1512m556m191J0532j2478R187j205p713J2536j1352N622
1170I58K506j0153J3177r470J537O373j1560J2111o774k254R741j2201R654l143
1184E02n446J1806j2002O518J145q180J2257j0623L332N184j0540J1487p874J45
1198b289Q227j2190J0111m183l324J0133j2486Q300l22o935J1195j1205N803L014
1212C849j0016J1766q746K343N836j1826J1647n843j787Q419j2083J0239k852
1225I46n636J0669j1141P320K70q400J2073r616L487L727r983J1964p611l51P222
1240D940j0713J0153m822l506R854j0878P382j245n990J1017j0303M467K613q182
1254e213J0786q603J698N928j0017R699n731j130Q136j0992Q259k308m183R364
$$ y = [-2035, -2136, 5725, -6936, 4576, 20, -4171, 6361, -6117, 3070, 1865, -5848, 6688, -4664, 958, 3464, -6689, 6488, -2982, -1445, 4928, -6632, 5479, -1295, -3549, 6192, -6009, 3645, 502, -4944, 6862, -5140, 1378, 2523, -5657, 6600, -4023, -691, 4493, -6047, 5440, -2434, -2289, 5938, -6252, 3859, -324, -3648, 6485, -6001, 2299, 1977, -4958, 6237, -4968, 835, 3849, -6167, 5599, -3147, -804, 5032, -6794, 4853, -990, -2777, 5642, -6441, 3798, 946, -4690, 5979, -5162, 2158, 2428, -5972, 6101, -3515, -28, 3699, -6284, 5680, -1931, -2282, 4940, -5773, 4380, -442, -3948, 5906, -4972, 2410, 1165, -4825, 6192, -4111, 356, 2969, -5213, 5573, -3030, -1332, 4596, -5421, 4278, -1453, -2583, 5553, -5439, 2820, 512, -3671, 5693]
1268E693j0663O451R28p169J0023r023L915L643r369J0157o585O45N930j0286
1282e710R479l937k834P943r959P632j271n710R429q828M781J515p582R917p196
1297b331J517M345q524R112n137j387O752q808P291k542l772Q285q533M982L80
1312A630n669Q708p541K630L153p187Q261n778L49N324q191P269l398k008O784
1327D336q394N878q24m280P570p635M037J544o156P801o143J804L561p298P444
1342C245m204o96N268p583O323k020l025O456p024M511J51m768O983n916K341
1357D2K224n861O756m423J59L986o295N813k617j819N256o177M387o96l361N869
1373C243n592K770J188m546N886m529J057K820n310N405l106o14M040n560M535
$$ y = [5693, -4970, 1481, 2409, -4760, 5263, -3760, 155, 3798, -5571, 4586, -1999, -1354, 4576, -5710, 3769, -168, -3002, 4941, -5018, 2614, 1343, -4367, 5062, -3766, 1015, 2530, -5052, 4865, -2331, -814, 3531, -4993, 4119, -1018, -2405, 4347, -4461, 2830, 288, -3484, 4801, -3732, 1250, 1630, -4039, 4669, -2872, -242, 2911, -4276, 3985, -1793, -1444, 3880, -4311, 2958, -440, -2448, 4336, -4058, 1820, 996, -3284, 4286, -3349, 688, 2232, -3924, 3877, -2266, -462, 3099, -4199, 3245, -959, -1655, 3613, -3970, 2353, 333, -2692, 3764, -3260, 1251, 1402, -3366, 3617, -2299, 42, 2266, -3595, 3161, -1262, -1103, 2883, -3412, 2401, -216, -2035, 3221, -2956, 1431, 735, -2626, 3243, -2349, 421, 1609, -2937, 2949, -1580, -523, 2297, -3013, 2392, -714, -1328, 2712, -2848, 1687]
1388A687j512k128M802n283L316J22l403N095m506J869J624m298M934l356L22
1403g15K827m641M279j975j145L675m491L248n40k343M079l925K007P74l156M036
1419A994l040P10J877l547L565j981m67K646l579K861q71j464L088l276J972J94
1435F82k204L174k693J021J072k642K980j977J37J733k784K551j184o84K198k680
1451a300J928l31j355K382k299J194L92j754K276j748M47J000j928J958j098k31
1467d67J376j851J471m41p35J513j567R15J13j024J429j173L97N09j115J194p37
1484a93m1P45j060Q78l18l38P97q62N30km81P06n94K34J87m75N30l31J0K70l96
1505b04L06q9j26K29k00R0M9j11Q0mp7Q5Mj30K17j86J5K05l56L43j31j89M54n25
$$ y = [1687, 175, -1953, 2849, -2434, 882, 1004, -2399, 2696, -1810, 59, 1683, -2615, 2319, -1037, -715, 2112, -2529, 1750, -225, -1370, 2305, -2186, 1062, 522, -1821, 2258, -1667, 340, 1114, -2042, 1994, -1046, -336, 1541, -2006, 1559, -422, -889, 1757, -1822, 1039, 168, -1296, 1792, -1484, 488, 682, -1522, 1652, -1041, -20, 1052, -1590, 1390, -587, -450, 1283, -1501, 1050, -134, -818, 1380, -1300, 628, 297, -1058, 1324, -975, 219, 611, -1143, 1133, -615, -168, 832, -1096, 862, -236, -467, 909, -942, 529, 88, -647, 866, -701, 214, 327, -697, 732, -441, -44, 465, -650, 544, -193, -234, 511, -549, 329, 11, -327, 470, -392, 138, 136, -345, 361, -233, 1, 188, -287, 243, -88, -78, 192, -204, 102, 13, -113, 116, -84, 6, 55, -56, 24, 20, -57, 28, 32, -98, 119, -67, -52, 153, -203, 140, 9, -180, 274, -251]
1529b51L51L5m52O83n96K23K86p21Q45n53k6O29r83Q88l55l84R92j160P75k3p94
1550e91J289j177N27L94j189J452j040J30Q88j539J509p77l68J374j769J358k91
1567A80r44J777j821J018K86j498K048j660M98R38j963K108j284j63J575k287
1583a192J953o97r09K118k394J551M2j642K494k218R17Q37k226K630j831J64J616
1600A213k688K520j190p05K319k887K135l98j571K844k820J519N03k338L140k499
1616i03P06J443k976L165j896k63K316l349K863j049j265L040l446K269l9k235
1632a619L503l178J385J058l033L638k563K92K135l592L394j653q73L031l814
1647a889K833n43j997L643l629J940O64k967L925l088Q33J826l673L834k235l85
$$ y = [-251, 100, 135, -317, 366, -230, -7, 279, -442, 403, -150, -176, 453, -530, 358, 3, -381, 611, -549, 226, 203, -591, 698, -479, 48, 442, -747, 705, -335, -205, 683, -856, 653, -124, -492, 882, -887, 471, 180, -764, 1013, -808, 210, 496, -1002, 1046, -614, -116, 822, -1141, 967, -317, -480, 1095, -1192, 761, 64, -845, 1273, -1121, 430, 472, -1170, 1324, -894, 23, 860, -1366, 1264, -567, -403, 1213, -1475, 1045, -145, -850, 1469, -1418, 717, 319, -1252, 1592, -1228, 291, 794, -1544, 1596, -903, -197, 1246, -1730, 1435, -461, -724, 1592, -1757, 1106, 57, -1208, 1832, -1614, 655, 616, -1619, 1884, -1294, 91, 1149, -1884, 1754, -809, -517, 1618, -1974, 1420, -233, -1106, 1925, -1889, 944, 401, -1596, 2047, -1582, 358, 1022, -1945, 1980, -1108, -275, 1551, -2122, 1712, -523, -908]
1663i08K851m055L413j186j600L671m084K645J6k715M179l726J584J302l636M326
1679B077l026L49K471m214M067k030r83L542m462L376p54k263M251m259K310O75
1695A127l351M544l653J033K052m168M389k645l41L226m572L807j342j735M077
1710B448m562K886J16l006M531m052J699J499l990M613l174L14K740m598M317
1725A781k023j138L770m775L611p06k512M517m500K510O79l641M900l875J158
1740b44K064m442M818k898l58L352m829M196j613j815M366m824L134r6l054M879
1756B636m367J791J499m049M859l455L44K906m711M382k168j094L942m911L540
1771A144o39k466M553m615K434Q98l681M789l841J123K239m542M648k700l52L320
$$ y = [-908, 1943, -2112, 1301, 115, -1485, 2186, -1898, 747, 763, -1952, 2227, -1499, 85, 1387, -2249, 2077, -949, -600, 1871, -2343, 1724, -306, -1289, 2253, -2209, 1167, 413, -1850, 2401, -1858, 452, 1127, -2224, 2320, -1333, -300, 1752, -2416, 1973, -672, -1013, 2213, -2359, 1448, 106, -1629, 2448, -2114, 772, 888, -2118, 2413, -1639, 60, 1559, -2431, 2182, -992, -678, 2062, -2536, 1781, -242, -1380, 2390, -2385, 1226, 520, -1992, 2525, -1975, 535, 1214, -2427, 2473, -1402, -244, 1820, -2622, 2196, -702, -1060, 2292, -2537, 1659, 46, -1769, 2597, -2227, 907, 811, -2243, 2636, -1731, 60, 1559, -2490, 2369, -1086, -742, 2164, -2547, 1835, -333, -1427, 2515, -2396, 1144, 505, -1961, 2592, -2023, 411, 1309, -2372, 2417, -1424, -301, 1938, -2604, 2044, -656, -1008, 2312]
1787B312m910M157j405j855M222m813L236m0l180M797m250J919J335m106M932
1802B351l384L85K674m622M542k260j127L853m756L623q61k437M593m487K365
1817D52O92l477M783l801R77K168m223M471k729l94L360m626L765j320j738M120
1833B480m574K812J53k920M444m039J688J505l883M432l085L71K635m461M127
1848A685j936j015L539m552L433o57k337M165m184K381O16l366M450l478J043
1863b13J843m001M306k514l87K991m249L649j330j669L801m108K640k0k696M178
1879B221l630J416J333l460M074k791J58K482l905L586j702j004L286l984K834
1894I14m79k062L741l715J929P31k970L849l049Q34J804l560L650k143k97K645
$$ y = [2312, -2598, 1559, 154, -1701, 2521, -2292, 944, 904, -2276, 2521, -1729, 190, 1525, -2581, 2351, -1033, -648, 2026, -2596, 1946, -314, -1441, 2412, -2344, 1279, 418, -2019, 2574, -1913, 452, 1144, -2333, 2450, -1351, -374, 1794, -2429, 2042, -687, -1081, 2279, -2347, 1418, 98, -1640, 2480, -2094, 718, 871, -2049, 2395, -1644, 44, 1549, -2334, 2098, -987, -616, 2019, -2442, 1685, -251, -1266, 2273, -2279, 1154, 497, -1840, 2325, -1859, 522, 1138, -2228, 2222, -1256, -213, 1630, -2371, 1935, -579, -966, 2025, -2224, 1425, 95, -1574, 2227, -1881, 759, 739, -1957, 2221, -1409, 7, 1340, -2120, 1954, -837, -679, 1803, -2102, 1484, -218, -1222, 2064, -1920, 914, 435, -1627, 2114, -1601, 328, 1059, -1911, 1938, -1111, -277, 1527, -2033, 1617, -526, -823, 1822]
1910A822l794L161j092j404L246l656K396Kk367L583l183J387J059l042L572k443
1926g53K58K000l373L210j539q20K735l374K508m93j771L177l072J596N55k463
1942a619L238k496O26J487k892K983j726l17K201l044K493q48j185K680k926J842
1958D97M9j893K872k547J065Q95k417K825j962K20J615k688K512j207o05K126
1974A357k695K026m37j319K431k427J330L79j886K505j980N62J099k221K304j344
1990c16j96J620k295J907o47q86J973k137J324O6j395K074j800P14O81j730J963
2007I20j320Q8J173j873J699p66m84J500j815J298k16r37J649j609Q47K82j269
2024h33J667j279L26P47j449J490q65j29J030j454J205m08n40J217j339Q40K0
$$ y = [1822, -1972, 1189, 97, -1307, 1939, -1717, 679, 681, -1686, 1897, -1286, 101, 1160, -1882, 1690, -753, -495, 1505, -1868, 1342, -197, -1017, 1718, -1656, 852, 359, -1412, 1765, -1307, 289, 844, -1619, 1619, -877, -251, 1236, -1656, 1327, -399, -716, 1485, -1559, 934, 86, -1099, 1581, -1345, 497, 546, -1347, 1525, -1022, 43, 938, -1479, 1346, -616, -396, 1219, -1469, 1043, -164, -769, 1357, -1338, 688, 251, -1068, 1363, -1064, 266, 645, -1241, 1264, -716, -154, 945, -1276, 1028, -316, -512, 1108, -1187, 720, 73, -813, 1160, -977, 347, 413, -982, 1092, -708, 6, 687, -1043, 920, -400, -312, 861, -1012, 687, -79, -563, 937, -878, 420, 204, -733, 916, -693, 154, 436, -833, 834, -445, -119, 628, -821, 669, -196, -325, 705, -749, 456, 48, -492, 725, -614, 226, 246]
2041B46q42J253j077M31L78j009J148p48L1O66j024R13l95k81Q02r41O51p6n03
2060c77Q19p55L52J91o22P51n37R5L66o21N83k91j06M39n51M13j05k34M32m24
2080a82K38M7k81L51k68P4J33k55K40j24k1J30j62J17k2p0Q7m4lL9k5k5Q5q9K2
2105hP1j48J60q4m5J86k50J97l0j98L56l40J59J16l70M57l38M4K95n23N16k58
2127c5j40N11o59N02r6l87P14p16L79J47o34Q55o89J89M20q61R16n47j05P26j019
2148e29Q49k86m38R98j113P08M3p91J201j055M19M31j120J311q82K6Q56j364J250
2167E14n58m10J221j483J050j25q77J507j440P14L42j278J645j263K76Q58j613
2184i20J641r10k65J337j805J476m54q11J730j863J129J30j352J974j699O30P45
$$ y = [246, -596, 657, -420, 11, 389, -620, 528, -220, -189, 477, -547, 366, -29, -310, 492, -449, 202, 126, -377, 442, -313, 39, 230, -392, 359, -178, -83, 283, -338, 245, -46, -152, 287, -264, 149, 44, -190, 242, -182, 56, 103, -178, 173, -95, -21, 112, -143, 97, -27, -48, 82, -80, 37, 15, -55, 32, -12, -15, 24, -1, -26, 59, -30, -8, 63, -85, 75, -9, -54, 132, -118, 79, 49, -149, 207, -133, 26, 142, -228, 229, -109, -65, 230, -293, 223, -35, -175, 336, -323, 179, 83, -304, 410, -306, 73, 220, -414, 441, -248, -59, 361, -500, 416, -131, -236, 490, -529, 320, 34, -404, 594, -519, 189, 232, -559, 642, -413, 6, 437, -683, 628, -254, -228, 628, -736, 514, -44, -454, 767, -716, 334, 209, -668, 839, -601, 113, 455, -823, 822, -441, -165, 693, -920, 721, -189, -454, 883, -922, 554, 100, -711, 1019, -844, 285, 415, -937, 1037, -662, -32, 713]
2201G13j790K044j361L4J336k100J911q33o42J840k220J573j88j299K202k115
2217h95J044N31j867K369j790L73J229k281K284j231m10J884k514J992n42j164
2233i88K347k469J455K46j852K626k189P49J050k396K647j684m2J772k730K434
2249I76j011q91K396k810J937j81j689K817k652J272O95k361K965k214M45J553
2265A247k853K839j529m86K301l076K438o82j397K863l012J765K95k234L159k635
2281i97Q98J274k877L151j977j10K158l222K805j103j109K836l279K215j16k028
2297a481L253l014J373R12k777L379k447L97J847l274L206j660o40K641l458K714
2313I71p12j641L238l348J955L46k518L539k935R81J402l157L499k214j04K371
$$ y = [713, -1077, 967, -394, -360, 976, -1124, 787, -46, -688, 1152, -1068, 505, 317, -982, 1220, -895, 149, 680, -1187, 1182, -608, -235, 994, -1287, 997, -234, -644, 1240, -1274, 718, 176, -988, 1359, -1110, 345, 591, -1261, 1365, -824, -75, 975, -1421, 1226, -458, -500, 1272, -1458, 976, -35, -926, 1470, -1340, 597, 416, -1273, 1544, -1108, 164, 859, -1502, 1463, -751, -306, 1247, -1606, 1233, -296, -782, 1519, -1557, 881, 199, -1198, 1665, -1347, 418, 713, -1521, 1638, -997, -99, 1175, -1702, 1449, -528, -638, 1520, -1702, 1103, 0, -1109, 1727, -1552, 663, 547, -1481, 1772, -1242, 131, 1043, -1734, 1645, -802, -405, 1442, -1832, 1374, -286, -926, 1715, -1743, 971, 259, -1382, 1856, -1492, 463, 809, -1709, 1830, -1105, -124, 1278, -1879, 1620, -594, -698, 1673]
2329A673l540L107j263j188L101l577K400j44k199L566l269J456J002k988L630
2344A767k618L85K053l531L369j692p46K873l700K801o19j819L441l516J982M87
2360I17k729L689k997R53J559l381L636k224j76K491l701L226j241j289L197l670
2376a740K496j48k298L655l327J516R77l067L747k670L80K048l548L460j768p67
2392a054K934l716K831o77j822L484l517J925N18k711L706k994Q76J627l360L554
2408A604k150k46K559l674L081j123j321L190l611K352j6k290L550l223J430J046
2424A158l024L588k541L65K000l481L341j656p28K763l569K751o51j741L271l333
2440a487J912M19k560L511k840Q80J455l132L390k071k02K341l389K909j099j224
$$ y = [1673, -1867, 1240, -23, -1211, 1890, -1687, 713, 569, -1630, 1936, -1333, 123, 1125, -1863, 1767, -851, -466, 1587, -1944, 1425, -267, -1013, 1860, -1840, 961, 342, -1477, 1964, -1552, 430, 917, -1812, 1877, -1120, -167, 1392, -1989, 1647, -577, -753, 1738, -1963, 1263, 22, -1267, 1930, -1740, 756, 608, -1690, 1965, -1362, 154, 1131, -1936, 1811, -859, -479, 1569, -1979, 1481, -287, -1054, 1880, -1836, 995, 318, -1504, 1980, -1537, 388, 906, -1805, 1901, -1093, -217, 1410, -1950, 1604, -546, -792, 1767, -1907, 1174, 51, -1270, 1920, -1691, 661, 645, -1645, 1905, -1318, 112, 1158, -1866, 1722, -819, -454, 1546, -1935, 1406, -250, -978, 1785, -1784, 967, 316, -1425, 1846, -1487, 425, 844, -1716, 1795, -1045, -165, 1290, -1842, 1548, -523, -725, 1616, -1773, 1136, 37, -1187]
2456a187K975l346K177l8k111L302k953J239R89k760L286k311K72J889l153K983
2472A253j471p02K560l235K403m98j604K987l008J642M53k298L097k504P66J324
2488A165k796K969j802j60K051l008K578r76j043K569k915J931o4j826K848k558
2504a037J112Q32k382K839j983K40J584k682K537j231o30K185k716K015m10j386
2520a113K523k488J326M20j945K588k043N56J160k334K438j430k11J740k456K048
2536G79p25r12K111k349J523jj493K291k040Q63O88j914K259j583J93J260k112
2553a162J991r60m73J676k113J583l39j054J936j919J039L08j504J981j548M23
2569a35Q82j757J828j057j73J294j819J500n06p04J575j708J057M9j107J652j431
$$ y = [-1187, 1788, -1558, 619, 581, -1530, 1772, -1181, 58, 1047, -1713, 1573, -738, -466, 1423, -1730, 1253, -218, -920, 1640, -1595, 808, 310, -1294, 1693, -1315, 327, 780, -1518, 1579, -925, -159, 1165, -1631, 1338, -464, -624, 1427, -1581, 997, 21, -1022, 1547, -1368, 563, 499, -1327, 1521, -1037, 75, 907, -1475, 1364, -619, -379, 1205, -1477, 1060, -171, -801, 1384, -1332, 683, 273, -1113, 1410, -1078, 248, 668, -1277, 1311, -732, -176, 984, -1350, 1088, -342, -553, 1187, -1269, 779, 54, -858, 1253, -1096, 427, 426, -1067, 1224, -816, 47, 735, -1179, 1080, -503, -310, 950, -1162, 829, -131, -604, 1072, -1041, 542, 203, -851, 1085, -834, 205, 513, -991, 990, -558, -135, 747, -1010, 818, -239, -412, 882, -937, 563, 57, -647, 928, -780, 277, 326, -781, 871, -560]
2586e60N71N45j390J575j054P8R19j489J355o13l77J184j452J052j92p40J317
2603G29j288O79K22r79J276j005K80N58j128J174o70j00Q02j124R26l26m20R64
2621E70j039O44K9o66R77q39L23L12p84Q87n91M1N08q07P18l12k15O23p32N12
2641A59o4l92O54o09K82J29m69N89m25R0K72m79M58k41o7L25m29L24r0j54L19
2662A82l18J71L3j97K61k08O9P5j73J82j07KQ6j23Q6k2k9N9l6kJ1%k6O1n1JO9
2689E6j31J24o0l8J49k04J40Jj52K50k27R5J04k70L23k36J0K34l96L75j70j13
2711a36L76m76L46n3k71N10n11K45J48m77O14m82J08L41o56O71l80j01N55p66
2731c95O29j97l50P49q01M99M6o07Q93p68K91L41q25R31o20QO34r97R10l88l24
$$ y = [-560, 11, 556, -834, 741, -313, -235, 684, -805, 550, -63, -440, 744, -708, 344, 152, -588, 729, -559, 120, 342, -637, 639, -366, -86, 472, -656, 518, -152, -252, 550, -574, 352, 26, -394, 570, -469, 175, 204, -462, 515, -324, -1, 311, -473, 414, -177, -136, 372, -435, 283, -29, -244, 379, -353, 159, 95, -297, 357, -252, 30, 159, -310, 279, -146, -56, 216, -263, 195, -46, -113, 212, -217, 107, 17, -137, 182, -136, 35, 68, -129, 132, -76, -7, 68, -105, 77, -30, -28, 58, -65, 21, -1, -30, 29, -7, -9, 2, 2, -24, 37, -14, -13, 56, -75, 49, -11, -49, 100, -104, 36, 37, -115, 135, -92, 3, 107, -163, 160, -76, -66, 168, -228, 147, -23, -136, 240, -236, 110, 57, -214, 296, -215, 30, 178, -299, 315, -167, -59, 282, -374, 297, -83, -184, 371, -395, 234, 37, -313, 436, -365, 134, 180, -427, 466, -302, -11, 330, -495, 436, -184, -176, 458, -539, 371, -17, -341]
2752c41Q93j078P70r0o43J100j068N25K78r62J207r04J81O52j195J204o74j85
2770c30R61j310J057l03o05J250j325Q09R1r75J413j203M50N27j286J459r58K9
2788b49R38j497J365o05m43J291j561J115j42r13J566j506P43L75j329J686j267
$$ y = [-341, 552, -526, 244, 154, -489, 611, -457, 68, 346, -616, 591, -313, -132, 520, -675, 529, -145, -330, 631, -679, 378, 75, -530, 720, -605, 204, 295, -680, 733, -470, -20, 507, -779, 680, -278, -249, 689, -808, 557, -48, -491, 800, -761, 354, 212, -701, 865, -641, 102, 477, -852, 834, -433]
$$ [...]
8191B
##END NTUPLES=NMR FID
##END=
