##TITLE=1H_ES-aq-MeOH-st
 
 8 sc, 
 14.1.2022
##JCAMPDX= 6.0         $$ Bruker NMR JCAMP-DX V2.0
##DATA TYPE= NMR FID
##DATA CLASS= NTUPLES
##ORIGIN= UXNMR, Bruker Analytische Messtechnik GmbH
##OWNER= root
$$ XWIN-NMR		Version 3.5
$$ Fri Jan 14 10:36:06 2022 Russian Standard Time (UT+4h)  she@DPX200
##.OBSERVE FREQUENCY= 200.131346
##.OBSERVE NUCLEUS= ^1H
##.DELAY= (6, 6)
##.ACQUISITION MODE= SIMULTANEOUS
##.ACQUISITION SCHEME= undefined
##.AVERAGES= 8
##.DIGITISER RES= 18
##SPECTROMETER/DATA SYSTEM= spect
##.PULSE SEQUENCE= zg30
##.SOLVENT NAME= D2O
##.SHIFT REFERENCE= (INTERNAL, D2O, 0, 15.7039)
##AUDIT TRAIL= $$ (NUMBER, WHEN, WHO, WHERE, WHAT)
$$ ##TITLE= Audit trail, XWIN-NMR		Version 3.5
$$ ##JCAMPDX= 5.01
$$ ##ORIGIN= Bruker BioSpin GmbH
$$ ##OWNER= she
$$ F:/spectra/data/she/nmr/H-F/1/audita.txt
$$ ##AUDIT TRAIL=  $$ (NUMBER, WHEN, WHO, WHERE, WHAT)
(   1,<2022-01-14 10:34:38.62 +0400>,<she>,<DPX200>,
      <created by zg, POWCHK disabled, PULCHK disabled
       configuration hash MD5:
       00 E9 B6 7A A2 85 ED C7 34 08 36 98 17 FE 4E 26
       data hash MD5: 16K
       50 ED 3F 91 7B D9 1B F0 CE 92 51 81 47 D5 0A 08>)
$$ ##END=
$$ 
$$ hash MD5
$$ E0 93 CF DE 65 BD 58 35 38 B9 DC EC C0 80 8A 84
##$RELAX= 
##$RELAX= 
##$RELAX= 
##$RELAX= 
##$RELAX= 
##$RELAX= 
$$ Bruker specific parameters
$$ --------------------------
##$DU= <F:/spectra>
##$EXPNO= 1
##$NAME= <H-F>
##$PROCNO= 1
##$TYPE= <nmr>
##$USER= <she>
##$AMP= (0..31)
100 100 100 100 100 100 100 100 100 100 100 100 100 100 100 100 100 100 
100 100 100 100 100 100 100 100 100 100 100 100 100 100 
##$AQSEQ= 0
##$AQ_mod= 1
##$AUNM= <au_zg>
##$AUTOPOS= <>
##$BF1= 200.13
##$BF2= 200.13
##$BF3= 200.13
##$BF4= 200.13
##$BF5= 200.13
##$BF6= 200.13
##$BF7= 200.13
##$BF8= 200.13
##$BYTORDA= 1
##$CFDGTYP= 0
##$CFRGTYP= 5
##$CHEMSTR= <none>
##$CNST= (0..31)
1 1 145 1 1 1 1 1 1 1 1 1 1 1 1 1 1 1 1 1 1 1 1 1 1 1 1 1 1 1 1 1 
##$CPDPRG= <>
##$CPDPRG1= <>
##$CPDPRG2= <>
##$CPDPRG3= <>
##$CPDPRG4= <mlev>
##$CPDPRG5= <mlev>
##$CPDPRG6= <mlev>
##$CPDPRG7= <mlev>
##$CPDPRG8= <mlev>
##$CPDPRGB= <>
##$CPDPRGT= <>
##$D= (0..31)
0 1.2 0 0 0 0 0 0 0 0.06 0 0.03 0 0 0 0 0.0002 0 0 0 0 0 0 0 0 0 0 0 0 
0 0 0 
##$DATE= 1642142078
##$DBL= (0..7)
120 120 120 120 120 120 120 120 
##$DBP= (0..7)
150 150 150 150 150 150 150 150 
##$DBP07= 0
##$DBPNAM0= <>
##$DBPNAM1= <>
##$DBPNAM2= <>
##$DBPNAM3= <>
##$DBPNAM4= <>
##$DBPNAM5= <>
##$DBPNAM6= <>
##$DBPNAM7= <>
##$DBPOAL= (0..7)
0.5 0.5 0.5 0.5 0.5 0.5 0.5 0.5 
##$DBPOFFS= (0..7)
0 0 0 0 0 0 0 0 
##$DE= 6
##$DECBNUC= <off>
##$DECIM= 32
##$DECNUC= <off>
##$DECSTAT= 4
##$DIGMOD= 1
##$DIGTYP= 9
##$DL= (0..7)
0 120 120 120 120 120 120 120 
##$DP= (0..7)
150 150 150 150 150 150 150 150 
##$DP07= 0
##$DPNAME0= <>
##$DPNAME1= <>
##$DPNAME2= <>
##$DPNAME3= <>
##$DPNAME4= <>
##$DPNAME5= <>
##$DPNAME6= <>
##$DPNAME7= <>
##$DPOAL= (0..7)
0.5 0.5 0.5 0.5 0.5 0.5 0.5 0.5 
##$DPOFFS= (0..7)
0 0 0 0 0 0 0 0 
##$DQDMODE= 0
##$DR= 18
##$DS= 0
##$DSLIST= <SSSSSSSSSSSSSSS>
$$ [...]
##$SUBNAM2= <"">
##$SUBNAM3= <"">
##$SUBNAM4= <"">
##$SUBNAM5= <"">
##$SUBNAM6= <"">
##$SUBNAM7= <"">
##$SUBNAM8= <"">
##$SUBNAM9= <"">
##$SW= 18.0517287032376
##$SWIBOX= (0..15)
0 0 2 0 0 0 0 0 0 0 0 0 0 0 0 0 
##$SW_h= 3612.71676300578
##$TD= 16384
##$TD0= 1
##$TE= 0
##$TE2= 300
##$TE3= 300
##$TEG= 300
##$TL= (0..7)
0 120 120 120 120 120 120 120 
##$TP= (0..7)
150 150 150 150 150 150 150 150 
##$TP07= 0
##$TPNAME0= <>
##$TPNAME1= <>
##$TPNAME2= <>
##$TPNAME3= <>
##$TPNAME4= <>
##$TPNAME5= <>
##$TPNAME6= <>
##$TPNAME7= <>
##$TPOAL= (0..7)
0.5 0.5 0.5 0.5 0.5 0.5 0.5 0.5 
##$TPOFFS= (0..7)
0 0 0 0 0 0 0 0 
##$TUNHIN= 0
##$TUNHOUT= 0
##$TUNXOUT= 0
##$USERA1= <user>
##$USERA2= <user>
##$USERA3= <user>
##$USERA4= <user>
##$USERA5= <user>
##$V9= 5
##$VALIST= <valist>
##$VCLIST= <CCCCCCCCCCCCCCC>
##$VD= 0
##$VDLIST= <DDDDDDDDDDDDDDD>
##$VPLIST= <PPPPPPPPPPPPPPP>
##$VTLIST= <TTTTTTTTTTTTTTT>
##$WBST= 1024
##$WBSW= 4
##$XGAIN= (0..3)
0 0 0 0 
##$XL= 0
##$YL= 0
##$YMAX_a= 313659
##$YMIN_a= -328904
##$ZGOPTNS= <>
##$ZL1= 120
##$ZL2= 120
##$ZL3= 120
##$ZL4= 120
##$ABSF1= 10
##$ABSF2= 0
##$ABSG= 5
##$ABSL= 3
##$ALPHA= 0
##$AQORDER= 0
##$ASSFAC= 0
##$ASSFACI= 0
##$ASSFACX= 0
##$ASSWID= 0
##$AUNMP= <proc_1d>
##$AZFE= 0.1
##$AZFW= 0.1
##$BCFW= 1
##$BC_mod= 2
##$BYTORDP= 1
##$COROFFS= 0
##$CY= 11.3945322036743
##$DATMOD= 1
##$DC= 2
##$DFILT= <>
##$DTYPP= 0
##$F1P= 2.36226072786647
##$F2P= -0.459571619588291
##$FCOR= 0.5
##$FTSIZE= 0
##$FT_mod= 4
##$GAMMA= 1
##$GB= 0.15
##$INTBC= 1
##$INTSCL= 1
##$ISEN= 128
##$LB= 0.24
##$LEV0= 0
##$LPBIN= 0
##$MAXI= 10000
##$MC2= 0
##$MEAN= 0
##$ME_mod= 0
##$MI= 1.114404
##$NCOEF= 0
##$NC_proc= 0
##$NLEV= 6
##$NOISF1= 3.799351
##$NOISF2= 2.8
##$NSP= 1
##$NTH_PI= 0
##$NZP= 0
##$OFFSET= 15.70392
##$PC= 1
##$PHC0= -15945.04
##$PHC1= 5.000789
##$PH_mod= 1
##$PKNL= yes
##$PPARMOD= 0
##$PSCAL= 0
##$PSIGN= 0
##$REVERSE= no
##$SF= 200.130013532006
##$SI= 16384
##$SIGF1= 3
##$SIGF2= 2
##$SINO= 400
##$SIOLD= 16384
##$SREGLST= <1H.CDCl3>
##$SSB= 0
##$STSI= 0
##$STSR= 0
##$SW_p= 3612.71676300578
##$SYMM= 0
##$S_DEV= 0
##$TDeff= 0
##$TDoff= 0
##$TI= <>
##$TILT= no
##$TM1= 0
##$TM2= 0
##$TOPLEV= 0
##$USERP1= <user>
##$USERP2= <user>
##$USERP3= <user>
##$USERP4= <user>
##$USERP5= <user>
##$WDW= 1
##$XDIM= 8192
##$YMAX_p= 0
##$YMIN_p= 0
$$ End of Bruker specific parameters
$$ ---------------------------------
##NTUPLES= NMR FID
##VAR_NAME=  TIME,          FID/REAL,        FID/IMAG
##SYMBOL=    X,             R,               I
##VAR_TYPE=  INDEPENDENT,   DEPENDENT,       DEPENDENT
##VAR_FORM=  AFFN,          ASDF,            ASDF
##VAR_DIM=   8192,          8192,            8192
##UNITS=     SECONDS,       ARBITRARY UNITS, ARBITRARY UNITS
##FACTOR=    0.0002768,     1,               1
##FIRST=     0,             0,               0
##LAST=      2.2672688,     0,               0
##MIN=       0,             -328904,         0
##MAX=       2.2672688,     313659,          0
$$ Real data points
##PAGE= N=1
##DATA TABLE= (X++(R..R)), XYDATA
0@%%%%%%%%%%%%%%%%%qJ6j6J6j6J6k1K9l2L5m3M8n2O0o8P6q5R7j12J21j30J46
39G7j66J86k03K27k51K75l04L34l69M05m46M94n45N98o60P34q16R08j016J145
59F07j302J495j736K054k485L099m051N684q970J7924q4704k56519K78919K86750
73B36765j84572j81542J77058O0094k63432k7014L62581Q2878l77512j49960L10752
84D6096J41675k36516o3708K29530j4545k79587L1037L22945j705l11002j5071
95a50851K66085j5927k41463O5792K59219q6099k83520O7135K70378n1642k21414
106a22307P9916J85724j40161k00591J77582K45700j57547k61422J07316K15414
116A29624r0092j40635J36238J02733k08982j30123K41672J83557k07782j97084
$$ y = [0, 0, 0, 0, 0, 0, 0, 0, 0, 0, 0, 0, 0, 0, 0, 0, 0, 0, -8, 8, -8, 8, -8, 8, -13, 16, -16, 19, -24, 24, -28, 32, -36, 40, -45, 52, -60, 61, -69, 77, -89, 97, -106, 121, -130, 145, -159, 175, -194, 211, -235, 259, -286, 312, -348, 386, -430, 478, -538, 607, -695, 800, -936, 1118, -1367, 1732, -2319, 3365, -5605, 12319, -72385, -328904, -49985, 236765, 52193, -129349, 47709, 107803, -155629, -182643, 179938, 262816, -114696, -264656, 46096, 187771, -48745, -112453, 117077, 102532, -177055, -146018, 176927, 175222, -135780, -150851, 115234, 99307, -142156, -76364, 182855, 96756, -186764, -119629, 150749, 99107, -122307, -42391, 143333, 3172, -197419, -19837, 225863, 68316, -193106, -85790, 129624, 39532, -101103, 35135, 137868, -71114, -201237, 40435, 223992, 16210, -180874]
126a80874J48016J46529j26767p2712J65614L7034k24400n8169K46274R7169k16089
137c8375j02391J71120O2719j57292j3413J81412o233k10170n880K11135J8345
148A10977j87322n488J68376k4647j73179M3850J88707l9565j88117K9783J64557
159H7932m0264j40490P2495J40981j00063j63005R8596J76754p4730j58569O0859
170c9504J18224q0118q9982J20428R6273j46490j23473J36809J36221j06101j14233
181i1946Q9235P2841j05074m5681J38252M9720j57139o9702J46957P6510j22803
192a8830n7855J10987K8464j21086j1387J38677J3275j44140j9887J33998J4869
203F7085j22191J883J21868j6509j30014J9052J32604j5518j22487J9989J08589
$$ y = [-180874, -32858, 113671, -13096, -85808, 79806, 116840, -107560, -165729, 80545, 177714, -38375, -140766, 30354, 93073, -64219, -77632, 103780, 97547, -112623, -118503, 92632, 110977, -76345, -81833, 86543, 61896, -111283, -67433, 121274, 81709, -106408, -76625, 87932, 47668, -92822, -20327, 120654, 20591, -142414, -43818, 132936, 58206, -100363, -39504, 78720, -1398, -91380, 29048, 125321, -21169, -144642, -7833, 128388, 22287, -91946, -2711, 70130, -34944, -80625, 57627, 107347, -49792, -119494, 27463, 103973, -18830, -76685, 34302, 62766, -58320, -69707, 68970, 82245, -61895, -81782, 52216, 67085, -55106, -53223, 68645, 52136, -77878, -58826, 73778, 58260, -64227, -44238, 64351]
214F4351l7047j05272N5261J14880n9936j23836N0511J17288m2298r6203N0239
225a2062P7336p2245p5625R0761Q8161r1072r7083P6694Q8167o5532o5376P1146
237A3270M6197q9373m3276J03624N2235j02494n7580R0588M9298q2100l2197Q5445
249C3637J8988r5642j6252J01527J8701r8393j6728R1899P613r0124K558R3854
261E1638p149r6459P158R2620r738q5097J9036Q1583l0627q5272L6327R0388l3706
274C0702q8340K9595P7447l2994o5417M5055O1532n7479o6606O0964P2032n4993
286A1498o8660M8345N6212m9911m3413N9803L8691o9728m1908P1899M5236o6692
298h628m1664O1362L1889o2051k2466O7779J8468p2637j8518P2645J7399o9573
$$ y = [64351, 27304, -77968, -22707, 92173, 32237, -91599, -41088, 76200, 33902, -62301, -12062, 65274, -6971, -82596, 8165, 96326, 5254, -91829, -15135, 73032, 7500, -57876, 13270, 59467, -29906, -73182, 30442, 82677, -19817, -77397, 13191, 62489, -19611, -51808, 33637, 52625, -43017, -59269, 42258, 60959, -37434, -54162, 37737, 45350, -44774, -42216, 51638, 44489, -51970, -44812, 47808, 38070, -47027, -27991, 53592, 22965, -62307, -25980, 64408, 30702, -57638, -28043, 49404, 16410, -49007, -3952, 57580, 101, -66505, -5541, 66491, 11498, -57162, -8817, 47395, -2516, -45929, 13874, 52565, -17163, -59071, 12828, 58064, -8628, -50292, 11070, 42959, -19092, -41558, 26221, 44689, -27948, -46466, 26179, 43578, -25995]
310b5995j2342O8019N572o9593j072P1502n60p0360K637O6553q036o3965J5409
323b2231O5106k0386o7817K0722O7345j9217o1718K0937N4335k7744n0556L5874
335e350N2110l9822n5049L8031N3871l4546m7132L4834L8905m0250l4438M6900
347H064L4921m9896l6613M8193L5065m5307k9506M5262K3094m8500j9265N2105
359A7617J8174n3317j7197N2275J4220n1363r767N2031O026n3315l908N3262K008
372B6746n1507J422M9869o205n0007J0134N1328j1585n1318J1537M8461j2755
384A6120m4016J6740M0998k2038m0981K5533M2325k5693m1911K4244L8266k4314
396E273l3100K7362K9472l1748k8733L4556K9333l4606k8565L3377K5346l3248
$$ y = [-25995, -38337, 29682, 35254, -34339, -35411, 36091, 35531, -34829, -32192, 34361, 26325, -37640, -22231, 42875, 22489, -45328, -24606, 42739, 23522, -38196, -17259, 37076, 9332, -41224, -5350, 46760, 6938, -48111, -10080, 43791, 9245, -37887, -3053, 35852, -4398, -38836, 8064, 42985, -6911, -43524, 4669, 39734, -5573, -35079, 10183, 33277, -15223, -34488, 17617, 35791, -17526, -34723, 17552, 31772, -19591, -29358, 22673, 28699, -24616, -28524, 24738, 26746, -24761, -23339, 26530, 20325, -29682, -19548, 31780, 20195, -31123, -19586, 28875, 16120, -27896, -11156, 29842, 7804, -33177, -7644, 34681, 8988, -32923, -8679, 29587, 5273, -27827, -465, 29007, -2741, -31474, 3082, 32415, -2191, -30756, 2621, 27967, -5281]
408e281k1102L5126J7883l7684j6353L9158J5341l9171j3412L8789J0448l9081
420a5339p545L9902N444m0176l718L9468J354l8478J797L8264m751l8786O437
433a6127L8845p063l7366Q030L4713j0437l2493J3853L1872j6603l2324J7522
445g578L2138j7166l0174J7271K6995j9011k4314K1845K3222k4152k3178K4893
457G91K2731k4616k0888K4611J8143k5712j5706K7485J4189k8831j3207K9301
469H291J1892k9305r907K9475P784k9987o001L0338M500l0119k809K9597O82k9342
483a4911J459K9496k990k9529L849K8760m689k7220O248K5698q480k4976J0540
496f745K4978j1617k4879J1855K3810j2099k1899J3194K0013j5041j8980J6841
$$ y = [-5281, -26383, 8743, 26626, -11058, -27411, 11747, 27088, -12083, -25495, 13294, 23742, -15339, -22884, 17018, 22462, -17714, -21432, 18036, 19390, -19088, -17291, 20973, 16222, -22564, -16127, 22718, 15655, -21711, -13681, 21032, 10595, -21898, -8045, 23827, 7224, -25100, -7578, 24560, 7394, -22780, -5509, 21486, 2475, -21839, 6, 23228, -924, -24102, 791, 23522, -1094, -21982, 2629, 20772, -4940, -20646, 6839, 21028, -7803, -21010, 8291, 20183, -9122, -19029, 10446, 18230, -11757, -17758, 12580, 17080, -13039, -15848, 13749, 14431, -14911, -13452, 16044, 13054, -16475, -12626, 16134, 11445, -15775, -9527, 16171, 7691, -17285, -6745, 18233, 6616, -18263, -6408, 17402, 5303, -16596, -3402, 16611, 1570, -17410, -569]
508e69J8682j7814j8342J8053J7249j8217j5502J8954J3731k0191j2433K1331
520D932J1525k1967j0546K2202R189k2396p645K2750O203k3061m949K3092L661
533A2990k2864k167K2670O24k2689O35K2698j516k2264K248K1393l351k0384M849
547g128J9773o369j9620P402J9510p878j8917Q222J7805r009j6552J0293J5672
560A3204j1648j5283J2603J4984j3064j4322J3389J3199j3951j1946J4850J0867
572A2882j5755j0069J6399R293j6745q331J6981P178j7211o071J7469N040j7582
585f522m019J7491K955j7399j809J7358P90j7313j1J7089o71j6556J470J5928
599H781k499j5463L603J5256m492j5132N053J4782n469j4114O063J3297o951j2634
$$ y = [-569, 18113, 299, -18043, 10, 17259, -958, -16460, 2494, 16225, -3966, -16399, 4932, 16457, -5510, -16056, 6146, 15335, -7061, -14706, 8044, 14247, -8814, -13763, 9329, 12990, -9874, -12041, 10629, 11253, -11436, -10801, 11897, 10381, -11883, -9635, 11758, 8407, -11977, -7128, 12645, 6276, -13344, -5942, 13568, 5690, -13227, -5005, 12800, 3791, -12761, -2468, 13204, 1556, -13727, -1124, 13860, 796, -13526, -137, 13062, -889, -12835, 2015, 12882, -2873, -12942, 3457, 12750, -3995, -12326, 4655, 11833, -5378, -11449, 6020, 11060, -6522, -10541, 6950, 9905, -7494, -9303, 8055, 8845, -8468, -8479, 8610, 7939, -8617, -7147, 8781, 6282, -9181, -5578, 9678, 5186, -9946, -4893, 9889, 4420, -9694, -3631, 9666, 2715, -9919]
613i919P955J2243q786j1974R332J1535r720j0803J0175R921j0810r111J1512
626A550Q429j2068p795J2416P098j2642o291J2852N422j3013m620J3135L834j3134
640d827l043J3097K196j3024j459J2983Q20j2847k48J2545l52j2177J102J1826
654F592j883j1640K571J1561l109j1345L505J0969l979j0484M626J0016n364r698
668g662O043R475o575r166O976Q698p362q112P833P501q341o971Q815O482r136
683a502n966R353N372r510m775R681M149r778l560R819K961r813k378R798J806
698E657r767j278R686Q30r557l47R320j67r146P66R017j308q945J771Q842k149
714C225q646K566Q343l050q067L636P816m181p626M647P421n020p117N368O723
$$ y = [-9919, -1964, 10279, 1493, -10481, -1149, 10386, 666, -10137, 38, 9959, -851, -9962, 1550, 9979, -2089, -9884, 2532, 9630, -3012, -9303, 3549, 8971, -4042, -8662, 4473, 8307, -4827, -7870, 5227, 7423, -5601, -7060, 5923, 6743, -6104, -6352, 6193, 5841, -6336, -5234, 6592, 4709, -6931, -4360, 7201, 4092, -7253, -3748, 7221, 3242, -7242, -2616, 7400, 2036, -7662, -1619, 7856, 1281, -7885, -909, 7789, 427, -7685, 148, 7649, -692, -7663, 1152, 7634, -1502, -7468, 1885, 7257, -2253, -7028, 2653, 6802, -2976, -6536, 3283, 6244, -3569, -5947, 3851, 5657, -4110, -5388, 4298, 5128, -4429, -4776, 4544, 4377, -4769, -4003, 5014, 3706, -5239, -3468, 5374, 3225, -5421, -2855, 5488, 2438, -5629, -1993, 5823, 1642, -5984, -1337, 6084, 1064, -6053, -685, 6038]
729F038n754o275O139N866o518n477O810N081p031m659P193M191p307l725P401
744A973L267p453k816P481K358p479j929P478J529p452j156P384P77p272l71P167
760C486p6p084N01P065r03p016J259O901j603o758K010O569k460o384K887O250
776D644l292o099L643N878l952n570M233N261m542m962M858M630n093m316N268
791E89M010n408l669N513L303n591k956N664K608n683k277N713J940n734j618
806c596N744J313n728j012N671P25n649l69N624Ln607L34N582o38n531R25N456
823C247j267n330J609N198j953n113K314M991k603m832K858M639l112m399L352
838d01M151l582l902L784L656l938l405M061L139m145k866M205K602m269k337
$$ y = [6038, 284, -5991, 148, 6014, -504, -5981, 829, 5910, -1121, -5780, 1413, 5604, -1703, -5428, 1973, 5240, -2213, -5029, 2452, 4810, -2669, -4598, 2880, 4409, -3043, -4199, 3185, 3962, -3310, -3681, 3486, 3410, -3674, -3173, 3892, 2989, -4027, -2768, 4133, 2530, -4228, -2218, 4351, 1891, -4493, -1606, 4644, 1352, -4747, -1104, 4774, 822, -4748, -515, 4746, 204, -4758, 100, 4730, -363, -4679, 589, 4599, -809, -4478, 1035, 4338, -1253, -4209, 1455, 4063, -1620, -3897, 1816, 3756, -1978, -3596, 2148, 3461, -2267, -3279, 2392, 3117, -2532, -2901, 2723, 2726, -2881, -2547, 3035, 2397, -3134, -2209, 3247, 1980, -3350, -1741, 3457, 1504, -3609, -1295, 3696, 1093, -3739, -881, 3758, 646, -3753, -401, 3750, 168, -3734, 50, 3706, -232, -3637, 424, 3563, -582, -3448, 757, 3359, -910, -3247]
853c247M319K074m360j808M372J563m385j339M404J087m404q27M402N45m387k83
869b274M390J9m403K57M390n14m351P72M302j060m215J356M119j623m035J876
885i94L922k094l779K286L612k486l407K652L221k812l042K964K831l053k628
900b807L119K424l185k216L238K008l282j807L318J608l356j407L389J215l425
915a166j017L440Q28l453o08L472L75l492j65L514n2l523K88L500n00l462P32
932a289L403r62l342J183L267j384l185J553L076j712k940J860K793j997k651
947b327K132K496k229k344K305K184k370k025K421J868k454j723K507J560k541
962e40j423K606J250k622j108K664R54k694p98K724O20k752m33K782K63k810q4
$$ y = [-3247, 1072, 3146, -1214, -3022, 1350, 2913, -1472, -2811, 1593, 2680, -1724, -2551, 1851, 2396, -1991, -2274, 2116, 2135, -2268, -2011, 2379, 1865, -2486, -1714, 2588, 1528, -2687, -1331, 2788, 1165, -2870, -994, 2928, 834, -2945, -659, 2953, 467, -2940, -288, 2933, 121, -2921, 43, 2874, -179, -2807, 312, 2736, -449, -2665, 573, 2581, -701, -2508, 810, 2418, -938, -2345, 1044, 2259, -1166, -2183, 1257, 2085, -1368, -1976, 1496, 1871, -1621, -1786, 1728, 1676, -1847, -1559, 1941, 1441, -2021, -1289, 2114, 1152, -2190, -1007, 2260, 876, -2309, -756, 2320, 608, -2332, -472, 2321, 324, -2327, -195, 2301, 72, -2272, 33, 2217, -153, -2178, 243, 2111, -343, -2066, 441, 2001, -540, -1963, 643, 1893, -729, -1837, 827, 1781, -913, -1711, 1013, 1633, -1119, -1552, 1230, 1493, -1317, -1401]
979a401K822r1k836K81K805m70k770O54K716q18k653R56K597j101k525J248K413
996A827j358k300J459K195j551k080J632J973j704j847J752J725j791j620J846
1011A58J486j867j377J920J258j962j147K009J028k048r11K091P75k131o44K165
1027H03N15k211l60K231K24k266p6K278q1k263K13K252l65k207M86K191o29k139
1045a404P51K072q45j996R33J917j013j840J092J745j146j662J197J578j250j489
1061a360J295J419j349j321J372J238j431j143J478J063j535r64J589Q62j638
1076d25p49J666O63j741n39J772M21j807l06J850J85j854o6J856n2j852J79J831
1094A032k94j789L89J760m86j729N87J663o56j600P09J547p66j494Q25J420q76
$$ y = [-1401, 1421, 1330, -1506, -1225, 1580, 1110, -1660, -1006, 1710, 892, -1761, -805, 1792, 691, -1834, -586, 1827, 469, -1831, -372, 1823, 272, -1808, -176, 1797, 93, -1754, -2, 1723, -68, -1688, 158, 1644, -223, -1600, 320, 1578, -384, -1531, 478, 1506, -542, -1453, 638, 1413, -718, -1362, 803, 1318, -893, -1253, 978, 1202, -1064, -1140, 1138, 1057, -1206, -993, 1259, 894, -1313, -827, 1364, 735, -1404, -653, 1419, 574, -1422, -489, 1428, 415, -1425, -333, 1412, 266, -1396, -199, 1379, 129, -1360, -65, 1354, 5, -1316, 56, 1294, -137, -1280, 198, 1261, -274, -1238, 351, 1213, -425, -1174, 492, 1155, -586, -1125, 647, 1068, -739, -1045, 805, 990, -864, -930, 926, 874, -978, -799, 1032, 738, -1051, -662, 1098, 612, -1117, -530, 1133, 477, -1123, -414, 1133, 367, -1127, -302, 1118, 242]
1111B42j358R32J285r58j229J014J158j069j090J111J014j152r47J214Q73j270
1127b30p81J313P01j375o06J413N13j452m08J494L08j519k07J523J19j536j2J526
1145G84p0j527J67J499k52j467L23J429l88j382M39J335m97j303N47J258n91j203
1163h99O41J152o79j108P20J064p73j005Q09R58q58r00R21Q38r61p83J019P14
1181H70j056o62J104N78j152m90J185M26j223l48J257K57j272j71J265R8j272
1198f06k4J245l3j245J06J223j66j196K27J158k58j139L05J106l54j060L88J034
1216G11m26r85M55R68n13r20N49Q78n86q53O42Q05o83p69P35P07p71o55Q13O20
1236G22q85n36R18M81r54m36R84L57j008k80J005K40j026j65J023J11j020n4R98
$$ y = [242, -1116, -184, 1101, 143, -1086, -72, 1086, 17, -1073, 38, 1052, -100, -1047, 167, 1040, -230, -1011, 302, 1003, -372, -978, 435, 948, -504, -912, 582, 890, -629, -836, 687, 806, -730, -742, 784, 714, -813, -646, 853, 601, -866, -543, 886, 498, -884, -445, 890, 393, -910, -363, 895, 304, -899, -258, 894, 215, -893, -173, 891, 118, -887, -78, 880, 22, -878, 43, 881, -80, -863, 156, 870, -186, -848, 256, 834, -318, -808, 377, 803, -420, -768, 489, 746, -526, -697, 568, 666, -606, -630, 615, 582, -663, -557, 666, 500, -696, -469, 689, 431, -708, -403, 703, 349, -711, -323, 711, 285, -700, -245, 723, 210, -710, -161, 717, 131, -722, -80, 725, 42, -727, 8, 715, -56, -711, 102, 722, -163, -699, 219, 700, -254, -690, 294, 651, -357, -637, 368, 608, -418, -583, 440, 551, -469, -523, 475]
1255D75J2r81L1R76q4r52J22R33j55r06J96Q64k17q51K66Q20k91q20L27P89l70
1276A84p56M11P30m58p00N08O56n39o31N91N85o32n35O75M86o96m59P46L84p63
1296b13l29P81K88p92k50Q06J99q05j53Q01J19p95p7P97K2p58j2P56l2p32M8P17
1318C86p3p03R3O97j46o77J76O55j98o52K57O17k80o09L26N92l68n62M10N27m35
1339C3m96M65M76n07m32N44L76n52l54N71L32o02k84O10K38o18j95O06J73o16
1359b32j48O11J22o02r3N95P3n90m8N72L2n84LN61k8n53M9N61q6n24J05N23j36
1382A83n25J83N11k21m84K41M79k75m63L14M38l44m05L74L80m11l45M09L29m45
1402g7k99M65K65m64k45M90K02m66k01M76J73m76j52M59J52m88j10M79R3m56p4
$$ y = [475, 487, -494, -463, 513, 429, -523, -401, 532, 377, -529, -333, 531, 314, -537, -271, 549, 258, -562, -235, 554, 184, -572, -161, 569, 111, -589, -81, 575, 36, -595, -4, 581, -51, -586, 89, 575, -121, -580, 166, 550, -213, -542, 239, 527, -265, -515, 291, 490, -315, -468, 333, 452, -343, -420, 377, 399, -359, -371, 385, 353, -379, -331, 386, 313, -390, -297, 400, 254, -423, -247, 408, 210, -442, -185, 432, 152, -457, -131, 461, 93, -469, -59, 468, 33, -463, 2, 478, -29, -461, 83, 459, -93, -447, 124, 456, -146, -430, 180, 418, -200, -395, 211, 384, -232, -380, 231, 353, -249, -342, 253, 326, -264, -312, 260, 292, -292, -289, 272, 244, -309, -260, 301, 215, -309, -204, 319, 183, -342, -159, 352, 131, -353, -112, 367, 92, -371, -57, 381, 37, -368, 6, 386, -25, -370, 39, 368, -77, -376, 89, 354, -110, -355, 135, 337, -129, -330, 146, 319, -157, -309, 150, 302, -186, -296, 183, 276, -180, -254]
1423b54M47O0m62k1M49J2m61K5M50m9m37O2M38r8m43J40M23j63m03J92L85k18
1445G4l87K56L60k79l33K96L14l13k90L36K69l48k45L31K47l61k09L62J88l61
1465i3j77L71J54l62j43L65J28l55j20L52J16l68q0L62N1l44l7L49K0l54j0L56
1487A81j5l68N5L53q5l42R9L49j43l18J59L13j87k97K08K72k08k74K41K41k33
1508Ak33K53K16k56k01K54J83k58j63K43J70k57j68K85J25k56j27K68J11k64j10
1529a84K70Q8k74q0K76P3k98l3K75K7k91RK91l9k71L7K88o7k72R2K63r4k69J32
1553e1K51j38k50J67K31j84k12J76K02j89j82J85J76j96j62J98J54k02j60K16
1573C0J46k12j44K21J13k06j13K09J07k08j03K32P4k24o8K35M7k39k4K38Lk29
$$ y = [-254, 193, 253, -209, -230, 219, 231, -230, -205, 245, 196, -241, -179, 259, 161, -282, -142, 281, 118, -285, -93, 292, 74, -313, -57, 303, 24, -309, -13, 301, -12, -302, 34, 303, -45, -290, 41, 288, -73, -282, 80, 268, -93, -270, 101, 255, -107, -250, 115, 243, -112, -232, 120, 236, -132, -212, 150, 201, -143, -180, 169, 189, -165, -175, 181, 166, -202, -147, 206, 121, -221, -122, 227, 84, -234, -75, 238, 51, -246, -38, 234, 26, -248, -7, 234, 1, -232, 21, 237, -19, -220, 34, 217, -41, -204, 39, 209, -48, -216, 69, 194, -62, -189, 79, 190, -74, -184, 86, 174, -100, -180, 96, 169, -129, -162, 113, 140, -151, -142, 149, 110, -161, -124, 164, 97, -175, -83, 180, 86, -183, -51, 200, 62, -188, -21, 210, 26, -186, -10, 192, 3, -179, 6, 182, -14, -176, 22, 176, -26, -186, 30, 176, -36, -180, 41, 154, -52, -165, 44, 151, -57, -160, 72, 146, -78, -146, 89, 136, -103, -127, 111, 114, -115]
1595a15K7K31m2k37O1K28p4k31J08J98r3k14J28J98j45j80J29J77j37j78J50J56
1617A45j42j63J54J54j66j36J62J39j56j36J70J27j76j12J74J02j85r0J76R6j91
1638e4o9J90N4j97l5K11J6k11JK01k5j91L0J96n1j91O4J92q0j80Q4J73r3j77R9
1663d3J67j10j58J24J56j25j39J15J36j17j37J32J24j33j17J43J03j35j10J39
1683A5J06j55p8J47Q0j47q1J60O4j66m1J57K7j66j2J74j7j49%J75k8j72M4J69
1707A06o3j64O1J62o8j45Q3J35r0j16Q2J27r4j15R4J20j01j07J00J02j10q4Q8
1730CR8j08r7J11Q2j17p6J21P4j32m9J12O5j40m1J36L0j32k9J42Rj33j1J51rj35
1756g5RJ50l4j30L5J28m7j22M8J38n9j33P7J04o4j17P9J00p0j03P5R0o8j08Q4
$$ y = [-115, -88, 143, 101, -136, -75, 153, 79, -152, -44, 154, 61, -153, -25, 173, 28, -152, -23, 154, 17, -161, -11, 145, 3, -160, -6, 148, -18, -154, 8, 147, -9, -145, 25, 152, -24, -136, 38, 140, -45, -135, 41, 137, -54, -123, 67, 121, -76, -111, 100, 116, -95, -94, 107, 82, -109, -79, 117, 66, -125, -61, 131, 51, -129, -45, 128, 35, -142, -43, 124, 14, -144, -20, 136, 11, -128, -13, 123, 6, -131, 1, 125, -8, -125, 18, 121, -14, -124, 15, 121, -34, -112, 35, 115, -32, -113, 47, 111, -55, -96, 61, 88, -78, -90, 84, 67, -82, -82, 93, 65, -107, -63, 106, 43, -121, -60, 102, 34, -111, -28, 107, 17, -99, -17, 110, 16, -99, -5, 115, 14, -93, 7, 109, -1, -85, 3, 101, -7, -104, 7, 89, -28, -104, 17, 91, -41, -90, 22, 87, -53, -94, 42, 72, -60, -89, 53, 62, -71, -82, 69, 60, -75, -66, 84, 50, -80, -45, 83, 36, -86, -38, 100, 41, -92, -15, 89, 25, -92, -13, 87, 17, -86, -11, 79, 11, -97, -13]
1781a3Q3o3q8P9Q6q5r0R7O9r3o7R8O2r4n3J06M8j11l9J13L1j23j4J24kj15QJ15
1809F9nj33L4J14m2j11M3J17m6j13M0J08m0j09N0R7m8j05N4R7n5q9O0P6o3p2O7
1836eQ4p6q0Q3N5n6o9P2Q5j03n8J03L6r2m0R3L2r9j4R7J8j12jJ05j5j11K0R8p
1865D3j20L2J09m1q6L0R5l6r2L7Q7m0q5L7Q8l7q6M3R0n3p3N3P4n3p7O7O1n8p1
1894f2P8O3q0o4P1N9q4l6O9L5q6l0J02Lp4j5R1J3j08OJ00j4r2J5R9k8r5K6J00
1923F2j8j00K7P8j9p8K9R0l4q8K8R4m5q2L3Q3m6p1M2Q2m7q3N1P6p0p1Q8M8p7n4
1953g2Q3L9p5l5R4J6r0oP1K5r5qJ02Mr3rR3Kq9J4P3jr5K9O7j5q1K7Q6l7p3K6P9
1986E6l3q1N1N9m3o6L7O9m2o3M9N9m7o7O7N4o6n4Q0L5p3k2O2L0o2l4Q4K2q9j4
$$ y = [-13, 70, 7, -81, -2, 84, -1, -91, 6, 75, -18, -85, 13, 75, -19, -72, 34, 82, -29, -68, 45, 76, -47, -61, 63, 61, -54, -46, 69, 64, -69, -35, 79, 37, -74, -31, 86, 40, -73, -33, 75, 35, -74, -24, 73, 25, -80, -26, 71, 16, -73, -13, 63, 0, -72, -5, 79, 3, -77, 6, 61, 5, -64, 8, 93, -10, -68, 35, 71, -21, -61, 32, 64, -35, -49, 48, 66, -46, -47, 58, 43, -68, -48, 50, 43, -77, -45, 64, 23, -63, -33, 62, 26, -66, -29, 58, 18, -67, -30, 58, 21, -65, -22, 68, 15, -58, -5, 69, 16, -61, 6, 67, 9, -62, 16, 79, -1, -65, 6, 65, -19, -55, 14, 49, -37, -67, 35, 38, -36, -51, 40, 53, -55, -49, 51, 37, -55, -40, 59, 31, -64, -38, 62, 44, -56, -29, 49, 30, -48, -19, 71, 37, -51, -23, 71, 26, -56, -23, 60, 14, -57, -15, 67, 20, -63, -12, 64, -6, -77, 11, 59, -18, -72, 11, 50, -25, -60, 34, 50, -40, -46, 25, 50, -45, -53, 49, 53, -40, -49, 44, 46, -43, -29, 44, 43, -52, -23, 44, 29, -52, -25, 61, 24, -49, -23, 56, 23, -58, -7, 52, 9, -57, -20, 49, 7, -56, -7, 52, 5, -62, 5, 59, -7, -61, 19, 54, -19, -41, 21, 51, -11, -45, 39, 61, -28, -42]
2016d2R7%q0j1Q6%r3J3P1lp8JQ4k5p0K4P1k0p8K0Q2l1p1L0O6l2p0M6N8l7n8M8
2048bN4n3n5N5O2n4m7M9M9o7m4O8M8p4k9O9J3o7k0O6K6q8pP4Oq0J1P2j3p1J7P6
2080D4j9p6K0O8j2p3OQ5k0o9L0N7k0o5K3P0l6m4K0O5m1o9M6P0n6m5M6N1n5n2N9
2111HM3p3l3P0K5p0k5O6L8p7l6Q7J2p2j5Q6Oo9oP0ko4nQ3j3o7JQ0j3p6J7P8k1
2144C3q0L3P6l6p1K9O4l3o9M1N8m1m7K2O5m6n4N7M2m7n5O7M2p5k6O6K1n7j9Q2
2174D2Lo8j0P1J1o6k5P3Po2oO9Np5JP6j2p1OO8rp1PP3k4o2J7P7l1o7K9O5l1o6
2208e6N0M5m1n1L9N1l9l8M9L5n0l9O2K6n4m2Q3J7o8j1N6K0o2k3P4on0j6N9J8p2
2239c4jO6mp1MO7jn6qP9j5o5J1O3j4o4K7O2j2p5K7O6k6n7L1N2m9m2L5N9o3l9N1
$$ y = [-42, 55, 55, -25, -36, 50, 50, -43, -30, 41, 38, -40, -39, 45, 20, -50, -26, 45, 25, -53, -33, 49, 18, -53, -23, 43, 11, -59, -13, 45, 8, -50, -2, 52, -1, -56, -1, 61, 7, -40, 9, 58, -9, -53, 15, 63, -11, -40, 29, 42, -25, -45, 21, 47, -41, -48, 26, 32, -48, -37, 35, 22, -49, -32, 44, 25, -51, -31, 37, 25, -48, -42, 43, 23, -46, -16, 41, 21, -44, -21, 49, 13, -31, -11, 54, 13, -56, -10, 60, 4, -41, 5, 56, 1, -51, 8, 51, -22, -55, 15, 40, -30, -55, 11, 49, -28, -64, 23, 35, -37, -52, 34, 40, -29, -35, 35, 33, -31, -36, 47, 34, -33, -32, 48, 35, -41, -24, 54, 33, -47, -14, 62, 26, -45, -16, 48, 15, -54, -13, 45, 4, -43, -21, 44, -2, -56, 1, 43, -4, -59, 8, 50, -25, -51, 15, 36, -21, -40, 42, 45, -23, -33, 38, 49, -17, -42, 31, 38, -24, -30, 39, 44, -31, -30, 46, 34, -37, -31, 37, 28, -43, -36, 37, 13, -49, -32, 45, 14, -53, -24, 41, 10, -56, -6, 39, -2, -53, -14, 37, -2, -40, 9, 44, -6, -45, 17, 43, -11, -53, 30, 47, -21, -32, 24, 44, -18, -41, 33, 27, -23, -39, 20, 38, -34, -35, 31, 27, -44, -40, 27, 26, -30, -38, 41, 26, -39, -28, 35, 21, -43, -16, 46, 34, -41, -14, 52, 26, -31, 0, 52, 3, -39, -4, 55, -8, -47, 4]
2272DL9m7m7P1J8m9l1M8K9n6k2O5No1qN2K7p3pP6Ko5mN2K5o4k0P6J1p1LO5mn9
2306b0QO2k2o0J8O1k6n5K1O4l2p1M2M6l5m5L6M7n6l8M8L3l4l6M7L5m7l6M8M0o0
2337a7k8N8K5m9k2N3K2m8k5O3K0o4j0N6Mn6mN3Oo2OM4jn5J6N3k1n4K2M3k0n9M5
2370fL5k7m2K9N1k6n6L5L9l0l9L9L8l3l5L5L5l8l2M4L0m9l0N5K6m4l7N6J1n5p
2401b8M2J1l9k6N7Rn8LN3nn6oO5ln1J5N4k1m8K0M8k0m4K8M4l6m7M3M2l6m6M8L5
2434D7k7m6M0L1l9m1L4L5l5l6M4K6m7k8N4L4p2j7M6J5m4jM2J1n1qM5J5m9nM8N
2466B6n2QN5j5l9%N1j6j8rM6j6n7M0L1k6m4K1M5k6m1K8M3m0l4L8L3l6l2L3L1m0
2498a2l1M0L2m4j8M0K7m7j1M6Qm1j3M9Rm2j3N8mn7J0M0Jl8nM9rm6LM8k2l6K0K4
$$ y = [4, 43, -4, -51, 20, 38, -11, -42, 6, 35, -21, -43, 22, 27, -34, -42, 10, 37, -36, -43, 33, 35, -30, -34, 18, 43, -21, -41, 35, 46, -25, -22, 43, 39, -20, -12, 50, 28, -32, -14, 47, 21, -34, -13, 51, 19, -52, -10, 36, 1, -44, -8, 39, -17, -55, -7, 26, -8, -44, 3, 38, -9, -45, 3, 43, -17, -45, 13, 38, -11, -33, 20, 42, -6, -31, 32, 52, -12, -22, 34, 38, -18, -22, 31, 37, -25, -19, 25, 24, -31, -15, 38, 17, -37, -15, 28, 8, -51, -6, 29, 2, -40, -11, 40, 14, -42, -7, 32, 2, -37, 2, 40, 7, -28, 7, 42, 4, -28, 16, 46, -3, -33, 22, 48, 4, -33, 23, 34, -21, -28, 14, 25, -14, -40, 17, 26, -32, -29, 24, 19, -37, -43, 22, 19, -32, -17, 37, 16, -32, -12, 36, 16, -28, 0, 44, 8, -39, 4, 46, 10, -36, 12, 47, 20, -26, 14, 45, 6, -35, -1, 34, -1, -37, 7, 33, -14, -42, 12, 46, -26, -43, 3, 18, -26, -27, 15, 26, -25, -33, 12, 27, -22, -27, 21, 26, -26, -18, 37, 22, -17, -17, 34, 18, 0, -9, 37, 21, -36, 4, 35, 9, -35, -14, 31, 5, -36, -8, 35, -5, -39, -1, 32, -4, -36, -3, 28, -12, -43, -3, 29, -15, -33, 7, 34, -13, -24, 22, 30, -11, -24, 25, 34, -8, -21, 37, 33, -24, -14, 26, 27, -11, -16, 33, 24, -22, -19, 29, 7, -29, -9, 15]
2532A5j3l6J2M6k4l6J9N0l2m3M1L2l8k9K9L7m4lK6K4k9l4L8L4m3rJ7K5m0j8L9
2563A3K4m6j5M5mk9nK9Nm6MM0j3l0%N2rm7J5N4l0l7J4L8k0l1K3L5j8l2K2M2l0
2596A3l3J6M1k9l7L2K0j8l2K7L1k8k7K7K8l8k2L4J9l6k4L4J8l9qM1jm1J0K3J5
2627A6m8MM7nl1qM7ml7OM7j6l7J0M2j8k9%M4k6l1K8L9l9m5M8K4k3l4K3J9k3k1
2660c1K6J8l4qL1J5k9j3L7Mj6j9L3Rm0j8N1J2m7MM6Mn2J1M2j7m0QL6j7k5NK9j4
2694Al0J6L2j2l9J5K1pk5J7K8j0k8RK8k2k6K0M1k8k8K3L0k1k7K5J6k2j7L4J1k3
2726Bj6K8Jk6j7M5Ol8oK8Kl3KL1pl7J9K2%l6PL0mk4LL0kk8QK7j1k5J0L9j8k3O
2763eM0l7j7K7K4k9j6J7J5k3j6L0Pk4j6L6Ll0j6L1%k4rL5Pm0NL9j3k2QK3nj7R
$$ y = [15, 2, -34, -22, 24, 0, -36, -17, 33, 1, -42, -1, 31, -7, -36, -7, 30, -14, -17, 9, 33, 4, -30, 8, 42, -1, -10, 7, 32, -8, -26, 13, 37, -9, -24, 21, 17, -12, -17, 12, 17, -29, -25, 15, 2, -28, -28, 24, 15, -32, -17, 37, 7, -30, -16, 22, 2, -29, -6, 29, 11, -21, 1, 43, 13, -20, -4, 37, 8, -29, 3, 23, 5, -27, 0, 31, 3, -24, 3, 31, -7, -29, 5, 24, -12, -36, -2, 16, -23, -31, 10, 9, -32, -22, 1, 16, -32, -28, 19, 14, -17, -25, 22, 18, -19, -13, 34, 18, -19, -9, 33, 15, -14, -14, 30, 4, -27, 1, 40, 1, -44, 4, 28, 5, -29, -6, 13, -10, -31, -5, 13, -21, -29, 2, 17, -12, -25, 12, 16, 0, -19, 14, 23, -17, -35, 16, 28, -19, -15, 31, 35, -17, -6, 36, 19, -21, -13, 23, 6, -19, -14, 15, 1, -29, -13, 19, 7, -32, -17, 4, -3, -28, -11, 17, 7, -21, -12, 16, -6, -32, -12, 29, 1, -27, -4, 26, 5, -22, 3, 19, -3, -20, 14, 25, 2, -14, 14, 15, -11, -28, 17, 23, -15, -21, 7, 9, -24, -22, 9, 2, -35, -16, 6, 6, -30, -23, 7, 3, -21, -18, 12, 10, -18, -10, 17, 6, -19, -9, 30, 12, -11, -5, 35, -2, -19, 8, 32, 3, -13, 4, 19, -4, -20, 10, 17, -7, -23, 13, 16, -14, -30, 1, 1, -23, -32, 3, 10, -30, -25, 14, 1, -21, -13, 10, 5, -12, -3]
2798cK6j3l0K1J7j0j9J6K2k1k1J2K2j1j7LK8k8k5K5J6k7j3K2J7k1j2J2K9l8JJ7
2830cJ1l2oM1Nl0rK5Ok3jK5lk7J1K8mk7RK3%l3J7J5lk7kK4jl9J7L1j9k2J0J9r
2867ck0J2J1j4j5J1L2k1j9J9J6k4MJ7J5k5j1L2%j9j2K5J1k7JJ8j1r%J2Ol1J5J5
2901A1%k8JJ9Ll5J2K7qk2QK2j2k2PJ6opRK1j2k4K3J7j9j0J3J5k2j2L4nj4nNJ3
2937A3j8mJ6Jk1j4K6Nk4lK4Mk1nJ7Kj6MJ4Rk5LK2Ok6LJ8Kl6K7J8nj5PJ0nk8K2
2975GK2j3k9K2J5k3k2L1J0j5j7QPj3lJ2J4k9NJ1Rj7j3L4Kk1kJ9Jk4J4OJ5k8lK9
3011B1Nj7mNJ2k7J0OopmK4pj5kK2j8j1jJ5Kk3J3Krj0J7J5j7JMJ2j8j2K8Mj1lJ3
3050IMj4j1K8mqj1J8nj5lK0Nl0K0Qj0j1ORpj4PNQk2OJ4pj3J1Qj2lJ6J0qj0J6R
$$ y = [-3, 23, 10, -20, 1, 18, 8, -11, 5, 27, 6, -15, -3, 19, 8, -9, -6, 22, -6, -31, -6, 10, -17, -30, -8, 9, -12, -24, -12, 17, -21, -20, -3, 8, -24, -30, 11, 16, -14, -23, 2, 8, -15, -16, 9, 6, -21, -10, 18, 14, -13, -4, 19, 19, -14, 3, 18, 15, -12, -14, 10, 9, -30, -13, 18, -1, -23, -13, 6, -3, -23, -11, 0, -14, -29, -18, 14, -7, -26, -7, 9, -15, -11, 6, 21, -4, -15, 17, 17, -2, -14, 11, 22, -5, -4, 14, 3, -6, -6, 6, 12, -19, -4, 11, 11, -17, -16, 3, 6, -29, -17, 10, 2, -20, -12, 10, -2, -24, -17, -1, -7, -14, -5, 16, 4, -20, 3, 20, 1, -9, 4, 19, -3, -15, 19, 14, 0, -5, 0, 13, -5, -9, 7, 8, -13, -27, -1, 4, -20, -23, 1, 5, -16, -21, -4, -2, -18, -14, 0, 9, -16, -13, 9, 15, -11, -8, 10, 12, -24, 3, 21, 16, 1, 8, 18, 13, -15, 7, 29, 16, -13, 9, 24, 1, -21, 10, 20, 5, -12, -4, 3, -10, -13, -1, 13, -16, -11, 0, 9, -8, -21, 13, 15, -6, -8, 11, 12, -12, 2, 8, 23, -5, -8, 21, 26, 9, 5, 10, 22, -5, 5, 11, 5, -2, -6, 18, 11, -4, -6, 16, -2, -13, -14, 1, 3, -20, -7, -5, -14, -24, -7, 8, -9, -8, -4, 8, -10, -22, 6, 10, -1, -4, 9, 13, -1, -12, 16, 12, 4, -7, 11, 6, -9, -12, 8, 13, -17, 3, 11, 1, -10, -4, 5, -2, -16, -9, -4, 4, -18, -12, 2, -5, -18, -7, 1, -11, -14, 2, 12, 4, -6, 10, 19]
3090A9k2lJ5J0j6j0K1Pj7j5J1J6k0lK3jk7qK2lj0JPOl2K2K0j9nj1K1oj6J3J5m
3126Aj2KJ6Mk3J3J5pj3LJ5j3pJ6J1k0rK3Jj1qJK0j5j3J2J0j7j1J9J3k5j3J6Pj8
3162a7PPLkqJ1Kj1QRjpmJ2%j2JJ0Lj8JJ7Pk6J0J7rk7J7J7k2kJ1J0k7j2K9Kj3j5
3202b2QK2k0j6K6JnlRPj2nJ7Rj9mJ8Qj6qJ8mj8LJ4Qj7nK9k3j4mK5lj1%J9j9j3
3241b0J1Poj0J3J0j5kJ2Rj1rJ4mnNRKj5%J6kMj5J3Mj7KPj0oKK1j4j2JjJ5k1NJ1
3282bojkJ3kj4MJ1kj6NK1j0oNJ1j9QnJ2oPkLpj1J9Nj1j3KL0j5j2QKj9NJJ2j4p
3324a8NPqlJ2jMj1QKlKMMj5OJ6pj5J5J2rj2J3lMj5Qlr%J1J0qj3KRj3oQJnj0J1
3368a3Mj0mNJ5pnJ5Lj2mJ2J2k1MQrJ7j4J4Pj8KL%qKNloPQj9jLRjj7%J1pqONkm
$$ y = [19, -3, -6, 9, 19, 3, -7, 14, 21, 4, -11, 0, 16, -4, -7, 16, 15, -12, -20, 2, -1, -11, -10, -3, 3, -29, -7, 13, -6, -11, -22, -1, -7, -23, -10, 5, 1, -11, -9, 7, 11, -12, 1, 16, 9, -4, -1, 14, 1, -6, 10, 21, 1, -8, 15, 16, 5, -3, -2, 18, 3, -10, 2, 12, -5, -16, 3, 16, -9, -22, -6, 1, -17, -10, -3, 0, -2, -10, 1, 3, -8, 0, 9, 8, 1, -3, 9, 9, -3, -2, 8, 11, -7, -6, 11, 18, -8, 2, 19, 10, -17, 0, 17, -5, -7, 4, 14, -13, -25, 4, 6, -7, -22, -14, 8, -12, -28, -2, -1, -6, -9, 0, 7, -5, -10, 7, 16, -3, -7, 11, 19, 3, -5, 13, 9, -9, -6, 8, 16, -1, -6, 23, 0, -14, -18, 7, 4, -7, -7, 12, -7, -20, -9, -2, -8, -18, -5, 5, -10, -12, 0, 9, -2, -11, 3, -1, -6, -1, 8, 10, -5, -5, 11, 9, 13, -2, 11, 15, -2, 0, 7, -3, -9, -7, 14, 0, -12, -11, -12, 3, -18, -13, -2, -8, -9, -11, 2, 0, -14, -10, 1, -1, -17, -12, 9, -1, -7, -2, 9, -10, -2, -7, 5, -1, 6, 4, 7, 0, -11, 8, 13, 2, -11, -9, 21, 6, -6, 2, 4, -15, -10, -9, 3, -11, -18, -13, -6, -14, -17, -5, -6, -2, -13, -5, -3, -6, -4, 0, 4, -11, -5, 11, 4, -11, 4, 16, 7, -5, 8, 5, 9, -6, 2, -1, -10, -10, 1, 11, 3, -10, -8, 1, -12, -18, -10, -9, -14, -24, -13, -9, -19, -23, -18, -3, -10, -15, 0, 3, -9, -13, -1, 11, -10, -6, 2, -7, 10, -4, 10, 17, -1, 1, 4, 4, -4, -2, 3, 0, -6, 1, 9, -10, -11, -8, 1, 0, -17, -17, -6, -13, -21, -15, -10, -12, -16]
3414a6LJ7j4%Rklj1J4kn%J3lqJ0mJ0rk%J0j0QqKj4JKLqJQJj1POopKJ1JnnJ2ln
3461a0RRoqJ3j2NkLOrpRRnNJJrj0ONpJrJ3rqQLoj2J5r%LJ0pJ1pQOkj0J9j7klJ8
3510A0rJ2j0KjrJ7llj4J1Mkj1QqqNKRKj6J0RrpMmKlRoj1J2LJ1j5PlJ1q%NOolN
3557GJj0rK0oknk%Lkj5J4j0QJ0qpJ1Qj0mnMMj0J5KpJQoOkmLOll%OLrRj2jPMj1
3606cMj0Rj2LJ0j6J2moLqJ1KlnJ0Qjj1mLKOkM%oLLOrMJoJ2j8J2%jmNLmljqpJ7
3655AkkqoKLpJ4%pPkjkPJ1j1Nj1K2pl%J3nk3J8Lj0okJ0mpKJNmRm%j0J2j0KJKo
3703a0JKmLjLN%JrJ3nPjPkJ%J2j6RqNj0oJ1pQmj0OqKPj1%pKJ6j7kJ2PNj1Qkj1
3751iLJ5jj6RJ0j3pJ8mk%J0Rj2nJMpkKJ7j8Kj4J2k%j1KNj2LjJ0pMJl%RJ4k1J3
$$ y = [-16, -13, 4, -10, -10, -1, -3, -6, -17, -3, -5, -10, -10, 3, 0, -8, 2, -2, 8, -1, -3, -3, 7, -3, 5, -3, -1, -15, -14, -12, -9, -17, -16, -8, -7, -18, -11, -5, -11, -18, -16, -5, -4, -9, -14, -2, -5, -10, -1, 8, 2, -6, 7, -5, 0, -2, 1, 7, -2, -9, 0, 9, 4, 9, 10, 11, 2, -8, -2, 3, -4, -3, -12, 1, -8, -16, -8, -5, -11, -23, -8, -17, -17, -14, -4, -11, 0, -7, 1, 7, 5, -5, 14, -3, -5, -8, 10, 1, 13, 3, 5, 4, -5, 12, 9, 6, -8, 3, 7, 5, -6, 2, -6, -14, -9, -7, 2, 4, -12, -2, 7, -2, -9, -5, -9, -7, -10, -1, -7, -18, -6, -3, 8, -7, 0, -3, 8, 0, 0, 5, 11, 5, 2, 7, 8, -2, -11, 9, 3, 1, -4, -6, -6, -3, -5, -20, -6, -16, -8, 2, -6, -13, -2, 6, -4, -8, -13, -9, -5, -15, 0, 2, -5, -4, 4, -2, 4, 2, -2, 1, 7, 4, 1, 1, 7, 10, 1, 10, -2, -3, 4, 8, -3, 1, -9, 0, -12, -9, 1, -15, -3, -7, -13, -10, -18, -7, -5, -8, -13, -3, 5, 4, -7, -11, -8, -6, 0, -2, 2, 2, -4, -1, 2, 8, -1, 3, 4, -2, 10, -8, 4, 4, 3, -1, 4, 7, 3, 0, -1, -9, -16, 1, -1, -3, -11, -17, -15, -12, -19, -5, -5, -12, -5, -7, -8, -10, -3, 8, -3, 2, -9, 13, 6, 3, 3, 16, 11, -12, 6, 9, -1, -7, -9, 1, -3, -10, -8, -7, -2, -6, 3, -1, -1, -11, 1, -9, -7, -6, -4, -10, -9, -7, -11, -8, -9, -6, -1, -1, 0, -9, 4, -1, 6, 5, 12, 10, 11, 11, 23, 7, 16, 8, 13, 3, -3, 8, 1, 9, 5, -5, 1, -7, -5, 2, -9, -9, -16, -14, 2, -15, -17, -5, 2, 7, -4, 4, 2, -9, -6, 9, 8, -8, 1, 11, -2, -9, 9, 5, 3, 3, 13, 22, 10, 5, 6, 10, 3, 1, 3, 20, 2, 4, -10, 2, 0, 0, -11, -9, -4, -16, -13, -14, -4, -11, -7, -6, -9, -9, 0, 14, -7, 6]
3795F%nkJ0LrMmOoPK%qOkoNKj6JJ1j2KKJ1k0RKLrpJ0j3kJ3LQpkJ4j1Nj%jKNJ%
3845A0mKQkj3MMmrKRlj0OnPj9J4jQj1J8j0j3RmKmmJ0MkjNJ1j5J0lMKmJmOnPjj6
3893dJ6%rnnP%jnPj6J5pjLJMpnPMnnlJ8klKNkoJPjJ5j7%QnM%j3J1JNolmOpj1j
3945a2J1KqJQKj6MKNqRLj4PRpjRlRlJ%Qj0lJ5mmmqPlKMo%okLkOj6J8j0rOQj3R
3996dOj8PQm%LkJ8j5J1lNkmNMOj6JPploOJrK0j5pRj7J2%JpLKnoOPj0KKnOPlRn
4047ALJj1J1OklJkOjKmj2J7mm%nMlj0%PJ2j3rkOMkNNo%kRRj2PppOJ1JKlKjj6J3
4098A0NoKqJ4rj0NjLkLkrLnJ0n%oNnj1NRPpoK4nqPpN%LKoNJ6poklQj3J0rLJlK
4150FqNj2MRqlLmKkMn%KjKK0lj0J0j0J0mPj4PMj0LJ7pOoRk6JJ4pjJl%o%mKJoN
$$ y = [6, 6, 1, -1, 9, 12, 3, 7, 3, 9, 3, 10, 12, 12, 4, 10, 8, 2, 7, 9, -7, -6, 5, -7, -5, -3, 8, -12, -3, -1, 2, -7, -14, -4, -17, -19, -6, -3, 5, -2, -4, 10, -1, 4, 3, 3, 2, 4, 9, 10, 10, 6, 8, 16, 14, 1, 5, 9, 5, -4, -2, 7, 4, -6, 0, -5, 2, -17, -3, -4, 4, -7, 11, 1, -12, -3, -7, -5, -9, -13, -3, 1, -1, -2, 3, 14, -1, 9, 6, 10, 12, 8, 9, 5, 11, 6, 13, 12, -4, 12, 12, 3, -2, -7, 0, 0, -1, -6, 1, -15, 0, -7, -8, -5, -4, 0, -7, -12, -5, -1, -6, -11, -14, 4, 2, -1, 1, 6, 4, -2, -1, 6, 5, 20, 3, 3, 11, 6, 10, 10, -3, 8, 9, 14, 8, 5, 1, 7, 0, -11, -12, -1, 1, -7, -6, 2, 4, -12, -8, -6, -1, -9, 0, 3, -11, -4, 5, -2, -3, 6, 3, 12, 9, 10, 10, 18, 8, 5, 20, 16, 12, 8, 0, 7, 4, 6, 10, 4, 4, -2, -4, -1, -3, 3, -13, 5, -5, -14, -8, 0, -13, -4, 2, -16, -9, -1, -5, -5, -2, -4, 14, -1, 10, 7, 12, 10, 6, 11, 15, 21, 5, 6, 13, 6, 3, -3, 3, 4, -5, 15, 0, -7, 2, -15, -3, -3, -2, -9, -6, -4, -9, -15, -9, -2, -12, -10, -8, -13, -7, 0, -3, 6, 1, 4, 5, -6, 5, 11, 9, 6, 7, 5, 11, 10, 12, 8, -4, 13, 9, 5, 5, 0, 4, 1, -9, -9, -2, 10, -3, -12, -14, -8, -4, -6, -1, 4, -2, -2, -4, 5, 14, 2, 9, 2, -5, 1, 12, 13, 15, 12, 14, 13, -3, 10, 15, 9, 11, 3, 17, 8, -2, 3, 2, 5, 3, 6, 4, -5, -2, -7, 3, -2, -2, -8, -3, -8, -19, -14, -5, 2, -5, -11, 13, 8, 0, 7, 0, 5, 5, 8, 10, 4, 9, 25, 18, 12, 10, 7, 15, 2, 12, 3, 6, 7, 4, 6, -2, 3, -9, -5, 4, -4, -7, -4, -8, -6, -8, -4, -9, -9, -7, -8, -6, 14, 11, 1, 11, 1, 11, 7, 14, 0, 7, 11, 1, 4, 21, 14, 20, 14, 23, -3, -2, 12, 5, 4, 5, 2, 2, -4, -4, -8, -6, -5, -11, -6]
4200fPkOj1oPRkNpPN%Jj0RjllJ1j4QJ2j7J1njJ2qJj1nJ0nj0rJ7lk%Kj0J2kPj3
4246gM%kQj1J0N%mJ1oJj3NjJ8j1OoknOK%jNj1qJ1Jj1%rJ4jj0mNLnNMLj4NRj2L
4294a0J5lKlNMQqJ3Kk5%RkLnpNlmKkkJ2jj3QkoJ2mLj0J%Rj4K0rj3J6lMj3ONKM
4342HLmKOonkJ3kj4LPj5J8qj0RoJjj5J1KmOmnJ5qPqlOKkJ6j1%jlJ1pOLOj8LMk
4391DPmkMJmoJJj0JPj4RPrnjJ2j2LOLL%j3RNPoN%JkqJ5njKrRJopQkkPqNj2rJ2
4444b%JJj2qJ7onOkLj1J2OJqJ0%%pMOOq%PmNlMk0J7j0Joj%KjoRmMmpjJ2rpMLJ
4496a0Qj7ONJOmOJM%%mMKMj4J4qnMOpQj4NMj4%LJ%%lRlomMLoMK%JjNK%NJlkkO
4551GRj5NpJ6lqKjJLl%o%QqmmRmqlLQn%rLLJ1j1J5jkoNO%J0j5JJ3j6J1pqPOkP
$$ y = [-6, 1, -1, 5, -6, -12, -5, 4, 2, 7, 0, 7, 12, 12, 13, 3, 12, 11, 8, 5, 16, 2, 10, 22, 5, 16, 11, 10, 22, 14, 15, 4, -1, 9, 4, -6, -15, 2, -1, -3, -3, -1, -11, 1, -1, 6, -7, -3, -3, -5, 3, -8, 2, 7, 7, 3, 14, 8, 9, -4, 1, 0, 18, 7, 13, 7, 5, 0, 6, 8, 8, 7, 12, 1, -7, 4, 5, -6, -6, -15, -1, -2, -12, -16, -11, -8, -13, -8, -4, -1, -15, -10, -1, -13, -10, 5, 2, 4, 1, 6, 10, 18, 10, 23, 25, 0, 0, 9, 7, 10, 5, -2, 3, 0, -4, -2, -4, -6, 6, 5, -8, 0, -2, -8, 4, 0, 3, -7, -6, -6, 3, -11, 9, 0, -13, 3, 0, 4, -9, -3, 2, 4, 8, 11, 7, 9, 15, 9, 4, 2, 15, 13, -1, 2, 9, -6, 12, 4, -6, 3, -3, -2, -3, -18, -7, -5, -9, -3, -7, -12, 3, -5, 2, -6, -9, -3, -1, -3, 13, 2, 2, 1, -2, 9, 2, 8, 11, 17, -1, 2, 6, 4, 11, 7, 5, 9, 10, 6, 0, 1, 2, -8, -7, 0, -14, -5, 2, -7, -12, -13, -1, -13, -10, -4, -1, 2, 2, -11, -2, 3, 10, 4, 9, 9, 10, 8, 0, 15, 10, 9, 11, 2, 11, 12, 6, -1, 7, 5, 3, 10, 2, 7, -5, -14, -2, -2, -1, 0, -12, -20, -3, -9, -14, -8, -10, -7, -18, -6, 0, 1, -7, 3, 3, 3, -4, 0, 6, 12, 4, 4, 11, 7, 12, 9, 13, -7, 10, 0, 1, -5, -6, -6, -4, -5, -11, -2, -6, -2, -6, -13, -14, -2, -11, -18, -14, -11, -10, -2, -19, -13, -8, -7, -1, -5, 1, 2, 6, 6, 6, 2, 6, 8, 12, -2, 12, 4, -1, 3, 9, 2, 10, -4, 1, 5, -9, -9, -6, -5, -5, -5, -8, 1, -2, -8, -12, -8, -5, -11, -7, -5, -5, -4, -5, 0, 2, 2, 7, 8, 5, 3, 1, 7, 16, 1, 6, -1, 15, 12, 4, 6, 5, 6, 9, 6, 6, 0, 0, 8, 0, -4, -8, 1, -3, -11, -14, -11, -3, -8, -8, -17, -14, -11, 0, -11, 4, 3, 1, -5, 0, 6, 6, 16, 1, 2, 15, -1, 10, 3, -5, 2, 8, 6, 13]
4602A3qKj0%LqJ1j0pJQPpMpJLj1MLLmmJ1%Kj6J1RkLOmNjqJMnLoKLoQpoJ0kj0R
4653Aj6J0lrNJ7j6NoKJ0%kQrkOOJ1j4Qj0mNMPkpPJnlJ1j1J3j1%oj1NlQj0jmJ3
4699b%j3J6NqLjKj6RRnQ%pORrjOo%oJ1nLnJ%mLoJ1rLnkmoMJJ0j3rJ1PrPmJ2qM
4751bLloNNNj0J0No%J2Kqj7J5Llj0MqOLqOknQkmJj7J5rJ2oLRjpj%nMPOnRlJkL
4803A2oNj0J2m%Nj9MKkmJ2j5mORj1MPrj1Rj1OJ0Rj1lJQJlJ7j3mJ5pjjnJ6j5Rq
4848BJ1Lmm%m%kOj4Q%j2PqNMj0rOQJrJ1%KJ2k0JJ1%M%kkPMknmOjnJ%J1mj2qRK
4899Aj0LL%mLm%%KqOPj0NojJ0PLj0RLJj4QPj0MLmj%Oj2J1qKPpqkKjkNM%kqN%%
4952eL%kJ4j6Rj2NPmJ3qPrQrJ2Oj2mM%nLjMjjj4lR%lqoJ3j1J0l%QrJ4j5QlNKo
$$ y = [13, 5, 7, -3, -3, 0, -8, 3, -7, -14, -13, -5, 2, -5, -1, -8, -7, -4, -15, -11, -8, -5, -9, -13, -2, -2, 0, -16, -5, 4, 2, 5, 11, 7, 12, 11, 3, 4, 8, 3, 6, 0, 2, 5, -1, 7, 0, -6, 4, 2, -8, 1, -15, -5, -8, -17, -12, 5, -11, -6, -12, -10, 0, 0, -2, 6, -3, -5, 1, 7, 18, 4, 12, 2, -2, 3, 7, 14, 12, 5, 12, 13, 8, 5, 16, 5, 18, 7, 7, 1, -10, -5, -8, 0, -10, -11, -15, -2, -2, -15, 1, 6, -2, 1, 0, 2, -14, -5, 4, -1, 7, 7, 0, 6, 15, 6, 5, 11, 5, 5, -1, 10, 5, 8, 3, 4, 4, 0, 3, -3, 8, -1, 2, -3, -5, -9, -15, -11, -10, 0, -13, -22, -11, -4, -13, -6, -10, 2, -6, -2, 1, -2, -8, -3, 2, 7, -3, 7, 12, 6, 6, 18, 20, 12, -5, 10, 13, 10, 0, 4, -4, 2, 5, -3, 3, 1, -4, 4, 2, -2, -1, -18, -3, -12, 0, -6, -3, 6, 5, -2, -3, -3, -8, -4, 3, 9, 4, 13, 10, 11, 9, 12, 6, 11, 1, 13, 9, 9, 14, -5, -1, 1, -1, -5, 7, -8, -12, -6, 3, -8, -4, 3, -6, -17, -8, -19, -13, -3, 6, -5, -8, -7, 1, 2, -1, 16, 3, -1, 14, 7, 6, 5, 0, 16, 1, 10, 2, 13, 16, 12, 8, 8, 4, 4, 2, 8, -6, 2, 2, -10, -3, -11, -6, -2, -12, -21, -15, -7, -6, -15, -4, -4, -2, 10, -10, -9, 2, 2, 6, 6, 4, 2, 9, 13, 11, 6, 2, 8, 7, 2, 3, 3, 14, 10, -2, -10, -1, 1, -9, -6, -3, -3, -7, -4, -8, -8, -8, -6, -14, -8, -1, -11, -6, -12, -13, -3, 4, 7, -3, 6, 9, 10, -4, 4, 11, 1, 5, 8, 4, 3, 3, 9, -3, 8, 0, 2, 9, 2, -6, -8, -6, -7, -9, -4, 0, 0, -2, -10, -5, -5, -5, -2, -2, -4, 10, -6, 3, -9, -4, 3, -1, 12, 4, 11, 2, 10, 1, 13, 19, 7, 3, 7, 7, 2, 5, 4, 8, 7, 6, -8, -11, -2, -2, -5, -13, -19, -6, -17, -7, -10, -10, -2, -11, 3, -12, -4, -7, -2, 0, -6]
5001fkNjRkJ2j6NNJnJ2j5J1krJ3LkjkrPj3jmJ0rkkJJoJ7lqQlJ4qpkMJ%PMjNKj0
5052FJ5j0nQomJKqRoJkLoPLj6Mj6RkNJkJ1jj2J6pJOmkNmJ4klJLp%MJRnJrpJ3k
5104A1njkLLnLj0Qp%MqJ1m%nmPjQ%Pj4J5qnPjJ4pJJ0lrQm%lqJQj3j%P%q%j3PM
5156bj3jOQLpJLpPKKjOKnMPj1nJ7jrRPkj3Qkj2kPLo%nqRQj0lJnNpLJ1j1mMQkQ
5209EnLpJ1jjJ0j3Rj0J5qPLKmj5RmjLkLpOmj5J3j2JJ6j4%%K%LjKkmJ2qJ4j1JR
5256A0lj%OmNmOMklj5Rj0NplQoJ0j2jKjJ1j0jLJ1j1J0rpjQoROKj1J0Pj7ORppK3
5304B1k3RJ0oj1J7oqKJoLj8QNj2MlLJ3ojMMpJKMQqJjP%MlrRpRMLnqmQj0J4j1%
5354ELJpj2J9j2jJj0QMj2J1j0OLNjpRKlmjjORlpJ3Oj1k%lPpOLj8J2PJj4jPlj0
$$ y = [-6, -8, -3, -4, 5, 3, 15, -1, 4, 9, 10, 5, 17, 2, 13, 11, 2, 15, 18, 16, 15, 13, 4, 11, -2, -3, -7, 3, -6, -8, -10, -9, -8, -14, 3, 0, -8, 0, -3, 11, 3, -4, -6, -2, -1, -1, 6, 10, 9, 14, 16, 6, 21, 11, 6, 14, 8, 4, 5, 7, -1, 8, 2, 3, 1, 4, -2, 5, 8, -8, -4, -20, -11, -13, -8, -7, -9, 2, 1, -11, 5, -2, -1, 5, 1, -1, 4, 0, 14, 12, 9, 10, 13, 6, 6, 10, 11, 20, 15, 16, 7, 0, 13, 11, 6, 5, 3, 6, 9, 4, 7, -3, 5, -2, -2, 2, -6, 5, 1, 1, -4, -8, -1, -2, 6, 6, 13, -1, 14, 6, 1, 8, 7, 21, 14, 15, 25, 22, 13, 21, 17, 17, 14, 6, 7, 15, 2, 1, 1, 8, 8, 0, 0, -13, -6, -2, -15, -16, -10, -2, 1, -6, -5, -2, -9, -2, 0, 2, 1, 7, 9, 4, 8, 15, 4, -1, 16, 15, 6, 15, 22, 20, 7, 15, 13, 1, -1, 6, 9, 3, 3, -2, -10, -1, 7, -3, -6, -5, -10, -5, -12, -9, 2, -9, -13, -9, -1, -3, 5, 0, 3, -4, 7, 6, 5, 15, 2, 11, 1, 16, 8, 15, 18, 20, 16, 1, 10, 6, 5, 8, 6, 9, 2, 8, 4, -11, 2, -10, -9, 7, -7, -7, -7, -5, -5, -2, -3, -1, -3, -7, 5, -3, 11, 0, 1, 10, 7, 6, 6, 12, 8, 13, 9, 15, 19, 17, 14, -1, 8, -2, 3, -4, -7, 1, -5, 5, -7, -8, -6, -7, 4, -6, -7, -4, 7, -4, 6, -3, -10, -11, -3, -9, 0, 6, 8, -3, 7, 14, -3, 3, 12, 5, -2, 21, -2, 7, 17, 11, 0, 17, 11, 3, 5, 6, 0, 3, -15, -7, -2, -14, -10, -13, -10, 3, -3, -4, 0, 4, -3, -2, 0, 4, 12, 4, 5, 4, 11, 11, 15, 12, 3, 12, 5, 14, 18, 21, 16, 8, 4, 12, 2, 16, 5, 5, 8, 9, 2, -10, 9, -3, -4, -3, -13, -5, -1, -13, -2, -12, -6, -3, 2, 1, -6, 3, 5, 2, -2, -3, -4, 2, 11, 8, 1, 14, 20, 9, 7, 7, 4, 11, 4, 10, 13, -5, 7, 14, 15, 1, 0, 7, 4, -6]
5402fOmpO%kJpNKJ1rkJMMpJ2jNnLj1J3JOMj2lljQNj8LJ2k3J0LrMnJjlOnlNJ0j8
5453a4J7q%J0qJ1lk%jOJ2j5Mj3J6mPj3J1%Kj5%OLnlNnmjj0J6mqKJkmKKkJ7Kmk
5500Bj2K6j6qP%J5nlLPq%lKjRrlJj2J0Mj1NJnJOp%klLpNp%NmMJ5j1P%mJ2qOJ2
5550A9j2KLkKqOJplnRpJ0j6jNj1J4onOqQMkmjPjoMPmJ0nRkj0QKLjnkPJj2OjJ0
5601A6j5J1j8J0moOr%kKKqMMM%l%jpJ1RnJOmLk%%lJ9j5J1rLpJJ0j1J2p%lRqj4
5649gOQqLj2MkoJ0NmLjnP%mkKJ1JKnJ0lKjmLqM%JrON%oNj5J1nlNjj5J0j1LMLk
5701e%J0qlJjNNkNlNJnQjRqNj8LJRJj0%kNj%l%nnOJkj2OMKpJ0rJ7qnJNkKMoMJ3
5756A7qnJJ0%NrNLj4KRmLqp%%lqNKljKpJ1rJ1kkrNJ0rNLMLpLRj8RJ1rRnj6J1K
$$ y = [-6, 0, -4, -11, -5, -5, -7, -6, -13, -8, -6, 5, -4, -6, -5, -1, 3, -4, 8, 7, 12, 7, 10, -1, 12, 13, 19, 23, 11, 8, 5, 4, 12, 17, -1, 2, 14, -9, 1, 4, -5, -1, -6, -5, -6, -9, -3, -8, -11, -6, 4, -14, 3, -5, -5, 5, -3, 8, 5, 3, 3, 2, 8, 20, 5, 9, -4, 12, 8, 15, 2, 13, 13, 15, 0, 0, 6, 9, 4, 1, 6, 1, -3, -4, -14, 2, -2, -10, -8, -7, -9, -13, -11, -9, -11, 6, 8, 4, 2, -10, 16, 0, -8, -1, -1, 14, 9, 6, 9, 16, 8, 8, 5, 7, 6, 15, 6, 3, 4, -8, 2, 6, -5, 0, 1, -4, -3, 3, -4, -4, -6, -9, -6, -13, -8, -15, -15, -10, -14, -10, 5, -6, 1, 1, -3, 9, 1, 7, 19, 7, 9, 12, 10, 12, 4, 10, 11, 4, 1, -4, 5, -2, 8, -8, -9, -4, -15, -1, -7, -12, -6, -14, -6, -2, -4, -8, -9, -2, -3, -9, -5, 2, -2, 8, 3, 12, 10, 0, 8, 10, 13, 12, 7, 5, 12, 13, 1, 7, 6, 16, 1, 12, -6, 4, 0, -6, 0, -9, -9, -11, -9, -7, -15, -11, -7, -3, -3, -6, -6, -7, -14, -3, 6, 1, 2, 8, 4, 7, 5, 5, 5, 2, 21, 6, 17, 8, 11, 4, 5, 15, 4, 16, 9, 9, 6, 15, 7, -7, -1, 7, -1, 2, -10, -6, -8, -14, -4, 1, -3, 0, -1, -6, 1, 1, -3, -5, -3, 8, 9, 11, 6, 16, 13, 15, 14, 10, 13, 5, 9, 9, 10, 1, 7, 12, 12, 6, 11, -4, 7, 2, -1, 4, 3, -12, -2, -13, -10, -6, -3, -5, -5, 5, -3, -6, -5, -6, -1, 4, 2, 7, 4, 9, 10, 5, 13, 12, 21, 13, 18, 0, 3, 4, 13, 14, 4, 4, 2, 7, 6, 6, 3, 3, -2, -7, -1, 0, -2, -14, -8, -4, -2, -9, 1, -8, 9, 1, -4, -3, 2, 0, 2, 6, 0, 4, 17, 9, 4, 5, 15, 15, 20, 11, 16, 19, 5, 7, 16, 12, 15, 7, 0, 0, 0, -3, -11, -6, -4, -7, -8, -6, -13, -2, -11, 0, -2, -4, -13, -8, 2, -7, -2, 1, 5, 8, 1, 4, 13, -5, 4, 15, 6, 15, 10, -6, 5, 7]
5807Glk%NpKJ0j9J1mqKrNMqJ8j1Oj6J2%mnKJ2PrQmOkQjj1J1j0MOpRj2LJ2j3j0
5853eJjLrJ0Mj2LmOKmrJ0%Jj1QMNpJ1mlO%mJ2nJNJJJkMPj9Qj6J4pOqpjQj6RmQ
5904A%j7J4pMknJ3lj1J2%Rj4J4mJ1pNojOMrONj0Nj2J2lKopoRoRj0kJ4j1kkKoL
5951ikJ0mRqQo%LPJNrR%j6J0oRlLnO%pRj9J7j8kJ2lj0%J0qmJMmOn%JKjNQk1J4
6001aJ2jMj5LLJ5plRj2J1o%kkQmrNrljnoJ7Jo%ljpPLKOmjLkllR%j0K4mj6NNLj
6053HPk3LJ7pkMlj3K1j5lJrMJj%jMj6J5j2MNJ1pjNmOkJ1Jj3NLJjMkLkj3OPKmk
6102CkqKLlJ0j4Qj2N%j2J0j2jJ0RJJqpJ3lLkJ7j2oQNKnOnqJ1oOl%Pj5OnlRpRp
6151bOj7PqQqLlNR%jkkJ6k0oPJMJNoQjJ2Op%Mj7OmNkNj3qMOKj4JOLrNrLmLPNo
$$ y = [7, 4, 2, 2, 7, 0, 2, 12, -7, 4, 0, -8, -6, -15, -10, -6, -14, 4, -7, -1, -17, -5, -5, -9, -14, -12, 0, 7, -2, 6, 2, 8, 6, 14, 13, 2, 13, 3, 7, 13, 6, 15, 3, 6, 18, 5, -5, -4, -5, -2, -11, -1, 3, -9, -6, -10, -4, -2, -6, -15, -5, -5, -4, -15, -7, -3, 2, -5, 6, 2, -1, 5, 5, 1, 13, 8, 9, 14, 15, 16, 17, 15, 19, 26, 7, 15, -1, 13, 6, 12, 4, -3, -4, 4, -12, -3, -7, 1, 1, -16, -2, -9, -5, -7, -12, 1, -2, -13, -1, -1, 8, -6, 8, 4, 15, 8, 13, 7, 6, 12, 16, 7, 13, 18, 8, 13, 1, 13, 10, 12, 6, -1, -7, 2, -4, 5, -5, -7, 7, -4, -6, -8, -6, -12, -9, -11, -1, -5, 4, -4, 4, -2, -2, 1, 8, 9, 14, 5, 14, 14, -2, 8, 2, 11, 8, 11, 6, 12, 12, 5, 14, -5, 12, -6, -8, 4, 1, -9, -9, 1, -7, -11, -10, -6, -10, -4, -9, -9, -8, -6, -7, -2, 6, -15, -1, 11, 10, 14, -1, 2, 5, 20, 13, 10, 19, 7, 18, 12, 12, 10, 8, 16, 12, 3, 8, -1, -4, -5, -10, -16, 1, 2, -4, -4, -7, -8, -15, -8, -5, -3, 3, -1, -2, 1, -1, -4, -7, 2, 2, -8, 16, 12, -4, 1, 6, 9, 8, 15, -8, -5, 12, 5, 3, 7, 4, -9, 12, -3, -6, -5, -14, -10, -9, -10, -10, -11, -7, -23, -8, -20, -16, -11, 0, -7, -8, -3, -7, -1, -3, 8, 9, -4, 1, 4, 5, 4, 8, 6, 9, 7, -6, 0, 7, 9, 5, 3, 1, -7, -5, -2, -5, 5, -9, -1, -13, -8, -8, -20, -10, -22, -23, -13, -4, -3, -2, -10, -17, -4, -7, -4, -6, 11, -1, -7, 1, 6, 8, 3, 9, 4, -4, 7, 1, 7, 4, 4, 11, -4, 2, -3, -6, 3, -4, 5, -2, 4, -13, -6, -14, -6, -14, -11, -14, -9, 0, 0, -1, -3, -5, 11, -9, -15, -8, -7, -3, -2, 3, -3, 5, 4, 16, 22, 15, 15, 19, 2, 8, 4, 9, 7, 12, -1, -9, -5, 1, 3, -11, -10, -4, -1, -10, -5, -14, -11, -15, -12, -5, 0, -6]
6205fMJM%rM%JJ0ojLkONMrONqj0lKjpJ3qPrj0Rmj0J0j0J4oLNpjJ6j1J1olMOKj
6255GjjMoLjJ3qQroJ3j3Mj2%J0j0MJprJ6Kj2%Jj2OJJ5kj5J3mPJ%MLJJJpJ0pPo
6303HPqNmkRq%j3LQj4JRj3J2j0jOk%Jj%%%J1j4jQLNJkkLJ0r%jJPrRjkMoKqNj2
6355e%JRjj1kkKKMljJ0mnnPkM%J0nJLNmPpkJ2j3JPLlpmMpkjRj7PRqLj0J0rLMn
6408hJ3j3LMj4J6mLPj3K0mo%RlLKoMJknpQJ3j6j5J3KJmpkQokJ0lmoj1PJ8ppJ0
6455@qkKJ3pMJ6qMmQqNmOmmKLJj3NplmJ6rK%j2%J0nnJ5j6J4J2j4nnPLoNKj3K7
6503A6ojkKJ3jj1kJLKjjkj0MjJj1Oj1LoQJj2LRpJ0qmJ7nkkJ0Jj0NJnJ1j3J2Jp
6550aJ2komJ0nQkloqPNom%%qPJ%oQppJ0mMQpNnRJlJQlJnONj4J1Qj3KQonrmJ1N
$$ y = [-6, -2, -1, 3, 3, -6, -2, -2, -1, 9, 3, 2, 5, 3, 9, 14, 18, 9, 15, 20, 12, 2, -1, 1, 0, -7, 6, -2, 5, -4, -14, -5, -9, -19, -9, -19, -5, -11, -8, -3, -10, -11, 5, -6, 5, -1, -4, 0, 6, 8, 7, 6, 5, 9, 3, 6, 5, 18, 10, 18, 9, 3, 16, 3, 7, -5, -5, 5, -5, -1, 0, -7, -16, 0, 2, -10, -10, -9, -21, -15, -14, 1, -1, -16, -3, -7, 0, 1, 1, 5, 8, 9, 10, 11, 4, 14, 7, 14, 8, 15, 7, 12, 8, 6, 15, 7, 7, -6, -3, 5, -9, -8, 1, -12, 0, -10, -11, -5, -7, -7, -6, -7, -7, -7, -7, 4, -10, -11, -3, 0, 5, 6, 4, 2, 5, 15, 6, 6, 5, 6, 13, 4, 13, 12, 10, 14, 8, 10, 2, 7, -5, -5, -4, 5, 4, -7, -9, -11, -9, -7, -3, -6, -7, 3, -1, -6, -11, -4, -6, -2, -2, 8, 3, 4, 7, 12, 8, 15, 8, 6, 18, 5, 6, 13, 16, 13, 6, 2, 6, -1, -3, -4, 5, -12, -5, 4, -4, -1, -11, -1, -10, -7, -3, -8, 5, -8, -5, -1, -15, 1, -3, 0, 7, -6, 14, 10, 4, 4, 13, 10, 13, 15, 9, 13, 14, 12, 7, 0, 8, 21, 5, -10, 3, 5, 6, 2, -5, -7, 1, -5, -7, 3, 0, -4, -10, -21, -14, 4, -3, -10, 0, -8, -10, -8, 5, -2, 2, 18, 10, 14, 10, 18, 10, 15, 11, 17, 13, 9, 11, 14, 15, 2, 7, 0, -3, -7, 9, 0, 2, 2, -10, -10, 0, -5, -10, 5, -11, 3, 15, 1, -4, -9, -2, 1, -5, 0, 2, -11, 16, 10, 9, 7, 9, 22, 21, 10, 8, 9, 12, 14, 13, 12, 10, 0, 4, 3, 4, -7, -1, -12, -9, -15, -7, -6, -18, -15, -6, -13, -3, -11, -15, 2, -3, -5, -7, 3, 4, -6, -1, 0, -5, 6, -7, 5, 6, -1, 11, 9, 3, -1, 9, 4, 12, 10, 7, 1, -7, 0, 5, -1, -5, -5, -5, -13, -6, -5, -5, -11, -3, -10, -17, -7, -11, -7, 1, -6, -1, -6, 3, 4, 1, 2, 10, 7, 8, 3, 9, 14, 0, 11, 19, 6, 8, 16, 10, 5, -4, -8, 3, 8]
6604Hj0LplMj3ROoKj1RJJkKnNQj3J2PnjLkjJ0qJ5qljJ1j1Nj3LJ1nrolJ0Kj3%P
6652eLJJq%jJ0jrQj3LLlMJ5omkNPpKPK%llRqlLLj0KnJLJnnLKpLnJ1ljjj%rNMP
6708@oJ2JJj2RNJmKKnQj2PKj1QnLk%j2JmN%jQqR%j6OLpJ5oNJj2RPmJQpLJ1j1R
6759A7j1%nOOj1J%OoKjmNr%K%rQnjNlNMjmlQj2QNnjMqRQj%RrRj4jKOkMj4NlJn
6814clLoJ%jRj5KOLJqPJmJjM%lJ6Lj6J1mMMLlQj5jjLMmj2ROj5J1qMoKmOoRj3l
6866a4RnJ8joLJJ3j7OkJ1njkQj2QM%LnoJpJJ1j3Lj1jPkMolLj2J6rLjmrJ7pJ1O
6914Fj1RJrJ1nMLNqLJ8j5O%j4Rj2kLMj5LPjrRjqKPKrNj0mJ2lnMNOqkNLOrJ4j0
6964B%J4pJ1j9PNNpmjjKjqkqPJ3rkjNqNJj4%LPmnNJ7kkjj2ROkPLj4Qpj4J2NJn
$$ y = [8, -2, 1, -6, -9, -5, -18, -9, -3, -9, -7, -18, -9, -8, -7, -9, -7, -12, -7, 1, -12, 0, 7, 2, 1, 4, 2, 1, 11, 3, 18, 10, 7, 6, 17, 6, 11, -2, 1, 12, 7, -2, -8, -11, -1, 1, -12, -12, -5, -2, -1, 0, -8, -8, -9, 1, 0, -9, -1, -14, -11, -8, -11, -7, 8, 2, -2, -4, 1, 8, 1, 3, 10, 12, 12, 9, 6, 15, 7, 4, 7, 10, 0, 2, -3, -2, 1, 2, -3, -8, -5, -3, -10, -7, -12, -1, -4, -5, -6, -7, -7, -16, -11, -7, 0, -6, 6, 7, 8, -4, 5, 10, 11, 7, 9, 11, 6, 14, 2, 9, 11, 0, 8, 3, 6, 4, 4, -8, -7, -11, -6, -6, -7, 1, -7, 2, 2, -14, -8, -5, -12, 3, -3, 2, 3, -9, 0, 7, 3, 4, 12, 5, 8, 19, 8, 17, 6, 6, 1, 7, 13, 2, 3, 3, 9, 3, 5, 4, 0, 5, -4, -4, -2, -2, -11, -3, -8, -9, -4, -7, -2, 2, 1, -3, -6, 2, -10, -2, 3, -2, -3, 1, -7, 2, 10, 9, 9, 18, 9, 18, 4, 3, 5, 11, 9, 13, -1, 4, 1, 2, -3, -6, -3, -9, -8, -8, -9, 0, -15, -13, -7, -4, -3, -11, -4, -3, -7, -6, -7, -3, -3, -6, 10, 13, -3, 8, 4, 8, 12, 15, 12, 20, 5, 4, 3, 6, 10, 6, -6, 3, 9, -6, 5, -3, 1, -5, -3, -7, -1, -7, 2, -11, -14, -5, -10, 8, 7, 1, 4, 5, 18, 1, 7, 5, 16, 11, 10, 8, 16, 4, 12, 16, 16, 19, 14, 8, 9, 2, 3, 14, 1, 4, -7, -8, -1, -3, 1, -5, -8, -5, -17, -1, -10, -7, -8, -12, -21, -4, -11, 0, 6, -5, 4, 5, -4, 7, 2, 6, 9, 14, 6, 9, 27, 12, 18, 18, 4, 13, 1, -1, 2, 6, -9, -6, 1, 0, -9, 0, -1, -9, -7, 0, 2, -7, -2, -12, -16, -4, -7, -12, -8, -3, 3, -5, -7, -2, 1, 7, -2, 12, 2, 2, 16, 9, 20, 1, 8, 13, 18, 11, 7, 6, 5, 7, 6, -2, -4, -12, -5, 8, -1, -3, -4, 1, -7, -2, -1, -15, -15, -12, -5, -9, -14, -9, 8, 6, 4, 3, -9, 0, 6, 4, 11, 14, 0, 8, 1, -13, -1, 4, 5, 0]
7015@J4j2Qmjj0J1%j3%KjlKnPj4J1kOnLOj0KLKRlOpJ7llQj1p%Nj0OLj0J7j4kR
7062Gj6OqPqOOjqjmJ5kj0kRj0JO%QnRqJ7m%JNnJpMmLJJ1j1kmMj3KkQoMj3ROoj
7114eoJ5rpQnLlPkqPMJ0rJ7k0J2oJ1lmPpmK%LNr%mM%j2j3J5kKkj2J5j4J1LLoK0
7162A2j6MjMlpJ1Jj1J2Lj1J1KrMKmjLJnKPknj0RknjpKKJmpJ1pRJ%KnnJ7rmJ2K
7212FpKJ3rLj3OOMqjnjRnkKrJ3j0kJ3ql%mJ0qNJMj2NoK2orJ0j2NJ0Mj2lJ2K%j
7260A1NkMlklkpJ2rkNj3R%j0rJ7mlLknLmORj4%J3%opRMlKjKPqlRmkJ0lj1MPj2
7311ck%Nj0pJ3KpJolqJ8j3NLJMJR%NMqNmj1K1qLjNkKnKj1J0onNKmLj4OJ1j3kj
7361hMjJj5PKqRKLlkLMjOQLmRj7Mjj4J5N%mmLpLrLNj4J4qOk%kKKpK%qJ1Pj1JO
$$ y = [0, 14, 2, 10, 6, 5, -5, 6, 6, -7, -7, -5, -6, -9, -7, -12, -5, -19, -8, -10, -4, -9, -6, 0, -10, -8, -5, -3, 6, 3, 9, 2, 19, 16, 13, 21, 10, 3, 3, 8, -2, 4, 7, -3, 14, 0, -2, 7, -9, -3, -11, -4, -12, -6, 0, -1, -9, -10, -14, 1, -1, -11, -13, -4, -14, -13, -7, -7, 1, -4, 5, -3, 14, 10, 10, 11, 16, 11, 12, 5, 9, 5, 8, 9, 20, 9, 7, 3, 7, -6, -4, -6, 2, -4, 0, -13, -4, 2, -4, -5, -11, 4, -5, -12, -4, -9, -6, -9, -2, -4, -12, -5, -1, 9, 0, 17, -3, 9, 3, 14, 11, 7, 14, 7, 3, 5, 5, 8, 13, 4, 4, 0, 4, 4, -8, -21, -6, -8, -6, -8, -20, -5, -19, -8, -5, -2, -8, 12, -4, 0, -1, 3, 0, -7, 4, 5, -6, 6, 9, -2, 9, 11, 2, 6, 8, 4, 3, 6, 7, 2, 4, 11, 9, 4, -6, 3, 1, -4, -5, -12, -10, -8, -7, -11, -18, -7, -14, -5, -4, -4, -2, -7, -12, 5, -4, -8, 4, 6, -1, 1, 14, 5, 8, -5, 1, 7, 11, 3, 2, -3, -4, 5, 0, -2, 0, -9, 4, -6, -8, 5, -3, -6, -6, -10, 0, -8, -3, -2, 2, -10, -5, -11, 11, 5, -4, 6, -6, -1, 9, 13, 1, -2, 10, 12, 12, 11, 16, 14, 18, 15, 13, 10, 8, 1, 13, 4, 2, 7, -6, 3, 3, -7, -16, 1, -3, -6, -3, -5, -10, -7, -11, -5, 4, -10, -10, 3, 3, -3, -10, -1, 3, 0, 2, 1, 3, 10, 2, -1, 8, 4, 2, 12, 9, -2, 2, 9, -3, -5, -5, 0, -10, -17, -4, -2, -9, -8, -14, -17, -25, -7, -20, -15, -12, -11, -7, -6, 3, 3, 8, 12, 4, 9, 5, -6, 15, 7, 10, 9, 14, 12, 14, 9, 11, 0, 10, 4, -1, 4, 6, 2, 5, -9, -3, 8, -5, -7, -8, -4, -5, -4, -19, -12, -10, -18, -9, -7, -4, -7, -9, -6, -2, -3, 3, 11, 14, 10, 19, 2, 6, 5, -9, 6, 11, 11, 7, 3, 6, -1, 2, -7, -4, 1, -13, 1, -7, -1, -3, -3, -5, -3, -1, -8, -6, -6, -14, -3, 4, -7, -6, 0]
7414@k%jPnNk%J5Kj8J0NmnOrMm%r%nJOolJ2qpPoj1J6J2j5NJoMPMj5OOOqJ1nQl
7465InkkJ0ljlNLnnMJj1OqNj2J1j0JJkJ6j7mJJ3nJ0nKj3QJ9k0ONLKmNJJj4J5%
7512A2j7J5j4QkLOj1JjklONj2lKMkLJj2J0pOkKjNlMRJKJnNqJ5mmOj6J6j2Lj4L
7560aQrJnMkKklqPlJMRok%PnNj2NJ4JkoMPJPj2PNkkPj1kj1MMqOoj2KqJ7%jnpJ3
7614arJlJ0qQpJ3OlOmqLjN%LJmMNj4LPlj0oJ9qKpJmjOj0LnlLLkKmNnOoOOrlJ7
7668FnJ5j1j3K3j4kQPrJ1j0mNlqjmJ4j0J0j3OKonJnKRqnkJ5%KKOj2KJ1qLLNLo
7715G%MmMKllLmKj0NPj5%jkjj2QKKQknkJ0JqoJ0%p%RJNNkNj2Jj%mJ6j1LJ%ppN
7768cNj3OnkqMPj1J6j8RKrJ7qj0J7j3J3mjQ%NMj4J6j2J6r%Pj0jOjJnj1J4mkQq
$$ y = [0, -2, -2, -3, 4, -1, 4, 2, 2, 17, 19, 1, 11, 16, 12, 7, 13, 4, 8, 4, 4, -5, -5, -10, -9, -3, -9, -12, 0, -8, -15, -8, -14, -25, -9, 3, -12, -7, -6, -12, -8, -1, 3, -12, -6, 0, 6, -2, 9, 4, 12, 9, 4, 2, 0, 10, 7, 6, 3, 8, 11, 6, 1, 5, 6, -5, 1, -7, -2, -14, -3, -13, -12, -11, -13, 3, -14, -18, -17, -4, -9, 1, -4, -2, -15, -7, 12, -8, -2, 3, 6, 8, 4, 9, 10, 11, -3, 12, 12, -5, 10, -4, 4, 2, 5, 11, 0, 1, 0, -2, -5, 1, 6, -6, -9, -7, -3, -5, -2, -1, -13, -3, -10, -4, -6, -4, -5, 0, -3, 1, 10, 11, 13, 14, 9, 14, 6, 21, 17, 13, 19, 3, 19, 7, 10, -4, -1, 7, -2, -1, -6, -2, -4, -2, -4, -7, -15, -8, -11, -10, -6, 3, -3, -5, -5, 2, -3, 2, -10, -5, 9, 10, 8, 2, 6, 13, 14, 21, 9, 16, 21, 19, 17, 24, 13, 11, 0, 4, 8, 0, 6, 0, -12, -10, -18, -1, -1, -2, -7, -14, -1, -10, -9, -12, -2, -10, -2, -9, 4, 10, 7, 13, 9, 1, 4, 3, 8, 8, 11, 12, 8, 12, 17, 3, 6, 13, 10, 0, -6, 13, 5, 7, 0, 1, -3, -4, 2, -8, -5, -10, -13, -10, -7, -9, -7, -11, -6, -11, -5, -11, -5, 1, -8, -11, 6, 1, 16, 5, -8, 15, 1, -1, 7, 14, 5, 16, 6, 2, 7, 4, -4, -5, -9, 5, -5, 5, -8, -2, 0, -6, -11, -10, -15, -13, -4, -12, -17, -19, -4, -4, -2, 0, 6, -6, -4, 7, -1, 2, 5, 10, 13, 7, 7, 11, 7, 11, 13, 10, 7, 10, 6, 8, -2, 3, 10, -5, -5, -6, -8, -9, -21, -13, -11, -9, -1, -3, -8, -10, 0, 1, -7, -13, -3, -3, -10, -10, -1, 0, 5, 10, 8, 13, 1, 2, 1, 1, -3, 13, 2, 5, 6, 6, -1, -8, -3, 2, -11, -5, -10, -12, -20, -16, -9, -20, -4, -22, -13, -11, -20, -3, -11, -21, -4, -17, -4, -8, -9, -1, -1, 4, 8, -6, 10, -2, 14, 5, 5, 12, 2, 1, 7, 6, 7, 2, -9, 5, 1, -1, 7, -1]
7813akjjnnQn%qJ2NrlK%%J9k2OPNkklLLPKl%Qlj3LjJJKpJj0KMJ7j8lpQjnJ4mk
7866frjNPlkLJMjL%lORnOLpoJ3qkrJ1qj2NOjj2MjJNqqNJ5Pj2KlkPQnOKj6QJrQ
7920BLQ%n%JLL%j0Nj4J0Lj0Okj3QrLOLj8LKljOpjQMnJ1mKQmoNO%ljKPjnkPrmM
7974BKj5J8ollOoO%korMJ4j0OjoQj3QRj0J5mJ1j2nRPrKOJrLPpLnjOqPprmjJ1m
8025djo%NrOkNn%J1qRkmOPj1lJ6mjjPJ2k3J2knlJ3ojNj4LL%j1Qj8Oj1JJ4LlL%
8074ckpJ4pLOmoJ5nmROJj5J3j0LJ0j3%Oj1%PQj5LOj1Lmj0MMKj0%PjnJ2qNJrJ9
8121Gj0Lj0PJ6j2jOmJ1m%JoNj8QjjRj6Qj2MLkmQj4J0Qj4nONJj2LjJ0J1j5lJ0K
8166clJ0oJ1lRmlPpNpqJ2j1RrjJlkkoRl
$$ y = [-1, -3, -4, -5, -10, -15, -7, -12, -12, -20, -8, -3, -12, -15, -13, -13, -13, 6, -16, -10, -3, 2, 0, -2, -5, -2, 1, 8, 10, 7, 7, 15, 12, -1, 2, 1, 2, 3, 5, -2, -1, -11, -9, -5, 12, -6, -9, -16, -8, -9, -14, 0, -4, -6, -15, -16, -11, -4, -7, -9, -6, -5, -1, -2, 1, 1, -2, 4, 13, 8, 14, 17, 10, 4, 17, 9, 7, -2, 9, 1, -11, -6, 0, -1, -13, -9, -10, -9, -4, -12, -20, -15, 0, 7, -5, -3, -6, -8, -1, 7, 2, 8, 10, -6, 2, 3, -6, 2, 5, 13, 13, 8, 8, 9, 12, 15, 15, 5, 10, -4, 6, 9, -1, 5, 3, -10, -2, -11, -8, -2, 1, -17, -14, -12, -15, -16, -10, -17, -18, -10, -6, -11, 0, -4, -2, 6, 2, -4, 1, 7, 7, 4, 3, 5, 12, 11, 6, 4, 11, 2, -2, 2, 4, -11, 7, 1, -2, -5, 1, -5, 1, 1, -1, -7, -16, -12, 2, -8, -2, -3, -9, -1, -14, -6, 3, -7, 8, 4, 15, 3, -2, 7, 14, 5, 7, 13, 14, 5, 8, 15, 8, 11, 6, 5, 11, 3, 10, 3, -6, -10, -11, 0, -4, -5, -11, -11, -6, -15, -9, -11, -6, -11, -11, 0, -8, 1, -1, -5, 1, 8, -3, -6, 10, 6, 5, 4, 11, 23, 0, 12, 10, 5, 2, 15, 9, 8, 13, -1, 2, 5, 5, -6, 2, -16, -10, -21, -20, -6, -3, -6, -3, -3, -5, -12, 2, -5, -2, 4, 0, -6, 9, 4, 0, 9, 15, 16, 1, 14, 4, 7, 17, 4, 4, 10, -1, -1, 6, 14, -1, 2, 8, -3, 0, -4, -14, -10, -6, -4, -14, -14, -7, -8, -13, -1, -9, -4, -3, -12, 7, -3, 0, -10, -3, 13, 1, 0, 6, 2, 13, 9, 9, 10, 4, 9, -9, -1, -2, -3, 6, -10, -2, -14, -10, -7, -9, -13, -5, -19, -9, -1, -15, -20, -14, -9, -8, -20, -17, -18, -8, 3, -12, -15, -5, -3, -6, 4, -2, 9, 6, 15, 11, 8, 15, 8, 13, 6, -2, 10, -1, 8, -1, -2, -1, -4, -6, -8, -14, -5, -8]
8191h
$$ Imaginary data points
##PAGE= N=2
##DATA TABLE= (X++(I..I)), XYDATA
0@%%%%%%%%%%JrJ6j6J6k4L2l3M1n6P0p9R0j13J36j53J77k08K41k74L14l62M11
33B18m67N30n96O70p50Q38r39J048j164J292j433J587j755J935k132K352k591
50a357K854l147L468l824M222m669N178n758O426p211Q146r279J0688j2499J4918
65H156j8337K3576l2682N2891j75378R7491L57942k61739k18518J47569J30215
76A11186k24725j8980L09481N5543l90175j15362L45031J62410k73214j03653
86a42458K19343K2796k54002L4191L03931j6356l26163r911K87542O594k49853
97a24346M3127K45108q0658k74818Q0486K82249n4954k48446O0086J98069j08703
108A7200j86967J65484K22578j74308k60845J32487K45406r1019j77576J06161
$$ y = [0, 0, 0, 0, 0, 0, 0, 0, 0, 0, 0, 1, -8, 8, -8, 8, -16, 16, -17, 24, -32, 38, -41, 49, -64, 72, -81, 96, -112, 129, -145, 169, -193, 218, -249, 281, -315, 355, -395, 443, -496, 552, -612, 680, -753, 834, -921, 1014, -1118, 1234, -1357, 1497, -1650, 1818, -2006, 2216, -2453, 2725, -3033, 3393, -3818, 4328, -4951, 5737, -6762, 8156, -10181, 13395, -19287, 33604, -141774, -44283, 313659, 51920, -166598, -19029, 111186, -113539, -132519, 176962, 232505, -157670, -273032, 71999, 234409, -38805, -142458, 76885, 99681, -154321, -120130, 183801, 167445, -158718, -168629, 118913, 125507, -124346, -81219, 163889, 83231, -191587, -111101, 171148, 116194, -132252, -72166, 125903, 17200, -169767, -4283, 218295, 43987, -216858, -84371, 161035, 70016, -107560, -1399]
118a399J13637j73546j09356K33662J57896k31838j98463J76824J78520j29633
128A6304j08344J40047M7404j96484m1890K42334P9120k36254j06009J92079Q6691
139A14998j58682l6265J66144j359j97821K591K14885J4317k00698j5418J75386
150G8078r137j67901L7122J81403m4132j91631L3504J78308l1585j50631N4904
161c1698J36986q8878j50831J03425J72955q7685j71945O4451J39213o6208j00472
172h0687R9705Q8788j37342j09360J46032J33689j21949j29423R4006R3871r3286
183a5956n5666J21508M4072j51128n9605J55344P6204j34880o9967J14133M2914
194F6973j13769j7404J30371J0511j43671j7237J40379J9306j27195p240J20349
$$ y = [-1399, 112238, -61308, -170664, 62998, 220894, -10944, -209407, -32583, 145937, 16304, -92040, 48007, 95411, -101073, -142963, 99371, 178491, -57763, -163772, 28307, 114998, -43684, -79949, 86195, 84836, -112985, -110394, 104491, 118808, -81890, -97308, 78078, 68941, -98960, -61838, 119565, 75433, -116198, -82694, 95614, 64029, -86602, -31698, 105288, 16410, -134421, -30996, 141959, 54274, -117671, -53220, 85993, 19785, -80687, 19018, 107806, -29536, -138896, 7136, 140825, 18876, -110547, -16541, 77330, -15956, -71622, 49886, 93958, -57170, -116775, 38569, 114773, -20107, -90074, 24059, 66973, -46796, -64200, 66171, 76682, -66989, -84226, 56153, 75459, -51736, -58976, 61373]
205F1373j0404j25710J9312J32812j7144j28921J6057J15012k7352j05026M7096
216b2895J09035n9774j20603N6274J22926m5058j07744M3893Q5275o0390p4021
227g3082Q3189Q1060r3472r4285Q4749R5076o9529p7537O6049N4220p9617m2573
239f5752R8047M7163j05074n6319R7048N5199q5099m1079Q2309K4422r0404j6420
251e5959R9690J7480j00914j8688R4973J2819r0127k135R1615n692r5787P326
263d5399R5377p684q8857J3641Q2433k5084q2699L4596Q8244l5785r0637L1205
275c0649Q3695l0030p0893L8307O2121n1910o3344O0654O9972n8762p1728N1067
287a1500O3153m7834m9199N4217L9807o5399l9682P1983M4133o9850m4488O3535
$$ y = [61373, 50969, -74741, -55429, 77383, 60239, -68682, -52625, 62387, 35035, -69991, -22895, 86140, 26366, -94237, -37963, 84963, 39905, -67839, -23946, 61329, 939, -73082, 10107, 91167, -2305, -96590, -11841, 83235, 13706, -63831, 2218, 56438, -23179, -65752, 32295, 79458, -25616, -81935, 15113, 70312, -14787, -55866, 26443, 50865, -39539, -55959, 43731, 61211, -39703, -58391, 36582, 49401, -40726, -42861, 48754, 43062, -52725, -45399, 49978, 42294, -46563, -32922, 49511, 24427, -58272, -23676, 64568, 28783, -61854, -30649, 53046, 23016, -47877, -9570, 52551, 641, -62703, -2049, 67923, 9161, -62567, -11500, 51653, 3819, -45380, 8837, 48644, -16755, -56437, 15546, 59679, -10171, -54659, 8876]
299H876L7206o0837k6684O4616J9718p0682j8294P3273J8391p1206j5330O8396
311B7443Q894o8511k884P0780N0p1409J283O8590m901o4858J1745O4090j8467
324B1845o6548K1083O8201j9863o5078J9428N7888k3827n1753L2012N0802l8606
336E584n3798L9486N5217l6117n1034L3987M2832l7051l5998M3793L4204m9034
348g929l5944M9484L6404m6601l2646M4805K6146m6610k0754N0472J8531n3098
360a7740j7861N2946J5989n1647j2038N1493P689n2731m795N3531L062n2506n34
373b5142N0525l758m9697Q416N0669j1166n1657J1593N0236j1831m6247J4420
385a3639M2159j9420m0645K4171M1690k5986m2511K4976M0460k3927l5674K5496
$$ y = [8876, 46082, -14755, -41439, 23177, 42895, -27787, -46081, 27192, 45583, -25623, -40953, 27443, 36337, -32174, -35058, 35722, 35772, -35637, -34354, 34236, 29335, -35523, -23778, 40312, 21845, -44703, -23620, 44581, 24718, -40360, -20932, 36956, 13129, -38624, -6612, 44190, 5584, -48214, -8728, 46489, 10372, -40662, -6675, 36157, -894, -36892, 6901, 41105, -7929, -43873, 5611, 42015, -4586, -37232, 7573, 33719, -12891, -33645, 16827, 35358, -17740, -35601, 17345, 33334, -18313, -30351, 21142, 28831, -23900, -28695, 24836, 27898, -24608, -25142, 25383, 21625, -28072, -19656, 31013, 19847, -31810, -20217, 30019, 18188, -28059, -13639, 28520, 9100, -31545, -7374, 34316, 8330, -34181, -9205, 31255, 7328, -28346, -2850]
397b850L0950k9565k8784L3482K9040l4892k9229L3987K7200l3055k3195L3958
409G047J9264l6426j6954L8611J5889l9293j4539L8944J2009l8837q922L9488
421A6281O392m0165m608L9943K643l8927J70L8237l379l8495N789L8956o792l8318
435b2273P389L6114r039l3460J2122L1985j5433l2054J7296L2433j7403l1385
447b3708J7035K8660j7941k5506K0393K3560k3157k3166K4719K3112k4808k2004
459b2811K4497J9570k5030j6817K6583J4819k8247j3705K9176J2633k9317j0951
471a9600K9332Q833k9727o823L0221N244l0295l708K9865J775k9404M34K9389
484A5536k321k9577L473K9248m211k8036N369K6372p317k5215R603K4923j1231
$$ y = [-2850, 28100, -1465, -30249, 3233, 32273, -2619, -31848, 2139, 29339, -3716, -26911, 7047, 26311, -10115, -27069, 11542, 27431, -11862, -26401, 12543, 24552, -14285, -23207, 16281, 22673, -17492, -22100, 17843, 20486, -18441, -18271, 19966, 16587, -21908, -16119, 22837, 16045, -22273, -14884, 21230, 12191, -21269, -9147, 22838, 7405, -24649, -7353, 25080, 7677, -23708, -6673, 21987, 4046, -21460, -1067, 22493, -664, -23830, 889, 24001, -807, -22811, 1686, 21256, -3774, -20591, 5992, 20811, -7436, -21141, 8035, 20668, -8649, -19600, 9732, 18565, -11162, -17985, 12236, 17480, -12815, -16523, 13342, 15117, -14287, -13853, 15536, 13215, -16362, -12889, 16359, 12148, -15888, -10519, 15853, 8536, -16679, -7076, 17847, 6616]
497F616k5004J1798K4482j1920k2909J2514K0890j4064j9376J6012J8777j7449
509C67j8574J7996J7896j8080j6433J8512J4575j9549j3002K0811J1951k1716
521e246j1062K2109R913k2279q422K2555O901k2934n566K3120M334k2992k946
534a2515K2737J384k2659O0K2710j115k2549J874K1868k746k0860M055K0025n643
548F626j9653O951J9599p685j9302Q036J8409q542j7150R596J6045j0976j5448
561a3494J2195J5163j2881j4713J3226J3802j3641j2561J4404J1341j5315j0448
573a2922J6119R689j6603q841J6862P767j7096o622J7364N544j7548m556J7562
586F719L506j7432k390J7370J278j7353l77J7233l15j6850J032J6241j945j5665
$$ y = [6616, -18388, -6590, 17892, 5972, -16937, -4423, 16467, 2403, -16973, -961, 17816, 367, -18207, -211, 17685, -395, -16828, 1684, 16259, -3290, -16292, 4519, 16470, -5246, -16308, 5801, 15714, -6565, -14987, 7568, 14469, -8465, -14031, 9089, 13423, -9569, -12515, 10222, 11606, -11053, -10993, 11717, 10602, -11947, -10073, 11795, 9049, -11811, -7756, 12269, 6626, -13027, -6076, 13523, 5838, -13464, -5428, 12981, 4439, -12711, -3115, 12930, 1954, -13494, -1299, 13864, 983, -13730, -504, 13298, -343, -12904, 1500, 12841, -2474, -12922, 3197, 12886, -3717, -12558, 4304, 12071, -5025, -11647, 5717, 11261, -6287, -10843, 6719, 10225, -7207, -9597, 7773, 9051, -8302, -8679, 8554, 8239, -8611, -7579, 8662, 6717, -8948]
600h948L062J5326m091j5193M804J4988n236j4490N714J3712o464j2939P460J2410
614A0115q404j2134R096J1801r536j1203R928J0373j0490r492J1171Q747j1814
627a842q123J2265P472j2550o687J2724N874j2952n010J3096M221j3136l445J3103
641E010K632j3054j822J3020J111j2920n30J2715m3j2360P16J1986j504j1716
655f759K247J1593k856j1478L309J1186l733j0718M277J0235m992r846N736R573
669G774o334r334O765Q957p143q415P573P822q109p211Q571O740q985o238R262
684A695N695r456n070R580M467r718l863R802L270r807k672R805K071r779j538
699e518R744J040r632n90R438R2r223M68R054j038q972J549Q897j961q761K357
$$ y = [-8948, -5886, 9440, 5349, -9844, -5040, 9948, 4712, -9778, -4064, 9648, 3184, -9755, -2295, 10115, 1711, -10423, -1327, 10474, 938, -10265, -337, 10036, -454, -9946, 1225, 9972, -1842, -9965, 2300, 9772, -2778, -9465, 3259, 9133, -3819, -8829, 4267, 8488, -4648, -8093, 5010, 7642, -5412, -7234, 5786, 6897, -6023, -6553, 6162, 6119, -6241, -5525, 6461, 4957, -6759, -4512, 7081, 4225, -7253, -3944, 7242, 3509, -7209, -2932, 7303, 2311, -7535, -1799, 7774, 1440, -7894, -1129, 7828, 685, -7730, -157, 7665, -444, -7655, 916, 7656, -1329, -7567, 1695, 7390, -2066, -7136, 2444, 6911, -2807, -6670, 3132, 6402, -3405, -6077, 3728, 5799, -3980, -5518, 4226, 5266, -4366, -4956, 4482, 4574, -4649, -4181, 4873, 3835, -5137, -3588, 5309, 3348, -5413, -3056]
715c056Q502k801q204L348P921l903p731M433P532m848p279N205O930n550o511
730f012N958O070o339n669O680N290o935m875P107M431p249l977P364L500p441
745b097l037P468K580p483k144P487J716p461j337P425R66p338n74P219J47p122
761c585K94P080p18p032J075O983j437o842J812O658k231o473K677O322l124o148
777d689L484N974l793n742M091N438m401n116M697M789m964m486N181M184n355
792g08l844N465L492n552l134N629K768n674k426N710K090n714j790N740J477
807C529n735j178N721Q54n664n28N639J85n615J57N600m80n561P68N501j082n401
824c290J430N269j781n165K134N059k466m913K727M743k986m522L230M274l472
$$ y = [-3056, 5446, 2645, -5559, -2211, 5710, 1807, -5924, -1491, 6041, 1193, -6086, -881, 6049, 499, -6012, -54, 6016, -323, -5992, 688, 5978, -957, -5832, 1275, 5706, -1543, -5520, 1844, 5344, -2097, -5134, 2334, 4914, -2569, -4713, 2774, 4490, -2971, -4308, 3117, 4083, -3255, -3829, 3390, 3537, -3585, -3291, 3789, 3071, -3961, -2886, 4097, 2660, -4182, -2370, 4288, 2057, -4416, -1739, 4583, 1459, -4689, -1205, 4769, 976, -4766, -675, 4763, 362, -4754, -57, 4732, -232, -4718, 463, 4647, -708, -4552, 913, 4405, -1147, -4281, 1348, 4116, -1558, -3984, 1726, 3816, -1898, -3688, 2052, 3529, -2206, -3384, 2337, 3191, -2473, -3001, 2638, 2823, -2792, -2635, 2965, 2485, -3076, -2308, 3193, 2111, -3290, -1860, 3409, 1628, -3537, -1403, 3656, 1190, -3723, -996, 3747, 761, -3761, -531, 3743, 271]
839B71m019L686L784l862l540L993L275m085l008M175K742m243k463M287K219
854C212m344j944M361J700m389j446M404J211m422r57M408O87m391m23M386J54
870B207m412J28M389l63m382O26M326r14m242J199M164j484m075J750L972j977
886I12l848K176L695k381l504K567L315k736l117K884K938l001k731L089K523
901B781l151k321L220K105l265j902L298J699l338j504L371J307l404j124L423
916A195R22l437p17L462M86l475k84L525M5l519J66L521l93l490O26L427q34l381
934b155J073L313j277l238J466L143j635l019J800K863j933k725K074K580k204
949A26k418K278K265k336k110K382J960k441j794K483J635k531j483K565J336
$$ y = [271, -3748, -62, 3722, -140, -3680, 313, 3588, -497, -3505, 670, 3412, -831, -3294, 993, 3212, -1132, -3076, 1285, 2985, -1404, -2850, 1554, 2765, -1657, -2614, 1794, 2481, -1910, -2333, 2053, 2207, -2205, -2077, 2312, 1949, -2433, -1807, 2519, 1605, -2637, -1438, 2726, 1242, -2833, -1083, 2889, 912, -2936, -760, 2935, 554, -2950, -383, 2932, 196, -2921, -37, 2901, -100, -2831, 258, 2781, -370, -2691, 529, 2634, -631, -2533, 765, 2464, -874, -2378, 993, 2300, -1104, -2228, 1195, 2117, -1320, -2037, 1425, 1911, -1564, -1848, 1677, 1722, -1797, -1631, 1890, 1497, -1993, -1367, 2060, 1226, -2155, -1082, 2231, 954, -2284, -818, 2325, 690, -2329, -529, 2334, 401, -2324, -250, 2330, 126, -2292, -14, 2251, -85, -2195, 187, 2147, -294, -2088, 395, 2030, -501, -1984, 581, 1917]
964A917k616j174K634J034k668q79K713P11k736n37K773L52k792j80K835j4k820
981a447J88K802l65k780N42K743p28k692Q89K641j050k555J179K459j311k345
997a830J392K257j506k131J591K016j658j905J726J773j760j672J806J557j851
1012a95j448J909J314j940j200J981J102k037r65K075Q46k115p09K149N80k191
1028h44m27K216K90k254j46K263J4k289J47K242k80k225M27K199n68k149O84K097
1046A397p92k039Q97J955r73j868J051J787j111j719J186J629j236j543J293J430
1062A344j315j363J375J280j425j176J459J097j513j008J550R31j610q28J665
1077D63P12j722n95J754M89j802l60J825K29j846j15J858pj848J22J836k35j807
$$ y = [1917, -699, -1873, 761, 1795, -873, -1752, 961, 1672, -1064, -1601, 1172, 1524, -1268, -1448, 1387, 1373, -1447, -1259, 1543, 1178, -1602, -1060, 1683, 955, -1737, -848, 1793, 743, -1812, -633, 1826, 515, -1830, -438, 1819, 313, -1818, -227, 1789, 131, -1774, -48, 1725, -35, -1707, 99, 1656, -195, -1643, 266, 1580, -360, -1560, 421, 1523, -514, -1479, 596, 1442, -673, -1382, 767, 1347, -844, -1271, 945, 1235, -1019, -1165, 1098, 1112, -1177, -1030, 1212, 932, -1293, -866, 1333, 765, -1384, -700, 1397, 605, -1434, -537, 1418, 445, -1423, -372, 1415, 304, -1415, -229, 1400, 164, -1379, -86, 1344, 29, -1334, 41, 1321, -104, -1280, 179, 1276, -237, -1245, 305, 1236, -374, -1202, 463, 1175, -547, -1142, 612, 1101, -701, -1061, 764, 993, -853, -968, 890, 883, -965, -843, 993, 758, -1049]
1095a049L44J783m35j754N33J700o10j627O78J566p34j524Q13J443q46j394R11
1112b02J313r45j261J004J172j035j121J084J059j148r69J187R07j251q25J289
1128B58P31j328o63J393N65j436m68J476L72j501k67J519J73j533o4J527j4j534
1146g94J20J506k00j481K85J446l56j410M21J361m69j327N29J270n68j229O09
1163b87J168o48j139P12J082p51j022P80R87q41r27Q86Q78r49q03R81P59j033
1181a67o91J080O20j119n39J162M68j201l82J230K98j255k12J263J39j266o0J251
1199F19Qj255O7J231j43j200J87J171k39j141K68J111l30j066L66J040m05j008
1217g19M49R78m84r44N28R12n71q67O15Q17o47p74O94P36p59o73P94O39q52n81
$$ y = [-1049, -705, 1078, 643, -1111, -578, 1122, 512, -1115, -437, 1129, 395, -1129, -316, 1127, 281, -1113, -202, 1111, 166, -1095, -91, 1081, 46, -1075, 9, 1068, -80, -1049, 138, 1045, -206, -1031, 258, 989, -339, -1002, 391, 956, -480, -948, 528, 900, -601, -868, 651, 824, -709, -773, 754, 740, -794, -674, 832, 632, -849, -564, 882, 526, -884, -463, 898, 429, -898, -369, 901, 333, -896, -287, 881, 233, -906, -194, 888, 137, -885, -105, 882, 41, -886, 0, 878, -71, -874, 107, 866, -167, -858, 222, 842, -277, -816, 346, 814, -387, -769, 461, 759, -496, -708, 555, 694, -572, -632, 619, 627, -628, -561, 670, 527, -673, -486, 685, 446, -695, -427, 684, 354, -712, -346, 694, 289, -719, -270, 708, 224, -720, -192, 720, 149, -718, -103, 714, 67, -707, -13, 723, -36, -709, 85, 724, -128, -709]
1237g09Q98N08r17m53R56L90r84l28J008K59j030j96J022J31j020p5R96L6r95
1256e03J7R85o6r57R6R49j51r01J81Q88k01q78K46Q43k73q18L12P98l48p77L89
1277a69P37m21p15M77O70n14o48N69O04o21n50O46N17o94m70P31M07p43l78P68
1297B03L26p93k51P88K26q09j78Q00J35p94r5Q02M1p68k4P66j3p49N8P25p0p09
1319c83R5O82j19o83J61O53j88o49K17O50k71o10K94N94l38n67L71N42m17n13
1339d79M52M97m97m50N17M26n51l73N72L33n90k89O03K56o12k22O22J90o33j44
1359c72O20J20o02j06O07O2n84n9N87K5n69j3N60k0n49L3N39n8n48R6N45j28n21
1382c35J57N15j98m97K31M79k60m61K99M47l27m23L59L88l82l72M08L59m37l15
$$ y = [-709, 189, 697, -220, -673, 283, 673, -311, -639, 369, 628, -402, -598, 424, 555, -465, -540, 456, 492, -503, -486, 499, 433, -524, -428, 521, 370, -531, -350, 538, 337, -541, -295, 548, 275, -543, -231, 567, 219, -558, -169, 568, 147, -568, -91, 579, 65, -583, -14, 590, -31, -581, 65, 582, -112, -582, 149, 556, -187, -565, 203, 529, -264, -515, 273, 499, -310, -488, 312, 447, -347, -442, 360, 401, -367, -391, 375, 362, -387, -329, 396, 326, -383, -288, 394, 275, -408, -247, 406, 218, -431, -214, 436, 165, -445, -151, 443, 105, -462, -91, 451, 34, -479, -27, 470, -27, -477, 40, 466, -85, -458, 114, 447, -143, -432, 171, 427, -185, -407, 215, 405, -228, -372, 248, 368, -234, -340, 267, 329, -255, -314, 273, 298, -271, -284, 276, 256, -293, -260, 279, 221, -327, -231, 314, 186, -335, -178, 337, 139, -358, -127, 352, 92, -369, -70, 377, 50, -373, -14, 374, -8, -380, 28, 387, -50, -365]
1402c65M55K84m71k39M60K25m76k08M84J68m67j61M66J39m61j24M60R0m62o7M52
1423A82O5m57m6M43L4m45QM37k2m41O0M38q4m27J17M21j54m11J81L92k05l81K40
1446e5L60k64l50K88L29l17l08L27K87l43k55L54K31l54k12L52K07l58j88L57
1466H8J65l58j48L59J40l57j31L65J10l59r1L64P7l63n4L48M2l56j0L55j6l47
1488a77L4L52o3l59J01L29j24l24J47L08j67l02J94K82k06k74K15K70k42k44K53
1509CK32k53k19K63K00k75j68K60J75k50j69K64J42k72j24K57J37k74j14K76J00
1530A91k76r5K86O7k71p0K83L6k89j5K96k8k73K6K81n2k73Q4K58r8k64J24K64
1553A92j36k50J54K42j74k11J81J98j70k04J89J85k04j74J96J72k03j56K05J52
$$ y = [-365, 90, 374, -97, -336, 124, 349, -127, -335, 149, 317, -150, -311, 155, 294, -167, -291, 169, 259, -203, -270, 182, 247, -210, -256, 187, 221, -224, -216, 221, 199, -242, -182, 256, 172, -255, -138, 283, 129, -282, -101, 291, 86, -295, -55, 305, 41, -309, -21, 308, -9, -317, 10, 297, -46, -301, 53, 284, -70, -282, 70, 277, -81, -269, 88, 253, -105, -253, 106, 246, -111, -242, 123, 233, -126, -217, 147, 224, -139, -193, 155, 197, -159, -169, 186, 170, -177, -143, 209, 146, -213, -112, 217, 93, -231, -84, 224, 57, -245, -51, 231, 25, -249, -34, 236, -6, -250, 3, 235, -18, -237, 26, 226, -49, -217, 43, 218, -32, -201, 63, 205, -67, -191, 66, 203, -71, -185, 91, 191, -85, -180, 106, 173, -98, -168, 115, 151, -138, -153, 143, 115, -158, -132, 149, 97, -176, -92, 166, 68, -196, -72, 192, 56, -194, -40, 202, 28, -183, -2, 196, 26, -178, 11, 196, -8, -182, 14, 186, -17, -173, 32, 184]
1573A84k11j35K04J29k05j31K23J08k30j01K28R5k41o7K22N2k32k7K34J4k30l
1595a20K36j4k41M7K30n5k32R3K23j00k17J14K06j20k08J21J95j40j64J52J53
1616A59j56j59J55J60j64j47J59J49j73j33J62J32j75j10J71J04j79j02J88Q5
1636A26j81q2K03N4k03l7K04K4j92j0J92Mk08M3J90m1j98N5J87o1j94P4J86r5
1660D0j75R7J68j05j57J03J53j25j37J23J32j20j39J39J22j36j09J34J06j32j06
1681a24J35J08j42q3J49P2j54o1J53N4j53n2J56M1j63j5J56Oj60JJ63j2j70L3
1705f2J63m8j56N5J49o9j36N3J54q3j38Q2J42r1j20R4J12r2j09R9R9r0j12J11
1729GJ10j11j02J22Q0j15p8J15P2j22o8J16O5j15o2J28M4j29l7J29L4j47oJ40
$$ y = [184, -27, -162, 42, 171, -34, -165, 58, 166, -64, -165, 63, 158, -83, -150, 72, 124, -108, -135, 99, 113, -117, -120, 116, 102, -139, -92, 138, 83, -149, -56, 167, 67, -150, -36, 170, 50, -158, -37, 158, 18, -146, 6, 159, 3, -156, -1, 159, -5, -152, 7, 156, -17, -150, 12, 144, -31, -141, 30, 134, -45, -147, 41, 126, -55, -137, 66, 120, -83, -120, 84, 108, -84, -94, 98, 102, -106, -63, 127, 86, -112, -57, 130, 69, -125, -51, 135, 40, -135, -38, 130, 25, -132, -29, 124, -1, -138, -15, 117, -3, -142, -3, 119, -17, -126, 8, 114, -18, -124, 11, 119, -23, -106, 43, 115, -39, -100, 53, 107, -46, -98, 58, 99, -64, -79, 77, 83, -77, -76, 87, 75, -95, -62, 101, 53, -103, -48, 101, 32, -104, -51, 103, 20, -118, -36, 106, 15, -105, -11, 101, 9, -100, -1, 98, 8, -104, 7, 117, 6, -96, 26, 106, -9, -87, 28, 100, -22, -90, 26, 91, -24, -86, 42, 86, -43, -80, 49, 83, -64, -70, 70]
1753G0j4j45K2J42k8j45M6J32l5j32N1J17m6j19O7J09n9j19O6J21p4j12P5J04
1777I4o9j00P7R5p3j03Q0Q2q2q7Q9N9p4p5J10N9j01o9J17L0j09k8J15K8j11k3
1803f9J16J7j27J4J15j0j21K4J19j8j16K9J07l0j10M0J05l7j16N0J05o3q9N1R2
1828G8n7r5O0Q7o7p8N3Q7p5p6Q4P1o5q3Q1O1q4n5J03L9r6m7J16K3r7k6J00K4r5
1857b9k1J03Lj03PJ06j7r1J2R4k3r9K3R9l2r9M2Q2l8r4M7R7m3q5K6J00n3q3N6
1886a3P3m8q3N8P1m5o7N0P9o3o4P6M4o7m4O8L8q2l7R7J4q6k5R5K0j06PR2qr7%
1917e3J07j8r6J5R8k3r6K7R0k1q7K1R2k8q9L9Q4l3p0L4O8l0p5M2Q3n8o7M9P1n9
1947A7o7N7N5p3m4P5M0q1m3Q6L8r0l2R1K6j04pJ03%q6mR6j8q3J4P8qp7MR8k3q3
$$ y = [70, 56, -89, -67, 75, 47, -98, -52, 80, 45, -87, -36, 81, 35, -84, -17, 92, 33, -86, -20, 101, 27, -85, -10, 94, 25, -75, 2, 97, 24, -79, 1, 83, 1, -86, 3, 62, -12, -87, 23, 82, -19, -88, 29, 59, -50, -78, 37, 65, -46, -69, 47, 64, -63, -49, 66, 56, -65, -41, 78, 60, -56, -27, 80, 50, -60, -20, 85, 48, -68, -18, 87, 24, -65, -14, 78, 21, -74, -14, 73, 6, -72, -19, 68, -7, -83, 1, 72, 7, -76, 5, 66, -18, -73, 30, 69, -27, -74, 42, 65, -32, -58, 42, 66, -29, -50, 53, 56, -47, -40, 66, 49, -42, -30, 64, 41, -58, -35, 64, 32, -67, -25, 57, 19, -75, -28, 69, 26, -59, -33, 67, 14, -69, -13, 60, 12, -71, -13, 58, 13, -54, -4, 75, 12, -52, 24, 68, 1, -43, 25, 63, -19, -56, 41, 55, -31, -56, 39, 59, -47, -40, 52, 44, -53, -53, 54, 36, -60, -45, 53, 30, -66, -39, 51, 30, -57, -36, 56, 28, -61, -22, 62, 29, -41, -7, 61, 31, -44, -2, 81, 23, -44, 5, 76, 17, -50, 7, 62, -11, -55, 20, 60, -21, -64, 22, 60, -30, -62, 29, 55, -49, -56, 47, 47, -39, -43, 53, 35, -48, -34, 44, 36, -41, -37, 61, 38, -45]
1979d5L3O7j2q5L0Q0k7p7L1O7l3p4L1P9l6p9M2O5n7o1O5N3o5o1P0M6o1m6P4M6
2009F0q1l7R1K3p9k3Q1J7q5LP1Lp4%Q8k2p4J4P8j8p4J3P4j0p3MQ2k4o6J2P8l0
2041B2q6M4P3m8o4L6O4m2p1O7M1m9l7N0M5m6o0P7L3n8l5P6K3p2k3P4K4q2k3Q5
2071C8J1q5LO5Rq7J4O9po8J5O3pp7J3O7j2p8J3Q6k9o3K2O1j9p4M0O1l6n7M7O3
2103F1n1o2O3L9m2n5P0L7n6m2O4K9o6l5O9J7o4k0P5jo5kO2J0o6pO7Pq7J2P8j1
2135B8o3JP1kp6J3P0rp4J5P5j8p7L7O7l8o3M2N9l6n6L3N7n5m1M8L7m4m6N1L7n7
2167a4l3O1K3o4k6P5J4o4j6O4J9o6j2O9Qp1nQ0Op3PN3on6lP8rp5J2O3j1p7L3O1
2201D5k6o5L5N8k5o4L2M9l5n2M2N1n2m3M6N6o4l6N0M5o3l5O4L3o0k4O1L1p0j8
$$ y = [-45, -12, 55, 43, -42, -12, 68, 41, -36, -5, 62, 29, -45, -14, 65, 29, -50, -8, 57, 0, -61, 4, 57, -8, -69, 1, 47, -14, -60, 14, 60, -21, -58, 33, 56, -23, -46, 35, 52, -33, -30, 41, 44, -30, -30, 58, 36, -38, -24, 54, 36, -38, -25, 49, 39, -34, -30, 52, 28, -38, -26, 52, 22, -64, -20, 53, 5, -59, -23, 41, -1, -72, -5, 36, -13, -50, 0, 45, -1, -61, 16, 49, -9, -44, 32, 55, -17, -40, 34, 58, -24, -47, 38, 49, -36, -33, 32, 41, -46, -32, 37, 30, -38, -23, 40, 33, -44, -31, 36, 24, -54, -41, 45, 16, -47, -25, 36, 17, -57, -17, 44, 8, -49, -2, 61, 10, -52, 11, 50, 8, -47, 23, 60, 4, -38, 26, 55, -11, -46, 23, 40, -24, -44, 31, 30, -35, -37, 25, 35, -31, -38, 29, 36, -51, -39, 39, 28, -35, -34, 37, 35, -41, -28, 42, 33, -41, -26, 49, 31, -46, -9, 58, 20, -43, -1, 58, 22, -34, -1, 56, 1, -40, 8, 45, 1, -45, 6, 43, -14, -47, 14, 37, -27, -53, 22, 36, -28, -44, 20, 39, -27, -39, 30, 38, -33, -38, 42, 48, -25, -18, 35, 29, -27, -30, 48, 39, -36, -24, 39, 28, -49, -16, 45, 19, -46, -11, 47, 22, -42, -10, 39, 4, -48, -6, 45, -7, -50, -4, 52, -12, -48, 2, 47, -16, -51, 13, 46, -14, -38, 23, 54, -16, -34]
2231c4O7J1n7k0P3kn6j3O3Ln6k1Q1qo9NO2j2o0RP1j2n9PP2l6o4L8N1k1n9L6M9
2264C9l2n8M3M1k6m2M5L9n2l5N2M1n8l6N2L7n0l3N6J5o3k0O2J9o2j8O4Mn6j2O8
2295B4Mn5nO2on1nO5kp5K6N9j9o3J0P8k4o4L6M3k6m5K6M6k9n3L9L9m0m3M9M3n3
2328ik4M1L7p0k0M1L5m3l0M6K9n2k5N2K7o0j4O1Mm8mN2J6n4j0N7ln9J5O1j5n2
2360a8NM6nn8K5M6l2m1K2N5l3m3K6M7m8l1K2N3l8m1K6M0l9k9L4M2l9l7L8M4n1
2391a2k1M7K6n7j5N4J2m2j9N7J7n1k7N3J8n3j1N0J1o2%N4rn5MN9k4l8PN0j2n0
2423c9K4M7l1m8L1M5k2m5L9L6l2l8L4L6l5m5N1M0m8l8N1K0l0m1O4Qm5j5M5J4n0
2454a7j9N3Rn5lM2Pm3%N0mn3MN1j5m0J5M0om8K7M1j5n3L0M1l5k6K5L3j8m8K6L3
$$ y = [-34, 33, 44, -13, -33, 40, 38, -18, -31, 32, 35, -21, -42, 39, 31, -38, -33, 29, 17, -43, -34, 37, 25, -34, -27, 45, 9, -55, -17, 34, 13, -46, -10, 39, 7, -51, -8, 33, 7, -35, 10, 49, -3, -38, 14, 55, -3, -39, 13, 50, 0, -33, 23, 38, -25, -45, 17, 36, -26, -44, 20, 24, -32, -44, 24, 28, -27, -32, 30, 24, -27, -32, 33, 31, -44, -18, 41, 22, -41, -31, 47, 23, -41, -5, 38, 12, -33, -7, 39, 10, -43, -4, 35, -5, -48, 1, 44, -9, -33, 8, 45, -25, -45, -4, 31, -12, -42, 4, 33, -19, -44, 8, 35, -25, -39, 22, 26, -22, -26, 26, 42, -12, -22, 35, 32, -27, -12, 49, 34, -18, -13, 33, 28, -30, -5, 41, 9, -32, -10, 45, 12, -31, -5, 42, -6, -37, -15, 38, 0, -41, -15, 25, -14, -43, -9, 33, -6, -43, -5, 39, -12, -33, 14, 40, -17, -32, 22, 34, -8, -27, 30, 47, -4, -31, 22, 40, -13, -24, 26, 37, -25, -25, 29, 20, -35, -31, 28, 4, -34, -27, 23, 11, -39, -15, 32, 1, -47, -16, 29, 7, -38, 1, 37, 5, -33, 1, 37, 2, -43, 8, 48, 0, -38, 13, 33, 3, -38, 26, 34, -11, -26, 19, 33, -17, -36, 17, 26, -29, -32, 10, 17, -26, -26, 24, 20, -33, -29, 22, 7, -33, -18, 22, 16, -32, -5, 36, 21, -32, -2, 39, 4, -22, 3, 36, 18, -30, -4, 29]
2488B9k8l6M3K4l9l1L5L4l7k6L2K8m0k4M0K6m8j5L4K5n8pN0J4m7j0N2jm0JM1P
2520B8m4jN3Jo1J2M9k3l8J8M0k6m3K7L6l0k5K0L9l2l9L1L2k1m4L6K8k3l7M7J2
2551B2l8j3L6K3l7j5K7J9k8j9L8J1l3j7M6Rl7rM8nl5MK2Ll3mL5Jn5J5L7j4k9J9
2585fK7pm6K2L4k4k1J4L8j9m0K8K4k5k5K8L5j9l5K7K7l1k7M3J2k5j7L0J3m2j1
2616a8M4J6n1j7M7Qm4oL9rl4jM0ml6JL3Nm5K0K5Kl1OL7j3k8J7L8k4l7PM4j8k4
2651a1J0M0m1j5K2K6j7l7K4K7l7j3L5J1k5l2L8Lk8j7M6K3n4lL5J0l1j3M6qk9M
2683a1L9lm1J7K2Nm3J6L3j3l2mM5qm2K6J6k1k7J2M1k8j4K0J8l0j4J8J8j4l1L4
2715DJ3k5k6L5J6l0j1M5Kl8OK4%k2j9M3J0k7jK7Ll4j2M3rk8JK3Om7K1J7kl1NM5
$$ y = [29, 1, -35, 8, 32, -7, -38, -3, 31, -6, -32, 0, 28, -12, -36, 4, 30, -18, -33, 1, 26, -32, -39, 11, 25, -22, -32, 20, 19, -21, -20, 21, 28, -16, -17, 36, 37, -24, -12, 37, 14, -24, -6, 34, 8, -35, -8, 28, -2, -27, -7, 32, 0, -39, -8, 24, 3, -41, -5, 23, 0, -37, 10, 22, -16, -29, 7, 30, -7, -22, 5, 24, -4, -23, 15, 26, -7, -24, 22, 31, -6, -15, 33, 28, -7, -3, 19, 22, -11, -15, 20, 21, -34, -19, 18, 4, -25, -6, 21, 14, -32, -10, 24, 0, -21, -7, 31, 12, -28, 0, 24, -1, -26, 2, 37, 18, -17, 10, 37, 6, -21, 22, 34, 9, -8, 22, 35, -7, -18, 26, 42, -9, -26, 21, 29, -15, -21, 18, 9, -25, -26, 14, 10, -26, -25, 8, 13, -32, -12, 13, 15, -16, -10, 27, 14, -14, 3, 41, 17, -20, -13, 31, 13, -11, -1, 39, -2, -17, 5, 31, 14, -23, 1, 28, -9, -22, 13, 24, -1, -33, 5, 8, -20, -37, 9, 32, -22, -25, 10, 20, -11, -24, 22, 14, -15, -11, 28, 25, -16, 1, 23, 28, -15, 1, 34, 21, -11, -15, 30, 22, -20, 6, 22, 1, -26, -14, 27, -1, -15, 5, 23, -7, -21, -3, 15, 1, -30, 4, 17, -8, -34, 1, 17, -13, -24, 21, 23, -15, -9, 15, 15, -7, -26, 17, 27, 0, -1, 26, 29, -5, -17, 26, 17, -11, -10, 13, 19, -28, -7, 10, 8, -23, -18, 27]
2751B7l1k8K7J2ml1J4L0j7k3K3K1j4k9K4K9k9j2J7J6k1j6K5L3m5j7L7J0k5j4K1
2782A0J4l2kK8ok9qM1kl4jL3j3k2MK4Kl2J0K2Ol2K1J7j3j5QK6j8k1J0L3j1l8K9
2817IJ5j4k3J7K3k7j8J8K0k4k5L3J1k4j1K6J2k9j0K5J4l9j0L1Mk9RJ8Mk7jL9j7
2850@j6OK6Nl0lK9jk5J6J1nk7J6J8pl0PK6j7k7K6J1j4j7K5Nk8%J1K2k8j0J8J2
2885Ej1j6L2lj4oK3J1l4NK5Lk6MJ9Jj8JK3nk3lK0Lk6QK5k1j5OJ8j2k2LK8pk1J9
2923aJ9j7qNK3k2j3J5J4ok4K5J5k4oJ5J2j5j3J5Pk4NJ1J7l4kJ9Nk0jK0mj8kK1
2959Irj0mL8k4j3KK7j3j3lL1j8qRJ8j7rJ8J6j2j9J4%j4mJ9Knj9J2Mlj3QPnj4K3
2998Hqk5J6J8%j9mK2qk6J8J2mk0MK9j2j8lK7oj9J0K8j0j4LJ9rj0KJ4j3j0MJ4j2
$$ y = [27, -4, -32, -5, 7, 3, -28, -14, 16, -1, -24, -1, 20, 6, -23, 1, 30, 1, -11, 6, 22, 1, -15, 10, 43, -2, -19, 18, 28, 3, -11, 10, 24, -8, -10, 18, 12, -17, -25, 16, 14, -20, -21, 12, -1, -23, -19, 5, 7, -25, -15, 7, 13, -19, 2, 19, 6, -9, -1, 25, 7, -14, -4, 29, 18, -20, 9, 24, 10, -13, 4, 27, 0, -18, 0, 20, -4, -29, 4, 15, -9, -20, 6, 18, -11, -21, 4, 18, -21, -31, 0, 4, -25, -16, 2, 6, -21, -22, 17, 0, -16, -10, 16, 21, -9, -12, 17, 16, -9, 7, 18, 13, -14, 2, 20, 13, -17, -10, 16, -1, -28, -2, 9, -5, -22, 3, 8, -20, -20, -9, 13, -15, -25, -7, 5, -6, -22, 10, 7, -7, -13, 10, 21, -13, -8, 17, 20, -6, -2, 17, 18, 0, 1, 24, 19, -4, -7, 13, 16, -10, -2, 23, 2, -13, -7, 11, -1, -23, -20, 8, 1, -20, -1, 18, 1, -7, -2, 21, -1, -14, 1, 15, 9, -15, 10, 25, 1, -5, 10, 22, 7, -6, 9, 16, -8, -3, 8, 25, -9, -11, 8, 13, -7, -8, 12, 8, -10, -12, 9, 0, -10, -14, 24, 0, -13, -11, 16, 3, -10, -13, 18, 0, -8, 1, 19, 2, -7, 11, 27, 15, -4, 10, 10, -4, -8, 11, 13, 8, -11, 1, 5, 2, -11, -3, 4, -1, -15, 8, 0, -25, -9, 9, 9, -10, -14, 8, 0, -26, -8, 4, 0, -20, -16, 13, 1, -17, -20, 7, 1, -18, -8, 20, 10, -4, -1, 18, 9, -1, 1, 15, 2, -8, -4, 10, -2]
3035bj7J9J1j1j6J4J0qk1K4J0k9kK1jmoJ4mj0jPJ8k9MK1Lk2mK7j0nJK2rk9RJ6
3073A1%j1mK8j2k5J6J6j6k1J1Lkj1LK0qj6J0J3k1RjJ3ppMJ9j7j0K5J5k2qJ6J0
3109B3k5j7K8OrkJ1kk4LK1jj7nJ8kj5L%LqpJ7oj4J2J2oj3K2J5k3pJ5MKj9J3J7
3148B3k3nJ1J0k8J3LRk3oJ9JrqJ1Lj8RJ0qj4QOMj7NK2qj7JL1j3j5NK8j6j1NJ2
3187A0j0nPJ5qqPNr%J3lrj0Q%j0rJ6jqLLkj5OJ4KpnJ4Qj6pK1Kk4QJ6lrjJ1llj
3233CPqM%J6j8n%J4nj4jJ4rj4RkOoRJpqJ1J1j5j5K9rOoJ6npjRj0%JJ6j4kj1K0
3277A0jj4J6KpkjqKj4K2j4Ok2J4J3qjkMpR%Qpj2K1nqMMR%p%jJ0j5PJ4j5nJ1Qk0
3322bPlK1k8jPOk2J3PoqlJ0%j0JJ1jljJ0qmnJ4Oj4J0jLj1J0J3j2jPKj3lJ3lr%
$$ y = [-2, -19, 0, 11, 0, -16, -2, 8, 0, -21, 3, 13, -16, -18, 3, 2, -2, -8, 6, 2, -8, -9, -2, 16, -13, -9, 12, 15, -7, -11, 16, 6, 1, 2, 24, 15, -14, -5, 11, 11, 0, -4, 24, 12, -13, 3, 19, 3, -18, -7, -4, -6, -17, -14, 6, -2, -18, -8, 5, -16, -7, -8, 5, -2, -9, -5, 14, -3, -13, 12, 27, 5, -3, 13, 23, -2, -19, 9, 15, 6, 4, 15, 13, -11, -8, 13, 12, -5, -10, 8, 6, -9, -6, -6, -3, -11, -18, -1, -7, -21, -9, 3, -3, -16, 6, 21, -2, -9, 6, 10, 12, -7, 6, 23, 0, -5, 6, 16, -12, 1, 4, 13, -10, -16, 3, 4, -5, -13, -2, 1, -17, -8, 2, -6, -20, -12, -6, -2, -19, -14, 8, 0, -17, -16, 15, 2, -13, -8, 20, 4, -7, -2, 10, 0, -5, 2, 17, 9, 1, 8, 13, 4, 4, 17, 14, 5, -5, 3, 3, -7, -16, 0, -1, -9, -6, -3, -5, -20, -14, 0, 2, -5, -10, 4, 12, -4, -11, 10, 12, -12, -4, 12, 9, 0, -1, 10, 7, 4, 3, 10, 2, 6, 6, 22, 4, -1, -1, 13, 8, -6, -7, 7, -2, -16, -7, -9, -3, -9, 0, 1, -6, -14, -3, 8, -7, -22, 7, -2, 4, -2, 14, 9, 2, 1, 10, 0, 0, 1, 17, 3, 1, -10, 10, 9, -5, 11, 13, 6, 4, 3, -5, -3, -17, 5, -9, -3, -25, -11, 2, -6, -7, -9, -5, -12, -3, -3, 5, -2, -14, 7, 2, -6, -2, 2, 11, 11, 4, 4, 3, 13, -2, 5, 19, 4, -1, 10, 18, -2, 5, 2, 23, -5, -6, 1, 7, -15, -2, 5, -1, -9, -12, -2, -2, -12, -11, 0, -1, -4, -5, 5, -3, -7, -12, 2, 8, -6, 4, 3, 6, -5, 5, 18, 6, 5, 12, 14, 1, -2, 11, 8, -1, -1]
3366aJ1Kj0ojRrlPjqoJ4MorJ5moLJ2kj8KOJ5j1%J1j0kRj%qORJj9PJ1ok2J5Rj6
3412grJ2Pj0j4J6Rj2j0PProJ0MJkPQj7OQLj1QkLpRjjj2OOjnmJ3pj3J4Oj2JojM
3459dK%RrojRkJkNmkPJojJ0Rj0qOPj2MJ3lj1jL%r%LJ2j3nJPj8PK0j4pNLOjj2J5
3509DqNj0RMrPJ2j2j5J0J2JmJOj0NJLj1lJ5mrpQLlj4RJrNQnlm%LljQJ0j4QOjK
3558GkjmoJ5rMJqJ7oLJnmj0J4Nj4JJQoj1PMjj5J4mljkJ0j5LJ3Lj7J6QpJj1J4n
3604CMj0J5nmP%JlmkNmpRj6%lPOj0MNNj8QJKljpMQkLlmJ2qJ3jLkOqOOqj6J1Nm
3656FLjNk0RojrnJ1J%KPJj1KJ2kj1lJ7npLKMj0J3PrnJJqKJ3jKj1NPolOpjLJj5
3706a1jJ%%rJ0%LLj3MJ1%LNjqJJ5j1pJ2KmJ2j2%p%RKprQQj3RmnNj0LJ0rkKJmK
$$ y = [-1, 10, 12, 2, -4, -5, 4, -5, -8, -1, -2, -10, -16, -2, 2, -4, -13, 2, -2, -8, -5, 7, 5, -13, -11, -5, 10, -1, -1, 10, 0, -2, 7, 6, 6, -2, 4, 13, 14, -5, 2, 13, 7, -15, 0, 9, -7, -16, -4, 3, -7, -21, -5, 4, -8, -18, -11, -4, -13, -19, -9, -5, -4, -6, 1, 9, -8, -2, 6, 9, -2, 6, 4, 7, 0, 9, 8, 7, -5, 1, 7, 6, 1, -3, 10, 3, -10, 4, 10, -2, -1, -7, -8, -4, -2, -2, 7, -2, -8, -9, 0, -2, -1, -3, 2, -2, -4, 3, 4, -2, -3, 7, 16, 6, -2, 4, 11, -1, 3, 16, 13, 2, 1, 4, 4, -5, -5, -2, 10, -3, -8, -7, 0, -18, -11, 9, -5, -12, -7, -4, 2, 1, -11, 4, -4, 1, -9, 0, 4, -5, 2, 14, 2, -13, -3, 9, 10, 6, 7, 13, 3, 8, 9, 12, 1, -2, 13, 9, 0, -7, 1, 4, 1, -13, -4, -3, -12, -7, 1, -4, -7, -11, -11, -8, -11, -12, -4, 6, -8, 0, 6, 5, 7, 5, 4, 0, -6, 9, 0, 4, 5, -3, 14, 8, 11, 12, 7, 3, -7, 7, 12, -2, -1, 0, 8, 2, -9, -2, 2, 1, -14, 0, -4, -7, -8, -10, 0, -15, -12, 1, 4, -13, 3, 11, 4, 5, -6, 8, 3, 7, -3, 12, 7, 3, 10, 10, 11, 8, 4, 2, 7, 3, -4, 5, -11, -11, -14, -7, -1, -11, -7, -2, 3, -15, -7, -6, -4, -7, -8, -15, -11, -3, -5, -2, -5, -9, 3, -5, 8, 7, 10, 8, 14, 6, 12, 18, 10, -6, 5, 10, 6, 9, 8, 13, -7, 2, -4, -5, -14, -19, -8, -7, -7, -5, 2, 3, -8, -6, 6, 4, -7, -10, 7, 2, -5, -2, 0, 4, -6, 7, 14, 5, 0, 1, 2, -6, -4, 9, 8, 10, -1, 4, 11, 5, 2, 8, 1, 0, 3, 4, -11, -12, -11, -11, -11, -20, -10, -10, -7, -4, -17, -13, -2, -2, 1, 6, 5, -3, -2, 13, 2, -5, 7, 9, 5, 17, 5, 5, -2, -2, 7, 9, 2, -7, 1, 9, -4, 5, 1, -4, 1, -9, -6, 4, -5, -7, -5, -4, -8, -6]
3755fjQpMKnJ2ljjrJ9j2J4j2J0rJJ1j3%QoKJ3j8Lk%Kj7J0J%opJ5KqqJ2j3J2kJ3
3800HJj5NnJ0p%L%pJ4%lMJOloOmKkr%mMMj8J2jNopqJ5j3%J5Rrj3QJ3njNnljLL
3851AOj3J3j3J1J%rJ0jLqkJQoJPj0LkjmJ1j9jJ4j0mJ4qPj2ROJmJjMj1PJ6k6J6
3896FmoJ0j1RJ0j9LkJ4%pJpJ0j4NQMjrJmlLKJj4J0%lpJ4KmNqNJJQmjjQj0OmPq
3946CnNJnlQnknkJ1jpNNmj3J4ojjLJ3orPkRknJ0nJJ%j0RJmOpNJmLMnnj0Qm%kQ
4000Aj1JKnlRJOmLj1PLLj%jMlNj4KQJ0kKj0J%KlpJ0%%jokokRLj3OkJLnj%JMmP
4054cnOjMJj0J1KjjOj2OmKMjLMj1Lj2KL%J1pKj2LJ0kpJ1j4JNjLlLnMmnJ3jj0J7
4103HKpJ2okoRqJ3qoNj0JLLnOj2lK%MLJjMKj5PLnJ4Nj2Okj1J4lJ%qKkNjLM%Jr
$$ y = [-6, -7, 1, -6, -2, 0, -5, 7, 4, 3, 2, -7, 12, 0, 14, 2, 12, 3, 4, 15, 2, 2, 10, 4, 6, 19, 1, 4, 2, 2, 4, -13, -3, -2, -2, -8, -15, 0, 2, -6, -14, -2, -15, -3, -5, 8, 9, -6, -1, -6, 4, -3, -3, 0, 0, -7, 7, 7, 4, 8, 9, 15, 12, 6, 12, 8, 10, 8, -1, -1, -5, -1, 3, -15, -3, -4, 1, -5, -12, -20, -5, -18, -18, -3, 6, -3, -16, -8, 5, 0, -1, 4, -1, -4, -5, -2, 1, 7, -6, 7, -6, 5, 6, 6, -3, 7, 6, 9, 1, -1, 0, 8, 2, 3, 10, 0, 3, 1, 0, -4, 7, -12, -13, 1, -9, -13, 1, -7, 0, -12, -3, 3, 4, 0, 1, 0, 4, -7, 0, 16, -10, 6, 2, -4, 6, -5, 4, 14, -5, -2, -4, 10, 10, 3, 4, -3, 7, -7, -2, 6, 10, 9, 0, 1, -3, -6, -3, -1, 0, -14, -4, -4, -7, -14, 0, 2, -2, 3, -5, 0, 1, 2, 10, 6, 5, 4, 12, 2, 8, 4, 11, 3, -2, 3, 4, -1, -4, 4, -1, -3, -8, -10, 1, 0, -7, -2, 3, -1, -14, 0, -6, -7, -8, -5, 8, 2, -7, 0, -2, 7, 5, 0, 10, 5, 6, 7, 7, -3, 6, 7, 3, 9, 2, 7, 8, 4, 7, 11, 6, 1, -9, -1, -5, -5, -7, 1, -10, -9, -7, -12, -15, -6, -5, 1, -3, 0, -11, -4, -1, 2, 1, 1, 0, 4, 1, 6, -8, -6, 2, 12, 10, 12, 2, 3, 3, 5, 2, -5, 5, 5, 5, 4, -2, -4, -10, -12, -3, 0, -13, -7, -9, -8, -5, -10, -11, -11, -10, -6, -10, -3, -8, -2, -3, 1, 2, -8, 3, 5, 4, 3, 9, -3, 3, -1, 1, 5, 4, 7, 11, 0, 3, -9, -7, -4, -4, 7, 0, 2, -10, -7, 3, 1, -6, 5, -9, -8, -3, -4, -1, -4, -1, -6, -2, -6, -11, 2, 1, -9, 8, 10, 3, 15, 9, 7, 1, 10, 2, 15, 7, 1, 6, -4, -3, 0, 3, -2, 4, -8, -11, -9, -9, -5, -2, -1, -2, 2, 4, -11, -4, -1, -6, 8, 13, 1, 7, 5, -6, 8, 5, 6, 6, -2, 0, -2, 3, 2, 5, 9, 9, 10, 1]
4155AnJ3ko%RrKkjjQqoQj7P%OMMj8J2%LLmMLkNnnNKj1J0J7j6LkmpKOpOnPjoNL
4208Hj1lkqJ6mMKmPrJ0mOLmpnJ4jkkKMMLj4J2j1%KkKlJ0k1MmmJ2j0PJOj3lJJ2
4256AokJ6rnPNJ0j2mJlOjQj2OlJ1J0j2KMj3J%JmpPk%%krJ3pPrPoj%JJJ1j0LkM
4306BKKJ%LLj1OOj0J0Mj1K%oQKj4PMj1Qj2JMj2mRJ0j2JlOmKOnPJ2lrRjjnOKqK
4356ENjLj1Pj0KLLnjj1RQj3PjQoj0J4r%J%Oj7QNklMNOpJ2nmj0OJ3moLP%kJj0j
4406BMklJj6J5qQJj1jJ1%pJ2j0jPkkKK%PmpMJ0pnOokPlqJ5kPj4J1KmpNplJ0mj0
4456glKNnJOkMJ%oMJNoL%oOj0MOOkJjJKljQoOj0nNjrJ3j1J1mj1KlJ4j6J2Oj7L
4507gJ3j6OjJ1pJ0%jJkJnJ0jj0J%KMj1kRRj4KnKJ3pj7J4J2j6jO%kJj3J2lnQkN
$$ y = [1, -4, 9, 7, 1, 1, 10, 1, 3, 1, 0, -1, 7, -1, -7, 1, -16, -9, -9, -3, 1, 5, -13, -1, -1, 2, 5, 1, 5, 8, 6, 11, 6, 1, 6, 8, -3, 7, 24, 8, 11, 9, 5, -2, 0, 6, -1, 5, 0, 7, 6, 0, 5, 8, -3, -6, -8, -16, 0, -4, 0, 2, -2, 5, -4, 6, 2, 8, 11, 7, 0, -5, 9, 8, 6, 4, 6, 10, 14, 17, 3, 15, 4, 4, 6, 4, 6, 3, 13, -8, -4, -8, -12, 0, -10, -3, -2, 4, -9, -12, -11, 1, -5, -7, 9, 0, -5, 2, 7, 17, 5, 1, 2, -1, 5, 4, 12, 0, 6, 3, 14, 24, 12, 14, 18, 5, 6, 6, 7, 3, -4, 3, 1, 1, 1, -1, -10, 3, -4, 3, -6, 1, -5, -6, -6, -5, -4, 7, -3, 0, -2, 2, 4, 6, 7, 7, 10, 13, 2, 8, 14, 4, 14, 18, 7, 9, 9, 3, 11, 13, -1, 6, 10, -1, 7, -5, -4, 0, -12, -16, -7, 3, -9, -8, -11, -5, -9, -7, -1, -6, 1, 13, 10, 1, 10, 9, 8, 3, 9, 11, 3, 5, 10, 9, 12, 1, 8, -2, 0, 3, 6, 1, 0, -11, -2, 6, -7, 0, -1, 7, 1, -9, 5, -4, -4, -3, -3, 3, -14, -6, -1, -3, -6, -2, 3, 9, 2, 14, 9, 5, -5, 1, 14, 10, 4, 7, 14, 14, 12, 13, 3, 2, 6, 4, 1, 2, -14, 1, -7, 1, 2, -9, -10, 1, 1, -6, 6, -4, -5, 2, 0, -2, 0, 2, 2, 9, 5, -2, 2, 12, 5, 0, 6, 0, -2, 5, 2, -6, 9, 7, 14, 0, 11, 13, 9, 2, 7, 0, -3, 7, 3, -7, -10, -8, -3, -8, -7, -1, -3, 1, 2, 2, -4, 0, 1, 6, 0, 3, 3, -3, 3, -7, -3, 3, 9, 7, 8, 7, 8, 10, 7, 6, 14, 8, 14, 4, -1, 4, 3, -6, 7, -4, 7, 3, -8, -6, -9, 5, -11, 1, 7, -10, -7, 6, -10, -4, -5, 6, -1, 9, 9, 8, 9, 7, 8, 3, 13, 12, 2, 3, 3, 5, 9, -2, -4, 5, 14, 0, 2, -3, -1, 12, 5, -12, 2, 14, -2, -3, 3, 3, 1, 2, -11, 1, -2, -7, 1, -1, 4]
4553DkkL%lMnJ3j1PjKJLNj9J0Nj1RplQj1JRj2OJj2NjJJ0qmMnJMRqLmNmkJ0qnJ2
4604G%%%Kj1J1Lj0LRj1LnnO%j4J5j0oJ0O%k0J9q%OjRqjJ2krMLJjlLr%J1LrJ1j6
4652bjNnJ3mkKj4PLqP%%rnJ2ollNQqJoQNOlJoOqQNlnPLj0OqLJ0lnOrmQjrlRkJ
4708@pMlRmkklM%Nj1PjKJ0nJkmnK2j2OoLoM%LnMj2Roj0LJ6j7%NqRokJJ1pPj3J1
4759ckkKnRMoRMqqJ0njJMJRn%NrLnpOqKJ%Qj7OPpJ0j0lQJJ6j5%M%oJ2j1nJ5j3
4810dJ1pLJ0j5J5mJmoMkjPj1PMKj3KQroJ3j7%jJ4kpmQNj6J4OpkJ3j%pJJNjoN%
4859FnLLrkLjKnmMqJ2LJqk%Qj3J2knKqK0j2J3oLnK%KJkqJ5KkKjKoLjKj1J0llk
4911BqPj2JJ3pjMooQjMo%QNMjj1LR%mjKmJ3j1LmmJ1Nj3l%kMklRjlpLmMKpOj6J0
$$ y = [4, 2, 0, 3, 3, 0, 4, -1, 12, 1, 8, 7, 9, 10, 13, 18, -1, 9, 14, 3, 12, 5, 2, 10, -1, 0, 9, -3, 3, 4, -8, -3, -4, -3, 7, -1, -5, -1, -6, -5, -1, 8, 0, 3, -1, 4, 0, -2, 8, 0, -5, 7, 7, 7, 7, 9, -2, 9, 12, 2, 5, 14, 3, 6, 1, -4, 2, 2, -12, 3, -7, -13, -3, 3, 3, -17, 2, -6, -6, 0, -1, 8, 0, -1, 11, 9, 0, 4, 7, 8, 7, 4, 7, -2, -2, 9, 12, 3, 14, -2, -3, 2, -3, 10, 6, 4, 6, -8, -1, 2, -6, 1, 1, 1, -8, -13, -1, -7, -10, -13, -8, 0, -8, -7, -13, -5, 0, 6, 3, 4, -2, 4, -4, 4, 9, 6, 1, 8, 11, 1, 7, -1, 2, 12, 9, 4, 10, 1, -3, 5, 4, -5, -8, 1, -1, 0, -7, -3, -6, 3, -1, -3, -5, -8, -4, -4, 1, -10, -3, -4, -2, 8, 3, 4, 2, -2, -7, 15, 3, 9, 3, 6, 0, 4, 4, 7, 2, 6, -6, 3, -3, -13, -10, 6, -11, -11, -6, -14, -5, -11, -13, -12, -1, -8, -1, -14, -3, -5, -7, -5, -10, -1, 3, -3, 6, 10, 2, -6, 4, -1, -2, -1, 3, 4, 13, 8, 8, 13, 4, 7, 2, -5, 1, -7, -5, -4, -4, 4, -13, -7, 0, -7, 3, -7, -10, -2, -1, 15, 0, 0, 4, 4, -2, 10, -1, -6, 9, -4, 7, 0, 3, 13, -2, 13, 9, 10, 6, 0, 4, 2, 1, 8, -3, 4, 8, 10, -3, -1, 7, -2, -8, 5, -12, -12, -13, 1, -1, -8, -12, -4, 1, -15, -1, 5, -2, -4, 9, 8, 8, 1, 2, 3, 8, 7, 1, 6, 6, 1, 4, 7, -2, -4, -1, -2, 0, -5, -9, -5, -13, -1, 2, 3, -5, -7, -7, 1, -12, 0, -2, -7, -5, -13, 7, -5, 8, 2, 5, 0, 2, 2, 4, 5, 3, -5, 10, 12, 10, 12, 11, 13, 7, 10, 9, 11, 0, 10, 7, 4, 2, -6, 1, -11, -10, 3, -4, -5, -1, -7, -13, -5, -6, -2, -8, -8, 0, 5, 9, 8, -3, 0, 9, 9, 5, 4, 6, 2, 15, 4, 7, 3, -1, 10, 15, 2, -1, -1, -3, 1, -1, -4, 5, 4, 1, -6, -3, -7, -3, -1, -8, -2, -18, -8]
4964hj%lQkNJJKkJ3j2Mj3J5oLLj1J4j3LNj3OpOJ1rrPkLkJ1j3l%NmNk%JnLjpJ8
5013Enj3J2J4j9QMoJjJ3NoomJPj7RJl%jj0NoLMJ%qMRRrNoJKKLppQ%J2k1RMNj0
5064AJ4oj4J8nOj3LmJ3nJj2%LpJ1j2Rj4J1Nljj2J0kNJNlqJ2j1NQOnjnK%JJnPo
5111DRj9J7mK%qJKLr%OnLqJ1j2oJ5JkNj5QkRLj1J0m%JQjklJJjlLJkj6QQj1NQn
5162DklkjNjmmQJlmJ0KmpOmjmLMPlmJ1MmOKj2Jlo%J3qLpj0QPlj4J3j1OLLJmlN
5215@jkK%Qj2PpKjLLJo%J0kjJ6j5J7j4kKKpjqJ0lNqpNjJ3j0ol%NPmMj3RKqQLn
5266cLlNLPj5LMqLmLOpKJKMkl%%jLplJ4j1kKklJ0qkJ2jpLOnJ0j0O%OnJ1j%j8P
5318EL%knkJ0j2mjoJ8pLl%KQrMj2QpJ4j0NlklRnLJjOj0OlOlnMMKjj1MKJL%Jj8
$$ y = [-8, -9, -9, -12, -4, -6, -1, 0, 1, 3, 1, 14, 2, 6, -7, 8, 2, 5, 8, -3, 11, -2, 1, 6, -7, -1, -8, -2, 9, 0, -9, -2, -4, -1, -3, 8, -5, -8, -8, -3, -7, -2, -4, -4, -3, -8, -5, -6, -13, 5, 0, -13, -1, 13, -6, 2, 6, 0, 1, 0, 13, 18, 12, 6, 2, 3, 10, -7, 2, 3, 0, 0, -1, -11, -6, -12, -9, -5, -4, -4, -12, -8, 1, 10, 1, 6, 0, 1, 3, 5, 8, 1, -6, 2, 2, 14, -7, 2, 6, 11, 1, 15, 9, -5, 13, 8, 14, 1, 4, 0, 13, 8, 9, -3, -3, 0, -7, 4, -8, 1, -13, -2, 3, 0, -1, -13, -3, -5, 0, 1, 6, 3, -5, 7, -4, 1, 9, 15, 10, 9, 4, 6, 6, 7, 8, 3, 10, 4, 13, -6, 11, 7, 9, 9, 1, 2, 4, 7, -2, -2, 4, -1, 2, -6, 5, -7, -13, 2, 3, 1, 6, -9, -1, -3, 6, 9, -2, 8, 4, 4, 5, 13, 12, 10, 7, 8, 9, 8, 5, 8, 9, 7, -9, -1, 7, -4, 1, 9, 4, 2, -1, -3, -4, 1, 0, -4, -8, 0, 1, -2, -6, 4, 6, 2, -5, 1, -3, -4, -8, -5, -1, 6, 3, -1, 10, 14, 10, 16, 18, 6, 7, 4, -2, -2, 11, 3, 6, -1, -11, -3, 4, 1, -13, 0, -11, -5, -2, 1, 2, -2, -5, 0, -1, -3, -1, -1, 7, -5, 2, -5, -3, -4, -1, 2, 3, -3, -3, 7, 5, 4, 20, 5, 22, 8, 6, 8, 10, 3, 2, -6, 4, 1, 6, -2, -9, -4, -5, 8, -2, -8, -11, -11, -6, 1, -3, 1, -12, -3, -1, -9, -1, 2, -3, 0, -3, 2, 5, 12, -3, 0, 4, -4, -1, -5, -2, 4, -3, -1, 0, 2, 6, 4, 1, 1, 1, 0, 3, -4, -7, 7, -4, -6, -4, -6, -9, 1, -7, -9, 3, 2, -5, -2, 4, -1, 9, -1, 5, 5, 11, 6, 17, 16, 16, -2, 5, 8, 8, 6, 1, -1, 9, -3, -7, -8, -14, 4, -3, 0, -3, -3, -1, 7, -2, 2, -10, -2, -9, 5, -5, 0, -3, -5, -8, 1, -4, -1, 0, -1, 5, -5, 1, -2, 4, 1, -4, 0, 4, 6, 5, -6, -2, 0, 1, 4, 4, 5, -13]
5370a3NlQqJ0nOj3J1ljlMLL%kJ%nQj3J3Ml%MmkJ1rjNl%mMqL%Kj0QnKJkorJ5pJ0
5422aKljOoJ0j0nRMJ0j2nPmmJkJ3KrJlkOn%pQOrJOnjMnJ%LKrOkLkRj4LQlOlR%
5477A4Oj8JKOklj4NKnRj4RJ2j4Mj0RRj9PMj0Nj%nL1k1oMLLj2J1k%mQpj%J0lpJ9
5524A5j1Jk%J0j8K0j7k%jJ4rlJoOll%jmjJ2JKj0J2%LmmJ7j8JnJ9j0oP%jj1RLM
5570GoPpM%J1qj1jPOprKjkj1J7Kj1MPkQnJNkjjKJPj5J1mjlJ0pKmlJ5k3RJKmqL
5621fKkOlrLPpQoQqLJ3j1NnJ1pJjMKlJ0pOpLOrPLpj0LMlpjMj1J5j6J1LKrJMkr
5673a1KJ5lrJ3%Kkj3Q%jJKkJ0j1jRrP%MqnQJmnMPj8qJ7kpJ4konJ0kQpjjLkNQ%
5724A3o%LnOokPnRj0PNjj1jlNnNn%KrJ4njlqKNJKoLlJ2qN%pJ2%lMmjJMoMpMMj4
$$ y = [-13, -8, -11, -3, -11, -1, -6, 0, -13, -2, -5, -6, -9, -5, -2, 1, 1, -1, 0, 0, -5, 3, -10, 3, 7, 4, 4, 8, 4, 2, 13, 4, 3, 8, 5, 5, 1, 5, -3, 0, 0, 2, -8, 0, -5, -3, -2, -4, -10, -19, -4, -11, -1, 1, -2, -3, 3, -3, 7, -3, -8, 1, 5, 15, 3, -2, 5, 1, -3, -2, -4, 9, 11, 2, 3, 0, -2, 4, -1, -1, -8, 0, 6, -3, -2, 4, -1, -2, 2, -3, -2, -2, 1, 3, -6, 0, -2, 1, -1, 8, -6, -3, 5, 2, 8, 5, 14, 14, 20, 2, 3, 5, 11, 9, 6, -8, -3, -1, -6, 3, -11, -2, 10, -4, 0, -10, -1, 8, -11, -4, 0, -10, -5, -6, -6, -11, 20, -1, -7, -3, 0, 3, -9, 2, 0, 0, -4, 4, -3, -4, -4, 6, 3, -4, 15, 4, 5, 3, 3, 13, -5, 15, -2, -4, -4, -5, 9, 0, -3, -2, -8, -2, -5, -8, -8, -9, -13, -14, -2, -1, 1, -9, 3, 3, 6, 2, -2, 15, -3, -2, -7, 12, 2, -4, 3, 3, 2, -9, 0, 3, 7, 1, 8, 1, 5, 5, 16, 8, -3, -4, 3, 9, 2, -7, -5, -6, -8, -19, -2, 0, -11, -7, 0, -2, 6, 1, 2, 7, 5, 4, 3, 5, 6, 13, -2, 9, 5, 4, 1, 11, 4, 6, 2, -1, 14, -9, 0, 1, 3, -1, -9, -6, -4, -6, 0, -3, -12, -9, -2, -9, -1, -7, 1, -7, -4, 9, -2, 3, -2, 9, 2, 3, 2, 6, 8, 5, 15, 8, 14, 7, 10, 16, 7, 14, 17, 10, 0, 3, 7, 4, -3, -4, 0, -11, 4, -12, -1, 2, 4, -5, -4, 0, -2, -11, -9, 6, 3, -6, 7, 7, 9, 7, -6, 2, 2, 1, 2, 4, 2, 12, 1, 0, 9, 0, 7, 7, 11, 3, -2, 6, 7, 3, -2, 2, 9, -9, -17, 0, -2, -9, 5, 3, -3, -8, 2, 0, 8, 1, 0, -1, 2, 0, 5, 13, 13, 7, 7, 10, 5, 11, 5, 3, 10, 5, 14, 4, 11, 16, 15, 4, 3, 0, 5, 0, 5, 0, 0, 2, -7, 7, 2, 1, -2, -10, -8, -3, -2, 0, -6, -3, -6, 6, -2, 3, 3, -4, 8, 8, 5, 9, 5, 4, 5, 9, 3, 7, 0, 4, 8, -6]
5779fOJ0lj3PrJ0ojOnmPp%Nkj0J8qklmPLPqQLlknQQllLk%OpLoJK%J0k1MOJj1j
5832fPpMjNLj2RPj7NOkpJ0jRplJ0j3JNNj0nJ0jOKnm%kNnlOnPj6J2j4J3nPj0Lj
5881eJOj0jJ2j5J3lK%KMk%nJ4pKqnQmllM%pJ6qoPOqJrOj0J0nJ1j5JkQJ5j4Jj2
5929a7J3jMPjlnKJNPpLjlmkNpPmrJRlOoLokNMpJ3j0NooNMK%kJ7j5JmlNMrRkMj
5984E%MJokklLj0%KKmNj0J3j3J0jRJj2MMjNj%%J0rJ1qLrJ0mk%pLj3J6lJ%nnJ1
6033CnmJ0pjjjjLpOlKlMmLlQKNoPo%%QkjQj6QjpKJ0LMl5K0lJOomJ1mj0j2RO%J
6086cpOJnKmlKJPkQPrkKNQrjlNMj1J2o%Kj4RrJ0%oJlJmmJ0lLOj5KMmkRoJ4j5K
6139gJ1konJ5ooNRj0J0qmMrORj4Pj0%RrmJ5%qmqJ4JpPL%J3k0kJ0Lj1J1lMjnJ3
$$ y = [-6, 0, 10, 7, -6, 1, -8, 2, -4, -5, 1, -4, -8, -1, -8, -8, -3, -5, -15, 3, -5, -7, -10, -14, -7, -4, 3, -5, 3, 6, 3, 1, -4, 4, 12, 9, 6, 9, 7, 7, 13, 6, 9, 3, 4, 6, 6, 16, -5, -1, 5, 6, -5, -6, 1, -6, -2, -3, 2, 5, -7, 2, 9, -8, -3, 3, 1, -6, 4, 3, 12, 5, 2, 12, -1, 0, 5, 10, 0, -5, 5, 4, 10, 12, 7, 3, 3, 1, 6, 1, -2, 4, -1, 6, -10, 2, -12, 1, -4, 3, -7, -4, -5, -4, 2, -8, -9, 3, -12, 1, -2, 0, 0, 2, 6, 4, 4, -1, 13, 6, 8, 0, -5, 3, -1, -4, -7, -3, -3, -10, 6, -2, -8, -1, 5, -3, -2, -11, -5, -15, -5, -10, 1, -14, -13, -15, -7, 8, -6, -5, -17, -4, -5, -1, 6, 5, 2, -3, -1, 0, 5, 12, 5, 8, 7, 4, 0, -2, 3, -4, 3, -1, -10, -9, 0, -3, 3, -3, 0, -6, -8, -3, 1, -6, 7, -3, 2, -4, -10, -5, -1, 1, 1, -1, 16, 1, 2, -2, -5, 0, 4, -5, 4, 2, 6, 5, 5, 9, 10, 4, 2, 0, -3, 0, -10, -10, -8, -6, -10, -5, -15, -2, -15, -5, -6, 3, 4, -8, -4, 0, -1, 4, 3, 3, 3, 13, 4, 15, 7, 10, 1, 11, 7, 5, 5, -2, 1, -12, 4, 1, 2, 2, -3, -8, 3, -2, -6, 4, -3, -4, -5, -6, -7, -4, -11, -5, -8, -6, -9, -5, -9, -6, -9, -1, 1, 6, 0, 7, 1, 1, 1, 9, 7, 6, 14, -2, 6, 5, -2, 0, 10, 13, 17, -18, 2, -1, 0, 6, 0, -4, 7, 3, -7, -19, -10, -4, -4, -3, -10, -4, -3, -8, -6, -10, -13, -11, -10, -3, -5, 3, 10, 1, -1, 1, 6, 14, 5, 4, 1, 6, 10, -1, 11, 5, 5, 7, -7, 2, -7, 3, 3, -3, -2, -5, -4, -8, -12, -2, -5, -2, 4, -11, -9, -5, -9, -11, -2, -8, 6, -9, -7, 4, 2, -4, -9, 6, 0, -6, -1, 8, -2, 8, 0, -4, 0, -9, -3, 6, -8, -1, -11, -11, -2, -11, -15, 0, 0, -8, -12, -20, -6, -5, -12, -5, -2, -2, 11, -9, -11, -1, 2, -9, 2, -1, 3, 2, -3, 10]
6186A0lkrP%LjKnKpPJ1j3Lj2RJqk%pJ0mJQlrjKlNNRoLPnJpQoJ2qnJ0l%KomQoL
6240DpQpJ1noLJMj3j%PmmLQkoKPpNkjlJJ2kPqOnPj4PMrLMplRoPjp%kKonlnRRM
6297Cj2%J3Nj0lNJ3mk0LJ5j3RJlQloKLnLLrOM%njoMQj8J1pPmlnlOJ0KqmPPlPj8
6348hQRooJ3jMj3lQkOj0QlLKj1J2mLk2QPQlpJ4j3Pno%NpKJkNlJ0kNoJ1njnMjk
6399FJrOKrkJ2pNqjRj1J3nmNLj7MNJj7QMoJ1nRj1J0j2J1%LLooJ7j1QPrPpklkQ
6448H%j3MknJKOmpKKlJ1mNj5%LMJ0oRj0j0J8LlOmklJ1j4OnO%mPj%Jkj4JNn%Jp
6499a1M%pJ1%oQ%mM%jRjj1NRMJkOj1JkJj0OOqNNj0JMoj1J6nJ8k1L%mJ1j0mM%L
6548@mjMolKJ2o%RJnKOoLMrkQpLjl%QpqjQmQpoNkJ%jrJ1MPqjJJLj1jORqKRj6J8
$$ y = [10, 7, 5, -4, 3, 3, 6, 5, 7, 2, 4, -3, 4, 15, 2, 5, -7, 2, 3, -5, -7, -7, -14, -4, -8, -7, 1, -2, -11, -12, -10, -13, -8, -3, 6, 0, 3, 10, 5, 6, -1, 7, 1, 13, 5, 0, 10, 7, 7, 9, 3, -1, 7, 1, 4, -3, 5, -2, 9, 4, -2, 1, 2, 6, -7, -8, -8, -1, -5, -9, -6, 2, 0, -6, -4, 3, -4, 1, -1, -2, -5, -4, 8, 6, 13, 5, 11, 6, 13, -1, 6, 10, 1, 4, 8, 1, -2, 7, 1, 8, 7, 0, 0, -2, 0, -6, -11, -14, -19, -10, -1, 3, -9, -9, 4, 9, -1, -4, 1, 14, 10, -10, -7, 8, -5, 4, 5, 2, 10, 7, 1, 3, 6, 1, 4, 7, -2, 4, 8, 8, 3, 2, -4, 0, 8, -10, 1, -6, 1, -3, -6, -11, -14, -8, 2, 4, -4, -8, -1, 6, 3, 10, -8, 0, 9, 3, -3, 10, 9, 13, 0, -3, 5, 3, 9, -1, 7, 4, 7, 9, -2, 10, 6, 9, -13, -5, 2, 10, 7, 0, 14, 1, 8, 3, -3, -3, 2, -5, -3, -2, -4, 1, -2, 8, 6, 11, 5, 16, 11, 10, 5, 9, 8, 6, 7, -2, 4, 6, -3, -5, 7, 0, 5, -3, -4, 5, -6, 7, 2, -2, 3, 6, -11, -7, -2, -1, -18, -10, -6, -12, -1, -6, 3, -8, 2, -10, 1, 1, 4, 7, 1, -5, 12, 1, 9, 16, 7, 14, 7, 5, 2, 0, 8, 8, -5, -1, -3, -8, -7, -5, 1, -3, -10, -8, -6, -9, 2, -2, 3, -12, -12, -9, -5, 5, -1, 8, -2, -12, 6, 9, 6, 12, 8, 6, 3, 14, 0, 6, 1, 7, 7, 3, 10, 9, 9, 10, 8, -6, -5, 0, -5, -5, -4, -11, -7, -7, -14, -3, -3, -9, -1, -1, -5, -1, -1, -2, 7, 6, -5, 0, 9, 13, 14, 12, 18, 7, 8, 6, 7, -3, 3, 9, 1, 6, 11, 1, 2, 6, 0, -11, 5, 0, 18, -3, 0, 0, -4, 7, -3, -7, -3, -3, 0, -4, -5, -1, -7, -10, -8, 4, -2, -2, 7, 8, 3, 5, 11, 5, 8, 12, 3, 1, 9, 2, 5, 4, 1, 1, 9, 2, -6, -7, 1, -3, 5, -2, -8, -3, -5, -4, -4, -5, -14, -3, 1, 8, 0, -1, 0, 1, 4, -7, -8, -2, 7, -1, 1, 10, -6, 12]
6605A2j5J3kmMqJ1k5L1j6OrJ3pnOmkKlOpMjrJ6%oQj5lJ2klQn%J5j5NmOjojJ0n
6652EoJ1knJqQj3J4lJj2J4pjJ5k1OJkMpQNj4JPmoPJOLPj4KKnJ0j1LQnOmpmOJO
6702HlkMj4PkokLMRnkJ1j0%pMOpJ2j5J1qJ3j3J4nmJ3ojllMNpJqjMOMoo%LJ1Jn
6752Gj2J0rQJlrJ0%Kp%MOpJQknNpJ0j0J0lJ0j2NrJJ9j4%j0%jlOpRpL%Rkj6R%J3
6801A1pK%qPNmPRj1Lj8J2Qj2OLonLOlKpLPj4rORJNj4J3j6PJ0j1JKnkOJnMLoOQ
6851A3oMkRj1JJ3j3Pj1ojjQnLKNnJj4NLLj5RJrR%Oj0J5oJpRoLLnJ5o%oQlRj1%
6901FJ2pmjJqNJNo%ljnjk%PqRJNj0Qj3lJ9j2LLQkkJoMmJ2krLOrLlNj1J1KkrN%
6954BOj5J0qMJRnj1RoLrMRNmlQjKNqNlolpOOJj0PKlojJ0jjnqOkRn%%mKkMllPJ
$$ y = [12, -3, 10, 8, 4, 8, 0, 11, -14, 17, 1, 7, -2, 11, 4, -1, 5, 1, -1, 1, -2, 4, -3, 1, 0, -9, 7, 7, 1, 9, -6, -9, 3, 1, -2, 6, 1, 1, 16, 1, 6, 2, 8, 7, 1, 0, 10, 5, -1, 10, 8, 3, 4, -4, 4, -9, 5, 2, 3, -9, 5, -2, -3, 12, -9, -3, -2, -4, 0, -7, 1, 6, -8, -7, 0, -4, -10, -3, -2, 4, 7, 14, 0, 2, 4, -1, 9, -2, 1, 9, 4, 10, 6, -1, -5, 1, 2, 8, 5, 3, 7, -7, 0, -2, -8, -10, -7, -3, 6, 1, -1, 10, 0, 0, -7, -3, 3, -4, 8, -7, 4, -4, 9, -4, 10, 5, 1, 14, 8, 7, 4, 1, 5, 10, 3, 4, -4, -5, -1, 5, 9, 3, -3, -3, 0, 11, 12, 7, -5, 5, -4, 4, 5, 2, -7, 3, 3, 5, -2, -2, 2, 8, 1, 2, 10, 8, 3, 8, 1, 11, 1, 11, 8, 18, 6, 11, 2, 3, 22, 8, 8, -2, -2, -3, -6, 0, -7, 2, -5, -2, -2, 7, 5, -11, -2, -2, 11, 4, 6, 6, -2, 5, 10, 6, 13, 22, 11, 14, -4, 8, 16, 4, 10, 13, 7, 2, 5, 11, 8, 10, 3, 6, 13, -1, -10, -4, 5, 6, 11, -3, 10, -6, 1, 11, 0, 1, 3, -2, -4, 2, 3, -2, 2, 5, -1, 5, 13, 7, 11, 9, 18, 7, 8, 21, 8, 15, 4, -2, -3, -4, 4, -1, 2, 4, 9, 4, 5, -9, -4, -1, 2, -13, -4, -3, -12, -3, -3, 3, -7, 8, 2, 3, -4, 5, -1, 2, 5, 0, 15, 9, 9, 3, 11, 8, 17, 6, 6, 18, 11, 7, 6, 7, -1, 4, 5, 10, 4, 4, 1, 0, -5, -6, -8, -8, -1, -9, 0, 1, 6, -4, 4, -9, -12, 7, -5, -2, 1, 9, 7, 5, 6, 0, 4, 0, 12, 10, 1, 4, 10, 1, 4, 1, 6, -5, 6, 8, 6, -3, 2, 2, 8, -7, 3, -5, -1, 0, 9, 4, -7, 2, -4, -1, -10, -6, 3, 8, 4, 1, 9, 8, 10, 15, 7, 12, 9, 3, 0, -7, -1, 5, 6, -4, 3, 5, 2, -4, -5, 5, 4, 3, -2, -10, -4, -6, 3, -2, -2, -2, -6, -4, -6, -2, -5, -8, -1, 0]
7010@JJkj2Oj4J7OnJ4j0JJ1mJJl%MqojNLj1PrjMMKmnJ0M%jjj1QLj5O%%J2OroK
7060AMmJ1oj0J2NmLkkJ%onpJ3qnKJ2j6RPj2LpJ3j7OPLnl%ONJkkOj0JJ9j5J%kJ5
7109A6j3Rj0OnqOMnj0J1oJpKlRlj1J1N%Kj1LQ%kJ1j0JNl%pRLmJ4j8NLrOjjm%q
7158iQK%Pj1%j0M%OKJlrJ3nlQqJ0jrLJJ0KmkLk%kLJJ0j3oRmLpQkNj0nQj2KjKK
7210eOLj4J1rLJ3j4OMjrJ2j1jLQk%MMkqRolKLMlm%Pmmj7OPqpLkJ6j1oRJKQLlo
7262cJPmNmNoNj1NLjlJ2ql%Qn%oNlj%QkpJlqmRMlkNmKjJ2j1J1JpPj2J2NrqJ1j
7315D%nMOj0MNj1kjRpMomRrRpKnJ7q%pQloQMpoMNmMlPJLjllJ0Mrj3J3Kj0N%j3
7368a2QoPj1RLpkKKjJL%j7J6J2j6PpJ1oOrjK0nj1J0qJRmkjRj2LJJPj5lL%m%J1
$$ y = [0, 1, 2, 0, -12, -6, -20, -3, 3, -2, 12, 2, 3, 14, 10, 11, 12, 9, 9, 13, 5, -1, -2, 3, 6, -5, 2, -7, -8, -4, 0, 2, -2, -7, 3, 7, 7, 6, 5, -6, 2, 5, -10, -4, -4, -4, 8, 14, 5, -1, 1, 5, 1, 12, 6, -4, 8, 13, 9, 12, 10, 8, 9, 9, 3, -2, -9, 4, -4, -9, -7, 5, -11, -2, 5, -7, -4, -11, 2, -15, -9, -2, 1, -4, -7, -7, -1, 4, 5, 3, 1, 7, -3, -2, 17, 2, 3, 3, 1, 16, 3, 12, 2, 8, 3, -5, 1, 5, 0, -10, 1, -5, -4, -11, -9, -12, -3, -6, -17, -6, -1, -1, 1, -10, -7, 1, 1, -1, 10, 0, 1, 6, 3, 3, -4, 5, 8, 4, 18, 0, 5, 8, -1, 5, 4, 3, -1, -1, -9, -1, 1, 1, 8, -3, -3, -13, -9, -9, -3, -1, 0, -3, -12, 1, -4, -7, 1, -7, 3, 2, -7, -4, -3, 7, 9, 5, 3, 6, 4, 4, 2, 5, 6, 16, 3, -3, 6, 2, 5, -2, 6, 4, 9, -1, -6, 2, -10, -8, -9, -7, -5, 1, 4, -10, 1, -8, -5, 8, -6, 0, 4, 3, -6, 6, -5, -6, -3, 5, 3, 3, 7, 11, 9, 1, 10, 4, 1, 3, 6, 10, 7, 3, 3, 10, 6, 2, -15, -9, -2, -10, -17, -14, -16, 0, -11, -17, -8, -7, -5, 3, 6, 3, -3, -2, 5, 1, 6, 2, 7, 1, 6, -5, 0, 3, 2, -1, 11, 3, 0, 0, 8, 3, 3, -3, 2, -1, -2, -2, 6, 4, -3, -2, -5, -13, -17, -8, -4, -7, -9, -4, -8, -6, -7, 5, -6, 5, 6, -1, 6, -6, 6, 11, 2, -6, 5, 4, 4, -1, 3, 9, -1, 3, 8, -3, -5, -6, 3, -4, 0, -6, -10, -1, -10, -1, -8, -6, -11, 6, -2, -2, -9, -1, -4, -10, -2, 2, -5, -11, -7, -2, -6, -2, -5, 2, 3, 6, 5, 2, -1, 9, 13, 4, -9, 4, 6, -4, 1, 1, -12, -4, -10, -3, -14, -5, -2, -9, -11, -9, -7, -8, -7, -4, -4, -21, -5, 7, -9, -2, -9, 2, -4, 2, -7, -8, 12, 7, -4, 6, -2, -1, 8, 4, 2, 1, 10, -2, 1, 2, 3, 10, -5, -8, -5, -5, -9, -9, 2]
7416BkJrNo%pPJ0j0KPkOkJRj1PmLp%jOmnJ8k0J2ml%NmnkLkJ2j9RMmJjnPmolQO
7469aj1J1joQMmJ%MoJ1j0J1Jj1pNkKkmJ5j0Jj1OrPOm%OpK%rJ4Nj1J7j7%MOmkl
7517eOrJ6J%pRq%oJJ3j6OjlPpkKKj3OJ4j2JLkoJ2kklKOj2J0KlKmLQlLlj3J2oP
7567FJj2MJ3nkj%oPj1Pn%rLmJ1rK%oQjKJKJjRonPKQlOj3%nJ0ojPrKMjmNnMj0j
7621iJ4j0K%LnmLNnnOlJ5qnNOj3KOJ2j4Qj5RQlolJQpNj6PjjNMn%oQj0LMlKnJJ
7673iJ4om%kJ5j8QKkjJQj0QPlJoLjlllJ0n%mrR%rJ6j1Pj1Rj1M%PNrJ0j7J6qOn
7722dlM%qLQ%OpJ0oj0NMnkMKnpQkLnMj3J8orRlqJ5Jj4K1j3Oj4J4lJOLj5MJ6lj0
7771@lmJ3LrLkOj5NkJ%kkJ0mjj0R%JKmJKj%KonJQmJ4j6RlLjJ1j3KJ3kj0J0mKN
$$ y = [2, 0, 1, -8, -3, -9, -9, -16, -9, 1, -9, -7, 0, -2, 4, 2, 3, 12, 1, 8, 4, 7, 0, 0, -1, 5, 1, -4, 14, -6, 6, 2, -1, -1, 4, 0, -5, -7, -4, -6, 6, -13, -4, 0, -4, -3, -4, -9, -2, -6, -12, -15, -7, -1, -12, -1, -2, -8, 0, 4, 0, 1, 1, 5, -1, 10, 0, 11, 12, 1, -6, -1, -3, -1, -3, -7, 8, -2, -1, -12, -6, -15, -8, -2, -6, -6, 0, -7, -5, -5, -14, 0, 5, -6, 11, -6, -6, -2, 4, 0, -2, -5, 1, -8, 8, 9, 9, 2, 11, 3, 3, -3, -2, 11, -5, 1, 0, -3, 4, -3, -5, -3, -1, -14, -8, 6, -6, -5, -2, -4, -10, 2, 0, -2, -5, -3, 3, -9, 1, 3, 0, 2, -2, 1, 9, 6, 9, 6, -7, 5, -1, 6, 7, -5, -1, 12, 7, 5, 4, 4, -2, 5, -6, 1, -4, -4, -13, -10, -14, -3, -12, -10, -10, -16, -8, -9, -7, -6, -4, -3, -4, 5, -1, -6, 1, 3, 11, 8, 14, 1, 1, -4, 6, 0, -1, 6, -3, -1, 3, 2, -2, 3, -2, 2, -8, -9, 5, -5, -3, -3, 0, -5, -9, -6, -1, -6, -11, -5, -8, 7, -1, -6, -1, 5, -8, -6, 0, 12, -2, 6, -9, 0, 8, 5, -1, -4, -3, 5, -2, 3, -13, -6, -7, -8, -3, 1, -4, -4, -10, -2, -12, -9, -5, -8, -6, -11, -10, -9, 5, -1, -5, -5, -7, 8, -10, -2, 0, -2, -3, -2, 6, -4, 4, 11, 8, 9, 3, 6, 5, 2, -1, -4, 6, 1, 1, -3, -12, -3, -3, -12, 4, -7, 0, -11, -2, -13, -9, -9, -2, 3, -6, 4, -13, 3, -5, 1, -4, -7, -3, -3, -11, -8, 0, 0, 6, -1, 9, 3, -7, -2, 2, -3, -5, -1, 1, -4, -11, -3, -5, -2, -7, -3, -16, 2, -4, -13, -4, -7, -15, 0, 1, -13, 8, -5, 1, -13, 1, -2, -1, 5, 8, -7, -3, 13, 10, 0, -3, -7, 6, 9, 0, 3, 1, 7, -8, -3, -5, -4, -4, -6, -8, 2, -2, -3, -13, -4, -4, -3, -1, -5, -4, -2, -3, -3, -1, -7, -12, -11, -3, -7, 7, -9, 0, -3, 0, -1, 10, -3, -1, 12, 10, 0, 10, 6, 8, 13]
7821A3jrqNPkjpoKO%j1J9j4OjOj4J1kJJJ2j4j%J0j9J7loJ3rnJ3rJ3%n%KnmPqK
7868BrNkKKkqJ1mjj0J7jj0QMkmLjjjNoJ0kKjqMlQ%kj2J%kRrqK3nj2J0kMJj1Qj5
7919a5JLMPqqJ0MnNkPmLRj2QJjj0%OnLJm%QojpQj3JkOqRJ%oJ0j0J4j4JJ0Nlj0
7969iNjQj1J0nOqLJKL%Jjj0OkMmlRnKoj1J3oJ3j4OkJ%MJ3j4JpLPoj1J5l%MkJ1
8018A0qKmNnjlj1J2J2%pOj1J4j0LkKLooJ5k1MjOp%NjKjlJ3Jj1LMJJOpRolNrKQ
8068A0qjj5J7rLJmOqRJqOmKmNooMnLKjPKKLnlLlJ0j2J3njJ3qQnmlJNjmpl%Mj2
8121a5J4M%j1OknPLkqQMLj0OPJj3QkLLjoL%J3j4LQj6OMqJ0j2KojLJ1nj0jlNNj4
8170a5J0J3jj4LQnQpPMqKqRmOokJ0R
$$ y = [13, 12, 3, -5, 0, 7, 5, 4, -3, -9, -7, -1, -1, -12, 7, -7, -1, -2, 4, -10, 1, -1, 0, 1, 13, -1, -2, -2, 8, -11, 6, 3, -3, 10, 1, -4, 9, 0, 13, 13, 8, 8, 10, 5, 1, 8, 0, 2, -7, -2, -4, -2, 0, -2, -10, 1, -3, -4, -14, 3, 2, -8, 0, 4, 2, -2, 1, 0, -1, -2, 3, -3, 7, 5, 7, 6, -2, 2, -1, 7, 7, 5, -7, -6, -6, -8, 1, -8, -16, 7, 2, -10, 0, -2, 2, 3, -8, 0, -15, -14, -11, -7, 0, -8, -16, -6, -2, -7, -2, -4, 3, -1, 2, 11, -1, 7, 8, 7, -3, -3, 3, -2, 1, 2, -2, -2, 6, 0, -1, -8, 0, -13, -12, -14, -8, -16, -7, -6, -6, -12, -2, -12, 2, -12, -11, -1, 4, 1, -9, -4, -5, 3, -8, 2, -3, 3, -5, -2, -1, 1, 4, 4, 5, 4, -6, 0, -2, 2, -2, -5, 4, -1, 1, -5, -16, -3, -9, 4, -10, -4, -6, -5, -5, -1, 12, -2, -1, -8, -5, 2, -4, -15, 0, -3, -3, 1, -1, 10, 2, 4, 0, 5, 0, -1, -4, -15, -3, 9, 9, 2, 8, -3, 11, 1, 4, 2, 4, 7, 1, -5, 10, -11, -7, -8, -2, -9, -9, -4, -5, -3, -4, -7, 6, 7, -4, -1, 3, 4, 5, 11, 4, 13, 7, 4, 9, 0, 2, 10, 2, 1, -14, 3, -6, -3, -2, -6, 0, -8, 1, 2, -6, 0, -4, -2, -6, -1, -7, -13, -9, -14, -11, -9, -10, -3, -1, 1, 4, -1, -4, -1, -4, 6, -6, 7, 2, 1, 14, 6, 14, 9, 5, 2, 3, 8, 7, 3, -4, -7, -7, -3, -15, -1, 3, 3, -8, -2, -4, -9, -2, 1, -1, -9, -1, 3, 6, -4, 2, 9, 10, -3, 5, 3, 6, 9, 8, 2, 5, 5, 18, 4, 7, 15, -1, 5, 9, 1, 11, -1, 1, -5, -6, -3, 8, 3, -7, -8, -11, -6, -1, -15, -5, 8, 7, -7, -4, 4, -1, 7, 0, 7, 11, 3, 5, -3, 6, 2, 8, 2, 0, 10, 19]
8191A9
##END NTUPLES=NMR FID
##END=
