##TITLE=1H_ES-aq-MeOH-c2
 
 8 sc, 
 14.1.2022
##JCAMPDX= 6.0         $$ Bruker NMR JCAMP-DX V2.0
##DATA TYPE= NMR FID
##DATA CLASS= NTUPLES
##ORIGIN= UXNMR, Bruker Analytische Messtechnik GmbH
##OWNER= root
$$ XWIN-NMR		Version 3.5
$$ Fri Jan 14 11:00:37 2022 Russian Standard Time (UT+4h)  she@DPX200
##.OBSERVE FREQUENCY= 200.131346
##.OBSERVE NUCLEUS= ^1H
##.DELAY= (6, 6)
##.ACQUISITION MODE= SIMULTANEOUS
##.ACQUISITION SCHEME= undefined
##.AVERAGES= 8
##.DIGITISER RES= 18
##SPECTROMETER/DATA SYSTEM= spect
##.PULSE SEQUENCE= zg30
##.SOLVENT NAME= D2O
##.SHIFT REFERENCE= (INTERNAL, D2O, 0, 15.7039)
##AUDIT TRAIL= $$ (NUMBER, WHEN, WHO, WHERE, WHAT)
$$ ##TITLE= Audit trail, XWIN-NMR		Version 3.5
$$ ##JCAMPDX= 5.01
$$ ##ORIGIN= Bruker BioSpin GmbH
$$ ##OWNER= she
$$ F:/spectra/data/she/nmr/H-F/1/audita.txt
$$ ##AUDIT TRAIL=  $$ (NUMBER, WHEN, WHO, WHERE, WHAT)
(   1,<2022-01-14 10:59:39.51 +0400>,<she>,<DPX200>,
      <created by zg, POWCHK disabled, PULCHK disabled
       configuration hash MD5:
       00 E9 B6 7A A2 85 ED C7 34 08 36 98 17 FE 4E 26
       data hash MD5: 16K
       D0 28 11 5E 0F 1A 94 6E 05 77 44 DF 0F 97 16 C1>)
$$ ##END=
$$ 
$$ hash MD5
$$ 39 FD 27 16 AF 76 0D B2 5C CD 6A 83 4E CE E6 DF
##$RELAX= 
##$RELAX= 
##$RELAX= 
##$RELAX= 
##$RELAX= 
##$RELAX= 
$$ Bruker specific parameters
$$ --------------------------
##$DU= <F:/spectra>
##$EXPNO= 1
##$NAME= <H-F>
##$PROCNO= 1
##$TYPE= <nmr>
##$USER= <she>
##$AMP= (0..31)
100 100 100 100 100 100 100 100 100 100 100 100 100 100 100 100 100 100 
100 100 100 100 100 100 100 100 100 100 100 100 100 100 
##$AQSEQ= 0
##$AQ_mod= 1
##$AUNM= <au_zg>
##$AUTOPOS= <>
##$BF1= 200.13
##$BF2= 200.13
##$BF3= 200.13
##$BF4= 200.13
##$BF5= 200.13
##$BF6= 200.13
##$BF7= 200.13
##$BF8= 200.13
##$BYTORDA= 1
##$CFDGTYP= 0
##$CFRGTYP= 5
##$CHEMSTR= <none>
##$CNST= (0..31)
1 1 145 1 1 1 1 1 1 1 1 1 1 1 1 1 1 1 1 1 1 1 1 1 1 1 1 1 1 1 1 1 
##$CPDPRG= <>
##$CPDPRG1= <>
##$CPDPRG2= <>
##$CPDPRG3= <>
##$CPDPRG4= <mlev>
##$CPDPRG5= <mlev>
##$CPDPRG6= <mlev>
##$CPDPRG7= <mlev>
##$CPDPRG8= <mlev>
##$CPDPRGB= <>
##$CPDPRGT= <>
##$D= (0..31)
0 1.2 0 0 0 0 0 0 0 0.06 0 0.03 0 0 0 0 0.0002 0 0 0 0 0 0 0 0 0 0 0 0 
0 0 0 
##$DATE= 1642143578
##$DBL= (0..7)
120 120 120 120 120 120 120 120 
##$DBP= (0..7)
150 150 150 150 150 150 150 150 
##$DBP07= 0
##$DBPNAM0= <>
##$DBPNAM1= <>
##$DBPNAM2= <>
##$DBPNAM3= <>
##$DBPNAM4= <>
##$DBPNAM5= <>
##$DBPNAM6= <>
##$DBPNAM7= <>
##$DBPOAL= (0..7)
0.5 0.5 0.5 0.5 0.5 0.5 0.5 0.5 
##$DBPOFFS= (0..7)
0 0 0 0 0 0 0 0 
##$DE= 6
##$DECBNUC= <off>
##$DECIM= 32
##$DECNUC= <off>
##$DECSTAT= 4
##$DIGMOD= 1
##$DIGTYP= 9
##$DL= (0..7)
0 120 120 120 120 120 120 120 
##$DP= (0..7)
150 150 150 150 150 150 150 150 
##$DP07= 0
##$DPNAME0= <>
##$DPNAME1= <>
##$DPNAME2= <>
##$DPNAME3= <>
##$DPNAME4= <>
##$DPNAME5= <>
##$DPNAME6= <>
##$DPNAME7= <>
##$DPOAL= (0..7)
0.5 0.5 0.5 0.5 0.5 0.5 0.5 0.5 
##$DPOFFS= (0..7)
0 0 0 0 0 0 0 0 
##$DQDMODE= 0
##$DR= 18
##$DS= 0
##$DSLIST= <SSSSSSSSSSSSSSS>
$$ [...]
##$SUBNAM2= <"">
##$SUBNAM3= <"">
##$SUBNAM4= <"">
##$SUBNAM5= <"">
##$SUBNAM6= <"">
##$SUBNAM7= <"">
##$SUBNAM8= <"">
##$SUBNAM9= <"">
##$SW= 18.0517287032376
##$SWIBOX= (0..15)
0 0 2 0 0 0 0 0 0 0 0 0 0 0 0 0 
##$SW_h= 3612.71676300578
##$TD= 16384
##$TD0= 1
##$TE= 0
##$TE2= 300
##$TE3= 300
##$TEG= 300
##$TL= (0..7)
0 120 120 120 120 120 120 120 
##$TP= (0..7)
150 150 150 150 150 150 150 150 
##$TP07= 0
##$TPNAME0= <>
##$TPNAME1= <>
##$TPNAME2= <>
##$TPNAME3= <>
##$TPNAME4= <>
##$TPNAME5= <>
##$TPNAME6= <>
##$TPNAME7= <>
##$TPOAL= (0..7)
0.5 0.5 0.5 0.5 0.5 0.5 0.5 0.5 
##$TPOFFS= (0..7)
0 0 0 0 0 0 0 0 
##$TUNHIN= 0
##$TUNHOUT= 0
##$TUNXOUT= 0
##$USERA1= <user>
##$USERA2= <user>
##$USERA3= <user>
##$USERA4= <user>
##$USERA5= <user>
##$V9= 5
##$VALIST= <valist>
##$VCLIST= <CCCCCCCCCCCCCCC>
##$VD= 0
##$VDLIST= <DDDDDDDDDDDDDDD>
##$VPLIST= <PPPPPPPPPPPPPPP>
##$VTLIST= <TTTTTTTTTTTTTTT>
##$WBST= 1024
##$WBSW= 4
##$XGAIN= (0..3)
0 0 0 0 
##$XL= 0
##$YL= 0
##$YMAX_a= 325565
##$YMIN_a= -341911
##$ZGOPTNS= <>
##$ZL1= 120
##$ZL2= 120
##$ZL3= 120
##$ZL4= 120
##$ABSF1= 10
##$ABSF2= 0
##$ABSG= 5
##$ABSL= 3
##$ALPHA= 0
##$AQORDER= 0
##$ASSFAC= 0
##$ASSFACI= 0
##$ASSFACX= 0
##$ASSWID= 0
##$AUNMP= <proc_1d>
##$AZFE= 0.1
##$AZFW= 0.1
##$BCFW= 1
##$BC_mod= 2
##$BYTORDP= 1
##$COROFFS= 0
##$CY= 11.3945322036743
##$DATMOD= 1
##$DC= 2
##$DFILT= <>
##$DTYPP= 0
##$F1P= 2.36226072786647
##$F2P= -0.459571619588291
##$FCOR= 0.5
##$FTSIZE= 0
##$FT_mod= 4
##$GAMMA= 1
##$GB= 0.15
##$INTBC= 1
##$INTSCL= 1
##$ISEN= 128
##$LB= 0.24
##$LEV0= 0
##$LPBIN= 0
##$MAXI= 10000
##$MC2= 0
##$MEAN= 0
##$ME_mod= 0
##$MI= 1.114404
##$NCOEF= 0
##$NC_proc= 0
##$NLEV= 6
##$NOISF1= 3.799351
##$NOISF2= 2.8
##$NSP= 1
##$NTH_PI= 0
##$NZP= 0
##$OFFSET= 15.70392
##$PC= 1
##$PHC0= -15947
##$PHC1= 7.80079
##$PH_mod= 1
##$PKNL= yes
##$PPARMOD= 0
##$PSCAL= 0
##$PSIGN= 0
##$REVERSE= no
##$SF= 200.130013532006
##$SI= 16384
##$SIGF1= 3
##$SIGF2= 2
##$SINO= 400
##$SIOLD= 16384
##$SREGLST= <1H.CDCl3>
##$SSB= 0
##$STSI= 0
##$STSR= 0
##$SW_p= 3612.71676300578
##$SYMM= 0
##$S_DEV= 0
##$TDeff= 0
##$TDoff= 0
##$TI= <>
##$TILT= no
##$TM1= 0
##$TM2= 0
##$TOPLEV= 0
##$USERP1= <user>
##$USERP2= <user>
##$USERP3= <user>
##$USERP4= <user>
##$USERP5= <user>
##$WDW= 1
##$XDIM= 8192
##$YMAX_p= 0
##$YMIN_p= 0
$$ End of Bruker specific parameters
$$ ---------------------------------
##NTUPLES= NMR FID
##VAR_NAME=  TIME,          FID/REAL,        FID/IMAG
##SYMBOL=    X,             R,               I
##VAR_TYPE=  INDEPENDENT,   DEPENDENT,       DEPENDENT
##VAR_FORM=  AFFN,          ASDF,            ASDF
##VAR_DIM=   8192,          8192,            8192
##UNITS=     SECONDS,       ARBITRARY UNITS, ARBITRARY UNITS
##FACTOR=    0.0002768,     1,               1
##FIRST=     0,             0,               0
##LAST=      2.2672688,     0,               0
##MIN=       0,             -341911,         0
##MAX=       2.2672688,     325565,          0
$$ Real data points
##PAGE= N=1
##DATA TABLE= (X++(R..R)), XYDATA
0@%%%%%%%%%%%%%%%%%qJ6j6J6j6J6k1K9l2L6m4M8n3O1o9P7q5R8j13J28j42J57
39H3j75J92k13K34k58K86l14L46l79M17m61N08n60O18o80P54q40R35j046J183
59F30j346J543j795K123k568L206m192N880r285J8579q8034k66652K88979K97324
73B44392j87944j83384J75214M6977k63333J610L72879M6494m00670j17769L38455
84G2921J19232k54321m3866K29518m6379k68191Q2958L14835o6712l14201M7677
95a26529K73377o8149k38100J14181K38457j43555k52976J37344K41918j24683
105E1285j96299J44284J52468j96772j49019K39154J80405k32698j98114J87600
115a7706J62886j56566q8379J79856L0229k42158k9297K86568O9794k72195r5334
$$ y = [0, 0, 0, 0, 0, 0, 0, 0, 0, 0, 0, 0, 0, 0, 0, 0, 0, 0, -8, 8, -8, 8, -8, 8, -13, 16, -16, 20, -24, 24, -29, 32, -37, 40, -45, 53, -60, 68, -74, 83, -92, 100, -113, 121, -137, 149, -165, 181, -198, 219, -242, 266, -294, 324, -356, 398, -442, 493, -553, 630, -716, 827, -968, 1155, -1413, 1793, -2399, 3481, -5804, 12775, -75259, -341911, -52932, 244392, 56448, -126936, 48278, 95255, -168078, -166468, 206411, 252905, -147765, -265534, 72921, 192153, -62168, -106034, 123484, 77105, -191086, -108128, 206707, 139995, -174206, -126529, 146848, 78699, -159401, -45220, 193237, 49682, -203294, -65950, 175968, 51285, -145014, -730, 151738, -45034, -194053, 45101, 225506, -7192, -205306, -17706, 145180, -11386, -99765, 80091, 110320, -131838, -161135, 125433, 195227, -76968, -172302]
126a72302K15019O5610j70131M235J76365o1604k19898O9901K52129m2089k39771
137a22536K2494J95031m0372j57807Q4139J52870j18874j68591J24877J75012
147A46243j14529j57762J13445J30245j30572j14184J50998J13513j56392j11574
157a30569J47776R2702j43734o2299J57811M1215j81131m1513J90921N1496j76040
168e3365m7043J50509J7537j39791K1543J54283m3846j77958L9044J84485k3287
179H2111j63761K2492J31603m6468j13263Q0310J18268j00336j32776R7695J35160
190A11035q5137j17640Q2252R1848r5641p4926J14709P2072j24966p3551J23077
201B3132O7326j18080n2080J19609L6546j27096k8117J31967K4265j28694j6479
$$ y = [-172302, 42717, 108327, -61804, -57569, 118796, 57192, -162706, -92805, 159324, 117235, -122536, -100042, 94989, 54617, -103190, -19051, 133819, 14945, -153646, -28769, 146243, 31714, -126048, -12603, 117642, -12930, -127114, 23884, 137397, -18995, -130569, 17207, 109909, -33825, -96124, 61687, 102902, -78229, -119742, 71179, 122675, -53365, -100408, 50101, 67638, -72153, -50610, 103673, 59827, -118131, -79087, 105398, 82111, -81650, -59158, 72445, 25977, -87286, -6976, 111292, 10956, -121820, -24125, 111035, 25898, -91742, -9490, 82358, -13283, -88209, 26500, 98572, -26394, -99945, 23132, 90458, -27622, -79702, 39907, 76453, -50643, -78760, 53207, 77472, -51222, -67701]
212f7701J21718R50j19959J6177J25881k5531j31945K5555J28391k4859j14459
223f5782L3526R9725n1951r4654O9976R9650p6979j04428P2599R8513o7043q1637
235f8485P0730O3665q4052n4643R7773N5135j02600n6645R8055N0740r1925l7043
247e9295R1677K2542r7534j3577J03384R937j04037o316J00176j214r6533J1386
259c9404R5908j9983r6360K5207R4088k9653q8345L6848Q2423m6615p9761N4959
271a0688P9639n8478p7557N8421P0141n9664n9142O5717M9853p4691m5895Q1108
283A8764M5447q1420m3005P7448L5045p4661k3379P6645J3222q1802q018Q5335
295C9621O273q4057l639P9321k732p5074J1637P3818j9651p4446K4762P3978k7993
$$ y = [-67701, 54017, 54967, -64992, -48815, 77066, 51535, -80410, -54855, 73536, 48677, -65782, -32256, 67469, 15518, -79136, -9160, 90490, 13511, -90917, -18318, 80195, 13152, -68485, 2245, 65910, -18142, -72785, 24988, 80123, -22477, -79122, 18933, 69673, -22252, -59295, 32382, 54924, -42610, -56187, 47197, 57134, -46903, -53219, 46957, 45743, -50790, -39404, 56504, 36521, -59839, -34632, 59456, 29803, -58542, -21694, 60729, 14114, -65647, -10688, 68951, 10473, -67084, -8663, 61478, 1814, -57328, 8389, 58242, -16449, -62344, 18764, 64211, -17209, -60214, 17234, 52279, -22382, -45761, 30884, 44106, -37696, -45714, 39621, 45894, -38163, -41802, 37519, 34787, -40287, -28650, 45168, 25517, -48929, -24167, 49811, 21818]
308B1818p0990L1864O6549l7245o2715M2892N9942m7123n6821M9958N2062n2939
320b748m6207N7130M1062o1622l7575O4356L4596o4508k9938O3524K2915o3805
332b2820j5171O6088R260o8723o007O9178L702o6645J60O2825o405o0289J3465
345b1382N9925j8963o0272K2011N9161k3922n5801K6695N1370l1040m7629L5941
357c906M5183l9881m3123M2427M0213m4334l6244M6555L1960m9131k8079N1312
369A2952K4456n2567k0418N3267J5676n4109j0879N5274O795n6007l508N5455
381B6387K20n3698L960N1741q954n0567J3659N0116j7030m9342J9169M7237k1154
394A1744m3883K4037M0330k7768l7672L1394L5908l3925l4111L5330L1399l6409
$$ y = [21818, -49172, -17308, 49241, 11996, -50719, -7827, 52115, 4992, -51829, -1871, 50191, -2748, -48955, 8175, 49237, -12385, -49960, 14396, 48992, -15516, -45454, 18070, 40985, -22820, -37991, 28097, 37357, -31366, -37373, 31805, 35507, -31138, -30978, 31847, 25442, -34847, -21382, 38543, 19580, -40692, -18681, 40480, 16558, -39243, -12548, 38822, 7782, -39847, -3906, 41277, 1396, -41727, 700, 40913, -3421, -39665, 6890, 38850, -10281, -38360, 12952, 37408, -15159, -35577, 17690, 33366, -20743, -31622, 23652, 30447, -25560, -29068, 26387, 26607, -27091, -23131, 28610, 19656, -30911, -17252, 32864, 15834, -33508, -14339, 32898, 11744, -32139, -8102, 32228, 4460, -33212, -1818, 34090, 165, -33946, 1384, 32783, -3626]
406c626k7758L8009K3896m0148k0497M2149J7618m3489j4719M4136J1392m4515
418a7552p712M4923M073m5210o98M5036k589m4351O055M3412r636m2522J2932
431a3839M1575j5618m0180J7915L8065k0269l5491K2968L3011k5748l0983K8077
443e17K9157k9576k6993L0499K4183l1481k0919L2857J7819l4481j5194L5746
455A1100J2948l6379j0537L6481P669l6494m467L6690J330l6976J494L6998m106
468A5751l6576O727L5794r460l4842J2200L3786j4740l2522J7039L0968j9246
480D879k9146K1394K7272k3379k5409K5022K3465k6254k1244K7219J8738k8199
492e642j6138K9257J3707l0173j1566L0704R493l0798p223L0660M663l0556k058
$$ y = [-3626, -31384, 6625, 30521, -9627, -30124, 12025, 29643, -13846, -28565, 15571, 26963, -17552, -25264, 19659, 23732, -21478, -22176, 22860, 20271, -24080, -18025, 25387, 15751, -26771, -13839, 27736, 12118, -28062, -10147, 27918, 7649, -27842, -4874, 28137, 2389, -28594, -517, 28640, -936, -27929, 2570, 26753, -4728, -25647, 7210, 25029, -9452, -24646, 11100, 24048, -12331, -22868, 13613, 21282, -15212, -19679, 17011, 18341, -18635, -17141, 19857, 15751, -20825, -14098, 21696, 12236, -22606, -10406, 23380, 8640, -23882, -6843, 24125, 4879, -24267, -2873, 24399, 1020, -24389, 633, 24098, -2156, -23400, 3819, 22557, -5642, -21780, 7477, 21184, -8989, -20555, 10149, 19642, -11156, -18379, 12281, 16944, -13612, -15670]
505a5670L0620l84l0644K536L0409m566k9789O667K8945q964k8027J1296K7125
518A9554j3475k6156J5428K4983j7210k3551J8918K1917k0518k0199K1982J8407
530B0080k3214j6510K4255J4480k5126j2415K5836J0391k6364q404K6604O402
542A6015k6569m345K6431K202k6246j52K6043j717k5723L438K5147n123k4356
555a4955O871K3495q696k2650J0472K1849j2103k0925J3531J9850j4904j8566
567a6731J6259J7181j7627j5713J8870J4275j9962j2777K0865J1146k1582r438
579a5234K2179P662k2622n887K2897M107k2968k337K2876O09k2685J083K2340
592A2020k674k1851M173K1203n642k0418P072J9609q468j8783R753J7936j0921
$$ y = [-15670, 14950, 14566, -16078, -13542, 16867, 12301, -17488, -10821, 18124, 9160, -18867, -7571, 19554, 6079, -20077, -4649, 20334, 3124, -20427, -1509, 20408, -110, -20309, 1673, 20080, -3134, -19644, 4611, 19091, -6035, -18450, 7386, 17777, -8587, -16991, 9613, 16015, -10554, -14899, 11532, 13734, -12512, -12664, 13379, 11662, -14061, -10623, 14524, 9401, -14955, -8084, 15411, 6715, -15935, -5463, 16386, 4283, -16642, -3111, 16739, 1835, -16731, -472, 16709, -918, -16631, 2239, 16514, -3448, -16225, 4640, 15786, -5796, -15234, 6945, 14607, -8015, -13902, 8995, 13102, -9866, -12203, 10673, 11282, -11403, -10320, 12020, 9346, -12505, -8332, 12871, 7229, -13189, -6117, 13492, 5024, -13759, -4006, 13930, 3009]
605C009j6974J1985J5901j3022j4737J4066J3539j5086j2345J6019J1140j6835
617c340r861J7516Q468j8085p024J8613N523j9040m023J9332K520j9458j040J9433
631I534m25j9280J910J8974l330j8552M681J7998n949j7351P161J6599q267j5791
645a2088R291J4903j0200j3947J1029J2942j1798j1899J2536J0840j3214r785
657a1390J3785Q730j4303p581J4725O407j5120n197J5486L961j5771k760J5990
670F962J535j6075k97J6028r53j5933K244J5720l482j5405M640J5008n759j4462
684a0229O801J3826p790j3099Q681J2316r489j1454J0200J0560j0831r633J1371
697A230Q671j1813p706J2182O723j2475n722J2703M713j2901l708J3053K708j3133
$$ y = [3009, -13965, -1980, 13921, 899, -13838, 228, 13767, -1319, -13664, 2355, 13495, -3340, -13201, 4315, 12783, -5302, -12326, 6287, 11810, -7230, -11253, 8079, 10599, -8859, -9899, 9534, 9109, -10171, -8261, 10713, 7383, -11169, -6488, 11510, 5561, -11790, -4629, 11970, 3703, -12088, -2797, 12106, 1906, -12041, -1012, 11930, 132, -11767, 769, 11609, -1605, -11390, 2395, 11125, -3178, -10759, 3966, 10373, -4747, -9944, 5542, 9503, -6268, -9028, 6962, 8497, -7578, -7875, 8153, 7200, -8733, -6489, 9231, 5749, -9656, -5016, 9992, 4233, -10229, -3428, 10398, 2608, -10491, -1810, 10506, 1017, -10437, -237, 10323, -508, -10141, 1230, 9901, -1912, -9618, 2564, 9287, -3188, -8910, 3793, 8506, -4395, -8103, 4950, 7658, -5475]
711e475j723J3156P38j3121K67J3028j304j2875K319J2675l302j2423M270J2077
725H307n210j1637O121J1113o977j0524P788R881q528r163R161Q399r720p572
739h561J0171O740j0559n865J0846M968j1029m097J1149L247j1216k385J1210
752D619J549j1148p46J1036o8j0884Q76J0682j648j0469K429J0204l185r897L925
767b725R553m659r141N364Q701o056q215O720P677p333p088P881O467q396n759
782g009Q802N044r154m305R431L559r627k805R740K043r781j290R731N72r634
797d683J34R467q06r255J455R007k070q722K662Q405l223q055L763P684m283p289
813e809M792O882n292o450N769N970o215n468O639M935p023m374P379L777p684
$$ y = [-5475, -7198, 5958, 6696, -6425, -6158, 6870, 5566, -7309, -4990, 7685, 4383, -8040, -3770, 8307, 3097, -8540, -2419, 8694, 1717, -8807, -1019, 8862, 334, -8829, 332, 8731, -989, -8561, 1610, 8350, -2209, -8074, 2772, 7740, -3289, -7386, 3763, 7010, -4206, -6591, 4619, 6168, -4980, -5726, 5310, 5242, -5642, -4766, 5916, 4268, -6201, -3772, 6432, 3247, -6650, -2725, 6828, 2169, -6972, -1608, 7093, 1037, -7178, -458, 7219, -114, -7202, 679, 7146, -1250, -7009, 1793, 6837, -2317, -6622, 2809, 6368, -3259, -6064, 3676, 5719, -4062, -5352, 4379, 4951, -4683, -4549, 4918, 4112, -5143, -3688, 5319, 3249, -5473, -2811, 5594, 2371, -5684, -1921, 5763, 1480, -5809, -1017, 5865, 573, -5877, -108, 5862, -353, -5821, 818, 5753, -1270, -5644, 1735, 5512, -2172]
828b172l170P941K539q146j885Q291J201q332n58Q338r6q263P21Q125j310p948
844d724J878P706k410p416K901P097l362o754L796O371m172n987M541N577m876
859A66n154N193M707n463m273N736L825o014l321O218K833o426k337O630J784
874D104o749j259O860P19o944j45O957m19o925R73O839j511o699K041O498k518
890A822o271K979N977l379n679L776N329m107m963M395M587m656m175M865L761
905D261n049l361N224K945n354k527N457K118n564j689N647J257n716q16N761
920B594L53n770R5N760n50n734J031N645j486n536J945N378k378n185K804M949
936C915l189m695L563M395l893m053M156L729m412l347M586K989m759k577M844
$$ y = [-2172, -5342, 2599, 5138, -3008, -4893, 3398, 4599, -3733, -4291, 4047, 3951, -4312, -3591, 4534, 3224, -4724, -2846, 4860, 2450, -4966, -2065, 5032, 1670, -5084, -1288, 5083, 911, -5076, -535, 5042, 166, -4988, 205, 4912, -551, -4824, 912, 4737, -1277, -4598, 1620, 4453, -1973, -4310, 2320, 4104, -2645, -3904, 2956, 3675, -3269, -3414, 3543, 3124, -3801, -2828, 4011, 2500, -4199, -2158, 4340, 1822, -4449, -1470, 4507, 1128, -4551, -775, 4554, 447, -4516, -121, 4466, -190, -4365, 500, 4261, -788, -4149, 1075, 4020, -1334, -3861, 1596, 3714, -1850, -3539, 2108, 3365, -2351, -3167, 2594, 2947, -2823, -2728, 3032, 2482, -3252, -2221, 3424, 1938, -3598, -1653, 3725, 1347, -3838, -1034, 3915, 726, -3969, -406, 3989, 96, -3957, 199, 3928, -484, -3831, 755, 3744, -1015, -3592, 1252]
951A252K203m934j818M989J439m998j091M998P19m980l36M911lm880L72M809p21
968A931m718J072M621j434m483J774M359k140m185K482L987k807l767L128L509
983C329l421l228L687K938l934k607M113K303m280j961M400J598m479j247M513
998A724R06m523n72M498K48m438O1M357l54m262O40M156r29m015J181L894j458
1015A114l737J711L583j952l426K211L228k449l030K697K806k921k578L138K326
1030B721l344k054L531J766l692j458L802J166l915q37L962N17l989k02L972r2
1046A854l937L97L846o60l761R23L651j171l512J395L362j595l190J781L022j969
1062D36k828K130K656k298k461K445K257k580k067K743J840k886j596L003J355
$$ y = [1252, 3455, -1479, -3297, 1692, 3131, -1867, -2958, 2040, 2759, -2221, -2557, 2354, 2351, -2529, -2157, 2652, 1931, -2787, -1715, 2906, 1472, -3011, -1237, 3122, 982, -3203, -721, 3266, 459, -3308, -180, 3329, -92, -3320, 367, 3305, -629, -3236, 877, 3180, -1100, -3061, 1339, 2937, -1542, -2789, 1724, 2630, -1893, -2465, 2033, 2281, -2157, -2096, 2261, 1907, -2355, -1715, 2441, 1512, -2503, -1322, 2572, 1114, -2623, -912, 2671, 719, -2707, -496, 2732, 283, -2747, -50, 2756, -165, -2743, 395, 2721, -623, -2677, 854, 2620, -1072, -2530, 1272, 2438, -1477, -2314, 1648, 2165, -1824, -2026, 1946, 1854, -2083, -1686, 2160, 1500, -2261, -1338, 2313, 1142, -2370, -975, 2387, 792, -2398, -617, 2405, 436, -2392, -262, 2394, 96, -2365, 80, 2337, -243, -2310, 433, 2273, -613, -2209, 794, 2149]
1077B149l127j099L222Q35l295n76L366K86l385j6L398k84l369N65L324q28l252
1094b086J073L146j296l026J527K880j711k728J896K542k036k364K163K180k277
1109a17j982K365J788k451j596K527J406k602j210K658J002k714p92K771N61k790
1125a176l46K824J10k839J39K817l68k813O14K762q46k698J065K629j281k538
1141a945J505K406j683k265J856K111k015j932K149J737k244j565K322J386k383
1156e60j188K422J005k444q30K457O46k463m66K450K95k446j17K423n5k409K39
1173a041K367l99k351O19K273p97k215R95K125j161k052J351J942j516j812J680
1189HJ679j836j523J950J373k069j201K153J019k212q41K266O50k276m92K276
$$ y = [2149, -978, -2077, 1145, 1980, -1315, -1891, 1475, 1761, -1624, -1640, 1758, 1474, -1895, -1330, 1994, 1166, -2086, -1013, 2133, 837, -2189, -662, 2218, 507, -2221, -325, 2217, 181, -2183, -20, 2160, -117, -2099, 266, 2054, -397, -1993, 534, 1940, -662, -1872, 786, 1788, -926, -1718, 1053, 1614, -1176, -1522, 1302, 1412, -1427, -1288, 1529, 1161, -1652, -1038, 1724, 878, -1820, -755, 1874, 593, -1945, -440, 1966, 283, -1982, -126, 1985, -30, -1962, 187, 1924, -320, -1885, 437, 1823, -560, -1748, 674, 1679, -765, -1595, 862, 1508, -955, -1421, 1029, 1324, -1122, -1239, 1184, 1129, -1280, -1041, 1326, 927, -1424, -805, 1468, 671, -1544, -549, 1576, 415, -1637, -286, 1656, 140, -1672, 8, 1687, -149, -1672, 278, 1651, -418, -1619, 534, 1553, -659, -1500, 766, 1416, -860, -1352, 924]
1205I24L33k271j68K243J4k213J47K155k78k108M27K033n50j977O82J909q03j843
1223a344R49J752j068j660J195J562j326j447J447J338j577j203J672J063j756
1238d03r24J852P69j938o00J982M45k030k67K030J12k025L2K011j88j974L30J928
1256A142m60j863N75J798o90j713P85J639q93j538R64J460j043j366J130J271
1272A198j205j177J284J073j361r66J433Q54j500p30J558O03j632m58J668L10
1288I52j698j64J726K3j743J34J725k75j704M17J660n32j612O51J561p77j478
1305a134Q73J384r45j310J030J213j079j123J135J045j207r37J232Q39j258p48
1321i90J306O49j341n41J353M45j389l34J416K25j436j02J439j5j453J36J444
$$ y = [924, 1257, -1014, -1182, 1061, 1075, -1138, -991, 1164, 886, -1222, -795, 1238, 688, -1289, -607, 1302, 499, -1344, -395, 1357, 289, -1371, -176, 1386, 60, -1387, 60, 1398, -179, -1382, 290, 1353, -403, -1327, 525, 1294, -644, -1244, 738, 1183, -847, -1114, 916, 1028, -997, -965, 1046, 858, -1116, -786, 1142, 682, -1181, -606, 1192, 502, -1211, -426, 1213, 320, -1218, -254, 1206, 163, -1203, -73, 1198, -7, -1184, 100, 1173, -188, -1154, 279, 1133, -367, -1097, 461, 1064, -568, -1026, 642, 952, -746, -910, 816, 839, -904, -770, 955, 680, -1024, -607, 1053, 521, -1091, -440, 1121, 344, -1134, -261, 1123, 178, -1132, -102, 1111, 32, -1091, 44, 1089, -118, -1055, 177, 1016, -242, -990, 316, 965, -376, -917, 436, 881, -508, -842, 574, 799, -637, -739, 700, 685, -768, -632, 812]
1338H12k70j415L93J390n18j347O33J301p46j236Q54J159r32j089J012J004j083
1355g8r03J125Q26j180p18J198O36j220n53J228M62j240l68J244K83j239k09J241
1373E35J04j222k4J224p4j205J57J195k54j170L52J147m63j104N57J068o52j019
1391h48P55R42q30q84R09Q15r88p29J058O33j090n51J121M68j147l85J174K78
1409G01j167j97J165J25j166l9J131k1j119R5J085j66j054K30J036l04r93L58
1427c00R69m12r45M94Q84n59q31O24P87o97p32P74O66q33n95Q95N08r44m25R80
1447C08L56j018k69J039J73j041j05J059J1j043M9J044j28j019K00R78k61r49
1465f16L15R13l61q64M12Q21m39q05N07P48n45p00N64O74o14o24O65N68p23m90
$$ y = [812, 542, -873, -480, 910, 392, -955, -322, 979, 233, -1003, -149, 1010, 78, -1011, 1, 1005, -78, -981, 144, 970, -210, -928, 270, 906, -314, -867, 361, 823, -417, -785, 459, 742, -497, -706, 535, 639, -583, -607, 617, 543, -662, -505, 690, 436, -734, -382, 765, 302, -802, -245, 823, 171, -848, -93, 849, 19, -865, 44, 859, -129, -858, 200, 833, -257, -808, 313, 781, -366, -751, 423, 701, -466, -663, 502, 627, -539, -578, 553, 532, -587, -492, 593, 427, -627, -397, 639, 335, -658, -300, 669, 257, -688, -194, 690, 131, -700, -76, 711, 14, -718, 56, 722, -111, -706, 189, 697, -247, -672, 308, 664, -354, -623, 416, 589, -452, -557, 502, 513, -530, -481, 563, 435, -584, -384, 594, 333, -616, -301, 612, 251, -613, -201, 620, 181, -624, -117, 631, 86, -614, -50, 624, 10, -614, 51, 619, -104, -594]
1485e94P48M44q09l53Q36K82q67k14Q82J39r05o0R15k2r06R1R06j65q87K29Q79
1506E69l21q38L73P98m21p65M83P16n16o73N49O33n67n84N81N41o24m92O41M48
1526E31o53l99O79L55p12k92P23K28p33j77P47J20p70m6P67k8p65Q8P79j66p57
1547d81K26P52k99p23L62O81m20o44M78O05n18n52N54N12n87m66O09M25o18l95
1567d99O44L31o42k85O40K51o60k01O69J52o69j11O65N6o57j8O56j8o58Q3O39
1588C68j31o37J96O23k74n84L15N75l72n37M22N03m68m69N11M29n52l73N69L25
1608D39n87k80O21K04o00j87O24J38o30r6O27N0o09k5O14k7n99N9N74q4n66J25
1630b15N62j70n34J97N25k45n05K88M79l25m42L60M05l90l77M36L36m59l04N02
$$ y = [-594, 154, 598, -211, -564, 272, 554, -313, -527, 355, 494, -411, -471, 444, 422, -484, -393, 513, 348, -539, -310, 569, 248, -590, -217, 581, 160, -605, -122, 594, 78, -595, -46, 587, 20, -564, 17, 558, -66, -558, 83, 531, -122, -521, 158, 513, -199, -491, 232, 460, -273, -450, 297, 417, -353, -399, 368, 340, -425, -337, 442, 276, -481, -255, 497, 198, -525, -163, 518, 98, -546, -68, 537, 19, -533, 21, 533, -54, -520, 89, 514, -104, -499, 145, 476, -166, -451, 189, 440, -220, -421, 248, 400, -269, -380, 285, 341, -316, -334, 322, 304, -354, -271, 368, 237, -400, -204, 419, 145, -439, -124, 451, 79, -458, -36, 467, -1, -470, 41, 470, -82, -455, 114, 439, -148, -428, 193, 397, -203, -390, 234, 372, -258, -354, 273, 323, -286, -311, 303, 276, -323, -264, 310, 226, -340, -215, 347, 177, -357, -160, 365, 120, -385, -97, 382, 57, -385, -25, 380, -10, -387, 49, 385, -74, -378, 124]
1650A24K62n40k09N48J67n70j04N57O9n74j5N65rn78P0N49r7n43J15N33j54m95
1672c29J70M87k11m48K18M54k58m30K91L91l03l66L31L44l59l12L80K78l99k42
1692c13M15K13m45j68M63J15m80q1N01L3n08J9N09n8n07R2M91j18m99J85M48j99
1714A08m29K21M16k48l96K79L76k93l51L06L33l41k84L30K72l48k50L69K28l82
1734h4j92L84J63l94j35M02R8m11n8M16K3m30K1M18n1m24R6M13j20m21J73L92
1756B79k08l70K39L65k64l40K88L10l15k87L38K46l36k21L37K15l56j80L63J71
1776B74l88j26L69J10l65r8L73O4l78k8L67J3l77J9L77n6l65R3L48j18l47J52
1798h7L31j78l27K16L05k49k81K68K82l12k25L20J92l25j88L59J53l67j22L62
$$ y = [124, 386, -154, -363, 185, 352, -218, -322, 235, 304, -270, -285, 280, 271, -307, -237, 312, 215, -328, -213, 320, 166, -329, -159, 328, 117, -331, -113, 341, 83, -347, -56, 335, 32, -334, -3, 341, -18, -330, 50, 328, -71, -313, 102, 315, -130, -298, 165, 280, -200, -281, 220, 253, -255, -236, 273, 215, -292, -200, 291, 173, -326, -141, 307, 108, -321, -100, 316, 68, -328, -49, 327, 34, -317, -11, 322, -19, -303, 27, 299, -49, -299, 70, 298, -84, -276, 108, 271, -123, -258, 144, 242, -169, -227, 189, 212, -218, -197, 221, 170, -254, -158, 255, 135, -286, -113, 279, 71, -299, -60, 305, 41, -299, -11, 299, -16, -303, 35, 281, -55, -276, 61, 276, -80, -260, 103, 274, -114, -240, 129, 239, -126, -224, 149, 213, -165, -193, 174, 187, -190, -171, 206, 150, -215, -122, 226, 108, -239, -87, 244, 66, -261, -45, 260, 11, -270, -2, 280, -32, -257, 63, 255, -70, -258, 101, 254, -113, -235, 127]
1818A27J11l70q6L70N6l67l0L62ll58K2L40k2l44N5L34q2l15Q9L11j19k83J35
1841f7K66j46k88J96K65k12k36K30K14k47j97K73J75k99j42L12J02k95j02L24
1861A26N8l34k2L24J1l26J9L09k9l22O1L07p6l06R8K96j13k78J23K63j44k47J49
1884e3K42j50k37J76K14j89k01K07J75k07j75K46J39k47j20K59R6k70o6K68N3
1905A60k95j1K97k3k86M0K84n7k79P6K62r5k64J25K41j24k41J46K28j66k09J72
1927a9J95j79j80J80J81j98j56K12J34k05j34K14J24k24j00K27Q8k26o8K34L3
1948A33k40k3K51nk43L4K19l1k50P4K39r4k28J18K08j42j95J49K07j91j64J88
1970A4J55j87j50K08J21j90j35K15J13k18r1K13O5k00o5K08M9k20l4K19K0j98
$$ y = [127, 238, -132, -218, 152, 208, -159, -189, 173, 170, -188, -166, 174, 152, -192, -137, 197, 115, -200, -111, 200, 81, -202, -67, 199, 53, -235, -39, 226, 14, -222, 8, 222, -25, -222, 51, 226, -73, -215, 97, 199, -96, -198, 126, 184, -150, -172, 152, 163, -163, -144, 165, 136, -186, -125, 182, 106, -200, -102, 194, 81, -197, -74, 189, 45, -202, -53, 189, 39, -198, -22, 192, 3, -198, 9, 184, -23, -198, 48, 187, -60, -180, 79, 175, -95, -161, 107, 160, -135, -146, 151, 128, -158, -118, 166, 109, -170, -94, 168, 73, -191, -66, 175, 51, -190, -44, 184, 18, -191, -19, 176, -3, -183, -3, 178, -20, -176, 36, 170, -35, -169, 45, 169, -55, -155, 72, 160, -66, -134, 100, 133, -107, -130, 121, 116, -127, -93, 126, 95, -155, -81, 158, 64, -164, -46, 162, 20, -175, -26, 181, -10, -174, 14, 169, -18, -168, 40, 161, -29, -164, 51, 164, -54, -145, 68, 133, -67, -132, 76, 125, -95, -129, 90, 110, -88]
1992h8k2K19j1k13K7K01m1k10P1J98q1k00J06J76j03j67J29J54j50j47J75J13
2014A36j71j14J94R5j87q7J99O7j99n2K01M0k03l3J94L3k11LJ95rj88LJ92j4j91
2039a07L7J76m7j80O6J68o5j77R1J52q9j48J14J39j36j27J52J22j63r3J57P5j64
2062d7p9K00N3j99k7J90K7k07OJ88j3j89K4J73l3j70L6J74m5j80P3J53n6j66P6
2087c8J41p1j56J03J33j04j23J05J27j25j01J25R2j31q5J40P3j45o3J59M9j64
2109e9l6J65K7j74NJ64j5j79L6J65m5j64N6J57p0j39P5J38r4j25Q7J37j14j09
2133a11J05J20j09j05J11R9j25r1J26P2j24n7J25O0j38n0J37M5j46j2J19K6j42
2156f5kJ38pj49K9J36l7j40M9J34o1j36Q1J42j05j16J11J06j21r3J07R7j15p9
$$ y = [-88, -110, 109, 98, -115, -88, 113, 72, -138, -67, 131, 50, -150, -44, 132, 29, -138, -9, 145, -5, -152, 23, 136, -35, -149, 45, 140, -47, -134, 65, 132, -67, -119, 82, 122, -81, -114, 80, 113, -98, -95, 100, 91, -97, -94, 98, 84, -107, -70, 106, 59, -121, -55, 113, 48, -129, -38, 114, 25, -123, -9, 130, -6, -133, 19, 141, -22, -115, 42, 117, -47, -126, 74, 127, -72, -99, 91, 118, -89, -83, 105, 92, -97, -73, 100, 67, -103, -67, 107, 62, -118, -45, 108, 52, -114, -38, 103, 32, -124, -21, 112, 8, -115, -10, 117, -8, -109, 16, 108, -23, -108, 32, 105, -40, -103, 56, 105, -59, -95, 70, 97, -77, -72, 92, 77, -102, -66, 99, 54, -110, -54, 103, 33, -106, -31, 107, 13, -112, -25, 112, -2, -111, -6, 114, 5, -100, 11, 110, -15, -106, 20, 92, -32, -89, 36, 96, -42, -92, 45, 90, -56, -68, 51, 77, -65, -67, 71, 64, -85, -56, 80, 43, -97, -48, 86, 25, -111, -30, 112, 7, -109, 2, 108, -13, -106, 1, 98, -17, -96]
2180i6J22O5j14o9J19O4j19n9J24N1j37l1J28K3j27j2J09L1j38MJ30mj46K6J27
2205G1m2j24N1J25n7j28Q7J06q6j01R2R4j03p5J03O9r9o7J15N5j14n7J32M1j38
2230e0l0J34J7j24j6J27J4j32J2J16j0j32K3J17k1j11L0J01l4j13N1R6l7j05O0
2255a7R5p2q3Q7O8q7p3R7N6r8n2J12M4j22j6J07K5j25KJ11nj18QJ19k2j11K6J05
2283F1j7j18L5J11m6j00M7R3l7j08O1Q6n9q6O3Q7o3q5P9O4o5p7P9P4j02l6R1L0
2311F2r0l4J01J8j14J0J05j4j00J7R5j1j02K5J00m4r3M8R7n6r2N5Q5o7o6O0O7
2338F2n8o9P0O8p1o3P7L8o7l9Q3K9p5l7Q1K3q3k3Q6K4r1qR2%r3JR6j0r2K4Q0l8
2370A7q3L2R9n1q6O8O2o3o9Q5N5p6n8Q8L7p6l0O4M1p0m1P1L4o7l9Q4K2o9l1Q3
$$ y = [-96, 26, 91, -23, -92, 27, 91, -28, -87, 37, 88, -49, -80, 48, 71, -56, -68, 41, 72, -66, -62, 68, 64, -82, -56, 71, 29, -95, -44, 81, 24, -104, -17, 89, 3, -98, -6, 88, -15, -90, 13, 82, -17, -84, 31, 86, -28, -85, 47, 88, -50, -80, 54, 71, -53, -69, 58, 72, -60, -48, 68, 58, -74, -51, 66, 45, -66, -36, 65, 31, -82, -31, 65, 28, -77, -17, 78, 6, -77, 10, 78, -9, -82, 15, 71, -27, -79, 33, 77, -45, -61, 46, 71, -54, -52, 59, 54, -64, -56, 63, 41, -70, -44, 61, 44, -74, -39, 72, 26, -74, -27, 66, 29, -79, -18, 68, 9, -77, -14, 73, 10, -75, 4, 68, 3, -74, 5, 79, -23, -59, 32, 62, -28, -62, 39, 57, -57, -47, 58, 44, -56, -39, 56, 45, -57, -32, 68, 24, -69, -21, 76, 20, -72, -17, 68, 1, -65, -5, 62, 4, -65, 5, 73, 2, -61, 16, 54, -13, -52, 31, 60, -15, -52, 29, 52, -31, -54, 32, 56, -35, -43, 49, 49, -44, -43, 53, 43, -49, -25, 55, 17, -66, -34, 65, 14, -72, -4, 58, -5, -74, 11, 66, -10, -68, 20, 57, -19, -49, 15, 56, -14, -55, 16, 50, -17, -56, 28, 50, -19, -50, 33]
2400C3K6r3rQ0%q1J1P1j0q1J6P4k1o5L4N3l3p1O4M2m3n0M6N5o8l8P9K7o6k9O6
2431A9K7o5k1P8Qq2nP1J0p0rP4Jo4rP0Kp3oQ7k1p4L0N5k1o6L0O8l4n1K5O4n3m6
2465e1N5L9n6m0P1L0o9k8P5J2o1k4Q1Oo8lO5%o9PO0%o7J2O4k2n7J4O7l8m3K2N4
2498C8k8n7K7N6l0m3K7N9m3m9N1L6m5l7N2K3m8j4N1J6n3k0N3J0n9pO7no2J7N6
2529C9j6n2J2N6k9n3K3N8l5l9K7N3m6n3M7L6k9m7M5L6l6m0L9L6l5l8M7L0n0j9
2559c3N4J8n4j6N3J3p3J3M6J3o8J3M2On8J9M0m2k9K5M8l4m0L5M9m5l0L7K5l7k8
2590c8M5K3m3k5M8J5l2l7N0K0l9j6M1J2l8j7N2%n6PN4nn3J1M7j0n0J6M4j5n1K0
2622b0M1j6m5K7K9k3l0L5K3k7l2M4K3m2k6L1L5m9jL4J0l4l2N4K1n6%N6j2m9NN3
$$ y = [33, 59, -34, -43, 37, 37, -44, -33, 38, 28, -53, -37, 37, 16, -49, -15, 38, 5, -66, -2, 40, -3, -53, -7, 48, -20, -58, 21, 48, -18, -47, 19, 46, -19, -40, 38, 46, -36, -41, 30, 40, -30, -39, 35, 36, -28, -37, 33, 35, -38, -44, 43, 22, -52, -22, 33, 12, -54, -24, 44, 10, -41, -16, 48, -5, -51, 4, 43, -13, -53, 18, 48, -21, -49, 26, 38, -23, -47, 34, 40, -28, -31, 34, 34, -35, -28, 32, 32, -35, -23, 41, 19, -38, -24, 43, 5, -38, -16, 38, 10, -47, -20, 36, 6, -37, -10, 49, 6, -43, 8, 44, -1, -38, 14, 37, -11, -25, 26, 42, -11, -31, 22, 32, -27, -34, 33, 28, -34, -17, 39, 23, -29, -17, 39, 10, -43, -20, 38, 3, -36, -9, 44, -2, -55, -8, 28, -1, -48, -3, 33, -3, -43, -4, 32, -3, -41, 6, 36, -14, -33, 21, 39, -15, -31, 22, 35, -38, -25, 21, 34, -34, -21, 21, 27, -31, -12, 28, -14, -43, -18, 30, -4, -44, -9, 40, -5, -35, 2, 27, -10, -38, 7, 30, -13, -38, 10, 25, -7, -44, 6, 26, -13, -29, 12, 24, -14, -31, 21, 21, -35, -28, 26, 21, -32, -21, 26, 16, -34, -18, 26, 11, -40, -20, 21, 5, -40, -13, 16, -7, -37, -2, 21, -6, -38, 6, 29, -13, -39, -8, 27, -22, -23, 11, 21, -13, -45, 9, 30, -26, -26, 30, 18, -31, -26, 27]
2654B7qm2QL0%m7NN4j5m6K4M1l0m1K4L8l7j9K6M1n2j4M1K2l9j0L2Om0JM1Pm8L
2688a7L6jm1J7L2j0n2K0M6l1l5J7K9Km1RM8l0l3K3L3k5k4J9L5k8k8L1K3k2l0L8
2720A0J9m2j5M4J2n0LM0Lm7J5J9Jl6J5K8j1l4PN2k7n1L9J9j3k4K0K8l8k0K8J8
2752A2nm0L7K3l3k1L7J7n4JM0%k4j6L5Nl4JL1Qm3J0K9kl3LL2j3l5K4K2rl2J7K6
2787A6j5k8K5K2k1k9L0J7l3j2L4%oj7K4Jj4j3K0K5m1j1K9J8m0%L2Ol6NK4pl0J6
2821iK2j2k7J7L0k7k3K8J8k4k0J5K3k6nJ8J7l4KJ7J2k1j0L1Rk8rK6Ql8RJ0J0k7
2855a8NK3mk4%L2j7l0J4K9k0j6J5K7k1k0K2J7k0j2J6J4j5k6L1J0k4lL2lk3LJ8
2888A2Kk7mL2%k5PK7j4k3MJ6kj2NK0j8k0J2K1rl0K2J0j0k0K6Nkk3K1J7k9k2L8
$$ y = [27, 19, -23, -15, 15, 15, -32, -27, 27, 12, -34, -10, 31, 1, -40, -16, 22, -15, -34, -8, 33, -19, -33, 8, 30, -9, -19, 13, 19, -21, -20, 21, 28, -20, -17, 19, 18, -23, -6, 26, 16, -36, -16, 30, -1, -36, -19, 10, 12, -29, -20, 28, -2, -35, -12, 21, -4, -28, -9, 26, -2, -30, 1, 24, 2, -28, 10, 29, -13, -28, 16, 28, -22, -19, 21, 24, -23, -8, 11, 12, -24, -9, 19, 8, -26, -19, 33, 6, -45, -6, 13, 0, -24, -4, 24, -14, -34, -6, 12, 7, -33, 4, 27, -6, -27, 10, 27, -27, -26, 14, 14, -10, -26, 9, 14, -20, -19, 12, 20, -23, -13, 16, 14, -19, -16, 16, 3, -32, -8, 14, 5, -27, -10, 16, 1, -27, -2, 20, -1, -30, 0, 17, -16, -28, 6, 6, 0, -17, 7, 8, -6, -19, 1, 26, -15, -26, 3, 21, -19, -19, 13, 19, -17, -12, 12, 5, -25, -9, 13, 1, -26, -9, 21, -6, -29, -1, 17, -7, -27, -12, 11, -15, -20, -2, 15, -19, -17, 0, 12, -9, -19, 12, 21, -7, -16, 10, 18, -20, -11, -1, 9, -18, -13, 10, 6, -18, -18, 14, -3, -33, -19, 10, -10, -26, -11, 16, -5, -25, -3, 14, -6, -18, -2, 12, -3, -29, 2, 12, -12, -15, 17, 14, -9, -6, 12, 14, -13, -17, 15, 15, -10, -3, 24, 10, -13, -9, 7, 5, -7, -2, 18, 0, -20, -8, 13, 4, -26, -4, 6, -4, -24, 2, 7, 5, -18, 3, 20, -9, -31, 7]
2923GJ2l5oL4Ok1mJ4Mk0KL1j1k1KK2ok1RJ3kk5J0L0k9pJ7J2j3k2J9J0j0k4M0n
2959A2j6j1K1%qj2K7Jk0j2K9J0k6pK6ok3OJ7nk1J2L6k9j3J5Opk0K5Nj3j7J2J2
2994Fnk0K0J8k9qJ7J2k2kJ9J3k6oK7qqoK1kk4LK1qj4QK7k2j7MJ9j1j7K0J9j2l2
3031b5L2Mj6lJ5J3k9j2L0kk2PJ5Lj1j1J8Nj3nJ4jk1J3K2j5k3J6J6oj5mK0lk0J
3067a3L1Lm2K5Omk1J1J0j7qK4Ok0qK5lj6jK4kj8kJ8Jj6nJ9lj6J3J6qk6J1J8oj6
3105a0PJ1j3j3J9J8j6k0J1J8j1%NQj2j8J7Pk9J5J1Lj0L%Nj6J0J0Lj7%J6rj4J4
3141CQJl2J4K4j5j8J5RppPRk6jJ4J1k5nJ8Plj5K1Lnj4J4Kj9kK9j0k1J0J2Lk3n
3180a9L1qj5J2KMj6RRmj7QK1ml4J8Qj2oOQlj3K0Jj4KRPj2jLJ5k9J3P%rqL2j3o
$$ y = [7, 19, -16, -22, 12, 18, -3, -7, 7, 11, -9, -7, 24, 13, -8, -6, 16, 10, -11, -2, 11, 9, -16, -6, 24, -5, -12, 5, 17, 4, -18, 1, 11, 1, -23, 17, 12, -4, -15, 6, 6, -2, -14, 13, 14, -6, -18, 11, 21, -5, -12, 14, 8, -15, -9, 8, 3, -18, -6, 30, 1, -12, 3, 9, 2, -18, 7, 12, -1, -18, -6, 6, 1, -19, 1, 19, -10, -18, -1, 11, -11, -13, 6, 19, -7, -13, 14, 6, -2, -8, 13, 11, -13, -10, 11, 3, -11, -3, 24, 2, -15, -11, 8, -3, -20, 0, 19, 7, -25, 7, 11, -5, -8, 7, 20, -9, -21, 9, 7, -15, -8, 7, 10, -1, -12, 6, 11, -2, -7, 7, 6, -15, -2, 20, 5, -18, -2, 14, 8, -7, -11, 9, 6, -14, -13, 18, 21, -21, 4, 10, 6, -15, -4, 6, -11, -19, 5, 11, -9, -17, 8, 5, -11, -12, 12, 10, -8, -10, 8, 9, -7, -12, 7, 4, -12, 1, 17, 9, -17, -6, 12, 6, -10, -3, 8, -5, -18, 1, 19, 3, -17, -6, 12, 1, 1, 6, 14, 2, -16, 1, 8, -21, -6, 5, 8, -2, 1, 1, 6, -10, 0, 10, 13, -4, -4, 12, 3, -11, 3, 11, 12, -20, -6, 18, 3, -15, 0, 9, 2, -5, 2, 11, -15, -16, -2, 9, -16, -21, -3, 4, 1, -14, 7, 10, 5, -9, 5, 7, -12, -14, 15, 5, -16, -6, 6, 9, -14, -19, 12, 4, -11, 1, 3, 7, -9, 0, 9, 5, -12, -4, 17, 13, -21, -3, 5, -7, -13, -7, 1, -2, -15, 5, 6, -8, -6, 3, 10, -2, -3, 0, 15, -14, -1, 6, 6, -3, -11, 21, 8, 2]
3222BKRJk6J2J0rnLJ8j6j3RK1l2PMJ0j2mQNj4nJ9Ok6NJ6Nk1RJ1j0j2JJ1lmlJ7
3263FJ3k7RK6k0nJJ0j2j6OJ8j0j3K4k%j8NK2k6pJ7Rj9oJ2LnJPNj7MJ2lj2J0kN
3303Ej0J0Mlm%MMj5PJ0%j5J1Lj0j0NJ3Nk1RJ0j6pJ8rqjJ4Mj2jQjolRLrqJ7Ok8
3347a8J5J0j1rJ1Rqj3J2J6j2j0J2Oj7JJ2Nk2qJ7jkjNPk0RRJljOQk9PJ3Jnk1K7
3388Hrj1NJ6j0j8J9Pj4JMJ0j5nJ3Pj2j3J9J1k8QJ1Mpj4QKj1LK2j2j2LJ3nl%J2
3427Gqj0J8jpj7QK1pj1J4Nrk1K3jkk3K3Qj4KnPkpK4nj9OKRj8J0J0Mj5pJ8Mk4L
3469gRRk3J0Oj%pJ6j0JjK2k6j3K2oj0NJJ3j5%JRqjJ4oj1QPjj1rJ2kLrLLqJ0J4
3513A3ppOMj4kmJ1J1j8%J6nj1jMPj3NJ0qN%oJ3j3OJj7J3PQk3NJ3mqPRrj0J1ok
$$ y = [2, 4, 13, 14, -12, 0, 10, 1, -4, -1, 17, 1, -12, -3, 18, -14, -7, -3, 7, -5, -9, -1, 4, -10, -15, 4, 10, -16, -11, 5, 10, -11, -2, 9, -1, -13, -12, -1, -4, -8, -11, 6, 19, -8, 1, 27, 7, 2, 3, 13, 1, -15, -9, 9, -1, -14, 10, 8, 8, -10, -5, 17, -9, -16, 1, 10, -9, -15, -3, 0, -5, -4, 3, 8, -9, -5, 7, 4, -8, 2, 0, 5, -5, 5, 9, 6, 2, 2, 6, 10, -5, 2, 12, 12, -3, 8, 11, 1, -9, -4, 9, 14, -7, 2, 12, -4, -11, 7, -2, -10, -11, 3, 7, -5, -6, 2, 1, -5, -8, 1, 4, -5, -13, 4, 10, -18, -3, 7, -4, -13, -2, 7, -1, -14, -2, 14, 2, -8, 4, 10, -7, -6, 6, 11, -11, -19, -2, -3, -5, -6, -1, 6, -14, -5, 4, 5, 2, 1, 7, 15, -14, -7, 6, 7, 2, -19, 8, -1, -12, -7, 9, -1, -19, 0, 7, -7, -6, -2, 8, -7, -12, 1, 8, -4, -17, 2, 13, -15, -7, 4, 8, 1, -13, -5, -3, -14, -11, 11, -1, -13, -10, 3, -2, -5, -5, 7, -1, -11, 7, 6, -1, -18, -10, 11, 4, -7, 7, 12, 3, -18, 5, 4, 2, -21, 2, 10, -4, -2, -7, 0, -2, -9, 15, 10, -9, -3, -1, 8, -10, 0, 10, 14, -1, -8, 10, 14, -10, -7, 2, 11, -12, -2, 4, 3, 3, -4, 12, 2, 3, 2, 24, -2, -15, 7, 1, -9, -4, -3, 10, -5, -5, -4, 5, -3, -4, 10, 4, -7, 1, 8, 7, -4, -13, -1, -3, 0, -9, -6, -3, -11, -1, 13, 6, -1, 5, 9, -5, -7, -11, 0, 11, -7, -7, 9, 4, -7, -8, -4, 3, -10, -5, 5, -3, 2, 2, -4, 9, -4, 2, 3, -14, -1, 6, 14, -9, -4, 9, 5, -3, 4, 13, 4, -6, 5, -1, -3]
3557cjJ2Poj4jJ6j3oJ1%qmlLJ8k3J0MNrPRj9kJ8mj1MJ1Jk9J3J0jllO%%kMJj7Q
3602dJKj1NJ1j5jQJLj2J6J1k2J4%Nk1LPJrj0J9Oj8OMj1J5kjJoPjNj6J5Nj0joJ5
3646IlllNj8MJ7qpqJ5Oj7LJ3Kj8mK0mmjJ0jj6MQjj0Pj%lJ2mOj1n%J4j2rJ7qmO
3692eNlmjQlnnJ7kj2J0Rj4NJRj1%KnmJ0qRlOlnPl%pJ3j4J0jrONqjLJ2j7K%J0r
3741clJ1komOOj0MrJ0qPNLj6QJ0lroJ9j1KJ6j4Kjj4J4%j1QJpnJJ6j0KrRq%OK2
3787A9j9mPOnmkJ1pJJJpPJJj2K%lPlKjJJNj6jJ4pPj4RRmj4LJ7j2nJnJ4pMl%nO
3837cJ0j1KOj0KLLlmjJ3j7lJ2J5j3j1J1kMnqJ2j1KJ3mpqMMNlNllqKPnpJ2mJPj1
3884a0PnJ3nmJJJ4j3Oj0J2mnoJ7j5jRJ0j0knmRj1jJ6j0%NNnoLJ5j0Rk4J9j4mJ4
$$ y = [-3, -4, 8, 15, 9, -5, -6, 10, -3, -9, 2, 2, -6, -10, -13, -10, 8, -15, -5, -1, 4, -5, 2, 11, -8, -10, 8, 4, -7, -3, 8, 9, -20, -7, 3, 2, -1, -4, 2, 2, 2, 0, 4, 5, -12, -4, -3, -1, -12, -7, 4, -11, -12, -4, -3, 0, -12, 4, 15, -7, 7, 7, 12, -9, -6, 1, 2, -7, -17, 2, 8, -10, -4, 0, -11, 4, 2, 1, 2, -4, 3, 2, 7, -9, 6, 11, 1, 0, -6, 9, 6, 3, 0, 5, -13, -9, 8, 0, -7, -15, 0, 6, -11, -8, 5, 7, -11, -15, 5, 1, -3, -4, 6, 5, -11, -7, 1, 0, -10, -3, -4, -4, -7, 5, 1, 7, -4, -9, -9, 5, -7, -16, 1, -7, -11, -5, 0, -3, -7, -8, 0, -3, -8, -13, 4, 2, -10, 0, 9, -5, 0, 1, 10, -1, -1, 1, -4, -8, 2, -6, 3, 0, 6, 3, -2, 5, 2, 2, -5, 8, -6, 4, 3, -6, 0, 5, -3, -4, -1, 11, -6, -4, -4, 6, -3, -6, 5, 3, -3, -7, -1, 5, -5, -1, -10, 0, -8, -1, 4, 7, -9, -1, 9, 6, -3, -9, 10, -1, 1, 17, 3, 5, 4, -10, 4, 4, -7, 1, 2, -5, -10, -9, 7, -3, -1, -10, -1, -9, -9, -3, 19, 0, -4, 3, 9, 4, 0, -2, 9, 2, 3, 4, 5, -2, 5, 6, 7, -5, -3, -3, -6, 1, -2, 0, -1, 0, 1, 6, -10, -11, 3, -4, 3, -11, -2, 7, 3, -11, -8, 9, -3, -8, -7, -12, 2, -5, -1, -4, -4, -9, -3, 7, -4, -2, 4, -6, -4, -1, 2, -1, -5, -6, 7, -10, -13, -1, 14, 1, -10, 1, -1, 3, -2, -10, 2, -9, -7, 6, 2, -5, -13, -9, -5, 0, -3, 2, -1, -4, -12, -10, -3, -8, -15, -3, -7, -6, 1, -10, -3, -8, 5, 0, -4, -3, -2, 12, -1, 5, -5, 7, 3, -2, -8, 9, -6, -7, 2, 12, 2, 0, -5, -9, 0, -11, -12, 4, -6, -6, -1, 4, -1, -7, -4, 11, 1, 10, -14, 5, -9, -13, 1]
3927AJrLNQj3KPj0jjRqjOJ6k0%JLn%J1qj0JJ3jnONJpmMLqQKJrj2J7pKmkMNnLR
3979Gj5LJ0kj6J8j7J8j3J3kj5NlkR%NqLlkJ2nrMOpQ%kllMjqQNJmLjpoQLjOKj5
4029iJ0qKLQn%j2KMQrmNKQrNmKL%nPLpjpJQjnkLjkOlMKqQNqKjlKJqRmNj%mKPn
4088A%nKM%jNrPJMj1nNLj0NMlRj1KMMlrJ2moLoLMKlPkMqLrQmrJ9jlKoQjqNNqj0
4144a0MNlmlNJl%J0j5NKlJ2j9J8KjqNLm%j0J5MmLjj4jkJ5j4J0pJOK%j2NNljlR
4192BnkqJ2jKj8K1nKkpOJpPMmkJ1onQmnMOnjJ1j8LlLOnLjkJ0j3JJ1jj0MRm%kl
4243bNmjrK3j6PLlrNKrJ0qPjj0ROj4QKmjJMlPj0nJ1Nj1jOjJoPj1J1KoKMjlMrO
4294@oLjLqJ4j5J2oJRlmkJ0Lj8KML%jnKKlPklPoNoMmjMkj3K1k6J6ljMoKQrKNp
$$ y = [1, 2, -7, -4, 1, 9, -4, -2, 5, -5, -6, -7, 2, -6, -7, -1, 15, -5, -5, -4, -1, -6, -6, 5, -3, -13, -12, 1, 0, -5, 1, 6, 7, 0, -4, 0, 3, -5, 3, 5, 6, -3, -15, 2, -5, -3, -7, -9, -5, 0, -5, -2, 7, -8, -5, 5, 3, -13, 5, -12, 6, -7, 6, 4, -11, -6, -9, -11, -2, -2, 3, -5, -2, -5, -7, 5, 0, -9, -5, 1, -6, 2, 2, 0, -3, -6, -2, -3, -11, -3, 2, 3, -1, 2, 1, -6, -12, -4, -1, -2, 4, 6, -9, 1, -7, -5, -2, 6, 1, 1, -11, -9, -5, 3, -6, -10, -5, -3, 5, -4, 1, -3, -1, 2, 2, -3, 4, 7, 0, -1, -8, -7, 1, 0, -5, -7, -4, -5, -7, -1, -4, 0, 2, -6, 2, 7, -1, 1, 0, -3, -1, 0, -8, 1, -3, 2, 1, 1, -3, -1, 6, 1, 1, -4, -2, 2, 2, 1, 6, -3, 4, 5, 9, -2, -7, -2, 1, -9, -4, 0, -3, 6, -5, -3, 1, 5, 2, -7, 5, 1, -5, -2, -8, -5, -1, 1, -2, 5, 3, 7, -1, 2, -7, 1, -3, -12, 7, 6, 3, 5, -1, 7, 6, -2, 3, 8, 0, -10, -6, -1, -4, -8, -11, -6, -5, -8, -8, 2, -13, -8, -6, -9, 3, -16, 2, 4, 3, -5, 0, 3, -1, -1, -11, 4, 8, 4, 7, 6, -8, -9, -11, 4, -10, 0, -7, -6, 0, 2, 2, -10, -5, 0, -3, -4, -7, 2, -3, -5, -13, -1, -2, 0, -18, 3, -2, 0, -2, -9, -3, -2, -9, -2, 2, -2, -4, 7, 1, -4, 4, 0, -5, -1, 5, 0, -1, 10, -8, -5, -8, -5, 1, -4, -1, -2, -4, 6, -7, -6, 5, 4, -6, -2, 7, 3, 3, 1, -2, 3, -1, -2, -11, 12, -4, 3, 6, 3, -6, -1, 1, -8, 2, -6, 1, 0, -10, -1, 5, -9, -1, 1, -3, -4, -3, 1, -2, 5, -5, -10, 1, 6, -5, -6, 0, -1, 0, -6, 1, -10, 1, 3, -3, -1, 3, 2, -1, 3, -6, 0, -6, -3, -4, -1, -9, 5, -10, 2, -4, -3, 6, 3, -1, -3, 7, 10, -8, -6, -2, 1, 1, 0, -5, -3, -1, -4, 3, 1, -2, 5, -1, 4, -2, 2, -2, -3, 1, -1, -14, 7, -19, -3, -6, -7, -3, -9, -7, 1, -8, -6, -1, -8]
4346hLOJqLKKqOkJ0j5JKRkj3QjpPRomOJlJ%KjNjnOrNpJ3rQ%lpNNJj9LNlOJmNj7
4402a5J7qKJOMnoKkmJ2jqnJ0kJjNlkNlmJ2j1LjjnJLQj4J2nmkKJoQOjloPknMJ1
4454Hmj1JOJKlkpJ5%rOqQqnJ0OpOmkNKj1KoPl%%J3oJqmK0j6NonJ4mPpjJlKnM%
4507cKnPkjKjj0J0Nlj1QQrj0LKJ3rj0J7jjj1QoLJ0%p%mKJnJ1qJ0j0Pkp%MOjpn
4556a0J1j0J4mKmMlKJ0j5nJ2Jj0JJj4PJ4rQqM%rJ0JrkJ8k2LkKJ%M%J1j0kRj1J4
4601Ej2KJ3mqKKlJ0j7J1kLjkj1J6pJRjjoPmM%j0KKjJojJMoKLqQm%NKrNJ0lj1J1
4652Cj1KlLJj2J4qJ1nlOPoJjnJ5j5jJ1j6PJ4rKmKrNKpJ1jLjpqJ4j%oMMmjnQkn
4702fnJ7j6RpRqKMlJjPjkoJ1oj%pJ4qLOj%pOkpQrJkNKjjmKlRJj0KLOKj4QLk%m
$$ y = [-8, -5, 1, 2, -6, -3, -1, 1, -7, -1, -3, 7, -8, -7, -5, 4, 2, -11, -3, -4, -11, -4, 5, -1, -5, 1, 2, -1, 0, 0, 2, 1, 6, 5, 0, 6, -3, 2, -5, 8, -1, 7, 7, 4, -3, 2, 7, 8, -11, -8, -3, -6, 0, 1, -3, 2, -15, 2, -6, -4, -3, 3, 7, 2, -4, -2, -4, -8, 4, 3, -5, -10, 0, -2, -1, -2, 3, 0, -2, 3, 0, -4, 8, -3, 0, -1, -2, -7, -6, -3, 5, -9, 3, -2, -6, -8, -6, -5, -11, -3, 3, 2, -1, -7, 0, -2, -7, -3, 8, 4, -7, -6, 0, 1, 3, 0, -2, -9, 6, 6, -3, 3, -5, 3, -5, -10, 0, 6, -1, 5, 1, -1, 4, 6, -5, -3, -9, -2, -5, -5, -5, 8, 2, 3, -5, -9, 11, -5, 0, -6, -11, 3, -1, 6, -1, -2, -1, -4, -2, -7, -3, -3, -1, -6, 1, -1, -2, 0, -1, -11, -1, 4, 1, -10, -2, 6, -3, -13, -10, -8, 5, -4, -14, 3, 2, 1, -10, -2, -8, -5, 5, 5, -2, -2, -6, -4, -3, -8, 3, -5, 5, -5, 2, 0, -7, -7, -3, 3, 2, -5, -10, 1, -9, 5, 1, 3, -1, 3, 0, 2, 12, -3, -8, 4, 5, -5, -4, -3, -17, -10, 4, -5, 3, -5, -1, -1, -10, 0, 1, -8, -10, 8, -14, -11, -13, -11, -10, -10, -6, -6, 5, -5, -7, 2, -9, 5, -7, -5, 8, 4, -4, -2, 0, -3, 7, -10, 1, -1, 2, 1, -1, -12, 4, -3, -2, 7, 6, 5, -1, 6, 2, 6, 6, -4, -2, 0, -1, 0, -6, -7, -6, -2, -8, -6, -3, -11, -3, -7, -7, -2, 0, -9, -4, 6, 3, -8, 3, -8, -6, -9, -6, -5, -17, -3, -11, 0, -5, -8, -2, 5, -1, 0, -1, -6, 9, -6, -7, 4, -12, -5, 9, 0, 2, -2, 0, -9, -4, -2, -9, 2, 1, 4, 3, -4, -12, 2, 1, 1, -5, -1, 3, -1, -2, -7, 1, -1, -6, -11, 6, -10, -1, -8, 1, -7, -5, -1, -4, -3, -4, 3, 2, 0, -6, 5, -1, -2, -2, -9, 5, -3, 0, 6, 5, 5, -2, 4, 2, -5, 3, -6, -5, -7, -2, 0, -1, -2, -6, -4, -7, 2, 3, -7, -5, -2, 4, 6, -8, 0, 3, 1, 1, -3]
4757cRk1J3lJ5j1%lRmj2OJPPoj3MlOoJ0j1mQQj0JoR%MmN%jKKpMj6RMmR%qnRj1
4807a1J5qjOqRpNpJ2k0J6JqnKJ3qKj2RoLjKlRkkJ1j6%LJ0Nj4LJknlJ7olOj1Oj2
4855a5J6n%LLnpKJ2j3LQnjqJORj2J0j0J7j0jnOlJ1qlJ1%kj4LOJ4k0JjNQj2mJ3
4900DpjlNknkOKLkPj6RLKj3OmPmQj%mjOnlJJKmOmKkKMkkj0OMoMPpPj0jM%J0mj1
4956hJ0l%j1OmKMPJlKjrRJoNmKmLlrRko%P%J0j1Mjj1J5Jj2J0LrjKLkLJlK%Mjk
5009@JkLj0PmLNj2KJ1j8QoJ3jNm%jJj3J0jjPr%NnMmoJNLJpOj9J3lMNrOqoRNMo
5061hLlMj1J4j5J0Qj2QpLJ5j9NnLjKjLKJOj4J3j0MknQrJ6j5LjLlQlkjnOmRqJ%
5110fMnNnQl%J1nj0lJ1ljnJoJ7qNjPjopOKj2OkOJllPkKQrmlOrJ3Lj1pJ1JJnLl
$$ y = [-3, 6, -15, -2, -5, 10, -1, -1, -4, 5, 1, -11, -5, -4, 3, 10, 4, -9, -5, -8, -2, -8, 2, -9, -13, -5, 3, -7, -6, -12, -3, -3, 1, -3, 2, 2, 1, 3, 5, -2, 2, -14, -5, -1, -5, 4, 4, -4, -9, 0, -11, 4, -4, -5, 1, -7, 2, -5, 0, -7, 5, -15, 1, 2, -6, -11, -9, 4, -4, -2, -14, -5, -11, -8, -9, -7, -10, -1, -3, -5, 6, -10, -10, -7, 3, 8, -6, -3, -2, -4, -9, -12, 5, -1, -4, 2, -9, -3, -15, 1, -4, -4, -1, 2, -3, -10, -8, 4, -9, -6, 2, -3, -4, -12, -11, -5, 4, -8, 2, -8, 9, -1, -2, -7, -1, -4, 7, -1, -4, 7, 7, 5, -9, -6, 0, 14, -6, -5, -6, -1, 7, -5, -9, 4, -3, -4, -7, -2, -4, -9, -11, -5, -3, 0, -2, 5, -11, -2, 1, 3, -10, -4, -8, -1, -5, 3, 2, 2, -2, -3, 3, -2, -5, -4, -3, -1, -5, 1, -3, -1, -3, -1, 3, 1, -1, -11, -5, -1, -7, -3, 4, -3, 4, -6, -7, -3, -3, 7, 3, -8, 2, -1, -1, -12, -6, -10, -8, -4, 3, 4, 1, 3, 2, -7, 2, 3, -3, 2, -2, 0, -4, -1, -4, -13, -4, -6, -12, -12, -5, -5, 5, -6, -2, -3, -14, 1, 2, -10, 0, 3, -6, -7, -5, -2, -4, -1, 0, -3, -1, -1, 3, 2, 0, 1, -1, 2, -8, -1, -5, -2, 3, -9, -7, 4, -14, -6, -12, 1, 0, 5, 1, 1, 0, 1, -12, -2, -3, -4, 3, -6, -6, -1, -6, -2, -6, -12, -11, -6, -3, -2, -9, -3, -22, -9, -12, -8, -3, -12, -6, -14, -20, -11, -6, -2, -8, -5, -8, -4, -15, -1, -16, -6, 2, -10, -2, -9, -6, 9, -10, -5, -10, -7, -8, -6, -7, -4, -2, -1, 5, -9, 4, -6, -2, -4, -9, -1, -10, 6, -9, -6, -7, -4, -7, 1, -2, -4, -5, -10, -4, -8, 1, -7, -6, -6, -2, -7, -2, -7, 1, -2, -2, 9, 4, -6, -9, 2, -1, -2, -7, -6, -12, 5, -3, 2, 1, 8, 7, 1, -6, 0, 2, -10, -4, -6, 0, 1, -2, -5, 2, 0, 2, 10, 1, -3, -6, 0, -9, 4, 7, -4, -11, 0, 1, 2, -3, 0, -3]
5163cPnLJpLkMkJnMmJ0kpMMm%Qj5KLnJJ1qLOkj6J8n%K%mJlKNjlpPkNj0OLpk%o
5218a3J4noJ4j0kJ0kpJKLPj0J4j4pJ3oJ2pNmJJLmqlNjKjlRJrlJ5moRlomQjq%R
5268AKlnjJ3mJ2j4pJ0lKJqRloJ6on%Jmm%J3qMrQkmj1R%OKomKOqQnoNJJnMMkKM
5322CnJK%K%oMj0JNMqMm%Oj0KJ1rOnNoJ0ljj3J0MoOrLNmMKmMkJj4P%KKOj3J0l
5374cMJJlrJ0LOk2J1kJPonJ1lpjNOj1KlKnQmONjqOknLjNLjknPj1RNljLjnkLQp
5429Bjj1J7j0JQlJoQqJ7qj1mLNKKKokjJJ2j7LjjK%J3pjloNJ2kj2PnnJ2j0MKRj5
5478fMMlKMoMkkmMMrJ2oO%j0j0J7jJ%j1OPo%PmMJj9J4j3RnMlLjpJ0J5j2oKMqL
5528cjNKj0pMJ0JKrNkQj3ONmqMNj0PKmJNj%oJ4j3M%kj%%LRlmjK%Qj1KojPmLJo
$$ y = [-3, 4, -1, 2, 3, -4, -1, -3, 1, -1, 0, -5, -1, -5, 5, 3, -4, 0, 4, 0, 0, 8, -7, -5, -2, -7, -6, 5, -3, 0, 6, 4, -12, 6, 1, 1, 3, 3, -1, 0, -3, -1, 4, 3, 0, -7, 0, -2, 3, -7, -1, 2, -5, -7, -7, -13, 1, -4, -10, 4, -6, -8, 2, 0, -7, -6, -4, -1, 6, -4, 10, -4, -11, 2, -4, 8, 1, 6, 2, 3, 4, 7, 3, -5, -8, -3, -4, -2, -3, -6, 3, 4, -5, -8, 7, 3, -3, 6, 3, -3, -7, 1, 0, -8, -8, 1, 3, 0, -5, -6, 7, 3, 15, 1, -6, 4, 1, 3, 4, -4, 5, 2, -4, 12, 6, 1, 1, 2, -2, -6, -6, 7, -1, 3, -6, 2, 0, -4, -15, -6, -6, 0, 2, -4, -8, -6, 0, -8, 0, -5, -11, -6, -5, -4, -9, -5, -1, -3, -1, 3, -2, -1, 1, 1, 3, 3, -3, 1, -9, -8, -3, 1, -7, -3, -7, -7, -1, -11, -9, 2, -7, -1, -6, -1, -7, 3, 0, -1, -14, -4, 0, -6, 0, -9, -6, -1, -5, -1, 1, -3, 1, -1, 0, -14, -7, -7, -5, -3, 3, -10, 0, -3, 1, 2, 3, 0, -9, 1, 4, 10, -12, -1, -3, -2, 5, -1, -6, 5, 2, -5, -6, -1, 5, -6, -4, -7, -5, -10, -2, -6, 0, 5, 4, -4, 2, 0, -5, -2, -3, 2, 5, 4, 2, -3, 4, -7, 2, 7, 4, 3, 6, 5, 0, -2, 1, 9, 2, 1, -10, 7, -3, -2, 6, 3, 4, -2, 6, -2, 15, 7, -4, -8, -5, 0, 2, 4, 6, 0, -2, -3, -2, 10, -7, -4, -5, -6, -4, -4, 9, 2, 1, -2, -8, -3, 9, 7, -5, 2, -3, -8, 4, -6, -2, 0, 9, -6, -2, 2, -1, 1, 5, -1, 3, 1, -1, -5, -1, 3, -6, 6, 0, 6, 6, -4, -14, 3, 2, 3, 3, -8, -2, 5, -1, -1, 6, 2, 6, 7, -12, 2, -11, -2, -7, -3, -6, -3, -4, -11, -1, 14, 2, -4, -2, 2, -6, -3, -4, 1, 3, -7, -14, -10, 0, 1, 3, -6, -1, -3, 5, -8, -2, 3, -1, -9, -5, 0, -10, -3, -1, -5, -4, 1, 0, 0, -6, 8, -5, -1, -1, -3, -4, -4, -4, -1, 8, 5, 1, 0, 2, 2, 10, -1, 1, -5, -6, 1, -3, 0, 1, -5]
5582eONjj3L%J0qOqLmKoQlKLjk%kJ4j2mPJLoLJ4j8KPNj0pK0ropJ2j1MK%j0Rkj
5632e%kqRP%nPqMkNoMKQj3%JM%l%lJ0Mj4%RlnOj2J4Lj5J3pQj0jjNj7RLLmQlNK
5684FoLpoJ0NokKJnQkqJ2j4RJokLJ8qj4MjQnJjRj1LjjNmljMJrJ2j4J3nLJjlP%
5736CJoLmj5K0mJ5j5jmPNk0QNmJmLJ2j7JQkjNpMLplJ0kpMkqK1opP%KjlJ2k1KJ5
5786FmmNkoJ5rPp%lmJLlPnlJ5jknj3PRLqLrJ8omJ0j3jKNqNJ0rMNpmJKNj1%RnJ
5839BkoNj5K0pJMj0Qj1J6kqKnJ2ooJ0j3J3oRj0lLRkkprJ9j0Q%nMJmQLj0%J%OJ
5887Fj0PPk1KQJ0j6Pm%QpjQnNkLpj2J0j6J2PLJK%j1jjJ3pqJ3j1kJ1Lnlk%RLmj0
5935hQkmLJ0j3J7qPj2j2J1nMRj3KJ1KrKKm%JLnnNPj0lRqJ5%Jj3J5mj8LJ1nj2J7
$$ y = [-5, 1, 6, 5, -8, -5, -5, 5, -3, 3, -5, -2, -6, -4, -10, -2, -5, -3, 0, -1, -3, -3, -5, 9, -3, -7, 0, 1, 4, -2, 1, 15, -3, -1, 6, 11, 1, -6, 14, 5, -1, -8, 4, -7, -3, -1, -1, -11, -2, -4, -5, -5, -7, -15, -6, 1, 1, -4, 3, -5, -1, -3, 2, -4, 0, 2, 10, -3, -3, -2, 2, 2, -1, -1, -4, 6, 10, -4, -4, 5, 2, -3, 3, -9, 5, 8, -7, 6, -1, 7, -3, -4, -5, 0, -17, -8, -5, -2, -6, 2, -1, 4, 6, 0, 3, -4, -10, 0, 5, -1, -3, -1, 0, -5, 3, 1, -7, 5, -9, 0, 1, -5, -7, -4, 14, 6, -8, -4, -5, 3, -2, -1, -2, 7, -4, -1, -2, -3, 2, -2, -5, -6, -2, -1, -10, 2, -12, 1, -4, -1, 0, -1, -4, 3, 3, 4, -2, 1, -3, -18, 2, -2, 13, -2, -3, -7, 0, 5, -15, -7, -2, -6, -5, -9, -6, 6, -11, -10, -2, -4, -5, 0, -7, -3, 0, -7, -10, 0, -2, -9, -5, -7, -15, 6, 0, -7, 0, 0, 2, 1, -2, 10, -11, -9, 6, 2, -2, 3, 1, -5, 10, 1, 8, 1, 1, -2, -6, -5, -2, -5, 2, -3, -6, 9, 8, 6, 1, -12, -5, 4, 7, -1, 2, -7, 11, 5, 1, 11, -2, -3, -1, 4, -4, 1, 11, 2, 6, 11, 4, 0, 1, 3, 8, -3, -3, 6, 1, 2, 0, -6, -1, -16, 4, -3, -2, 2, -8, 0, -11, 5, 3, -5, -3, -8, 4, -2, -8, 2, -11, 2, -4, 5, -5, -8, -5, 4, 2, 0, -7, -16, 3, -7, 1, 1, -4, 0, 1, -3, 5, 8, -2, -2, -1, -1, 5, 6, -4, 3, 10, -11, -9, -1, 9, -7, 0, -4, -4, 4, -3, -4, 4, -1, 4, 2, 5, -2, -14, -4, -20, -8, -1, 2, 3, 5, 5, -6, -7, -8, 5, -2, -10, 3, -8, -10, 1, 4, -1, -4, -6, -6, 3, 6, 2, -8, 0, -2, -6, -3, 7, -6, 11, 3, 10, -2, -14, -3, -8, -4, 5, -8, -6, 5, 7, -2, 0, 2, -2, -2, -1, 2, -3, -8, -3, 4, -6, -9, 0, -8, 7, 7, 8, -5, 10, 6, -12, -9, 2, -3, -15, 2]
5981B%nqJ6pOkrNJ2rkjopJ2j2J0Rj3LjKOnlMJOj7QKmLKkMlMoNlJ1Nj7J6j1mLj0
6031a0J0%%lqRmj5K1kLjo%kjRNj2J1j2Rnm%jK2j7J0j1KnjkkQOpJ3Jj3MnJ1oJr
6078iMnQNKPj0njnKKPj9J8mnKmMmJ2mPloLKplQjmnJ3qJ2mqJ3j1KjQPj6KmMqkJ7
6130Ej8OmKMOmMj1KJ6ojJmOjNj4J2j4M%LmLjjQj2Pk%%LmkoMkJ0jo%J5ooRj7J7
6180Ej4RjJlLoQoRj6J4OJk2J5rPlNpj0QjJ3rkrRJ8j0pJJjQmLnrOj2J5%LKKj3J5
6229Hj1QLr%MkmrJ0Oj0J0j4PjJNkj0PlM%pJJLjlMpJ4okkLMnJ%JmKkRkM%LopOj
6283aj0J0nJ%MJqpJ5MonLoJ0lkLnJ2rJOmJ1joKm%KLj4K0j1lLLj6J1mJ0qrNjNo
6332iKPmkLKJnqNPKjKl%NLj3JNOkmj0J4j4NPjJkJqLLkkMlmJ2jroJ2JJ%lkKpJ2
$$ y = [2, 2, -3, -11, 5, -2, 4, 2, -7, -2, 10, 1, -1, -2, -8, -15, -3, -15, -5, 4, -9, -6, -7, -5, 1, -4, -7, -3, -2, 4, -13, -5, -3, -7, -4, -2, -4, 0, -3, 1, -5, 0, -3, 8, 13, -4, 12, 1, -3, 0, -10, 0, 0, 0, -3, -11, -2, -6, -21, 0, -2, 1, 0, -6, -6, -8, -9, 0, 5, -7, 4, -8, 1, -4, -8, -8, -9, 13, -4, 6, -5, -3, -8, -9, -11, -13, -5, 1, -6, 7, 8, -5, -1, -6, 5, -1, 0, -9, -5, -10, -2, 3, 5, 12, 2, -3, -4, -9, -7, -5, 2, -17, 1, -3, -8, -6, -10, -6, -10, 2, -2, 5, 2, -4, -1, 1, -6, -9, -1, -2, -6, -11, 2, -6, 6, 2, -6, 7, -4, -2, -3, 5, 12, -4, -2, -6, -2, -10, -12, 5, -13, -7, -11, -9, -5, 1, -3, 1, -10, -8, 8, 2, 1, 2, -2, 4, 3, 8, -6, 6, -8, -4, -4, -1, -5, -2, -3, -4, 4, -8, -1, -3, -3, -3, 0, -4, -6, -12, -8, -10, 0, -1, -7, -7, 8, 2, -4, 5, -12, 5, -9, 0, -1, 0, -3, 0, -6, 2, -4, 5, -11, 3, 9, 10, -12, 3, -6, 1, -2, 3, -4, -14, -6, -7, 6, -3, -5, -14, -5, 13, 3, -4, -3, -2, -3, 5, 1, 4, -1, -10, -4, -16, -1, -1, 2, 4, 6, -7, 8, -3, 5, 8, -1, -1, 3, 1, -3, -12, -2, 4, -6, 4, -10, -3, -4, -3, 2, 0, -10, -3, -6, -2, -2, -9, -8, -7, -4, -5, -8, -4, -11, 3, -3, -5, -7, -4, 0, -5, -4, -4, -3, -7, -5, -7, 2, 0, 4, 4, 7, 1, -6, 0, -1, -11, -1, -6, -5, -5, -1, 0, -8, -15, 0, 4, -2, -7, -4, -10, 0, -3, -5, -2, -7, 5, -4, -3, 3, -1, 10, 9, 3, 5, 1, 1, 3, 6, -8, 12, 1, -2, 1, 4, -12, -1, -5, 5, -3, -12, -7, -8, -3, -9, -7, 0, -4, -6, -3, -1, 0, -5, -13, -8, -1, 1, 0, 2, -1, -1, 4, 7, -6, -5, 0, 6, 4, 0, -10, 4, -10, -5, 2, 1, 2, 0, 1, -7, -4, -1, -3, -5, -1, -4, -8, 4, 3, -6, -12, 0, 1, 2, 2, -1, -3, -1, -8, 4]
6386Dj2J3opLMJMjJj0OkkLJkKOj0nQmPjlKnj0KKJ7pJ4j4Ok%nJ5j6MqJ%jPkmPO
6437Gj1J0lkjJ1%qmKkojLKkQk2J4O%%JKj0NOolOj1N%NqPOj5N%JpJ3mPklmoJ2K
6488EqQLqjnNMj6nK0j2MJ2j2MnjJ2j1jLOKoJqJ1kM%lmMPkmkJrNK%LlMkmRLorn
6541a2LjOPlnQlnMrJ1oJj0J2P%%pJNJlj3K1jqrLJJJlQLj1J6k0KJkKMJL%nMj2J0
6592aOkjJLLj0Jj1QlOj0QNj1LJJ0qpM%J%lNljLlpLkRKmQplNoJ8j4jpPkP%kJ0j1
6645cjnNJ2Llj1NPoj0Rj2Nn%RJqOJ%KOnpNj2R%KNnlJkMMj3J3opJ1J1onnjJ1j0
6695dPkj1NN%Lo%%pMMlPqJQJk%JKmPj%Lj2OJnMJmkNMNk0MQnk%MNoj2J2Nj7LNl
6750fJ0lmJ0rJj0J2mO%mmMQnMJk%jnoJ4njjOo%KoOrQjkJKqJJ0j0KjjlkNoJ0pP
$$ y = [4, -8, 5, -1, -8, -5, -1, 0, 4, 3, 4, -6, 0, -2, -4, -1, 0, -2, 0, 6, -4, -9, -1, -5, 2, 1, -2, 0, -5, -15, -13, -11, 6, -1, 13, -1, 5, 3, 3, -2, 13, -3, 1, -7, -6, -6, -7, 0, -2, -6, 1, 7, -4, 6, 3, 1, 0, 11, 11, 3, -1, 1, -1, -7, -8, -5, -3, -5, 3, -19, -5, 1, 1, 1, 2, 4, -6, -1, 5, -1, -4, 2, -9, -4, -4, 1, -7, 0, 6, -9, -4, -4, -3, -10, 3, -1, 6, 4, 1, -3, -9, 3, 5, -3, 5, 8, 0, -1, -6, -1, 3, -13, -18, 2, -10, -6, 6, -6, -2, -7, -8, 4, -7, -8, -5, 1, 3, -3, -2, -10, 1, -1, 3, 3, 0, -4, 0, 7, 5, 1, -1, 0, -9, -4, -2, -2, 1, -2, 2, 0, -4, 5, 8, 2, -7, -12, -9, -10, -4, 3, 0, -5, 3, 0, -5, -1, -10, 1, -5, -4, -14, -2, 5, 5, 5, -2, -1, 4, 5, 2, -11, 10, 9, 1, -8, -5, -4, -3, -2, -5, 3, 6, -5, 11, -9, -7, -6, -8, -6, -2, -1, 2, 2, -3, 1, -11, -1, 5, 3, 2, 3, 6, 9, -1, 0, -11, -3, -6, 0, -10, -2, 3, -8, -5, -4, 6, -2, -9, -5, -5, -4, -4, -7, -2, -5, -6, -3, -6, -13, -10, -12, -3, -1, -5, 3, -4, -7, -2, -8, 10, -4, -5, -12, -5, -7, 0, 0, -2, 8, -3, -4, -9, -4, 8, 11, 8, -3, 2, 9, 3, -7, 2, -10, -5, -10, -10, -1, 0, -8, -2, -1, -1, 1, 7, 2, -5, 0, -12, -3, -3, -1, 4, -1, -4, -3, -5, -1, 3, -10, 3, -3, -10, 1, 12, 6, 1, -4, -5, 6, -4, 3, 1, -10, -5, 0, 0, 3, -3, -3, -3, -10, -6, -2, -5, 2, -6, -5, 3, 4, 2, 2, 3, 5, 1, 8, 7, 7, 10, -2, 4, 5, 0, 4, 5, 1, -1, 4, 8, 13, -7, -3, 5, 0, -2, -2, 2, 7, 1, -11, 1, 6, -11, -8, -3, -6, 4, 1, -3, 7, -2, -1, -11, 1, -3, 3, 3, -1, -5, -1, 7, 2, 6, 7, 5, 5, 4, -1, -7, 7, 2, 1, 0, 6, 0, 0, 2, -4, 2, -7, 1, 0, -2, -1, 1, -7, -6, 4, -6, -4, -5, -6, -9, -11, -6, -12, -2, -9, -2]
6803bNKl%mNLj1kJnJ8nmKqNJqJ1j0LPpNLpj7K5j3LNomNnJ0%%PjlKrP%LMpj0J6
6854Gq%qMPN%j1QMqMpkJKJPmnJ3j3QokMKpJ7j0jQj7J2nMqPJpKpLJ1lrMJjKMjq
6907eJ3j7PoKLjkJ1j0jL%qJ9j6RjpLojPLrJ8pmLKlNook%J3qMmJ0mqJPj2MkkJ0
6957aqOjKpnJ3JkqOjNkkKJ4j5NlKNlj1PMrJ1n%%nRnmk%Kj1QkJJQkmrJ6qOpNlJ3
7011GnjnMjlQj1J1lqQJlkRj1PrPnrJ1kpJ0rJ3pOokNPj0MQjpQorPJRj0oQOj4QN
7063FoNLnjkklMm%ljNOj0lOlPmKjO%rK%NoNmnJ4JKj0QJqPol%kNMpoQLj1PkMon
7120a2nOQOlQpm%KNrNOqrJ4jmoJ1Knk0J8%pOnJ0Pj1mqJ2RqklLjKpLnjJK%M%MJ
7173@rPlMPmkJ0j3jJOj4JJ5j4J3ppPKmnOJJpRj2J2oNKnKrJ2NoMlNlmJPqNKoOp
$$ y = [-2, 3, 5, 2, 2, -2, 3, 6, -5, -7, -6, -11, 7, 2, -2, 0, -8, -3, -2, -10, 1, -9, -6, 1, -6, -1, 2, -5, -22, 3, -10, -7, -2, -8, -12, -7, -12, -2, -2, -2, 5, 4, 1, 3, -6, 1, 1, 4, 8, 1, -9, 7, -1, -1, -9, -5, 2, 7, 7, -4, 4, 8, 0, 4, -3, -5, -4, -2, -1, 6, 2, -3, 10, -3, 5, -1, -3, 1, 3, -4, 13, 3, 2, 10, -7, 5, 0, 4, -4, 3, 4, -3, -1, -8, -5, 6, 3, -6, -2, -1, -2, 0, 4, 3, -5, 8, -9, -2, -8, -6, -3, -4, -6, 5, -5, -6, -3, -3, -11, 8, -8, 1, 0, -7, -4, -10, -11, -4, -1, -10, 8, 1, -3, 0, 2, -1, 4, -2, -8, -10, -10, 3, -5, -1, -5, 5, 1, -7, -6, 1, -11, -7, -9, -11, -1, -9, -3, -4, -2, -9, -14, -1, 0, -2, -10, -4, -5, 0, -2, -4, -2, 12, -3, 2, -1, 1, 6, 3, -8, -1, 3, -6, 5, 0, 0, 0, -5, 4, -1, -5, -7, -7, -5, -16, -8, -10, -9, -8, 0, -2, -6, -15, 1, -7, -1, -8, -3, -6, 7, 2, 1, -4, 0, -1, -4, 4, -7, 4, 1, -7, 1, 2, -1, -3, 6, -5, 2, -7, 0, -5, -14, -3, -5, -12, -2, -11, 2, -5, 1, -5, -7, -2, 5, -5, -1, 7, 6, -1, 7, 1, -8, -1, 0, 9, -1, -7, 1, 7, -7, 1, 6, 0, 5, 8, 3, 2, 0, -2, -5, -1, -5, -5, -8, -9, -4, 2, -8, -11, -5, -8, -1, -5, -3, -4, 2, 2, -7, -5, -5, 0, -6, -1, -5, -10, 4, 5, 7, -3, 5, 6, -2, 5, -1, -4, -4, -6, -1, 3, -4, -10, -2, 1, -10, -3, -5, -1, -7, -12, -17, -11, -3, 3, 0, 8, 1, -3, -3, -1, 4, -5, 0, 6, -2, -11, 3, 2, -2, -8, 3, 5, 0, -20, -2, -2, -9, -3, -8, 2, 9, -2, -6, -14, -2, 7, -1, -3, -6, -3, -4, -2, -9, -6, -11, -12, -11, -9, -9, -5, -5, -1, 0, -9, -2, -5, -1, 6, 2, 0, 10, -3, -4, -3, 3, -11, -10, 5, -9, 4, -3, -10, -3, -1, -5, -10, -4, -3, -2, -9, 0, -12, 0, -6, -1, 1, -4, -2, -11, 1, 6, 0, 4, 1, 6, 3, -1, 0, 7, -1, 4, 6, 0, 6, -1]
7225aJ%lJ1Jj5%JLpJ2ooJ7j5mKjM%jPj0MqQNj0J1KnJ%KqQkkl%J4mj1NjKLmJ6l
7275A0k2J3j5J9j4K%mPO%lKpKOomNJKmPKKqj0MJ0Nj2%lORnqkJJ2nklj0LJ6j3L
7323eJj2J2K%j1J2kmLKpLjpJ4oNMjNj1NljLLj6J9kLo%J1k0RrJ2lkj5K2jj3QnJ
7370dOlnJO%j1OJ%NnRkk%lJlNLqMKlpnRJKl%MjmKMnmmPmQ%mnJ6mk3RJRPpj%Jj
7428blKMNorJ6j1nNjMRj3mLLj1J2MnLrKNoKjJNqMmNQj7OJ0j1Qj0J7jrR%j0J0%
7477FoJ4plrkM%%J0rjlLkMKj6J8lJJkOKj1lRJkmNk%Oj0%JkLnJ0jJj9J8rkPJmJ
7529cMoNjM%lRoKmqKMJQnpRmKMkpQnJ0j6J1j0MlpLLlkJ1rJNmLoRJqJ0j2lPj3J3
7582dkQnnJJQlJ0j5RrPj0OJPj3QkjPqJPJoKlnPmnLQqLjKnjJ0qMolJ2n%rJ0%J0
$$ y = [-1, 0, 0, -3, 8, 9, -6, -6, -5, -2, -9, 3, -3, -9, 8, -7, -11, -9, -10, -6, -6, -7, 0, -10, -6, -14, -6, -1, -11, 0, 2, -3, -2, -2, 0, -8, 0, -2, -4, -7, -7, 7, 3, -8, -3, -4, -2, 1, -3, 13, 10, -12, 1, -14, 5, -9, -7, -7, -11, -4, 2, 2, -1, 1, -6, -4, 2, -4, -8, -3, -2, 0, -4, 3, 5, 7, -1, -11, -7, 3, 8, -4, -4, -7, -1, 8, 3, -5, -7, -6, 6, 1, -1, -4, -14, -11, 5, -8, -5, -4, -16, -4, -2, -2, -13, -1, -3, -7, -4, -2, -9, -6, -7, -14, 0, -6, -1, 3, 2, 7, -4, 1, -2, -3, 0, 3, -13, 6, 4, 7, 1, 1, 12, -8, 1, -8, 4, 1, -1, -16, 6, 5, -8, 0, -5, -4, 2, -1, -6, -5, 1, 1, -10, -4, -3, -3, 2, -3, 6, 4, 2, 2, -1, 0, -3, 2, 5, -3, 1, 3, 0, -7, -12, -3, -2, 0, -3, -3, 1, 0, -4, -2, 2, -3, -7, -11, -4, -8, 0, 0, -4, -9, 7, 3, -20, -11, -10, -1, 6, -1, -2, -2, -1, -2, -5, -3, 1, 6, 0, -9, 7, -4, -9, -4, -5, -1, 8, -5, -9, -6, -3, -14, -2, 2, -3, 0, -9, -7, -2, -8, -6, -7, -6, -1, -9, -5, -9, -4, 4, -13, -7, 3, -8, 0, -10, 7, 6, -3, 6, 6, -4, 6, 6, 0, 14, 7, 4, -5, -7, -3, -3, -3, 7, -2, -3, -6, -3, -5, -1, 1, -15, 3, 0, 1, 2, 0, 6, 8, -3, -6, 3, 4, 2, -2, 3, 1, 1, 7, -3, -3, -2, -4, -1, -6, 4, 3, 4, -15, 3, -6, -8, -1, 0, -4, -3, 1, -5, 0, -1, 3, 3, 0, 9, 3, 5, 1, -7, -5, -1, 0, 8, 3, -4, 5, 1, 3, 7, 5, -2, 6, 1, 11, -5, 6, -4, 0, -3, -10, -7, -4, -7, -9, 2, -7, -6, -1, -5, -2, -8, 1, 2, -6, 4, -8, -11, -4, -17, -4, -6, 2, -3, -8, -7, -6, 2, -1, 9, -6, 3, -6, 1, -9, -3, -2, 5, -8, 0, -2, -3, 4, -4, -3, 4, 5, -1, 1, -2, -7, 0, -4, -9, -6, 2, -6, -3, -4, -2, -7, -8, 2, -6, -2, -8, -11, 1, -4, -4, -13, -3, -3, 7]
7635GjlPj5lJ0Nj5J9j1JjKOj2mNnOnJ2nKmLk%JokOkMj0RKoLK%KMmmLpOlJJ1j2
7686cLMj0Pj2PMnOj1J0j0MPkjQj1mJ0%j1J5j7J3LKPj8QmMj2jJ1Qj1MMj3QLMlm
7731AllQmLj0MjOplJ1n%Kj2J3jlJLJKkKmlMKnJMkOKkqJ0kk0RMmK0k3NRj3RKj0
7782fLknJ4j0J3k1PRKPqqQKoPNmnRj0KOnPj1J0j0oQLoJ%%j0J5lj3J1nMkKK%oo
7831a1KNmNjMQqjPj0mJ3j1OnKJ4j1jllJ1j1J3oPrlJNlmLmJ3k%rkJJ2%m%j2J3o
7879cPmoMJQljoJ2j5Jo%J1JqrJ1pPNqOj3KJ3j5J0kOjnMj1LRlkjOpJ4j6J1plJ%
7928iJ0J%nmkQj0PjjNnpNMkqQOMj8J1Qmj0nPj%OOmkpJ3pJ%J0j1J8j0lMqlJNpN
7979aknjKM%Jo%jL%OLrkMmlJ5llqPMKnJ0j0OLrPj0NoJkPqM%jjNj%LqkJ1j0KJ1
$$ y = [7, 6, 3, 10, -5, -8, 2, 7, -8, 11, 0, 1, 0, 2, 8, -4, -8, -3, -8, -2, -7, 5, 0, 2, -2, 1, -1, -1, 0, -6, -8, -2, -4, 0, -10, -1, 1, -5, -2, 0, 0, 2, 6, 2, -2, 1, -6, 0, -3, -2, 9, -3, 0, 4, -6, 1, -11, -4, 0, -5, 1, -10, 0, -10, -6, 1, -1, -2, 6, -5, -9, 1, 1, -10, 5, -12, 1, 4, 6, 13, -5, 3, -1, 3, -9, -10, 1, 9, -2, 2, 6, -7, 1, 4, 8, 5, 1, -2, -5, 3, -1, 2, -8, -4, -5, 1, -6, -9, 2, -3, -3, -1, -13, 0, -1, -4, -3, 0, 1, 3, 1, 3, -1, -4, 0, 2, -3, -2, 2, 0, 6, 8, 6, -2, 8, 6, -14, -5, -1, -5, 15, -8, -3, 6, -7, 2, 4, -6, -3, -5, -10, 4, -6, 7, -14, -7, 2, 4, 11, 3, -5, 3, 5, -1, 6, 11, 7, 2, 11, 1, 3, 9, 4, 11, 0, 10, 0, -6, 2, 5, -1, 0, 0, 0, -10, 5, 2, -11, 0, -5, -1, -3, -1, 1, 1, -5, -11, -9, -4, -8, -3, -4, 0, 8, 0, -1, 6, -4, -8, 5, -6, 0, -5, -3, 11, 0, -1, -4, -7, 4, -7, 6, 0, 7, -2, -5, -4, 1, -2, -6, -3, -7, 6, 4, 4, -5, -7, -6, 6, 6, 2, 2, -10, 3, -3, 4, 0, -6, -2, -1, 7, 4, 3, -3, 9, -6, -5, -11, -11, 0, 1, -7, -16, -5, -12, -5, 0, -8, -2, -15, -13, 0, -15, -5, -7, -1, -2, -7, -3, -14, -11, -2, -5, -7, -8, -2, -9, 5, -11, 0, -7, -10, -9, -9, 1, 2, 2, -3, -7, -9, -1, -11, -4, -5, -6, -1, -6, -13, -8, -4, -6, -14, -6, 0, 4, -14, -3, 5, 1, -9, -14, -7, -8, -8, -2, 4, 0, -2, -9, 4, -3, -2, -2, 8, -3, 15, 5, 2, 6, -2, -5, -4, 1, -6, -1, -3, -8, -9, -7, -3, -3, -2, -8, -8, -9, -6, -6, 0, 3, -6, -8, -4, -8, -11, 4, 1, -2, -10, -3, 1, 3, -2, 8, -2, 4, 7, -2, 5, -5, 0, -6, -5, -7, 0, -8, -4, -4, -5, -6, -1, -2, -2, 1, -7, -9, 2, -8, -6, 5]
8033Ej2mjLOPj2jJJ5pMj0M%mjJ5%pmLLoRoklOnQj2MqJ0nKpJ0j1RjMkKJ0j4J1p
8082aj0MKJ3rkPomJ0JmKKqMKlLm%jJ0j1L%j3J2nNpNJJj0NJoJ0pJ6moMqKJ4moQ
8132Hj0J6nprJJ2lklLojnOlRpMqR%mKJMj1OnlJQmM%NpJ2Kj3PQnkRrqQqJ1j1J0
8184GmjmLJj3J0
$$ y = [5, -7, -11, -12, -9, -3, 4, -8, -9, -8, 7, 0, 4, -6, -2, -2, -6, -7, 8, 8, 1, -3, 0, 3, -3, 6, 0, -2, -5, 1, -4, 4, -8, -4, -12, -2, -7, -5, -12, -2, -13, -4, -5, -1, -3, -1, 9, -5, 6, -1, -11, -7, -5, 8, -1, -3, 4, -2, -6, 4, 5, 1, 3, 5, -3, 1, 3, 0, 3, -1, -1, -2, 8, -3, 0, 0, -13, -1, -6, -1, -8, -3, -2, -1, -11, -6, -5, -11, -1, -8, 8, 4, -2, 2, -6, -4, 10, 6, 0, 8, -2, 14, 9, 2, -7, -6, 6, 3, 1, -2, 1, -5, -6, -11, -5, -8, 1, -6, -2, -10, -1, -1, -5, -3, -2, 2, -9, -3, -8, -11, -10, -2, -6, -2, -2, 3, -4, 8, 10, -3, 4, 12, 7, 5, 14, 5, -3, 5, -3, 8, -3, 7, 3, 2, -2, 1, 2, -11, -1]
8191a
$$ Imaginary data points
##PAGE= N=2
##DATA TABLE= (X++(I..I)), XYDATA
0@%%%%%%%%%%Qj6J6j6J6k4L2m0M8n6P2q8J04j20J37j61J88k18K54k89L30l78M29
33B28m85N47o19O98p83Q77r78J091j215J346j492J651j823K013k220K448k697
50a413K970l273L608l980M396m862N390n994O690p506Q480r659J1124j3011J5534
65H494j9095K4546l4026N5068j82654J00930L72302k70072k24619J46968J25758
76A03600k23147K767L13342K1920m07548p9459L71906J35361k97857q3989K28232
87H5128j139k46813P6099K92320p6448l23738N5829K94469n0910k53558R1908
98e6853K32863j32185k47611J44855K51642j28281k22519J29698J70620j68047
108b5818j45077K22764J62553k42513j94593K12357J87535j66656j27611J61029
$$ y = [0, 0, 0, 0, 0, 0, 0, 0, 0, 0, 0, 8, -8, 8, -8, 8, -16, 16, -24, 24, -32, 40, -48, 56, -64, 73, -88, 100, -118, 136, -153, 177, -201, 228, -257, 290, -329, 369, -414, 463, -515, 576, -639, 707, -785, 866, -957, 1056, -1164, 1284, -1413, 1557, -1716, 1892, -2088, 2308, -2554, 2836, -3158, 3532, -3974, 4506, -5153, 5971, -7040, 8494, -10601, 13945, -20081, 34987, -147667, -46737, 325565, 55493, -169126, -22158, 103600, -119547, -116780, 196562, 218482, -189066, -268525, 103381, 238742, -59115, -143104, 85128, 83989, -162824, -86725, 205595, 129147, -194591, -138762, 155707, 104797, -148761, -56853, 176010, 43825, -203786, -58931, 192711, 64430, -158089, -28391, 142229, -25818, -170895, 51869, 214422, -28091, -222684, -10327, 177208, 10552, -117059, 43970]
118D3970N3547k09242k2208K70301M7495k87135q8038K45847Q7788j87536l2719
129g7930J66432l7769j96237P2268K40447n7952k51844K8560K19112k6513j73119
140i4545O1104J51228j04623j60023J25393J74554j20091j69037J11627J43747
150A19334j20238j19924J41775J12657j56096j14021J52865J04487j43911p7750
160a00822J48496M9337j69694l8865J88978M6807j86277n2307J62966L5008j42026
171e8399K537J44323l6063j66707M4369J84620l0812j77053J9786J47428l1805
182D2224j19528O3733J13271r3160j25808J01474J36491r1321j28543Q1623J04591
193H5047q7274q1550J05509P2092j21514p3148J25160P1788j20209o0411J17778
$$ y = [43970, 97517, -111725, -133933, 136368, 183863, -103272, -191310, 54537, 142325, -45211, -77930, 88502, 50733, -145504, -73236, 167211, 109259, -142585, -114025, 105087, 78574, -94545, -33441, 117787, 13164, -146859, -21466, 153088, 32997, -136040, -24413, 119334, -904, -120828, 20947, 133604, -22492, -136513, 16352, 120839, -23072, -100822, 47674, 97011, -72683, -111548, 77430, 124237, -62040, -114347, 48619, 83627, -58399, -55862, 88461, 52398, -114309, -69940, 114680, 83868, -93185, -73399, 74029, 42224, -77304, -13571, 99700, 6540, -119268, -17794, 118697, 27376, -101167, -19544, 85047, -2227, -83777, 21732, 93824, -27690, -100838, 24322, 96110, -24099, -84510, 33268]
204C3268M3711j23071l1354J30409K6141j31308k1337J25105R490j19767Q063
215e0650J22230k2190j29586K6335J31712k4537j22302K7689J06402m1975r5650
226g2522O1837R6359p5178j02875P5734J03121o9176r0981O7413P2024p6620n7727
238f8591R1576N4112j01579n6443J01122N4877r4606m4522R0855K9379r4156j7193
250e5169J00897J1371j04477q476J02394L102r8044O226R5871j6098r6257K2932
262c5728R5732k7284r1493L2800Q5135m1607q0616N1258P9635n7390p9137N8635
274a0060P4531n8561o4792O2084N3935p0158m7186P8551M5557q2049m4802P9652
286A6702L9724p5577k9384P5038J7792p9093r978Q4047O974q5320n319Q1886R27
$$ y = [33268, 76979, -46092, -77446, 52963, 79104, -52204, -73541, 51564, 61054, -58713, -50650, 71580, 49390, -80196, -53861, 77851, 53314, -68988, -41299, 65103, 23128, -72522, -10685, 85674, 10496, -92379, -16645, 86476, 17300, -73681, -6268, 65756, -10864, -68591, 22985, 77097, -24482, -80925, 20197, 75074, -19532, -64054, 26801, 56180, -37976, -55169, 45728, 57099, -47378, -55854, 46540, 49642, -48402, -42176, 53695, 37597, -58660, -35728, 60004, 32720, -58773, -25973, 59162, 17555, -63061, -11803, 67832, 10442, -68695, -10060, 64471, 5910, -58882, 3202, 57137, -13021, -60207, 18344, 63901, -18148, -62950, 16702, 56426, -19151, -48535, 26503, 44295, -34798, -44776, 39271, 46245, -39075, -44394, 37492, 38419]
299C8419p6894P075P4074j5955p4070K2565P4494k6441p2787K9757O8787l4402
311A4622o4463M0135O1267m5222n8535M8626N4659n1324m9175N4888M3440n9466
323a0548l9134O3313L6152o4707l2574O3998K6657o3401j8945O4746J1861o7518
335c0100p355O9326M904o8210k074O4709l028o1282J0000N9881j6533o0149K0754
348a9157O0002k2981n7710K5096N3610k8719m9332L3542M6260l8088m4191M1295
360c73M1824m3385l8336M5366L4091m7845k9971N0330K6268n2051k2521N2947
372A6344J8107n3641j3238N4710Q702n5758n090N5911J944n4673J738N2669o423
385B1302n1013J1422N0309j5537m9862J8212M8492k0115m5657K2456M2055k5850
$$ y = [38419, -38475, -31400, 42674, 26719, -47351, -24786, 49708, 23267, -49520, -19763, 49024, 14622, -49841, -9706, 51561, 6339, -52196, -3570, 51089, -235, -49410, 5478, 48918, -10548, -49682, 13631, 49783, -14924, -47498, 16500, 43157, -20244, -39189, 25557, 37418, -30100, -37455, 31871, 36775, -31435, -33509, 31200, 28172, -33110, -23110, 36771, 20238, -39911, -19157, 40845, 17864, -39846, -14750, 38860, 10141, -39191, -5649, 40611, 2523, -41668, -373, 41451, -1934, -40270, 5096, 39187, -8658, -38629, 11701, 37969, -14082, -36603, 16344, 34451, -19190, -32428, 22282, 30984, -24774, -29864, 26047, 27991, -26682, -24944, 27725, 21302, -29711, -18289, 32020, 16483, -33379, -15167, 33325, 13210, -32447, -9991, 32064, 6214]
397F214l8863K9668L6720l2827l5061L4718L2887l5842k9667L7121K5787l9024
409h169k2120M1193J9032m2921j6214M3880J3123m4343r566M4715N866m5104k354
422b2982M5196r34m4748M305M3881p853m2948J1339M2080j4348m0965J6791L9218
435B8032j9060l6797K1579L4200k4388l1915K6990L0071k8924k8157L0066K5671
447B7368l0950k2584L2129J9330l3683j6452L5191J4044l6146j1773L6457R169
459B2100l6479o085L6563K870l6834J22L7046k806l6864N409L6228q093l5328
472b2151J0844L4333j3496l3187J5917L1779j8143l0080K0315K8198k2403k6334
484b4408K4251K4462k5697k2385K6746K0013k7697j7445K8734J4896k9737j2626
$$ y = [6214, -32649, -2981, 33739, 912, -34149, 569, 33456, -2386, -32053, 5068, 30855, -8169, -30289, 10904, 29936, -12985, -29199, 14681, 27804, -16539, -26105, 18610, 24476, -20628, -22982, 22214, 21280, -23468, -19163, 24718, 16865, -26083, -14744, 27336, 12988, -27977, -11186, 28032, 8972, -27825, -6246, 27954, 3566, -28349, -1359, 28712, -212, -28369, 1697, 27368, -3582, -26166, 5963, 25293, -8390, -24842, 10349, 24393, -11753, -23526, 12931, 22100, -14379, -20464, 16099, 18969, -17865, -17743, 19303, 16497, -20367, -14958, 21270, 13177, -22151, -11307, 23026, 9530, -23657, -7740, 24039, 5896, -24184, -3869, 24329, 1926, -24408, -157, 24305, -1392, -23777, 2969, 22982, -4715, -22160, 6574, 21470, -8267, -20893]
496b0893L0491J0538l0792q392L0728N980l0578l363L0571Q11l0654J488L0572
509A6507l545l0151N608K9384p796k8476J0128K7577j2402k6674J4478K5596j6335
522C899k4280J8069K2741j9730k1076K1281J9333k2654j7476K3753J5514k4701
534e327j3440K5496J1394k6143r392K6517P412k6606n393K6511L283k6340j160
547a3188K6163q21k5895K595K5466m275k4781N986K3927p769k3076R597K2259
560A6188j1307k1411J2837K0422j4214j9251J5576J7885j6939j6460J8267J5003
572A6596j9448j3546K0436J1991k1256j0290K1893Q544k2413o784K2776N011k2946
585i436l225K2933J465k2787K51K2529j893k2110L420K1556m901k0821O342K0026
$$ y = [-20893, 9598, 20136, -10656, -19048, 11680, 17660, -12918, -16281, 14290, 15101, -15553, -14065, 16507, 12962, -17189, -11581, 17803, 10007, -18469, -8341, 19236, 6834, -19840, -5362, 20234, 3899, -20381, -2312, 20429, 699, -20377, 904, 20237, -2417, -19893, 3860, 19374, -5327, -18767, 6729, 18123, -8020, -17412, 9105, 16517, -10089, -15482, 11029, 14312, -12028, -13188, 12975, 12154, -13741, -11146, 14320, 10045, -14736, -8750, 15177, 7408, -15668, -6071, 16188, 4881, -16530, -3693, 16729, 2515, -16736, -1160, 16725, -214, -16674, 1593, 16596, -2852, -16398, 4038, 16029, -5227, -15517, 6376, 14920, -7493, -14277, 8499, 13510, -9436, -12661, 10272, 11737, -11050, -10799, 11730, 9837, -12273, -8853, 12703, 7802, -13019, -6677, 13349]
599A3349p776j9195R121J8378j0362j7473J1476J6444j2505j5331J3537J4140
611A3803j4592j2930J5569J1735j6437j0519J7188R178j7801p764J8352O277j8827
624f768m765J9205L270j9424j790J9469L20j9383J174J9157k639j8772M011J8292
638A1357n307j7702O567J6988p735j6201Q799J5360r761j4443J0620J3459j1422
651E79j2424J2177J1359j2879j0318J3515R257j4058q169J4532P000j4934n803
664a0166J5314M582j5652l364J5917K133j6039r27J6087l48j5978J588J5835k850
678F132j5565M060J5218n205j4752O291J4169p311j3479Q243J2731r114j1898
691a0480R859J1019j0523j0112J1119R143j1594q195J2007P217j2336o228J2599
$$ y = [13349, 5573, -13622, -4501, 13877, 3515, -13958, -2482, 13962, 1457, -13874, -337, 13803, -789, -13719, 1850, 13585, -2852, -13371, 3817, 12995, -4806, -12570, 5782, 12059, -6768, -11533, 7672, 10942, -8482, -10272, 9197, 9517, -9866, -8692, 10465, 7826, -10946, -6935, 11357, 6050, -11652, -5085, 11903, 4168, -12033, -3234, 12126, 2365, -12078, -1458, 12001, 579, -11845, 332, 11691, -1188, -11506, 2009, 11266, -2792, -10961, 3571, 10571, -4363, -10166, 5148, 9730, -5922, -9286, 6631, 8764, -7275, -8202, 7885, 7537, -8441, -6853, 8982, 6132, -9433, -5373, 9845, 4640, -10112, -3821, 10348, 3037, -10442, -2199, 10532, 1418, -10480, -621, 10398, -125, -10237, 882, 10025, -1569, -9764, 2243, 9460, -2876, -9104, 3495]
704C495N204j2802m213J2996L199j3101k220J3160J239j3156k39J3097p81j2965
718g087J798J2813k814j2570L789J2270m743j1882N662J1405o555j0832P393J0213
732H860q179r527Q858Q780r449p995R951P158j0363o303J0688N421j0945m540
746g585J1113L659j1189k814J1230J973j1189j150J1103L30j0955M75J0785j275
760D511j0558K049J0331k817j0049L552R727m281r364N017Q935n720q461O392
774g36P952p032p397P622O764q132o125Q598N411q985m687R311L926r546l166
789f222R692K409r761j669R764R31r682k02R548m71r369J130R143j762q867K365
805c023Q569k955q220L496P871m035p490M551P094n050o675N530O216n992n736
$$ y = [3495, 8699, -4103, -8316, 4680, 7879, -5222, -7442, 5718, 6957, -6199, -6438, 6659, 5878, -7087, -5289, 7524, 4710, -7860, -4071, 8199, 3456, -8426, -2764, 8641, 2086, -8746, -1353, 8860, 681, -8846, 12, 8792, -657, -8652, 1299, 8457, -1906, -8209, 2479, 7900, -3045, -7585, 3528, 7187, -4002, -6816, 4414, 6387, -4802, -5952, 5151, 5481, -5474, -4999, 5786, 4511, -6047, -3998, 6333, 3516, -6533, -2981, 6746, 2465, -6899, -1882, 7053, 1333, -7128, -736, 7216, 184, -7213, 409, 7173, -959, -7084, 1514, 6925, -2060, -6747, 2564, 6490, -3056, -6222, 3470, 5879, -3882, -5551, 4213, 5144, -4538, -4740, 4808, 4337, -5032, -3902, 5241, 3479, -5388, -3023, 5546, 2591, -5629, -2133, 5738, 1703, -5787, -1236, 5858, 808, -5867, -337, 5879, -113, -5849]
820e849O440N197o827m656P199M074p542l466P817K851q058k204Q222J548q308
835c562q90Q343K34q306M18Q199j021q047J607P827k149p566K669P256l142o928
851e058L600O554l995o179M367N784m720n357N021M948n330m512N601M047n873
866a102l568O110L092o342k587O541K068o707j523O821R85o907m33O955j33o947
882c677P03O891j257o764J779O594k257o405K761O133l198n839L598N503l946
897F19n145M255M770m527m392M771L974m968l563N137L143n285k743N416K319
912C781n521j904N616J484n688j037N743N89n782j19N763l07n756P93N704j276
928B083n587J717N462k167n288K600N082l009m822L380M542l729m229M020L899
$$ y = [-5849, 591, 5788, -1039, -5695, 1504, 5578, -1964, -5430, 2387, 5238, -2820, -5024, 3198, 4746, -3562, -4452, 3891, 4125, -4181, -3763, 4436, 3415, -4632, -3025, 4802, 2653, -4913, -2244, 5012, 1870, -5058, -1458, 5096, 1101, -5078, -711, 5073, 353, -5004, 17, 4965, -365, -4877, 724, 4771, -1102, -4670, 1440, 4532, -1810, -4397, 2144, 4212, -2495, -4018, 2803, 3788, -3119, -3552, 3403, 3270, -3677, -2974, 3917, 2660, -4104, -2325, 4269, 2012, -4393, -1632, 4501, 1303, -4536, -938, 4565, 619, -4526, -271, 4499, -28, -4420, 351, 4325, -643, -4206, 931, 4074, -1211, -3954, 1462, 3781, -1740, -3644, 1972, 3456, -2232, -3269, 2474, 3063, -2719, -2838, 2925, 2618, -3138, -2345, 3359, 2083, -3504, -1787, 3675, 1508, -3780, -1180, 3902, 893, -3929, -549, 3993, 264, -3965, 55, 3954]
943C954m292l538M504L160m678k781M808K393m895k027M966J638m998j260N000
958A954Q91m981n32M956J72m911J99M840n32m757Q76M677j245m554J600M432j964
975A121m275K317M081k648l887K985L640l287l373L556L093l811k791M037K449
990C207m196k135M354J760m426j424M488J072m527p17M503L97m453r1M406k13
1006B005m317M99M212p84m085J064L958j308l828J567L677j835l505K074L346
1021B740k340l133K571K922k810k698L034K456l262k184L442J902l609j622L754
1036A163J310l852j001L932O82l981l61L977O5l951K39L918n40l818P97L716j048
1053A247l574J271L449j513l266J696L102j866k937K050K746k215k557K360K363
$$ y = [3954, -338, -3876, 628, 3788, -890, -3671, 1137, 3530, -1365, -3392, 1574, 3212, -1786, -3046, 1954, 2845, -2136, -2668, 2288, 2460, -2451, -2252, 2588, 2056, -2701, -1825, 2852, 1607, -2947, -1347, 3085, 1121, -3154, -837, 3244, 596, -3291, -306, 3334, 47, -3326, 230, 3323, -488, -3279, 758, 3207, -989, -3124, 1230, 2990, -1436, -2860, 1628, 2700, -1827, -2544, 1959, 2356, -2097, -2188, 2218, 2005, -2312, -1813, 2399, 1615, -2470, -1406, 2552, 1244, -2584, -1017, 2660, 825, -2680, -606, 2740, 400, -2733, -162, 2760, -50, -2748, 286, 2742, -520, -2704, 738, 2640, -969, -2591, 1163, 2473, -1379, -2380, 1552, 2234, -1747, -2108, 1869, 1934, -2017, -1778, 2140, 1600, -2218, -1421, 2295, 1247, -2327, -1056, 2393, 880, -2386, -690, 2412, 546, -2391, -341, 2405, 190, -2367, -7, 2356]
1068B356k522k165K677J946k811j727K941J483l073j224L161R72l248p18L339
1083A387M32l377j43L397j26l402M16L368o86l297R50L207j197l086J411K971
1099B225j622k817J804K643j967k453K091K289k233k091K326J902k430j704K501
1114D64J514k576j312K628J113k692q93K721O86k775m49K802K30k818mK836k29
1131A246k822M77K784p09k740R48K683j179k588J400K472j603k331J773K188j939
1147F0k022K078J853k209j666K299J465k356j300K412J092k437r19K473P25k465
1163i17n56K456L90k465j91K438L6k433J59K400l35k369N34K320p13k258Q96K186
1181A578j083k096J269J992j429j883J588J755j755j608J882J459k018j274K093
$$ y = [2356, -166, -2331, 346, 2292, -519, -2246, 695, 2178, -895, -2119, 1042, 2014, -1234, -1952, 1387, 1819, -1558, -1701, 1696, 1570, -1832, -1416, 1952, 1266, -2031, -1081, 2126, 929, -2157, -746, 2225, 603, -2214, -410, 2233, 266, -2187, -96, 2193, -40, -2131, 195, 2097, -333, -2037, 464, 1978, -598, -1910, 718, 1831, -861, -1754, 967, 1653, -1122, -1571, 1231, 1461, -1357, -1361, 1475, 1246, -1576, -1099, 1685, 976, -1764, -816, 1867, 688, -1900, -500, 1972, 369, -1962, -189, 1999, 60, -1962, 116, 1969, -240, -1906, 393, 1858, -498, -1798, 614, 1706, -731, -1650, 823, 1548, -917, -1473, 983, 1373, -1092, -1283, 1155, 1191, -1242, -1083, 1317, 982, -1387, -853, 1467, 754, -1504, -608, 1578, 495, -1601, -332, 1660, 231, -1652, -64, 1691, -64, -1672, 210, 1669, -349, -1623, 470]
1196D70J120k198r27K233P58k269n72K270M08k270k51K267Q5k229O7K191k13k131
1214a191L51K080m84k009O19J938p41j869Q80J793j014j707J141J608j262j498
1230a365J367J401j516j275J632J137j741r86J821Q39j899o89J963N17k009l47
1246a150K027J89k024m5K029j21j985K54J952l89j897N28J824o29j754P34J686
1263A229q44j599R32J499j003j420J106J316j174j228J243J119j316j022J393
1278B31R14j472p92J540O59j606n10J630M05j696k53J726R2j731N0J745k11j711
1296i90L48J688m78j637N95J590p14j517Q20J441r00j366R95J265j061j172J118
1313B5J077j167r94J200R01j243q11J286P03j318o05J351M87j363l99J407K71
$$ y = [470, 1590, -608, -1535, 698, 1456, -813, -1385, 885, 1293, -977, -1228, 1039, 1124, -1105, -1038, 1153, 940, -1191, -840, 1240, 756, -1253, -634, 1304, 563, -1306, -426, 1367, 353, -1354, -213, 1395, 133, -1365, 2, 1403, -113, -1388, 244, 1381, -360, -1346, 475, 1314, -585, -1274, 689, 1206, -803, -1150, 877, 1066, -958, -1003, 1026, 905, -1080, -826, 1126, 737, -1160, -632, 1192, 563, -1191, -457, 1229, 385, -1214, -282, 1217, 214, -1206, -100, 1216, 42, -1186, 57, 1176, -140, -1162, 231, 1145, -327, -1119, 421, 1080, -526, -1036, 594, 999, -697, -950, 776, 868, -863, -813, 932, 721, -990, -642, 1046, 568, -1069, -474, 1116, 402, -1115, -295, 1146, 246, -1120, -125, 1140, 79, -1093, 25, 1102, -65, -1059, 141, 1042, -201, -1012, 274, 977, -341, -946, 405, 892, -471, -870, 537, 808]
1330H08j421j72J452M7j451P7J446j94j434L25J423m65j367N78J338p01j274P98
1348a87J207q89j134R75J045j036r61J091Q71j149p81J189O86j221o03J236N13
1365H52j259m07J238L27j245k24J230J58j234p4J240k4j215J05J217k06j197L08
1383d10J161m02j119M96J098o03j050P00R91p87r26Q83Q42r47p76J014O79j067
1401b23o01J113N12j155m04J148L40j167k51J164J59j162q1J150J5j125N2J113
1419E97j35j060J84J042k57j005L23R81l88r45M57R12n30q71O05Q13o64p64P37
1438C2P02q11o34Q61N57r11m82R56L93r96l23J039K24j051j37J049N9j044J7J043
1458E43r7j023J72R92k25r55K85R23l40q88L85Q54m29q01M64P79n12p28N48O94
$$ y = [808, -613, -785, 667, 714, -737, -660, 786, 592, -842, -517, 906, 441, -926, -348, 990, 289, -985, -187, 1020, 131, -1003, -28, 1017, -19, -980, 111, 982, -167, -948, 241, 927, -294, -897, 339, 852, -407, -814, 424, 751, -494, -718, 512, 670, -564, -638, 602, 578, -637, -532, 685, 479, -718, -410, 751, 349, -770, -274, 824, 221, -829, -129, 862, 75, -851, 32, 874, -73, -849, 165, 844, -223, -824, 289, 801, -354, -758, 390, 730, -437, -688, 476, 635, -527, -608, 542, 557, -568, -516, 597, 462, -598, -414, 628, 371, -634, -311, 670, 282, -663, -206, 706, 176, -695, -90, 723, 59, -705, 32, 734, -77, -711, 150, 707, -204, -686, 270, 663, -333, -656, 383, 607, -444, -581, 468, 527, -517, -500, 543, 446, -577, -405, 587, 362, -593, -308, 615, 275, -613, -228, 626, 197, -604, -140, 639, 127, -601, -53, 641]
1478F41o09o42O47N82o94n19P21M64p83l92Q08L29q52k48Q69J95r09j08R26J5
1498D41r19O5R14j39q91K06Q87k75q57L39Q22l89p91M47P53m89p08N30O62n56
1518E2o17N75N73o05n27O26M73o53m22O57L90o91l37P20K57p26k06P39J48p71
1538c45o8P68J3p78O7P79j30p61J95P54k73p29L42P11m02o63M42O40n00n96N44
1559A0N43n77n03O00M54o24m01O23L67o62l03O43K73o68k20O66J79o65j28O73
1579B80P5o61m2O64j5o46O5O49j22o28J66O51k51o05K88N95l50n52L88N22m35
1600C6m90M84M49n35m01N71L49n92l05O02K55o12k17O26J58o15j25O24P7o20l9
1621c20O09Kn92K4N92o6n74J11N74j58n39J78N28k23n03K75M81l09m59L39M39
$$ y = [641, 32, -610, 37, 619, -75, -594, 127, 591, -192, -584, 224, 553, -299, -547, 322, 517, -392, -500, 426, 441, -478, -413, 501, 362, -529, -323, 564, 289, -568, -229, 593, 204, -587, -140, 613, 124, -584, -54, 608, 52, -565, 10, 583, -22, -549, 77, 550, -103, -525, 132, 522, -169, -506, 214, 471, -255, -461, 278, 426, -345, -413, 355, 368, -410, -343, 436, 306, -455, -260, 494, 221, -508, -166, 545, 143, -520, -78, 562, 62, -534, 10, 553, -24, -527, 73, 527, -97, -498, 125, 492, -170, -473, 170, 443, -225, -445, 221, 400, -265, -393, 280, 355, -306, -348, 316, 301, -345, -280, 369, 247, -381, -215, 436, 185, -420, -132, 463, 113, -439, -51, 471, 36, -454, 30, 479, -56, -457, 114, 463, -129, -434, 168, 423, -189, -406, 220, 378, -237, -362, 262, 339, -281, -320, 289, 291, -301, -277, 315, 249, -325, -214, 360, 202, -337, -159, 369, 146, -357, -82, 399, 90, -369, -30, 409]
1642D09l92l91M03L67m59l15M86K89n32k36N38J87n53j34N58R0n76m1N70Jn65
1663b96L9N52o8n43J05N34j38n09J73M98j93m78K12M62k46m31K64M06k89l79L07
1684a8L74l52l32L71K99l97k67M11K29m39j93M69J38m84r6M80O3m90j9M99k3n05
1706b82P2N09j24m75J47M84k08m51K38M25k47m10K78L79k79l78L18L48l31l16
1726c03L45K77l52k73L66K37l61k14L80J78m05j51M13J15m15q9M27M8m38QM28
1747B21k8m36O9M39j23m09J53M04j94l83K19L89k72l49L00L13l04k96L18K75l41
1768c5k46L47K08l50j90L68J65l72j54L81J14l66j08L76P8l82m9L74K0l60%L82
1790B01n3l57P4L62j15l42J38L49j69l35K05L07k17l06K71K75k97k51L10K20l33
$$ y = [409, 17, -374, 29, 396, -63, -378, 108, 397, -135, -371, 167, 354, -199, -333, 225, 315, -261, -302, 268, 269, -296, -257, 295, 227, -316, -211, 323, 185, -324, -151, 347, 154, -324, -112, 350, 104, -327, -63, 343, 54, -325, -18, 356, 4, -328, 43, 342, -55, -322, 89, 318, -121, -314, 155, 293, -191, -287, 193, 256, -234, -253, 246, 223, -282, -210, 299, 175, -300, -153, 331, 123, -328, -90, 335, 88, -322, -44, 335, 56, -322, -4, 344, 13, -303, 42, 319, -33, -306, 60, 297, -64, -278, 102, 280, -125, -276, 137, 252, -163, -252, 175, 223, -215, -207, 221, 193, -243, -174, 265, 142, -267, -114, 290, 96, -287, -68, 321, 49, -300, 0, 313, 9, -287, 31, 306, -35, -281, 66, 274, -76, -266, 102, 267, -105, -259, 122, 236, -130, -238, 138, 216, -166, -215, 159, 179, -181, -181, 201, 148, -209, -135, 227, 112, -230, -92, 257, 88, -247, -42, 265, 48, -258, 13, 288, -9, -260, 50, 270, -63]
1811f3j91L49J64l61j37L65J07l68q8L64N8l69k5L48J8l47jL49j5l49N3L15o1
1834A15l16Q3L21j03l02J31K81j46k70J67K75k03k44K14K31k41k12K68J82k93
1854f2j37K79J41l12j07L25O9l40m2L32J3l34J6L21l1l23M8L19o4l10J00K79r9
1877H1k62J11K63j24k53J35K50j40k47J70K33k01j96J97J94k20j73K29J49k49
1897e3j12K35J09k67q4K76N6k78m1K85%k81J8K94m7k82O3K72q3k67J13K60j28
1920E8k44J40K39j53k23J73K15j77j94J86J64j75j62J82J46j93j43K14J16k09
1940d0j05K06J01k45o8K45L7k38l6K49Mk42J3K52m3k36O5K28p3k32J11K17j24
1963D6k05J37K01j61j78J80J64j87j58J92J33j93j25K04J20k11j06K09Q7k04p7
$$ y = [-63, -254, 95, 259, -102, -239, 126, 233, -135, -223, 141, 199, -170, -195, 153, 171, -176, -177, 172, 157, -192, -139, 176, 115, -201, -118, 203, 100, -202, -71, 210, 64, -206, -39, 236, 33, -211, 3, 234, -7, -219, 49, 231, -62, -199, 80, 221, -91, -198, 127, 196, -144, -186, 146, 159, -175, -159, 162, 131, -192, -144, 175, 111, -199, -99, 180, 81, -181, -70, 193, 69, -184, -49, 201, 61, -186, -16, 217, 16, -180, 17, 211, -9, -182, 47, 196, -53, -165, 70, 179, -88, -172, 104, 160, -118, -159, 126, 126, -155, -137, 157, 110, -172, -109, 163, 80, -187, -74, 186, 58, -186, -46, 193, 40, -183, -10, 205, 28, -166, 20, 184, 9, -153, 29, 175, -18, -161, 53, 169, -40, -145, 61, 162, -83, -151, 94, 131, -107, -143, 106, 110, -132, -119, 133, 90, -146, -81, 147, 74, -158, -47, 170, 46, -159, -22, 179, 18, -160, 20, 184, -3, -161, 31, 164, -29, -154, 50, 170, -41, -147, 62, 149, -55, -132]
1984a32K13M5k03m3J93M6k27mK04Nk10RK08l7k02O1K00o3j95Q5K02j07j84J27
2008iJ79j56j46J51J39j80j16J83J15j96j04K00Q1k08n5J96M7j95m7K00L2k11
2030a00k1K17Jk07K6J80j9j95M1J87m5j79N4J91q1j61P0J73r2j56J00J50j20j23
2054a09J21J33j59j01J56R1j78p7J87N0j75n1J79L1j91j0J86Kj97K2J80k7j70
2077a07K2J79m4j61N4J67n7j68P2J52o9j37P3J38q3j37J04J26j09j16J23J08j38
2100hr1J37P0j39p4J56O6j71m8J64K5j74rJ77j6j65L2J58l6j64N7J66p2j52O7
2125d4J56q6j28Q2J44j08j17J05J19j09j13J17J05j10j00J05J06j37o9J20O0j29
2147c1o9J44M5j43m3J51K4j32k7J52j8j31J5J49l8j40M0J43o0j35P8J35q7j11
$$ y = [-132, 81, 126, -77, -120, 73, 119, -108, -112, 92, 97, -113, -104, 104, 67, -135, -74, 126, 63, -132, -47, 155, 48, -136, -9, 170, 14, -132, 19, 158, -22, -138, 45, 160, -36, -140, 60, 141, -67, -122, 74, 121, -74, -121, 79, 111, -100, -121, 96, 97, -110, -84, 96, 77, -118, -77, 110, 65, -114, -60, 131, 50, -111, -41, 132, 40, -116, -16, 134, 14, -109, 12, 145, -14, -115, 41, 132, -46, -123, 64, 114, -61, -112, 67, 98, -93, -103, 83, 85, -112, -90, 90, 63, -107, -85, 94, 50, -111, -57, 110, 53, -115, -43, 109, 40, -97, -24, 114, 31, -106, -2, 124, 15, -101, 22, 130, -8, -99, 38, 108, -31, -105, 51, 117, -54, -102, 62, 87, -87, -96, 81, 65, -100, -68, 90, 54, -110, -53, 113, 41, -111, -44, 112, 26, -102, -20, 124, 16, -101, 4, 123, 14, -99, 18, 123, 13, -87, 18, 124, -13, -82, 38, 98, -31, -100, 44, 89, -54, -97, 54, 78, -54, -81, 71, 53, -78, -63, 86, 48, -92, -52, 91, 31, -104, -26, 109, 22, -89]
2171h9J00J05j03j11J21Q9j19r0J33P0j12p9J22N8j23n5J20N4j21n2J21L5j27
2194e3k7J32Qj28j5J37oj20K2J23l9j15L8J27m5j29P7J14p9j12R1J00r8q8J04
2219A9P4j09n5J17M9j17o2J28M1j26l1J13K8j24k6J40j1j17JJ24rj12NJ18j9j11
2245g2K2J14k9j21O7J02n1j08O0R9p2q4P4R6q5q4R8O3j03n0J07L7j09m4J15L0
2271G2j15k3J11Kj06qJ21rj19K0R4k2q8J4J22l4j01L6R9m4q7N8P9n7r1O9R8p4
2299A7p4P0O9p4n7P9N5q8n8R8L0q7l1J01J8j11mR0oq9JJ03k4r9K1J00k9r0L7Q6
2329E4m5q3M7R3m8q8O4Q5o9o4P5M9o9o4P8O6p1o3Q5L5q3m6R0K9p8k8R1Rq6k1R4
2360C8jr8OR8j2r0J8Q4j8j09O1P6m1p1M9O9n9n9O0P0p2o3P3N6p5m0P1M2p6l6Q2
$$ y = [-89, 11, 116, 13, -98, 23, 112, -7, -97, 36, 106, -6, -85, 37, 95, -28, -83, 37, 91, -30, -82, 39, 74, -53, -80, 52, 60, -68, -83, 54, 48, -72, -50, 73, 34, -81, -43, 84, 39, -90, -13, 101, 22, -90, 1, 101, 3, -85, 19, 93, -16, -71, 46, 95, -22, -84, 44, 85, -41, -72, 41, 69, -55, -81, 59, 48, -69, -68, 56, 47, -65, -60, 58, 39, -72, -50, 64, 35, -86, -19, 83, 32, -76, -16, 83, 11, -73, 1, 97, 12, -72, 26, 89, -14, -64, 43, 80, -29, -73, 42, 72, -43, -66, 45, 47, -59, -67, 54, 45, -74, -54, 40, 18, -70, -56, 66, 32, -69, -33, 66, 22, -65, -7, 72, 15, -76, -7, 91, 17, -57, 13, 82, 8, -49, 30, 85, -3, -61, 37, 67, -20, -51, 50, 68, -43, -47, 43, 37, -52, -51, 52, 28, -71, -50, 50, 21, -69, -32, 54, 9, -74, -27, 66, 18, -70, -6, 79, 10, -54, 21, 70, 1, -63, 15, 81, 10, -53, 32, 67, -16, -62, 28, 57, -21, -49, 42, 51, -35, -56, 38, 37, -61, -55, 43, 31, -59, -41, 43, 25, -84, -23, 53, 12, -59, -10, 59, 0, -59, 1, 71, -1, -64, 9, 65, -10, -50, 21, 63, -13, -49, 33]
2391C3K7p5m2Q8J7q3j3P3J0q1QP0mp7OQ0j2q3K0P9k4p6L8O6l8o1M3P8m8o8N5O1
2423F7p5l8P2M7q8k3O8L1p5k8P9Po2k2P5Qp4j3O9Ko8MO1po3RO8j9n4J5P9k7p3
2456d8L3O1k7p1N9M3l9m7N4L6m3l8M9M5o8l3O5K5p0j8O2J5o1j0N8Lo2nP2k2n9
2487d1J1N1pn6OO6k6m6K2O0j9o3K8O1l1m8L0N5m0n0M6L6m9k7N4K9o0k5N7K7o0
2518ik3N4Nm7j2N8ko6J8N1j2n3J0P0l6m6K7M5k6n2L4M4k4m8L4N5l9m4N0L8l9l8
2550b3L3L8m9k3M6K7m4k7M5J3m4k1M4Pm0j3N1Po5J0M8k0m0K0N0k1o0L0N1k3m8
2581d1K6M8l5l7M9L5m4l3N4K3m3k4L4L1m5k4M8J7m3l3N6J8m9k7N9Kn1j1N4J3n5
2612b8jM1mm8K0M2j7l6QM9l1m1M4L8l0k9L3L0m0j9L8J8n1jM0J7m2k1M7J0n1j0
$$ y = [33, 60, -15, -57, 31, 48, -35, -48, 25, 35, -46, -38, 32, 28, -49, -43, 37, 25, -58, -38, 41, 17, -59, -21, 45, 7, -54, -11, 67, 19, -49, 6, 67, -8, -46, 26, 73, -15, -38, 30, 61, -14, -42, 37, 44, -18, -40, 35, 43, -31, -44, 25, 27, -41, -37, 24, 17, -46, -37, 31, 12, -42, -27, 52, 25, -48, -15, 46, 19, -52, 7, 50, 11, -36, 18, 54, 11, -27, 22, 67, -1, -34, 31, 56, -14, -32, 30, 45, -16, -26, 32, 35, -27, -32, 40, 18, -41, -30, 21, 14, -42, -36, 30, 4, -42, -20, 40, 21, -42, -14, 47, 16, -32, -2, 53, 13, -37, 9, 45, -4, -31, 23, 52, -8, -33, 24, 51, -9, -32, 22, 27, -20, -32, 26, 24, -42, -24, 27, 15, -38, -28, 42, 6, -40, -13, 32, 6, -46, -12, 32, 8, -40, -6, 49, 10, -34, 16, 54, 15, -23, 10, 48, -1, -24, 22, 49, 5, -22, 23, 36, -8, -29, 15, 22, -18, -31, 20, 27, -38, -28, 20, 0, -40, -20, 30, 9, -51, -21, 30, 7, -41, -15, 33, -2, -39, 10, 45, 1, -32, 22, 45, 2, -22, 12, 43, -2, -26, 22, 39, -4, -37, 19, 37, -12, -39, 20, 22, -29, -40, 14, 27, -28, -29, 12, 8, -40, -20, 22, 5, -31, -23, 26, -5, -46, -2, 36, 6, -23, 10, 40, 0, -19, 19, 37, -14, -15, 25, 42, 0, -21, 26, 36, -15, -25]
2644b5M9Om7j0M2nm5OL7Om8oN6pm1J2M7j9m1J7M7k8l3L2K1j7k6L2L2l8k5K9K4
2677C4l5j6M2Ol5j8M3J3o2PM5jn8J7L7mn2J6L3rl9K9K2j7k9J2N0k5l5J4L7j9l0
2710b7K7L4k1m1L9L2l5k6L7J9m5nL3Om3%M1nl6LL2Kn4J3M3k1l1QL1pm1K5K8j1
2744Dm0K8M2l6j7J5K7j8j7K6J8k1k1K1J9k7j6K7K3l4k0L7J5m6MK6j0k7kM2j2l4
2776b4jM2rk7J5J9j2k9K1K9k3k9K0L5k6l2M1J9l5%J5J9j9j1K5J3l1rJ8J9k9j5
2808a1L5qk5qL0Ol5mL2Ml8QK9j6k6K4K0j6k2J2K9k1j9K6J8j1k2K9Nk1nK1J7m2
2842eoL0Nk1LK9ml8lK8Nn4J1L9j2j7mK6ql2J7K1j0k1J3J5j0j6RL0j7k2K9Rj8r
2878hJ4K1l3nL7ok1kK3%j8pK1Nk9LK2pk8PL0k6j8J7K0pk3OL0k1j5J8K2j7j4J5
$$ y = [-25, 24, 30, -17, -27, 15, 10, -35, -29, 8, 14, -34, -40, 16, 9, -32, -20, 27, 8, -33, -16, 31, 3, -30, 2, 23, 6, -20, 12, 44, 6, -19, 10, 34, -1, -17, 25, 31, -4, -22, 21, 34, -28, -21, 24, 23, -35, -18, 19, 15, -37, -21, 12, 3, -36, -7, 15, -2, -31, -19, 31, 6, -29, -15, 22, 3, -27, 0, 34, 13, -28, 11, 43, 8, -18, 19, 38, -7, -12, 21, 27, -16, -16, 25, 20, -16, -13, 19, 21, -33, -20, 23, 2, -29, -21, 10, 3, -38, -13, 15, 4, -36, -8, 34, -2, -19, -4, 23, 5, -12, 14, 32, 11, -10, 11, 30, 3, -13, 14, 37, 3, -17, 20, 35, -11, -7, 19, 9, -18, -20, 22, 10, -24, -25, 17, 8, -19, -4, 15, 3, -26, -5, 24, 1, -28, -8, 27, 1, -31, 10, 29, -6, -6, 9, 28, 9, -2, 23, 36, 5, -4, 14, 33, 4, -11, 24, 16, -9, -17, 13, 19, -16, -20, 12, 16, -22, -14, 15, -1, -27, -3, 17, 1, -21, -9, 20, -1, -20, 6, 24, 13, -9, 20, 25, 4, -1, 20, 37, -5, -11, 19, 24, 3, 6, 35, 31, -7, -10, 18, 23, -31, -20, 19, 7, -10, -14, 12, 4, -28, -11, 10, 0, -21, -8, 7, -3, -19, -10, 20, 3, -19, 10, 19, 1, -8, 6, 27, -6, -11, 26, 20, -1, -3, 20, 20, 2, -5, 16, 21, -8, -5, 17, 10, -18, -11, 19, -7, -25, -8, 12, 5, -18, -12, 18, -3, -18, 0, 22, 5, -9, 6]
2914FK6j9k0J8Qj6j2L2jk0%J9Nk9oL1jk5j3L8k0pKK5k0k7J2K5j2k6J3K1j1j6J6
2949dJ9j6k5J9J6oj6J9J1k1qJ1K8j7j7J9J3k1kQJ3l4NJ7%j4mK1j2k2J2K8k7j8
2983b5JL3k0k3K1K3j5j3J0Oj4j2K1J2mj2J0K4k3KJ6%k5PRJ4l2LK3j5qlJ6pj5r
3019b4L2rj4KJ0Nl8J6J6oj7J4J6oj3J1J5j6j4J3K7k5OJ3pjj0K0oj6RK0pj9%J9
3055A6j3j4mK0kj9MJ4pj5J6J2k4kJK0j6j4J8J7j6oJ2PkoPJ3k4lK9mj2LJ3Kk3%
3093bJ9pj6RPpj9J1J9k0j2NJ2orMJ9pl2J7J7j1j5K0J0j4mJ6J0k4KJ2J0k0lK0L
3130A4j0lJ8rjK%Qk5RJ9j1k2J0Pj0oOK0k3r%J2j3j0J6J3%j6LJ4rqJ8RrrJ8nrj0
3171a1L0J7l6MQJ2k7oL0j9j1QJ6j6j0PJ0j3rQJ3k2pK1nj5PMJ9j6LJ0Kj3jJ0J8
$$ y = [6, 32, 13, -7, 11, 19, 3, -9, 23, 22, 2, 2, 21, 26, -3, -9, 22, 21, -4, -17, 21, 1, -6, -4, 21, 1, -26, -14, 11, -1, -27, -14, 7, -4, -20, -4, 15, -1, -26, -7, 9, 3, -13, 6, 17, -4, -12, -1, 27, 10, -7, 12, 25, 4, 2, 10, 23, -11, -6, 11, 11, -3, -7, 14, 2, -20, -8, 20, -7, -25, -24, 9, -11, -34, -13, 10, -5, -18, -8, -2, -16, -28, -7, 5, 1, -11, -1, 23, 0, 2, 18, 18, -7, 0, 9, 23, -9, -6, 17, 2, -6, -9, 7, 0, -15, -24, 8, -1, -15, -13, -3, 2, -36, -20, -4, -10, -27, -13, 3, -3, -16, -5, 10, -6, -20, -7, 20, -5, 1, 14, 7, 6, -4, 16, 10, -6, 3, 23, 16, -3, -3, 16, 3, -11, -15, 5, 3, -16, -12, 2, -5, -20, -4, 8, -16, -18, -17, 3, -13, -27, -9, 8, -8, -14, -2, 5, 3, -3, 4, 17, -7, -10, 19, 15, 3, 6, 19, 21, -2, -2, 17, 10, -6, 3, 10, 3, -16, -5, 14, -6, -18, -13, -1, -7, -16, -12, 7, 0, -32, -15, 2, -9, -24, -4, 6, -8, -12, 4, 14, -10, -8, 4, 14, -6, -9, 11, 14, 4, 1, 19, 10, 9, 11, 11, 19, -6, 3, 22, 11, -11, -1, 6, -4, -10, -4, 16, -7, -16, -16, -4, -17, -27, -11, 2, 2, -14, -11, 3, -6, -14, 4, 13, 4, -5, 13, 8, -1, -11, 19, 36, 0, 4, 12, 24, -3, -9, 21, 2, -9, -1, 15, -1, -11, -4, 6, -7, -16, -8, 5, -17, -24, -3, -8, -23, -16, -12, 7, -9, -6, 4, 6, -7, -8, 2, 20]
3208B0j0qJ0Rj9MQOj4oK6nj3rOJ3l5J4J6Jk1%J3j1oKJ8rj4OJ7k0pJ2Qj7Q%J7m
3248Fj7J9J3j4JJ3mj6NLkqKJ5%jk5J9opoJ3kk1J1jNj7J6Nj3pJ2J3pqNJ5kk0K0
3289GQoj1J0QpJJ0oj2kK1j1j1QJ2pk1MNMk5MK0lj0nP%j4J0O%j5J0J2pj1QPLlJ3
3332A1jj6PJ2lrJ2Qj2j%QnplMoj1J1J8j8k3J7KOj8J7Kj8kLJ7j5jPJ1j2mJ1J6j6
3373aLJ2Lkk0K6kj6J0%Qj6j2K3lj7jJ8j7j2J0Rj2lK%lKJ4ojpMJ6rj6J1QmkRkp
3416cpJ8J8j8j0K3Kj2j4J4Ok1KJ2rqMPpj2MJ4j1j5J6KqkMQoj3K1pnJK8lj3lJ9
3457A6Nj0j2J3KmJ1j0llnJ2Jj2lJ0j0KjQkj9kJ4oqoK2%nlRj0kJ6pMqJ6jqlJ6K
3501A6k4RK9j4j4rL0rk0J2OrLkJ%j3RRoj9J4jj%oJ9rj4R%nqK0RroQJ4j0nNOj8
$$ y = [20, 10, 2, 12, 21, 2, 6, 14, 20, 6, 0, 26, 21, 8, -1, 5, 18, -17, -3, 13, 14, -7, -7, 6, -5, -11, -9, 9, 0, -14, -8, 9, -11, -18, -6, 2, -15, -7, -7, 10, 6, -11, 8, 21, 7, 8, 21, 17, 1, 6, 9, 7, -1, 1, 16, 16, 15, -10, 9, 3, -4, -10, 3, 1, -20, -9, -10, -5, -22, -6, -1, -14, -21, -9, 4, -3, -11, -6, 9, 7, -13, 7, 15, 9, -2, 8, 16, 9, 10, 20, 14, 2, 0, 21, 10, -1, 7, 19, 12, -9, -5, 0, 4, -21, -17, 3, 0, -10, -15, -8, -8, -22, -12, -6, -6, -21, -11, 1, -6, -17, -9, -2, 1, -2, 11, 10, -6, 1, 13, 10, 1, 13, 21, 9, 8, 8, 16, 11, 4, 1, 5, -1, -12, -1, 17, -1, -24, -7, -5, 1, -17, 0, 2, -16, -18, -15, 2, -13, -14, -7, 4, -8, -12, -1, 15, -1, 2, 14, 17, 15, -5, 21, 19, 3, 13, 13, 21, 5, -7, 16, 13, -4, -5, 13, -4, -16, -6, 3, -9, -12, -10, -10, -13, -11, 3, -3, -4, -11, -7, 9, 0, -16, -5, 3, -1, -3, 6, 4, -3, -10, 8, 26, 8, -2, 21, 23, 11, -3, 11, 17, -4, -2, 10, 1, -7, -3, 4, -3, -15, -11, 3, -8, -23, -7, -5, -13, -15, -11, -3, -9, -22, -1, -8, -13, -12, 16, 13, 0, -3, 16, 21, 11, -1, 12, 14, 10, 21, 11, 8, 5, 0, 12, 13, 1, -2, 8, -2, 0, -1, 7, 5, -14, -16, -2, -8, -16, -22, 0, 0, -5, -8, 1, -9, -11, 5, -2, 2, -6, 10, 9, 1, -2, 14, 16, -8, 1, 30, 16, 2, -7, 23, 14, -6, 6, 12, 3, 6, 4, 5, 5, -8, 1, 10, 4, -15, -1, -2, -3, -3, -9, 10, 1, -13, -4, -4, -9, -17, 3, 12, 3, -3, 5, 19, 9, 4, 9, 15, -3]
3545cPJ7mj2NJ0j3%KLj3Mj1%%k%J3rrMJ2j0lNPj1rJ2J0lj9RJ5jj0QMMj4K2oj0
3588AKJ3Lj2JPnj0oJ6j0mLLj1l%JKnO%Mj0PRj3mJ1oRj2J0J3rNj2K0rlQLLj0J4
3633B0lqj0Qj0%pK2j0j4LJ3kj9J1jj3lQQkmjJ4j4PJ1JpjNNnNOp%j3K3njqMMLk
3679A1npoJ1mqmKPj1LJ4npm%Nk%mJ3Mj1NJ4j4mJ6JpoJ2mML%qKjNqmO%Nj1lLMq
3729fj1RkpJ0klJJ0Kq%KMpJ5Pj0lMLklKOoQLKnj0rJ4nj0mJ2jk1J1J0r%kOLj7J1
3777hLLlMqJ2kj0K1k0R%J7j5JJ2kj1MJNolQMj4kMj3PkNqkMLomQkJnJ0%%k0J7l
3825f%QqJ6j2RLqLPJknJJJkpMLj3J2pNonJ1pm%Pj3QpPrMOMJkJ2j2J0jKoljJ2L
3876A5qQkj0QlPlpllPqMOj3M%mjkkKKMmPrJL%NmK0j0KJqJ2kkJKqKMkj3PMPnqJ5
$$ y = [-3, 4, 21, 17, 5, 10, 20, 7, 7, 9, 12, -1, 3, -8, -8, -8, -10, -10, 3, -6, -15, -11, 1, -9, -12, -7, 0, -11, -20, -8, 2, -1, -20, -11, 4, 3, -7, 1, 5, 9, -5, 17, 11, 1, 3, 16, 19, 7, 8, 15, 10, 0, -6, 10, 0, -4, -1, 2, -9, -12, -12, -11, -9, -14, -8, -8, -4, -14, -7, 2, -11, -15, -4, -10, -1, -13, -3, 10, 1, 6, -6, 14, 5, 2, 10, 13, 16, 6, 20, 17, 9, -1, 7, -3, -3, -10, 12, 2, -12, -9, 4, 2, -17, -6, -7, -20, -23, -15, -7, -9, -13, -14, 0, -14, -7, 4, 5, -2, -3, 2, 7, 2, 7, 13, 6, 6, -7, 16, 11, 10, 2, 6, 10, 13, 11, 6, -1, -7, 4, 0, -8, -12, -10, -3, -14, -11, 3, -2, -9, -13, -13, -8, -10, -10, -14, -1, 3, -8, -3, 11, -3, -7, 9, 10, 3, -3, 9, 5, 9, 12, 12, 4, 6, 5, 10, 2, -2, 4, 4, 9, -2, -5, -2, 2, -6, -17, -8, -10, -17, -7, -9, -12, -11, -1, 1, -7, -7, -5, -1, -8, 7, 14, 4, 1, 5, 8, 6, 3, 5, 11, 5, 13, 16, 18, 13, 3, -6, 8, 3, -7, -11, 1, 0, -21, -10, 0, -9, -9, -11, -5, -2, -19, -8, -5, -2, -5, -1, -9, 3, 1, -9, 12, -8, 1, 1, 18, 3, 4, 16, 14, 3, 7, 8, 13, 7, 4, 12, 16, 2, 0, 4, -9, -2, -4, 1, -7, -9, -5, -2, -8, -12, -4, -6, -5, -10, 0, 0, 0, -20, -3, -6, -6, 2, -6, 10, -2, 7, 10, 2, 5, 12, 13, 11, 6, 7, 8, 9, 7, 0, 4, 7, -6, 6, -1, 4, -2, -7, 4, -3, -7, -7, 0, -13, -5, -12, -5, -14, -10, -4, 0, 1, -1, 11, -1, 9, 8, 10, 4, 1, 0, 12, 15, 7, 15, 13, 3, 11, 8, 15, 12, 5, 2, -1, 6, -2, 2, 8, -5, -1, -1, -5, -6, -8, -10, -8, -6, -2, -6, 1, -8, -7, -4, -4, 1, -3, 17, 7, 9, 10, 2, 14, 12, 10, 11, 13, 5, 7, 11, 9, -4, 3, 7, 14, 9, 1, 16]
3930A6j2ploPnoJ4rm%J4Jj3JJ4LolQJj1J8mmNkMoNLpJjMmj2NJ4oj4J0Nmj4Rk%
3978cmlPj4RLnoLJ0Nj0MlJ8Lj8NQrNLMlMLqjLMj0KJQrpNoLjjjjmNqkMQNMj3kJ1
4032EPqpK0rO%kNrKJPrJ3mJj3%Lj4NKqQ%jmnkjKJ2k0J3j2NMKrPjMKjPOlLqRrP
4085IJ6j0joJ6j4JnPKqjoMrM%j2Rj3KQPmQj2oJ4KJNLj1J0l%J0k4J7Oj0PORk5P
4131A0mQj0MpNjj3J1j0%J3plOj7MQj5MJ7Mj1lJ1qNKKQprJ8j%lJ0nj0JJ2rMpJ0
4176A7oqkNJk3K1pkkPnRj0rRKkNKpmJ3j1PNKJLoMJ0nj%mKlJlJOKoj8MRj1RJ3k2
4227gPj5MJ3oj3RlJ0n%oJ8jqJ4j0mK0oMkQj1jkJ1j0Pj4J5j0PKj3Nj4RkMqKmL%
4272cJ1npnNMkj2J8JLJmPlnJ2Jj2MJLpJ1Kj1%kmOkNprNj0J3rjmPjj1LLPolNmJ5
$$ y = [16, 4, -3, -6, -12, -5, -10, -16, -2, -11, -15, -15, -1, 0, -13, -12, 2, 5, -1, -4, 4, 5, -6, 12, 8, 4, 9, 7, 11, 5, 10, 13, 6, 7, 6, 10, 6, -6, -1, 13, 7, -7, 3, 8, 4, -10, -1, -3, -3, -7, -10, -3, -17, -8, -5, -10, -16, -13, -3, 2, -8, -4, -7, 11, 14, -4, 1, 9, 0, 5, 8, 12, 9, 13, 16, 8, 7, 10, 14, 4, 6, 7, 15, 6, -1, 4, -2, 1, 0, -1, -2, -3, -7, -2, -10, -12, -8, 0, 5, 9, -4, -6, 5, 12, 4, -3, 17, 8, 14, 14, 12, 17, 8, 10, 11, 18, 9, 22, 18, 19, 6, 6, 9, -5, 0, 2, -6, 2, 2, 1, -3, -8, -10, -11, -9, 3, -17, -4, -16, -11, -7, -5, -14, -7, -8, -4, -2, -3, 4, 10, 7, 10, 2, 11, 2, 9, 25, 15, 14, 8, 24, 10, 11, 6, 13, 15, 7, 6, 0, 4, -5, -1, -1, -13, -4, -17, -15, -7, 0, -4, 4, -8, -14, 0, 2, 3, 8, 11, 0, 10, 7, 7, 17, -7, 10, 16, 6, 13, 19, 28, 3, 10, 6, 14, 4, 8, 1, 6, 5, -8, 3, -7, -7, 6, -1, -4, 2, -15, -11, -3, -18, -14, 3, 7, -4, -7, 4, -4, 1, 3, 5, 13, 6, -3, 15, 14, 14, 11, 21, 16, 6, 7, 19, 10, 14, 7, 17, 11, 3, 1, 6, 7, -16, 5, -2, -4, -6, 1, -4, 5, -5, -14, -5, -3, -5, 0, 2, -5, -9, 4, -7, 0, 5, 7, 8, 11, 5, 9, 19, 14, 13, 13, 9, 11, 8, 9, 6, 7, 13, 15, 9, -9, -5, 4, -7, 2, 15, -7, 0, -15, -11, 2, -4, -17, -8, -11, -1, -6, -6, -12, 6, 5, -3, 11, 1, -3, 17, 11, 15, 13, 21, 10, 9, 7, 18, 8, 15, 1, 16, 6, 13, 15, 2, 7, -7, 2, 0, 4, -4, -2, -6, -3, -3, 8, 3, -4, -9, -4, 0, -2, -14, 4, 5, 8, 9, 5, 12, 9, 4, 16, 17, 5, 9, 10, 13, 6, 17, 19, 8, 8, 6, 2, 8, 6, 11, 4, -5, 0, -10, 3, -6, -7, -11, -4, -5, -16, -13, -10, -3, -9, -12, -7, -11, 4]
4323DjjjKPlMKj5J0%%LLlknlMnjkKJoNJnOJpJj0NnJ3JpNpJKLNN%MmqJ1nRnJRj0
4379IJ1krKrPj1J2j1Nj3K5j1j7OKm%pMmJ7j0kJ2jNj1J1JkLLnJ3pkkJ0oj%LKqO
4425A4j0LrJ0j0pRmJjoLOmpKJl%%J3mKlLM%j1J8qKJ0koMNkj4J7oOj6J4j0mljN
4473AlLojLnLmMkqMPopJ7kJRPqLLKJkQj0qPNqQj2J1nplLPj3pOjNj3J0oOj2%LL
4526iJ4pJ0njPpK%MLrM%J1qQlpkLrKPjOlnKj2Nj1PnO%jPj0j4R%J1OrOkMlOj0R
4578FOpJ1olKj0J1kjlQOpj0M%okj0RjlnJ0knJ0nMjjjJlONpRrJ7qJ0rpOMN%Jol
4630HNoKKq%pRj0mJLlmKmPkMj1J1NKj5J4PNq%rKK1j7J2ljJNoJnkQnJ0j9RpOJr
4681bl%MmnQm%lMlMlJ8j3OmJ1JJpJKjQpPj1OnOkQqlJKr%jLj%j1J0j4J4j0Onom
$$ y = [4, 3, 2, 1, 3, 10, 7, 11, 13, -2, 8, 8, 8, 11, 14, 11, 9, 4, 1, 5, 0, -1, -3, -1, 0, -6, -1, 0, -5, 1, 2, -5, -4, -14, -9, -14, -1, 0, -7, -2, -9, -8, -6, -3, 2, 7, 7, 11, 7, -1, 10, 5, 14, 9, 10, 19, 9, 20, 18, 9, 11, 2, 9, -2, 10, -1, 4, -9, 16, 5, -12, -6, -4, -8, -8, -15, -11, -15, 2, -8, -10, 2, 1, 6, -5, 6, 7, 5, 8, 11, 6, 19, 12, 10, 8, 18, 12, 11, 11, 14, 16, 8, 14, 4, 7, -2, 8, -2, -9, 0, -4, -3, -4, -10, -7, -1, -5, -12, -10, -9, -12, -12, -12, 1, -3, -1, -4, -1, 3, 3, -8, 10, 2, 4, 14, 12, 6, 10, 15, 13, -1, 16, 10, 16, 0, 14, 4, 0, -3, -4, 1, -2, 1, -5, -6, -3, -8, -5, -9, -5, -7, -15, -11, -4, -10, -17, 0, -2, -1, 8, 15, 7, 10, 13, 15, 16, 14, 22, 12, 4, 11, 16, 8, 16, 4, 15, 10, 3, 0, 3, 10, -3, -10, -4, -5, 0, -13, -3, -9, -3, -15, -15, -12, -9, 5, -2, 8, 3, 2, 9, 2, 4, 4, 8, 11, 2, 6, 6, 17, 9, 17, 14, 7, 5, 8, -1, 1, 8, 7, 13, 10, 5, 7, -5, 0, -11, -4, -9, -3, -3, -4, 3, -7, -21, -12, -12, -1, 5, -4, 2, 0, 4, 1, 7, -3, 6, 12, 5, 16, 10, 7, 9, -1, 10, 8, 7, 4, 12, 18, 11, 1, 5, 5, -1, -3, -13, -4, -5, -8, -13, -3, -5, -10, 0, -5, -1, -2, -3, -4, -3, -6, 0, 5, -2, 7, -2, 15, 7, 17, 8, 1, 7, 11, 16, 16, 17, 11, 8, 13, 7, 9, 11, 3, 3, -4, 5, -5, -9, -8, -5, -8, -12, -10, -14, -7, -9, -5, -16, -5, 0, 2, -13, 1, 8, 13, 5, 5, -4, -2, 19, 2, 14, 11, 10, 11, 16, 10, 11, 6, 4, 12, 7, 17, -2, 7, 0, 6, 7, -2, -5, -5, -1, -5, -10, -2, -6, -6, -9, -5, -8, -4, -7, 11, -2, 4, 0, 11, 12, 13, 6, 7, 9, 8, 16, 9, 16, 5, 11, 6, 12, 10, 18, 10, 7, 8, 10, 1, 1, 0, 3, 2, 2, -9, 1, -13, 1, -9, -3, -8, -14, -18]
4733a8J1kOPKjOmmRkJjL%pRqkJ4Kj2LJKmmknNj0J4mj3OoO%j1LL%kJ1mkmQNJ%L
4785IJ%RJj0Pj2NNqLjQk2J7j2%QJokKkj9J4jNjj2J0JojJ2rJ1NkmjJ7qllJ0oJ1
4832B1j3LLLqkQj3NllKjmOnllNoqRqJ0lJJ3Mj2N%mM%Qj1J2j%jKmOoMpjNoQj4J
4884bNn%M%JRj9PnkoLKoOJ2JnJmJljJ3JMkM%j1J2LpolRKlrLOj2jOMj2%pJ7rJJ
4937br%PKqJOkNOjlKlJJ0Qk0jOMJj4J1nkJ5j7JLMkL%j0OoljjJmjJ1rJ2mLj0J1
4987BjJ%jMNJOqKjJJLlPprOpNplOojjOJOopMlqKOKmJ3Nj3J0kMp%J2j8MLMNqNO
5043A7rJ2j4QkPj4JkkjQj2qJ2knmqRJnJ6qJK%LlJ1j8J5LnNRl%mjLj0oJ0MNj6%
5091@LrNrRj3J3MnkpPlPmRj0OJ1j1J0jnlRj0NKJmqJ9%nLkj1J1rnN%jkRrqKJ6j6
$$ y = [-18, -7, -9, -3, 4, 6, 5, 11, 7, 3, 12, 10, 11, 10, 13, 13, 6, 15, 7, 5, 19, 21, 9, 12, 13, 15, 11, 7, 5, 0, 5, -5, 9, 5, -8, -2, -8, -2, -2, -13, -10, -7, -7, -9, 2, -2, -4, -8, 0, 5, 6, 6, 9, 10, 10, 19, 20, 10, 17, 5, 10, 15, 7, 10, 9, 17, -5, 12, 0, 0, 8, 9, 3, 1, 3, 1, -18, -4, -5, 0, -1, -13, -3, -2, -8, -9, 3, -6, 5, 10, 8, 4, 3, 20, 12, 9, 6, 16, 10, 21, 8, 11, 14, 17, 9, 7, 15, 2, 7, 4, 1, 3, 2, -2, 4, -1, -4, -7, -2, -8, -16, -7, -15, -5, -8, -7, 6, 10, -2, 3, 3, -1, 3, 3, 11, 0, 12, 11, 11, 10, 12, 8, 14, 8, 12, 5, 4, 9, 3, 11, -3, -2, 3, -2, -2, 2, 2, 3, 12, -7, 0, -5, -7, -13, -10, -8, -14, -8, 4, 5, 0, 1, -3, -2, -5, -6, 7, 8, 12, 10, 14, 14, 3, 15, 18, 11, 5, 2, 11, 13, 10, 1, 4, 10, -2, -3, 3, 7, -5, -5, -12, 5, -4, -3, -2, -11, -11, -4, -2, -10, -9, -3, -5, 0, 6, 5, 2, 4, 1, 2, 12, 20, 0, -1, 5, 9, 10, -4, 7, 2, 0, 15, -2, -1, 2, 6, 4, 7, 7, -3, 3, -3, -6, -7, -8, -7, -11, -12, -1, -10, 2, -2, 1, -9, 2, 1, 2, 2, 1, 5, 10, 11, 17, 9, 11, 10, 11, 12, 15, 12, 19, 12, 3, 9, 2, 7, 0, -3, 3, -3, -4, -5, 1, 2, 8, 2, -5, -1, -4, -12, -10, -4, -2, -6, 7, 12, -1, 9, 7, 11, 4, 4, 16, -2, 2, 5, 9, 14, 6, 11, 17, 8, 20, 6, 14, 12, 19, 5, 6, 4, 2, 1, 9, -3, -11, 1, -1, -6, -10, -18, -9, -8, -13, 3, -5, -4, -2, -2, 1, -2, 9, -9, 6, 9, 4, 9, 18, 15, 15, 11, 10, 13, 3, -3, 7, 11, 16, 0, 0, 3, -6, -1, -10, -1, -14, -1, 3, -2, -4, -11, -4, -7, 0, -4, 5, -5, 1, 12, 1, 11, 10, 5, 2, 11, 1, 6, 8, 9, 5, -3, 16, 16, 11, 14, 12, 1, 12, 3, -2, 3, 3, 2, 0, 9, 0, -8, -6, 10, -6]
5141fPrJ3j0KKJj1RJ0qPlJKJ2j0l%NKLjQj1j0J4knoJjOnqJ5j1Rj1NKPj8LoLJ2
5188Fo%P%pOLj1QkL%LmlJ4Lkj0LJ1q%j2J6j7PNj3JPpmj0K1mpJ0rJokNoJ4j4JR
5236@J0Kj3MNJJ1kJ0j3KNj3NJKlloOlq%nJ1oj0J3%p%lP%n%%n%J7jNJjNj0LNL%
5286A7%%jknjRlLj1J2j9J0KMj1Mj3NpNjknLMLnQlQl%jjJj3J2LN%%Kj0LmJ8j1k
5335GKR%j5KLOj1%Nj1qJ2krLLkOMlkpQJNkOqKjKLN%M%kJj0kOj1J4pnoQlKoJ0n
5388AKp%%mKPnoQlJ0JmoPPj2O%LLQn%j6J5jnJN%lkj2NkLLlPj4kRnLkKlqPlQJ0
5442A0k1RRKkNkmMkPpQpQoOnjMprJ0rPkj1RqJKmNjqJ2Lj1NnLkJNRjJmjmJ2lkj4
5496fNJ4j1J0poJ2omLk%j0NmmOLq%jPKoMmmPkjJ4rJJ0rLmRj0NOkoOJ3j8J0ljj4
$$ y = [-6, 1, -8, 5, -5, -3, -1, 0, -11, -2, 8, 0, 7, 4, 5, 7, 19, 9, 6, 6, 11, 13, 16, 15, 23, 12, 2, 16, 14, 9, 3, 4, 3, 9, 4, -4, 11, 0, 9, -2, 3, 5, 12, -6, -3, -9, -6, 6, 0, 0, 7, 7, 0, 6, 9, -2, 6, 4, 7, 7, 10, 6, 3, 17, 20, 18, 8, 11, 22, 14, 14, 2, 18, 1, 8, 13, 0, 1, 8, 1, -3, -13, 8, 4, -3, 7, -2, -1, -7, -9, -4, -10, 4, -10, -9, 0, 10, 12, -1, 3, 8, 9, 20, 18, 28, 15, 17, 22, 9, 14, 15, 17, 14, 11, 5, 11, 8, 0, 0, -5, 6, 0, -10, 3, 3, -4, -4, -7, 0, 0, -5, -5, -5, -10, -10, 7, 6, 11, 12, 11, 16, 6, 9, 14, 17, 17, 17, 17, 16, 14, 9, 8, 17, 14, 17, 6, 18, -1, 9, 11, 15, 4, 8, -5, 0, -7, -2, -3, -5, -10, -7, -3, 0, -5, 3, 0, 8, 5, 5, 4, 3, 4, -9, 3, 6, 11, 11, 11, 13, 3, 6, 2, 20, 9, 7, 9, 18, 18, 3, 5, 8, 14, 3, 3, 8, -3, -11, 1, -1, -10, -7, -4, -6, 0, 4, 1, -1, -8, 0, 1, 6, 4, 10, 2, 4, 3, 5, 8, 13, 13, 17, 17, 15, 16, 6, 4, 10, -1, 13, 6, 1, -5, 3, 0, 2, -4, 6, 1, 3, -4, -4, -4, -8, -6, 1, -4, -10, -2, -5, 5, 6, 2, -4, 3, 10, -2, 4, 4, 7, 10, 18, 13, 13, -3, 12, 11, 6, 7, 12, 12, 9, 7, -5, 0, -2, 1, 4, 1, 8, -6, -8, 1, -4, -1, -3, -1, -4, -12, -5, -8, 0, 10, -11, -2, 7, 9, 7, 12, 10, 6, 10, 8, 15, 8, 16, 9, 17, 11, 17, 12, 11, 15, 8, -1, 9, 0, 7, 5, -6, 3, -5, -4, -2, -6, -1, -2, -10, 2, 5, -6, -1, -6, -3, -5, -4, 1, 10, 9, 10, 6, 5, 1, 13, 10, 8, -6, -1, 13, 2, 12, 5, -1, 11, 5, 1, 4, 2, 2, -8, -3, -7, -11, -5, -2, -10, -10, -11, -4, -2, -8, -4, -8, -12, -5, -7, -8, 6, -3, -2, 8, -1, 2, -2, 7, -3, 2, 8, 6, 0, 6, 19, 1, 11, 8, 7, -7]
5546gJ2j0NJrJ9rj8J4oKK%lkLRq%PjmJ4j3LJ4j3j1K2lJlnkJ0oknkRjj0NRj0Qm
5593Blj5J1nJJ3rkk%MqM%PMNj4RJJ0o%NnmpOJ1j2QMrjj3J2jLnqNpJMKj1KJ1j4
5642a6RNmjLMmKlPKkLjJpQJ2jj2kJ2kj3J9j1jRj6jjkpJ0qJ0n%qMk%JNQj5JP%K
5692aj%LPoLKrJ3j6J3jMmqRJkqK1k8OjjJ1j5%LjOk1J9nLnPrrJ3JjK%OLnQNmjL
5743A0mKlkNMjonRkrj%lqJ6omOqLQj1Rj0NmOoJ4Oq%MrROJPkpKNqlJRKJpj3kkJ0
5798FJkopjkJ0nnK0rJj3J0j1RJJ6Jj9J1nPMmLoJ2pjoJ1pNrMjLjJpJ1mj5J2rL%
5846@%nQj2J2pLlPq%kKmJ7mP%Kkj0LOOj5PqJ3j1PnNJkjjj5%J2pMljMj1QqJRoO
5897aNm%MLj0J4KqRpJ3nLkrlOJ0qqLPmjmjnJLoJ2j8QMomMKmmRNNKlnMlJJlLQn
$$ y = [-7, 5, -5, 0, 1, -8, 11, 2, -16, -2, -8, -6, -4, -4, -7, -9, -6, 3, -5, -5, 2, 1, -3, 11, -2, 1, 15, 2, -9, 13, 10, 11, 8, 3, 1, 11, 5, 3, -2, -4, 5, 4, -6, -1, 8, -2, 6, 2, -1, -16, -5, -10, -9, 4, -5, -7, -9, -9, -5, -13, -9, -9, -2, 2, 7, -7, 2, 3, 13, 7, 7, 12, 7, 3, -4, 2, 13, 1, 9, 13, 4, 3, -10, 2, 1, 4, -1, -9, -4, -11, -10, -6, -4, -15, -13, -2, -16, -7, -2, -6, -7, -4, 0, -4, -2, -5, 2, 4, 2, 5, 4, 5, -2, 6, 18, 17, 5, 3, 15, 13, 0, 19, 8, 7, 16, 0, -1, -2, -4, -11, -1, -9, 1, -4, -4, -12, -8, -10, -10, -9, -4, 4, -11, -10, -3, -3, -1, -2, -2, 1, 8, 2, 5, 7, -2, 11, -5, 8, 7, 11, 7, -1, 8, 9, 7, -1, 20, -8, -2, -3, -4, 7, -8, -8, -5, -6, 0, -21, -2, -7, -4, -9, -2, -11, -20, -7, -6, -7, -5, -5, 1, 4, -1, 7, 12, 8, 7, 10, 6, 8, 5, 3, 8, 12, 11, 5, 0, 9, 7, -2, -3, -3, -6, -14, 2, -4, -8, -2, -10, -7, 1, -10, -1, -11, -6, -10, -4, -10, 4, 10, 2, 2, 6, -3, 6, 12, 13, 20, 18, 11, 13, 18, 10, 7, 8, 17, 19, 20, 13, 0, -2, -4, 6, 7, 5, -1, -8, -9, -11, -1, -6, -11, 9, 0, 1, -12, -2, -13, -4, -3, 13, 14, -5, 6, 1, 8, 12, 8, 11, 5, 17, 10, 9, 3, 14, 7, 12, 3, 7, 6, 9, 8, 9, 2, 13, 9, -6, 6, -3, 0, 0, 0, -5, 3, -9, 3, -4, -1, -4, 3, -5, -5, -7, -5, -9, 8, 4, 11, 11, 13, 11, 1, 4, 10, 16, 1, 8, 0, 13, 2, 9, 4, 9, 10, 8, 7, 6, -9, -9, 3, -4, 0, -3, -4, 0, -11, -3, -11, -10, -1, -7, -1, 4, 0, 0, 4, 7, -3, 11, 13, 5, 14, 7, 20, 15, 18, 16, 7, 4, 10, 20, 12, 4, 7, 14, 10, 9, 5, 4, -1, 0, 3, -3, 9, -9, -1, 3, -3, -7, -3, -1, -5, -9, 0, 5, 10, 12, 9, 4, 8, 5, 6, 7, 4, 7, 15, 10]
5952A0l%jJ%oJ1nJmjoj2K4j1o%KJOJj2OLpRnQj1MK%J0qPpJ2j3J3j0JMmMkjLMK
6001A4nllnMjNnJprNJ1j1KPrRj1ROpOMl%jKJ0Jj2jLpOO%JpP%p%JoOj9J6kNpjK
6054@j1jQkmJ2qLJlJnJ7lMLj2KJkJ4MqlJJjoJ1ojPn%kn%oMj0Q%LoOlj2J0jRkj0
6106hLmJ2jOOpjJ0Jj1Q%klmMjKJ0j3J8j9Oj8j%OlOk%nLlJj%J5j0JnNjLMpKJ1n
6156HNPplLj4J5lLlNpKKpPj8QljjRj0oRjjRqKkM%jNnNoJ3j7J5j1MRm%%KMll%%
6209A0lLnoJOlj4J2MMnljojlOJ0qMk%NQj1RqRNkrKnOOoNNJqnJnJ2Nj0jlNrMj0
6262dMOnMmmKNj0RlRKNnqJ8nqJJJO%j2QMj1JOo%%j0lK2j0lnOkjLj3J7mj%nQnn
6314dJ0mkJ0qJNJ4j3Qj3MPKJkj1NKJplJjjj0NK0j1joLLqRmoO%kOpJ3j2NJ0q%k
$$ y = [10, 7, 7, 6, 7, 7, 1, 12, 7, 8, 4, 3, -3, -15, 9, -2, -8, -8, -6, -5, 1, 2, -10, -4, -1, -8, 1, -4, 4, -7, -3, -1, -1, 9, 1, 8, 1, 13, 0, 13, 3, 4, 8, 4, 8, 6, 5, 8, 12, 14, 9, 6, 3, -2, 2, 1, 6, 1, 2, -5, -14, -9, 2, -9, -7, 0, -9, 0, -11, -2, 4, -3, 3, 7, 4, 4, 3, 5, 15, 16, 4, 3, 6, -1, 5, 11, 11, 12, 5, 12, 12, 5, 5, 6, 0, 6, -13, 3, 1, 6, -1, -2, 0, -11, -12, -4, -6, -10, 2, -6, -3, -2, -5, -4, -9, 8, 5, 9, 12, 0, 2, 3, 1, 15, 19, 11, 8, 9, 10, 9, 3, 14, 8, 7, 14, 9, 9, 7, 2, 2, -4, 0, -10, -2, -2, 1, -5, 1, -2, -14, -4, -5, 4, 2, -8, -5, -9, 3, 2, 8, 14, 7, 6, 16, 17, 6, 14, 14, 12, 9, 5, 9, 8, 10, 20, 7, 25, 6, 12, -6, -7, -7, -1, -4, 2, 0, 0, -5, -2, -5, -4, -5, -5, 10, 0, 1, -4, 1, 0, 3, 7, 0, 2, 13, 8, 13, 20, 13, 10, 13, -1, 14, 11, 14, 11, 16, 9, 11, 13, 6, 13, -5, 3, 0, -1, -2, 7, -3, -9, 0, -1, -2, 7, -1, 1, -1, 3, 3, 2, 7, 2, 7, 1, 14, -3, 12, 1, 5, 14, 10, 10, 10, 12, 16, 13, 10, 10, 10, 7, 10, 5, -1, 0, 6, 3, -11, 1, 5, 9, 4, 1, 0, -6, -7, -10, -4, 6, -2, 2, 0, 0, 5, 13, 2, 11, 3, 12, 17, 15, 6, 8, 3, 9, 15, 9, 14, 19, 20, 12, 7, 8, 3, 15, 20, 10, 9, 6, 11, 2, 6, -4, 0, 6, 1, 5, 1, -3, -1, 4, -6, 3, 0, 9, 11, 16, 11, 3, 21, 16, 8, 9, 10, 11, 17, 17, 5, 13, 17, 6, 7, 13, 7, 7, 7, -3, -6, 16, 6, 3, -2, 4, 2, 1, 4, -9, 8, 4, 3, 3, -2, 6, 1, -4, 6, 2, 0, 10, 2, 3, 8, 22, 9, 17, 4, 8, 15, 17, 18, 16, 5, 10, 12, 13, 6, 3, 4, 3, 2, -8, -3, 17, 6, 5, -1, 2, 5, -3, 6, 2, -4, 2, 2, 0, 6, -1, 12, 0, 5, 15, 7, 7, 5]
6363E%P%oNKlmRnLj4J6mj1Nj3NoQMJpOj4J6ljJlJ0rmNL%PMj0MPKnkKkj2J4pQj4
6414@J1Lj4RkjRj7J0qpQLJkpKlJJ1j4NMkQNmmNJj2J2jPj0Qj2J4JrmJ2j1k%jkJ3
6462A4Kj0j0PN%orJ0j0KJQj3NJ%J4rj%J9j0OJ0plrLkkRlnl%LqRoKkOlj4J1Olk
6511CqMoJ1%KooJ3LmJjNqJOJ0Mj2LqKkMKLmnlPqPJLmkMlnJk%nOlkj%Nj%NOqol
6568dJ6j7K3lmLnjJ0lnojJ0MnJj1MkJ1j1kkpKmRQj2joMJ1PJnKrMJRj0QkkPRk0
6617DJPMjrKNp%J1j4LmLmJj1lJ1JoOqJ1mLJ0j8J7%pjOkLqPmLMnNm%LPj6QrMJP
6669A3nNj4J2rqJ0qOkMmONqklNOmKPnMmoOrJ6j2J0pMKmLj%oNqJOpMoJ%j0J0Kj1
6721hJ2j1MK%OJnMln%J0jJ7j4JLrQljknQmj3J4nJ0mj0LNjMlLj9J3MrpNOPnoKl
$$ y = [5, 5, 12, 12, 6, 11, 13, 10, 6, 15, 10, 13, -1, 15, 11, 0, 5, -8, -3, -9, -1, 3, 4, -3, 3, -11, 5, 2, 1, 2, -1, 9, 0, -4, 1, 4, 4, 11, 15, 5, 9, 16, 18, 13, 11, 13, 11, -1, 13, 6, 14, 0, 11, 14, 0, 9, 7, 6, 15, -2, 8, 0, -7, 1, 4, 5, 3, -4, -2, -5, -4, 7, -7, -2, 2, 0, 8, 13, 9, 5, 10, 11, -1, 11, 10, 17, 7, 15, 3, 17, 18, 9, 5, 17, 6, 4, 4, 3, 1, 14, 16, 6, -4, 3, 8, 8, 2, -7, 3, -7, -5, -4, 4, -9, -4, -3, -3, 11, 2, 1, 1, 20, 10, 16, 26, 19, 16, 7, 10, 8, 6, 15, 12, 7, 4, 4, 7, -1, 8, 2, 4, 2, 8, 5, -9, 2, 8, 5, 3, -5, -1, -7, 4, 4, 6, 0, -6, 7, 10, 6, 7, 6, 11, 3, 4, 10, 20, 24, 12, 15, 7, 9, 7, 11, 13, 16, 12, 7, 4, 11, 3, 10, 11, 14, 10, 8, 12, 9, 4, 5, 3, 3, -2, 4, 1, -1, -2, -2, 3, 2, 2, 7, 13, 5, -1, -4, 12, -5, 18, 15, 11, 14, 9, 8, 18, 15, 10, 4, 3, 13, 17, 12, 13, 2, 6, 4, 15, 4, 2, 0, -7, -5, -9, 0, 8, -4, -5, -11, -7, 4, 11, 12, 7, 9, 0, 4, 5, 14, 4, 12, 10, 8, 15, 24, 4, 5, 12, 16, 15, 6, 8, 13, 6, 6, 17, 3, 6, 2, 5, 1, 2, -9, -12, -1, 0, -6, 0, -8, 3, -1, 2, 12, -6, 11, 11, 4, 3, 9, 7, 10, 2, 9, 5, 8, 12, 7, 12, 8, 8, 11, 18, 2, 10, 1, 5, 6, 13, 8, 13, -1, 11, 2, -6, 4, -4, 2, 0, 4, 0, 6, 11, 3, 1, -2, 3, 9, 5, 7, 14, 9, 13, 9, 3, 9, 0, 16, 4, 14, 7, 11, 13, 9, 12, 11, 11, 5, 10, 2, 3, 9, 2, 6, 0, 1, 1, -9, 1, 3, -8, 4, -7, -3, -1, -1, 5, 6, 1, 5, 2, -3, -3, 7, 6, 23, 9, 10, 13, 4, 12, 9, 8, 6, 1, 9, 5, -8, 6, 1, 11, 7, -3, 0, 5, 4, 8, 5, 8, -11, 2, 6, -3, -10, -5, 1, 8, 3, -3, -1, -4]
6771dKPlLkKqKJRjKJK%kMno%%nJ2j8O%jMj3RjmLkKJ2pNmL%pMLJjJ1j1J3plPKj1
6825FLoR%kJ2j7MpkKLqKOj0L%nJJ0oLoMnkKJKJMJ0rKOqJ1OrkKKrNkj1J1nmKl%
6878cRqj%MpJ1rKJJj0J6p%NqjJ1j2PJ3mJrOoMkJ4kprMOMk0POmKKr%M%mjlrJ4k
6930coJ5qQJkrJ5mJn%PpJ5j5J0LrPOrklRpooJ5Mj4%Mj0KJ6rr%L%JLJj0K1j3%%
6979AMMl%nJ4k%JrJ0plK%mnMOlqMNplJj0JKQKLpj3QJ1j0QPoRnkoJ2mQJoNnjqJ
7033@NOj2JjKLrMJOjmrjLLoQqmJ0Jj2QRjlpJ7nmPnJ1Mq%mnMOnQj3OnkRNJoqmR
7088EJrNnJN%pNJJnLRj2J5j2KOoMJkKJkKpPLqRjrMrJ2qKqJ6j5k%J2j1MmJmKN%
7141@J2mjJ0k1OQkJ4j7jNQj5jJ0Jj0RqLKkrRKj0LOkj3QMOj8J8j8NLj4J9knJ2j2
$$ y = [-4, -2, 5, 2, 5, 3, 5, -3, -1, 0, 9, 8, 10, 11, 13, 13, 11, 15, 10, 4, 4, 4, -1, 11, -7, -1, -1, -2, 2, -11, -2, -3, -7, -4, -6, -4, 8, 1, 6, 2, 5, 5, -2, 2, 5, 6, 5, 16, 5, 18, 11, 8, 15, 17, 6, 9, 3, 12, 12, 10, 22, 5, 9, 2, 0, 2, 5, -3, -1, 5, -5, -2, -2, -7, -6, 4, -2, 1, -5, -1, -6, -8, -6, -5, -3, -2, 2, 12, 3, 5, 11, 3, 14, 20, 11, 9, 11, 13, 4, 9, 7, -4, 7, 2, -2, 0, -3, -3, 6, -2, -3, -3, 1, -6, 5, -4, -2, -1, 0, -10, 6, -1, -1, 4, -4, -5, 6, -6, 1, 14, 10, 11, 2, 8, 2, 6, 4, 18, 16, 9, 0, 4, 10, 14, -6, 1, 7, 3, 5, 7, -2, -2, 2, 2, -2, -3, -6, -15, -1, -3, -9, 6, -2, 6, 7, 5, -4, 11, 7, 8, 3, 3, 10, 3, 18, 3, 13, 16, 7, 14, 20, 11, 9, 6, 15, 8, 2, -4, 11, 15, 1, 1, 5, -5, -3, 13, 4, -5, -5, -2, -2, -1, 2, 3, -7, 14, 1, 1, 1, 5, 9, 6, 6, 1, 15, 13, 13, 14, 5, 15, 8, 5, 7, 7, 3, -2, 2, 8, 5, -3, 1, 6, -1, -4, -3, -13, -12, -10, -2, 0, 3, -4, -17, -9, 2, -8, 0, 7, 1, 10, 5, 3, -3, 9, 5, 13, 14, 8, 13, 8, 7, -1, 0, 5, 11, -1, 0, -1, 1, 4, -5, -1, 0, 6, 5, 1, -8, -9, -6, -3, -9, -1, -9, -13, -3, -2, -14, -6, 3, 2, -1, -8, 9, 4, 0, 7, 2, 13, 17, 9, 9, 5, 0, 4, 10, 5, 13, 0, 6, 1, -1, 8, 13, 14, 8, 0, -4, 5, 6, -3, 2, -3, -2, 3, 3, -4, 1, 2, 3, -2, 1, 10, -2, 13, 1, 3, 9, 3, 7, 8, 6, 8, 9, 7, 9, 2, 9, 12, 4, 13, 12, 3, 7, -2, 10, 2, 4, -4, 12, -3, -5, -5, 7, -4, 0, -4, -3, -7, -5, 0, 0, 12, 8, 7, 17, -4, 2, 10, 8, 22, 5, 4, 9, 17, 2, 1, 11, 12, 2, 11, 3, 6, 8, 6, -3, 6, 8, -2, 1, 7, 5, -8, 0, 4, 10, -8, 10, -8, -3, 0, -14, 5, 3, -2, 10, -2]
7186bQj0J2Noo%KOlNmnJ9r%j1Qj1LkOmJm%mQkjJpkM%jLKKjRLomMLj0oK1p%JoJ
7240C%%JLoRj5J2omJOoKjLmnOrJ9kllOj5J1Mq%J4Lj2jkPmJj0QOJj3jJJ0nMj4L
7290eMLj%lnJ1pMNMj4JKjOnkMqOMnJ2pJ%QK%okLJ4k4PKlJjmnRmNj8J3%Oj4J2J
7342Fj0kMlnK0nKklLjkRqJPpJpQ%ojMJ2kj5J0jpmNj0J4Lj0J2rknQj9J0JJ2JKj1
7391bkLjNMrR%mQkoLJjlNNmOj4JjpJ8ooJn%oJ3rQoLnoJ2JkOnOKjpRjMmJjMLj3
7447BMJ0kmnkkKJrJ2qMkKm%KmJOLkk%M%loPKk%JJ1j6J4NJmqLj3J0J%ojKlRKmk
7501GnKlJpOKKj3J1ljPj7J3%KJ0pRoOlmkLlMplMNkQm%mjqQlj0MJ0rlJMj9K0J1
7552A3j4lLQJrLNLrjPmMLK%KnJqJ6j6mJ8j1kNkmJrOpN%NnlkMMnO%j2RLLlPqQ%
$$ y = [-2, 6, -4, 8, 13, 7, 1, 1, 3, 9, 6, 11, 7, 2, 21, 12, 12, 1, 9, -2, 1, -1, 5, 1, 2, -2, -2, -6, 2, 0, -1, 0, -7, -9, -5, -5, -6, -3, -1, 1, 0, 9, 12, 6, 2, 6, 9, -1, -7, 14, 7, 7, 8, 2, 3, 3, 3, 4, 7, 1, 10, -5, 7, 1, -3, -2, 4, -2, 0, -1, 2, -2, -7, -1, -10, 9, 7, 4, 1, 7, -8, 3, 7, -1, -1, 13, 16, 4, 3, 1, 8, 4, 5, -5, 3, 9, 10, -3, -4, -3, 7, 2, 6, -8, -5, -1, 2, 1, 1, -2, -7, 4, -3, 1, 6, 10, -4, -3, -1, -2, 4, -1, -3, 1, -7, -1, 3, -2, 10, 3, 4, 4, 12, 14, 14, 8, 6, 9, 23, -1, 6, 8, 5, 6, 5, 1, -4, 5, 1, 6, -12, 1, 1, 7, -7, 5, 6, -4, -6, -2, -5, -10, 10, 5, 7, 5, 2, 5, 4, 2, 11, 3, 4, 11, 4, 5, -2, 6, 6, 0, -1, 3, 15, 13, -2, 8, 7, 0, -4, 1, -9, 5, 8, -2, 10, 1, -1, -6, 2, -17, -7, -6, 6, 7, 9, -2, -4, -1, -2, 3, 7, -2, 7, 7, 3, 11, 9, 3, 6, 7, 6, 3, 8, 13, 9, 15, 1, 2, 1, -6, 12, 6, 0, 1, -4, -4, -10, 3, -6, 2, -4, -1, -6, -12, 0, 1, -1, 5, 0, 6, 8, 7, 0, 9, 8, 12, 8, 9, 8, 12, 15, 2, 6, 16, 14, 10, 5, 3, 1, 3, 4, -5, 7, -1, 3, 1, 3, -1, -1, 1, -3, -2, 4, 7, 5, 3, 3, 7, 7, 4, -2, 5, 7, 5, 5, 6, 17, 1, 15, 20, 21, 17, 9, 12, -1, 9, 10, 10, 4, 3, 5, 2, 11, 13, 9, 7, 2, 4, 1, 2, -5, 1, 3, 5, -8, 3, 0, -1, 6, -11, 2, 2, 4, 14, 7, 16, 10, 16, 13, 9, 7, 10, 7, 11, 4, 1, 5, 10, 8, 16, 12, 12, 8, 7, -1, 7, 4, -6, -2, 8, -1, -4, -3, 1, -18, 2, 13, -1, -4, -1, 7, 8, -1, 2, 7, 10, 1, 0, 7, 3, 7, 10, 12, 12, 14, 9, 10, 2, 18, 2, -2, 16, 5, 3, 8, 6, 2, 3, -6, 0, -7, -2, -2, 3, -2, -5, -7, -3, 1, -4, 2, 2, -10, -1, 2, 5, 2, 9, 1, 9, 9]
$$ [...]
8191H
##END NTUPLES=NMR FID
##END=
