##TITLE=1H_ES-aq-MeCel-st
 
 8 sc, 
 14.1.2022
##JCAMPDX= 6.0         $$ Bruker NMR JCAMP-DX V2.0
##DATA TYPE= NMR FID
##DATA CLASS= NTUPLES
##ORIGIN= UXNMR, Bruker Analytische Messtechnik GmbH
##OWNER= root
$$ XWIN-NMR		Version 3.5
$$ Fri Jan 14 11:21:58 2022 Russian Standard Time (UT+4h)  she@DPX200
##.OBSERVE FREQUENCY= 200.131346
##.OBSERVE NUCLEUS= ^1H
##.DELAY= (6, 6)
##.ACQUISITION MODE= SIMULTANEOUS
##.ACQUISITION SCHEME= undefined
##.AVERAGES= 8
##.DIGITISER RES= 18
##SPECTROMETER/DATA SYSTEM= spect
##.PULSE SEQUENCE= zg30
##.SOLVENT NAME= D2O
##.SHIFT REFERENCE= (INTERNAL, D2O, 0, 15.7039)
##AUDIT TRAIL= $$ (NUMBER, WHEN, WHO, WHERE, WHAT)
$$ ##TITLE= Audit trail, XWIN-NMR		Version 3.5
$$ ##JCAMPDX= 5.01
$$ ##ORIGIN= Bruker BioSpin GmbH
$$ ##OWNER= she
$$ F:/spectra/data/she/nmr/H-F/1/audita.txt
$$ ##AUDIT TRAIL=  $$ (NUMBER, WHEN, WHO, WHERE, WHAT)
(   1,<2022-01-14 11:20:58.15 +0400>,<she>,<DPX200>,
      <created by zg, POWCHK disabled, PULCHK disabled
       configuration hash MD5:
       00 E9 B6 7A A2 85 ED C7 34 08 36 98 17 FE 4E 26
       data hash MD5: 16K
       44 3C 6E 68 DB 70 01 4F F3 95 DF 3F D7 BC 22 D5>)
$$ ##END=
$$ 
$$ hash MD5
$$ EF 00 B4 97 EB 77 A3 D4 8C 70 DE C8 3A 7D C3 4A
##$RELAX= 
##$RELAX= 
##$RELAX= 
##$RELAX= 
##$RELAX= 
##$RELAX= 
$$ Bruker specific parameters
$$ --------------------------
##$DU= <F:/spectra>
##$EXPNO= 1
##$NAME= <H-F>
##$PROCNO= 1
##$TYPE= <nmr>
##$USER= <she>
##$AMP= (0..31)
100 100 100 100 100 100 100 100 100 100 100 100 100 100 100 100 100 100 
100 100 100 100 100 100 100 100 100 100 100 100 100 100 
##$AQSEQ= 0
##$AQ_mod= 1
##$AUNM= <au_zg>
##$AUTOPOS= <>
##$BF1= 200.13
##$BF2= 200.13
##$BF3= 200.13
##$BF4= 200.13
##$BF5= 200.13
##$BF6= 200.13
##$BF7= 200.13
##$BF8= 200.13
##$BYTORDA= 1
##$CFDGTYP= 0
##$CFRGTYP= 5
##$CHEMSTR= <none>
##$CNST= (0..31)
1 1 145 1 1 1 1 1 1 1 1 1 1 1 1 1 1 1 1 1 1 1 1 1 1 1 1 1 1 1 1 1 
##$CPDPRG= <>
##$CPDPRG1= <>
##$CPDPRG2= <>
##$CPDPRG3= <>
##$CPDPRG4= <mlev>
##$CPDPRG5= <mlev>
##$CPDPRG6= <mlev>
##$CPDPRG7= <mlev>
##$CPDPRG8= <mlev>
##$CPDPRGB= <>
##$CPDPRGT= <>
##$D= (0..31)
0 1.2 0 0 0 0 0 0 0 0.06 0 0.03 0 0 0 0 0.0002 0 0 0 0 0 0 0 0 0 0 0 0 
0 0 0 
##$DATE= 1642144857
##$DBL= (0..7)
120 120 120 120 120 120 120 120 
##$DBP= (0..7)
150 150 150 150 150 150 150 150 
##$DBP07= 0
##$DBPNAM0= <>
##$DBPNAM1= <>
##$DBPNAM2= <>
##$DBPNAM3= <>
##$DBPNAM4= <>
##$DBPNAM5= <>
##$DBPNAM6= <>
##$DBPNAM7= <>
##$DBPOAL= (0..7)
0.5 0.5 0.5 0.5 0.5 0.5 0.5 0.5 
##$DBPOFFS= (0..7)
0 0 0 0 0 0 0 0 
##$DE= 6
##$DECBNUC= <off>
##$DECIM= 32
##$DECNUC= <off>
##$DECSTAT= 4
##$DIGMOD= 1
##$DIGTYP= 9
##$DL= (0..7)
0 120 120 120 120 120 120 120 
##$DP= (0..7)
150 150 150 150 150 150 150 150 
##$DP07= 0
##$DPNAME0= <>
##$DPNAME1= <>
##$DPNAME2= <>
##$DPNAME3= <>
##$DPNAME4= <>
##$DPNAME5= <>
##$DPNAME6= <>
##$DPNAME7= <>
##$DPOAL= (0..7)
0.5 0.5 0.5 0.5 0.5 0.5 0.5 0.5 
##$DPOFFS= (0..7)
0 0 0 0 0 0 0 0 
##$DQDMODE= 0
##$DR= 18
##$DS= 0
##$DSLIST= <SSSSSSSSSSSSSSS>
$$ [...]
##$SUBNAM2= <"">
##$SUBNAM3= <"">
##$SUBNAM4= <"">
##$SUBNAM5= <"">
##$SUBNAM6= <"">
##$SUBNAM7= <"">
##$SUBNAM8= <"">
##$SUBNAM9= <"">
##$SW= 18.0517287032376
##$SWIBOX= (0..15)
0 0 2 0 0 0 0 0 0 0 0 0 0 0 0 0 
##$SW_h= 3612.71676300578
##$TD= 16384
##$TD0= 1
##$TE= 0
##$TE2= 300
##$TE3= 300
##$TEG= 300
##$TL= (0..7)
0 120 120 120 120 120 120 120 
##$TP= (0..7)
150 150 150 150 150 150 150 150 
##$TP07= 0
##$TPNAME0= <>
##$TPNAME1= <>
##$TPNAME2= <>
##$TPNAME3= <>
##$TPNAME4= <>
##$TPNAME5= <>
##$TPNAME6= <>
##$TPNAME7= <>
##$TPOAL= (0..7)
0.5 0.5 0.5 0.5 0.5 0.5 0.5 0.5 
##$TPOFFS= (0..7)
0 0 0 0 0 0 0 0 
##$TUNHIN= 0
##$TUNHOUT= 0
##$TUNXOUT= 0
##$USERA1= <user>
##$USERA2= <user>
##$USERA3= <user>
##$USERA4= <user>
##$USERA5= <user>
##$V9= 5
##$VALIST= <valist>
##$VCLIST= <CCCCCCCCCCCCCCC>
##$VD= 0
##$VDLIST= <DDDDDDDDDDDDDDD>
##$VPLIST= <PPPPPPPPPPPPPPP>
##$VTLIST= <TTTTTTTTTTTTTTT>
##$WBST= 1024
##$WBSW= 4
##$XGAIN= (0..3)
0 0 0 0 
##$XL= 0
##$YL= 0
##$YMAX_a= 365943
##$YMIN_a= -356669
##$ZGOPTNS= <>
##$ZL1= 120
##$ZL2= 120
##$ZL3= 120
##$ZL4= 120
##$ABSF1= 10
##$ABSF2= 0
##$ABSG= 5
##$ABSL= 3
##$ALPHA= 0
##$AQORDER= 0
##$ASSFAC= 0
##$ASSFACI= 0
##$ASSFACX= 0
##$ASSWID= 0
##$AUNMP= <proc_1d>
##$AZFE= 0.1
##$AZFW= 0.1
##$BCFW= 1
##$BC_mod= 2
##$BYTORDP= 1
##$COROFFS= 0
##$CY= 11.3945322036743
##$DATMOD= 1
##$DC= 2
##$DFILT= <>
##$DTYPP= 0
##$F1P= 2.36226072786647
##$F2P= -0.459571619588291
##$FCOR= 0.5
##$FTSIZE= 0
##$FT_mod= 4
##$GAMMA= 1
##$GB= 0.15
##$INTBC= 1
##$INTSCL= 1
##$ISEN= 128
##$LB= 0.24
##$LEV0= 0
##$LPBIN= 0
##$MAXI= 10000
##$MC2= 0
##$MEAN= 0
##$ME_mod= 0
##$MI= 1.114404
##$NCOEF= 0
##$NC_proc= 0
##$NLEV= 6
##$NOISF1= 3.799351
##$NOISF2= 2.8
##$NSP= 1
##$NTH_PI= 0
##$NZP= 0
##$OFFSET= 15.70392
##$PC= 1
##$PHC0= -15946.78
##$PHC1= 7.80079
##$PH_mod= 1
##$PKNL= yes
##$PPARMOD= 0
##$PSCAL= 0
##$PSIGN= 0
##$REVERSE= no
##$SF= 200.130013532006
##$SI= 16384
##$SIGF1= 3
##$SIGF2= 2
##$SINO= 400
##$SIOLD= 16384
##$SREGLST= <1H.CDCl3>
##$SSB= 0
##$STSI= 0
##$STSR= 0
##$SW_p= 3612.71676300578
##$SYMM= 0
##$S_DEV= 0
##$TDeff= 0
##$TDoff= 0
##$TI= <>
##$TILT= no
##$TM1= 0
##$TM2= 0
##$TOPLEV= 0
##$USERP1= <user>
##$USERP2= <user>
##$USERP3= <user>
##$USERP4= <user>
##$USERP5= <user>
##$WDW= 1
##$XDIM= 8192
##$YMAX_p= 0
##$YMIN_p= 0
$$ End of Bruker specific parameters
$$ ---------------------------------
##NTUPLES= NMR FID
##VAR_NAME=  TIME,          FID/REAL,        FID/IMAG
##SYMBOL=    X,             R,               I
##VAR_TYPE=  INDEPENDENT,   DEPENDENT,       DEPENDENT
##VAR_FORM=  AFFN,          ASDF,            ASDF
##VAR_DIM=   8192,          8192,            8192
##UNITS=     SECONDS,       ARBITRARY UNITS, ARBITRARY UNITS
##FACTOR=    0.0002768,     1,               1
##FIRST=     0,             0,               0
##LAST=      2.2672688,     0,               0
##MIN=       0,             -356669,         0
##MAX=       2.2672688,     365943,          0
$$ Real data points
##PAGE= N=1
##DATA TABLE= (X++(R..R)), XYDATA
0@%%%%%%%%%%%%%%%%%qJ6j6J6j6J6k4L2l2L6m4M9n4O1p2Q4r2J01j13J28j44J60
39H4j76J97k18K41k66K91l22L56l92M30m74N22n73O32p01P78q65R66j083J223
59F50j393J602j870K221k702L396m474O343j0131K0481r6534k74258L92573K80199
73C16103l67851j94870L39753Q6650l26206J1555L24617q2809l09452J21586K68064
84A87140j49211j97261J81509J19542k26568n7935K68902K8728k87909k4197K66178
95A08918K5830k08101j3219J33041j7567o6202N4901K0340p8145P794P4839l3184
107I245m8153O8087J4810j12134Q107J50559j3829j65605J0654J48505j4617j05974
119e0345L7188N5571p6149j4934J17544r382j44826K3716J49794m0272j37185
$$ y = [0, 0, 0, 0, 0, 0, 0, 0, 0, 0, 0, 0, 0, 0, 0, 0, 0, 0, -8, 8, -8, 8, -8, 8, -16, 16, -16, 20, -24, 25, -29, 32, -40, 44, -48, 53, -60, 68, -76, 84, -92, 105, -113, 128, -138, 153, -169, 187, -205, 225, -249, 273, -300, 332, -369, 409, -456, 510, -573, 650, -743, 859, -1011, 1210, -1492, 1904, -2570, 3773, -6358, 14123, -82411, -356669, 35904, 316103, -51748, -246618, 93135, 179785, -146421, -134866, 189751, 106942, -202510, -80924, 187140, 37929, -159332, 22177, 141719, -84849, -142784, 126118, 154846, -133063, -157260, 108918, 134748, -73353, -86572, 46469, 28902, -37300, 17601, 37941, -40204, -32410, 42429, 9245, -38908, 29179, 43989, -68145, -60038, 90521, 76692, -88913, -78259, 70246, 55629, -50345, -13157, 42414, -33735, -48669, 68875, 59493, -85333, -61617, 88177, 47905, -89280]
130h9280O6409J20224r8566j10394J24600J09157j31991j08151J17171R6097q8111
141G165o7643N8765K8016l9792R682L2911l3351l0866L8910K4159l1639q800K1302
154H819j0470j4848K3864J1532k3454m361Q484j3569J4103M3231l4830p7853M7830
167b1522J06744n4493j21460O1402J20332p4788j08342R5710R2606j19213p6906
178i9930J37505N9772j45235l6467J42714L567j34976L7485J27678q0171j22943
189a11001J16302J18098j40535j07781J52722Q8036j56607n9433J56510K6664
199H2975j54069M439J47183l0208j32275N0674J07572o8486p5119Q5974L9962
210E8622j02532p729J14666j8321j17981L8320J10049n4600r1831O9069O7148
$$ y = [-89280, -22871, 97353, -1213, -111607, 12993, 122150, -9841, -117992, -821, 95276, 7165, -60478, -1713, 26303, -13489, -3807, 29104, -4247, -35113, 3797, 27956, -3683, -12483, 8819, -1651, -16499, 7365, 18897, -4557, -8918, -434, -14003, 100, 43331, 8501, -69352, -21522, 85222, 30729, -90731, -29329, 91003, 16215, -92127, 3583, 96189, -23024, -99930, 37575, 97347, -47888, -84355, 58359, 61926, -73050, -35565, 92113, 11942, -111001, 5301, 123399, -17136, -124917, 27805, 115841, -40766, -100199, 56311, 82975, -71094, -66655, 80528, 50320, -81955, -31281, 76291, 7805, -67314, 18660, 58622, -43910, -51639, 63027, 44706, -73275, -34955, 75094, 20494, -71337, -2268, 64880]
221F4880q1407m0406Q9237J4257q9638J0993Q1421l6171o6149O1501M7205q5213
233b9490k7961J03942J0091j14405O827J15052k4122j06838M2393R2379o0553
244G315p4487P6273N4686q7122l3224R1971R885r1444J4781Q7171l8914q0582
256f3691N9752P2059p4791o0988Q2913M6628q4534k9121Q1122R839p4029Q953
268b5888O4006k5094n1107L7317L5440m5481j7751M9999k34n1318J6467M9227
280C5583k9163m3309L7494L3272m1599j9661M2140L900l9782J2184L4722k6861
292a080k6907L9000J6381m8113l745N4081r866n6713K3079N5606l4722n0300M4142
305H43M0738n1175k7401N5806J1470n7926N625N7201k2406n3314L7797M6045n0922
$$ y = [64880, -16527, -56933, 32304, 46561, -43077, -32084, 49337, 13166, -52983, 8518, 55723, -29490, -57451, 46491, 56582, -57823, -50996, 64056, 39934, -66904, -24511, 67868, 7315, -67172, 9101, 63787, -23335, -56559, 35412, 45297, -46147, -31366, 55805, 16891, -63691, -3939, 68120, -6671, -67659, 15254, 61882, -22652, -51773, 29349, 39188, -34841, -25888, 38118, 13024, -38083, -766, 34674, -10807, -28558, 21441, 21207, -30111, -13644, 35583, 6420, -36889, 605, 33877, -7722, -27383, 14757, 18657, -21125, -8941, 25781, -1080, -27987, 11013, 27394, -20719, -24464, 29617, 19751, -36962, -13883, 41723, 7001, -43299, 843, 41581, -9594, -36995, 18811, 30281, -27645, -22020, 35181, 12775, -40539, -2742, 43303, -7619]
318g619l5775O1180K3244o7969r427P0678m708o8910J8398O2562l1008n2171M2046
331E21L8618n0904k3107N6947O809n9637R260N8684k4251n4129L7390M6424m7961
344e336l6143N5341K3964n9071j0565N8982l392n5207J7165M8202k9937l8571
356c4568M0865K6987m9138j4176N4177Q03n5624J2331N3461k4497m7827L4850
368b356L9161m2815k7948M7819J4963m9681j028M8354j2858m4054K5741L7081
380C2379l6656k7945M4889J7249m9939n622N1516o152m9631J7346M4499k7236
392D697l6525L5279K6288m1049j4440M4215J859m4719J0673M2494k2314l7698
404c1240L2342L0565m0157k1516M5287J1078m7448J04M6518j1322m2598K1897
$$ y = [-7619, -43394, 17786, 41030, -26939, -36366, 34312, 29604, -39306, -20908, 41654, 10646, -41525, 521, 39139, -11765, -34872, 22075, 28884, -30753, -21493, 37191, 12940, -41189, -3799, 42625, -5336, -41479, 13862, 37826, -21245, -31810, 27172, 23780, -31427, -14262, 33940, 4003, -34568, 6297, 33284, -15854, -30030, 24147, 24950, -30674, -18343, 35118, 10621, -37206, -2356, 36805, -6010, -33958, 13861, 28824, -20857, -21885, 26469, 13611, -30443, -4702, 32379, -4277, -32222, 12667, 29916, -20023, -25645, 25871, 19719, -29912, -12566, 31933, 4697, -31828, 3451, 29739, -11310, -25750, 18465, 20324, -24395, -13722, 28772, 6458, -31240, 1102, 31667, -8490, -30006, 15281, 26359, -21089, -20985, 25533, 14211, -28387, -6490]
416f490L5898l1121k6878L8401J6122m3233m390M5289p542m4387J8903M0539k8901
429B210l3998L6950K5189m2567j4711M5447L284m5443Q344M2600j9413l7168K9288
442A2K9519l7344k0200M3115R763m6220J094M6493j1764m3960K1672L8784l0298
455F66l1256L7109K1929m1785j1349M4006J71m3658J0953M0750k1329l5485L0317
468A039K8243l7365j9415M1945R605m3778N93M2851j0618l9203J9772L3197k7462
481e96k5305L3195J6076l6650o106L7625l926l6172J3360L2462k1585k6821K8081
494C638J9589l2438j1271L4447K395l4135O550L1549j4919k6936K2172K0607k7835
507f587j2918L1555M353l3142M576L2499j3234k9671K1055K4790k7496j8079L2128
$$ y = [-6490, 29408, -1713, -28591, 9810, 25932, -17301, -21691, 23598, 16056, -28331, -9428, 31111, 2210, -31788, 5162, 30351, -12216, -26927, 18520, 21804, -23639, -15295, 27305, 7892, -29276, 12, 29531, -7813, -28013, 15102, 24865, -21355, -20261, 26232, 14468, -29492, -7820, 30964, 666, -30590, 6519, 28448, -13337, -24686, 19320, 19491, -24167, -13214, 27536, 6207, -29278, 1039, 29282, -8083, -27498, 14447, 24052, -19726, -19133, 23718, 13100, -26103, -6331, 26866, -596, -25901, 7294, 23370, -13280, -19386, 18239, 14313, -21859, -8499, 23963, 2378, -24443, 3638, 23227, -9211, -20482, 13965, 16360, -17775, -11225, 20324, 5405, -21531, 641, 21248, -6587, -19505, 12050, 16403, -16739, -12163, 20336, 7102, -22569, -1514, 23276, -4220, -22299, 9829]
520I829R943l4685q96L5013q414l3086J7320K8989k5186k2974L1513J5335l5893
533a3192o607L8080k597l7988J1672L5558k0010l0925K7113K4379l2636j6344
545b3497L6316P356l7965J968L7511j1042l4930J9394L0367k6590k4074L2259
557G073J6484l6096q090L7868o18l7439R173L4792j7118l0099K4026K3718k9548
570e874j6098L3291P735l4956Q40L4448r153l1850J6718K7404k3115k1470K7908
583E828J4504l0778o966L1606p35l0396Q121K7362j4716k2864K0160J7282k4105
596e697j0952K6281M279k6611K316K5299q519k2466J3868J8363j7967j3311K0582
609E465P592k1620j540K1077m433j9064R831J5793j4276j1481J7404O348j8976
$$ y = [9829, 19772, -14913, -15809, 19204, 10790, -22296, -4976, 24013, -1173, -24147, 7366, 22701, -13192, -19799, 18281, 15684, -22304, -10632, 24926, 4916, -26009, 1104, 25483, -7153, -23497, 12819, 20175, -17790, -15822, 21689, 10647, -24283, -4889, 25478, -1112, -25186, 7073, 23557, -12539, -20629, 17239, 16621, -20818, -11645, 23147, 6029, -24070, -44, 23674, -5874, -21972, 11319, 19054, -15902, -15062, 19386, 10233, -21617, -4899, 22505, -610, -22080, 5828, 20332, -10446, -17412, 14194, 13459, -16937, -8816, 18546, 3830, -19034, 1126, 18408, -5697, -16649, 9632, 13911, -12700, -10384, 14915, 6396, -16070, -2202, 16161, -1806, -15117, 5465, 13057, -8563, -10103, 10974, 6541, -12523, -2692, 13101, -1175, -12656, 4748, 11096, -7880]
622g880p34J8903m879j7309J0068J4321j4405j0072J7462M871j9006R20J9003
635A1263o858j7505J2511J4545j7285j0354K0835N180k2932P24K3445o948k2368
648a5747J3020J9731j8451j5719K2913J0430k6114m120K7846k840k8014R938K6615
661A9488j6776k3591K2888J8980k7887j2980L1505N893l3554J899L3828r856l2211
674b2374J7488K8691k4351k3400L0110J6609l4419q716L6987K79l7604Q204L6193
687B3697j6270l2771K3518K7510k9574k0860L4154J3212l6993n014L7896l310
699A5195l6828J1331L3937j8734k9442K5153K3655l0214j6944L3647R642l5302
711a4904k037L5115n474l3215J2546K9780j8759k5071K3802J9293k7342j2783
$$ y = [-7880, -8614, 10289, 5410, -11899, -1831, 12490, -1915, -11987, 5475, 10346, -8660, -7740, 11263, 4405, -13100, -589, 13956, -3329, -13683, 7152, 12332, -10600, -9876, 13569, 6621, -15747, -2727, 17004, -1447, -17166, 5747, 16177, -9937, -14057, 13789, 10949, -17065, -7127, 19488, 2712, -20879, 2009, 20989, -6898, -19878, 11627, 17520, -16034, -14135, 19693, 9837, -22374, -4886, 23805, -546, -23946, 6164, 22773, -11646, -20362, 16625, 16904, -20700, -12496, 23697, 7427, -25344, -1826, 25684, -3890, -24750, 9404, 22616, -14377, -19391, 18505, 15195, -21633, -10302, 23635, 4901, -24541, 612, 24267, -5947, -22891, 10756, 20398, -14904, -16941, 18174, 12700, -20515, -7969, 21811, 3052, -22019, 1783, 21076, -6266, -19049]
723a9049K9282N908k9613R54K8425p369k5867J2931K2105j7265j7440K0251J2120
736A5373k1837o534K2042J074k0983L853J8809p996j5685J1138J1872j3215p675
749i764J4197L477j4158M03J3182l758j1265O328Q690q064n661Q966K449q974
763c952O45Q070l294o390N370M067o748j295P300j641o953M379N749o704l695
778e092Q380R31r270K279R276n646q353Q827O490j1558l744J3585K95j4754L642
793d712J4915p713j4044J1660J2080j5144r113J7995N255j9993p20K1051m237
806G280k0974R220J9777j4024j7407J8379J3927k2049r496K4819M337k6473J256
819a1428K6857p048k5845J2707K3442j7983j9747K2544J4950k6100r314K8408
$$ y = [-19049, 10233, 16141, -13472, -12518, 15907, 8538, -17329, -4398, 17707, 442, -16998, 3253, 15373, -6464, -12998, 9044, 10118, -10865, -7012, 11797, 3801, -11884, -746, 11126, -2089, -9764, 4433, 7910, -6248, -5845, 7337, 3579, -7686, -1358, 7332, -732, -6393, 2573, 5022, -3952, -3307, 4763, 1469, -4921, 449, 4516, -2232, -3527, 3773, 2132, -4821, -442, 5307, -1397, -5092, 3288, 4219, -5051, -2772, 6504, 858, -7495, 1332, 7822, -3736, -7480, 6105, 6400, -8354, -4712, 10203, 2490, -11554, 106, 12186, -2958, -12071, 5924, 11179, -8814, -9534, 11517, 7280, -13694, -4474, 15303, 1279, -16128, 2251, 16178, -5871, -15367, 9452, 13789, -12684, -11428, 15429, 8381, -17464, -4757, 18685, 702, -19045, 3499, 18449, -7651, -16965, 11443]
831A1443L143k9274L234K8630r505k6509J5307K3046k0262j8479K4131J3064k6673
844h704p081K7786Q44k7411N292K5665j0992k2717J5965J8725j9928j3923K2713
857F234Q565k4231k952K4462k648k3429P894K1221j2520j8014J6342J3888j9111
870d299r172K0797M103k1321J004K0655n790j8902J0038J6144j3483j2602J6003
883C175Q523j7440m225J7780Lj7052L913J5341p287j2800R933R669j1729o235
897h431J2617K743j2582N67J1698l526j0070N942P827p679n200Q645K409q845
911c885L79Q248k966o942N211N016o897k671P939O4q206K585P731n131o483P359
927A351M550r042k106J0089o96j0349L622R797o466q472R019O428j1081l810J2457
$$ y = [11443, 14586, -14688, -11454, 17176, 7671, -18838, -3531, 19515, -747, -19226, 4905, 17969, -8704, -15785, 12001, 12845, -14566, -9274, 16391, 5399, -17318, -1353, 17372, -2556, -16479, 6234, 14799, -9432, -12384, 12078, 9430, -13999, -6105, 15116, 2596, -15418, 924, 14812, -4299, -13471, 7326, 11429, -9892, -8888, 11767, 5977, -12925, -2887, 13257, -226, -12828, 3175, 11698, -5742, -9967, 7813, 7816, -9236, -5323, 10018, 2731, -10069, -136, 9533, -2196, -8431, 4186, 6929, -5653, -5086, 6612, 3086, -6984, -1042, 6785, -894, -6094, 2551, 4960, -3885, -3506, 4742, 1776, -5166, 45, 5061, -1836, -4507, 3432, 3496, -4710, -2125, 5606, 475, -6008, 1351, 5901, -3141, -5247, 4842, 4146, -6203, -2581, 7216, 750, -7722, 1297, 7725, -3356, -7166, 5291]
942E291Q15j3042K322J2819n455j1760Q368R904j0822p427J2687M464j3846j185
956f867J4208k219j3757N525J2540q554j0617J1174Q052j3160m993J4399J630
969G361j4820J878J4399n314j3151Q501J1103j1206q402J3282N158j4568j606
982g385J4978k056j4506N580J3154q722j1037J1327Q253j3181n033J4226J549
995G147j4386J944J3673n213j2191Q112J0014j0417p295J2016M230j2847j029
1008f242J2901k141j2170N095J0705p635q622R667O029j1034l118J1692K3j1580
1022f430L021J0700n832r122Q232O944j0080m307J1247J340j1612J689J1184m622
1036B352r977P255Q074r381n609J0868K757j1611K66J1600l277j0796O063R300
$$ y = [5291, 6106, -6936, -4614, 8205, 2750, -9010, -642, 9262, -1560, -8987, 3700, 8164, -5682, -6867, 7341, 5122, -8635, -3110, 9430, 876, -9741, 1433, 9485, -3675, -8668, 5731, 7361, -7459, -5581, 8818, 3504, -9647, -1146, 9957, -1249, -9651, 3631, 8789, -5779, -7385, 7593, 5537, -8969, -3389, 9765, 1043, -9994, 1333, 9586, -3595, -8628, 5598, 7147, -7239, -5295, 8378, 3165, -9026, -914, 9100, -1317, -8612, 3404, 7634, -5213, -6242, 6659, 4518, -7652, -2557, 8148, 513, -8109, 1558, 7587, -3447, -6565, 5127, 5150, -6430, -3409, 7291, 1459, -7663, 569, 7513, -2567, -6874, 4373, 5713, -5899, -4210, 6974, 2352, -7625, -370, 7704, -1677, -7286, 3582, 6339, -5272, -5006, 6594, 3317, -7479, -1416, 7884]
1050G884q433p207J0258M664j1428j826J1883j127j1586L991J0589o644q952Q904
1064I70O768j0634m170J1728J289j2152J689J1851m609j0818P277R133r527o898
1078h103J1269M181j2333j194J2652j869j2227M845J1077p531r263R755O940j1379
1092c180m231J2325J318j2543J620J2014m370j0812O781R042q740o827J0121M328
1106F846j0906j670J1027r65j0522L415R432n560p868P283N910q498l679R138
1120C383J343r181R78Q642l135p563M989O020o424m114P354K011p719J58P522
1135D264k247o743M076N479n531l832O526J917o967P8O864k052o194L801N077
1150D516n260l571O282J792o817J05O832j992o350L750N402n257m031O396K362
$$ y = [7884, -549, -7756, 2502, 7166, -4262, -6088, 5795, 4668, -6918, -2927, 7662, 1018, -7934, 970, 7738, -2896, -7066, 4662, 5951, -6201, -4512, 7339, 2730, -8088, -811, 8322, -1205, -8103, 3166, 7347, -4986, -6180, 6472, 4603, -7624, -2779, 8298, 767, -8496, 1259, 8199, -3180, -7411, 4914, 6232, -6311, -4691, 7323, 2953, -7859, -1078, 7964, -776, -7603, 2518, 6846, -4060, -5730, 5297, 4332, -6190, -2775, 6657, 1097, -6771, 512, 6422, -2076, -5755, 3383, 4726, -4455, -3477, 5165, 2030, -5533, -544, 5476, -948, -5062, 2292, 4303, -3416, -3258, 4264, 2017, -4726, -650, 4829, -702, -4534, 1992, 3909, -3058, -2980, 3884, 1832, -4362, -561, 4516, -744, -4315, 1967, 3759, -3058, -2953, 3879, 1887, -4463, -713, 4689, -568, -4599, 1797, 4159]
1165D159p132m76P380j490p136L441O383n214n164O710L567p813j651Q466m74
1180C556q581K672Q112m787p096O682N575q231l638R295J397r817R85R753l376
1195B501r089N624P844p562o143R079M070j0086j735J0510o78j0358L080R631
1209F688n291q390P205O706q709m693R747K444j0249q4J0215k262r615M449Q518
1224F679o377o960P914N047r006k880R573N78r569J706R015l836p961N680O456
1239F059p151m597Q108K551q555m18Q455j635p840L492O766n034n318O181L639
1254D703o883j810P108l3o853J764O174l265n144M487L827n359k325N835P04n868
1270b938Q97N474k388m717L678L605m670k243N302P01n532R14N310k464m657L837
$$ y = [4159, -2973, -3449, 3931, 2441, -4695, -1254, 5129, -85, -5249, 1461, 5028, -2785, -4436, 4030, 3556, -5025, -2353, 5759, 972, -6124, 558, 6133, -2098, -5736, 3559, 4956, -4861, -3876, 5877, 2501, -6588, -964, 6880, -682, -6825, 2254, 6324, -3762, -5497, 5013, 4335, -6023, -2943, 6688, 1397, -6993, 212, 6918, -1791, -6484, 3263, 5707, -4542, -4626, 5589, 3327, -6288, -1839, 6679, 302, -6658, 1256, 6303, -2703, -5583, 3990, 4568, -5001, -3295, 5720, 1884, -6077, -397, 6059, -1092, -5689, 2419, 4970, -3585, -4003, 4452, 2817, -5023, -1531, 5235, 201, -5117, 1064, 4703, -2180, -3990, 3118, 3085, -3768, -2004, 4170, 905, -4239, 248, 4075, -1284, -3609, 2226, 2930, -2938, -2041, 3433, 1045, -3672, 6, 3611, -1059, -3302, 2000, 2701, -2831, -1917, 3393, 929, -3728, 109]
1286A09L642m951k315N721P51o053R20N930k557n349M060M365n314l039O230J471
1302C621o732K36O801j965o418L606N620n074m435O215K978p021j316P407m49
1317C074p389K230O948l925o103N435M878o654l354P514J639q012K43Q033k138
1332B419p586L943O721n544n471O855L886p772k069Q275J26q278J779P847l599
1347A532o961N176N698o412m181P276K475p733o82P743j083p335K709O553m113
1362F62n459N223M124o010k641O426J113o489M14O180j820n549L052M618m016
1377a72l473M700K172n022q22N002m85m628J667L955k659l027L374J926l755p64
1393b011L807l96l553J471K953k322k138K931J161l267r4L268r40k976J903K389
$$ y = [109, 3751, -1200, -3515, 2206, 2957, -3096, -2176, 3754, 1197, -4152, -92, 4273, -1041, -4080, 2150, 3621, -3111, -2875, 3926, 1961, -4457, -851, 4769, -305, -4740, 1475, 4453, -2568, -3884, 3523, 3074, -4315, -2085, 4863, 938, -5165, 270, 5148, -1506, -4860, 2654, 4293, -3719, -3476, 4557, 2419, -5167, -1224, 5497, -47, -5518, 1337, 5223, -2549, -4618, 3657, 3783, -4495, -2716, 5131, 1532, -5429, -253, 5445, -967, -5148, 2128, 4603, -3130, -3812, 3931, 2848, -4487, -1778, 4775, 662, -4797, 426, 4550, -1460, -4101, 2325, 3438, -3051, -2637, 3543, 1723, -3826, -774, 3844, -172, -3645, 1055, 3227, -1795, -2617, 2385, 1900, -2728, -1061, 2894, 235, -2792, 582, 2508, -1247, -2011, 1796, 1400, -2153, -682, 2271, -51, -2189, 742, 1903, -1364, -1458, 1810, 870, -2106, -203, 2186]
1409B186k681j606L253O40l533L88L546j433l264K436K698l289j893L949R02m371
1425b072K38M513j433m343K633L874l774l079M719K037n463p69N889o57n947K127
1441a507N626l560m958M874L943n963k628O709J125p125N18P140k175o748L763
1456i66N972n168m868O301L515p113j939P573K48p625J445P296l043o624M505
1471d91N606n731m331O679K833p278j223P519m55p389K097O866l609o014M926
1486EM841n955l460O671J914p006l07O978j288o560K756N808m000m776M979L540
1502D140n641k183N984P78n956N78N614j810n009K865M151l689l118M203K049
1517B956m488r18M471j68m192J123L705j929l040K543K228k929j360L076M71k972
$$ y = [2186, -495, -2101, 1152, 1792, -1741, -1353, 2193, 760, -2504, -68, 2630, -659, -2552, 1397, 2299, -2072, -1834, 2679, 1246, -3097, -464, 3410, -364, -3443, 1276, 3313, -2150, -2919, 2970, 2313, -3634, -1507, 4119, 559, -4399, 475, 4418, -1545, -4173, 2536, 3661, -3464, -2946, 4194, 2019, -4729, -966, 5006, -162, -5030, 1271, 4786, -2327, -4266, 3307, 3555, -4070, -2625, 4671, 1628, -4996, -491, 5115, -616, -4947, 1732, 4565, -2713, -3936, 3583, 3128, -4261, -2164, 4702, 1093, -4921, 5, 4846, -1109, -4569, 2102, 4016, -2990, -3297, 3681, 2393, -4167, -1411, 4397, 397, -4379, 600, 4140, -1501, -3684, 2300, 3078, -2878, -2300, 3314, 1504, -3505, -640, 3511, -178, -3296, 907, 2956, -1532, -2450, 2021, 1853, -2339, -1216, 2489, 560, -2480, 63, 2291, -638, -1998, 1078, 1549, -1423]
1533a423L49K667j082k153J654J503k007p50K116j3j994P24J683j343j154J769
1549E46N14j999K00K022r34j808J602J397k163q02K534Q7k720O69K698j453k457
1566b067K183J990k793j378L285O07l591K65L650j138l515K038L166k882k592
1581b772L619J803m156q89M518j55m637J289M456k373m006L372L314m223k401
1596c241M882J291n278q5N382j184n159K380M666l484l885M385K898n055j760
1611c247N434N33n545P44N320j921m850K989M150l902l210M573K152m996j001
1626b777N158j68n061J338M685k394m070L288L245l978k273M472J163m661n0M586
1642B503j051m260K071L662k914k880L558J931l954r26M097j10l971J103L571
$$ y = [-1423, -1074, 1593, 511, -1642, 12, 1515, -492, -1242, 874, 861, -1133, -409, 1274, -69, -1223, 546, 1060, -939, -739, 1283, 349, -1459, 143, 1540, -623, -1425, 1109, 1196, -1524, -855, 1843, 390, -2067, 116, 2106, -687, -2065, 1220, 1827, -1764, -1499, 2151, 1013, -2502, -464, 2702, -180, -2772, 847, 2650, -1506, -2395, 2123, 1968, -2669, -1380, 3076, 703, -3303, 69, 3383, -840, -3241, 1641, 2932, -2346, -2431, 2951, 1767, -3392, -1012, 3654, 170, -3715, 670, 3568, -1487, -3247, 2187, 2720, -2825, -2081, 3239, 1318, -3532, -543, 3607, -295, -3505, 1068, 3220, -1776, -2777, 2381, 2213, -2848, -1510, 3175, 781, -3289, -1, 3244, -734, -3007, 1465, 2628, -2033, -2083, 2503, 1452, -2808, -737, 2925, 11, -2869, 689, 2620, -1334, -2260, 1837, 1727, -2244, -1141, 2430]
1657B430j944k989K629K251l123j390L377N15l413L83L210j188k817J896K246
1672B073k412j571K763Q10k918l0K885p70k634J480K196k059j625K500R20k746
1688a138j56K797o38k637J377K265k022j733K525J053k829l05K978n17k867J297
1704e50K558j984k071K553J430k938o92L150j09l140Q89K937j613k552K240K023
1720B131k749j347L059O21l218J60L173r26k960J628K562k245k017K727J360l052
1736a093o18L201j66l163R55K918j672k473K273J882k716j206L014M45l093L37
1752a175K971j083k666J751K188k269j591K640Q88k815j58K796n44k605J185K242
1768A755j730j763K144J181k408n37K485j13k417P38K197j299j827J776J336k120
$$ y = [2430, 486, -2503, 126, 2377, -746, -2136, 1241, 1756, -1657, -1274, 1936, 748, -2069, -173, 2073, -339, -1910, 853, 1663, -1255, -1285, 1600, 830, -1804, -324, 1872, -187, -1812, 688, 1608, -1138, -1294, 1503, 865, -1772, -395, 1870, -152, -1885, 640, 1693, -1136, -1441, 1537, 1020, -1847, -550, 2008, 24, -2047, 506, 1936, -1002, -1694, 1456, 1347, -1793, -904, 2033, 420, -2132, 108, 2131, -618, -1965, 1094, 1715, -1503, -1343, 1830, 904, -2056, -428, 2134, -111, -2128, 599, 1959, -1093, -1711, 1490, 1324, -1839, -884, 2034, 362, -2111, 162, 2044, -672, -1878, 1136, 1581, -1512, -1175, 1796, 713, -1953, -202, 1986, -283, -1874, 766, 1654, -1161, -1319, 1477, 933, -1672, -487, 1755, 25, -1738, 406, 1587, -821, -1358, 1127, 1014, -1403, -665, 1532, 233, -1594, 182, 1518, -602]
1784f02p44K302J26k355N41K207j154j893J695J448k133q80K420K28k530M68K467
1801A611j158k203J789J747k287j184K647N16k842K07K844r35k670J630K286k208
1817b10j787K681J146k984m57L134k94l086J039K861j710k483K316J951k780j317
1833a980L107O04l279J81L259r37l057J659K683k310k151K826J491l191p48L382
1849A539o3l365Q64L146j602k761K246K214k753j541L067Q20l230o1L198o80k996
1866a958J369K618j922k118K366J531k660q92K797K26k745L89K580r75k258J474
1882a78J844j855j351K116P91k240k20K199l37k032Q32J737j256j340J565Q65
1898A140j730l54J752j56j644O23J400j001j073J306O29j429j91J484k81j365
$$ y = [-602, -1346, 956, 1082, -1273, -732, 1475, 321, -1572, 123, 1571, -562, -1442, 978, 1206, -1324, -856, 1611, 453, -1750, 39, 1786, -501, -1685, 962, 1478, -1364, -1157, 1687, 752, -1918, -288, 1998, -210, -1997, 684, 1830, -1154, -1611, 1523, 1229, -1857, -818, 2043, 333, -2150, 166, 2117, -663, -1980, 1127, 1731, -1548, -1367, 1892, 955, -2102, -443, 2240, -70, -2221, 605, 2096, -1095, -1843, 1539, 1476, -1889, -1025, 2121, 519, -2242, 4, 2218, -535, -2076, 991, 1811, -1419, -1480, 1718, 1038, -1958, -589, 2029, 107, -2011, 355, 1886, -774, -1666, 1131, 1357, -1388, -999, 1581, 606, -1652, -178, 1666, -189, -1540, 576, 1367, -873, -1093, 1106, 769, -1263, -431, 1306, 50, -1290, 275, 1140, -590, -944, 808, 652, -992, -369, 1031, 30, -1043, 263, 892, -537, -728, 756, 475, -890]
1914h90O99J142j036q10J285M15j414nJ436m35j322Q33J112j178q05J437M27j614
1932g23J4J665m80j605R19J431j338j144J702P40j963k70K126k70k147Q36K014
1949A507j364j760J863J349k238q61K533K72k669L76K636j003k464J621K117k123
1965b08j669K548J097k832m67K954j94k921Q42K736j454k415J980J991k416j460
1981a888K734Q40k900k21K947m44k823J060K557j604k186K100J692k447j121K665
1997I61M93k729J44K649p50k421J300K072j745j618K071J092k268n36K327l9k239
2014a236N67K019j016j719J383J312j625q87J758M39j776kJ693m14j508P71J235
2031I94j030q99J195N48j278j69J262j90j133N00R36p54o54R30L31j023K5R95
$$ y = [-890, -191, 951, -85, -895, 390, 805, -609, -614, 822, 387, -935, -102, 1010, -168, -973, 464, 891, -723, -709, 956, 476, -1129, -210, 1221, -117, -1261, 441, 1181, -782, -1052, 1074, 804, -1343, -507, 1507, 143, -1617, 246, 1595, -643, -1504, 1029, 1301, -1368, -992, 1644, 641, -1823, -202, 1915, -208, -1877, 671, 1768, -1064, -1531, 1423, 1229, -1692, -850, 1886, 432, -1983, -3, 1988, -428, -1888, 846, 1686, -1214, -1435, 1512, 1068, -1755, -695, 1862, 258, -1928, 172, 1864, -583, -1704, 961, 1454, -1275, -1131, 1518, 768, -1653, -353, 1719, -26, -1644, 427, 1519, -749, -1285, 1042, 1003, -1236, -669, 1350, 334, -1385, -2, 1310, -315, -1202, 556, 995, -781, -783, 910, 496, -1012, -241, 994, -36, -935, 260, 808, -470, -639, 623, 433, -700, -200, 736, -18, -672, 258, 589, -434, -409, 586]
2049E86l55q80O66O62r14l85J086L9j156L32J112p03r43J013P01j292l71J455
2067F53oj523M17J477q18j328J192J080j508p28J735L33j878J19J898n74j797
2084a256R98J627j423j330J778R54k040n04K193Pk260N19K193j029k002J507J676
2101A608j911j283K250P70k449k20K529l61k476R50K265j464j945J902J530k253
2117e58j014K469M62k563J21K514o64k342J182K053j602j681J947J227k190p32
2133a371K314K09k321L07K205p82j995J190J688j531j289J775Q49j927l90J963
2149H94q5j866N06J676q81j400J196J048j378o69J479K61j468J11J364m56j150
2166h18P28Q91r05o00J022K76j022PR55k81q16N00O11o54l81P36J30p40R8O93
$$ y = [586, 231, -649, 17, 679, -235, -620, 466, 505, -651, -319, 793, 90, -853, 160, 861, -431, -802, 653, 647, -876, -459, 1018, 200, -1128, 64, 1144, -364, -1092, 643, 976, -902, -783, 1115, 541, -1256, -258, 1369, -54, -1384, 394, 1348, -692, -1196, 997, 1004, -1256, -737, 1456, 427, -1575, -68, 1608, -303, -1586, 664, 1434, -1015, -1235, 1294, 933, -1543, -593, 1672, 208, -1737, 165, 1695, -558, -1572, 897, 1359, -1204, -1083, 1431, 767, -1575, -393, 1660, 58, -1623, 324, 1551, -639, -1371, 943, 1152, -1169, -862, 1343, 561, -1434, -244, 1444, -87, -1376, 399, 1248, -679, -1069, 894, 809, -1057, -551, 1125, 244, -1156, 40, 1088, -290, -959, 520, 781, -687, -576, 788, 332, -818, -90, 801, -104, -704, 318, 594, -428, -421, 534, 253, -563, -63, 548, -106, -487, 249, 379, -361, -263, 430]
2186D30l23n88N26M01o57j90P50p1p50L13P10n73n60P94L54r61j07J076j97j099
2206g22N45J009q53q51J135N94j338k83J475o5j545M58J486q37j330J187J083
2223A148j487p64J702L85j829K8J851m50j769Q54J609j241j341J540J015j804
2239e53o02J956J87k016K75J970p18j821J135J578j504j229J790Q17j989l75K092
2256I93j08k058N74J913j018j687J426J343j724r36J926M82k024j7K007m46j891
2273a245Q78J642j229j335J516R67j696n63J805J33j791K73J685o36j507R93J243
2290A133j255r20J430N68j531j86J518j77j441N18J270q18j027J040P41j196m03
2307g36J253N9j227K63J112n66r09P81O67r40l86J021J04j029J95R35m34p91O58
$$ y = [430, 107, -481, 45, 446, -211, -401, 349, 278, -472, -159, 551, -22, -582, 212, 566, -395, -502, 574, 377, -722, -177, 832, -21, -872, 263, 857, -481, -764, 711, 646, -899, -441, 1045, 208, -1122, 65, 1148, -339, -1103, 599, 984, -845, -817, 1034, 584, -1185, -331, 1278, 37, -1304, 236, 1251, -553, -1155, 801, 988, -1028, -753, 1217, 499, -1322, -187, 1391, -113, -1342, 448, 1265, -724, -1099, 993, 885, -1173, -599, 1314, 296, -1391, 35, 1378, -346, -1282, 644, 1126, -898, -915, 1092, 646, -1245, -367, 1275, 46, -1289, 227, 1194, -502, -1065, 740, 873, -918, -645, 1040, 404, -1103, -110, 1133, -122, -1042, 388, 956, -575, -761, 757, 580, -861, -343, 927, 109, -918, 122, 863, -333, -736, 517, 576, -651, -388, 724, 158, -751, 30, 697, -243, -629, 392, 496, -533, -338, 597, 163, -628, 30]
2326C0N74q03l43Q88R2q99J75Q44m15p16O02N56p67l32Q39J16q92J49Q41l88p51
2347f00N96O21q11l95R22J55j007J36R92m14r06O81P55r08n33J070K71j173M5
2366e03J190l54j131O70R86r36p78J153M99j291j84J356j42j334M63J231p64j052
2384i21J010Q25j223n35J349K16j412J13J393m49j295P61J111j038q60J256N63
2401H64j403k28J476j35j433M86J320q24j125J107Q68j323n43J479J51j503K09
2418e57J470n76j309Q95J093j179q04J374M66j491j14J522k62j436N85J296q98
2435G5j081J157Q01j336m74J425J46j466K06J406n25j266Q31J061j076q09J275
2452C50M92j383j54J415k00j336N16J209q11j008J068P27j239m03J317O7j318
$$ y = [30, 604, -199, -542, 346, 438, -461, -286, 558, 143, -573, 29, 585, -182, -514, 325, 441, -451, -302, 539, 151, -600, -4, 617, -194, -589, 333, 488, -519, -383, 609, 195, -711, -30, 725, -183, -716, 354, 625, -548, -503, 687, 333, -798, -128, 858, -78, -856, 297, 796, -495, -679, 677, 535, -799, -336, 895, 131, -921, 89, 914, -309, -844, 505, 721, -691, -578, 815, 366, -929, -168, 943, -95, -955, 301, 864, -539, -767, 709, 574, -859, -373, 947, 123, -1002, 105, 973, -350, -893, 586, 737, -766, -557, 913, 337, -972, -77, 1016, -163, -967, 407, 873, -618, -732, 790, 528, -908, -323, 973, 75, -1006, 151, 952, -384, -858, 567, 713, -753, -547, 859, 334, -932, -101, 960, -116, -925, 350, 842, -541, -695, 720, 520, -816, -300, 909, 98, -910, 158, 885, -354, -757, 560, 627, -691]
2469f91K49J236n64j079Q16Q56j012n95J147L09j211KJ170k67j096N41R40p64
2487a3p19R07M95j004k44J050k4j009K77R22n06p65O79N76q12l48Q90R4q95J47
2507c02Q24l69p03N62N28p08l23P85R2q15J57P64l73o49N75M65p02k84P97N4q33
2528d58K09P70m09o72O12N10p57l28Q71J05r01J42Q77l82p92N84O72p89m97R43
2548C10K54j019nJ049k62j027N35R21p82p46R67N30j124k59J248p5j244L73J185
2567H29o69j054R58Q32j176n69J326K58j401Q5J411m21j330P42J169j017r48J242
2585B67O77j412l57J493Qj491L18J436o41j295R19J085j169q14J333N32j460j93
2603g64J489j37j457M68J345p73j148J027R09j227o12J350L01j393J3J374l43
$$ y = [-691, -442, 794, 230, -849, -33, 823, -189, -784, 363, 672, -539, -537, 633, 366, -730, -189, 751, -13, -732, 175, 670, -334, -578, 472, 448, -561, -284, 638, 132, -633, 46, 622, -190, -538, 352, 446, -449, -302, 522, 153, -550, 12, 540, -168, -491, 294, 386, -429, -272, 492, 119, -530, 45, 510, -192, -476, 321, 375, -458, -249, 521, 112, -560, 52, 562, -195, -523, 348, 453, -448, -306, 571, 189, -603, -19, 653, -136, -633, 310, 564, -455, -460, 589, 327, -700, -165, 756, -26, -772, 195, 725, -399, -658, 590, 515, -729, -356, 829, 160, -894, 64, 896, -280, -849, 477, 735, -666, -581, 830, 409, -921, -179, 990, -27, -975, 267, 944, -468, -825, 668, 676, -815, -497, 939, 298, -997, -78, 1007, -162, -976, 357, 889, -571, -764, 725, 588, -869, -401, 944, 171, -977, 50, 959, -268, -880, 470, 771, -622, -609, 765, 422]
2620D22j259O36J083q70q55J046N78j150l02J194J8j160K45J067m95r06O65P35
2638F92q34m96Q96K92r40n1Q88j56q10L35P00m89n29N92L50o39j53O43j7o16J93
2659a49N22l40l75M30K08m76l6M80j38m12K81K98l92j76M76J7n10J54M85l28m04
2680c85M78K79o01j23O62n5o84K45O70m40n88O19M58p55k89Q65R5r16J16R29l48
2701B32q76N71P88p79o41R56M28j086j89J169p7j190L67J130o47j002Q80Q30j112
2720b48n78J249L08j350JJ375l10j320O17J182q88r91J102P74j309m63J400J57
2738G08j425J58J392m35j320P52J127r76r22J174O67j309l74J375P3j386K43J307
2756H29n19j182P54J001r68p71J122M92j200k34J240n6j183L26J065n66q98P60
$$ y = [422, -837, -201, 882, 12, -843, 203, 781, -369, -671, 523, 541, -619, -374, 693, 198, -708, -43, 692, -142, -638, 258, 550, -390, -441, 447, 291, -519, -184, 516, 27, -502, 90, 440, -199, -352, 291, 274, -342, -149, 373, 33, -342, 88, 296, -180, -216, 264, 126, -286, -5, 293, -99, -275, 201, 218, -292, -138, 347, 19, -385, 93, 372, -229, -352, 310, 255, -429, -184, 486, 46, -542, 77, 535, -220, -509, 356, 451, -465, -349, 580, 232, -644, -73, 715, -64, -705, 251, 679, -407, -596, 573, 496, -694, -327, 803, 156, -846, 34, 864, -248, -826, 423, 731, -619, -618, 757, 447, -873, -256, 926, 38, -953, 149, 923, -386, -849, 551, 708, -717, -559, 833, 398, -922, -170, 957, -19, -941, 233, 900, -409, -783, 592, 665, -721, -478, 829, 310, -872, -118, 883, -85, -856, 266, 758, -442, -676, 564, 508, -675, -349, 716, 150, -748, 12]
2774A2P00q93m81R76K23r59J0R12k08q31M02O84n37n32O34L69o95j78O98%o50
2795c44J50N69k84m56L66L47m45k07M69N6m39P1L86j90l02K84J75l18o9L37p7
2816G9k95K03K33k98j33L76Om05J36M02k82l45M17K45n13j23N87l4o25K01O06
2837D38l48n58N10M54o66l06P51J38q05L9Q29k33q24M44P41o17o10P67M68r04
2857b92k73R91M3j018J84R98m08r33O45P94q25o32R95M13j092j61J131j01j124
2876f65L52J056n87r31P96P48r71n25J084K79j144j9J143k45j072M71R62o70q15
2895g53Q48O25r82l91J056J53j066O7J055l20r44N17Q13o84o61Q39M48r11k33
2914e24R52lr17K11Q33l93p17N57N56o73l81P37J83p57J1P12j90o29L36N07m43
$$ y = [12, 712, -181, -662, 314, 537, -422, -412, 500, 292, -539, -137, 547, 10, -522, 112, 481, -214, -392, 306, 306, -344, -194, 375, 91, -365, 1, 348, -97, -304, 165, 221, -218, -147, 239, 49, -253, 31, 206, -112, -181, 156, 79, -216, -13, 220, -78, -211, 165, 171, -234, -98, 304, 22, -323, 94, 339, -174, -297, 290, 256, -369, -168, 438, 90, -468, 42, 496, -170, -476, 275, 413, -392, -353, 476, 243, -581, -137, 604, -13, -623, 144, 612, -292, -565, 426, 469, -549, -365, 633, 225, -708, -63, 731, -94, -726, 269, 682, -410, -571, 560, 459, -665, -313, 743, 156, -775, 21, 769, -202, -727, 357, 636, -508, -527, 616, 371, -701, -230, 732, 62, -753, 95, 720, -262, -653, 403, 556, -510, -443, 612, 292, -652, -135, 678, -6, -667, 172, 620, -291, -524, 428, 425, -492, -281, 552, 159, -558, -1, 555, -118, -499, 238, 421, -336, -325, 387, 197, -432, -96, 411, -32]
2935c2l83N31K26n50q4N60o8n10K08M25l00l37L86K10m23q4M43l3m23J56L63k60
2957B1k85L55J67l97n7M09p3l90J91L31k97k45L79J48m56j1M54j21m37K74L71
2978C31l91k83M93J54n43j6N71j41n48L00M97m23m13N33K96o30j22O57j9o75J75
2999a97O49l44n71M74M70n90l51O62K17p25l9P35j45p14L11O55m71n36N95M01
3019D86p01k30P53N2p62J33P41l08o55M58N52n85m11O83K53p49n3P37j18p07K84
3040a47O20m14n20N31L95o37k34O76O6o68Q2O34k31n81L70M86m82l63N58K10n87
3061b36o7N97o2n80K18N03l28m25M46K98n05j55N35J0n18J30M66k42l93L42K86
3082C20m30j58M56L8m60R4M24k10l75L07K84l86j76M25P0m47N1M31j71l87K62
$$ y = [-32, -415, 116, 342, -208, -292, 268, 200, -310, -102, 323, 23, -314, 72, 282, -141, -225, 218, 185, -238, -82, 281, 21, -264, 91, 258, -139, -196, 213, 140, -250, -59, 272, -25, -270, 109, 257, -199, -210, 244, 123, -314, -40, 331, -60, -343, 150, 304, -239, -255, 316, 175, -373, -73, 424, 1, -412, 121, 417, -213, -335, 322, 303, -372, -197, 452, 108, -463, 11, 481, -109, -460, 202, 419, -306, -345, 390, 245, -469, -158, 497, 26, -510, 85, 486, -215, -445, 308, 360, -402, -269, 472, 164, -491, -33, 519, -66, -477, 206, 459, -290, -343, 394, 276, -431, -147, 473, 59, -461, 70, 465, -172, -406, 270, 336, -332, -250, 384, 153, -428, -58, 428, -54, -417, 141, 351, -236, -303, 294, 232, -348, -130, 373, 45, -380, 66, 364, -141, -296, 239, 249, -269, -139, 327, 85, -308, 34, 320, -110, -268, 188, 226, -234, -140, 284, 74, -301, 6, 290, -96, -272, 153, 223, -224, -173, 258, 87, -300, -38]
3103c8L34l43k31M10J27m52j3M53j07m20K23L83l12l10L90J99m58p6M89n0m72
3124b74J72M18k79l60L95K53m60j39M83J9n02J12M85k62m04L56L21m40k10M88
3144A72R9n09J9N28j66m82K77M13l73l15M45K26n06j04N29k2n21J56M74k57m22
3165c39L51L36m38k17M88R5n20L8N04j66m58K71L85l69k90M32J88m79n1M79o2
3186A78m63J85M16k93l39L67K48m24j21M44J0m42R8M09j93l62K84K82l34k01L81
3207A30R4m06J9L95j11l83K09L13k73k52L42J49l70o5L99n2l71J50L15k28k49
3228b45K85J89l49p5L60j8l43J09L20j94k67K67J93l22r3L44Kl42P3L29j73k77
3250b27K45K19k90j50L25N9l59L2L47j14l08J86K64k70j94L22J31l64l8L65o1
$$ y = [-38, 296, -47, -278, 132, 259, -193, -206, 247, 140, -280, -57, 326, 14, -296, 94, 293, -165, -241, 248, 198, -274, -102, 316, 37, -323, 72, 325, -135, -274, 209, 228, -274, -162, 323, 61, -343, 13, 334, -106, -316, 172, 271, -238, -219, 309, 143, -339, -62, 351, -22, -337, 108, 334, -172, -276, 253, 231, -290, -134, 340, 83, -339, 12, 348, -90, -307, 181, 276, -244, -206, 298, 132, -326, -55, 330, -39, -329, 103, 291, -188, -239, 240, 178, -285, -100, 316, 23, -316, 51, 299, -125, -246, 198, 208, -234, -136, 273, 80, -282, 2, 284, -50, -251, 130, 224, -182, -163, 232, 121, -262, -53, 260, -13, -265, 77, 226, -144, -209, 190, 138, -233, -83, 232, 4, -245, 40, 229, -120, -195, 165, 147, -196, -87, 233, 39, -228, 39, 232, -90, -183, 161, 163, -179, -106, 223, 50, -227, 18, 237, -53, -203, 122, 181, -178, -146, 201, 87, -221, -35, 229, -41, -235, 87, 218, -146, -184, 181, 120]
3271A20l33J39L01k21k44K91J82l46p6L68k1l56J07L41k06k80K81K01l39j13L63
3292A59J7l77Q8L33j64l02K33K64l06j88L44J03l64j5L68p2l49J63L16k49k44
3313b42K95J88l50r5L81Jl79R0L55j80l04K48K46l05j73L52Q4l91L5L68j19l37
3335b32J90K83k59k22L25J40l63n2L75n8l50J40L01k05k55K73J87l12r7L21K7
3356A57l34O5L13j30k80K08K15k40j71K88R3l10j5L09n8k86J31K53j97j97K48
3377F2J15k65n2K67j7k74Q5K44j49j92K11J30k44o3K48Ok51P4K24j40j72J84J31
3400A62k15p9K40J7k42M9K31j21j82J54J51j92j17K27N2k45QK45q3k25J41J88
3422A64j88j32K24P0k54oK60o7k44J34K11j91j61K45R7k70k1K74n0k58J13K33
$$ y = [120, -213, -74, 227, 6, -238, 53, 235, -111, -187, 181, 160, -196, -89, 252, 46, -234, 47, 248, -91, -204, 159, 176, -201, -113, 220, 56, -246, -13, 251, -55, -243, 101, 204, -160, -175, 193, 121, -228, -65, 251, 2, -242, 53, 241, -109, -204, 177, 178, -201, -111, 244, 64, -240, 8, 254, -51, -224, 128, 212, -179, -144, 224, 105, -232, -42, 241, -18, -240, 85, 225, -138, -190, 185, 127, -223, -83, 218, 13, -242, 31, 218, -94, -191, 130, 157, -177, -112, 201, 71, -209, -1, 214, -26, -197, 91, 184, -126, -141, 168, 110, -176, -45, 208, 11, -186, 62, 177, -88, -140, 127, 110, -164, -79, 165, 16, -176, 35, 165, -79, -142, 106, 112, -139, -65, 159, 19, -153, 31, 162, -53, -132, 108, 125, -117, -68, 163, 42, -140, 14, 165, -27, -144, 83, 135, -110, -102, 143, 60, -165, -24, 164, -24, -156, 68, 138, -116, -122, 138, 71, -173, -39, 172, -19, -180, 65, 162, -108, -129, 145, 95, -163, -50, 183]
3444A83j67j94K30J36k88n6L04k0k91R3K74j52k58K32J75k63j22L02N1l15K2K98
3466A74r0k87J66K42k24j98K67J38l04n4L26k2l29J24K84j81k45K46J76k78j31
3487b00L31L0l34O5L27j48k89K25K11k49j72L08Q1l18j5L30q3l07J44K65k09k15
3509b22K70J39k98p7L18jl06Q3K83j47k42K08J93k54j35L00N3k98K0K88q9k66
3531a80J62K20k15j61K56Q5k78k2K70n3k58J30K32j98j82K42J06k57m5K80l6k67
3553a69R3K33j50j98K10J46k42p8K60J0k53N1K51j11k26J72J88k32j08K38O8k64
3575a11kK64o9k50J18K20j89j41K19Q5k49l2K76n9k46J21K14j73j78K21J27k61
3597i5n2K74k2k71R4K44j50k08K11J51k44q7K69K5k82N3K61j08k36J68K00k23
$$ y = [183, 16, -178, 52, 188, -100, -156, 148, 128, -163, -70, 204, 52, -206, 26, 201, -62, -184, 118, 169, -146, -124, 174, 84, -203, -37, 205, -19, -217, 50, 188, -116, -170, 156, 134, -195, -71, 213, 32, -213, 33, 209, -69, -200, 131, 161, -173, -108, 219, 71, -218, 7, 218, -31, -203, 105, 186, -132, -147, 183, 100, -207, -63, 202, -7, -222, 48, 187, -111, -188, 130, 129, -177, -94, 189, 42, -200, 8, 201, -53, -188, 112, 165, -133, -113, 175, 86, -180, -18, 202, -13, -174, 82, 167, -111, -133, 137, 84, -174, -44, 188, -10, -192, 50, 156, -101, -146, 134, 98, -169, -76, 157, 7, -191, 19, 165, -77, -155, 105, 115, -138, -87, 164, 53, -173, -1, 187, -45, -153, 85, 153, -111, -113, 151, 82, -168, -50, 170, -19, -160, 59, 144, -105, -137, 139, 80, -166, -45, 169, -4, -182, 39, 166, -95, -147, 127, 105, -166, -72, 172, 22, -186, 25, 176, -68, -155, 114, 139, -143, -90, 171, 63, -173, -5, 195, -28]
3619b8j47K66P2k88mK78o8k62J32K34j84j91K33J32k77m5K74qk83P7K72j50k19
3642a84J98J70k48j02K87L5l00M3K89j23k43J69K21k48j49K70Q4k91qL00o5k84
3664a79J34K34j89j95K34J37k74o1K79Lk88O6K64j33k26J97J85k44j27K83N7l02
3686a45K7K89r1k68J72K14k25j49K63Q9k76k2K84n3k64J17K23j82j89K46J16k75
3708i9n8K95k8k65P7K48j46k10J98J66k32j13K66N1k86L3K63r4k48J67J91j99
3730b3j47K49R6k82j7K69m1k58J13K34j75k02K35J23k53o9K81j7k67Q0K34j32
3752C1k20K01J54k39r1K65K1k75M9K49j05k23J67J87k16j32K57O5k52j3K72o3
3774H9k34J06K20j90j57K23J15k55n4K74k0k65Q4K42j60j92J92J48k39q2K68M
$$ y = [-28, -175, 91, 163, -125, -129, 149, 81, -181, -49, 185, 1, -190, 43, 175, -102, -147, 127, 119, -164, -87, 185, 35, -184, 14, 184, -64, -166, 121, 156, -144, -101, 188, 65, -178, -9, 212, -36, -185, 85, 169, -122, -130, 170, 105, -179, -45, 189, 0, -195, 39, 176, -98, -159, 120, 123, -165, -99, 165, 32, -194, 3, 188, -56, -183, 100, 157, -145, -118, 171, 80, -188, -16, 198, -27, -176, 87, 176, -100, -122, 162, 109, -155, -38, 185, 3, -186, 60, 176, -99, -157, 138, 110, -155, -78, 170, 24, -186, 12, 178, -54, -167, 99, 150, -136, -103, 160, 66, -182, -15, 176, -23, -170, 79, 175, -107, -124, 145, 104, -154, -41, 193, 18, -184, 51, 174, -79, -148, 133, 116, -151, -71, 163, 31, -189, 12, 166, -73, -164, 101, 122, -153, -104, 145, 40, -183, -16, 171, -45, -177, 80, 145, -107, -120, 152, 89, -145, -39, 181, -9, -166, 57, 172, -83, -137, 137, 117, -148, -64, 178, 18, -174, 18, 166, -73, -155, 113, 117]
3796A17k70N6K54j20k37K00J76k35j15K63N0k74K8K73r0k53J64J95k09j45K48
3817G6Q1k52k5K68m4k54J07K26j63k03K22J37k54o6K53J3k73O2K56j25k26J95
3839A1J75k48j13K57O2k87K3K78r9k44J68K05k13j55K51R8k82j7K87o4k66J19
3861e4K58j92j99K44J32k79n2K80rk75O7K62j52k21J89J86k40j20K73M5k83J2
3883a28K93r7k57J62K19k26j62K65J03k88j8K84m1k78J16K51j83j98K32J41k69
3904g9p7L02ok92O1K87j56k34K09J77k40j36K88L8k94K5K79p6k62J47K25k06j72
3927a92K59J07l00l2K98l1k81Q5K68j56k23K33J50k63q1K88J5k95O6K69j34k47
3949a97K06K03k56j33K76O4k92J1K76r0k62J75K07k20j60K64Q6k89j6K89n1k78
$$ y = [117, -153, -97, 157, 37, -200, 0, 176, -59, -174, 89, 139, -135, -107, 166, 76, -177, -13, 182, -27, -172, 76, 157, -95, -120, 148, 104, -150, -43, 183, 20, -183, 39, 176, -78, -144, 109, 122, -151, -89, 167, 42, -184, 11, 186, -62, -175, 82, 144, -143, -120, 158, 59, -185, -17, 188, -25, -180, 71, 169, -113, -130, 157, 93, -173, -54, 204, 12, -187, 57, 189, -90, -142, 138, 129, -146, -79, 183, 31, -190, -1, 185, -55, -175, 98, 143, -140, -128, 165, 68, -189, -27, 192, -34, -196, 69, 172, -116, -134, 150, 109, -169, -53, 198, 15, -183, 49, 190, -79, -156, 146, 140, -152, -91, 196, 40, -194, 15, 192, -48, -184, 104, 142, -152, -127, 152, 76, -186, -39, 186, -20, -192, 67, 174, -126, -158, 140, 109, -172, -87, 181, 25, -198, 35, 185, -78, -159, 129, 144, -151, -85, 184, 50, -197, 9, 212, -44, -177, 99, 163, -129, -118, 158, 68, -194, -19, 188, -32, -192, 72, 158, -131, -147, 142, 91, -187]
3971a87J23K50j81k07K51J29k69o4K87%k87P0K74j45k31K02J88k58j15K85L7k95
3993a43L7K80r8k69J69K23k40j65K79R7l02j9L16o1k98J40K54k04k13K62J43k86
4015i8o6L08j9l04Q8L00j70k41K36J79k81j13L12M7l24K7L14j14k83J78K53k59
4037c0j92L06J15l37l6L39m3l39J34K99k16k30K64J81l20q4L34J0l42P4L38j79
4059D6k71K39K10k80j47L28N1l31K2L40j01l16J86K50k35k00K89J35l37m3L36
4080A71l6l35J19L10k01k62K56K03l18j13L34K6l40O7L21j41k91K18K40k67j57
4101a96L07P6l28JL34j01l09J81K71k42k13K95J42l33n4L42m2l20J16K96k05k50
4123b32K57J99l10j14L26L0l47O2L37j41k94K08K38k80j61L28Q1l36mL62q7l32
$$ y = [-187, -64, 186, 5, -202, 49, 178, -91, -155, 132, 132, -155, -85, 189, 44, -187, 15, 203, -55, -170, 115, 152, -143, -106, 174, 76, -193, -24, 199, -41, -206, 73, 170, -132, -151, 165, 104, -194, -54, 200, -4, -217, 45, 188, -98, -164, 144, 125, -179, -91, 209, 39, -202, 34, 213, -68, -181, 131, 178, -146, -119, 195, 81, -202, -24, 229, -30, -222, 84, 199, -138, -174, 165, 122, -217, -83, 216, 0, -230, 34, 215, -105, -189, 145, 155, -187, -113, 225, 46, -225, 14, 224, -56, -203, 125, 176, -155, -133, 207, 106, -210, -24, 226, -9, -209, 80, 215, -122, -165, 171, 135, -200, -81, 229, 28, -234, 22, 225, -93, -206, 128, 154, -186, -119, 202, 61, -230, -12, 228, -39, -196, 111, 187, -141, -140, 194, 93, -216, -35, 236, -6, -219, 76, 218, -115, -169, 173, 131, -189, -73, 223, 18, -232, 25, 224, -86, -200, 126, 156, -191, -129, 208, 67, -227, -19, 219, -61, -222, 106, 187, -149, -153, 209, 122, -210]
4145b10J67K84k35k37L00J56l32p0L60k7l54J08L25j89k83K75J91l04j37L29N3
4166A70l54M3L45j25l23K17K61k80j86L21J14l45l6L74p5l43J57L07k25k52K89
4187E4J81l31j04L50K6l68Q5L28j55k99K38K35k92j59L30O9l56K1L41j14l09J92
4209c7K53k51j97L11J11l22l5L34n6l26J41K87k06k29K81J53l10q0L20J9l37P9
4231i7L11j55k88K36K25l01j41L35N3l44K5L39j12l00J79K64k57k04L17J03l33
4252a45l2L49n2l45J51K96k22k33K93J53l24p4L44jl53J02L18j81k69K44K18l05
4274f8j36L32N3l48L6L35j10l23J96K78k85k01L25J28l57m7L75n4l58J40L24k22
4296A3k77L08J86l45j00L69J7l70P2L70j78l21K53K53l01j89L66Q3l77J3L77j09
$$ y = [-210, -43, 241, 6, -231, 69, 225, -107, -177, 183, 156, -198, -90, 235, 46, -237, 38, 229, -75, -212, 117, 170, -184, -141, 204, 79, -244, -27, 234, -46, -232, 89, 203, -142, -178, 196, 121, -222, -65, 242, 17, -235, 54, 235, -96, -200, 150, 176, -192, -107, 221, 66, -233, 5, 240, -52, -211, 119, 188, -168, -147, 194, 80, -229, -37, 216, -35, -232, 79, 190, -132, -167, 167, 111, -215, -74, 213, 7, -222, 59, 212, -98, -178, 142, 161, -176, -97, 214, 59, -229, 7, 232, -69, -210, 125, 178, -166, -141, 198, 86, -214, -35, 229, -28, -232, 85, 188, -145, -177, 172, 120, -225, -74, 222, 0, -233, 60, 213, -111, -185, 159, 158, -195, -93, 225, 44, -225, 19, 237, -68, -204, 128, 181, -167, -131, 204, 94, -229, -33, 245, -40, -241, 84, 212, -145, -192, 183, 129, -229, -89, 235, 13, -264, 44, 230, -115, -215, 154, 171, -199, -127, 243, 65, -256, -3, 250, -51, -240, 126, 209, -168, -155, 222, 113]
4318A13l43J88K94k56k52L36J51l56p4L71k7l65J20L32k01k90K78K16l26j31L54
4339A32N4l80M5L64j25l29K11K76k79k00L30J13l66j7L64o1l53J65K98k30k39
4360b27K96J48l25q9L67j9l39R0L10j68k79K53K05l00j30L31N1l48K5L50j32k98
4382b28K07K53k71j83L15J05l33k1L36o2l36J56K99k15k41K79J62l21r0L47%l43
4404a85Q7L17j69k81K35K26k95j57L44M8l36L2L29j19l06J95K51k64j75L09J12
4425A98l44j7L36o4l17J53K91k23k37K73J78l22q7L36%l50J02L26j66k95K35K25
4447B31k96j55L46O3l68K1L51j07l25J97K67k69k08L19J38l50l6L57n4l42J38
4468h2L13k17k43K70J85l30r5L50J5l47P5L31j61k90K27K36k96j56L41O9l56J6
$$ y = [113, -230, -42, 252, -4, -256, 80, 231, -125, -199, 172, 145, -220, -100, 232, 31, -259, 19, 235, -91, -222, 132, 186, -194, -149, 215, 90, -239, -28, 248, -31, -231, 99, 212, -154, -171, 193, 132, -221, -56, 242, 12, -227, 69, 217, -108, -197, 170, 151, -188, -98, 212, 44, -235, 18, 223, -77, -207, 124, 175, -173, -148, 202, 70, -228, -21, 232, -39, -222, 93, 198, -135, -156, 180, 118, -218, -62, 237, 22, -219, 60, 222, -99, -189, 158, 158, -185, -98, 219, 50, -231, 4, 230, -65, -222, 122, 170, -166, -134, 195, 76, -230, -35, 216, -48, -223, 86, 198, -146, -163, 173, 109, -208, -55, 236, 13, -224, 49, 227, -95, -182, 154, 154, -196, -94, 232, 66, -229, 6, 231, -65, -220, 126, 189, -179, -158, 193, 86, -239, -42, 225, -44, -252, 67, 205, -145, -181, 176, 122, -220, -82, 231, 14, -229, 41, 226, -104, -199, 151, 166, -181, -106, 225, 64, -226, 1, 237, -59, -215, 126, 195, -161, -145]
4490a45L59j15l37J85K99k62k29L18J49l55o7L70k6l65J20L37k17k65K80K02l26
4511i0j27L69K4l72O7L53j48l11K34K49k87j91L44Q8l54LL58r5l31J61L05k53
4533dk37K98J66l59o0L71k1l71J02L46j96l02K81K27l26j36L54N8l83M9L71j46
4555H2l28K13K81k72k09L30J28l59m7L82o6l53J56K91k16k42K76J83l26r7L51
4576A58jl59Q4L36j70k93K39K39l08j56L49N7l56K5L59j11l31K01K78k62k13L17
4598H2J40l57l0L44m9l45J34L19k15k55K79J85l30r0L44Kl42Q4L13j61k73K22
4620AK25k92j48L20P4l49K0L28j00l05J89K63k43k01K89J18l25l1L44l9l37J35
4642f4K94k07k57K87J85l38r0L50jl53P7L40j66l00K42K33k92j50L24Q0l73K9
$$ y = [-145, 214, 99, -238, -53, 246, -16, -245, 73, 222, -133, -200, 170, 144, -221, -101, 236, 19, -246, 34, 236, -90, -217, 152, 176, -196, -129, 224, 76, -235, -1, 248, -39, -230, 114, 202, -152, -149, 209, 114, -217, -56, 249, -4, -241, 57, 223, -136, -196, 175, 154, -217, -115, 231, 35, -267, 14, 241, -85, -221, 133, 191, -192, -143, 228, 82, -246, -33, 248, -24, -233, 97, 225, -134, -181, 201, 135, -218, -62, 229, 13, -229, 47, 230, -96, -193, 158, 157, -202, -118, 218, 48, -245, -6, 233, -75, -231, 118, 175, -181, -156, 203, 92, -239, -38, 240, -22, -235, 82, 222, -135, -165, 179, 130, -215, -81, 238, 23, -232, 47, 232, -98, -188, 156, 158, -184, -100, 213, 52, -221, 1, 226, -66, -214, 106, 180, -169, -149, 179, 79, -226, -37, 226, -17, -218, 71, 189, -136, -167, 177, 138, -199, -64, 230, 23, -234, 53, 238, -100, -190, 160, 159, -194, -117, 223, 57, -243, -1, 232, -60, -210, 114, 194, -179, -150]
4664a50L42j06l08J77K69k52k13L18J23l38m2L49m6l38J45L13k14k63K77J87l24
4685i4j01L49J7l46N5L58j59l18K30K57k95j92L56Q8l75ML65q9l52J85L10k65
4707a2k43L23J61l60q3L84k3l62J13L41k00k86K69K19l17j41L57N0l62M3L49j19
4729A01l22K03K58k62k12L27J27l58l4L54n8l43J41K90k05k52K75J84l18j10L66
4750A52Pl69R1L37j78k80K37K30k93j54L39N2l27K0L37j06l06J75K66k54j85L01
4772I2J09l12m6L34n1l27J29K81j89k56K65J82l03q8L17Ql31P4L17j56k70K20
4794aK10k75j38L12O9l46L4L25j04k94J88K41k35k05L04J26l39l3L38l9l42J36
4816f8K97k01k47K60J77l09r4L12K7l31O4L06j46k73K15K19k63j55L14P1l30J5
$$ y = [-150, 192, 86, -222, -45, 224, -28, -241, 77, 200, -138, -180, 169, 123, -215, -70, 243, 29, -234, 43, 230, -94, -195, 154, 171, -175, -120, 238, 79, -239, -9, 248, -47, -239, 117, 205, -170, -166, 199, 110, -242, -57, 253, -12, -255, 68, 229, -131, -214, 170, 147, -215, -102, 239, 39, -247, 22, 241, -76, -217, 140, 190, -172, -129, 220, 101, -221, -18, 240, -22, -234, 93, 220, -138, -172, 182, 124, -219, -78, 212, 7, -245, 30, 214, -104, -214, 152, 159, -210, -119, 218, 40, -240, -3, 227, -66, -220, 119, 171, -156, -136, 201, 95, -211, -36, 230, -24, -209, 92, 201, -111, -157, 177, 126, -201, -72, 209, 20, -236, 29, 211, -92, -180, 137, 145, -186, -112, 205, 49, -221, -1, 209, -66, -204, 108, 177, -169, -135, 190, 86, -208, -20, 221, -14, -219, 85, 211, -128, -161, 177, 138, -204, -68, 229, 28, -219, 41, 218, -91, -185, 127, 154, -177, -113, 193, 47, -226, -11, 208, -55, -210, 104, 175, -155, -140]
4838a40L19r0l08J85K47k32j86K82J31l14m9L31l6l39J22L00j96k35K52J82l11
4859h5j14L43K3l49O5L15j30k89J97K44k73j50K97P4l15j0L26p8k94J45K69k21
4881a0k03K71J38l03o6L10Kl09Q8K99j77k45K35J92k81j15L04L8l17L1L20j28
4903G4k84K00K18k44j67L03Q9l32j1L26o4l16J49K65k15j99K58J37k86p1L12n
4925A37l34J10K86j58k54K41J87k87j09K93N3l17M2L08j09k90J81K37k36j87L04
4946I8Q8l13k6L18n6l04J28K80k00k41K73J61l11r2L26J5l28P4L26j52k89K28
4968CK15k68j44L03P3l32K2L17r7k88J58K54k18k05K62J52l13n3L07k6l04R3K85
4991A96j65k42K32J87k77j16K94L3l06M5K97j11k75J80K25k23j76K87J06l11l0
$$ y = [-140, 179, 89, -219, -34, 213, -19, -205, 77, 208, -106, -155, 176, 140, -199, -77, 223, 27, -208, 44, 226, -85, -199, 144, 167, -182, -117, 198, 68, -221, -24, 220, -53, -203, 94, 168, -147, -157, 169, 91, -203, -58, 211, -10, -213, 58, 196, -107, -173, 137, 139, -170, -82, 217, 40, -205, 30, 222, -59, -174, 130, 168, -149, -118, 202, 74, -210, -10, 208, -36, -203, 100, 189, -143, -154, 172, 108, -208, -59, 206, -9, -208, 50, 187, -99, -170, 142, 137, -197, -87, 199, 41, -213, 28, 215, -72, -181, 112, 165, -152, -110, 198, 89, -201, -20, 217, -19, -206, 98, 186, -127, -153, 165, 109, -195, -67, 213, 13, -228, 45, 206, -105, -197, 129, 144, -184, -110, 216, 64, -225, 3, 218, -50, -194, 109, 182, -150, -128, 189, 92, -196, -38, 216, -2, -207, 55, 207, -106, -159, 148, 122, -182, -89, 196, 31, -211, 21, 208, -69, -185, 109, 142, -164, -119, 178, 67, -208, -28, 197, -26, -202, 85, 191, -120, -150]
5012a50L17n0k91J14K58j79k13K46J44k76p8K89Ok99P3K72j36k40J97J78k45j14
5034a77K72N2k89K4K74r5k38J51K09k11j55K60Q5k79lK77o0k68J30K24j68k02
5056a87K34J23k64n0K79j8k78R0K64j61k18K06J64k63r1K75L6k82L5K65j06k37
5078a84J61K13k18j63K66P9k69rK82o3k81J42K41j98j94K52J30k75o4K96j1k87
5100a54P4K76j51k47K25J91k70j30L02M9l16L9K97j06k84J81K27k29j80K78J20
5121A92l27k8L16l7l05J14K78j84k36K47J78k72j06K98L8l21N4K99j18k68J77
5142a1K25k34j67K73R8l05j4L09p2k84J39K38j91k05K44J46k74q8L03j1k87P9
5164h9K74j53k37K15J80k41j28K85N2k80PK83q5k62J54K19k10j51K44Q8k51m3
$$ y = [-150, 167, 117, -174, -60, 198, 19, -194, 52, 196, -80, -158, 131, 137, -162, -89, 183, 47, -193, 4, 182, -63, -177, 95, 147, -142, -118, 156, 61, -177, -26, 183, -28, -183, 77, 162, -117, -120, 157, 97, -171, -41, 183, 15, -187, 47, 170, -94, -144, 135, 117, -161, -71, 193, 32, -186, 20, 184, -79, -170, 105, 141, -141, -106, 159, 53, -184, -23, 190, -28, -191, 75, 154, -115, -124, 158, 95, -186, -44, 197, -1, -195, 57, 187, -88, -152, 144, 133, -154, -80, 196, 45, -202, 23, 214, -56, -186, 116, 165, -151, -112, 185, 79, -205, -24, 203, -26, -206, 72, 192, -135, -163, 153, 116, -189, -75, 203, 19, -217, 30, 208, -64, -170, 128, 166, -155, -101, 198, 80, -188, -11, 214, -20, -187, 86, 184, -121, -135, 174, 102, -182, -43, 195, 4, -201, 43, 189, -85, -173, 130, 119, -168, -89, 185, 32, -205, 10, 190, -51, -179, 106, 158, -122, -115, 168, 83, -179, -25, 194, -16, -167, 77, 165, -86, -129]
5186a29K78l7k69J11K24j53k02K07J47k45q2K59Pk66O1K47j19k14J81J69k28j10
5208a63K59M8k74L8K54r4k40J68J92k19j36K45P7k54k1K74m8k64J21K25j79j77
5230a68K19J23k51o9K78j6k54P4K25j22k19J89J68k35j08K56L9k68L3K68r1k46
5252a75J61K09k19j70K69R6k86j3K89n5k74J23K40j84k04K46J31k58p9K96j6k92
5274a65Q3K77j51k40K03J89k44j36K75P5l09J8K74p0k63J40K32k00j85K43J33
5295A79k72o1K90j8k80R4K54j36k34K13J61k53j06K86L3k84L7K78j03k65J77K06
5317A96k24j59K67P1k72rK79m5k83J22K30j71j92K35J24k57o3K75%k70N5K63j27
5340D5k10J77J76k20j27K66M7k70J2K61p6k36J44J94j93j57K40Q9k53l9K73m8
$$ y = [-129, 149, 112, -157, -46, 178, 25, -177, 30, 177, -68, -150, 109, 116, -150, -89, 158, 39, -175, 6, 175, -53, -163, 96, 144, -130, -92, 162, 68, -172, -4, 188, -31, -167, 78, 155, -99, -120, 154, 106, -158, -37, 188, 9, -168, 51, 174, -77, -146, 132, 116, -138, -64, 161, 39, -180, 9, 177, -58, -166, 90, 129, -139, -106, 162, 71, -175, -14, 195, -24, -194, 75, 171, -115, -128, 161, 106, -168, -45, 195, 11, -193, 53, 184, -74, -153, 143, 127, -165, -82, 195, 44, -196, 7, 196, -48, -184, 91, 166, -143, -125, 149, 79, -184, -44, 188, -12, -197, 46, 179, -93, -154, 136, 118, -162, -68, 186, 50, -184, 29, 190, -63, -169, 117, 150, -134, -97, 181, 78, -187, -10, 196, -28, -187, 80, 151, -121, -130, 149, 104, -179, -57, 173, 2, -190, 45, 169, -88, -151, 124, 124, -146, -91, 172, 45, -165, 12, 188, -32, -159, 107, 154, -116, -104, 157, 81, -155, -11, 183, -10, -167, 73, 162, -91, -130, 143, 95]
5362I5k46R8K26j59j91K20J20k48o9K82j3k61O3K49j31k08J88J68k39r5K48M3
5384A40k49K0K46p6k45J50J94j88j57K27R6k37m1K58l9k46R3K22j45j96J98J43
5406A68k45p2K45K7k71N6K50j15k15J72J80k37j10K64O0k76J8K48p2k37J45K00
5428A83j78j66K25R8k42l8K53k7k56Q5K31j39k00K05J40k36j00K52L7k60L6K34
5450A37o9k39J57J82k02j35K38P8k57jK53n2k38J07K21j65j77K17J13k36o1K61
5472A32kk70P8K41j40j95J68J59k24q7K33M0k52K2K38p8k22J27J99j89j41K26
5494F3P8k36l1K56m4k30R5K10j46j71J76J37k10q1K45lk40O8K18j11k05J74J60
5517A72k13r5K22M8k43PK45p7k20J37J85j96j30K20P9k41l0K51k7k44Q2K26j42
$$ y = [95, -151, -53, 173, 14, -177, 43, 163, -85, -154, 128, 115, -146, -83, 166, 35, -173, 15, 183, -56, -151, 97, 140, -109, -89, 157, 81, -164, -14, 180, -8, -165, 62, 158, -79, -120, 138, 99, -147, -54, 168, 23, -173, 25, 168, -77, -149, 96, 123, -148, -92, 158, 43, -172, 0, 180, -57, -167, 97, 157, -119, -101, 147, 75, -162, -17, 183, 5, -161, 64, 162, -80, -118, 135, 108, -148, -63, 168, 29, -171, 34, 174, -62, -162, 90, 127, -133, -97, 137, 68, -171, -14, 168, -34, -169, 69, 147, -110, -111, 142, 90, -148, -41, 180, 15, -162, 55, 168, -68, -129, 132, 130, -140, -62, 179, 39, -156, 12, 171, -53, -140, 93, 133, -119, -97, 141, 63, -159, -32, 167, -22, -163, 63, 141, -95, -126, 130, 86, -144, -49, 161, 15, -156, 20, 157, -53, -134, 111, 108, -132, -64, 154, 43, -162, 12, 172, -41, -136, 86, 134, -109, -102, 143, 66, -154, -17, 168, -28, -158, 62, 141, -100, -130, 121, 94, -150, -68, 158, 16]
5540A6j76J89J24k02q7K34K3k37L9K25r8k01J51J69j86j24K23N4k34J3K30o6k26
5563a47J20J96j76j55K02J07k35l8K36j7k33Q3K10j42j77J78J39k08q5K36J3k37
5585a30M8K29r1k05J42J57j71j17K06P5k31j8K41m9k21J06J87j47j49J66J19k13
5607f6o3K26Ok30M7K28j07k01J64J43j88j05K24M4k34J4K34p7k09J41J75j80j33
5630a47K05P7k19k0K24k8k14R4J84j38j62J80J10j99n9K06J4k32M5K14r3j84J32
5653a0J49j85j00K10M4k02JK21o9k03J16J68j51j32J99Q1k05l9K19k5k01O7J93
5676A46j37j42J64R6j78p0K18J4k23M8J93r7j65J38J36j77r5J92N5k12OK00n0
5699F0j99J05J63j42j22J66Q2j89l8K09j5j94O2J93j22j49J50J28j93q3K22J0
$$ y = [16, -160, 29, 153, -49, -136, 98, 121, -116, -77, 148, 50, -151, 0, 169, -17, -141, 82, 136, -98, -85, 145, 79, -147, -27, 169, -7, -162, 40, 147, -88, -126, 110, 93, -140, -57, 153, 11, -166, 12, 151, -57, -142, 94, 107, -130, -82, 147, 56, -149, -7, 150, -21, -138, 68, 143, -88, -106, 135, 86, -135, -29, 158, 11, -138, 28, 147, -66, -129, 97, 103, -127, -80, 148, 41, -160, 4, 147, -41, -146, 78, 122, -112, -98, 136, 59, -150, -9, 166, -14, -147, 58, 135, -84, -104, 120, 92, -122, -28, 156, 18, -144, 36, 146, -53, -112, 94, 108, -124, -79, 135, 42, -142, -10, 139, -46, -146, 64, 108, -94, -93, 128, 59, -144, -28, 140, -11, -143, 56, 137, -68, -107, 112, 87, -114, -47, 146, 9, -133, 31, 127, -51, -121, 97, 111, -112, -64, 129, 32, -133, 5, 141, -36, -131, 61, 116, -96, -90, 110, 60, -139, -34, 129, -13, -135, 31, 113, -76, -114, 95, 80, -114, -52, 141, 19, -130, 20, 148, -45, -128, 94, 104]
5721A04k13L7K15j02j71J30J37j71r8K02M5k05lK04n4j90J00J70j45j26J76Q3
5743A25j94m9K14nk01N3J90r5j78J46J32j70q5K06K8k10J9K14p7j90J10J63j61
5766a5j15J83N8j90j6K02l7k00Q9J81j41j37J63J04k03m8K02Rk13O2J83q2j85
5789a46J47J36j72q5J92M5k05NJ88l3j96R8J73j41j29J69Q1j85n3K04Jj95N2J61
5813A12r6j45J39J10j61p1J75J7j80L1J69o8j63J28J31j62q0J74M0j87MJ95n3
5836E9j75J09J33j18j16J51P9j75l1J65lj73N2J58r3j41J22J09j50o4J67K2j75
5859h8J9J75p1j50J04J20j30r3J71L7j65mJ71m6j49P5J48j31j03J57P1j76j9J65
5883H8j6j69N5J69j06j45J43R8j55o5J65K2j74K2J62o4j49J07J22j32q5J44M8
$$ y = [104, -109, -72, 143, 41, -130, 0, 137, -34, -132, 70, 115, -90, -93, 111, 57, -133, -33, 137, -8, -134, 42, 125, -69, -118, 96, 91, -110, -57, 133, 38, -140, 6, 138, -32, -117, 89, 117, -93, -74, 140, 63, -127, -17, 146, -15, -130, 53, 111, -79, -95, 107, 70, -130, -41, 140, -1, -138, 25, 129, -74, -122, 80, 89, -124, -62, 121, 39, -146, 1, 137, -35, -120, 72, 117, -88, -83, 105, 72, -124, -26, 147, 6, -123, 46, 127, -58, -111, 93, 94, -101, -49, 112, 16, -129, 10, 120, -41, -112, 63, 80, -100, -69, 100, 32, -131, -3, 128, -34, -114, 60, 100, -87, -83, 112, 59, -116, -7, 126, 8, -108, 43, 122, -53, -84, 81, 78, -95, -43, 115, 22, -119, 3, 112, -38, -102, 65, 87, -88, -69, 106, 35, -115, -11, 109, -21, -114, 57, 94, -71, -75, 96, 50, -99, -24, 124, -7, -110, 47, 118, -58, -77, 88, 72, -97, -42, 127, 21, -124, 19, 117, -38, -103, 62, 84, -90, -68, 94, 30, -119, -12, 110, -22, -107, 37, 85]
5906H5j63oJ68k5j69O7J62j19j11J33P7j49m4J73nj76P0J44q3j35J15J11j61o8
5930a09J80J6j58OJ67m4j63R1J23j15j06J52O2j74j4J63j9j62N3J57q8j26J15
5953GJ04j53n1J45K6j58K4J53o0j40J02J22j34p2J35L3j47QJ32k7j41P3J16j00
5977cj04J35O5j42k2J45k2j40N2J25p5j19J17P6j18n6J38J4j37K1J38o4j14Q6
6001dJ00j23o2J38M1j38j0J44l1j37O9J18r8r8J20O0j31j9J30j6j27M0J15p0j00
6026h9J04P7j30m4J35Kj29J8J37m9j20R2Q5j10p1J35L3j31pJ36k2j37O7J07p8
6051A1r4J11O9j37m2J48kj42L4J25o0j12Q9J00j31o0J37K1j33RJ42o0j21P9J02
6076H3r4p4J24L7j30qJ40l2j20O0J12q7r3R9O3j10m3J37jj22K3J10o4q7Q3Q1r0
$$ y = [85, -78, -84, 84, 59, -110, -43, 119, 0, -111, 22, 99, -50, -94, 79, 74, -102, -32, 112, 29, -106, 9, 120, -41, -109, 71, 87, -71, -65, 102, 58, -105, -14, 109, -6, -112, 40, 102, -72, -86, 77, 58, -104, -51, 106, 18, -108, 7, 111, -42, -93, 52, 78, -80, -56, 97, 37, -103, -1, 121, -13, -85, 50, 83, -64, -56, 76, 49, -92, -19, 97, -3, -107, 28, 93, -49, -71, 74, 52, -88, -36, 89, 14, -105, 12, 88, -30, -86, 52, 66, -71, -50, 88, 24, -90, -4, 96, -27, -89, 49, 90, -48, -58, 86, 55, -82, -13, 105, 7, -91, 29, 89, -42, -61, 69, 53, -74, -34, 81, 11, -89, 15, 92, -38, -82, 53, 55, -74, -56, 81, 32, -88, 4, 89, -21, -92, 43, 76, -55, -62, 74, 52, -85, -18, 89, 11, -83, 28, 97, -40, -82, 66, 64, -78, -44, 81, 21, -91, -2, 98, -33, -93, 44, 65, -68, -59, 83, 23, -98, -19, 83, -11, -85, 39, 76, -54, -62, 78, 46, -74, -14, 98, 11, -82, 17, 80, -30, -73, 64, 63, -59, -36, 74, 10, -77, 6, 87, -3]
6103cp0J15K4j28OJ24l8j08O6Q2q8n7Q9N8j13j5J22qj33M9J08p8q5J05N7j06k8
6130e3J08Qj24L0J10n8j00Q7O8r4m9J15Lj10J6J20n1j07P8Q2r5o6J14L3j19j6
6156g0J14j7r6L1J13p3p9R3N2r7k9J07Kj09K9J03m9r2P2P2r9m6J15J8j09MJ03
6183F3m0r2N1R0q5o8J13L2j17j8J25j8j07N0R0o5q8Q8O2r3l5J11Oj16L6Q6l1r8
6211f8O1Q0q0n1R6K8r7mJ05k8r5M0R4p1o7Q2L5r6j7R3rr0K3J02n2q8O2O1p9l5
6241f5R5%q6K0R0l8q5O4O7o9m5Q5K6q7j2R9k2q9M2P3o2n4O7M8q9k9R9mq7J3Q2
6272D7l6p3N8N2o8l6Q8Rq8K2O9l3p3N8O2p0m0Q9J0q5J0Q3k5q2N4O2n5o6Q4L5r0
6303b8j7Q3qq3L3O9m2o3O3N2q7l2Q3J3q3RP7k4p7N4O3p5l4Q0L5r0nP9j7p3L7Q5
$$ y = [-3, -73, 42, 66, -62, -56, 68, 30, -78, -12, 70, -18, -75, 14, 72, -41, -56, 66, 58, -75, -26, 82, 4, -81, 24, 81, -25, -53, 55, 63, -61, -31, 79, 21, -79, 8, 76, -18, -67, 48, 51, -59, -43, 77, 26, -81, -3, 79, -16, -82, 32, 65, -54, -70, 44, 27, -69, -38, 75, 2, -77, 16, 68, -29, -58, 49, 51, -58, -29, 74, 25, -67, 5, 77, -22, -68, 47, 65, -44, -40, 63, 23, -69, -18, 72, -13, -81, 32, 64, -53, -71, 54, 36, -71, -21, 69, 4, -84, 4, 66, -27, -62, 49, 55, -61, -25, 61, 30, -68, -7, 73, -7, -58, 38, 66, -31, -35, 70, 42, -53, -13, 81, 10, -57, 25, 60, -36, -53, 40, 31, -59, -36, 66, 14, -74, -12, 49, -30, -65, 30, 30, -56, -36, 54, 16, -69, -5, 62, -7, -52, 33, 59, -28, -40, 59, 37, -52, -10, 63, 1, -53, 14, 62, -27, -56, 43, 39, -48, -35, 47, 11, -62, -4, 48, -20, -56, 32, 41, -47, -25, 44, 11, -62, -4, 58, -12, -52, 37, 47, -38, -28, 55, 30, -52, 2, 64, 9, -57, 27, 62, -28, -45, 38, 30, -53, -20, 49, 7, -56, 7, 59, -28, -60, 23, 36, -47, -38, 39, 15, -62, -8, 55, -20, -54, 26, 61, -29, -34, 45, 28, -45, -8, 77]
6335G7p7m3O5L0p5kP3pq6K6P7m5n4M7N0p6l0P9J4j05L4P0k3p7N3N8o2l2N1L2p1
6366b9jQ3j7q4L1Q3o7m5O1M3o2l8Q8jp9J8O5k7o6L8N9n8l6O6J1p2J1P3l2o9M5
6397hM4n3k9O5J2o5oP0qo6L5N9n6m5O0M1o4k7O8Qo9J2P3l2n0L1N8n7m1O8J9p1
6429b4QO1k6n3J9O5n4m8P3K4o8mO3k2o0L2O0n1m1N5K3n8JN3No6K1N8l1m9L3N9
6461E8o2l1N3K5n8nN5jn9K6N2m6m2M0L0n4k5O5ko0K8M7k8m6N3J9m8j9O6Jo8K0
6493a6N3k7m3M5M4n6j7N5Lo9J1N4j3n6L4L9m5k8N6K1o2qN8j3n3K1N6m5m5M9L6
6524C9o0j5O5jo8J8O3l0o2M1O0m9m1N4L2p0LO0j6n9L2N2n6l8O1K6o4j3O4jn7J9
6556a1M2rn5L9L2n1l1O5Ln1jN2%o7L9M3m0m0N6K0m5k0O3jn9J1O8l1n5M0M1n2j4
$$ y = [77, 0, -43, 22, 52, -23, -25, 48, 41, -45, -19, 58, 13, -41, 6, 56, -20, -50, 29, 43, -62, -28, 42, 19, -58, -5, 53, -9, -41, 10, 42, -29, -30, 53, 36, -48, -17, 66, -1, -46, 15, 58, -4, -42, 46, 45, -34, -16, 49, 22, -44, -6, 53, -5, -41, 25, 36, -36, -25, 48, 16, -53, -8, 36, -17, -46, 19, 31, -34, -40, 30, 22, -44, -9, 50, -6, -51, 9, 50, -14, -41, 27, 35, -34, -22, 51, 19, -31, 0, 58, 1, -40, 28, 47, -24, -16, 45, 19, -34, -15, 50, -4, -52, 21, 45, -23, -27, 36, 14, -46, -14, 46, -5, -46, 9, 32, -26, -25, 28, 33, -33, -12, 46, 15, -34, -1, 58, -4, -35, 18, 43, -15, -20, 35, 34, -25, 1, 53, 7, -35, 5, 35, -19, -44, 21, 19, -41, -13, 34, 6, -40, 13, 32, -16, -35, 31, 32, -36, -16, 37, 10, -33, 12, 56, 0, -17, 38, 41, -28, -17, 37, 24, -32, 2, 41, -4, -32, 24, 45, -17, -25, 33, 20, -33, -12, 44, -1, -46, 3, 39, -21, -36, 29, 28, -40, -22, 41, 11, -51, -10, 50, 1, -40, 14, 46, -24, -21, 39, 23, -36, -4, 48, -8, -46, 15, 41, -23, -36, 28, 27, -30, -11, 31, 22, -33, 6, 38, -13, -44, 21, 24, -27, -28, 24, 24, -43, -4, 39, -1, -41, 15, 35, -10, -30, 33, 32, -27, -16, 52, 21, -34, 6, 47, -5, -19]
6589a9N0On4OM2k1m2K3M2m5k4M2K7o0J2M2nn7K8L6k3k3K7Pl2nL9Jl8OL6j2m5M3
6623A0L6l9j9L9Lm8K5K5k0m0K6L3l8pK9%l7J0K7j5l1L5J6k9k4M8%l5J3L3j6l3
6655b3RN5m4k1L2L0n3KM8k1l2J2N1l5k4K1L8m3k9N0Jn3J8L4rm7K3M1l4l2M2J2
6687A9m3lN2ln9K4M4k9k8L1K7l7j7M7ll6J0M2k7l8M1K8m4k5M5J4m3KL6mm9K2L0
6720B6k1m2L8J6l6j0N4nl6OK3j1k7K2L3l7j5L7%k7rN2k0l8L2K0j7j5K6lk6QK2
6753B0rj8J5J3j5j8K8kk3LJ2lk9J7J6j6pK0Kk9OK8mj9LK8ml2K9J0l6mL6kl2J9
6789CK7l2nK3Rl6jL0ll1QL5j2m1K3J9k8j1M1ql7RL0ml0NM5l1k1K3K6l9oM4%m8
6825b4K4K3rl9K2L2k3k0K0K9m2KK3Nl6PK4j1l5L2J6l7kL6jl5jL4j5k0J9K0k5j3
$$ y = [-19, 31, 37, -17, -11, 31, 10, -32, -9, 33, -12, -36, 6, 33, -27, -15, 27, 22, -35, -7, 29, 6, -17, 10, 17, -15, -20, 19, 20, -18, -12, 24, 12, -33, 10, 46, 7, -12, 27, 30, -18, 7, 32, 12, -28, -2, 31, -7, -14, 15, 15, -22, -12, 15, 0, -31, 4, 20, -9, -33, 15, 15, -20, -7, 26, 10, -23, -14, 41, -3, -24, 8, 38, -15, -13, 35, 14, -18, -6, 45, 10, -14, 7, 45, 2, -27, 23, 24, -29, -11, 23, 14, -33, -10, 31, -3, -35, 7, 19, -24, -27, 25, 22, -37, -13, 31, 2, -26, 5, 32, -5, -22, 25, 22, -14, -4, 38, 11, -27, 14, 42, -2, -27, 18, 32, -11, -9, 27, 23, -26, -4, 26, 5, -37, 1, 17, -19, -29, 25, 20, -16, -10, 13, 2, -25, -3, 30, -7, -22, 15, 15, -12, -21, 31, 11, -27, 5, 25, 8, -7, 19, 16, -10, -2, 20, 11, -7, 8, 21, 6, -12, 16, 14, -9, -6, 6, 3, -26, -9, 7, -9, -16, 4, 6, -23, -17, 11, 7, -12, -9, 19, 15, -17, 12, 22, -14, -18, 18, 16, -16, 3, 30, -2, -7, 16, 25, -11, -12, 18, 15, -16, -8, 27, 15, -26, -3, 16, -12, -23, 18, 10, -27, -18, 12, 8, -22, -17, 28, -3, -24, -1, 25, -14, -20, 24, 24, -24, 0, 23, 14, -25, -3, 29, 6, -14, 6, 35, -7, -5, 18, 23, -13, -6, 18, 7, -28, 4, 20, -17, -19, 17, 16, -19, -20, 14, -1, -21, -2, 18, -7, -20]
6859b0L0kk3QK1Jl5J6K8k1k2K3J4j6%J9%k7pL8j7j3J7Mk7KK1J0l8NK6k4j4K3N
6894Ej9QRjk0J4K1j3k3J9J4k7MJ2kqjL9l0qK3J0k5qK9j0k6J0K1rk3J0K4k7j6L7
6930A3kl2LK9lk8J4K5k0k7L4J5l5PK4Kk5kL5k0l7M3J7l1j3L7rk7PL9j4m4K3L5
6964C3m2rK2J2k4j6M1Mm4K4J3j0k4J9K5k8k1L8jl4J3L3j4k9K4L0l5j5K8Ql5J3
6996aJ7jl0K2J9l0j4K3J3k8%K0mj3J7Kj0k1J7J4k5j3L5J0l6NK8ql0L2J6l1j0K6
7030A1Qk8JL0j7l0K7K0k5j8K6J1k8qM3j1l4J6K8k2k1K3Pk7OK1pj1lJ6j0k5K2K9
7064B0k2j6K1J1l6PL3qj7K2Nj9k2L6Ol8LL3j0l0K2J8j4k7K8J5k4j4K3J0m5J5L6
7097B2k2k7K1L1m4j0L8J2m0jL5pl7K9K2k4j3K7Pl5ML5ql7J2L6k4l0L3Qk8lM1k
$$ y = [-20, 10, 8, -15, -7, 14, 15, -20, -4, 24, 3, -19, 4, 18, 2, 2, 21, 21, -6, -13, 25, 8, -5, 12, 16, -11, -9, 12, 22, -16, -11, 15, -9, -23, 0, 5, -14, -6, 3, 2, -18, -4, 17, 4, -19, 0, 14, -13, -9, 3, 1, -7, -8, 31, 1, -7, 16, 26, 1, -7, 22, 12, -14, -4, 17, 8, -15, -5, 19, -8, -24, 13, 11, -21, -18, 11, 8, -20, -6, 19, -1, -28, 6, 21, -14, -7, 17, 19, -6, -8, 27, 7, -30, 13, 30, -1, -14, 23, 14, -13, -6, 33, 19, -25, -2, 33, -9, -18, 4, 16, -8, -24, 17, 21, -23, 1, 14, 4, -20, -1, 24, -4, -25, 13, 12, -22, -9, 24, 10, -19, 5, 35, 0, -15, 13, 21, -14, -1, 16, 15, -15, 7, 26, -4, -18, 5, 18, -10, -10, 10, 6, -7, 10, 12, 2, -19, -2, 12, -13, -26, 9, 19, -17, -12, 16, 8, -22, 10, 26, -5, -15, 11, 19, -9, -8, 22, 5, -25, 2, 22, -3, -21, 5, 16, -12, -20, 23, 12, -22, -6, 22, 0, -21, 2, 9, -18, -12, 9, 2, -9, -12, 4, -6, -31, -9, 20, -2, -18, 3, 14, -22, -15, 18, 10, -7, 15, 20, 1, -21, 15, 21, -17, -14, 19, 9, -21, 1, 19, 5, -22, 6, 21, -3, -17, 6, 16, -29, -14, 22, 0, -27, -6, 25, -19, -29, 9, 21, -19, -20, 15, 8, -29, 0, 22, -2, -15, 12, 19, -16, -12, 23, 15, -22, -10, 26, 2, -28, 5, 13, -15, -18, 23, 21]
7131B1l5%L6j9j5J3J1j2k9L3J7l4pM0j4k0QK1ql3L3J8m1NK4Jl6J7L0k1oJ8J3l7
7165hmK1J3l7JL7j1n3L4K7l1pK7Om1QL8ql3J1K6j2l5M1J1l1qK7jk7J8K3k4j1J6
7200CJ3k5pM0nl7J2N0l9k1K0J5k1rJ9J2m1PK2mk5J6K3k1k3L1J5m0J2K4j2k4J4
7233fK6j2k2J9J5j6k2K3J3k7JK9j7k1K2J0j2k7L2J3l7MK4ml1K3J3j2k7L1Qk7q
7266b2K9jl0J1L3k0k7L3Rj8j2K7Ol0OK0j1k4J4K4l7%L0Rl8KL8pl5J2M2l8k7L8
7300FJ4l6qL5j0k1pM6j8l4K8J9k5j5L1Pl1kL8pk5J9K1k2k3L7J7m6kK8J2m0LN2
7334D1l4j5J4K2m1lK7jk3%L2j0k6J4J3j8j6K8K0m0JK8rj6J3K3k4j9L1Ok1j2L4
7367A9j6j6J2K5j5k2J9J8k9oK3J0k5lK3j3j7J6J3l3j3K7Ok1PK0%l7J7K8j5k7J5
$$ y = [21, -14, -14, 22, 3, -12, 1, 12, 0, -29, 4, 21, -13, -20, 20, 6, -14, -6, 15, 7, -26, 7, 25, -16, -11, 13, 14, -22, -5, 25, 4, -2, 16, 29, -8, -12, 9, 22, -15, -14, 23, 12, -41, -7, 20, -11, -18, 9, 15, -26, -18, 20, 12, -21, -10, 16, 4, -31, 10, 21, -10, -18, 9, 8, -19, -1, 22, -2, -13, 3, 16, -9, -16, 24, 19, -18, -6, 44, 5, -16, 4, 19, -2, -11, 8, 20, -21, -14, 8, 4, -21, -5, 18, -3, -26, 5, 20, -20, -8, 16, 4, -20, -6, 20, 8, -14, 5, 20, 4, -18, 5, 18, -9, -8, 21, 4, -17, 5, 15, 3, -24, 8, 21, -16, -12, 12, 8, -23, 0, 13, 1, -26, 5, 13, -14, -22, 7, 6, -24, -13, 20, 0, -27, 6, 15, -3, -15, 12, 18, -12, -6, 14, 3, -21, -7, 17, -20, -20, 10, 19, -19, -17, 21, 14, -21, -9, 33, -5, -32, 6, 20, -16, -24, 11, 1, -20, -27, 19, 1, -33, -5, 14, -11, -26, 5, 12, -19, -21, 17, 10, -15, 4, 25, 3, -20, 17, 34, -12, -14, 14, 26, -14, -11, 41, 7, -8, 6, 28, -13, -16, 11, 10, -13, -13, 19, 9, -17, -3, 10, -8, -24, 4, 24, -16, -15, 13, 4, -12, 1, 24, 0, -19, 12, 18, -3, -15, 19, 3, -13, -1, 24, 9, -13, 6, 24, -5, -11, 12, 22, -3, -6, 17, 4, -13, 3, 16, -17, -30, -3, 3, -18, -11, 9, 9, -28, -11, 17, 2, -25, -10]
7400a0L4l7jL2nl2J7K6k4k1L0K0l3j7M3jm2J1L0k2k4J3J6j3rL2Kl0qL9rk9J9J8
7434A5k5j9L1J1k0j3M0j3k9J4L5j7k8J8K9l1j5J4L3k6j3K3pl2J6K6k0k4K6J1k8
7465a8MK2rk2K2llj7J5K5k5j6K9Mk7jL7j1k1K3Nk0j4K2J2j6j2L2Lk8KK2ok0J4
7500DOk4oL3qk6K0J9j5l0L4Rj9j8K6nj8J2J8k3nJ5J6k0oK7nj7qL2kk8K0Rk8MJ6
7537IRk9MK1mj7pK0j8nJ3K0l6jJ1J3k5JL3j8j4J3J2k2j0K8MqrL0j6j2J7J9k9p
7573a0J4J5j6k1K5Jj6J2J8j7k6K4J3k3j3K3Pj9LJ1%k7J2J9j8%MJ0j2qK6%j9LJ2
7608GroJ8lj7JK0J0k6OJ5j8pJ5Nlj4J6Rk9J3Pj3k1J7J1opJ1J1l0nK2prOJ8pj4
7647a3QK4k1rJ7nj2OK2j1j5LJ5j8PJ8Jk8%K3j3oMQpj5K2lj4LNJ0j5nJ0mkNJ3j6
$$ y = [-10, 24, -13, -14, 18, 13, -19, -2, 24, 0, -21, 9, 29, -4, -21, 22, 21, -21, -10, 20, -2, -26, -13, 3, -10, -19, 13, 15, -15, -23, 16, 7, -22, -3, 15, -10, -29, 2, 13, -7, -20, 20, 7, -22, -8, 27, 10, -18, 0, 29, -2, -17, -3, 30, 4, -9, 14, 7, -25, -9, 17, -3, -27, -1, 10, -18, -14, 8, -1, -23, -1, -4, -7, -24, -9, 16, -9, -25, 4, 8, -19, -20, 17, 6, -15, 8, 13, -7, -21, 1, 13, -3, -15, 17, 20, -8, -6, 16, 10, -10, 4, 10, -14, -20, 13, 5, -21, -1, 18, 3, -27, 7, 16, -3, -21, 5, 0, -18, -6, 12, -11, -16, -1, 15, -5, -11, 16, 11, -6, -14, 18, 16, -12, 8, 17, -11, -7, 9, 18, -11, -7, 14, 10, -7, -14, 6, -12, -17, -4, 16, -20, -21, -10, 3, -22, -21, 12, -6, -20, -7, 5, -17, -27, 1, 5, -3, -12, 18, 2, -10, 7, 26, -3, -10, 4, 19, 3, -18, 7, 8, -8, 4, 22, 5, -21, 3, 16, -7, -20, 3, 10, -9, -6, 5, 5, -22, -10, 9, -9, -9, -5, 5, -7, -15, 11, 11, -8, -5, 7, -2, -8, 10, 7, -10, -9, 11, 21, -5, 1, 16, -2, -9, 6, 11, 8, -6, 10, 19, -10, 3, 10, -3, -24, -7, 4, -2, -9, 2, 13, -17, -22, 0, -7, -16, -10, 8, 1, -13, -5, 19, -2, -11, 6, 1, -11, -5, 17, 6, -9, -6, 9, -9, -2, 16, 17, -11, -11, 12, -1, -7, -3, 5, -2, -17, 5, 2, -12, -9, -4, 6, -9, -14, -4, -8, -10, -5, 8, -8]
7687hj3L2nj4%L7k6j4K2Oj5pPK2k7NJ7j6p%K8k4j3J5Ok9OK6j5j3J2J3j5qK0mj2
7724a1KJ4kmkJ6k1mJ8kjj6J8%j0J5jj0MQjj3mK0Kk8KJ6nj6J1J1j0j0J2MopOPj3
7765a1J0RmoJ9pj3%K2j6j5J3Plj5K2Nk8PJ2Jj8J2J7j4k0J3JmrJ7kj4NOmmLJ8k5
7805a3rK4Jpj7K3Pj6OK2k4qJ8J0k5kK5j5j5J3J8pj7RJ2k3j1K4Qk4kJ4qkPLqnJ0
7844dOj1QNqj3J6Q%j7J3Ok1J2J0pj1J0RnpO%lkNQk6%K6j5j2J2Qk2QLNk2RK2lk4
7887a8J4Pj8oK7kj7J0Rjj9J4J0j0KMKj5mJ3J0rjK1j5j3PJ3j3rJ6Nk0pJ1Jk1J6
7925fJ0pj0J6Nj4j0J7Lk3J4J6mpKJ3k0nK2mmlK4j8j3PJ5j5qJ8%j0j3L1rk2lJ7
7963Blj4JK0k1MJ2mj2J2Pj4QJ0mpnJ7Pj5j4K1j0j7J8J3j1jLJ5k7MK1j1qJ2jj6
$$ y = [-8, -21, 11, 6, -8, -8, 29, 3, -11, 11, 17, 2, -5, 2, 24, -3, 2, 19, 3, -4, -4, 24, 0, -13, 2, 8, -21, -15, 11, -4, -17, -5, 8, -7, -15, 5, 1, -11, -9, 5, 3, -1, -3, 13, -8, -12, 6, 4, 3, -13, 5, 5, -5, 10, 9, -1, 3, 11, 10, -3, -7, 13, 15, -13, -11, 5, 0, -16, -5, 6, -4, -14, -2, 2, -4, -11, -5, 2, -11, -1, 8, 4, -2, 17, 10, -3, -3, 19, 3, -12, 1, 8, 5, -10, 12, 17, -11, -4, 8, 9, -9, 3, 20, 6, -14, -1, 0, -4, -13, 4, 2, -12, -7, -1, -5, -9, -6, 12, -13, -22, 2, 3, -4, -21, 2, 9, -7, -1, 21, -3, -11, 7, 17, -8, -10, 15, 0, -15, -2, 16, 9, -8, 1, 13, -10, -21, 3, 11, -13, -15, -1, -9, -11, -4, -1, -9, -14, -4, 2, -9, -1, 4, -4, -17, -1, 7, 7, -10, 3, 9, -12, 0, 10, 3, -8, 2, 11, 6, -1, 5, 5, 2, 0, 5, 13, -13, -13, 13, -2, -14, -2, 6, -16, -8, -5, 0, -22, -13, 9, 6, -18, -4, 3, -15, -21, 6, 4, -13, -3, 6, 5, -14, 0, 10, 0, 2, 6, 8, -7, -11, 2, 12, 3, 2, 23, 8, -5, 2, 15, 2, -7, 9, 14, -6, -13, -2, -1, -22, -6, 4, -3, -13, 3, 8, -6, -16, 1, 4, -19, -5, 11, 7, 0, 2, 15, -5, -10, 12, 8, 4, 1, 25, 7, -6, 1, 16, 1, -7, 11, 11, 1, -12, 19, 10, -12, -15, 2, -1, -15, -14, 6, -15, -11, 1, -3, -15, -3, 4, -10, -2, 8, 4, -3, -8, 9, 16, 1, -13, 8, -2, -19, -1, 12, 1, 0, 3, 18, -9, -5, 16, 5, -3, 9, 8, -8]
8001hj3K6Jk0JJ0J0k0Q%Rj8J8Kj0j3K4%rnJ2nqJ4JlpJ3KqmJ7pj6JK4k2rjK9k1
8042eoJ4%k1OJ1pj1J9Kj7jJ7Kj4kK3j3noK1lj9J6MppK7qj3lK3j2rJ2Qj7lJ8ok4
8083a6J0Qoj5J5NkoJ2Ok0lJ1Kj4%K5nj5K0loj2PKj0%K7j1j8PK6j5k2K5Lk1%J7
8122Hmk5J7J9k4lOJ1j6pK3j4l%Rjj8L1rj1%K1Lk6J2O%j2MJ4j0k0J9J1k1MJ2Lj7
8161h%J1opJ1Jj6lK7k1j1J1J6Kk4J2J1j7OJ1%j9NJ6qj6J5Omj5
$$ y = [-8, -21, 5, 6, -14, -13, -3, 7, -13, -5, -5, 4, -14, 4, 6, -4, -17, 7, 7, -2, -7, 5, 0, -8, 6, 7, 4, -3, 10, 12, 4, 0, 17, 10, -6, -5, 19, -3, -12, -13, 16, -5, -11, 3, 3, -18, -12, -1, -8, -19, 0, 2, -15, -16, 1, 3, -11, -13, 10, -3, -8, -14, 7, 4, -15, 1, 5, -2, -9, 18, 10, -3, -6, 17, 5, -4, 8, 16, -1, -4, 14, 8, -16, -6, 2, -4, -19, -4, 1, -1, -7, 5, 11, -9, -12, -1, 1, -13, -13, 12, 7, -8, 12, 9, 3, -9, -2, 0, -10, -10, 17, 6, -12, -5, 21, 6, -16, 9, 12, -9, -9, 8, 4, -21, -4, 15, -9, -12, -6, 5, -11, -18, 5, -9, -12, -12, -3, -4, -22, 9, 0, -11, -11, 10, 13, -13, -1, 5, 5, -7, -3, 11, 1, -19, 0, 11, -10, -6, 6, 9, -8, -8, 3, -3, -10, 1, 2, -14, -17, 10, -11, -22, -11, 5, 7, -17, -5, 6, -11, -5, 6, 6, -13, -8, 8, 0, -16, -1, 5, 1, -14]
8191a4
$$ Imaginary data points
##PAGE= N=2
##DATA TABLE= (X++(I..I)), XYDATA
0@%%%%%%%%%%Qj6J6j6J6k4L2m0M9n7P2q8J04j28J52j76K08k40K73l13L60m09M66
33B49n30O01o80P61q52R56j067J187j321J469j628J801j991K198k425K673k945
50a544L244l575L942m346M798n307N882o540P302q194R252j0535J2133j4182J6917
65I247k0773K6661l6830N9122j90644J51847L67313m22700k13807L30610J59048
76B19094l45308k2512L14754m2152l28022J12522K86180j29749k40585J68619
86g159J53428j99108q8847K52577L6347k80088k6794K84553K3754k38959k3614
97a13910J72470j603r6220L5631M1416p0227m129P9348j9248o4090M9555L0673
109C9666q9270j570J33489j3140j61672J2207J61163j0894j29362K3281Q0578
$$ y = [0, 0, 0, 0, 0, 0, 0, 0, 0, 0, 0, 8, -8, 8, -8, 8, -16, 16, -24, 25, -32, 40, -48, 56, -72, 80, -96, 112, -128, 145, -168, 192, -217, 249, -281, 320, -360, 401, -451, 505, -562, 625, -696, 773, -855, 946, -1045, 1153, -1272, 1401, -1544, 1700, -1875, 2067, -2279, 2519, -2788, 3094, -3446, 3856, -4338, 4914, -5621, 6512, -7670, 9247, -11526, 15135, -21695, 37427, -153217, -1370, 365943, -56757, -270564, 60046, 219094, -126214, -148726, 166028, 123876, -204146, -91624, 194556, 64807, -175778, -7159, 146269, -52839, -141686, 110891, 147238, -132850, -159644, 124909, 148663, -90296, -113910, 58560, 56957, -39263, -3632, 37784, -32443, -36572, 42776, 23528, -40562, 8993, 39666, -49604, -51174, 82315, 69175, -92497, -80290, 80873, 69979, -59383, -36102, 44476]
120D4476n5368l3237R7628R00j33784J7064J50076l1010j44964N2099J28361q2363
132I878j14059J13258J09047j31129j09391J27098J04072j03583q3851P2636M8501
143D2477m7624q042L5127k3752l1920L8235K8561l6300j7452K6273r03j7437J8511
156E754J3156k5651q932J7516l021K461K7213k5229o0590M2380R3689n1607j16164
169h9025N7450J22678o7061j15233Q4486J00603j07640q4727J29469O8793j42837
180d3044m9173J45001K1262j39082J6244J31036n9176j25060R9504J20854j30028
191a1662j13949J47959R9174j55415p4623J56884M3181j55645j0586J51424j8088
202E8654j40919M0979J21112n9731r2047P7232N7506r4549k3190J09446o138j17664
$$ y = [44476, -10892, -44129, 53499, 54399, -79385, -62321, 87755, 56745, -88219, -36120, 92241, 9878, -104181, 9077, 118124, -13005, -122396, 4702, 108774, 5191, -78660, -6024, 42477, -5147, -13189, 21938, -1814, -33734, 4501, 33062, -3238, -20690, 5583, 4680, -12757, 5754, 18910, -6741, -15673, 1843, -1178, 1283, 28496, 3267, -57323, -14943, 78746, 27139, -89025, -31575, 91103, 24042, -91191, -6705, 93898, -13742, -98469, 31000, 99793, -43044, -92217, 52784, 74046, -65036, -48792, 82244, 23068, -101992, -2488, 118366, -11662, -125611, 22348, 121522, -33893, -108516, 48368, 91549, -64096, -74682, 76742, 58654, -82265, -41286, 79826, 20095, -71952, 5280, 62786, -31763, -54953, 54493, 48355, -69309]
214f9309K8952J15466m6773j02044O2027Q0007p5630n3809Q6088K7187r0501j567
226c9906Q6570k3542p4468M8881N6873p3727l7464R5426J8841j10353j611J15971
238F1491j5371j11911L3167J00187n1600q3721O8892O4779q2427m4160R0288K1766
250E1380r2288K375Q9676k7102q4109M9931P6584o8104o6908P9729N4252q4468
262a9052l8230Q3377J9566p7971k30O9386j7475n7921L1723M3600m1870k6758
274c1855M8145Q668n1056Q709N0724k3329m6797L3893L8793m0040k6847M2277
286A1285J1930m1309M229L7597j9785l1164L3287K1954m3935j0263N1483l011
298B2298n5854J6611N6653k9143n3505L9729M6050m7966l4480N3789J9674n7190
$$ y = [-69309, -40357, 75109, 28336, -73708, -11681, 68326, -7304, -61113, 24975, 52162, -38339, -39906, 46664, 23122, -51346, -2465, 54408, -19319, -56783, 38643, 57484, -52869, -54480, 61491, 46120, -65791, -32624, 67563, 15963, -67758, 1134, 65913, -16514, -60674, 29614, 51380, -40908, -38533, 51143, 24041, -60068, -10137, 66447, -1657, -68565, 11164, 65416, -19052, -57282, 26095, 45661, -32310, -32540, 36846, 19371, -38550, -6827, 36773, -5097, -31855, 16290, 24958, -26098, -17389, 33335, 10006, -36791, -2898, 35895, -4145, -30992, 11285, 23215, -18094, -13865, 23732, 3947, -27217, 6070, 28024, -15911, -26174, 25309, 22298, -33556, -16945, 39708, 10565, -42940, -3211, 42839, -5127, -39607, 14182, 33856, -23334]
310b3334k971N7931j4127n5664L0341N0072m4661m1258N6449K9733o5048j6429
322c8966O9872K343p0378J1646O6292k4867n7820L6758M5721m6792l1037N4316
334A7088J4993n8733J306N9629j6937n6856L1090N0654m3026m1578N2080L0249
346C9959n7692j7364N9504L604n7539J0363N2084k3742m3684L5691L2982m5375
358a1209k0685N2083P511n5351N847N4982j8584n1063K9958M3834l9164l3837
370c5678M5700K1640m9151q065M9404n970m6551J9475M0879l1497l2759M1156
382H583K2739m7836j1502N1170k85n1005J1858M7452k2485m0833L1510L1651l8460
395g443k0522M2968Q209m4813M456M3941j6652m0402K7581L4383l6548k6241M3075
$$ y = [-23334, -26305, 31626, 17499, -38165, -7824, 42248, -2413, -43671, 12778, 42511, -22537, -38966, 30906, 33249, -37129, -25483, 40809, 15942, -41878, -5120, 40601, -6191, -37228, 17088, 32081, -26652, -25346, 34283, 17346, -39510, -8420, 42234, -792, -42370, 9710, 39959, -17733, -35097, 24407, 28011, -29528, -19165, 32919, 9177, -34507, 1184, 34166, -11209, -31894, 20189, 27700, -27651, -21804, 33178, 14594, -36469, -6511, 37323, -1841, -35678, 10022, 31662, -17489, -25554, 23850, 17880, -28671, -9196, 31683, 186, -32573, 8583, 31322, -16514, -28016, 23154, 22869, -28136, -16278, 31174, 8689, -32144, -634, 31017, -7443, -27965, 15003, 23212, -21601, -17145, 26796, 10144, -30258, -2677, 31706, -4842, -31083, 11992]
408A1992J6428m6749n545M7383n762m4919J6737L9572k6718l1640L5036K1671
420B7486m1152j0329M4627j617m5213J3352M2809k4094l7590L3209K9831m0080
432h761k0109M4357R074m5826K564M4370j3993m0195K4552L3587l3581k5010M0525
445A1554J5069m5001m341M6703o486m5576J6851M1694k6185l5275L3947K6796
457B9750l9741j6772M3233N807m4191N458M2502j6274l8384K6025L2097l4122
469d612k4004L9991J4593m3223m507M3669n676m1349J5346L6461k3827k9454L0598
482D006K0822l5233j1133L7459J037l7183Q759L4579j7659k9857K5074K3380l0543
495f492j5551L3744O877l4587K112L3114j0842k9484J8716K3979k5221j6916K9952
$$ y = [11992, 28420, -18329, -23874, 23509, 17747, -27172, -10435, 29137, 2419, -29221, 5815, 27486, -13666, -23995, 20632, 19015, -26198, -12846, 29963, 5869, -31721, 1488, 31319, -8761, -28870, 15487, 24561, -21265, -18701, 25669, 11676, -28519, -3967, 29620, -3961, -28971, 11554, 26623, -18378, -22719, 23984, 17498, -28078, -11227, 30467, 4282, -30993, 2954, 29750, -9991, -26763, 16470, 22277, -21914, -16456, 26046, 9772, -28612, -2587, 29510, -4612, -28616, 11375, 25968, -17255, -21762, 21907, 16231, -25118, -9772, 26689, 2862, -26592, 4006, 24828, -10405, -21538, 15921, 16958, -20225, -11466, 23113, 5454, -24403, 671, 24051, -6492, -22043, 11701, 18578, -16009, -13897, 19217, 8375, -21109, -2393, 21586, -3635, -20551, 9401]
508I401Q709l2614Q2L3111q971l1372J7295K7474k4472k1643L0071J4153l3674
521a2450n499L5142l782l4320J2946L1309k1411k6214K8572J9315l3941j1076
533b1409L7273K020l8328P189L7065j5969l3496K3735K7878l0100k0521L4716
545A0053J1950l7420k698L8001o565l6476J5343L2875k3162k7422K9658K0408
557B4545l4432j2361L7258L746l7932M934L6390j3245l2672K0724K7089k6992
569b948k0023L1656J1974l4391l446L4983n064l3396J3061K9828k0101k4580K5726
582C279J8084k9593j0778L1446L117l1239M478K9094j1539k5282J7611K0192k2340
595c470j4187K5416P634k6670r56K6171n506k4061J1333K0550j6077j5954J9472
$$ y = [9401, 18110, -14504, -14422, 18689, 9718, -21654, -4359, 23115, -1357, -23000, 7071, 21224, -12450, -17949, 17193, 13411, -20909, -7963, 23346, 1935, -24279, 4293, 23608, -10333, -21409, 15864, 17884, -20444, -13255, 23810, 7841, -25655, -1920, 25958, -4142, -24663, 10053, 22003, -15417, -18115, 19886, 13321, -23155, -7812, 25063, 1901, -25521, 4137, 24545, -9887, -22248, 15010, 18756, -19176, -14242, 22148, 8903, -23769, -3045, 24044, -2948, -22971, 8685, 20659, -13732, -17178, 17805, 12741, -20655, -7594, 22234, 2133, -22447, 3279, 21363, -8230, -19008, 12438, 15555, -15684, -11206, 17888, 6349, -18933, -1322, 18870, -3470, -17657, 7759, 15393, -11277, -12233, 13938, 8432, -15629, -4296, 16254, 177, -15777, 3695]
608C695J0520k1295m596K1540j481k0236P229J7584j2208j3755J6026Q985j8387
621f379l565J9128k095j8291P561J5981j2377j2350J6115P574j8429k024J9198
634A0047l907j8433R753J6192j5026j2602J9242P879k2084k297K3397l822k3104
647a4765J0025K1245j5837j7893K0817J3231k4688p378K7174O89k8116O391K7506
660A8401j3410k5316J9951K1487k5558j6133K9881R551l2735k070L3919n880l3258
673b1170J3750L0675k1040k6275K7408K0162l2469j2757L5935M531l7548L990
685a4808L7173j2325l4723K0020L0347k6707k4339L2061J7133l5800r157L7693
697A6568Q46l7613P378L5611j5139l1877K2080K6696k7864k0388L2142J3341l4690
$$ y = [3695, 14215, -7080, -11676, 9864, 8383, -11853, -4624, 12960, 752, -13003, 3023, 12008, -6379, -9944, 9184, 7089, -11202, -3641, 12340, -37, -12387, 3728, 11302, -7127, -9151, 10047, 6140, -12293, -2540, 13652, -1374, -13976, 5266, 13145, -8939, -11236, 12161, 8339, -14765, -4740, 16505, 668, -17225, 3592, 16823, -7865, -15243, 11931, 12620, -15496, -9105, 18401, 4991, -20325, -374, 21113, -4445, -20578, 9303, 18854, -13881, -15951, 17968, 12088, -21170, -7420, 23255, 2215, -24060, 3348, 23510, -8959, -21716, 14219, 18750, -18798, -14808, 22365, 10040, -24683, -4663, 25684, -1023, -25362, 6699, 23832, -11968, -21125, 16568, 17414, -20199, -12821, 22790, 7651, -24226, -2146, 24550, -3314, -23702, 8440, 21781, -12909]
710a2909n883L5443j738l4382R096L1675j5785k7570K1448K2286k5763j6121K8522
723H319R369k9633k434K9178m247k7297J0264K4135j5260j9875J8932J4847k1228
736d930r339K2116L756k1658J480K0020o036j7351R699J3844j2309r803J3839
749C328N567j4318j473J3788k170j2326N137J0054p304p204Q613M046r061q67
763d190Q625k045p317M427N293o160k716P135j68p245L040O476n617m818P629
778B349K389q926O35R387l960q930P273P537j0265n231J2672K089j4276J655J4942
793I340n674j4631R733J3209j3485j0726J6667P279j9103l045K0632j723k1159
806a2686O733K0532j1662j8742J6279J5795k0302j1823K3554O991k5780j597K6844
$$ y = [-12909, -18792, 16651, 14913, -19469, -10373, 21302, 5517, -22053, -605, 21681, -4082, -20203, 8319, 17688, -11945, -14379, 14799, 10552, -16745, -6481, 17654, 2394, -17481, 1451, 16298, -4930, -14269, 7847, 11603, -10055, -8575, 11445, 5409, -11942, -2243, 11601, -708, -10511, 3328, 8895, -5423, -6896, 6892, 4722, -7604, -2467, 7587, 283, -6921, 1692, 5738, -3323, -4190, 4435, 2390, -4927, -500, 4793, -1367, -4083, 3052, 2884, -4361, -1321, 5155, -462, -5280, 2349, 4738, -4188, -3553, 5834, 1874, -7056, 217, 7754, -2511, -7742, 4930, 7019, -7257, -5602, 9340, 3666, -10965, -1232, 11977, -1508, -12234, 4433, 11712, -7391, -10436, 10196, 8473, -12686, -5953, 14579, 2917, -15825, 454, 16249, -4053, -15876, 7678, 14669, -11111, -12708, 14136]
819A4136m148k6532R916K4818j5414k1747K0360J7471k4448j2229K7420O274k9011
832a3134K7K9140o395k7753J2479K4936j7902k0894K2348J5864k5584j0126K7409
845A0415L972k7780K263K6713q222k4339J3593K0844j8082j6411K1479J1302k3640
858g893n778K4509J40k4104N322K2473j0300j9733J4537J6046j7852j1589K0100
871E878O658k1210j524K1119l443j9919P995J7634j1873j4457J4873J0619j6868
884d518o389J7757K090j7545K010J6295n677j4149Q705J1293j0940p977J2281
897C236M497j2718j059J2252k106j0959M811Q998o907o542Q265L816q859r82Q645
912D388j721p690M152O062o129l914P518J392q197J283Q076l897p202O306N586
$$ y = [14136, 9988, -16544, -6628, 18190, 2776, -18971, 1389, 18860, -5588, -17817, 9603, 15877, -13134, -13107, 16033, 9638, -18115, -5636, 19300, 1398, -19496, 2852, 18716, -6868, -16994, 10415, 14387, -13393, -11130, 15583, 7361, -16978, -3385, 17459, -623, -17034, 4445, 15747, -7893, -13671, 10838, 10978, -13126, -7804, 14669, 4369, -15364, -827, 15219, -2633, -14222, 5878, 12536, -8674, -10198, 10921, 7478, -12441, -4446, 13188, 1315, -13142, 1731, 12350, -4518, -10907, 6850, 8940, -8605, -6595, 9700, 4023, -10126, -1421, 9872, -1068, -9045, 3236, 7733, -4985, -6044, 6208, 4102, -6857, -2046, 6952, 45, -6497, 1768, 5584, -3275, -4257, 4388, 2667, -5023, -871, 5191, -938, -4852, 2666, 4058, -4139, -2856, 5220, 1323, -5879, 427, 6013]
927F013q281l385R671P37j0327K159J0179n074r234P800P523j0127n161J1859
941D352K351j2868P51J3048l918j2385O959J0916r651q751J1840N995j3355k857
955g573J4126n01j4088L891J3243p097j1660R934R399j2247o565J3862L345j4713
969f644J10J4724l616j3869O943J2213r914r820J2336O818j4022l403J4875k23
983F508j4835L834J3934p195j2198J0112R713j2359o677J3801L318j4420K14J4123
997G873l622j3009O708J1164r321q712J1303N815j2564k633J2987n71j2645L645
1011c582J1545o432r728Q722P374j0431m592J1445J579j1722J503J1235m473r982
1025g539P099Q106r240n677J0762K846j1527J65J1512l189j0693O001R102q392
$$ y = [6013, -2268, -5653, 4018, 4755, -5572, -3413, 6766, 1692, -7542, 258, 7781, -2346, -7507, 4352, 6703, -6165, -5414, 7634, 3716, -8669, -1710, 9206, -445, -9196, 2644, 8639, -4716, -7573, 6553, 6052, -8036, -4145, 9098, 2001, -9659, 275, 9674, -2573, -9138, 4724, 8069, -6644, -6534, 8190, 4574, -9295, -2352, 9861, -53, -9873, 2463, 9281, -4741, -8144, 6731, 6508, -8327, -4493, 9441, 2246, -9952, 160, 9873, -2486, -9163, 4638, 7956, -6464, -6250, 7873, 4251, -8758, -2050, 9114, -207, -8919, 2384, 8199, -4365, -6998, 5989, 5418, -7227, -3582, 7963, 1531, -8197, 525, 7899, -2532, -7124, 4321, 5900, -5822, -4319, 6916, 2443, -7539, -440, 7666, -1574, -7251, 3511, 6357, -5170, -5005, 6507, 3318, -7375, -1374, 7728, -664]
1039f64o891J0202M227j1335j267J1719j782j1293M694J0129p304q317R418N987
1053G523j0945l253J1741L50j1826K577J1191n353r851P804P928r836n502J1262
1067C810K756j2030J95J2089l158j1427N982J0068q475q073J0483N577j1882k719
1081f804J2572l35j2535L370J1752o236j0257Q720Q167j0663n619J1947K784j2524
1095e661J66J2360l025j1496N633R996p829p987R512N599j0600k980J1039L34
1109E061j0851K232J0043m538q716O486O938p947m849Q894K527r231j78Q978k086
1124B763q162M114O825n764n103O973L081p621r33P703j222p194L192O175m869
1139d2m698O103K890o810r20O992j096o585K971N686m583m356N827K703o617q52
$$ y = [-664, -7555, 2647, 6874, -4461, -5728, 5991, 4209, -7084, -2390, 7739, 435, -7882, 1536, 7523, -3422, -6675, 5066, 5416, -6410, -3833, 7358, 2005, -7846, -42, 7886, -1950, -7452, 3810, 6566, -5464, -5269, 6820, 3662, -7765, -1783, 8285, -190, -8263, 2220, 7797, -4085, -6804, 5768, 5433, -7102, -3732, 8020, 1784, -8473, 247, 8414, -2249, -7868, 4079, 6863, -5661, -5495, 6865, 3840, -7656, -2023, 7973, 144, -7843, 1669, 7268, -3332, -6312, 4727, 5061, -5790, -3558, 6485, 1947, -6769, -283, 6655, -1292, -6141, 2753, 5280, -3951, -4129, 4849, 2763, -5399, -1285, 5540, -224, -5327, 1646, 4727, -2894, -3827, 3876, 2654, -4540, -1348, 4827, -42, -4740, 1363, 4253, -2557, -3477, 3515, 2419, -4166, -1195, 4491, -92, -4448, 1379, 4082, -2535, -3387]
1155c387O888j054o660K913N913m533m766N885L225o826j437P312n02p328K476
1170a881O830m348n834N995M415p321k636Q212N91q589J582Q406l744p674N787
1185b09O386p511m650Q836K549r648k16R880k201r491M537Q533o652p045Q377
1200A475N150r647k914J0356N19j0495J893J0061m211r076O275P616p998n761
1214f757R287L594j0051j271J0288j100r977L387R121n457p797P219O039q527
1228b002l981R365J728r652N97R364k807q544M790P267o471n575P703L592q405
1243c031j489Q583o24q217K588P367m330o074N666M498o589k715P034Q74p021
1258c480R19O557k537n703L915M519m969l096N649J517n905J10N727j664n148
$$ y = [-3387, 3501, 2447, -4213, -1300, 4613, 80, -4686, 1199, 4424, -2402, -3839, 3473, 2971, -4357, -1881, 4949, 601, -5233, 762, 5177, -2144, -4780, 3432, 4023, -4566, -2984, 5422, 1678, -5996, -209, 6177, -1334, -5984, 2852, 5401, -4247, -4463, 5417, 3216, -6275, -1738, 6795, 143, -6902, 1475, 6625, -3022, -5936, 4420, 4939, -5556, -3663, 6398, 2187, -6889, -614, 7002, -996, -6757, 2530, 6124, -3927, -5198, 5090, 3990, -5987, -2600, 6521, 1064, -6733, 486, 6525, -2002, -5983, 3382, 5110, -4542, -3945, 5419, 2612, -5932, -1142, 6125, -346, -5921, 1782, 5374, -3031, -4520, 4063, 3439, -4778, -2190, 5177, 847, -5227, 439, 4937, -1652, -4367, 2667, 3541, -3480, -2561, 3996, 1459, -4244, -329, 4190, -779, -3875, 1774, 3291, -2614, -2504, 3223, 1559, -3589]
1273c589L073M193m214k936N032J472n455Q8N468j690n029L172M199m439l017
1288c672N403J538n941O7O059j748n691L336M887m722l728N817K275o537o20O810
1304C533j103o644K805O046m361n068N678L740o660k166P268M46p465J353P220
1319D622l091o573M711N533o086m160P139K518p812p17Q080j208p863L063P221
1334E377m779o141O243M706p372k996Q075J105q319Q14Q133k717p457M432O383
1349E487n842m983O909L345p575j583P812k16p587J914O980l425o043M707M830
1364D730n676l392O262J876o509l35O378j146n898K462N110l574m068M407K839
1379C466m911j501N048J57m849J101M323k195l521L062K492l599j344L816J73
$$ y = [-3589, -516, 3677, -537, -3473, 1559, 3031, -2424, -2336, 3132, 1442, -3587, -415, 3784, -655, -3672, 1731, 3269, -2672, -2605, 3454, 1706, -3985, -649, 4238, -484, -4212, 1605, 3880, -2657, -3277, 3533, 2430, -4214, -1409, 4637, 276, -4792, 886, 4626, -2034, -4200, 3068, 3514, -3951, -2598, 4622, 1531, -5042, -331, 5202, -884, -5044, 2095, 4613, -3199, -3916, 4164, 2956, -4907, -1844, 5377, 598, -5543, 700, 5406, -1966, -4962, 3113, 4218, -4101, -3287, 4846, 2129, -5328, -896, 5487, -355, -5338, 1571, 4916, -2659, -4242, 3570, 3354, -4233, -2319, 4661, 1236, -4807, -100, 4730, -946, -4338, 1924, 3800, -2709, -3044, 3334, 2188, -3710, -1248, 3862, 288, -3780, 627, 3466, -1445, -2946, 2102, 2259, -2590, -1489, 2834, 639, -2882, 180, 2672, -927, -2271, 1545, 1718]
1394A718l711R49L289j934k555K654J673l143o33L310m37l165J445K723k334k012
1410b163K991J148l439j28L590r33l439J945L006k871k322L630J432m199l51M484
1426B381q22m476K050M144l217l514M272K596n129j420N704P2n959J399N838k874
1442A045n323M237M471n435l310O374J897o979l02P184j349p010K991O416m485
1457D22n472N757M222o750k732P392J091p642N95P522k269p003L790O165n157
1472f9m995O238L611p018k039P448L80p497J292P173k873o480M297N453n477m177
1488d733O353K704o886j124P048m95o824K047O218l396n335M526M169n338k869
1503c935N847J481o023p7N835j214n356K372M610l324l649L987K584m383j479
$$ y = [1718, -1993, -1044, 2245, 311, -2244, 410, 2083, -1060, -1693, 1617, 1180, -1985, -540, 2183, -151, -2163, 828, 1976, -1463, -1591, 1999, 1066, -2373, -428, 2578, -293, -2615, 1015, 2447, -1752, -2103, 2381, 1559, -2917, -867, 3277, 60, -3454, 818, 3414, -1715, -3135, 2569, 2641, -3318, -1919, 3919, 1045, -4278, -41, 4430, -1005, -4315, 2059, 3956, -3023, -3325, 3859, 2510, -4500, -1509, 4907, 422, -5050, 707, 4929, -1821, -4553, 2839, 3930, -3712, -3117, 4405, 2136, -4867, -1077, 5088, -69, -5064, 1174, 4785, -2233, -4272, 3176, 3556, -3941, -2649, 4524, 1651, -4829, -532, 4921, -556, -4733, 1620, 4324, -2562, -3686, 3362, 2867, -3957, -1910, 4308, 912, -4423, 103, 4272, -1066, -3935, 1912, 3393, -2630, -2707, 3128, 1914, -3442, -1070, 3540, 216, -3433, 554, 3138, -1245, -2724]
1518b724M517L85m371O52L977j540l383K246K656k771j797L024R12l052m5K845
1534A531p33k428J379J852j861j135K083L79k096L77J870j047j436J576Q36j903
1550g56j69K048n75j939J280J623j904j099K359M54k638K86K740j084k586J822
1566a38K247k503j707L059J013l451j90L626o89l611J610L365k494k892L274K216
1582B735l918j370M379L62m593P09M574j822m268K875L706l825k889M587J875
1597C117n121o92N360n55n305J792M950k948m303L956L422m752k347N285J146
1612C005n526J03N463j329n115K461M538l473l715M268K704m818j585N121M08
1627B510n145P51M911j873m415K863L682l672k772M265J730m598o05M670n16m469
$$ y = [-2724, 1793, 2178, -2193, -1541, 2436, 896, -2487, -241, 2415, -356, -2153, 871, 1783, -1269, -1314, 1531, 798, -1630, -251, 1601, -260, -1395, 688, 1067, -1029, -652, 1218, 171, -1265, 311, 1147, -756, -925, 1123, 548, -1391, -111, 1512, -392, -1491, 868, 1322, -1316, -1030, 1710, 626, -1960, -138, 2109, -394, -2101, 958, 1971, -1480, -1670, 1956, 1267, -2344, -734, 2631, 137, -2755, 519, 2735, -1183, -2553, 1826, 2188, -2405, -1696, 2878, 1056, -3212, -337, 3369, -456, -3345, 1242, 3117, -2004, -2696, 2664, 2109, -3196, -1404, 3546, 598, -3705, 251, 3673, -1079, -3426, 1859, 3005, -2521, -2418, 3045, 1716, -3399, -938, 3600, 127, -3588, 680, 3384, -1434, -3019, 2102, 2510, -2635, -1884, 3027, 1154, -3261, -398, 3284, -388, -3160, 1105, 2835, -1763, -2368, 2302, 1786, -2683]
1643b683J580L998k525l285L259K431l793j443M065L98m054O16L803j547l315
1658b495K321K636k906j829L280R46l425m4L330p99l038J559K547k180j914K619
1674F08J190k878l96K912l76k762J111K434j772j930K293J285k647n33K801k45
1690A095k737J001K484j712k024K296J405k717o78K936j06k955R22K729j645k343
1706b049K295J754k771j061L068L03l188N07L065j265k772J951K308k523j691
1721b069K933R90l169k24L217n38l077J276K782j951k318K492J719k914j004L158
1737A303K25l198N61L054j309k716J965K217k530j565K901Q21l071n4L059p19
1753I44k845J438K433k030j887K469J250k748n30K843k05k728Q91K442j476k023
$$ y = [-2683, -1103, 2895, 370, -2915, 344, 2775, -1018, -2461, 1604, 2002, -2052, -1436, 2367, 820, -2495, -174, 2462, -444, -2273, 1007, 1953, -1472, -1516, 1814, 1015, -2023, -464, 2083, -97, -2011, 608, 1798, -1080, -1476, 1436, 1060, -1702, -591, 1843, 71, -1859, 434, 1719, -928, -1461, 1340, 1095, -1642, -641, 1843, 131, -1893, 403, 1808, -909, -1587, 1349, 1243, -1712, -790, 1939, 294, -2049, 246, 2000, -771, -1832, 1236, 1539, -1649, -1142, 1923, 658, -2114, -163, 2145, -378, -2069, 864, 1854, -1315, -1539, 1678, 1140, -1937, -661, 2121, 170, -2148, 344, 2063, -851, -1855, 1303, 1528, -1670, -1109, 1945, 636, -2080, -115, 2102, -428, -1993, 908, 1729, -1342, -1396, 1663, 944, -1901, -463, 1970, -60, -1947, 522, 1772, -976, -1506, 1337, 1132, -1596, -705, 1737, 261, -1762]
1769a762J966J466k276q76K467K22k484M31K328j026k034J559J585j954j053K233
1785G92M33k349K09K295q51k072J434J692j934j181K309N52k506J26K522q14k358
1802a701J490J990k043j484K481Q71k768j62K869n82k756J266K502j926k054K460
1818D53J473k852q03L071P7l111O74K974j389k675K033K228k567j657K980R46
1834A855l217k16L292n57l175J305K896j998k439K596J828l030j122L303L47l386
1850a718M49L293j246k966J934K503k506j898K924J202l190m28L231l18l105J022
1866h17K812j655k378K158J833k530j206K726N64k789R3K687p13k426J235K075
1882A669j685j602K015J058k185m98K229o5k133N99J904j070j537J419J111j665
$$ y = [-1762, 204, 1670, -606, -1482, 985, 1207, -1277, -846, 1482, 456, -1578, -19, 1566, -388, -1441, 792, 1225, -1124, -915, 1380, 529, -1543, -109, 1583, -351, -1532, 777, 1329, -1177, -1051, 1471, 657, -1701, -211, 1779, -264, -1748, 733, 1604, -1164, -1326, 1543, 961, -1795, -529, 1973, 47, -2007, 453, 1926, -926, -1729, 1342, 1419, -1692, -1018, 1956, 567, -2108, -75, 2153, -414, -2071, 909, 1855, -1362, -1578, 1714, 1157, -2018, -713, 2183, 185, -2254, 342, 2170, -860, -1982, 1321, 1668, -1718, -1269, 2024, 778, -2188, -254, 2249, -257, -2155, 769, 1971, -1219, -1647, 1584, 1266, -1839, -817, 1995, 340, -2038, 120, 1953, -577, -1783, 943, 1507, -1282, -1189, 1498, 785, -1641, -406, 1669, -16, -1618, 397, 1455, -730, -1228, 1001, 936, -1197, -598, 1306, 236, -1301, 118, 1229, -436]
1898d36o09J766Q0j710M09J521q24j246J169Q48j387m03J482n8j435M88J256q60
1916E1r91J165O29j351k27J447k31j399O53J225j013r58J319O21j551k01J665
1933H53k53j656P02J538j140j298J539R49j854n11K067j1k145N55K088j096j897
1950a570J619J564k053j126K401N62k611N7K666o97k576J331K313j897j899K356
1966D40J385k704p86K912J38k953N16K857j165k603J738K225k216j732K593J163
1982A808k848n24K939j09k905P40K725j355k391J872J942k277j414K559Q17k709
1998a130j75K703m54k548J026K261j527j857J921J374k195q12K326K39k305L15
2014h38K143p97j878J213J517j517j097J719O33j765k10J742k31j602O04J373
$$ y = [-436, -1045, 721, 801, -909, -500, 1021, 197, -1049, 120, 968, -419, -822, 660, 602, -833, -345, 911, 51, -940, 225, 854, -497, -724, 723, 492, -907, -254, 971, -42, -1000, 319, 940, -611, -812, 853, 600, -1056, -354, 1184, 44, -1254, 285, 1234, -620, -1131, 936, 925, -1220, -665, 1423, 327, -1570, 49, 1613, -440, -1566, 835, 1397, -1214, -1157, 1509, 812, -1764, -433, 1880, -17, -1916, 440, 1825, -879, -1665, 1247, 1385, -1568, -1052, 1805, 640, -1963, -225, 2000, -216, -1948, 645, 1808, -1040, -1564, 1375, 1266, -1639, -899, 1826, 471, -1920, -48, 1894, -383, -1797, 762, 1579, -1130, -1305, 1398, 944, -1604, -578, 1683, 156, -1701, 220, 1594, -601, -1413, 913, 1152, -1153, -838, 1305, 508, -1370, -157, 1360, -157, -1254, 465, 1098, -667, -877, 865, 634, -968, -364, 1009]
2030A009r02j076J119P12j228l68J265nj182L31J033o32p84Q40M97r77j68J028
2048E12j93r41N11P89q01n35J019K03j125J46J148n21j043Q57Q61j176n55J383
2066E39K01j499K07J503o10j414J004J207j359r19J630N52j810j30J907l47j869
2083a207Q00J735j222j504J608J163j915p32K131K63k244K54K230p75k106J280
2099b41J862j716j496K082J044k376m90K503q0k510O57K376j187k133J681J752
2115A728k093j271K367P39k530j61K541m06k445R47K213j407j875J786J467k089
2131d89r83K268M72k325N1K269n49k099R87J852j379j499J683J082j872o13J940
2148G96J54j931L13J769o92j555J034J232j292q63J441M66j482p3J413k95j254
$$ y = [1009, 107, -969, 150, 862, -366, -734, 531, 526, -656, -325, 708, 76, -708, 132, 629, -348, -516, 512, 319, -622, -111, 678, -123, -658, 361, 564, -561, -415, 733, 212, -831, 26, 887, -289, -844, 539, 740, -759, -552, 951, 341, -1073, -69, 1138, -221, -1140, 490, 1042, -768, -898, 1009, 662, -1207, -407, 1328, 106, -1398, 210, 1373, -542, -1274, 857, 1120, -1124, -870, 1360, 585, -1521, -241, 1621, -95, -1591, 491, 1535, -841, -1331, 1172, 1092, -1418, -761, 1615, 428, -1705, -24, 1728, -365, -1636, 731, 1470, -1060, -1221, 1320, 914, -1531, -584, 1629, 222, -1653, 133, 1600, -489, -1472, 796, 1268, -1057, -1006, 1263, 714, -1385, -398, 1454, 75, -1424, 259, 1341, -531, -1144, 796, 950, -981, -668, 1101, 409, -1146, -112, 1120, -172, -1035, 406, 872, -610, -683, 730, 435, -819]
2165h19N92J035q23p50R74M44j030j29R93j46q92L92P24n73n17P01K67p53k4P57
2185D23k30o37M31M81n90l06P20N3p48J92P40m51o52O95M65q79k39J020n1j088
2205f51L71J057o84r53R90P35j231m55J432J02j520K68J528o53j428J017J224
2222A149j338r38J595N95j770j95J848k29j832O60J711j064j469J385J183j695
2238d04q10J890L95j994N1J999n05j903R37J703j334j398J653J030j901o01K044
2255H52J38k091L62J994q02j815J237J529j594j143J839P18j987k57K026k30j948
2272a172O69J778j068j494J377J160j624p66J763L47j799O5J763m75j608Q20J385
2289A121j129j077J331P52j478l80J524J8j492L43J363o59j161R43Q77j127n61
$$ y = [-819, -227, 808, -15, -765, 209, 653, -377, -506, 487, 341, -551, -159, 565, -8, -525, 176, 443, -310, -334, 423, 193, -444, -13, 468, -122, -428, 292, 345, -403, -211, 529, 78, -574, 121, 586, -293, -532, 488, 437, -651, -280, 777, 93, -860, 130, 865, -366, -821, 611, 713, -807, -539, 989, 336, -1092, -75, 1149, -189, -1127, 468, 1063, -707, -902, 946, 717, -1115, -455, 1256, 192, -1277, 108, 1291, -404, -1214, 676, 1071, -923, -872, 1127, 622, -1281, -344, 1359, 25, -1373, 280, 1310, -591, -1192, 852, 990, -1101, -739, 1255, 453, -1362, -125, 1404, -190, -1333, 506, 1224, -763, -1020, 1006, 776, -1172, -503, 1275, 207, -1287, 90, 1250, -374, -1140, 623, 970, -829, -764, 999, 524, -1084, -264, 1121, -8, -1085, 246, 998, -480, -860, 664, 682, -810, -467, 896, 237, -924, 19, 896, -231, -792]
2306g92J241K26j261J06J186m21j036O85Q13q83n39J000K39j017L4R92l35q58
2324f20N59O76p35m63Q58K19r06M0Q78k91p86N10O43o98m41Q20K18q74J2Q96k79
2345B36q14M98O98p14n14Q88K70r76qJ001k62r61N39Q56q06o47R98L83j126j16
2365e77J202k00j177N15J067q05q83J043O37j220l47J319K8j339K96J292o25j150
2383i24R08R45j124o93J312L60j388m2J423k92j357O18J210r10j006J159P20j340
2401d21l96J444N9j482L06J398o63j231R69J005j231p07J423L45j509L6J483l88
2419D40j404P52J217j042r69J282O55j442l01J522p4j482M24J367p41j205J045
2436D4R39j243o42J390L06j462M1J444l91j337O91J169r63r31J180O45j333l31
$$ y = [-792, 449, 675, -586, -480, 706, 285, -751, -66, 747, -136, -675, 325, 564, -453, -419, 573, 238, -620, -61, 615, -120, -583, 275, 494, -412, -372, 506, 215, -571, -61, 582, -116, -557, 263, 481, -393, -381, 515, 236, -578, -80, 618, -96, -610, 278, 548, -428, -436, 565, 303, -658, -119, 737, -69, -716, 282, 665, -461, -577, 625, 425, -752, -237, 830, 25, -858, 185, 822, -398, -745, 574, 602, -737, -441, 851, 226, -924, -16, 929, -195, -888, 424, 784, -604, -646, 777, 485, -872, -254, 956, 46, -960, 199, 919, -421, -817, 627, 686, -796, -490, 908, 245, -986, -17, 988, -243, -950, 473, 818, -691, -655, 828, 440, -964, -212, 1005, -37, -1006, 276, 931, -511, -812, 710, 636, -846, -422, 945, 204, -1001, 44, 983, -260, -902, 488, 794, -668, -627, 817, 426, -911, -220, 949, -14, -945, 235, 880, -453, -784]
2454g84J412k3j387L68J280o67j110R48Q55j145n70J287K35j314R3J280m11j168
2472h21P08R54r11p36J093M48j181j58J203j44j147M14J011o46q35Q39O00r55
2490b64l58J013J12j029J44R68l73q56N94O73p40m58Q35K36q92J3Q79k69p74M67
2510g9O36o48m24P68J99q19M3P96k76p08M75N85o60l79P58J69q34O8Q22l03p36
2531e47N05O05o89m20Q08K14q82J6R00k53q64N01P44o98n74Q52L87r78j46J046
2551E27j22j035L85R70o59q25Q76O44j069l82J186J06j250K09J228n31j125Q25
2569d2R40j070o92J237M32j401p8J418k55j368N76J260q88j057J134Q12j329n08
2587h79J456J84j495J39J477m89j364P96J183j051r54J279O57j410l61J498K0
$$ y = [-784, 628, 605, -782, -414, 866, 199, -911, 37, 892, -253, -823, 464, 699, -615, -522, 758, 347, -821, -113, 841, -70, -806, 287, 735, -446, -604, 599, 455, -692, -278, 733, 87, -748, 91, 691, -264, -622, 391, 503, -526, -382, 586, 213, -643, -49, 624, -116, -574, 261, 497, -395, -382, 497, 228, -546, -79, 557, -91, -515, 253, 452, -367, -324, 472, 196, -512, -37, 548, -112, -491, 267, 436, -398, -330, 492, 189, -547, -42, 563, -126, -546, 262, 476, -406, -390, 510, 257, -607, -106, 638, -60, -634, 218, 605, -373, -519, 527, 405, -630, -245, 725, 66, -759, 117, 761, -308, -690, 496, 602, -648, -439, 789, 258, -867, -42, 898, -172, -864, 373, 805, -596, -674, 744, 489, -879, -303, 957, 69, -988, 146, 958, -371, -879, 577, 761, -734, -595, 882, 393, -971, -175, 1008, -43, -997, 282, 939, -471, -832, 666, 686]
2604F86j482K97J418o37j247Q99J036j137p70J296M61j374j37J394j96j324M98
2621c19J167p51r66R66P19j108m42J169J79j186J06J124l67r88N78Q28p49o19
2639f59Q57M10r17j90R22m8q49K42P58m18o21N40M49o27k61O44Q6o36J02N67k80
$$ y = [686, -796, -499, 919, 282, -965, -66, 970, -167, -937, 359, 820, -554, -691, 703, 507, -817, -319, 848, 97, -869, 97, 816, -292, -734, 435, 614, -572, -466, 658, 291, -697, -119, 709, -40, -659, 198, 608, -309, -499, 423, 375, -474, -232, 526, 108, -513, 27, 476, -151, -412, 232, 318, -318, -216, 351, 71]
$$ [...]
8191d
##END NTUPLES=NMR FID
##END=
