##TITLE=1H_ES-aq-MeCel-c2
 
 8 sc, 
 14.1.2022
##JCAMPDX= 6.0         $$ Bruker NMR JCAMP-DX V2.0
##DATA TYPE= NMR FID
##DATA CLASS= NTUPLES
##ORIGIN= UXNMR, Bruker Analytische Messtechnik GmbH
##OWNER= root
$$ XWIN-NMR		Version 3.5
$$ Fri Jan 14 11:04:14 2022 Russian Standard Time (UT+4h)  she@DPX200
##.OBSERVE FREQUENCY= 200.131346
##.OBSERVE NUCLEUS= ^1H
##.DELAY= (6, 6)
##.ACQUISITION MODE= SIMULTANEOUS
##.ACQUISITION SCHEME= undefined
##.AVERAGES= 8
##.DIGITISER RES= 18
##SPECTROMETER/DATA SYSTEM= spect
##.PULSE SEQUENCE= zg30
##.SOLVENT NAME= D2O
##.SHIFT REFERENCE= (INTERNAL, D2O, 0, 15.7039)
##AUDIT TRAIL= $$ (NUMBER, WHEN, WHO, WHERE, WHAT)
$$ ##TITLE= Audit trail, XWIN-NMR		Version 3.5
$$ ##JCAMPDX= 5.01
$$ ##ORIGIN= Bruker BioSpin GmbH
$$ ##OWNER= she
$$ F:/spectra/data/she/nmr/H-F/1/audita.txt
$$ ##AUDIT TRAIL=  $$ (NUMBER, WHEN, WHO, WHERE, WHAT)
(   1,<2022-01-14 11:03:13.34 +0400>,<she>,<DPX200>,
      <created by zg, POWCHK disabled, PULCHK disabled
       configuration hash MD5:
       00 E9 B6 7A A2 85 ED C7 34 08 36 98 17 FE 4E 26
       data hash MD5: 16K
       6E 9C 77 A3 F4 7F 4E 85 CE D8 CA 12 BC 16 DB DA>)
$$ ##END=
$$ 
$$ hash MD5
$$ 1F A2 74 5D 30 07 B1 C1 D1 9E 42 CA E4 03 EF 47
##$RELAX= 
##$RELAX= 
##$RELAX= 
##$RELAX= 
##$RELAX= 
##$RELAX= 
$$ Bruker specific parameters
$$ --------------------------
##$DU= <F:/spectra>
##$EXPNO= 1
##$NAME= <H-F>
##$PROCNO= 1
##$TYPE= <nmr>
##$USER= <she>
##$AMP= (0..31)
100 100 100 100 100 100 100 100 100 100 100 100 100 100 100 100 100 100 
100 100 100 100 100 100 100 100 100 100 100 100 100 100 
##$AQSEQ= 0
##$AQ_mod= 1
##$AUNM= <au_zg>
##$AUTOPOS= <>
##$BF1= 200.13
##$BF2= 200.13
##$BF3= 200.13
##$BF4= 200.13
##$BF5= 200.13
##$BF6= 200.13
##$BF7= 200.13
##$BF8= 200.13
##$BYTORDA= 1
##$CFDGTYP= 0
##$CFRGTYP= 5
##$CHEMSTR= <none>
##$CNST= (0..31)
1 1 145 1 1 1 1 1 1 1 1 1 1 1 1 1 1 1 1 1 1 1 1 1 1 1 1 1 1 1 1 1 
##$CPDPRG= <>
##$CPDPRG1= <>
##$CPDPRG2= <>
##$CPDPRG3= <>
##$CPDPRG4= <mlev>
##$CPDPRG5= <mlev>
##$CPDPRG6= <mlev>
##$CPDPRG7= <mlev>
##$CPDPRG8= <mlev>
##$CPDPRGB= <>
##$CPDPRGT= <>
##$D= (0..31)
0 1.2 0 0 0 0 0 0 0 0.06 0 0.03 0 0 0 0 0.0002 0 0 0 0 0 0 0 0 0 0 0 0 
0 0 0 
##$DATE= 1642143793
##$DBL= (0..7)
120 120 120 120 120 120 120 120 
##$DBP= (0..7)
150 150 150 150 150 150 150 150 
##$DBP07= 0
##$DBPNAM0= <>
##$DBPNAM1= <>
##$DBPNAM2= <>
##$DBPNAM3= <>
##$DBPNAM4= <>
##$DBPNAM5= <>
##$DBPNAM6= <>
##$DBPNAM7= <>
##$DBPOAL= (0..7)
0.5 0.5 0.5 0.5 0.5 0.5 0.5 0.5 
##$DBPOFFS= (0..7)
0 0 0 0 0 0 0 0 
##$DE= 6
##$DECBNUC= <off>
##$DECIM= 32
##$DECNUC= <off>
##$DECSTAT= 4
##$DIGMOD= 1
##$DIGTYP= 9
##$DL= (0..7)
0 120 120 120 120 120 120 120 
##$DP= (0..7)
150 150 150 150 150 150 150 150 
##$DP07= 0
##$DPNAME0= <>
##$DPNAME1= <>
##$DPNAME2= <>
##$DPNAME3= <>
##$DPNAME4= <>
##$DPNAME5= <>
##$DPNAME6= <>
##$DPNAME7= <>
##$DPOAL= (0..7)
0.5 0.5 0.5 0.5 0.5 0.5 0.5 0.5 
##$DPOFFS= (0..7)
0 0 0 0 0 0 0 0 
##$DQDMODE= 0
##$DR= 18
##$DS= 0
##$DSLIST= <SSSSSSSSSSSSSSS>
$$ [...]
##$SUBNAM2= <"">
##$SUBNAM3= <"">
##$SUBNAM4= <"">
##$SUBNAM5= <"">
##$SUBNAM6= <"">
##$SUBNAM7= <"">
##$SUBNAM8= <"">
##$SUBNAM9= <"">
##$SW= 18.0517287032376
##$SWIBOX= (0..15)
0 0 2 0 0 0 0 0 0 0 0 0 0 0 0 0 
##$SW_h= 3612.71676300578
##$TD= 16384
##$TD0= 1
##$TE= 0
##$TE2= 300
##$TE3= 300
##$TEG= 300
##$TL= (0..7)
0 120 120 120 120 120 120 120 
##$TP= (0..7)
150 150 150 150 150 150 150 150 
##$TP07= 0
##$TPNAME0= <>
##$TPNAME1= <>
##$TPNAME2= <>
##$TPNAME3= <>
##$TPNAME4= <>
##$TPNAME5= <>
##$TPNAME6= <>
##$TPNAME7= <>
##$TPOAL= (0..7)
0.5 0.5 0.5 0.5 0.5 0.5 0.5 0.5 
##$TPOFFS= (0..7)
0 0 0 0 0 0 0 0 
##$TUNHIN= 0
##$TUNHOUT= 0
##$TUNXOUT= 0
##$USERA1= <user>
##$USERA2= <user>
##$USERA3= <user>
##$USERA4= <user>
##$USERA5= <user>
##$V9= 5
##$VALIST= <valist>
##$VCLIST= <CCCCCCCCCCCCCCC>
##$VD= 0
##$VDLIST= <DDDDDDDDDDDDDDD>
##$VPLIST= <PPPPPPPPPPPPPPP>
##$VTLIST= <TTTTTTTTTTTTTTT>
##$WBST= 1024
##$WBSW= 4
##$XGAIN= (0..3)
0 0 0 0 
##$XL= 0
##$YL= 0
##$YMAX_a= 364252
##$YMIN_a= -356665
##$ZGOPTNS= <>
##$ZL1= 120
##$ZL2= 120
##$ZL3= 120
##$ZL4= 120
##$ABSF1= 10
##$ABSF2= 0
##$ABSG= 5
##$ABSL= 3
##$ALPHA= 0
##$AQORDER= 0
##$ASSFAC= 0
##$ASSFACI= 0
##$ASSFACX= 0
##$ASSWID= 0
##$AUNMP= <proc_1d>
##$AZFE= 0.1
##$AZFW= 0.1
##$BCFW= 1
##$BC_mod= 2
##$BYTORDP= 1
##$COROFFS= 0
##$CY= 11.3945322036743
##$DATMOD= 1
##$DC= 2
##$DFILT= <>
##$DTYPP= 0
##$F1P= 2.36226072786647
##$F2P= -0.459571619588291
##$FCOR= 0.5
##$FTSIZE= 0
##$FT_mod= 4
##$GAMMA= 1
##$GB= 0.15
##$INTBC= 1
##$INTSCL= 1
##$ISEN= 128
##$LB= 0.24
##$LEV0= 0
##$LPBIN= 0
##$MAXI= 10000
##$MC2= 0
##$MEAN= 0
##$ME_mod= 0
##$MI= 1.114404
##$NCOEF= 0
##$NC_proc= 0
##$NLEV= 6
##$NOISF1= 3.799351
##$NOISF2= 2.8
##$NSP= 1
##$NTH_PI= 0
##$NZP= 0
##$OFFSET= 15.70392
##$PC= 1
##$PHC0= -15946.62
##$PHC1= 7.80079
##$PH_mod= 1
##$PKNL= yes
##$PPARMOD= 0
##$PSCAL= 0
##$PSIGN= 0
##$REVERSE= no
##$SF= 200.130013532006
##$SI= 16384
##$SIGF1= 3
##$SIGF2= 2
##$SINO= 400
##$SIOLD= 16384
##$SREGLST= <1H.CDCl3>
##$SSB= 0
##$STSI= 0
##$STSR= 0
##$SW_p= 3612.71676300578
##$SYMM= 0
##$S_DEV= 0
##$TDeff= 0
##$TDoff= 0
##$TI= <>
##$TILT= no
##$TM1= 0
##$TM2= 0
##$TOPLEV= 0
##$USERP1= <user>
##$USERP2= <user>
##$USERP3= <user>
##$USERP4= <user>
##$USERP5= <user>
##$WDW= 1
##$XDIM= 8192
##$YMAX_p= 0
##$YMIN_p= 0
$$ End of Bruker specific parameters
$$ ---------------------------------
##NTUPLES= NMR FID
##VAR_NAME=  TIME,          FID/REAL,        FID/IMAG
##SYMBOL=    X,             R,               I
##VAR_TYPE=  INDEPENDENT,   DEPENDENT,       DEPENDENT
##VAR_FORM=  AFFN,          ASDF,            ASDF
##VAR_DIM=   8192,          8192,            8192
##UNITS=     SECONDS,       ARBITRARY UNITS, ARBITRARY UNITS
##FACTOR=    0.0002768,     1,               1
##FIRST=     0,             0,               0
##LAST=      2.2672688,     0,               0
##MIN=       0,             -356665,         0
##MAX=       2.2672688,     364252,          0
$$ Real data points
##PAGE= N=1
##DATA TABLE= (X++(R..R)), XYDATA
0 0 0 0 0 0 0 0 0 0 0 0 0 0 0 0 0 0 0 -8 8 -8 8 -8 8 -16 16 -16 20 -24 27 -30 35 -40 44 -48 53 -60 68 -76 84
39 84 -92 105 -114 128 -140 156 -172 189 -205 226 -249 276 -303 336 -371 414 -458 512 -578 654
59 654 -748 865 -1014 1218 -1499 1914 -2581 3781 -6367 14120 -82354 -356665 30460 312003
73 312003 -42428 -236914 82979 165674 -135547 -117876 175814 85460 -184498 -50844 169262
84 169262 -2476 -150063 67297 148199 -122031 -163584 142376 178850 -123674 -169622 81456
95 81456 127024 -42722 -62562 24521 1831 -24790 35597 25590 -47590 -10688 48954 -21149
107 -21149 -56620 54528 75027 -70190 -91819 60031 88391 -33927 -55075 12015 4
118 4 -9527 56009 25698 -93508 -45600 106932 52511 -106115 -40682 106000 19034 -113587
130 -113587 -2992 122633 1695 -119496 -10805 95147 16442 -53750 -6699 10830 -18838
141 -18838 17383 48398 -24767 -66746 17879 66207 -9543 -51470 8147 34518 -11642 -24959
153 -24959 10406 22926 3796 -20218 -30217 8225 58956 14040 -77811 -37942 81009 51194
165 51194 -72661 -46288 62840 25428 -59449 1940 62585 -26375 -65348 44769 60082
176 60082 -61020 -44740 80950 24585 -105866 -7834 130300 -725 -145148 3286 144081
187 144081 -6960 -127760 18035 103053 -37207 -78013 59157 56551 -76676 -37108 85720
198 85720 15627 -87758 9839 87411 -36341 -87968 57777 88449 -68931 -84192 69290
209 69290 70706 -62877 -47394 55315 18507 -49703 9572 45168 -32001 -38314 47839 26672
221 26672 -59091 -11052 67933 -4863 -74086 17231 74806 -24729 -67089 29184 50363 -33765
233 -33765 -27505 40381 3436 -48075 17674 53801 -34135 -54671 46795 50034 -57162 -41535
245 -41535 65501 31654 -70300 -21901 69567 11848 -62504 -78 50493 -14069 -36504 29477
257 29477 23426 -43380 -12558 53012 3476 -56893 4920 55436 -13098 -50185 20260 42503
269 42503 -24964 -32819 26184 20950 -24136 -7006 20176 -7929 -15841 21679 11827 -31998 -7825
282 -7825 37475 3000 -37989 3093 34507 -10051 -28151 16763 19663 -22145 -9325 25647
294 25647 -2584 -27431 15199 27918 -27145 -27166 36868 24790 -43224 -20130 45924 12855 -45399
307 -45399 -3313 42228 -7560 -36926 18516 29683 -28545 -20700 36943 10418 -43348 380
319 380 47272 -10706 -48284 19720 45863 -26946 -39835 32331 30584 -35907 -18981 37733 6185
332 6185 -37688 6691 35673 -18658 -31656 29003 25898 -37101 -18843 42421 10951 -44560
344 -44560 -2626 43346 -5783 -38981 13941 31962 -21490 -23050 27896 13031 -32643 -2669
356 -2669 35263 -7363 -35484 16427 33240 -24034 -28642 29682 21968 -33028 -13626 33963 4167
369 4167 -32537 5710 29010 -15231 -23735 23598 17113 -30129 -9606 34278 1674 -35736 6171
382 6171 34420 -13446 -30477 19717 24254 -24639 -16263 27960 7177 -29489 2297 29179 -11442
395 -11442 -27034 19548 23156 -26099 -17747 30657 11108 -32951 -3623 32897 -4236 -30541
407 -30541 11993 26143 -19098 -20019 25044 12645 -29388 -4522 31754 -3788 -31898 11755
419 11755 29766 -18823 -25451 24578 19268 -28662 -11628 30854 3107 -31001 5679 29174
431 29174 -14052 -25510 21401 20243 -27221 -13758 31088 6457 -32771 1196 32214 -8745
443 -8745 -29494 15717 24871 -21681 -18692 26289 11436 -29228 -3561 30359 -4354 -29559 11836
456 11836 26890 -18383 -22479 23653 16623 -27269 -9678 29061 2143 -28953 5485 27004
468 27004 -12650 -23307 18840 18172 -23614 -11948 26657 5093 -27761 1939 26843 -8637
480 -8637 -24012 14580 19533 -19371 -13770 22724 7201 -24403 -327 24344 -6331 -22539 12358
493 12358 19149 -17330 -14420 20958 8726 -22975 -2462 23312 -3961 -21943 10167 19021 -15663
506 -15663 -14762 20115 9506 -23118 -3568 24472 -2715 -24005 8920 21783 -14629 -17996 19455
519 19455 12868 -23026 -6735 25066 19 -25413 6832 24102 -13304 -21203 18913 16933 -23194
532 -23194 -11483 25882 5225 -26834 1510 26096 -8141 -23733 14250 19965 -19379 -14995
544 -14995 23238 9159 -25606 -2811 26427 -3567 -25628 9538 23277 -14749 -19423 18907
556 18907 14303 -21899 -8323 23588 1904 -23885 4451 22729 -10313 -20145 15343 16282 -19303
569 -19303 -11461 21942 6082 -23076 -539 22588 -4817 -20495 9726 17020 -13918 -12532 17102
582 17102 7498 -19061 -2319 19561 -2665 -18577 7188 16286 -10969 -12948 13789 8935 -15410
595 -15410 -4514 15660 -35 -14604 4441 12432 -8469 -9440 11698 5901 -13791 -2055 14553
608 14553 -1928 -13928 5858 12039 -9426 -9077 12277 5330 -14102 -954 14745 -3801 -14106
621 -14106 8632 12343 -13077 -9610 16697 6058 -19083 -1768 20009 -3027 -19448 8028
633 8028 17571 -12797 -14496 16936 10395 -19989 -5450 21807 -60 -22344 5780 21619 -11243
646 -11243 -19636 15947 16449 -19606 -12089 22053 6771 -23266 -835 23229 -5227 -21938 10981
659 10981 19375 -16050 -15520 20210 10616 -23261 -4989 25065 -925 -25382 6772 24065 -12187
672 -12187 -21074 17022 16628 -21038 -11079 24028 4931 -25694 1428 25828 -7652 -24397 13451
685 13451 21520 -18569 -17510 22637 12681 -25388 -7354 26584 1737 -26218 3979 24479 -9462
698 -9462 -21637 14360 17989 -18331 -13743 21086 9087 -22543 -4194 22771 -621 -21872 5050
711 5050 20008 -8750 -17257 11523 13743 -13290 -9654 14160 5388 -14176 -1304 13432 -2217
724 -2217 -11937 4905 9766 -6722 -7112 7637 4253 -7721 -1553 6970 -737 -5451 2462 3288 -3610
739 -3610 -750 4159 -1844 -4084 4128 3404 -5889 -2071 6991 185 -7418 2061 7222 -4388 -6378
754 -6378 6535 4843 -8298 -2691 9566 49 -10309 2817 10396 -5630 -9753 8110 8255 -10106
768 -10106 -5936 11494 2895 -12241 576 12222 -4189 -11340 7644 9527 -10722 -6848 13204
781 13204 3452 -14943 337 15707 -4263 -15357 8082 13778 -11584 -11060 14625 7408 -17000
794 -17000 -3114 18509 -1519 -18968 6237 18290 -10836 -16514 15027 13765 -18622 -10222 21290
807 21290 6062 -22882 -1440 23277 -3465 -22463 8396 20598 -13116 -17760 17231 14105
819 14105 -20511 -9791 22745 5004 -23831 -11 23751 -4897 -22495 9390 20147 -13187
831 -13187 -16785 16167 12652 -18172 -7987 19185 3171 -19189 1465 18212 -5629 -16274
843 -16274 9124 13564 -11798 -10287 13538 6675 -14333 -3013 14103 -487 -12959 3676 11020
856 11020 -6413 -8477 8554 5614 -9980 -2611 10587 -316 -10358 3033 9362 -5360 -7691
869 -7691 7178 5552 -8318 -3086 8776 520 -8499 2034 7595 -4304 -6164 6172 4395 -7387
883 -7387 -2399 7921 357 -7711 1599 6841 -3311 -5435 4603 3614 -5419 -1556 5628 -570 -5299
898 -5299 2576 4447 -4301 -3177 5553 1571 -6255 278 6322 -2232 -5750 4155 4598 -5887 -2950
913 -2950 7285 898 -8205 1443 8558 -3915 -8289 6324 7362 -8475 -5830 10236 3721 -11419
927 -11419 -1146 11963 -1734 -11798 4698 10895 -7549 -9348 10060 7175 -12057 -4542 13382
940 13382 1589 -13957 1466 13702 -4446 -12646 7164 10857 -9472 -8434 11230 5568 -12356
953 -12356 -2426 12791 -765 -12492 3820 11513 -6565 -9889 8861 7717 -10529 -5140 11534
966 11534 2288 -11781 630 11266 -3519 -10084 6101 8264 -8296 -5976 9882 3343 -10794
979 -10794 -574 10931 -2194 -10326 4721 9025 -6879 -7101 8491 4717 -9495 -2056 9818
992 9818 -674 -9474 3288 8496 -5572 -6980 7407 5048 -8647 -2815 9244 454 -9168 1890
1006 1890 8435 -4053 -7127 5909 5331 -7337 -3193 8227 849 -8556 1507 8278 -3762 -7407
1020 -7407 5745 5975 -7311 -4094 8371 1881 -8847 527 8702 -2926 -7920 5165 6605 -7077
1034 -7077 -4796 8514 2662 -9360 -321 9557 -2011 -9068 4251 7989 -6184 -6345 7727 4301
1048 4301 -8744 -1976 9221 -434 -9099 2788 8418 -4929 -7214 6716 5582 -8042 -3628
1061 -3628 8837 1438 -9058 808 8688 -3000 -7801 5001 6407 -6665 -4652 7892 2607
1074 2607 -8583 -418 8730 -1746 -8263 3801 7286 -5501 -5792 6851 3955 -7681 -1861 8008
1088 8008 -279 -7791 2336 7070 -4153 -5897 5609 4393 -6611 -2641 7097 805 -7046 981
1102 981 6507 -2630 -5513 3991 4180 -5010 -2607 5613 902 -5774 792 5479 -2352 -4753 3678
1117 3678 3654 -4665 -2227 5293 629 -5419 1062 5128 -2687 -4361 4174 3218 -5325 -1729 6095 52
1133 52 -6386 1719 6146 -3453 -5401 4982 4176 -6251 -2575 7094 716 -7480 1290 7358 -3268
1148 -3268 -6724 5100 5641 -6622 -4140 7765 2355 -8420 -367 8564 -1693 -8189 3691 7306
1162 7306 -5508 -5961 7038 4273 -8165 -2302 8850 172 -8986 1991 8612 -4040 -7694 5883
1176 5883 6304 -7391 -4485 8458 2383 -9020 -128 9023 -2156 -8518 4272 7461 -6141 -5974
1190 -5974 7575 4146 -8536 -2103 8944 -52 -8771 2129 8101 -4023 -6919 5614 5399 -6836
1204 -6836 -3596 7583 1659 -7856 261 7650 -2091 -6978 3705 5916 -4995 -4521 5923 2908
1218 2908 -6425 -1180 6490 -557 -6123 2174 5360 -3581 -4278 4668 2922 -5370 -1429 5614 -144
1233 -144 -5434 1611 4816 -2915 -3850 3932 2575 -4603 -1127 4895 -372 -4759 1791 4247 -3038
1248 -3038 -3379 4001 2243 -4612 -915 4853 -467 -4691 1831 4162 -3063 -3291 4080 2166 -4807
1263 -4807 -843 5174 -568 -5185 1977 4790 -3294 -4041 4416 2958 -5272 -1583 5827 53 -5971
1278 -5971 1562 5727 -3134 -5093 4574 4065 -5744 -2722 6584 1173 -7007 531 6969 -2243 -6468
1293 -6468 3853 5548 -5237 -4271 6356 2722 -7090 -1022 7384 -771 -7250 2469 6673 -4038
1307 -4038 -5735 5320 4458 -6293 -2966 6877 1294 -7069 409 6862 -2060 -6280 3552 5369 -4809
1322 -4809 -4175 5736 2755 -6295 -1224 6460 -316 -6209 1817 5586 -3116 -4626 4180 3411 -4926
1337 -4926 -1992 5305 538 -5315 868 4957 -2119 -4273 3139 3310 -3867 -2146 4243 897 -4301
1352 -4301 319 4004 -1448 -3433 2395 2591 -3115 -1602 3537 524 -3668 530 3452 -1525 -2946
1367 -2946 2355 2174 -2995 -1213 3396 116 -3507 1000 3298 -2092 -2811 3047 2023 -3811 -1043
1382 -1043 4273 -100 -4420 1317 4214 -2515 -3642 3615 2753 -4526 -1623 5156 281 -5471 1117
1397 1117 5384 -2532 -4935 3820 4120 -4912 -3021 5713 1687 -6170 -212 6256 -1337 -5958 2848
1412 2848 5325 -4218 -4385 5366 3171 -6221 -1767 6702 226 -6833 1346 6545 -2873 -5904 4245
1427 4245 4908 -5420 -3619 6290 2081 -6834 -445 7002 -1262 -6794 2857 6178 -4276 -5211 5445
1442 5445 3948 -6283 -2484 6755 909 -6839 691 6532 -2188 -5871 3533 4914 -4615 -3755 5415
1457 5415 2458 -5858 -1101 5955 -212 -5691 1425 5128 -2496 -4318 3343 3320 -3949 -2195 4250
1472 4250 1029 -4297 82 4077 -1125 -3617 1972 2934 -2617 -2138 2962 1228 -3026 -316 2837
1487 2837 -546 -2403 1284 1805 -1805 -1051 2120 260 -2175 516 1997 -1197 -1604 1736 1046 -2061
1503 -2061 -336 2168 -408 -2044 1153 1715 -1824 -1216 2351 585 -2680 140 2803 -909 -2719
1518 -2719 1657 2364 -2342 -1816 2888 1069 -3262 -192 3422 -804 -3378 1814 3100 -2766 -2557 3588
1534 3588 1798 -4197 -827 4576 -240 -4667 1404 4471 -2545 -3929 3624 3118 -4510 -2049 5167
1549 5167 827 -5567 493 5625 -1823 -5368 3059 4761 -4155 -3892 5016 2768 -5637 -1486 5934
1564 5934 127 -5944 1257 5638 -2569 -5020 3740 4173 -4703 -3118 5400 1928 -5798 -661 5868
1579 5868 -637 -5606 1882 5053 -2985 -4215 3931 3143 -4613 -1955 4998 687 -5095 566 4882
1594 4882 -1752 -4385 2748 3619 -3526 -2703 4022 1627 -4247 -520 4181 -572 -3867 1557 3321
1609 3321 -2381 -2586 3007 1742 -3385 -843 3535 -54 -3398 871 3062 -1594 -2507 2162 1803 -2538
1625 -2538 -997 2725 164 -2696 660 2479 -1382 -2069 1966 1498 -2367 -820 2555 84 -2512
1640 -2512 632 2240 -1309 -1795 1867 1141 -2266 -417 2442 -362 -2437 1103 2206 -1755 -1775 2286
1656 2286 1191 -2630 -496 2772 -253 -2709 1037 2441 -1740 -2011 2359 1418 -2830 -723 3121
1671 3121 -48 -3211 804 3082 -1561 -2746 2235 2208 -2783 -1525 3168 699 -3377 185 3363
1686 3363 -1091 -3153 1926 2726 -2680 -2118 3245 1370 -3610 -497 3735 -406 -3591 1302 3233
1701 3233 -2093 -2654 2776 1906 -3265 -1055 3547 159 -3594 736 3410 -1559 -3024 2237 2451 -2787
1717 -2787 -1758 3120 936 -3273 -99 3202 -738 -2968 1487 2514 -2156 -1951 2643 1248 -2969
1732 -2969 -506 3063 -281 -2956 1028 2626 -1705 -2109 2225 1432 -2603 -667 2773 -155 -2735
1747 -2735 962 2502 -1687 -2068 2266 1473 -2680 -767 2875 9 -2872 757 2635 -1474 -2221 2084
1763 2084 1633 -2572 -958 2864 190 -2988 549 2897 -1299 -2631 1928 2169 -2479 -1563 2855 856
1779 856 -3066 -72 3075 -738 -2911 1494 2541 -2183 -2025 2735 1370 -3124 -614 3298 -188
1794 -188 -3275 973 3017 -1708 -2566 2331 1949 -2805 -1216 3081 408 -3197 408 3082 -1194 -2800
1810 -2800 1846 2341 -2399 -1754 2757 1078 -2957 -364 2956 -345 -2778 1033 2457 -1615 -1990 2086
1826 2086 1436 -2416 -810 2577 178 -2587 461 2412 -1036 -2090 1501 1635 -1875 -1087 2054 478
1842 478 -2117 132 2005 -714 -1754 1210 1356 -1587 -904 1791 375 -1861 142 1740 -641 -1504
1858 -1504 1039 1121 -1362 -670 1566 170 -1604 343 1521 -809 -1303 1211 1001 -1505 -585 1700
1874 1700 129 -1740 361 1638 -851 -1428 1281 1081 -1657 -654 1892 136 -2046 404 2024
1889 2024 -975 -1868 1475 1526 -1929 -1090 2247 509 -2445 120 2469 -788 -2317 1441 2024 -1996
1905 -1996 -1568 2460 1018 -2772 -373 2910 -310 -2870 999 2666 -1618 -2285 2167 1775 -2584 -1171
1921 -1171 2869 483 -2993 215 2959 -908 -2782 1538 2428 -2106 -1974 2514 1374 -2805 -736
1936 -736 2926 34 -2900 645 2701 -1294 -2351 1852 1873 -2279 -1291 2578 662 -2705 -22 2655
1952 2655 -610 -2452 1165 2096 -1614 -1632 1949 1100 -2139 -528 2196 -46 -2100 567 1891 -1009
1968 -1009 -1599 1357 1203 -1599 -784 1699 337 -1685 89 1556 -479 -1331 802 1024 -1054 -663
1984 -663 1197 264 -1221 112 1152 -455 -972 746 714 -942 -377 1049 13 -1023 374 904 -697
2001 -697 -673 982 361 -1172 10 1243 -404 -1212 774 1043 -1107 -771 1366 414 -1542 -8 1600
2018 1600 -438 -1554 870 1377 -1287 -1121 1613 759 -1866 -338 1997 -116 -2033 610 1929 -1063
2034 -1063 -1712 1500 1381 -1862 -952 2139 459 -2285 110 2319 -663 -2224 1203 1974 -1693 -1609
2050 -1609 2079 1141 -2349 -582 2485 -9 -2497 601 2337 -1168 -2051 1657 1659 -2046 -1171 2316
2066 2316 630 -2447 -77 2453 -469 -2312 973 2052 -1395 -1685 1749 1258 -1990 -769 2125
2081 2125 274 -2131 235 2034 -698 -1835 1108 1535 -1419 -1168 1635 748 -1741 -306 1708 -134
2097 -134 -1599 513 1376 -844 -1094 1094 724 -1229 -369 1260 4 -1175 314 1022 -577 -792 753
2114 753 518 -842 -224 850 -58 -770 317 628 -521 -431 670 221 -728 28 720 -257 -636 471
2132 471 491 -646 -273 755 12 -809 243 770 -536 -688 774 502 -996 -261 1119 -30 -1203
2149 -1203 360 1169 -693 -1044 1020 813 -1297 -512 1508 148 -1614 269 1637 -671 -1529 1071
2165 1071 1328 -1420 -1034 1706 643 -1874 -214 1969 -247 -1932 696 1801 -1138 -1560 1498 1238
2181 1238 -1809 -841 2011 394 -2122 69 2110 -549 -2001 995 1771 -1401 -1446 1713 1031 -1959
2197 -1959 -568 2086 90 -2092 417 1984 -861 -1753 1261 1438 -1580 -1046 1797 619 -1890 -148
2213 -148 1876 -311 -1758 702 1529 -1064 -1240 1316 883 -1512 -525 1569 131 -1565 218 1446
2229 1446 -562 -1271 830 1017 -1029 -725 1172 397 -1215 -79 1193 -210 -1076 486 908 -693
2245 -693 -668 851 419 -914 -130 892 -125 -795 357 631 -542 -423 654 185 -687 49 660 -289
2263 -289 -541 458 382 -596 -176 667 -39 -657 258 597 -467 -467 642 301 -756 -75 815 -129 -801 373
2283 373 743 -584 -600 785 433 -915 -195 1004 -80 -1031 339 988 -611 -854 870 665 -1074
2300 -1074 -420 1225 124 -1299 201 1278 -535 -1183 839 990 -1134 -742 1332 419 -1467 -71
2316 -71 1508 -313 -1444 657 1311 -980 -1077 1256 795 -1426 -456 1545 101 -1555 277 1497 -624
2333 -624 -1351 931 1116 -1198 -844 1381 511 -1508 -150 1531 -216 -1477 551 1328 -880 -1100 1136
2350 1136 804 -1309 -474 1414 108 -1429 256 1342 -583 -1176 871 936 -1082 -652 1244 331 -1284
2367 -1284 18 1268 -323 -1153 609 969 -839 -727 1030 472 -1110 -173 1128 -113 -1079 374
2383 374 959 -598 -791 786 566 -924 -327 981 57 -990 187 907 -435 -782 637 594 -768
2400 -768 -362 867 108 -883 120 833 -370 -697 567 526 -713 -308 801 76 -817 163 769 -376
2418 -376 -654 567 488 -705 -282 771 71 -801 139 757 -363 -655 529 495 -678 -342 750 123
2436 123 -801 72 764 -288 -699 477 563 -640 -412 745 192 -811 30 818 -251 -744 483 636
2454 636 -655 -460 800 242 -872 9 890 -255 -829 500 712 -716 -535 869 295 -974 -43
2471 -43 995 -225 -947 472 840 -702 -679 889 467 -1013 -217 1069 -44 -1076 314 1010 -549
2488 -549 -872 783 700 -955 -465 1085 219 -1147 74 1141 -350 -1062 619 908 -843 -702 1029
2505 1029 463 -1154 -164 1188 -142 -1167 424 1064 -714 -884 926 648 -1093 -380 1169 77
2521 77 -1196 216 1126 -497 -1005 735 819 -916 -583 1063 336 -1127 -52 1132 -206 -1064 450
2538 450 956 -664 -782 845 571 -951 -330 1022 77 -1021 157 946 -401 -843 579 669 -735
2555 -735 -466 827 235 -859 -24 826 -200 -747 392 609 -535 -426 633 249 -666 -40 649 -137
2573 -137 -578 303 489 -406 -343 496 189 -515 -26 512 -124 -445 264 357 -370 -243 446 102 -468 49 468
2594 468 -199 -407 333 316 -431 -195 498 31 -535 143 510 -308 -447 457 332 -594 -166 686 -17 -713
2614 -713 232 696 -422 -592 621 473 -758 -274 877 71 -920 164 910 -409 -837 626 715 -833
2632 -833 -546 976 314 -1067 -80 1112 -185 -1091 437 1002 -683 -858 886 673 -1059 -435 1173
2649 1173 174 -1215 96 1220 -388 -1127 651 984 -872 -770 1074 531 -1175 -247 1237 -32
2665 -32 -1230 347 1146 -600 -989 833 784 -1007 -548 1104 271 -1169 0 1137 -265 -1062 506
2682 506 914 -705 -758 856 521 -957 -295 1009 69 -983 178 928 -373 -802 542 661 -652
2699 -652 -478 761 281 -778 -82 761 -105 -687 267 584 -396 -437 487 277 -524 -128 507 -37 -464 150
2719 150 364 -267 -253 306 110 -335 11 289 -135 -239 214 149 -282 -44 298 -65 -283 186 253 -261 -169
2740 -169 361 69 -407 61 424 -187 -404 338 346 -439 -250 547 128 -625 33 639 -211 -642 381 567
2760 567 -546 -473 692 308 -822 -126 882 -98 -897 318 850 -544 -750 749 595 -893 -382 1015
2778 1015 161 -1072 113 1075 -346 -1014 594 898 -805 -715 978 517 -1092 -253 1173 2 -1180
2795 -1180 245 1123 -506 -1025 733 845 -945 -648 1078 400 -1172 -138 1195 -138 -1154 393
2811 393 1045 -627 -889 832 698 -964 -444 1062 203 -1084 65 1050 -299 -928 502 800 -680
2828 -680 -613 804 424 -871 -202 901 -7 -841 207 767 -376 -656 511 500 -608 -346 656 168
2846 168 -675 -19 636 -149 -578 272 456 -363 -340 434 204 -460 -68 444 -58 -370 175 309 -256 -184 300
2867 300 74 -291 47 270 -138 -190 229 111 -277 10 292 -118 -267 228 209 -325 -131 383 6 -422 107
2888 107 405 -230 -379 337 301 -445 -205 519 83 -574 49 586 -201 -549 368 501 -482 -376 619 253
2908 253 -691 -94 745 -76 -736 284 705 -443 -605 618 464 -742 -308 833 110 -877 101 852
2926 852 -317 -800 504 681 -680 -530 804 340 -902 -127 926 -77 -914 289 851 -483 -721
2943 -721 653 580 -776 -396 885 213 -897 14 915 -216 -836 409 748 -576 -601 705 433 -790
2961 -790 -234 841 21 -828 162 761 -348 -654 496 518 -620 -349 680 170 -692 9 668 -174 -597
2980 -597 311 493 -425 -355 512 220 -527 -70 536 -62 -483 187 435 -290 -328 377 217 -414 -103 442 -16
3001 -16 -422 155 366 -245 -283 318 188 -369 -80 391 -44 -375 151 308 -260 -237 330 119 -372 -8 380
3022 380 -117 -355 221 296 -319 -201 396 101 -425 34 448 -171 -412 287 352 -385 -249 462 151 -507 -14
3043 -14 525 -115 -528 243 461 -360 -377 460 276 -538 -151 579 5 -606 132 564 -280 -510 393 408 -513
3064 -513 -304 583 146 -619 7 627 -165 -576 321 514 -436 -392 544 254 -607 -98 632 -68 -608 206
3084 206 551 -346 -455 456 331 -538 -214 570 63 -592 78 558 -220 -512 348 409 -448 -317 514 177
3104 177 -550 -39 549 -97 -513 229 447 -342 -357 428 246 -480 -111 496 -18 -477 158 447 -262 -343 357
3125 357 242 -401 -131 436 1 -430 118 387 -242 -327 307 222 -383 -127 404 2 -402 97 368 -218 -316
3146 -316 285 227 -358 -149 396 35 -417 78 412 -183 -351 272 287 -354 -184 406 84 -425 32 433 -158
3167 -158 -394 254 322 -364 -237 417 110 -460 -8 456 -137 -433 238 358 -357 -289 398 153 -477 -50 462
3188 462 -82 -465 205 411 -310 -337 398 239 -452 -119 492 19 -494 114 464 -213 -408 324 334 -412 -244
3209 -244 461 109 -495 1 485 -122 -460 224 389 -349 -313 404 182 -467 -77 473 -62 -457 163 399
3229 399 -281 -330 352 226 -407 -113 442 3 -425 122 400 -220 -331 310 253 -361 -157 405 49 -412 53
3250 53 376 -171 -353 229 267 -335 -215 354 88 -401 -12 385 -116 -368 181 307 -289 -239 344 136 -385
3271 -385 -41 372 -64 -372 160 308 -246 -240 309 153 -350 -59 367 -37 -349 150 312 -226 -248 290 162
3292 162 -337 -82 351 -26 -350 112 311 -213 -278 259 197 -330 -132 344 24 -372 53 339 -154 -314 240
3313 240 236 -304 -176 352 77 -370 18 361 -123 -330 214 272 -279 -189 337 97 -366 -2 362 -108 -341
3334 -341 190 277 -284 -214 320 113 -379 -29 356 -92 -358 158 301 -260 -244 314 157 -363 -75 370 -27
3355 -27 -391 122 348 -208 -303 292 231 -335 -137 380 54 -399 65 378 -153 -344 242 283 -325 -201 374
3376 374 95 -392 2 392 -108 -372 195 308 -289 -240 349 140 -389 -46 388 -71 -388 154 331 -254
3396 -254 -282 313 186 -373 -105 379 -6 -392 89 368 -181 -316 262 254 -312 -176 365 82 -382 9 375
3417 375 -112 -351 177 296 -266 -240 312 146 -360 -64 348 -34 -349 115 313 -201 -250 250 168 -303 -88
3438 -88 315 -4 -297 84 288 -148 -231 209 170 -246 -105 278 31 -275 47 254 -111 -224 168 184 -208
3459 -208 -118 243 51 -253 6 244 -89 -226 142 177 -193 -132 201 53 -241 9 231 -92 -205 141 162
3480 162 -192 -113 223 37 -231 41 233 -107 -201 173 160 -207 -90 249 26 -267 47 252 -121 -240 179
3501 179 173 -243 -130 264 53 -300 4 294 -89 -292 154 247 -226 -198 281 119 -341 -53 341 -42 -332
3522 -332 108 321 -191 -268 275 193 -315 -115 355 30 -367 67 351 -156 -313 235 254 -311 -181 337 82
3543 82 -382 -7 358 -101 -342 173 282 -262 -235 305 134 -352 -81 360 -17 -361 95 333 -190 -281 258
3564 258 232 -308 -149 352 68 -341 23 360 -103 -316 179 280 -237 -198 293 132 -311 -34 319 -42 -298
3585 -298 112 265 -191 -211 226 130 -273 -77 269 -16 -265 75 231 -148 -196 182 131 -218 -71 237 14
3606 14 -228 47 220 -93 -176 155 149 -185 -85 208 38 -206 39 211 -80 -173 142 146 -175 -84 196 40 -207
3629 -207 20 192 -92 -180 133 125 -188 -86 205 15 -216 35 201 -103 -170 167 132 -197 -79 224 24 -225
3651 -225 58 236 -100 -199 153 173 -192 -119 230 60 -252 17 251 -58 -239 135 211 -184 -168 223 105 -253
3673 -253 -51 265 -31 -281 97 252 -166 -205 203 158 -247 -100 273 8 -287 60 267 -124 -211 187 185 -241
3695 -241 -110 273 58 -272 30 281 -87 -241 148 209 -199 -151 238 83 -275 -26 262 -50 -267 107 232
3716 232 -169 -202 207 129 -254 -83 266 6 -283 72 250 -133 -218 184 178 -231 -96 259 47 -270 47 257
3738 257 -107 -218 168 186 -207 -120 252 53 -257 19 255 -78 -225 141 185 -197 -137 231 70 -254 -15
3759 -15 246 -56 -247 116 207 -163 -187 216 114 -246 -47 267 -9 -247 89 250 -136 -197 195 166 -217 -87
3781 -87 271 37 -255 42 250 -113 -223 176 179 -210 -116 239 63 -249 26 251 -88 -234 142 187 -183 -136
3803 -136 213 78 -225 -18 237 -42 -225 110 199 -148 -161 207 117 -217 -52 245 3 -236 70 233 -109
3824 -109 -181 172 154 -187 -83 224 29 -221 36 214 -98 -179 134 157 -184 -99 187 54 -198 7 197 -76
3846 -76 -168 108 127 -154 -82 183 33 -192 21 178 -60 -167 119 141 -143 -80 191 54 -182 9 200 -52
3868 -52 -158 122 157 -139 -107 184 71 -200 -2 205 -50 -191 105 172 -152 -128 193 82 -214 -26 216 -38
3890 -38 -211 82 188 -149 -147 203 117 -220 -44 248 -5 -229 84 214 -135 -184 197 147 -210 -74 251 31
3912 31 -250 46 253 -93 -221 165 192 -203 -142 243 74 -267 -25 274 -60 -275 109 247 -179 -184 220 140
3934 140 -253 -76 287 2 -270 77 277 -128 -217 197 185 -215 -98 264 56 -261 22 267 -81 -234 145
3955 145 198 -192 -137 218 84 -243 -24 246 -33 -236 97 206 -151 -171 192 122 -209 -59 228 1 -237
3976 -237 43 218 -96 -181 159 146 -170 -85 212 45 -205 21 209 -69 -172 123 155 -144 -89 192 53 -179
3998 -179 11 177 -51 -153 100 129 -129 -88 149 40 -167 -6 158 -55 -135 93 109 -121 -77 162 41 -158
4020 -158 3 159 -55 -154 97 140 -114 -84 162 71 -157 2 176 -42 -159 104 149 -122 -103 167 55 -175
4042 -175 -11 178 -40 -172 79 147 -137 -122 165 70 -193 -38 193 -46 -185 75 176 -112 -136 169 103 -187
4064 -187 -46 211 1 -197 56 203 -83 -167 154 143 -184 -92 224 43 -215 12 231 -65 -204 120 181
4085 181 -168 -144 205 84 -214 -27 218 -33 -223 91 187 -145 -168 183 118 -207 -47 231 2 -229 77
4106 77 223 -111 -172 184 147 -177 -77 234 35 -217 42 224 -72 -190 123 166 -174 -122 207 77 -224 -13
4128 -13 227 -40 -214 78 193 -143 -159 177 106 -202 -54 214 8 -218 50 194 -101 -174 146 129 -184 -69
4150 -69 205 39 -189 33 199 -68 -163 132 138 -144 -88 174 48 -177 8 191 -42 -168 97 140 -121 -107
4172 -107 158 69 -168 -9 177 -40 -169 65 150 -126 -119 145 90 -155 -32 181 0 -165 61 157 -97 -121
4194 -121 129 99 -140 -28 167 6 -154 51 151 -82 -107 132 88 -136 -38 144 -5 -143 46 139 -80 -127
4216 -127 117 79 -148 -52 150 13 -152 34 146 -69 -132 110 114 -129 -60 164 35 -157 25 188 -52 -146
4238 -146 108 133 -126 -85 166 56 -154 4 183 -40 -160 95 138 -129 -100 164 54 -173 -15 173 -40
4259 -40 -176 87 149 -126 -124 150 85 -183 -38 191 -9 -188 76 191 -101 -145 156 129 -171 -57 208 30
4281 30 -202 36 211 -64 -174 132 161 -168 -103 210 65 -211 1 219 -44 -211 94 173 -152 -137 182 97
4303 97 -202 -41 205 -16 -192 76 185 -109 -149 149 116 -173 -66 202 19 -184 49 195 -79 -158 128
4324 128 145 -142 -91 184 58 -186 0 192 -40 -181 97 157 -136 -125 154 85 -186 -27 184 -34 -191 64
4346 64 159 -109 -121 143 91 -151 -44 174 4 -179 59 169 -79 -115 140 99 -136 -40 172 9 -155 41
4368 41 160 -64 -126 102 103 -138 -59 152 20 -158 11 155 -58 -139 91 114 -131 -82 145 39 -157 3 173
4391 173 -38 -137 86 128 -104 -80 143 66 -151 5 169 -28 -129 89 126 -99 -75 151 61 -148 3 167
4413 167 -16 -150 77 130 -111 -102 128 73 -145 -33 155 -27 -166 55 147 -97 -120 135 86 -154 -42 169
4435 169 4 -173 42 172 -76 -148 129 118 -157 -80 195 43 -181 33 189 -67 -152 128 134 -148 -97 166
4457 166 46 -179 -6 182 -58 -169 100 149 -135 -113 158 62 -188 -21 189 -35 -187 78 165 -115 -131 153
4479 153 101 -178 -55 198 17 -189 49 202 -91 -148 150 141 -158 -80 200 48 -200 20 207 -68 -189 119
4501 119 153 -154 -110 169 59 -203 -9 191 -43 -195 87 156 -139 -134 169 94 -179 -27 200 -15 -178 71
4523 71 180 -96 -126 152 117 -162 -57 192 34 -175 39 186 -63 -154 115 139 -143 -99 165 43 -184 5
4545 5 174 -55 -168 76 143 -141 -114 146 71 -173 -19 169 -22 -157 73 141 -87 -107 135 85 -136 -19 168
4568 168 7 -138 58 150 -77 -102 124 89 -129 -31 154 1 -139 37 139 -83 -109 113 83 -126 -53 147
4590 147 5 -143 24 141 -63 -121 108 99 -116 -58 151 23 -156 27 156 -55 -121 113 115 -121 -61 170 31
4613 31 -146 28 164 -55 -112 101 112 -120 -76 162 43 -163 23 168 -58 -155 85 123 -138 -97 158 59 -170
4636 -170 -12 185 -39 -174 88 157 -115 -128 171 102 -181 -39 198 5 -186 56 202 -97 -147 148 129 -176
4658 -176 -72 204 34 -203 32 205 -68 -167 131 148 -165 -108 187 52 -204 -15 195 -46 -205 84 173
4679 173 -129 -135 177 102 -191 -51 209 5 -200 61 197 -80 -146 148 159 -160 -64 203 44 -194 12 207
4701 207 -61 -166 111 153 -139 -111 172 65 -186 -20 173 -45 -175 77 141 -116 -122 145 73 -156 -35 170
4723 170 -10 -164 66 139 -80 -110 137 92 -127 -26 161 22 -137 58 144 -65 -106 118 93 -125 -44 147
4745 147 14 -145 38 141 -70 -118 103 88 -128 -64 134 22 -147 30 140 -61 -115 104 101 -120 -51 152
4767 152 28 -153 19 149 -58 -116 102 116 -121 -63 146 35 -148 22 169 -50 -137 101 140 -113 -90 149
4789 149 75 -158 -5 171 -33 -167 67 141 -116 -122 148 93 -172 -42 180 1 -185 66 182 -86 -143 130
4811 130 119 -149 -75 181 29 -181 32 185 -64 -153 126 151 -122 -83 182 58 -187 -7 190 -41 -174 89
4833 89 143 -128 -124 152 76 -178 -46 185 -18 -177 59 167 -109 -141 146 103 -151 -62 184 23 -168 43 179
4856 179 -70 -135 134 139 -137 -72 181 41 -157 20 182 -49 -154 98 141 -121 -87 159 57 -166 -10 169
4878 169 -38 -145 84 138 -114 -110 141 72 -147 -25 172 -22 -163 70 153 -100 -119 141 99 -149 -34 190
4900 190 11 -175 48 177 -77 -126 135 113 -152 -57 183 19 -186 33 178 -73 -164 110 117 -145 -91 179
4922 179 35 -186 6 177 -48 -163 93 145 -124 -115 164 72 -168 -10 195 -11 -166 75 174 -98 -118 153
4944 153 110 -158 -50 191 24 -174 41 183 -59 -148 121 115 -144 -84 178 36 -171 8 169 -67 -153 95
4966 95 135 -128 -96 148 61 -160 4 160 -23 -142 92 144 -96 -96 134 72 -143 -14 155 -11 -136 67 134
4989 134 -79 -96 118 73 -135 -30 162 0 -145 46 138 -88 -109 116 74 -137 -57 138 4 -150 33 133
5011 133 -75 -111 119 100 -140 -43 160 15 -143 45 151 -67 -119 121 106 -129 -50 163 29 -147 21 164
5033 164 -65 -132 107 116 -128 -79 167 51 -174 -3 173 -51 -171 91 149 -136 -107 174 80 -189 -17 214
5055 214 -9 -203 69 188 -113 -146 164 122 -171 -58 217 36 -198 39 217 -61 -169 139 158 -160 -103
5076 -103 194 69 -194 -6 206 -40 -198 92 181 -136 -146 175 90 -192 -48 198 -3 -199 50 197 -96
5097 -96 -156 134 137 -154 -79 197 47 -191 14 198 -47 -157 98 152 -132 -90 166 74 -169 -14 185 -15 -159
5120 -159 75 149 -104 -105 120 82 -139 -32 155 -6 -150 39 121 -76 -113 100 76 -118 -45 125 5 -124 39
5143 39 119 -46 -80 105 79 -102 -27 132 15 -97 47 125 -58 -90 110 71 -99 -27 135 3 -120 45 116
5166 116 -69 -102 100 68 -122 -35 132 3 -142 34 121 -71 -103 107 83 -129 -49 146 22 -142 39 150
5188 150 -58 -116 112 114 -122 -68 167 41 -150 20 180 -44 -156 94 150 -127 -106 158 77 -180 -32 187
5210 187 -23 -201 66 173 -109 -146 145 103 -165 -59 190 21 -191 38 198 -65 -167 121 149 -139 -97
5231 -97 192 67 -180 10 209 -22 -170 89 184 -107 -113 162 105 -167 -51 190 2 -177 49 165 -77 -146
5253 -146 114 117 -151 -88 173 42 -182 12 175 -45 -156 95 138 -111 -81 145 72 -145 -10 169 -11 -133
5275 -133 64 134 -71 -90 132 78 -120 -31 123 1 -120 47 130 -62 -97 87 79 -122 -37 136 -9 -122 27
5298 27 109 -61 -88 103 74 -111 -35 135 0 -126 38 125 -58 -91 99 82 -97 -47 132 19 -119 33 133
5321 133 -52 -98 102 94 -114 -42 142 22 -132 20 121 -49 -118 73 85 -116 -75 127 36 -142 9 140 -40
5344 -40 -135 68 118 -109 -85 122 55 -141 -11 163 -11 -135 65 132 -88 -105 143 96 -144 -31 164 4 -150
5367 -150 48 160 -82 -128 117 105 -144 -61 148 23 -168 12 156 -61 -140 92 123 -118 -84 152 52 -151
5389 -151 -10 164 -19 -153 67 132 -87 -101 129 86 -137 -28 165 13 -157 42 151 -78 -109 118 101 -126
5411 -126 -49 151 20 -151 25 138 -57 -134 87 106 -123 -80 134 37 -156 -9 144 -52 -133 74 118 -95
5433 -95 -82 132 50 -132 -10 149 -17 -125 70 135 -89 -79 122 82 -127 -21 146 -10 -130 48 129 -72
5455 -72 -100 108 73 -139 -46 142 6 -151 36 131 -76 -121 104 83 -128 -62 131 16 -144 34 157 -45 -114
5478 -114 99 110 -108 -61 154 52 -133 10 171 -25 -118 86 123 -96 -82 129 64 -138 -15 143 -19 -146
5500 -146 40 119 -80 -103 110 72 -131 -43 151 11 -146 45 129 -71 -126 115 97 -127 -50 144 25 -139 31
5523 31 147 -42 -119 100 114 -108 -58 146 42 -126 4 146 -39 -121 73 108 -112 -83 122 51 -140 -16 137
5546 137 -17 -127 56 128 -69 -98 125 82 -125 -22 156 9 -136 60 140 -69 -107 110 87 -114 -34 148
5568 148 18 -124 42 141 -57 -109 100 98 -109 -52 128 32 -127 13 129 -45 -122 83 93 -107 -62 125 40
5591 40 -138 -2 137 -28 -125 64 110 -88 -75 121 66 -124 -19 153 -2 -130 63 139 -79 -97 122 77 -127
5614 -127 -24 145 4 -133 49 147 -69 -112 114 89 -128 -54 141 29 -149 20 135 -53 -121 90 107 -111
5636 -111 -72 135 45 -153 -2 142 -32 -114 78 109 -89 -75 138 75 -120 -6 164 4 -133 58 139 -77
5658 -77 -97 120 79 -141 -34 140 -1 -141 24 134 -66 -119 104 95 -118 -67 142 33 -141 15 145 -34
5680 -34 -116 80 109 -96 -74 137 62 -122 -2 143 -15 -114 77 128 -65 -80 127 70 -118 -18 146 -4 -116
5703 -116 55 114 -78 -93 104 73 -115 -44 129 -1 -131 37 118 -66 -98 90 88 -112 -49 131 23 -121 33
5726 33 135 -36 -99 80 97 -79 -42 128 37 -106 8 135 -29 -106 73 102 -78 -59 104 41 -102 -8 115
5749 115 -24 -107 56 99 -89 -86 103 50 -117 -23 124 -16 -125 46 113 -73 -79 114 68 -120 -21 140 0 -118
5773 -118 57 137 -59 -87 112 82 -108 -37 138 16 -121 24 132 -49 -120 81 92 -103 -66 123 33 -129 -4
5796 -4 149 -34 -123 69 110 -90 -82 130 56 -123 -9 147 -6 -145 65 139 -72 -91 128 90 -121 -31 155 14
5820 14 -127 48 135 -45 -103 105 97 -121 -64 140 32 -144 5 150 -45 -120 77 115 -105 -86 116 53 -129
5843 -129 -12 133 -10 -119 59 123 -77 -86 107 66 -114 -25 148 10 -121 48 127 -41 -95 99 90 -101 -36
5866 -36 135 27 -116 18 127 -44 -94 72 79 -112 -50 112 13 -122 18 111 -31 -104 71 88 -89 -49 115
5889 115 48 -104 8 122 -11 -100 72 98 -72 -56 110 52 -100 -4 117 -9 -102 52 113 -61 -65 106 59 -101
5913 -101 -15 116 -16 -112 49 107 -77 -81 91 67 -111 -32 130 6 -131 37 125 -52 -91 87 86 -102 -38 140
5937 140 24 -121 34 141 -38 -111 97 104 -91 -59 128 51 -118 -2 129 -28 -117 71 120 -100 -86 107 62
5960 62 -129 -33 132 -6 -126 38 118 -69 -96 105 84 -118 -45 142 14 -127 30 138 -39 -104 104 112 -97
5983 -97 -57 139 38 -111 4 138 -11 -104 71 111 -79 -72 111 51 -113 -22 129 -14 -122 54 107 -77 -88
6006 -88 96 62 -103 -26 131 -2 -104 46 117 -59 -94 102 87 -84 -29 130 16 -112 42 125 -41 -89 84
6029 84 97 -86 -38 127 25 -106 15 120 -27 -116 76 104 -81 -53 107 33 -113 5 116 -34 -111 65 96
6052 96 -69 -73 112 44 -113 -8 134 2 -100 56 115 -57 -76 110 63 -100 -25 130 3 -120 40 123 -56
6075 -56 -84 95 84 -110 -46 118 29 -119 21 122 -45 -106 76 87 -108 -60 123 40 -124 1 132 -24 -114
6098 -114 66 112 -88 -64 104 73 -109 -17 132 14 -106 53 119 -54 -77 97 71 -101 -36 121 0 -117 27
6121 27 106 -61 -94 80 75 -98 -41 114 26 -109 25 125 -44 -87 64 79 -85 -44 106 35 -109 8 122 -14
6145 -14 -92 68 90 -69 -50 100 57 -98 -9 120 -1 -93 52 105 -67 -63 97 55 -101 -21 110 -12 -103 33
6169 33 104 -68 -83 84 69 -103 -29 124 6 -106 38 121 -51 -82 84 82 -93 -32 120 33 -96 25 124 -25
6193 -25 -90 82 95 -82 -50 131 51 -107 -3 123 -11 -107 53 101 -75 -74 93 57 -108 -30 126 -10 -119 32
6217 32 109 -65 -93 94 68 -96 -33 126 17 -110 28 115 -39 -90 89 96 -76 -40 130 34 -105 8 121 -24
6241 -24 -98 67 93 -88 -60 103 45 -108 -20 101 -14 -105 35 90 -67 -73 82 63 -100 -34 103 4 -104 46
6265 46 113 -34 -69 85 68 -79 -22 104 19 -92 22 105 -32 -73 72 79 -71 -33 107 22 -100 11 90 -42
6289 -42 -96 52 65 -90 -54 91 24 -104 8 100 -25 -94 68 75 -60 -58 83 37 -91 -10 116 -25 -84 51 96
6314 96 -56 -56 98 56 -76 -11 112 6 -93 42 101 -48 -71 80 66 -88 -29 102 12 -103 17 96 -55 -96
6338 -96 71 81 -87 -47 102 29 -97 6 118 -24 -80 66 101 -67 -47 108 49 -94 -7 120 -2 -88 52
6361 52 109 -46 -61 97 64 -93 -23 107 7 -92 34 104 -45 -81 74 73 -101 -42 88 4 -110 15 103 -28
6385 -28 -88 58 70 -77 -46 99 35 -90 7 114 -22 -91 64 91 -54 -54 98 47 -94 -7 102 -12 -104 45
6409 45 87 -60 -72 74 47 -95 -41 93 9 -93 21 86 -52 -90 67 74 -81 -29 103 22 -95 20 98 -43
6433 -43 -75 68 79 -71 -32 105 25 -79 17 116 -26 -75 63 84 -64 -46 95 41 -90 -11 86 -7 -88 35 73
6458 73 -71 -75 74 46 -87 -24 97 -1 -85 33 88 -43 -64 74 68 -82 -29 99 16 -83 31 110 -30 -74 68
6483 68 67 -69 -34 101 23 -84 10 95 -28 -90 60 75 -65 -45 81 45 -91 -6 88 -24 -94 38 76 -58 -76
6508 -76 79 44 -75 -15 111 12 -80 35 98 -45 -63 86 69 -71 -11 105 19 -82 29 102 -42 -65 77 72 -71
6533 -71 -30 98 18 -100 16 97 -37 -75 56 63 -73 -45 86 28 -95 -10 90 -28 -91 55 84 -48 -59 93
6557 93 42 -87 -14 107 3 -81 55 95 -42 -57 85 70 -71 -17 103 13 -90 25 89 -30 -73 62 66 -85
6581 -85 -43 95 21 -97 7 88 -36 -75 59 69 -71 -49 93 43 -74 0 110 -19 -75 46 87 -55 -61 82
6605 82 57 -68 -6 106 11 -66 37 95 -45 -55 72 56 -78 -25 89 12 -90 15 78 -46 -79 56 65 -69 -37
6630 -37 84 20 -80 14 93 -27 -77 63 75 -50 -35 88 34 -64 8 106 2 -74 62 78 -56 -42 85 47 -71
6655 -71 -1 95 -5 -72 41 82 -32 -62 65 44 -87 -25 81 -1 -88 20 67 -45 -73 59 61 -78 -28 84 20
6680 20 -86 30 92 -31 -66 65 70 -65 -27 97 27 -69 18 95 -14 -68 60 72 -62 -41 81 36 -86 -8 87
6705 87 -6 -83 35 79 -51 -59 70 52 -77 -25 92 0 -96 32 84 -43 -71 70 73 -66 -25 93 25 -82 25
6730 25 105 -31 -63 61 81 -50 -29 93 32 -84 5 82 -20 -76 48 59 -78 -50 78 32 -75 -12 83 -6 -82
6755 -82 32 68 -51 -62 79 52 -64 -6 97 9 -71 26 102 -27 -57 66 58 -49 -6 81 31 -59 25 92 -9 -53
6781 -53 65 71 -57 -20 77 24 -72 27 84 -28 -69 43 55 -62 -53 72 21 -83 -1 80 -9 -77 49 83 -52 -31 75
6808 75 51 -78 -2 94 7 -64 34 83 -40 -48 79 50 -69 -17 81 8 -70 30 84 -43 -66 61 59 -75 -39 80 8
6835 8 -84 13 80 -34 -84 59 58 -65 -45 71 25 -74 8 100 -12 -66 58 74 -45 -41 86 44 -71 -3 90 2 -73
6862 -73 37 89 -36 -48 62 54 -74 -22 83 3 -84 16 80 -37 -80 47 54 -70 -36 83 16 -83 13 99 -8 -72
6888 -72 48 75 -48 -37 86 33 -75 8 93 4 -64 50 84 -51 -33 90 38 -61 4 87 2 -62 37 74 -45 -55
6914 -55 63 41 -71 -17 78 -6 -77 21 80 -35 -61 59 50 -61 -21 91 25 -70 21 92 -20 -49 60 64 -54 -25 87
6941 87 23 -68 19 84 -21 -65 45 71 -56 -39 75 30 -77 0 82 -11 -82 36 61 -53 -48 78 43 -70 -12 82
6967 82 14 -76 30 80 -31 -50 73 62 -60 -19 91 20 -68 34 95 -16 -62 59 65 -56 -21 78 28 -80 14 84
6993 84 -14 -75 42 66 -63 -43 76 25 -81 -7 93 -10 -79 35 70 -45 -50 74 44 -59 -15 82 7 -64 30 75
7019 75 -19 -45 75 66 -62 -15 87 26 -62 21 90 -29 -66 52 54 -52 -41 68 19 -76 10 70 -26 -77 42 63 -62
7046 -62 -39 72 36 -65 4 83 -3 -62 42 69 -42 -37 78 43 -50 0 87 24 -60 41 86 -28 -37 83 52 -54 -5
7073 -5 90 6 -66 22 76 -29 -58 54 48 -69 -36 79 7 -72 -1 76 -20 -66 53 63 -57 -40 71 31 -61 12 92 -8
7101 -8 -59 57 76 -46 -22 86 39 -66 4 84 3 -60 40 84 -30 -41 69 47 -61 -21 78 0 -76 23 66 -31 -68
7128 -68 45 40 -66 -34 80 24 -74 13 90 -8 -56 51 62 -49 -25 88 40 -60 15 93 2 -58 52 76 -44 -41 77
7155 77 42 -73 -1 81 -7 -72 20 61 -37 -53 54 37 -71 -25 79 -1 -79 19 66 -32 -57 59 55 -50 -9 84 19 -68
7183 -68 25 89 -26 -50 59 69 -51 -19 100 40 -61 19 87 -8 -57 46 61 -44 -32 65 23 -75 0 79 -5 -72 42
7210 42 61 -51 -42 61 38 -62 -9 87 3 -63 37 78 -30 -53 63 58 -50 -9 85 6 -69 25 79 -21 -60 61 62
7237 62 -50 -39 84 20 -70 20 86 -17 -67 43 55 -51 -48 73 19 -69 -15 78 -23 -75 37 60 -48 -46 69 41
7263 41 -65 -9 86 7 -67 36 78 -24 -43 47 44 -59 -22 79 9 -73 27 78 -29 -58 44 51 -53 -44 67 10 -76
7290 -76 19 69 -17 -64 32 64 -54 -36 70 26 -75 7 78 -7 -64 46 63 -39 -34 73 46 -59 3 82 4 -61 34
7317 34 66 -26 -49 59 51 -63 -21 74 -5 -65 17 71 -34 -55 50 46 -65 -33 64 11 -67 6 70 -23 -59 54 54 -50
7345 -50 -36 72 23 -59 6 76 -3 -59 50 64 -40 -49 72 48 -59 4 84 -4 -64 24 62 -41 -46 52 28 -66 -30 66
7373 66 9 -73 14 68 -29 -57 53 53 -54 -30 70 18 -66 11 71 -11 -55 66 70 -33 -32 63 30 -53 2 71 4 -62 33
7402 33 57 -35 -44 59 26 -62 -9 67 9 -74 21 51 -43 -43 48 37 -75 -25 65 -8 -66 12 65 -26 -41 55 47 -54 -19 72
7432 72 20 -58 22 75 -20 -46 57 61 -44 -26 74 17 -68 9 80 -14 -55 26 43 -49 -44 56 21 -61 -9 62 -6 -69 22
7461 22 54 -39 -46 56 32 -52 -10 76 4 -55 28 67 -20 -40 62 50 -46 -19 79 27 -50 25 73 -14 -40 50 58 -45 -35 60
7491 60 17 -74 1 61 -20 -58 31 50 -53 -43 53 26 -56 0 67 5 -54 33 63 -35 -33 58 44 -46 -7 68 12 -41 33 71
7521 71 -19 -31 56 47 -43 -6 73 12 -61 12 69 -21 -48 33 43 -56 -33 62 18 -69 -4 62 -22 -65 23 59 -41 -31 57 29
7551 29 -50 2 79 10 -52 37 62 -25 -33 69 45 -44 1 75 18 -52 26 63 -26 -47 44 46 -50 -13 64 7 -58 4 57 -19 -57
7582 -57 37 37 -54 -50 57 9 -77 -7 72 -23 -49 41 54 -38 -28 61 34 -43 2 68 8 -45 40 69 -28 -21 67 51 -44 -16 67
7613 67 10 -60 13 60 -22 -47 43 34 -46 -17 52 5 -63 16 58 -22 -54 41 38 -45 -21 56 29 -54 -8 68 -23 -46 42 60 -19
7644 -19 -32 53 29 -43 5 69 -4 -43 32 52 -25 -37 50 29 -52 -8 42 -12 -59 20 49 -31 -42 44 33 -62 -20 64 3 -54
7674 -54 22 59 -23 -40 46 56 -42 -15 66 24 -39 15 62 -16 -45 44 51 -32 -30 65 27 -60 -4 67 -24 -55 30 60 -36 -40 46 25
7706 25 -66 -15 68 -8 -66 14 58 -32 -39 56 35 -43 -6 67 16 -47 24 63 -21 -44 50 51 -35 -20 65 24 -48 9 72 -4 -37
7737 -37 46 48 -31 -31 54 23 -57 -2 64 -4 -52 26 52 -28 -38 50 31 -49 -13 53 4 -49 25 49 -19 -39 39 48 -35 -7 73 17
7769 17 -33 23 58 -6 -36 38 40 -37 -11 52 22 -49 1 42 -17 -46 37 35 -38 -21 51 19 -53 -4 48 -9 -45 29 36 -36 -27 48
7801 48 22 -48 -7 62 -9 -40 29 57 -23 -29 59 26 -45 -4 56 1 -40 34 60 -29 -36 48 31 -51 -22 51 3 -71 2 54 -24
7832 -24 -57 37 31 -58 -38 44 17 -63 -4 57 -14 -44 39 49 -21 -35 63 32 -44 -2 65 3 -47 23 67 -35 -27 48 36 -55 -7
7863 -7 60 15 -42 9 53 -15 -46 32 28 -52 -28 46 5 -63 -4 45 -21 -49 28 47 -25 -27 41 30 -33 6 57 -1 -31 35 45 -22
7895 -22 -24 39 29 -40 -7 57 10 -41 27 46 -19 -41 35 23 -41 -15 42 -2 -47 -3 36 -19 -43 24 24 -36 -22 41 13 -40 1
7926 1 43 -5 -28 43 41 -24 -11 42 17 -30 8 54 -15 -30 36 43 -34 -21 46 11 -50 3 48 -13 -43 25 43 -22 -40 35 13 -46
7958 -46 3 50 -2 -49 24 47 -33 -33 43 25 -38 -7 53 3 -43 17 45 -4 -35 39 42 -36 -15 63 16 -36 5 58 -11 -55 32
7989 32 40 -35 -36 44 24 -55 -12 52 -7 -50 21 44 -47 -46 39 32 -38 -21 57 16 -42 8 60 -12 -31 39 39 -30 -17 56 27 -37 4
8022 4 62 -9 -33 35 44 -20 -22 45 15 -39 -3 42 -16 -34 20 40 -29 -25 34 11 -45 -16 34 -6 -44 18 28 -17 -34 29 23 -32 -4
8055 -4 47 14 -34 14 49 -4 -19 36 38 -25 -5 41 6 -39 11 40 -12 -33 20 25 -31 -28 37 19 -38 3 49 -16 -42 24 35 -35
8087 -35 -23 39 26 -40 -4 49 -8 -41 13 51 -14 -21 40 23 -46 12 56 -4 -31 27 48 -19 -33 31 37 -38 -15 40 5 -54 5
8118 5 44 -24 -40 24 30 -34 -31 42 18 -46 0 50 -12 -38 28 46 -30 -10 58 25 -36 0 51 14 -45 33 57 -16 -31 42 43 -28
8150 -28 -9 55 9 -50 9 40 -17 -28 26 28 -42 -19 44 8 -41 -4 45 -20 -36 21 23 -32 -18 49 17 -36 4 51 -11 -17 35 34
8182 34 -11 -15 43 24 -26 3 53 -6 -36
8191c6
$$ Imaginary data points
##PAGE= N=2
##DATA TABLE= (X++(I..I)), XYDATA
0 0 0 0 0 0 0 0 0 0 0 0 8 -8 8 -8 8 -16 16 -24 25 -32 40 -48 56 -72 80 -96 112 -128 145 -168 192 -217 248
33 248 -281 318 -358 401 -449 504 -561 625 -695 771 -854 943 -1043 1150 -1269 1398 -1539
50 -1539 1698 -1868 2060 -2273 2512 -2781 3087 -3437 3844 -4324 4900 -5607 6495 -7649 9221
65 9221 -11497 15096 -21643 37354 -153163 -3865 364252 -48918 -263720 50116 206897
76 206897 -115869 -133194 153938 105048 -188015 -66374 175716 29408 -161051 36828
86 36828 144391 -95813 -156153 138902 171502 -136099 -179496 104875 151307 -59324 -96782
97 -96782 31403 29564 -22726 19911 26836 -44508 -20258 48068 -3510 -51550 39159 64724
109 64724 -65335 -84999 68240 93501 -47673 -75473 21251 29043 -7937 29273 16031 -77866
121 -77866 -36350 102870 51417 -107332 -48676 105224 30131 -108918 -9441 118757 455
132 455 -123405 -5712 110072 15007 -75764 -13831 31338 -4616 5815 34137 -23513 -59726
144 -59726 22343 68810 -13150 -59928 7849 42488 -9803 -28546 12284 23377 -5140 -22316
156 -22316 -15928 15689 45111 1988 -70211 -26570 81337 46563 -77682 -51098 67297 37364
168 37364 -60115 -11854 60539 -14899 -64550 36217 64041 -52750 -53478 70301 34772 -92968
180 -92968 -15335 118714 2510 -139444 2364 146755 -4482 -137478 11368 115916
190 115916 -26837 -90192 48306 66815 -68853 -46847 82280 26846 -87360 -3335 87593
201 87593 -23315 -87527 48100 88458 -64798 -87229 70285 78754 -66556 -60101 58955
212 58955 33255 -52195 -3962 47518 -21629 -42238 40673 33147 -53860 -19151 63774 2853
224 2853 -71473 11669 75349 -21527 -72125 27136 59751 -31270 -39411 36819 15321 -44276
236 -44276 7660 51401 -26478 -54952 40835 52975 -52205 -46103 61632 36630 -68477 -26739
248 -26739 70739 16996 -66787 -6244 56957 -6721 -43540 21772 29735 -36795 -17690 48876
260 48876 7873 -55678 767 56762 -9044 -53174 16888 46593 -23010 -37912 26034 27183
272 27183 -25498 -14203 22280 -460 -17995 15085 13781 -27402 -9876 35379 5550 -38310
284 -38310 -103 36678 -6533 -31636 13522 24153 -19670 -14706 24131 3533 -26729 8868
296 8868 27829 -21342 -27702 32385 26224 -40496 -22751 45042 16834 -46022 -8306 44121 -2033
309 -2033 -39825 13097 33544 -23681 -25404 32971 15684 -40425 -5025 45650 -5668 -48192
321 -48192 15415 47509 -23578 -43293 29861 35565 -34347 -25007 37053 12661 -37959 324
333 324 36942 -12835 -33896 24082 28971 -33365 -22491 40150 14984 -43897 -6807 44379 -1564
346 -1564 -41520 9920 35771 -17818 -27683 24871 18138 -30512 -7855 34246 -2421 -35682 12051
359 12051 34658 -20456 -31200 27122 25530 -31653 -17969 33800 8988 -33542 747 31017
371 31017 -10568 -26564 19617 20572 -27124 -13429 32547 5669 -35342 2293 35431 -9887
383 -9887 -32739 16733 27625 -22349 -20421 26528 11827 -28948 -2432 29580 -6953 -28333
395 -28333 15664 25305 -23062 -20618 28646 14554 -32094 -7447 33212 -280 -31994 8158
407 8158 28584 -15654 -23285 22239 16454 -27449 -8636 30830 362 -32099 7854 31124 -15409
420 -15409 -27851 21913 22585 -26844 -15575 30022 7454 -31175 1317 30331 -9948 -27546
432 -27546 17894 23057 -24526 -17118 29424 10187 -32214 -2637 32765 -5010 -31121 12338
444 12338 27393 -18861 -21951 24169 15171 -27985 -7537 30042 -421 -30196 8193 28448
456 28448 -15256 -24887 21212 19735 -25669 -13240 28406 5956 -29227 1700 28219 -9144
468 -9144 -25336 15910 20905 -21419 -15157 25376 8583 -27454 -1559 27552 -5350 -25653 11728
481 11728 21965 -17138 -16785 21244 10549 -23793 -3781 24599 -3061 -23651 9445 21024
493 21024 -14997 -16923 19321 11677 -22176 -5649 23356 -753 -22826 7134 20677 -13018
505 -13018 -17015 18061 12251 -21801 -6583 24032 452 -24459 5865 23128 -11844 -20077 17186
518 17186 15587 -21424 -9902 24261 3438 -25452 3415 24973 -10153 -22846 16242 19227
530 19227 -21243 -14330 24737 8419 -26572 -1886 26678 -4853 -25096 11298 22021 -16950
542 -16950 -17619 21489 12176 -24611 -5991 26232 -390 -26218 6633 24666 -12233 -21508 16978
555 16978 17000 -20555 -11378 22920 5131 -23917 1323 23501 -7465 -21605 12937 18344 -17470
568 -17470 -13984 20801 8815 -22702 -3307 23021 -2183 -21735 7359 18910 -11926 -14857
580 -14857 15662 10053 -18250 -4905 19506 -208 -19251 5005 17592 -9167 -14712 12536
592 12536 11037 -14754 -6739 15717 2249 -15273 2273 13636 -6518 -11010 10194 7727 -12897
605 -12897 -4007 14342 77 -14413 3907 13122 -7699 -10681 10954 7285 -13339 -3216 14575
618 14575 -1408 -14573 6251 13361 -10937 -11085 15033 7943 -18066 -3977 19742 -567 -19891
631 -19891 5537 18676 -10458 -16153 15010 12578 -18588 -8005 21071 2757 -22220 2928
643 2928 22145 -8591 -20783 13718 18189 -17920 -14406 20989 9533 -22826 -3861 23401 -2214
656 -2214 -22754 8167 20821 -13632 -17604 18261 13194 -21876 -7854 24338 2042 -25402 3901
669 3901 24941 -9538 -22761 14703 19032 -19134 -13957 22690 8076 -25020 -1746 25965 -4558
682 -4558 -25291 10634 23123 -16118 -19628 20746 15184 -24196 -10068 26190 4578 -26586 1122
695 1122 25513 -6762 -23178 11990 19883 -16497 -15935 19873 11463 -21982 -6648 22803 1767
708 1767 -22440 2926 21074 -6996 -18717 10267 15589 -12515 -11749 13849 7531 -14254 -3278
721 -3278 13917 -534 -12760 3686 10934 -5930 -8478 7295 5673 -7781 -2865 7446 350
734 350 -6306 1676 4434 -3124 -2046 3963 -568 -4204 3044 3830 -5079 -2816 6518 1189 -7283 918
750 918 7418 -3219 -6865 5512 5712 -7456 -3824 9008 1431 -9993 1387 10452 -4241 -10163
764 -10163 6937 9126 -9161 -7190 10894 4489 -11961 -1181 12346 -2390 -11899 5957 10548
777 10548 -9239 -8285 12041 5218 -14181 -1603 15462 -2309 -15681 6210 14719 -9886 -12549
790 -12549 13172 9343 -15892 -5317 17886 841 -18864 3907 18782 -8554 -17520 13008
802 13008 15263 -16914 -12074 20095 8222 -22231 -3792 23243 -977 -23021 5949 21655
814 21655 -10805 -19277 15258 16015 -18994 -12021 21766 7442 -23438 -2523 23930 -2479 -23260
827 -23260 7211 21448 -11386 -18588 14791 14821 -17280 -10351 18828 5600 -19310 -808 18851
840 18851 -3612 -17338 7484 15014 -10560 -11964 12795 8509 -14056 -4839 14353 1253 -13642
853 -13642 2145 12079 -5111 -9813 7568 7085 -9381 -4127 10389 1123 -10590 1712 9949
866 9949 -4248 -8599 6343 6673 -7824 -4347 8644 1807 -8724 786 8126 -3210 -6921 5321
880 5321 5333 -6844 -3401 7771 1391 -7891 664 7369 -2492 -6197 4033 4578 -5073 -2611 5599
895 5599 506 -5527 1600 4931 -3493 -3869 4983 2405 -5995 -680 6361 -1261 -6116 3203 5258
910 5258 -5061 -3835 6643 1968 -7807 251 8467 -2667 -8486 5142 7906 -7432 -6663 9433
924 9433 4854 -10893 -2460 11794 -257 -11960 3222 11453 -6151 -10197 8862 8332 -11125
937 -11125 -5900 12821 3091 -13766 -58 13934 -2984 -13284 5853 11837 -8374 -9716 10421
950 10421 7038 -11869 -4007 12657 839 -12719 2329 12100 -5231 -10773 7782 8864 -9761
963 -9761 -6459 11124 3750 -11727 -806 11631 -2086 -10748 4878 9259 -7261 -7171 9175 4682
977 4682 -10428 -1957 10959 -827 -10727 3497 9762 -5853 -8119 7766 5946 -9086 -3422
990 -3422 9737 689 -9726 2010 9071 -4477 -7805 6568 6064 -8093 -3960 9041 1645 -9278
1004 -9278 742 8880 -2982 -7824 5038 6296 -6667 -4277 7861 2059 -8462 343 8512
1017 8512 -2658 -7902 4800 6752 -6583 -5089 7911 3016 -8689 -689 8847 -1732 -8383
1030 -8383 4086 7327 -6169 -5749 7857 3770 -9004 -1505 9542 -849 -9384 3170 8610
1043 8610 -5252 -7219 7027 5376 -8291 -3141 9065 798 -9210 1634 8839 -3881 -7863
1056 -7863 5887 6463 -7433 -4632 8508 2550 -9023 -313 8941 -1922 -8309 4036 7157 -5882
1070 -5882 -5574 7332 3647 -8308 -1522 8734 -674 -8570 2799 7848 -4672 -6584 6244 4925
1084 4925 -7326 -2916 7938 810 -7953 1343 7495 -3256 -6518 4941 5194 -6160 -3519 6926
1098 6926 1742 -7120 107 6843 -1832 -6051 3353 4883 -4553 -3413 5361 1764 -5760 -54 5686
1113 5686 -1590 -5167 3058 4237 -4214 -2973 5039 1453 -5404 215 5343 -1881 -4785 3466 3855
1128 3855 -4789 -2506 5788 927 -6291 830 6336 -2585 -5818 4263 4843 -5659 -3403 6747
1142 6747 1680 -7345 290 7489 -2279 -7105 4204 6234 -5903 -4951 7249 3266 -8158 -1378
1156 -1378 8559 -660 -8444 2706 7803 -4629 -6689 6312 5161 -7663 -3316 8577 1263 -8984
1170 -8984 923 8885 -3028 -8212 5011 7060 -6682 -5436 7990 3478 -8797 -1264 9103
1183 9103 -1005 -8835 3245 8053 -5248 -6759 6909 5095 -8131 -3145 8800 1013 -8943
1196 -8943 1103 8506 -3110 -7571 4858 6199 -6275 -4514 7260 2644 -7773 -687 7815
1209 7815 -1198 -7344 2941 6493 -4375 -5242 5527 3768 -6210 -2046 6516 319 -6347 1386
1223 1386 5801 -2902 -4841 4186 3619 -5072 -2183 5548 635 -5577 876 5165 -2310 -4368 3464
1238 3464 3230 -4332 -1872 4797 379 -4868 1085 4543 -2440 -3836 3559 2843 -4357 -1602 4790
1253 4790 239 -4813 1173 4486 -2447 -3752 3611 2770 -4474 -1521 5039 151 -5227 1286 5042
1268 5042 -2646 -4463 3885 3524 -4890 -2308 5588 831 -5946 737 5892 -2360 -5466 3872 4618
1283 4618 -5189 -3429 6207 1972 -6837 -321 7045 -1379 -6781 3068 6077 -4583 -4941 5860 3537
1298 3537 -6765 -1865 7302 136 -7357 1635 7012 -3272 -6250 4713 5138 -5860 -3738 6631
1312 6631 2133 -7016 -450 7009 -1252 -6614 2831 5858 -4221 -4800 5307 3482 -6062 -2002 6428
1327 6428 442 -6391 1091 5949 -2485 -5131 3691 4058 -4586 -2703 5169 1277 -5336 187 5197
1342 5197 -1506 -4645 2683 3829 -3534 -2726 4101 1536 -4321 -291 4195 -897 -3759 1957 3036
1357 3036 -2786 -2108 3365 1067 -3654 -2 3592 -1047 -3237 1952 2588 -2717 -1719 3239 685 -3474
1373 -3474 449 3453 -1553 -3080 2593 2459 -3471 -1557 4089 502 -4388 715 4385 -1911 -3956
1388 -3956 3095 3250 -4088 -2208 4881 967 -5348 421 5473 -1830 -5204 3196 4572 -4397 -3606
1403 -3606 5355 2376 -5990 -952 6256 -567 -6150 2113 5695 -3556 -4881 4834 3812 -5818 -2481
1418 -2481 6513 1025 -6806 567 6736 -2103 -6259 3602 5459 -4858 -4285 5908 2885 -6601 -1262
1433 -1262 6966 -410 -6932 2071 6526 -3590 -5742 4882 4607 -5909 -3241 6566 1698 -6857
1447 -6857 -108 6728 -1456 -6252 2888 5431 -4114 -4356 5060 3119 -5682 -1781 5959 446 -5855
1462 -5855 854 5457 -1968 -4746 2958 3842 -3671 -2757 4148 1645 -4299 -466 4230 -629 -3871
1477 -3871 1583 3299 -2329 -2566 2814 1677 -3035 -780 2957 -133 -2650 922 2118 -1578 -1447
1492 -1447 1987 654 -2176 127 2113 -878 -1821 1491 1340 -1915 -689 2149 -8 -2113 809
1507 809 1917 -1493 -1479 2111 936 -2528 -220 2772 -511 -2788 1306 2559 -2014 -2111 2628 1461
1523 1461 -3101 -648 3364 -308 -3447 1304 3256 -2301 -2853 3190 2200 -3912 -1338 4424 307
1538 307 -4648 820 4605 -1973 -4224 3105 3578 -4071 -2601 4884 1482 -5384 -163 5652 -1151
1553 -1151 -5527 2470 5124 -3630 -4347 4634 3368 -5367 -2141 5826 812 -5973 568 5813 -1933
1568 -1933 -5371 3168 4619 -4252 -3672 5076 2548 -5639 -1290 5875 4 -5767 1269 5368 -2442
1583 -2442 -4657 3490 3714 -4286 -2555 4858 1331 -5063 -41 5030 -1169 -4662 2287 4034 -3164
1598 -3164 -3190 3805 2189 -4159 -1078 4240 -30 -4050 1076 3609 -2009 -2973 2725 2161 -3236 -1299
1614 -1299 3473 385 -3497 471 3262 -1261 -2797 1900 2168 -2371 -1406 2673 592 -2740 261
1629 261 2627 -1002 -2276 1710 1812 -2174 -1160 2504 465 -2562 284 2416 -972 -2035 1606
1644 1606 1483 -2083 -780 2370 31 -2486 728 2343 -1461 -2020 2037 1497 -2483 -857 2717 121
1660 121 -2765 661 2615 -1390 -2242 2074 1749 -2612 -1064 3013 360 -3175 437 3181 -1168 -2911
1676 -2911 1918 2510 -2504 -1871 3003 1131 -3285 -268 3396 -630 -3298 1524 2962 -2329 -2436 2984
1692 2984 1745 -3462 -937 3693 38 -3683 850 3440 -1704 -2955 2469 2299 -3037 -1491 3433
1707 3433 625 -3583 312 3538 -1157 -3240 1929 2772 -2532 -2111 2991 1368 -3213 -519 3274
1722 3274 -313 -3101 1132 2759 -1834 -2248 2427 1603 -2838 -871 3045 101 -3033 658 2811
1737 2811 -1379 -2395 1977 1778 -2447 -1058 2725 259 -2779 556 2651 -1318 -2300 2001 1803 -2479
1753 -2479 -1120 2810 406 -2884 387 2787 -1110 -2429 1803 1959 -2346 -1304 2744 591 -2943
1768 -2943 183 2951 -935 -2777 1635 2411 -2230 -1881 2683 1218 -2985 -471 3099 -327 -3020
1783 -3020 1104 2753 -1853 -2305 2490 1709 -2946 -984 3246 228 -3309 581 3178 -1339 -2798
1798 -2798 2049 2283 -2582 -1581 2980 817 -3156 29 3171 -806 -2955 1536 2575 -2141 -2058 2588
1814 2588 1432 -2881 -723 2974 -6 -2898 709 2637 -1333 -2238 1865 1728 -2260 -1123 2517
1829 2517 488 -2589 165 2532 -742 -2264 1284 1889 -1694 -1355 1994 796 -2112 -168 2091
1844 2091 -419 -1890 986 1573 -1394 -1137 1697 634 -1849 -114 1818 -393 -1645 851 1317 -1231
1860 -1231 -915 1465 417 -1607 84 1579 -594 -1446 1015 1154 -1374 -789 1621 359 -1722 115
1876 115 1710 -602 -1541 1083 1273 -1469 -874 1793 410 -1990 141 2061 -686 -1958 1240 1721
1892 1721 -1727 -1332 2096 805 -2380 -214 2465 -459 -2424 1095 2191 -1740 -1827 2232 1290 -2634
1908 -2634 -707 2871 22 -2920 657 2791 -1308 -2492 1892 2051 -2369 -1487 2755 847 -2946
1923 -2946 -122 2997 -563 -2873 1239 2622 -1839 -2211 2317 1697 -2690 -1067 2888 390 -2938
1938 -2938 296 2804 -985 -2550 1574 2116 -2098 -1594 2443 977 -2670 -337 2696 -308 -2572
1953 -2572 895 2287 -1413 -1871 1806 1375 -2073 -804 2201 240 -2155 322 2021 -806 -1746 1215
1969 1215 1406 -1489 -989 1659 560 -1711 -117 1643 -296 -1465 651 1184 -943 -849 1129 460
1985 460 -1233 -92 1194 -297 -1082 616 857 -859 -549 1009 199 -1039 195 980 -542 -792 861
2002 861 532 -1087 -167 1243 -189 -1241 599 1144 -941 -920 1261 617 -1468 -219 1583 -211 -1587
2019 -1587 651 1473 -1088 -1255 1449 930 -1750 -562 1949 112 -2045 350 1984 -846 -1838 1286
2035 1286 1556 -1697 -1175 2015 719 -2221 -167 2333 -387 -2281 942 2118 -1447 -1808 1910 1395
2051 1395 -2230 -858 2447 298 -2493 320 2426 -890 -2216 1436 1858 -1866 -1434 2199 906
2066 906 -2400 -363 2464 -201 -2390 712 2183 -1202 -1889 1583 1471 -1881 -1004 2098 520 -2142
2082 -2142 3 2114 -470 -1944 917 1702 -1269 -1352 1553 970 -1697 -516 1755 90 -1660 341
2098 341 1502 -696 -1244 969 898 -1172 -551 1252 174 -1233 158 1111 -457 -918 661 655 -804
2115 -804 -383 850 69 -823 188 717 -419 -537 607 329 -685 -84 742 -128 -686 368 581 -561
2133 -561 -377 721 160 -786 118 811 -392 -743 658 612 -895 -398 1068 115 -1185 183 1183 -542
2151 -542 -1127 857 940 -1172 -680 1406 336 -1584 58 1629 -467 -1587 893 1457 -1248 -1162 1589
2168 1589 852 -1791 -427 1955 0 -1960 478 1892 -913 -1689 1335 1420 -1653 -1033 1927 636
2184 636 -2081 -160 2131 -317 -2076 771 1896 -1205 -1625 1559 1254 -1865 -809 2042 328 -2108
2200 -2108 168 2053 -650 -1884 1074 1617 -1432 -1248 1720 842 -1855 -373 1911 -76 -1822 523
2216 523 1664 -897 -1383 1201 1076 -1415 -702 1552 325 -1574 41 1502 -412 -1369 698 1128
2232 1128 -954 -878 1114 557 -1211 -243 1213 -75 -1148 363 1005 -609 -808 778 553 -882 -273
2249 -273 916 16 -842 246 735 -442 -525 607 316 -675 -57 689 -167 -596 392 483 -539 -282 638
2268 638 71 -680 159 634 -372 -547 554 370 -711 -200 780 -28 -820 254 785 -484 -677 675
2286 675 525 -845 -310 978 73 -1012 219 1021 -472 -910 758 793 -964 -537 1172 286 -1263
2303 -1263 45 1300 -364 -1241 688 1100 -984 -878 1235 581 -1406 -245 1497 -125 -1495 484
2319 484 1390 -836 -1212 1118 946 -1336 -640 1496 289 -1559 98 1542 -441 -1423 786 1246 -1062
2336 -1062 -980 1323 692 -1434 -324 1526 -23 -1497 399 1425 -717 -1219 1015 946 -1237 -648 1374
2353 1374 291 -1437 69 1401 -427 -1267 728 1058 -995 -816 1162 487 -1266 -158 1291 -170
2369 -170 -1205 481 1068 -728 -852 939 611 -1059 -319 1141 42 -1097 256 1033 -485 -861 714
2386 714 689 -854 -442 969 194 -988 72 962 -322 -851 543 688 -712 -481 832 246 -882
2403 -882 4 861 -250 -778 462 620 -633 -417 763 195 -809 48 809 -257 -697 495 579 -624
2421 -624 -383 752 191 -789 60 792 -245 -702 451 587 -592 -423 715 226 -787 -29 787 -195
2439 -195 -754 377 640 -564 -489 677 287 -788 -86 809 -155 -787 367 691 -567 -532 737 352
2457 352 -843 -104 912 -125 -857 397 787 -606 -623 805 420 -912 -162 995 -77 -977 363
2474 363 916 -590 -770 800 575 -955 -350 1053 92 -1077 174 1044 -437 -949 684 789 -882
2491 -882 -587 1030 350 -1123 -64 1158 -213 -1097 497 1006 -731 -801 953 598 -1087 -311 1188
2508 1188 20 -1183 302 1134 -575 -975 826 781 -1008 -520 1135 228 -1189 57 1169 -368
2524 -368 -1080 613 908 -828 -708 997 453 -1105 -199 1132 -80 -1109 344 1015 -555 -856 778
2541 778 686 -890 -448 1010 235 -1011 58 1009 -271 -880 498 767 -658 -563 796 362 -851 -109
2559 -109 856 -98 -793 295 667 -480 -530 577 333 -666 -146 667 -37 -622 220 533 -354 -412 466 261
2579 261 -504 -93 529 -42 -479 217 426 -315 -295 426 184 -455 -23 484 -114 -427 262 366 -379 -251
2599 -251 481 113 -530 56 538 -229 -496 388 384 -536 -259 636 77 -709 123 712 -320 -654 523 550
2619 550 -689 -372 825 179 -892 62 932 -276 -872 527 794 -727 -620 911 439 -1025 -188
2636 -188 1097 -48 -1098 320 1062 -559 -920 787 770 -975 -570 1110 312 -1216 -44 1226 -248
2653 -248 -1181 512 1066 -765 -893 988 675 -1137 -400 1230 103 -1240 204 1205 -461 -1061 738
2670 738 919 -907 -647 1093 417 -1147 -121 1168 -128 -1102 391 1004 -624 -833 792 638 -908
2687 -908 -415 980 172 -1003 42 946 -266 -884 443 733 -608 -575 725 383 -768 -179 780 -5
2705 -5 -724 201 658 -333 -506 452 380 -494 -195 539 61 -473 112 423 -201 -298 300 190 -324 -54 329
2726 329 -68 -272 170 195 -253 -101 293 -12 -309 120 265 -240 -207 325 118 -381 0 418 -120 -405 268
2747 268 391 -370 -298 510 198 -576 -39 642 -104 -632 303 612 -454 -525 633 394 -758 -224 854
2766 854 9 -896 209 885 -444 -802 636 670 -828 -506 955 261 -1058 -37 1066 -233 -1050
2783 -1050 462 953 -699 -802 899 632 -1035 -389 1146 154 -1171 138 1158 -385 -1062 636
2799 636 950 -836 -757 1013 537 -1134 -273 1175 -4 -1176 267 1106 -519 -990 728 787 -907
2816 -907 -579 1014 330 -1081 -69 1074 -190 -1008 398 876 -601 -707 742 518 -842 -290 905
2833 905 102 -854 125 833 -293 -699 461 591 -557 -412 656 271 -672 -80 659 -78 -609 210 523
2852 523 -337 -420 403 266 -456 -152 438 -5 -432 108 331 -222 -258 265 127 -304 -9 297 -98 -230 203
2873 203 166 -247 -35 300 -51 -259 189 246 -260 -147 362 76 -399 44 421 -161 -390 292 352 -403 -259
2894 -259 487 135 -553 -14 570 -140 -580 276 524 -428 -447 560 339 -648 -168 732 5 -743 182 727
2914 727 -356 -643 540 560 -672 -367 816 209 -854 17 882 -209 -822 414 749 -594 -605 760
2932 760 447 -851 -235 925 26 -915 183 879 -397 -793 578 646 -727 -497 834 305 -894 -92
2950 -92 918 -118 -882 318 806 -488 -666 655 533 -741 -321 836 148 -823 84 812 -252 -715
2968 -715 439 596 -555 -428 651 270 -687 -71 684 -88 -646 229 538 -380 -438 465 280 -528 -146
2987 -146 537 3 -522 138 465 -242 -372 345 287 -402 -166 436 45 -418 78 402 -185 -315 298 251 -329
3008 -329 -127 387 19 -368 108 347 -197 -271 299 177 -355 -78 366 -48 -370 153 320 -275 -253 365 150
3029 150 -427 -44 454 -95 -435 222 385 -331 -300 426 204 -479 -82 532 -39 -507 190 490 -297 -418
3049 -418 420 342 -494 -209 565 80 -593 49 580 -210 -551 342 461 -464 -370 540 217 -618 -92 619 -100
3070 -100 -618 243 546 -384 -446 495 337 -562 -180 623 40 -612 149 594 -277 -500 403 406 -485 -259 571
3091 571 141 -584 7 587 -151 -540 283 456 -400 -367 469 251 -538 -109 546 -28 -540 152 481 -284
3111 -284 -416 385 311 -449 -175 490 50 -487 92 471 -196 -383 315 320 -380 -176 429 78 -421 68 421
3132 421 -165 -346 286 290 -339 -161 396 66 -404 43 392 -166 -352 248 260 -334 -194 383 86 -420 18
3153 18 409 -131 -393 232 318 -319 -234 390 134 -419 -23 435 -82 -414 227 365 -301 -275 393 192 -424
3174 -424 -49 476 -64 -434 198 416 -293 -317 383 224 -442 -113 470 -28 -477 134 430 -267 -378 344
3194 344 287 -426 -189 462 72 -490 51 486 -169 -429 279 390 -362 -278 447 183 -466 -49 506 -42 -475
3215 -475 189 439 -279 -353 381 251 -425 -130 474 10 -467 106 427 -231 -376 310 273 -398 -181 415 56
3236 56 -430 62 406 -163 -362 262 293 -330 -197 397 104 -392 15 414 -103 -352 215 329 -273 -236 358
3257 358 167 -375 -36 402 -49 -378 148 339 -232 -266 319 201 -366 -94 372 -15 -380 105 340 -207
3277 -207 -282 286 196 -335 -98 365 11 -353 105 334 -183 -276 279 220 -318 -109 356 49 -337 84 350
3298 350 -158 -291 251 241 -305 -161 340 78 -353 25 356 -114 -328 193 278 -273 -212 320 115 -381 -29
3319 -29 365 -72 -345 175 306 -256 -231 310 147 -350 -40 376 -43 -342 159 325 -219 -239 319 175 -333
3340 -333 -56 375 -34 -357 131 321 -208 -275 283 199 -337 -114 364 22 -384 77 353 -166 -332 237 261
3361 261 -320 -182 363 104 -381 7 398 -101 -359 212 320 -275 -237 360 168 -390 -22 416 -52 -366
3381 -366 169 354 -239 -279 331 201 -363 -96 386 -11 -395 104 357 -205 -304 286 237 -348 -152 363 45
3402 45 -399 32 370 -139 -351 224 297 -285 -211 352 146 -362 -30 388 -41 -362 156 351 -211 -252 300
3423 300 203 -331 -98 362 27 -347 95 328 -163 -279 237 211 -280 -128 314 51 -318 37 305 -119 -263
3444 -263 181 194 -249 -133 270 68 -260 20 275 -72 -231 154 218 -180 -129 236 101 -225 7 261 -34
3465 -34 -226 119 204 -162 -138 213 88 -235 -17 231 -52 -231 112 179 -169 -131 210 70 -242 -4 239 -77
3487 -77 -220 135 179 -188 -135 235 62 -259 10 269 -69 -233 169 229 -195 -142 266 109 -276 -7 310 -38
3509 -38 -285 139 280 -195 -228 257 165 -301 -88 332 14 -344 66 322 -157 -288 232 236 -302 -171 333 65
3531 65 -346 22 363 -114 -323 204 292 -260 -189 336 149 -341 -22 376 -49 -343 139 325 -211 -251 298
3552 298 204 -331 -106 366 26 -366 58 342 -157 -326 223 250 -298 -191 326 105 -362 -24 351 -63 -330
3573 -330 143 298 -214 -240 272 170 -302 -81 335 10 -302 94 308 -144 -230 212 179 -232 -91 276 39
3594 39 -261 51 248 -102 -210 164 167 -210 -116 222 34 -232 11 227 -81 -206 135 168 -171 -117 206 66
3616 66 -209 -6 221 -50 -185 116 165 -147 -107 193 73 -187 15 211 -45 -183 115 160 -148 -101 194 55
3638 55 -216 12 212 -74 -194 125 148 -174 -111 203 49 -228 6 220 -76 -218 133 181 -185 -136 212 76
3660 76 -239 -15 259 -18 -239 115 239 -144 -168 218 150 -235 -74 278 16 -267 63 256 -131 -232 185
3681 185 177 -231 -128 264 54 -298 2 272 -101 -261 148 196 -226 -160 250 90 -265 -13 271 -54 -257
3702 -257 133 233 -165 -174 241 135 -248 -45 288 2 -260 88 265 -122 -207 201 171 -240 -112 260 48
3723 48 -281 31 272 -96 -230 164 191 -221 -153 250 65 -277 3 258 -76 -244 126 205 -187 -147 220 96
3745 96 -233 -6 262 -39 -226 131 234 -149 -142 237 121 -236 -33 260 -4 -242 88 227 -142 -193 186
3766 186 147 -222 -95 250 26 -255 37 243 -103 -233 161 184 -216 -136 249 61 -257 14 274 -53 -229
3787 -229 155 210 -173 -138 224 99 -228 -6 260 -30 -236 122 216 -147 -147 211 108 -222 -50 235 -19 -237
3809 -237 79 223 -134 -179 176 142 -214 -83 229 28 -226 37 227 -80 -198 145 175 -176 -117 224 81
3830 81 -211 14 250 -52 -193 124 177 -147 -120 199 78 -200 7 217 -38 -176 113 160 -142 -116 165 66
3852 66 -181 -19 189 -51 -182 93 152 -132 -105 165 70 -176 -11 186 -27 -185 84 170 -117 -119 188 97 -178
3875 -178 -24 208 -10 -195 81 193 -121 -148 169 122 -187 -51 223 -4 -220 67 202 -128 -172 174 124
3896 124 -215 -87 228 16 -236 49 224 -112 -191 175 166 -208 -114 242 55 -249 19 262 -68 -234 147
3917 147 227 -180 -150 238 125 -254 -41 265 -21 -265 83 256 -138 -208 209 174 -247 -113 266 29 -283
3938 -283 34 263 -98 -244 160 198 -220 -141 241 88 -260 -15 268 -43 -233 119 207 -156 -148 220 134 -218
3960 -218 -32 254 3 -234 78 223 -121 -175 180 148 -198 -83 233 51 -220 21 225 -75 -199 125 164
3981 164 -171 -123 183 62 -218 -12 200 -37 -191 90 168 -129 -113 163 82 -171 -13 188 -14 -155 98
4002 98 147 -99 -95 161 78 -153 -4 162 -29 -145 74 135 -119 -99 141 68 -159 -21 169 -27 -167 57 128
4025 128 -115 -116 135 78 -160 -34 169 -9 -174 75 160 -103 -104 145 82 -154 -19 196 -3 -161 81 177 -95
4048 -95 -136 164 102 -178 -54 193 7 -190 54 176 -103 -161 145 115 -183 -81 195 14 -207 25 202 -82
4070 -82 -192 124 163 -163 -125 195 79 -214 0 240 -32 -215 96 210 -138 -150 191 120 -203 -45 240 6
4092 6 -226 63 212 -115 -178 162 126 -205 -88 225 24 -232 27 218 -99 -196 145 155 -175 -117 200 69
4114 69 -218 4 230 -50 -193 103 187 -140 -126 201 103 -207 -32 232 -4 -197 73 217 -91 -172 164 152
4136 152 -189 -82 208 26 -219 25 209 -76 -188 123 149 -158 -111 186 50 -200 -4 191 -51 -183 107
4157 107 150 -138 -110 171 80 -166 -14 186 -13 -157 90 166 -94 -107 145 99 -152 -33 188 -11 -164 51
4179 51 162 -93 -140 129 100 -161 -54 168 7 -176 23 152 -84 -140 109 99 -149 -69 152 24 -164 21
4201 21 153 -67 -124 120 110 -113 -61 165 35 -146 35 163 -54 -121 113 113 -125 -59 152 39 -150 8 144
4224 144 -61 -152 86 114 -127 -101 143 50 -164 -12 166 -48 -174 84 136 -120 -107 145 73 -163 -17 184
4246 184 -11 -162 77 164 -115 -121 156 88 -173 -31 186 -2 -182 68 163 -104 -138 144 105 -172 -56 181
4268 181 8 -200 28 182 -106 -179 124 128 -164 -106 186 53 -225 1 197 -54 -197 103 185 -131 -131 192
4290 192 108 -186 -27 236 -7 -187 80 203 -116 -149 171 120 -184 -65 207 12 -195 38 198 -81 -174
4311 -174 128 126 -176 -96 183 36 -200 3 191 -55 -166 115 152 -139 -105 172 72 -175 -15 200 -10 -181
4333 -181 81 180 -106 -126 162 108 -166 -40 191 3 -180 40 175 -88 -141 132 109 -156 -73 166 17 -183
4355 -183 20 164 -74 -145 104 100 -142 -72 150 30 -156 19 154 -52 -135 82 121 -115 -77 157 57 -146
4377 -146 9 168 -30 -134 85 141 -110 -85 145 68 -152 -24 160 -18 -149 64 143 -103 -114 123 62 -148
4399 -148 -38 157 -10 -152 55 141 -96 -108 138 82 -133 -30 163 1 -144 57 150 -91 -109 133 83 -133
4421 -133 -33 175 17 -155 46 155 -80 -127 111 100 -141 -73 168 22 -179 20 176 -70 -160 110 126 -145
4443 -145 -92 168 54 -170 -2 187 -33 -162 98 159 -127 -97 181 85 -168 -3 192 -24 -172 84 168 -108
4465 -108 -123 163 103 -173 -36 186 -10 -187 49 173 -104 -154 140 126 -168 -77 190 25 -191 20 190 -72
4487 -72 -173 111 147 -151 -101 179 78 -208 -1 220 -28 -179 108 182 -121 -121 175 102 -186 -33 209 -2
4509 -2 -194 68 174 -98 -154 137 98 -178 -69 186 1 -199 35 181 -80 -165 120 121 -167 -86 180 34 -194
4532 -194 12 194 -41 -172 109 163 -131 -111 171 81 -174 -20 200 -11 -171 63 171 -94 -120 151 100 -164
4554 -164 -51 167 0 -170 37 146 -91 -139 104 93 -144 -55 145 20 -148 30 142 -60 -127 98 91 -117
4576 -117 -56 151 33 -140 41 150 -51 -114 114 117 -108 -57 141 41 -132 12 145 -49 -127 92 106 -116
4598 -116 -77 139 33 -156 -6 144 -51 -151 81 107 -121 -85 145 40 -150 2 159 -35 -137 81 124
4619 124 -115 -90 146 73 -143 7 174 -24 -144 77 156 -104 -107 155 88 -164 -31 186 -8 -186 62 171
4641 171 -100 -155 137 107 -180 -76 184 12 -212 14 197 -69 -178 126 142 -159 -107 179 52 -204 12
4662 12 211 -42 -179 102 167 -125 -116 187 90 -188 -24 206 -22 -196 70 189 -101 -163 143 114 -177 -78 197
4685 197 22 -207 10 190 -87 -189 105 144 -166 -109 188 67 -189 -1 199 -40 -182 88 159 -128 -125 159
4707 159 99 -164 -26 197 8 -168 64 177 -90 -128 143 93 -152 -39 156 6 -165 34 150 -76 -126
4728 -126 96 101 -141 -60 153 23 -150 18 158 -60 -123 94 122 -107 -61 142 42 -132 24 164 -32 -117
4750 -117 110 126 -93 -58 146 47 -130 24 153 -33 -139 83 113 -103 -81 143 46 -148 -2 148 -39 -135
4772 -135 81 116 -111 -86 136 53 -138 -8 162 -25 -144 76 155 -81 -99 143 78 -160 -36 181 13 -149
4794 -149 66 169 -76 -117 147 122 -146 -53 186 23 -185 25 181 -67 -161 119 123 -156 -91 174 43 -178
4816 -178 -5 177 -44 -167 98 149 -119 -112 169 93 -155 -8 194 -15 -166 82 182 -86 -136 146 123 -136
4838 -136 -47 194 30 -173 51 187 -77 -156 123 122 -153 -83 170 34 -190 7 183 -53 -173 100 148 -119
4860 -119 -101 156 54 -178 -5 188 -22 -153 87 155 -96 -98 152 82 -146 -18 183 -10 -155 61 161 -89
4882 -89 -107 145 98 -139 -48 163 0 -174 48 151 -91 -133 118 102 -157 -62 169 14 -172 28 174 -67
4904 -67 -153 120 131 -141 -95 167 57 -167 9 202 -37 -152 103 146 -120 -89 173 71 -181 -10 191 -22
4926 -22 -161 68 163 -104 -132 149 90 -170 -54 171 0 -186 42 167 -89 -158 129 118 -162 -80 175 40
4948 40 -184 15 185 -48 -148 113 151 -123 -83 183 73 -155 4 190 -31 -154 71 149 -111 -109 142 78
4970 78 -157 -48 158 -9 -163 49 126 -96 -119 121 70 -148 -51 152 2 -151 35 148 -68 -118 110 98
4992 98 -112 -40 154 29 -138 29 152 -46 -102 110 117 -108 -56 148 24 -148 29 150 -59 -126 91 102 -125
5015 -125 -73 145 32 -153 -1 138 -59 -134 88 114 -122 -89 144 47 -151 -7 161 -38 -148 97 124 -117
5037 -117 -90 163 83 -161 -9 198 -12 -157 76 169 -108 -122 169 102 -182 -51 182 10 -194 51 198 -91
5059 -91 -174 139 134 -181 -101 186 40 -205 11 213 -46 -186 119 173 -135 -127 186 81 -189 -31 230 -4 -185
5082 -185 82 202 -100 -149 161 130 -168 -61 194 35 -203 36 201 -73 -168 120 142 -149 -107 178 58 -185
5104 -185 -13 187 -33 -196 77 156 -105 -124 155 95 -158 -32 180 9 -152 54 164 -76 -122 129 102 -109
5126 -109 -46 153 29 -135 31 140 -46 -109 99 98 -103 -52 122 22 -128 10 117 -45 -106 75 91 -106
5148 -106 -48 111 24 -121 13 121 -45 -99 89 95 -95 -52 140 38 -108 37 132 -41 -102 107 100 -103 -45 138
5172 138 27 -122 31 133 -48 -120 81 95 -120 -72 128 23 -146 2 142 -60 -153 84 119 -120 -102 147
5194 147 53 -161 -12 171 -27 -156 70 158 -94 -112 158 100 -154 -43 190 10 -187 43 188 -78 -139 137
5216 137 133 -157 -85 179 51 -208 -7 191 -55 -175 90 149 -138 -120 161 89 -184 -37 178 -7 -187 55
5238 55 178 -97 -149 138 131 -152 -57 197 40 -181 30 184 -51 -164 119 162 -127 -91 168 68 -168 -23
5260 -23 176 -16 -168 68 137 -103 -128 128 75 -148 -52 150 -6 -150 45 136 -75 -111 105 85 -125 -52 142
5283 142 27 -133 31 144 -43 -91 100 101 -97 -47 139 26 -112 29 125 -48 -106 87 81 -96 -61 115 16
5306 16 -124 5 118 -51 -118 75 77 -110 -69 121 9 -133 5 133 -32 -124 84 98 -98 -52 132 43 -126
5329 -126 12 143 -24 -112 81 114 -94 -74 131 56 -137 -5 137 -16 -132 61 138 -80 -99 127 76 -151
5351 -151 -38 145 -5 -166 46 146 -80 -124 110 98 -136 -51 157 22 -157 30 168 -55 -136 107 131 -107
5373 -107 -77 167 65 -144 0 163 -27 -151 81 140 -96 -100 131 77 -144 -41 163 -2 -158 45 135 -82
5395 -82 -128 106 90 -150 -64 155 17 -156 28 159 -51 -117 109 117 -112 -65 157 37 -144 14 165 -30 -126
5418 -126 95 136 -98 -76 141 68 -147 -10 143 -24 -138 65 129 -86 -104 115 71 -131 -40 135 -14 -143
5440 -143 37 119 -77 -102 103 81 -121 -35 159 19 -124 34 146 -59 -97 108 96 -111 -39 154 39 -136
5462 -136 33 158 -38 -127 88 104 -114 -68 146 45 -155 -2 151 -43 -134 77 118 -115 -88 118 56 -151
5484 -151 -34 141 -13 -135 60 137 -79 -97 125 82 -113 -34 156 8 -152 40 139 -57 -116 106 89 -124
5506 -124 -56 149 22 -141 17 136 -61 -126 87 98 -121 -74 127 39 -146 -4 143 -36 -136 60 118 -99
5528 -99 -87 122 67 -125 -11 156 -5 -124 67 132 -75 -95 118 80 -111 -22 146 12 -119 55 134 -59 -102
5551 -102 97 85 -122 -49 132 11 -133 16 136 -58 -119 95 94 -119 -60 136 34 -135 11 142 -43 -130
5573 -130 83 111 -91 -68 130 63 -121 15 141 -14 -127 79 125 -82 -80 124 62 -136 -21 146 -8 -129
5595 -129 41 116 -85 -102 106 62 -134 -43 144 1 -146 34 144 -59 -110 101 92 -121 -40 145 33 -144 25
5618 25 147 -45 -115 102 118 -99 -60 149 45 -144 11 151 -27 -133 79 127 -95 -83 128 64 -137 -27
5640 -27 141 -20 -157 55 124 -92 -109 114 85 -124 -31 147 4 -141 32 141 -56 -112 103 114 -105 -43 159
5663 159 35 -127 25 165 -29 -123 99 105 -112 -73 129 54 -130 -4 140 -24 -124 66 117 -92 -95 117 48
5686 48 -133 -38 129 -13 -144 50 129 -66 -99 107 78 -107 -32 142 14 -120 33 130 -41 -101 113 102 -104
5709 -104 -56 135 43 -126 22 133 -46 -104 74 84 -99 -63 121 25 -123 -1 122 -31 -129 52 89 -102 -73
5732 -73 101 43 -116 -14 126 -17 -108 63 102 -65 -76 112 62 -108 -11 131 1 -105 53 127 -52 -75 94
5755 94 61 -104 -34 130 -5 -110 44 123 -67 -102 97 70 -124 -45 123 -1 -132 22 119 -61 -114 77 93
5778 93 -103 -47 140 29 -132 10 137 -35 -114 75 117 -100 -75 136 51 -123 5 137 -15 -112 58 125 -94
5801 -94 -105 106 67 -132 -41 139 -10 -139 31 132 -67 -125 97 89 -121 -58 141 21 -147 22 145 -49 -108
5824 -108 99 122 -95 -65 124 65 -127 2 146 -10 -121 68 127 -66 -80 133 73 -124 -20 139 0 -131
5846 -131 32 118 -69 -111 98 87 -120 -50 130 20 -134 11 119 -46 -108 72 91 -98 -48 126 40 -114 14
5869 14 132 -22 -110 78 101 -81 -48 120 45 -108 7 122 -26 -103 51 84 -73 -75 103 39 -114 -24 111 -17
5893 -17 -113 38 93 -78 -91 90 52 -124 -37 103 -3 -116 39 105 -60 -81 97 70 -81 -23 130 10 -104
5916 -104 39 119 -52 -94 94 79 -100 -38 124 23 -122 10 119 -54 -109 59 89 -110 -67 112 26 -132 -7
5939 -7 121 -28 -127 58 104 -95 -89 118 59 -118 -20 137 -8 -126 56 123 -57 -90 108 76 -109 -31 137 19
5963 19 -137 25 137 -53 -124 87 82 -111 -58 111 24 -145 -10 120 -46 -127 71 105 -101 -79 113 54 -126
5986 -126 -13 125 -22 -126 53 117 -76 -81 106 71 -99 -22 136 3 -115 54 115 -51 -84 96 73 -104 -38
6009 -38 111 17 -121 13 111 -44 -109 76 79 -95 -54 104 39 -123 9 113 -38 -106 65 89 -92 -62 116 43
6033 43 -119 -3 120 -19 -105 66 118 -80 -65 118 67 -102 -11 124 -7 -112 41 115 -66 -88 95 57 -109
6056 -109 -39 114 -7 -117 22 99 -73 -91 78 75 -106 -39 126 21 -114 21 127 -39 -99 78 96 -93 -65
6079 -65 124 44 -112 17 137 -25 -110 57 105 -90 -73 106 42 -123 -20 116 -27 -120 32 110 -73 -101 78
6102 78 56 -117 -43 104 5 -119 22 106 -45 -101 70 94 -92 -46 118 25 -111 24 119 -30 -98 71 84 -81
6126 -81 -53 115 41 -115 -9 120 -24 -103 61 78 -91 -75 90 29 -111 -24 111 -23 -105 30 90 -73 -89 89
6150 89 49 -107 -26 120 4 -105 38 105 -51 -79 88 74 -93 -28 126 15 -107 26 122 -45 -84 85 86 -80
6174 -80 -36 112 26 -114 14 102 -50 -105 66 83 -95 -67 105 29 -124 -8 107 -34 -117 62 91 -78 -68 104
6198 104 55 -94 -6 132 3 -115 48 119 -59 -75 93 75 -89 -24 125 23 -111 18 123 -50 -104 79
6220 79 81 -105 -62 99 17 -122 1 119 -36 -106 65 96 -79 -67 107 37 -108 -4 113 -13 -109 48 109 -59
6244 -59 -66 106 65 -95 -21 118 8 -95 25 111 -45 -83 76 67 -91 -37 99 7 -108 8 99 -47 -95 63
6268 63 59 -87 -49 98 21 -116 10 96 -36 -92 60 77 -74 -61 102 36 -94 6 104 -11 -80 59 88 -68
6292 -68 -62 96 44 -87 -11 111 -4 -94 52 86 -56 -68 82 45 -108 -31 105 1 -110 39 97 -52 -78 74
6316 74 71 -87 -38 112 17 -100 10 104 -34 -79 85 82 -80 -45 103 37 -89 12 118 -29 -89 65 79 -75
6340 -75 -58 103 44 -91 -9 116 -17 -107 35 88 -77 -82 82 54 -104 -41 117 0 -117 31 108 -49 -81 82
6364 82 72 -86 -39 111 25 -97 29 111 -27 -86 78 85 -73 -48 106 28 -100 -1 97 -31 -100 55 70 -88 -68
6389 -68 84 44 -109 -13 99 -16 -105 27 84 -59 -66 75 60 -89 -24 94 8 -91 30 94 -42 -76 74 70 -78
6414 -78 -20 100 26 -95 15 101 -28 -86 68 71 -88 -50 87 20 -100 2 99 -33 -97 47 78 -71 -70 81 27
6439 27 -102 -11 111 -14 -93 43 81 -56 -56 87 53 -84 -16 105 7 -86 38 103 -41 -60 84 60 -85 -34 93
6464 93 17 -99 6 98 -36 -92 67 62 -89 -51 87 10 -103 1 82 -40 -94 38 74 -76 -56 97 36 -89
6488 -89 -3 110 -15 -88 38 90 -62 -55 84 48 -81 -21 95 4 -93 42 90 -45 -71 71 47 -84 -48 80 -2
6513 -2 -98 13 80 -36 -78 56 66 -82 -45 89 10 -97 5 97 -34 -88 62 83 -65 -42 94 41 -86 -5 97
6538 97 -9 -78 60 82 -63 -50 91 43 -80 -18 94 -12 -97 23 83 -68 -78 68 44 -100 -47 85 17 -95
6562 -95 10 84 -42 -79 59 55 -78 -41 102 26 -89 15 98 -22 -73 61 80 -60 -38 89 40 -97 -6 98
6586 98 -12 -68 53 89 -55 -65 79 54 -86 -21 93 -6 -103 24 79 -59 -76 68 47 -81 -40 88 17 -93
6610 -93 19 84 -40 -61 61 77 -62 -38 90 33 -81 6 94 -12 -71 54 73 -59 -45 89 30 -78 4 90 -23
6635 -23 -82 44 63 -67 -59 66 29 -90 -24 85 -27 -88 35 73 -56 -56 67 44 -79 -21 82 10 -73 32 83
6660 83 -28 -57 69 72 -69 -29 89 14 -78 18 86 -28 -83 50 58 -67 -38 72 22 -89 5 84 -21 -76 43 59
6686 59 -64 -51 80 18 -91 -4 93 -10 -78 43 77 -52 -47 80 55 -74 -9 100 5 -80 44 91 -41 -68 71
6711 71 53 -68 -38 79 1 -89 10 93 -32 -75 56 61 -68 -48 70 11 -92 2 76 -21 -85 44 68 -59 -47 85
6737 85 30 -72 -4 89 -12 -74 49 87 -47 -50 70 51 -72 -14 90 1 -84 28 77 -50 -64 53 44 -71 -30 77
6763 77 0 -90 14 78 -38 -84 40 55 -66 -37 65 17 -77 1 95 -25 -72 38 55 -56 -33 78 27 -67 4 91
6789 91 -13 -59 53 64 -45 -42 78 25 -72 -9 75 -20 -83 23 67 -60 -63 63 33 -85 -31 83 -5 -92 19 83
6815 83 -39 -59 56 52 -62 -26 87 16 -74 17 84 -29 -70 52 72 -51 -32 83 33 -62 7 87 -19 -67 27 70
6841 70 -62 -58 70 21 -97 -13 82 -6 -78 30 68 -54 -69 67 42 -79 -24 76 -2 -70 19 87 -19 -60 66 64
6867 64 -51 -35 80 28 -87 7 81 -20 -73 51 64 -62 -37 74 30 -81 -15 77 -18 -80 34 54 -62 -57 59
6892 59 23 -78 -9 74 -7 -76 26 62 -48 -52 63 44 -57 -8 84 9 -58 33 75 -38 -51 67 52 -54 -20 94
6918 94 15 -67 9 78 -17 -61 49 48 -59 -41 68 22 -78 5 80 -28 -77 42 62 -61 -51 59 24 -81 -16 64
6944 64 -22 -64 35 78 -38 -44 74 35 -64 -3 90 -1 -75 32 90 -32 -55 64 50 -70 -16 90 7 -82 16 79 -39
6971 -39 -73 52 54 -72 -40 68 21 -80 4 84 -31 -86 46 59 -46 -44 80 36 -75 -1 92 -5 -69 40 81 -47
6997 -47 -43 65 32 -62 -16 99 -1 -71 28 74 -39 -63 55 45 -76 -31 79 21 -80 11 72 -29 -68 48 54 -62
7023 -62 -46 73 28 -77 -3 82 -7 -74 44 61 -44 -27 72 36 -58 6 89 -5 -64 38 64 -38 -43 60 34 -70 -13
7050 -13 82 -17 -68 30 59 -45 -54 52 35 -68 -25 78 1 -67 29 78 -35 -50 55 51 -58 -31 89 24 -73 16 82
7077 82 -20 -51 61 74 -50 -38 90 28 -68 9 89 -12 -71 43 63 -56 -42 67 36 -73 -11 72 -17 -77 33
7102 33 73 -43 -43 60 50 -62 -15 86 8 -67 35 79 -35 -63 68 68 -60 -27 82 19 -62 11 87 -21 -60 56
7128 56 62 -57 -45 68 24 -73 2 89 -15 -78 40 53 -55 -59 64 25 -71 -2 80 -7 -65 35 71 -37 -54 64 49
7155 49 -65 -9 94 6 -65 23 79 -28 -45 61 47 -49 -33 85 33 -62 11 73 -19 -61 44 55 -64 -47 69 22
7181 22 -88 -1 74 -23 -67 41 56 -59 -44 75 35 -63 0 89 -7 -61 47 69 -32 -41 74 47 -63 -3 91 3 -71
7208 -71 27 76 -35 -51 62 53 -69 -15 69 9 -77 4 71 -28 -59 55 55 -62 -29 79 20 -75 11 80 -19 -72 44 58
7236 58 -48 -39 78 44 -73 13 82 -1 -51 46 73 -42 -37 81 49 -66 -2 91 2 -68 27 79 -35 -54 54 35 -60
7263 -60 -21 83 6 -69 19 73 -30 -62 54 50 -56 -31 72 18 -70 5 88 -13 -54 53 67 -39 -32 73 39 -59 8
7290 8 79 4 -65 45 78 -30 -42 68 31 -63 -17 68 -6 -77 21 65 -43 -47 55 37 -59 -18 66 4 -63 14 80 -25
7318 -25 -64 55 58 -44 -21 80 19 -59 10 83 -15 -56 47 57 -53 -33 78 28 -59 -4 70 -19 -68 25 71 -50 -50 51
7346 51 23 -68 -10 62 -11 -75 26 64 -33 -47 54 48 -66 -20 68 17 -61 27 69 -14 -49 63 58 -51 -20 75 20 -71 15
7375 15 74 -18 -59 45 61 -46 -40 69 28 -69 -6 80 -15 -78 26 54 -51 -46 47 27 -61 -16 67 -3 -61 30 58 -43
7403 -43 -50 53 31 -55 -8 86 1 -66 37 76 -11 -40 53 57 -44 -22 62 16 -70 8 74 -28 -58 40 48 -56 -37 68 12
7432 12 -66 1 58 -16 -67 31 60 -42 -29 68 48 -64 4 65 -5 -56 31 64 -29 -41 67 46 -49 7 77 15 -61 28 72
7461 72 -19 -49 47 37 -60 -20 69 7 -73 16 73 -27 -49 47 44 -56 -32 56 18 -60 -3 69 -13 -54 42 54 -32 -36 67 31
7491 31 -59 0 74 5 -52 30 74 -26 -28 61 33 -52 -20 68 11 -60 24 54 -40 -52 51 29 -58 -17 62 9 -70 13 57 -28
7521 -28 -57 40 44 -44 -28 60 25 -58 15 67 -7 -46 41 55 -31 -32 66 28 -48 -3 75 -2 -51 37 60 -33 -48 40 24 -68 -24
7552 -24 58 -6 -71 15 54 -48 -46 34 38 -64 -30 51 6 -56 2 68 -19 -49 43 48 -44 -16 63 11 -52 3 63 -5 -55 35 55
7583 55 -41 -34 61 32 -61 -13 65 -5 -53 24 49 -43 -47 52 34 -62 -25 53 0 -60 18 59 -21 -47 38 38 -56 -22 62 23 -49 17
7615 17 64 -16 -33 38 52 -27 -34 59 12 -51 3 66 -11 -55 36 52 -40 -34 39 2 -62 -15 61 -13 -66 24 52 -46 -46 41 22 -49
7647 -49 -14 58 -3 -53 21 51 -37 -36 55 47 -39 -11 63 9 -54 22 68 -27 -44 24 44 -41 -23 65 13 -56 -2 60 -16 -47 35
7678 35 33 -54 -37 41 7 -67 -9 52 -18 -60 25 50 -40 -43 55 21 -61 1 71 -3 -60 25 65 -35 -41 60 45 -39 -19 66 12
7709 12 -57 14 60 -19 -46 46 44 -55 -32 51 8 -62 -7 60 -19 -53 21 35 -35 -38 54 19 -63 11 75 -5 -57 34 47 -39 -34 52
7741 52 36 -51 -12 71 6 -46 28 53 -27 -44 37 41 -43 -24 73 6 -58 14 54 -15 -43 31 31 -52 -40 44 6 -48 -1 55 -9
7772 -9 -42 35 29 -34 -22 58 14 -48 6 58 0 -36 31 53 -16 -25 55 32 -43 -1 61 5 -35 15 43 -35 -41 37 19 -48 -15 51
7804 51 -4 -46 13 46 -26 -37 44 25 -49 -18 59 2 -51 11 54 -12 -36 42 43 -43 -24 57 19 -57 4 68 -12 -52 37 50 -38
7835 -38 -30 53 25 -58 -11 56 -7 -58 27 52 -33 -42 39 41 -55 -18 52 5 -53 12 51 -22 -46 41 42 -46 -19 60 13 -52 4 65
7867 65 -17 -35 30 50 -33 -25 51 20 -49 -7 53 0 -54 17 48 -41 -46 37 20 -48 -11 52 -3 -60 20 48 -22 -36 29 33 -47 -14
7899 -14 50 10 -42 13 53 -12 -37 36 32 -36 -21 46 14 -41 12 57 -7 -30 36 40 -26 -17 33 12 -41 -5 40 -20 -42 37 25 -38
7931 -38 -26 33 7 -46 -5 37 -2 -42 28 39 -34 -27 46 11 -32 -5 55 1 -46 28 49 -30 -41 46 29 -46 -13 48 5 -51 8
7962 8 52 -25 -35 31 24 -63 -45 44 10 -59 -3 46 -23 -52 29 42 -42 -21 44 10 -51 -3 62 -7 -42 32 54 -20 -31 52 33
7993 33 -51 -8 60 14 -54 12 56 -23 -49 38 49 -47 -22 52 17 -49 10 52 -18 -53 25 33 -51 -37 39 6 -40 0 47 -7 -37
8024 -37 33 35 -22 -23 44 24 -22 -3 52 14 -35 13 48 -18 -29 41 41 -31 -12 53 13 -39 9 45 -7 -36 25 34 -37 -20 38 2
8056 2 -51 9 38 -14 -38 24 24 -34 -15 46 11 -43 7 38 -5 -28 29 43 -22 -9 44 10 -27 6 48 -1 -32 24 31 -13 -24 42
8088 42 21 -48 -7 55 -3 -42 22 37 -32 -36 32 21 -42 -16 43 4 -36 24 55 -11 -33 30 29 -25 -12 56 23 -42 13 52 -1
8119 -1 -30 28 45 -18 -25 51 23 -48 -11 50 1 -40 18 42 -23 -28 31 22 -40 -22 38 0 -45 10 42 -25 -32 39 36 -43 -24 43 25
8152 25 -38 10 48 -9 -29 29 46 -28 -10 50 29 -39 12 53 1 -28 29 50 -30 -29 37 20 -33 2 41 -7 -30 17 37 -20 -31
8183 -31 31 19 -31 -11 38 4 -36 14
8191A4
##END NTUPLES=NMR FID
##END=
