##TITLE=1H_ES-aq-EtCel-st
 
 8 sc, 
 14.1.2022
##JCAMPDX= 6.0         $$ Bruker NMR JCAMP-DX V2.0
##DATA TYPE= NMR FID
##DATA CLASS= NTUPLES
##ORIGIN= UXNMR, Bruker Analytische Messtechnik GmbH
##OWNER= root
$$ XWIN-NMR		Version 3.5
$$ Fri Jan 14 10:50:59 2022 Russian Standard Time (UT+4h)  she@DPX200
##.OBSERVE FREQUENCY= 200.131346
##.OBSERVE NUCLEUS= ^1H
##.DELAY= (6, 6)
##.ACQUISITION MODE= SIMULTANEOUS
##.ACQUISITION SCHEME= undefined
##.AVERAGES= 8
##.DIGITISER RES= 18
##SPECTROMETER/DATA SYSTEM= spect
##.PULSE SEQUENCE= zg30
##.SOLVENT NAME= D2O
##.SHIFT REFERENCE= (INTERNAL, D2O, 0, 15.7039)
##AUDIT TRAIL= $$ (NUMBER, WHEN, WHO, WHERE, WHAT)
$$ ##TITLE= Audit trail, XWIN-NMR		Version 3.5
$$ ##JCAMPDX= 5.01
$$ ##ORIGIN= Bruker BioSpin GmbH
$$ ##OWNER= she
$$ F:/spectra/data/she/nmr/H-F/1/audita.txt
$$ ##AUDIT TRAIL=  $$ (NUMBER, WHEN, WHO, WHERE, WHAT)
(   1,<2022-01-14 10:49:58.23 +0400>,<she>,<DPX200>,
      <created by zg, POWCHK disabled, PULCHK disabled
       configuration hash MD5:
       00 E9 B6 7A A2 85 ED C7 34 08 36 98 17 FE 4E 26
       data hash MD5: 16K
       9F 05 F4 83 6E BD B2 D9 A0 C1 86 81 BB 6B BD 6F>)
$$ ##END=
$$ 
$$ hash MD5
$$ 5B CA CD 54 D8 EA 50 81 F7 20 BD EA F7 5F C3 08
##$RELAX= 
##$RELAX= 
##$RELAX= 
##$RELAX= 
##$RELAX= 
##$RELAX= 
$$ Bruker specific parameters
$$ --------------------------
##$DU= <F:/spectra>
##$EXPNO= 1
##$NAME= <H-F>
##$PROCNO= 1
##$TYPE= <nmr>
##$USER= <she>
##$AMP= (0..31)
100 100 100 100 100 100 100 100 100 100 100 100 100 100 100 100 100 100 
100 100 100 100 100 100 100 100 100 100 100 100 100 100 
##$AQSEQ= 0
##$AQ_mod= 1
##$AUNM= <au_zg>
##$AUTOPOS= <>
##$BF1= 200.13
##$BF2= 200.13
##$BF3= 200.13
##$BF4= 200.13
##$BF5= 200.13
##$BF6= 200.13
##$BF7= 200.13
##$BF8= 200.13
##$BYTORDA= 1
##$CFDGTYP= 0
##$CFRGTYP= 5
##$CHEMSTR= <none>
##$CNST= (0..31)
1 1 145 1 1 1 1 1 1 1 1 1 1 1 1 1 1 1 1 1 1 1 1 1 1 1 1 1 1 1 1 1 
##$CPDPRG= <>
##$CPDPRG1= <>
##$CPDPRG2= <>
##$CPDPRG3= <>
##$CPDPRG4= <mlev>
##$CPDPRG5= <mlev>
##$CPDPRG6= <mlev>
##$CPDPRG7= <mlev>
##$CPDPRG8= <mlev>
##$CPDPRGB= <>
##$CPDPRGT= <>
##$D= (0..31)
0 1.2 0 0 0 0 0 0 0 0.06 0 0.03 0 0 0 0 0.0002 0 0 0 0 0 0 0 0 0 0 0 0 
0 0 0 
##$DATE= 1642142998
##$DBL= (0..7)
120 120 120 120 120 120 120 120 
##$DBP= (0..7)
150 150 150 150 150 150 150 150 
##$DBP07= 0
##$DBPNAM0= <>
##$DBPNAM1= <>
##$DBPNAM2= <>
##$DBPNAM3= <>
##$DBPNAM4= <>
##$DBPNAM5= <>
##$DBPNAM6= <>
##$DBPNAM7= <>
##$DBPOAL= (0..7)
0.5 0.5 0.5 0.5 0.5 0.5 0.5 0.5 
##$DBPOFFS= (0..7)
0 0 0 0 0 0 0 0 
##$DE= 6
##$DECBNUC= <off>
##$DECIM= 32
##$DECNUC= <off>
##$DECSTAT= 4
##$DIGMOD= 1
##$DIGTYP= 9
##$DL= (0..7)
0 120 120 120 120 120 120 120 
##$DP= (0..7)
150 150 150 150 150 150 150 150 
##$DP07= 0
##$DPNAME0= <>
##$DPNAME1= <>
##$DPNAME2= <>
##$DPNAME3= <>
##$DPNAME4= <>
##$DPNAME5= <>
##$DPNAME6= <>
##$DPNAME7= <>
##$DPOAL= (0..7)
0.5 0.5 0.5 0.5 0.5 0.5 0.5 0.5 
##$DPOFFS= (0..7)
0 0 0 0 0 0 0 0 
##$DQDMODE= 0
##$DR= 18
##$DS= 0
##$DSLIST= <SSSSSSSSSSSSSSS>
$$ [...]
##$SUBNAM2= <"">
##$SUBNAM3= <"">
##$SUBNAM4= <"">
##$SUBNAM5= <"">
##$SUBNAM6= <"">
##$SUBNAM7= <"">
##$SUBNAM8= <"">
##$SUBNAM9= <"">
##$SW= 18.0517287032376
##$SWIBOX= (0..15)
0 0 2 0 0 0 0 0 0 0 0 0 0 0 0 0 
##$SW_h= 3612.71676300578
##$TD= 16384
##$TD0= 1
##$TE= 0
##$TE2= 300
##$TE3= 300
##$TEG= 300
##$TL= (0..7)
0 120 120 120 120 120 120 120 
##$TP= (0..7)
150 150 150 150 150 150 150 150 
##$TP07= 0
##$TPNAME0= <>
##$TPNAME1= <>
##$TPNAME2= <>
##$TPNAME3= <>
##$TPNAME4= <>
##$TPNAME5= <>
##$TPNAME6= <>
##$TPNAME7= <>
##$TPOAL= (0..7)
0.5 0.5 0.5 0.5 0.5 0.5 0.5 0.5 
##$TPOFFS= (0..7)
0 0 0 0 0 0 0 0 
##$TUNHIN= 0
##$TUNHOUT= 0
##$TUNXOUT= 0
##$USERA1= <user>
##$USERA2= <user>
##$USERA3= <user>
##$USERA4= <user>
##$USERA5= <user>
##$V9= 5
##$VALIST= <valist>
##$VCLIST= <CCCCCCCCCCCCCCC>
##$VD= 0
##$VDLIST= <DDDDDDDDDDDDDDD>
##$VPLIST= <PPPPPPPPPPPPPPP>
##$VTLIST= <TTTTTTTTTTTTTTT>
##$WBST= 1024
##$WBSW= 4
##$XGAIN= (0..3)
0 0 0 0 
##$XL= 0
##$YL= 0
##$YMAX_a= 257523
##$YMIN_a= -315136
##$ZGOPTNS= <>
##$ZL1= 120
##$ZL2= 120
##$ZL3= 120
##$ZL4= 120
##$ABSF1= 10
##$ABSF2= 0
##$ABSG= 5
##$ABSL= 3
##$ALPHA= 0
##$AQORDER= 0
##$ASSFAC= 0
##$ASSFACI= 0
##$ASSFACX= 0
##$ASSWID= 0
##$AUNMP= <proc_1d>
##$AZFE= 0.1
##$AZFW= 0.1
##$BCFW= 1
##$BC_mod= 2
##$BYTORDP= 1
##$COROFFS= 0
##$CY= 11.3945322036743
##$DATMOD= 1
##$DC= 2
##$DFILT= <>
##$DTYPP= 0
##$F1P= 2.36226072786647
##$F2P= -0.459571619588291
##$FCOR= 0.5
##$FTSIZE= 0
##$FT_mod= 4
##$GAMMA= 1
##$GB= 0.15
##$INTBC= 1
##$INTSCL= 1
##$ISEN= 128
##$LB= 0.24
##$LEV0= 0
##$LPBIN= 0
##$MAXI= 10000
##$MC2= 0
##$MEAN= 0
##$ME_mod= 0
##$MI= 1.114404
##$NCOEF= 0
##$NC_proc= 0
##$NLEV= 6
##$NOISF1= 3.799351
##$NOISF2= 2.8
##$NSP= 1
##$NTH_PI= 0
##$NZP= 0
##$OFFSET= 15.70392
##$PC= 1
##$PHC0= -15946.07
##$PHC1= 7.80079
##$PH_mod= 1
##$PKNL= yes
##$PPARMOD= 0
##$PSCAL= 0
##$PSIGN= 0
##$REVERSE= no
##$SF= 200.130013532006
##$SI= 16384
##$SIGF1= 3
##$SIGF2= 2
##$SINO= 400
##$SIOLD= 16384
##$SREGLST= <1H.CDCl3>
##$SSB= 0
##$STSI= 0
##$STSR= 0
##$SW_p= 3612.71676300578
##$SYMM= 0
##$S_DEV= 0
##$TDeff= 0
##$TDoff= 0
##$TI= <>
##$TILT= no
##$TM1= 0
##$TM2= 0
##$TOPLEV= 0
##$USERP1= <user>
##$USERP2= <user>
##$USERP3= <user>
##$USERP4= <user>
##$USERP5= <user>
##$WDW= 1
##$XDIM= 8192
##$YMAX_p= 0
##$YMIN_p= 0
$$ End of Bruker specific parameters
$$ ---------------------------------
##NTUPLES= NMR FID
##VAR_NAME=  TIME,          FID/REAL,        FID/IMAG
##SYMBOL=    X,             R,               I
##VAR_TYPE=  INDEPENDENT,   DEPENDENT,       DEPENDENT
##VAR_FORM=  AFFN,          ASDF,            ASDF
##VAR_DIM=   8192,          8192,            8192
##UNITS=     SECONDS,       ARBITRARY UNITS, ARBITRARY UNITS
##FACTOR=    0.0002768,     1,               1
##FIRST=     0,             0,               0
##LAST=      2.2672688,     0,               0
##MIN=       0,             -315136,         0
##MAX=       2.2672688,     257523,          0
$$ Real data points
##PAGE= N=1
##DATA TABLE= (X++(R..R)), XYDATA
0@%%%%%%%%%%%%%%Qj6J6j6J6j6K0k8L2l6M4m8N6o4O9q0R1j01J13j28J44j60J80
$$ 0 0 0 0 0 0 0 0 0 0 0 0 0 0 0 8 -8 8 -8 8 -8 12 -16 16 -20 24 -24 32 -32 37 -43 48 -53 60 -68 76 -84 96
37I6k01K21k45K72k99L28l61L98m38M79n27N80o35P00p73Q51r42J047j165J303
$$ 96 -105 116 -129 143 -156 172 -189 209 -229 250 -277 303 -332 368 -405 446 -496 551 -614 689
57F89j468J666j905K203k590L101l801M815o379R031j4223K7539j13780k20034
$$ 689 -779 887 -1018 1185 -1405 1696 -2105 2710 -3669 5362 -8861 18678 -95102 -315136
71c15136M14157N6581j11828k23927J23858K84408l47901P0712J67470j61908
$$ -315136 99021 155602 43774 -180153 -56295 228113 -119788 -49076 118394 -43514
81d3514n328k6171K71122j40914l57632L66233J17565j55936j78485K2642L79903
$$ -43514 -48842 -75013 196109 55195 -302437 63796 181361 25425 -153060 -130418 249485
92B49485k35854j71161K04678m5390M0941r8607P5869P6859k77828K04163J23901
$$ 249485 13631 -157530 47148 1758 42699 -55908 19961 96820 -181008 23155 147056
103A47056j69198o1273k9064K93205r8315k72699J97662L2161K5589q4586p3022
$$ 147056 -22142 -83415 -112479 180726 82411 -190288 7374 39535 65124 -19462 -92484
114i2484J79599j37649M7383R7420j65995M7604o450J15502j1720k40315J76503
$$ -92484 87115 -50534 -3151 94269 -71726 -24122 -30572 84930 73210 -167105 9398
125I398O3310n1289k1023j07628J64752k5924n7389P9151j38766Q1662N6524l8649
$$ 9398 72708 21419 396 -107232 57520 31596 -25793 53358 -85408 -3746 52778 14129
137A4129O976j40445J49898P1309j47470K8993l1746R1858N513j05990R0602p8095
$$ 14129 21105 -119340 30558 101867 -45603 -16610 -48356 43502 49015 -56975 33627 -44468
149d4468K7830R6603r1595o895n4049J09976P8916k01134L0585P6654K8817k3006
$$ -44468 -16638 79965 -11630 -18525 -72574 37402 116318 -84816 -54231 22423 51240 28234
161B8234j19041J16193L370o5242Q1940n4595r496j3731M7342Q9369j79230n683
$$ 28234 -90807 25386 28756 -36486 45454 -9141 -18637 -32368 14974 104343 -74887 -80570
173h0570J40812J37n6067j11105J20011Q0751j34278K2514J5606J1603m509k8536
$$ -80570 60242 60379 4312 -106793 13218 93969 -40309 -17795 -2189 9414 4905 -23631
185b3631Q5134q9649m5402J29029m076n9625q0270Q5914J18269j41441m1734O7892
$$ -23631 61503 -28146 -73548 55481 51405 -8220 -88490 -2576 115693 -25748 -67482 410
197D10L8599p778q4084N9228J5792n9308O3099k337l4911l2456L3727R8994r8949
$$ 410 39009 31231 -52853 6375 22167 -37141 25958 23621 -11290 -43746 -10019 88975 -9974
210i974o9073Q3134M6998j5961r5322K9120Q2910m9187q448j783n04J2648j2237
$$ -9974 -79047 4087 51085 35124 -60198 -31078 51832 2645 -5803 -7586 -8090 4558 -7679
223g679M3921l9509n1501O6761K8222k2576o3169R288Q9702l0788m7306P12K1192
$$ -7679 36242 -3267 -54768 11993 40215 17639 -45530 -36242 53460 22672 -24634 -23922 -2730
236b730L5906l3340j0327M977j2322L9186k276k8740j3722R156N2559k1617m7290
$$ -2730 33176 -164 -10491 -5514 -17836 21350 19074 -9666 -23388 -14232 38327 16710 -30580
249c0580J1222K5698K7123l1481l2829K2973J7734J4582k4082k9566K2760K1179
$$ -30580 -19358 6340 33463 1982 -30847 -7874 9860 24442 360 -29206 -6446 14733
261A4733O590k6439k3499K7609J8630k791k1767j8076K3733K0581l341k6914j8627
$$ 14733 21323 -5116 -28615 -1006 17624 14833 -6934 -25010 -1277 19304 15963 -10951 -29578
274b9578L3585K5581k1428l2289K859L9185N945l0770j2775J3028J9419O30j4873
$$ -29578 4007 29588 8160 -24129 -21270 17915 23860 -6910 -19685 -6657 12762 13392 -1481
287a481j2234Q88K2739J2965k4506k5448J7105L5763o099l9108n439L4126J4652
$$ -1481 -13715 -12827 9912 22877 -1629 -27077 -9972 25791 19692 -19416 -24855 9271 23923
300B3923k2331j9172P609J7797M562q335j2957o577J7872J9170j4515k7951L155
$$ 23923 1592 -17580 -9971 7826 12388 4053 -8904 -15481 2391 21561 7046 -20905 -17750
313a7750L4641P594l3596j5336K2820K2685j0910k3677J116J4276R827k456j6240
$$ -17750 16891 24485 -9111 -24447 -1627 21058 10148 -13529 -12413 1863 11690 9234 -7006
326g006p477J1908J9137l104k8179m861K7274J4719j9965k3742J1573K4903r03
$$ -7006 -14483 -2575 16562 13458 -14721 -19582 7692 22411 2446 -21296 -9723 15180 14277
339A4277j9275r939J0965J4906P8j3410j1820P593J9844J335k1922j1195J7653
$$ 14277 -4998 -14937 -3972 10934 11012 -2398 -14218 -6625 13219 14554 -7368 -18563 -910
352i10J9919r512k4726J195K1446P998j2744j6575N119J6480L999q830j5964L231
$$ -910 19009 9497 -15229 -14034 7412 15410 2666 -13909 -8790 7690 11689 2859 -13105 -9874
366i874J9441L850j3040j7427R598K3391n378j6745r449J3906J9003j2701j2785
$$ -9874 9567 13417 377 -17050 -7452 15939 10561 -6184 -15633 -1727 17276 4575 -8210
379h210k728J0271J6737j2982j2116q41R789J8107j6554j4600N480J1314J4692
$$ -8210 -10938 -667 16070 3088 -9028 -9869 -80 18027 1473 -13127 -7647 3667 18359
392A8359k1627j2444J3973P312R401k0874r558J8361K071P084j7798j0288K1425
$$ 18359 -3268 -15712 -1739 5573 14974 -5900 -15458 2903 4974 12058 -5740 -16028 5397
405E397J45M706j6640j1371K6766j394j105j4795r266L1944o582q075p108o731
$$ 5397 5542 10248 -6392 -17763 9003 7609 6504 -8291 -17557 14387 7805 -270 -7378 -14109
419a4109L0691j1471r762J825j0363K7757q219j2176L163j1901L1704p261k3091
$$ -14109 16582 5111 -4651 -2826 -13189 14568 6349 -5827 -2664 -14565 17139 9878 -13213
432a3213R286m306K8003j4411k5651K4114o483J4477q280k0543K4285j3634J5074
$$ -13213 -3927 -8233 19770 5359 -20292 3822 -2661 11816 3536 -17007 7278 -6356 8718
445H718K486l1615K1960k042J3417n354l7243L8141K081q581j109k3069L8035
$$ 8718 11204 -20411 1549 -493 12924 7570 -29673 8468 10549 1968 859 -22210 15825
458A5825j0824j2998J9393k9198K2710J700p723J2539l9582L4702J5828l2556
$$ 15825 5001 -7997 11396 -17802 4908 6608 -1115 11424 -28158 6544 22372 -10184
470a0184Q951j7272L5821r88m1846L4647j3961P498Q096k5643K8762k9226J2253
$$ -10184 -1233 -18505 17316 16328 -25518 9129 -4832 2666 10762 -14881 13881 -15345 -3092
483c092L1741m5809J2824k713J7841J2680n8401L7594J1409j7876J3100l0581
$$ -3092 28649 -17160 -4336 -7049 10792 23472 -34929 2665 14074 -3802 9298 -21283
495b1283L3987q961k0254M2658m0101N241J4920n855K3465n6062K5192L8628m1697
$$ -21283 12704 3743 -16511 26147 -13954 -8713 6207 352 23817 -32245 -7053 31575 -10122
508a0122J1617j9295K6714J2421n0148M4342j5465j3330K7379k2846K7320l6910
$$ -10122 1495 -17800 8914 21335 -28813 15529 64 -13266 14113 -8733 18587 -18323
520a8323j59N9221n1754M54L701J0702K7641o5587L2877K1534l5648K7329k4109
$$ -18323 -18482 40739 -11015 -10561 -6860 3842 31483 -34104 -1227 20307 -15341 11988 -12121
533a2121K1804p298l0389O3649l8454j8964K6678n638L1170n8076Q316N5595m7476
$$ -12121 9683 2385 -28004 35645 -2809 -21773 4905 -733 30437 -27639 -19323 36272 -11204
546a1204J1908r934R592K0826n1283M7157o227l6858L7349j4133K2084l1486j8591
$$ -11204 704 -9230 362 21188 -30095 17062 10835 -26023 11326 -2807 19277 -12209 -30800
559c0800P0922m2464j1467J1771l302L5203n4176J8728K9326m6295L2521j1204
$$ -30800 40122 -2342 -13809 -2038 -5340 29863 -24313 -5585 23741 -22554 9967 -1237
571a237M994R37l6672O3705k4070l3674L2334j1583L0678l8701r862N4228m4483
$$ -1237 3757 4694 -31978 31727 7657 -26017 6317 -5266 25412 -13289 -23151 31077 -13406
584a3406J4605K644j3499K5541l8857L7718Q45m6932M2989j0641R018j1902k6675
$$ -13406 1199 3843 -9656 15885 -22972 14746 15591 -31341 11648 1007 10025 -1877 -28552
597b8552N8588l2257r892K2715k4369K9386k5114P599K1749m8836L8571K381j8385
$$ -28552 30036 -2221 -12113 10602 -13767 15619 -9495 -1896 19853 -28983 9588 11969 -6416
610f416R338k5328M6575j6644l3601M0538j9706J2022p745j1074L4423m2980J9692
$$ -6416 2922 -22406 24169 7525 -26076 14462 -5244 6778 -967 -12041 22382 -20598 -906
623i06K2779l5827J4467j2916K9144j475n0852M7268p54j3992K541j5455L9816
$$ -906 21873 -13954 513 -12403 16741 15266 -35586 11682 10928 -3064 -523 -15978 23838
636B3838l1138r245M0973l3537M846n68J2182J3719n5482L5516K4112l2498K397
$$ 23838 -7300 -16545 24428 -9109 -4263 -4831 7351 21070 -34412 1104 25216 -7282 -4885
649d885j0694L7027j3013l7515M5336j2130j0437M337q90K5436m3674Q727M1173
$$ -4885 -15579 21448 8435 -29080 16256 4126 -6311 -1974 -2864 22572 -21102 -12375 28798
662B8798l2834m985l444K6759O022n1489L2603J4893k0039J335q702K9346k0408
$$ 28798 -4036 -9021 -12465 14294 20316 -31173 1430 16323 -3716 -2381 -11083 18263 -2145
675b145j8380M0914j8566j0658J792J1259J8744m5226J1216L1398j9904k948j1633
$$ -2145 -20525 20389 1823 -8835 -7043 4216 22960 -22266 -11050 20348 444 -2504 -14137
688a4137K3134M506l2591K5202j365r552N579n991J9980k2088o691K9707j4566
$$ -14137 8997 13503 -19088 6114 4749 -4803 776 -5215 14765 -7323 -14014 15693 1127
701A127k809p155P555J8733k7596N758Q187n983R931j5264Q230K762j0896J6115
$$ 1127 -1682 -8837 -1282 17451 -10145 -4387 3800 -2183 7748 -7516 714 3476 -7420 8695
715H695j0995o94M966p186J4217j1023l350Q017o287J2479j0591p353J3337k623
$$ 8695 -2300 -2994 1972 -5214 9003 -2020 -5370 2647 -3640 8839 -1752 -9105 4232 1609
729A609L913j1910p88J8247j1839k822K639J665L889j2212J0690L836j5930O765
$$ 1609 5522 -6388 -7176 11071 -768 -3590 -951 714 4603 -7609 3081 6917 -9013 -2248
743b248P523J914j3910n676K5384m796j9159M282J3150L810k0029K508J8948j1306
$$ -2248 5275 7189 -6721 -12397 12987 8191 -10968 -6686 6464 10274 -9755 -7247 11701 395
757C95q616Q486Q868r999j3205K0281P822k2521m171J8981Q731k2212q237K4832
$$ 395 -8221 265 9133 -866 -14071 6210 14032 -8489 -12660 6321 15052 -7160 -15397 9435
771I435J938j9722l79J6559l04j8065O655J6445j2202j3397J3685J4132j6081
$$ 9435 11373 -8349 -8728 7831 7527 -10538 -3883 12562 360 -13037 648 14780 -1301
784a301j4989J8991J3087j8709j1337J7161R838j6453o610J5499K581j4540J340
$$ -1301 -16290 2701 15788 -2921 -14258 2903 12741 -3712 -10322 5177 7758 -6782 -5442
797e442J4155m974j3838P172J4289q511j4997R927J3732r479j1785P585J0779
$$ -5442 8713 3739 -10099 -2927 11362 2851 -12146 -2219 11513 2034 -9751 -2166 8613
810H613p451q059P832L552o397j357O425M14q937K497R224l910p725J651Q604
$$ 8613 1162 -6897 935 4487 -1910 -3267 3158 3572 -5365 -2868 6356 2446 -5279 -3628 4976
825D976p20q847J734N224r1k523j850K298rR2J464l059j93J922Q43j06k812O77
$$ 4976 4256 -4591 -2857 2367 2276 -247 -2097 201 192 284 1748 -1311 -1504 418 1261 1155 -1657 -980
843i80J274M26J451l613j786M149K904l184n807M041O538m473n354L090N159l053
$$ -980 294 720 2171 -1442 -3228 921 3825 641 -5166 -1125 5413 940 -4414 -1324 3835 782
859G82m432M633J849n521K21O451j124q352K005J0071k705j0991L024J1046l246
$$ 782 -3650 983 2832 -2689 -2468 3983 2859 -5493 -3488 6583 3878 -7113 -4089 6957 3711
874C711j0081L145R074l831p910N947N336p380l304Q251L412j1108k434J3432
$$ 3711 -6370 -3225 5849 2018 -5892 55 5391 -1989 -5293 2958 6370 -4738 -7172 6260
888F260J77j2226r71J1917K199j3707R20J1517l256p376J886Q224m291q915R812
$$ 6260 6437 -5789 -6760 5157 7356 -6351 -5431 6086 2830 -4546 -2660 5564 1273 -7642 2170
903B170M480r401l656P720P762j2308n563J3510P60p507l775P464M942j1850K930
$$ 2170 6650 -2751 -6407 1313 9075 -3233 -8796 4714 5474 -2033 -5808 1656 6598 -5252 -2322
918b322P200n216k418N62Q409n187r955J1951K244o034l922K475J0604j0278l612
$$ -2322 4878 -338 -2756 -2194 6215 1028 -8927 3024 5268 -766 -4688 -2213 8391 -1887 -5499
933e499R186l450M31l463L909L223j1267Q504K911o527Q46k377J0001n195q568
$$ -5499 3687 237 668 -2795 1114 4337 -6930 1574 4485 -2042 -1196 -3573 6428 1233 -7335
948g335J1049l410P54j614k775Q843r409L613N021r327O040l055L978P92j1362
$$ -7335 3714 304 1058 -556 -3331 5512 -3897 -284 4737 -4590 1450 -1605 2373 3165 -8197
963h197J2479k468l991M207o781R725n906k513R795j1923O548R90l542N776j2117
$$ -8197 4282 1814 -2177 2030 -4751 4974 -932 -3445 6350 -5573 975 1965 -1577 4199 -7918
978g918J1425J810j2016R721n833N916j283r208J5105j0754L39P799q965Q188
$$ -7918 3507 5317 -6699 3022 -2811 3105 1822 -7386 7719 -3035 -2696 5103 -3862 4326
992D326r977N592R446j8475J0244J29j066M002j4140J6263l605j0055J3186r364
$$ 4326 -5651 -59 9387 -9088 1156 1285 219 4221 -9919 6344 2739 -7316 5870 -3494
1006c494O369m241l769J6414j8477M127Q645p879P315j4159J1311O920j9262J3778
$$ -3494 2875 -1366 -5135 11279 -7198 -3071 5574 -2305 5010 -9149 2162 9082 -10180 3598
1020C598m084P81K765j2078J8868j1633o042J6037j1296O566q832K431J6226k3399
$$ 3598 -486 295 3060 -9018 9850 -1783 -7825 8212 -3084 3482 -5350 -2919 13307 -10092
1034a0092R012N413o619P689j5448J5777m06j7002J9354q706J213n75o807K1065
$$ -10092 -1080 4333 -2286 5403 -10045 5732 5326 -11676 7678 -1028 185 -390 -7197 13868
1048A3868k0047j135J6006j1729P607j2425P831J1829k4215J5362N10o381O258
$$ 13868 -6179 -7314 8692 -3037 4570 -7855 -24 11805 -12410 2952 3462 -2919 3339
1061C339j2399J9384r438j3519K2334j0439K017n095j428K0285k4022M494J2363
$$ 3339 -9060 10324 886 -12633 9701 -738 1279 -3816 -5244 15041 -8981 -4487 7876
1074G876j1508P886j2568J2535M116k2835K0821k960n533K254q437K2243j6465
$$ 7876 -3632 4254 -8314 4221 8337 -14498 6323 3363 -2170 84 -8353 13890 -2575
1087b575q824K1196j1542M519q442L300J5955k5575J1720P423j1065O701j1687
$$ -2575 -11399 9797 -1745 2774 -5668 -2368 13587 -11988 -268 7155 -3910 2791 -8896
1100h896J7549l534k0054K2729n971j644j994n800K1978j9651k227J6243j2005
$$ -8896 8653 5119 -14935 7794 1823 179 -1815 -7615 14363 -5288 -7515 8728 -3277
1113c277O770r924P416R882k4036J5684K869p760M020j0848J9326p535j4490J9213
$$ -3277 3493 -6431 985 10867 -13169 2515 5384 -2376 1644 -9204 10122 2587 -11903 7310
1127G310q142K844m157l346J7476j9335M202J0374j1114P142j0026J0222M361
$$ 7310 -832 2012 -2145 -5491 11985 -7350 -3148 7226 -3888 3254 -6772 3450 7811
1140G811j9798J6099j952k895K546j0062J7339r650o551J4135j0672O373m908
$$ 7811 -11987 4112 2160 -735 1811 -8251 9088 -562 -7113 7022 -3650 2723 -2185
1153b185n50J1982j7683Q786M276q043P280j0683J0694O95j2966J3610o903J856
$$ -2185 -2735 9247 -8436 350 4626 -3417 3863 -6820 3874 4569 -8397 5213 -1690 166
1167A66K104q130J2846j0311M08Q928j0588P484n424J629P217j3401R486j058
$$ 166 2270 -5860 6986 -3325 -2917 6011 -4577 2907 -2517 -888 6329 -7072 2414 1356
1181A356m107O968r315Q116k083n539J0396r321L592J601m723Q221r607M123M389
$$ 1356 -2751 4217 -5098 3018 935 -4604 5792 -3529 63 1664 -3059 5162 -4445 -322 4067
1196D067q197P319n532K271L325q108Q861m994j471O041o542N798m523o65P588
$$ 4067 -4130 3189 -2343 -72 3253 -4855 4006 -988 -2459 3582 -2960 2838 -1685 -2350 5238
1211E238q767M059j49j849N164p749N392N44n322O371m552K324j09l920P710n799
$$ 5238 -3529 530 381 -1468 3696 -4053 1339 1883 -3439 2932 -1620 704 595 -3325 4385 -1414
1227a414m64L694l142M082n205J343M697o154L353r58j94K157m842N212j298l542
$$ -1414 -1878 1816 -1326 2756 -2449 -1106 3591 -2563 790 -168 -362 1795 -3047 2165 867 -2675
1243b675M173j986K038k428j592N945m075n07J289n71K576m301J843K380l811
$$ -2675 1498 -488 1550 -878 -2470 3475 -600 -1107 182 -389 2187 -2114 -271 2109 -1702
1258a702K028m32R18n03k998M789r42k844J280L77K304l372r45M149j879q67M2
$$ -1702 326 -106 812 309 -2689 2100 1158 -1686 -406 -29 2275 -1097 -2042 2107 228 -639 -597
1275e97J132P58l334K214J742k758l27J117K185k269k588L826Q07k657q82K003
$$ -597 535 1293 -2041 173 1915 -843 -1170 -53 2132 -137 -2725 1101 1908 -749 -1631 372
1291C72J689l122n25L105o42k324N56K712j014l213K018K887k290k753K353K807
$$ 372 2061 -1061 -1586 1519 877 -1447 -891 1821 807 -2406 -388 2499 209 -2544 -191 2616
1307B616k663k515K892K084l163j425L355O33l273k91L614j63m199J200L966j619
$$ 2616 -47 -2562 330 2414 -749 -2174 1181 1814 -1459 -1750 1864 1701 -2498 -1298 2668 1049
1323A049l628J388M097k089l831K869K617k460k400K586K504l879j181M058J47
$$ 1049 -2579 -1191 2906 817 -3014 -145 2472 12 -2388 198 2702 -1177 -2358 1700 1847
1338A847l417o81M261K95n023J132L940r79l515N71M228j896l443K762J993k119
$$ 1847 -1570 -2251 2010 2305 -2718 -1586 2354 1375 -2140 -1569 2659 763 -2680 82 2075 -44
1354d4k336K715K520m175j076L837O21l161j376M035O13m114O02K860l28k752
$$ -44 -2380 335 2855 -1320 -2396 1441 2062 -1099 -2475 1560 2173 -1941 -1339 1521 1193 -1559
1370a559M31L220j780k324K118J628j695k120K282J966k801j093K234J001j957
$$ -1559 -1128 2092 312 -2012 106 1734 39 -2081 201 2167 -634 -1727 507 1508 -449
1385d49j015K180K96j811J30J465k70j547P56J333r73j117Q88J244j119q83R44
$$ -449 -1464 716 1012 -799 -669 796 526 -1021 -265 1068 95 -1022 -134 1110 -9 -892 52
1402E2N00l34p81N50L99p02O18l06k64M32k83N84q08P1R45j232P19J25m84K12
$$ 52 552 218 -563 -13 386 -316 302 -4 -268 164 -119 465 -343 -272 673 -559 160 285 -199 13
1422A3o88J815r80j691K219j89k26j255K96K880l049l38K101n93N0k162K628J092
$$ 13 -675 1140 160 -1531 688 499 273 -982 -686 2194 -855 -1193 908 315 365 -1797 831 1923
1440A923m277K308J085k99j468j595N387k462l432L488J76N71l719J124N196n686
$$ 1923 -2354 -46 1039 740 -728 -2323 3064 602 -2830 658 834 1405 -2314 -1190 4006 -1680
1456a680m1K754K1l58m492N678J249o735L204J396J155l423k662Q541l944m055
$$ -1680 -1721 1033 1054 696 -3796 1882 3131 -3604 -400 996 2151 -1272 -3934 4607 663 -3392
1472c392L858L62J742o241K400O579p848P35K451J274o68o917Q445R16p588L508
$$ -3392 466 828 2570 -3671 -1271 5308 -2540 -1805 646 1920 1252 -5665 2780 3696 -3892 -384
1488c84M15L503n010l330J0455n730k844L210K77L105q820M369O750r185K011
$$ -384 31 3534 -1476 -4806 5649 -81 -2925 285 562 3667 -5153 -784 5966 -3219 -1208
1503a208P34L138r09q558J0508q12o484L832j253N341o560k260J0853p740o28
$$ -1208 -474 2664 1755 -6803 3705 2893 -3591 241 -1012 4329 -2231 -4491 6362 -1378 -2006
1518b006J960M32L880j0277O201N059q808L742j662M274j258q025J1168l636l957
$$ -2006 -46 386 4266 -6011 190 5249 -3559 183 -1479 2795 1537 -6488 4680 1044 -2913
1533b913L998k776O191p548o8R334r193K535K30L46L731j0032Q286J256p472O062
$$ -2913 1085 -1691 4500 -3048 -3116 6218 -2975 -440 -210 136 3867 -6165 2121 3377 -4095 1967
1549A967l901M615k521n304J1150p669m22M019l773N943q319L561O010j0134O318
$$ 1967 -1934 2681 160 -5144 6006 -1663 -2085 1934 -1839 4104 -4215 -654 5356 -4778 1540
1564A540j799K88K467q065J0088l828n006P865n516M399l974j513R587j0617L308
$$ 1540 -259 29 2496 -5569 4519 691 -4315 3550 -1966 2433 -1541 -3054 6533 -4084 -776
1579g76L186m216M877p720O658J642r674R141l174J45M71n030J0802q074k295
$$ -776 2410 -1806 3071 -4649 2009 3651 -6023 3118 -56 89 560 -4470 6332 -1742 -4037
1594d037Q323o006L785n102K366O841j2227O725J913m052L059o358R428l049q170
$$ -4037 4286 -1720 2065 -3037 -671 6170 -6057 668 2581 -1471 1588 -4770 4658 1609 -6561
1609f561J0834m413O17j726j764J0242j1267J249P241o123L307n662N752L241
$$ -6561 4273 -140 477 -1249 -3013 7229 -4038 -2789 4452 -1671 1636 -4026 1726 4967
1623D967j2099R217K4k982J206m775J0558o443n465J0336n091J382l154Q68Q164
$$ 4967 -7132 2085 2109 -873 333 -4442 6116 -327 -5792 4544 -547 835 -2319 -1451 6713
1638F713j2001M010N233n420K519n230P493m1j0157R793j573j704j40k905R633
$$ 6713 -5288 -1278 3955 -1465 1054 -4176 3317 3276 -6881 2912 1339 -365 -505 -3410 6223
1653F223q225k159Q609n475J885l610K940N178j1180O177K610m182J864m477P943
$$ 6223 -2002 -4161 4448 -1027 858 -2752 188 5366 -5814 363 2973 -1209 655 -3822 4121
1668D121k759o981R053l262k1j142j251P769q704R84N836m982K339l839M077K439
$$ 4121 1362 -5619 3434 172 151 -991 -2242 5527 -3177 -2193 3643 -1339 1000 -2839 1238 3677
1684C677q881O653J28k315J203l537O990m075l595P009l910J069j516P2N213p559
$$ 3677 -5204 1449 1577 -738 465 -3072 3918 -157 -3752 3257 -653 416 -1100 -1028 4185 -3374
1700c374K718L197l780K194l347M000M02n878N805j593p61P45k358N202m323q80
$$ -3374 -656 2541 -1239 955 -2392 1608 2010 -3868 1937 344 -417 328 -2030 3172 -1151 -2031
1716b031M619l663J744j809Q49L070n630L253P63k113J962k899L400q48l015M253
$$ -2031 2588 -1075 669 -1140 -291 2779 -2851 402 1165 -948 1014 -1885 1515 667 -2348 1905
1732A905k428N68R5j387L528l627O82K197k626K017j845R29J420l259K766q02
$$ 1905 -523 45 140 -1247 2281 -1346 -664 1533 -1093 924 -921 8 1428 -1831 935 133
1748A33p73J500k019K211j169r31K429k238J122j32q31J866k155J179M04j584
$$ 133 -640 860 -1159 1052 -117 -1048 1381 -857 265 133 -698 1168 -987 192 596 -988
1764i88J822j257M50L49j225J843j395k0J102j204J008q69K76Q88j673J241p2
$$ -988 834 -423 27 376 -849 994 -401 -421 681 -523 485 -384 -108 780 -893 348 276
1781B76o14N67p20J160o53q49J456n52j38k40J64R52j368K02Q93n46j14k84Q48
$$ 276 -338 229 -491 669 16 -833 623 71 -67 -307 -143 809 -559 -357 536 -10 -124 -408 440
1800D40m8j247R15N15o17m65L22R57q06p60J022L69p84m08Q39L96j073j13J106
$$ 440 392 -855 60 575 -42 -507 -185 772 -34 -794 228 597 -187 -595 244 640 -433 -546 560
1819E60r6j091K46J034k49j145L56J277p16j024Q14P42o01r33Q31R65j359l53
$$ 560 464 -627 -381 653 404 -741 -385 892 176 -848 -34 708 107 -826 5 970 -389 -742
1837g42J138K31r41n69J520J13j608M41J008p1j189K2J700q59j133R74O10m22
$$ -742 396 627 -314 -883 637 750 -858 -417 591 520 -669 -647 1053 194 -939 35 645 223
1855B23j163R24J157j602k77J104L38r18q05J682J26j624M68Q74Q2j245J3J708
$$ 223 -940 -16 1141 -461 -738 366 704 -214 -1019 663 789 -835 -367 507 589 -656 -643 1065
1873A065r34r86Q66O11l98j197J012R88j444k58R19M55r11o88J457N1j243L04
$$ 1065 131 -855 11 622 224 -973 39 1027 -417 -675 244 699 -212 -900 557 608 -635 -331
1891c31P40N4j031J50J212p05p68O49O19m89q00P26O50q43l70P10K93o71k12O96
$$ -331 409 463 -568 -418 794 89 -679 -30 589 100 -700 26 676 -167 -537 173 466 -205 -417 279
1911B79Q0p24J07O51k58m83J89M58q9o67M08M31n22L4J5K64o5m88O10j76k42L02
$$ 279 359 -365 -258 393 135 -348 -159 299 210 -457 -49 382 -140 -106 -91 173 108 -380 230 54 -188 114
1933A14l01M49l62j39N98o27M30j56l05P65p59L66K0m40R25r91L36M71p70P57
$$ 114 -187 262 -100 -239 359 -268 162 6 -299 466 -293 73 93 -347 578 -413 -77 394 -376 381
1953C81p85M91M13j300J272m70j76M71j011J518r24n95J492j192P42n72k02J576
$$ 381 -404 87 500 -800 472 2 -174 297 -714 804 -120 -715 777 -415 327 -245 -447 1129
1971A129k014R06M52r68J127j503J313J81j874K066j008K08L07j391K380j707
$$ 1129 -885 21 473 -495 632 -871 442 623 -1251 815 -193 15 322 -1069 1311 -396
1987c96k88J645j707J478j224Q5J751k644J770k08q58J562k225K038l60j704K518
$$ -396 -684 961 -746 732 -492 -407 1344 -1300 470 262 -596 966 -1259 779 419 -1285 1233
2004A233k054J164N8j680K778k375P71R80k199K628k012M49J390k631K724j666
$$ 1233 -821 343 401 -1279 1499 -876 -105 875 -1324 1304 -708 -259 1131 -1500 1224 -442
2020d42j39J995k947K510j099o28K286l240K548l48j732K617k689K136l41k247
$$ -442 -581 1414 -1533 977 -122 -750 1536 -1704 844 496 -1236 1381 -1308 828 487 -1760
2036a760L624k736P90P07j928L227l283R23K207l361K502j659Q29J503m126L883
$$ -1760 1864 -872 -82 625 -1303 1924 -1359 -436 1771 -1590 912 -747 82 1585 -2541 1342
2052A342q43j610K068k435L271k119j655M412l431J037j27o17L149m879K455J898
$$ 1342 499 -1111 957 -1478 1793 -326 -1981 2431 -1000 37 -90 -707 2442 -2437 18 1916
2068A916l459K359k113K420K7m219N119j816j052J258j843M029l919m13M387l885
$$ 1916 -1543 816 -1297 1123 1150 -3069 2050 234 -818 440 -1403 2626 -1293 -1706 2681 -1204
2084a204J497j065P48K494n610L788R87k994K067k348L542j385l563N493k617
$$ -1204 293 -772 -24 2470 -3140 648 1635 -1359 708 -1640 1902 517 -3046 2447 -170
2099a70l11M68j106M032m942Q95L704l900J854j711J758J484n346M643l37k179
$$ -170 -481 -13 -1119 2913 -2029 -1134 2570 -1330 524 -1187 571 2055 -3291 1352 1015 -1164
2115a164J848k286L888k637k095N126l484P64k36m51L420n214K406K063l480K426
$$ -1164 684 -1602 2286 -351 -2446 2680 -804 -40 -276 -727 2693 -2521 -115 1948 -1532 894
2131H94k235K350J89m171M970j864r47J421k059L786l407m15L901l759J821r02
$$ 894 -1341 1009 1198 -2973 1997 133 -814 607 -1452 2334 -1073 -1488 2413 -1346 475 -427
2147d27P1K410m591L339L66k684K620k344K395p70k569M402k910K44J126j801
$$ -427 -356 2054 -2537 802 1168 -1516 1104 -1240 1155 385 -2184 2218 -692 -448 678 -1123
2163a123K979l309J069K276l652K596j185K53J276l331L674j271j612K581k244
$$ -1123 1856 -1453 -384 1892 -1760 836 -349 -96 1180 -2151 1523 252 -1360 1221 -1023
2178a023K097j432q87L355l460J355N60j328K078k910K141O19k932K839j464O02
$$ -1023 1074 -358 -1245 2110 -1350 5 565 -763 1315 -1595 546 1165 -1767 1072 -392 210
2194B10K46k067L391k225m57K004j901J727j719M10K064l254J902Q5q20J160k199
$$ 210 456 -1611 1780 -445 -902 1102 -799 928 -791 -381 1683 -1571 331 416 -404 756 -1443
2211a443K473n10k013K515j385O55l44r22K581k451L50J357j434J219j553J083
$$ -1443 1030 520 -1493 1022 -363 292 -52 -974 1607 -844 -494 863 -571 648 -905 178
2227A78R34k532J930l41l20N28j458K180j093r80J811j198P55p42j16J717k130
$$ 178 1112 -1420 510 169 -151 377 -1081 1099 6 -974 837 -361 394 -348 -464 1253 -877
2244h77P63N83p52P87j397J320J99j638J484n45J86mq81J676j126k96J014p83
$$ -877 -114 469 -283 504 -893 427 626 -1012 472 -73 113 109 -772 904 -222 -518 496 -287
2262b87P01q58K46R89j418O90M6j97M58j034J025o3q31Q27m66M14k48m86J082
$$ -287 414 -444 -198 791 -627 63 109 -88 370 -664 361 298 -533 294 -172 242 -6 -492 590
2281E90p15o8L25k74N40p73K61N82p45L09j44K23J33p51O97K1m17K05j41M71l94
$$ 590 -125 -193 132 -142 398 -375 -114 468 -277 32 -112 111 244 -507 190 211 -206 -1 -142 329 -65
2302f5k99O81k48j60p5K00L24o68J43M38k36j51o3M11p5n12L69K68k89k22K19
$$ -65 -364 317 69 -91 -166 34 358 -310 -167 271 35 -116 -179 232 157 -355 14 282 -7 -229 -10
2323a0L32l76k46M23J54m07j36M35O7m17m3M44m6m70J84L48j51l45J22M93l45
$$ -10 322 -54 -300 123 277 -130 -266 169 236 -181 -224 220 174 -296 -112 236 85 -260 -138 355 10
2344A0l58M28J27k14k62K78L41n53lL86o8j91j76M97l7n50L44J78r9k31l9N49
$$ 10 -348 80 207 -7 -269 9 350 -203 -206 180 112 -79 -255 242 205 -345 -1 177 78 -153 -192 357
2366C57l66k69M05m8m4k49K02L03n11J20K22q2m8k34M23n3l91L26k8J8j25p4L98
$$ 357 -9 -278 127 79 35 -214 -12 291 -220 -100 122 40 -8 -242 181 128 -263 63 35 53 -72 -146 252
2389B52l13p0K46j37Q1j85J44J50l31J87K2m2M1j68K44r9j33K08j28M4j4n1J38
$$ 252 -61 -131 115 -22 59 -126 18 168 -163 24 46 4 45 -123 121 22 -111 97 -31 13 -1 -52 86
2412H6j48N3Q1j23N9k0K8qo8J05m1n4N6Rl7j8M2L9n2o4J34%j35Q7j2M3m5q3K01
$$ 86 -62 -9 72 -51 8 -12 16 8 -60 45 4 -50 6 15 -22 -40 2 41 -11 -75 59 59 -76 11 -1 42 -3 -86 115
2441A15j22o1J31r2J13j86M7K50l18J38pqJ39l58L14J7k92L05k28J99p0k59N14
$$ 115 -7 -68 63 -29 84 -102 -55 195 -123 15 8 0 139 -219 95 112 -180 125 -103 96 26 -233 281
2464B81m02J9K10k52L87m73J74L54n77M08k11O6K46o51P01k09l37N13m93N04k97
$$ 281 -121 -102 108 -144 243 -230 -56 298 -279 129 -82 -16 230 -421 280 71 -266 247 -246 258 -39
2485c9k85Q02p56K87R4l23O42q45M95K83q14P64m96K47J75q26J134o19k36O65
$$ -39 -324 478 -278 9 103 -220 422 -423 72 355 -459 305 -191 56 231 -595 539 -80 -316 349
2505C49p04P77o77l9R67j233O69l0k60O46j190J106n2j008J145p26N18k24p12
$$ 349 -355 422 -255 -294 673 -560 109 79 -181 465 -725 381 329 -679 466 -260 258 34 -678
2524f78J593j259K6P16p30R11j228O32Q80j730J147k53oL48j381J861o53j035
$$ -678 915 -344 -318 398 -332 579 -649 -17 863 -867 280 27 21 369 -1012 849 196 -839
2542h39J383q27Q17q94k87J938j967M07O38n49Q23j740J427O24k105J486l65L46
$$ -839 544 -283 534 -360 -647 1291 -676 -269 369 -180 643 -1097 330 954 -1151 335 -30 316
2560C16j80j351K502j300q64J464q28R85j513L25J982k507Q32M24k76O02k034
$$ 316 136 -1215 1287 -13 -877 587 -241 744 -769 -444 1538 -969 -137 287 11 613 -1421
2577a421K190L7k065J735o55P55p51j028K799j990l26J231p55J122k031J048J567
$$ -1421 769 806 -1259 476 -179 576 -175 -1203 1596 -394 -720 511 -244 878 -1153 -105 1462
2594A462k662J317o4J70K71k043K675o80j587J734r23J100j219m94K602k398L62
$$ 1462 -1200 117 53 223 494 -1549 1126 446 -1141 593 -330 770 -449 -943 1659 -739 -377
2611c77Q05o74J107k143J590Q05k395J763o11L84M9j633K671j449p72J644j261
$$ -377 428 -246 861 -1282 308 1113 -1282 481 -130 254 303 -1330 1341 -108 -880 764 -497
2628d97J217j347J72J881k558J238K50o85R98j851J938k43j752K104j163N13j98
$$ -497 720 -627 -455 1426 -1132 106 356 -329 669 -1182 756 513 -1239 865 -298 215 17
2645A7q80K282k154K77J342j436J103j282R17Q44k444J991k86o07O45j245K070
$$ 17 -863 1419 -735 -458 884 -552 551 -731 186 1030 -1414 577 291 -316 329 -916 1154
2662A154j294r68K251j477M37l85j0J620k550J103J038j472Q00r80J419j30k082
$$ 1154 -140 -1108 1143 -334 103 -282 -292 1328 -1222 -119 919 -553 247 -733 686 556 -1526
2679a526K398o07n87K77n23J917j995k61K119j490K80n34P40R31k603J619O91
$$ -1526 872 265 -322 -45 -568 1349 -646 -907 1212 -278 2 -532 208 1139 -1464 155 846
2696H46j217L50o98J815r22j609K364p00l79k58J10J699k315K53J692j169R7p22
$$ 846 -371 -21 -719 1096 174 -1435 929 229 -150 -408 -298 1401 -914 -661 1031 -138 -41 -763
2714g63J301L58k322J689L59p56q1m65J860j255j084J930n90j64n81M41J342k073
$$ -763 538 896 -1426 263 622 -134 -215 -680 1180 -75 -1159 771 181 17 -564 -123 1219 -854
2732h54M46J118p26M0p82J356M5j752J368J01k90l04l32J579j177n98J268m32
$$ -854 -408 710 -16 24 -758 598 643 -1109 259 360 70 -234 -566 1013 -164 -762 506 74
2750G4R4p22N21R09j583N41N21l11L8p27J159j76j026R21j77J11l47k19J087q84
$$ 74 168 -554 -33 876 -707 -166 355 44 82 -645 514 338 -688 233 56 167 -180 -399 688 -196
2770a96j21N72l05K84o14L95M37q67M93k0m8J43n18O58k37l32N08l82K64j21j81
$$ -196 -317 255 -50 234 -380 15 452 -415 78 58 10 153 -365 293 56 -276 232 -150 114 -7 -188
2791a88M60m73K23J06l31L60k39J07L1k68M54l16p6K83j81J16k48K03K58n26J92
$$ -188 272 -201 22 128 -203 157 -82 25 56 -212 242 -74 -150 133 -48 68 -180 23 281 -245 -53
2812e3J90o3j37j63M78j43m19L29J80j40l08J81M54m70k24M26J42l27k57M65J87
$$ -53 137 74 -63 -226 252 109 -310 19 199 59 -249 -68 386 -84 -308 118 260 -67 -324 141 328
2833C28n76j0N10l5n00M8N69j46n52K30N10l02m72L56M30l95m16M98L26n56k18
$$ 328 -248 -258 252 217 -283 -235 334 188 -364 -134 376 74 -398 -42 388 -7 -423 75 401 -155 -373
2854c73N37K01n69j77P03k6o32J18N18n6o22J88O49l93m65L65M01l15n19N17L74
$$ -373 164 365 -204 -381 322 296 -336 -218 300 244 -378 -190 459 66 -399 -34 367 52 -467 50 424
2875D24n95j34M23K18m91k31O92n3n51J07M07K5n71J35N85l60l24K44L16j89m43
$$ 424 -171 -305 118 336 -155 -386 306 253 -298 -191 216 241 -330 -195 390 30 -294 -50 266 77 -366
2896c66M38K45m62n8K77J89l64j91N19o9l50Q5K48L3l94J21L58k64j66J50J92
$$ -366 72 317 -145 -203 74 263 -101 -292 227 158 -192 -107 141 174 -220 -99 259 -5 -171 -21 171
2917A71j35k67K82J14k41l1J39J12k18p0K59m5j82N8J35k6j72Q2J34j09o7Q5N3
$$ 171 36 -231 51 165 -76 -107 32 144 -74 -144 115 70 -112 -54 81 55 -117 -35 99 -10 -77 8 61
2940F1o6m9O3M7j01MQ6l3k7PJ4L6q9N4M0q7O1k9kL4q4J22r0j6J09j14P6l9j5J07
$$ 61 -5 -54 9 56 -45 -41 45 12 -15 -8 6 42 -47 7 47 -40 21 -8 -10 24 -60 62 -28 -44 65 -49 27 -12 -27 80
2970H0j90J51Lj25J47j32J31l8j58K58j66K5O1j38K47k60O2J87k64K04j45O6J44
$$ 80 -110 41 44 -81 66 -66 65 27 -131 127 -39 -14 47 -91 156 -104 -42 145 -119 85 -60 6 150
2993A50l69L27p2j18J94k84L24j51k07M05l03J37m1j41M28m80J48K00k90L08l68
$$ 150 -219 108 36 -82 112 -172 152 1 -206 199 -104 33 -8 -149 279 -201 -53 147 -143 165 -203
3014b03K38J94n41M50j48oJ42m40O22l07k54M82l50L10l19n7O47p47K49J65k07
$$ -203 35 229 -312 138 -10 -16 126 -314 308 1 -253 229 -121 189 -130 -187 460 -287 -38 127 -80
3035h0L28o58N71J47p28N84k34K14j13m88R59n66k09M59l08M61o87J95P40r83
$$ -80 248 -410 161 308 -420 164 -70 144 31 -457 502 -64 -273 186 -122 339 -348 -153 587 -396
3055c96L77M3L2K26r15R54op75O15k94M84m43m43J216q13j15L67j89N41j019M78
$$ -396 -19 24 56 282 -633 321 315 -460 155 -139 345 -98 -541 675 -138 -253 114 -75 466 -553 -75
3076g5P25j101M86j01K59M6j005J261k73o87O19l28O45p42k30J264j040J13K06
$$ -75 650 -451 35 -66 193 239 -766 495 222 -465 154 -174 471 -271 -501 763 -277 -164 42
3095D2q6N42j213Q18M54j066O45k98M59j74q73J398o17l77N16l87P74r64J18J019
$$ 42 -44 498 -715 103 557 -509 136 -162 297 123 -750 648 31 -346 170 -217 557 -407 -289 730
3115G30j141M29m6M5M22j181J066J8q49P65m92N56l40n66J281r22J8M11m47P20
$$ 730 -411 18 -28 17 439 -742 324 342 -507 258 -234 322 -18 -584 697 -225 -207 204 -243 477
3135D77r74M39O33j145P82k54K9K86r03J144m56n24Q72o57N41m55j40J006j182
$$ 477 -497 -58 575 -570 212 -42 -13 273 -630 514 58 -466 406 -251 290 -165 -305 701 -481
3154d81M59K93m62N30q59Q02Q5j035J020l93P8kn03J159r34j34Q25o47M28n93
$$ -481 -22 271 -191 339 -520 282 367 -668 352 -41 37 35 -468 691 -243 -377 448 -199 229 -364
3174c64L47O49j310P66J66l58K44o77J051l50q34J088m31R8k49j43J066j163J11
$$ -364 -17 632 -678 88 254 -104 140 -537 514 164 -670 418 -13 85 -164 -307 759 -404 -293
3193b93P21n46L03o48O47L54j235Q50L6j88J6n31J144o13n98R37l52J62m95J36
$$ -293 428 -118 185 -463 184 538 -697 153 189 1 17 -514 630 17 -581 356 4 166 -329 -193
3213a93R15j177K45M81k71J64p18Q47J25j025P38n2P4k24l96J079o54l58O10k06
$$ -193 722 -455 -210 271 0 164 -554 293 418 -607 131 79 153 -71 -467 612 -42 -400 210 4
3233DK62o37K51P23r69K70J99j1Q5o97Q00Qo88M98j40K65k98l33Q77n41j47K90
$$ 4 266 -371 -120 603 -366 -96 103 92 177 -520 280 288 -400 98 -42 223 -75 -408 469 -72 -219 71
3255G1j16L29o23K62M78o47K35n0J57P0n69N96l9l57K76j86L49k84k03N59l76
$$ 71 -45 284 -339 -77 401 -246 -11 -61 96 166 -403 193 154 -203 73 -113 236 -48 -251 308 -68
3276f8L4M3o0K83m56K17J98l42K31j67J43N7l38L73j43q2J59k02K45j67m4K26
$$ -68 -34 9 -51 232 -224 -7 191 -151 80 -87 56 113 -225 148 5 -77 82 -120 125 -42 -86 140
3298A40k70J81l4r7J70j87J67n5j49K55j56OM2n0J60k38R0J81k20M0KJ20n5k27
$$ 140 -130 51 17 -80 90 -97 70 15 -134 121 -35 -29 13 -37 123 -115 -25 156 -64 -24 -22 98 43 -184
3322a84K70L5k02J8P9J45k52o1L06p4j98K7K10kl12J38K44j66j90J32K28j85k41
$$ -184 86 121 -81 -63 16 161 -91 -152 154 80 -118 -91 119 117 -195 -57 187 21 -169 -37 191 6 -235
3345b35K80J46k57j18K50J28l01p2L17K0l20L5L08o8l02J10K99j51k78J91K20
$$ -235 45 191 -66 -184 66 194 -107 -179 138 158 -162 -127 181 113 -189 -79 220 69 -209 -18 202
3366B02j83k22K15J93k65j32K70P3k30q1K50P1l08L4K44o0j84J3K27p3k14J63
$$ 202 19 -203 12 205 -60 -192 78 151 -79 -160 90 161 -147 -113 131 71 -113 -100 127 54 -160 3
3388CJ03q9j27Q7J48j66n5J52Ko9n9J00M8j52O1M8k7j4l1P3l8l1P3p0K3K0k6J5
$$ 3 106 17 -110 -23 125 -41 -96 56 58 -11 -70 30 78 -74 -13 35 8 -6 -37 36 -2 -33 40 -30 -7 13 -13 2
3416Bl1P4l3r0J15kp7k2Q1O8j55j0J72m9j21NJ81n6k01J40J32j15j33J09J76j83
$$ 2 -29 45 12 -78 37 35 -42 -64 17 85 -70 -80 92 43 -78 -73 108 52 -149 -9 123 8 -125 -16 160 -23
3442b3j32K25P1k09p8K39N8k67%K50k0k61N4K67j24k29J22K44j62k21K03J70k17
$$ -23 -155 70 141 -68 -146 93 151 -116 -116 134 114 -147 -93 174 50 -179 -57 187 25 -196 7 177 -40
3465d0j34K00J52k55p9K59Ok03m2K32L6k90R4J85p3j46K1K34j26j93J94M9o8j08
$$ -40 -174 26 178 -77 -156 103 109 -94 -136 96 132 -158 -64 121 48 -98 -77 157 31 -162 32 81 13 -95
3489i5O1J98k24k5J41k1j8j30J45P4k19J11ML4k7j37K15o5r3Q8p7J61j50n4K16
$$ -95 -34 164 -60 -85 56 35 17 -113 32 106 -113 -2 2 36 9 -128 87 22 -71 17 -60 101 -49 -103 113
3514A13j48N0p0J8J91k82R1J14j01P9k08K48L4l17K43k7J0n7j47L92k57j23K47
$$ 113 -35 15 -55 -37 154 -128 -37 77 -24 55 -153 95 129 -188 55 28 38 -19 -166 226 -31 -154 93
3537I3q5R2k70J27L20m60J29J18l2K0l27M45m3l89L20m9J04k25r0N28m29o9K81
$$ 93 8 100 -170 -43 277 -183 -54 64 32 52 -275 170 127 -262 58 9 113 -112 -202 326 -103 -172 109
3560A09r8J11l78K98K53n78K89N2J3o3l15O23k56l41M13j27J25l18O6N18o39J22
$$ 109 11 122 -256 42 295 -283 6 58 71 8 -307 316 60 -281 132 5 130 -188 -122 396 -243 -121
3582a21K70j62R1l94M97M9o29N08n5k3j01j84O61n12j74N17k81J19l03K36L57
$$ -121 149 -13 78 -316 181 230 -399 109 54 31 -70 -254 407 -105 -279 238 -43 76 -227 9 366
3603C66p49M02J60k38R8l19N96k42m74O71k65pr9j4N43p15J22M65l91J24k56L89
$$ 366 -383 19 179 -59 39 -280 316 74 -400 271 6 -1 -100 -114 429 -286 -164 301 -90 34 -222 167
3625A67P6p26O52j4k61P9j68N82n17k32P29m30J9p9J30L51p96M38L12m96J81j67
$$ 167 243 -483 169 155 -106 -27 -195 387 -130 -362 367 -63 -44 -123 7 358 -438 0 312 -184 -3 -170
3647a70M35j91n45Q07k61k32J51p1M60o78R5O22n98J15k3J99J06p09O62P7n02
$$ -170 265 74 -471 336 75 -157 -6 -77 383 -295 -200 422 -176 -61 -84 115 221 -488 174 251 -251
3668b51K43q8L90m12k81Q34m85j29J64L4K82p28L95M30o50J95NK67j47n35P98
$$ -251 -8 -96 294 -118 -399 435 -50 -179 -15 19 301 -427 -32 398 -252 -57 -52 215 68 -467 331
3689C31j85m10K74l0L31n58J2O91o06J2J42R3J00o41N59K09n99K53k3K73k69l40
$$ 331 146 -264 10 -20 311 -247 -235 456 -150 -138 4 97 197 -444 115 324 -275 -22 -45 228 -41 -381
3711c81P46l43k48K58m2K65n51J77N07n88J14O3J27K6n31N87Om21K49o1K62l21
$$ -381 365 22 -226 32 -10 255 -296 -119 388 -200 -86 -23 104 130 -401 186 192 -229 20 -41 221 -100
3733a00j71O09l85n8J17pJ96m64K36K84m22J68n8J60l1l62M60j10j98J66j09K50
$$ -100 -271 338 -47 -105 12 5 201 -263 -27 257 -165 3 -55 105 74 -288 172 62 -136 30 -79 171
3755A71k61p5L68l03P5Qk3J91l38J97J08k35J79j40J30J0k32L03j47k3R3j51K20
$$ 171 -90 -165 203 -100 -25 -17 -40 151 -187 10 118 -117 62 -78 52 62 -170 133 -14 -37 56 -95 125
3778A25j76qJ74k12J49q0k1J57k15J55l5q4J53j53J06j8r4J58j50O7M0j12J38
$$ 125 -51 -59 115 -97 52 -28 -49 108 -107 48 13 -71 82 -71 35 17 -77 81 -69 -2 38 -74 64
3801F4j29P0M5j45J43o4%L6q8J33r2m3J19p2M1n1J8J05j70N6P8m8pq2J41Rj70
$$ 64 -65 5 50 -95 48 -16 -16 20 -68 65 -27 -70 49 -23 18 -33 -15 90 -80 -24 54 6 -1 -83 58 67 -103
3828a03R9M3j5q2j2J78j07j13J31L3m8j22J20J23j90n0J59M2j31q1K13K0k19L1
$$ -103 -4 39 24 -58 -70 108 1 -112 19 52 4 -118 2 125 -65 -115 44 86 -45 -126 87 107 -112 -81
3852h1J84k3j94L3K27j04j92J14J81j22j87J68J53j94j11K09Q6k19o8K40L1k39
$$ -81 103 80 -114 -81 146 42 -150 -36 145 23 -164 4 157 -37 -148 61 147 -72 -140 100 131 -108
3874a08j1K46l7k26M9K25q5k28J31K06j58j65J46J65j80j33K16P8k03m9J92M3
$$ -108 -119 127 90 -136 -87 138 53 -175 -44 162 4 -161 -15 150 -30 -163 53 131 -72 -121 71 114
3896A14k17NK14m7j58L1J58n4j71J32J04j28n5Q4O8j01o2J43k8q4RN6K3r6M3N7
$$ 114 -103 -98 116 69 -89 -58 100 46 -125 7 111 -17 -72 12 80 -21 -83 60 32 -52 -43 13 36 -60 -17 40
3922D0p6J0K4K1l1l5P9l3m6O9k2j2j9N1K3j22N7Q8q2m1M9Q7r1p8J58lj23kJ19
$$ 40 -36 -26 -2 19 -12 -47 32 -1 -47 22 0 -12 -31 20 43 -79 -22 66 -16 -57 -8 79 -12 -90 68 65 -58 -60 59
3951E9L2j87K2J90r3j29P1J41r0j60J45J29j72q6J63Q6j85p2K10J9j90oK17n1
$$ 59 91 -96 -74 116 23 -106 -35 106 16 -144 1 130 -42 -128 35 121 -64 -136 74 93 -97 -103 114 63
3975F3j88O2J93r5j81J18J73j49j40J54J24j63j16J97O6j93j8J52L5j79nJ96n2
$$ 63 -125 -63 130 35 -146 -28 145 -4 -144 10 134 -29 -145 52 118 -75 -93 59 94 -85 -90 106 54
3998E4j42K9J33k3j65Q6J18j13n4M7J13q0j03J29J3o6k2L8P6j19KQ8m2Lm1M0O1
$$ 54 -88 -59 74 51 -114 -28 90 -23 -77 -30 83 3 -100 29 42 -24 -46 -8 68 -51 -49 39 -3 0 -41 -1 60
4025F0j13M7R%L8j06Q1K5q0L8l4R5n2r9J52n0k4k0MJ32j64oJ31p6Kp6J15P2k22
$$ 60 -53 -6 3 3 41 -65 16 41 -39 -1 -35 60 8 -91 61 11 -13 -33 -29 103 -61 -67 64 -12 -10 -86 29 101 -121
4054a21J04P3o2j8o9K01r8j42J95m9Qp7J7J89k35PJ62q3J5j28J61M6k43J86om2
$$ -121 -17 56 -6 -24 -93 108 10 -132 63 14 22 -55 -38 151 -84 -77 85 2 17 -111 50 96 -147 39 33 -9
4080ilp0K09j64q2K17j34L8n7M3J17k44J50O8j60J10q2J24o9j22K42j52m1R7o0
$$ -9 -12 -82 127 -37 -119 98 -36 2 -55 -12 105 -139 11 79 -81 29 -53 71 2 -120 122 -30 -71 26 -34
4105c4J19j98R7J67k79J27K6%j4j60K91r2k05K16l5L3j73M6K92l48J9K08p2k4
$$ -34 85 -113 -16 151 -128 -1 25 25 11 -149 142 50 -155 61 26 59 -114 -68 224 -124 -105 103 31 7
4129Gk14L25M1m00K31J03m4j64l2M25l06k16L46Jq4k46K56K52n03R0K94o4j83
$$ 7 -207 118 159 -241 -10 93 49 -115 -147 278 -28 -244 102 103 19 -227 29 281 -222 -132 162 98 -85
4152h5j37M67j14m46L38J43j15k57J15M40m59j38L89j5j59k31L94J41n60J87K80
$$ -85 -222 245 131 -315 23 166 51 -206 -91 349 -110 -248 141 126 -33 -264 130 271 -289 -102 178
4173A78j15k18n5N14k66l61M08P0j43k51K34L43n33J2L65q5j74j52M42k9n01L14
$$ 178 63 -155 -210 304 38 -323 85 155 12 -239 -5 338 -195 -183 182 97 -77 -229 213 184 -317 -3
4195cJ79j39k01N5M16l76j81M03l5j54j78K88J72m98J73K54j51j28m8L63j67l13
$$ -3 176 37 -164 -109 307 -69 -250 153 118 -36 -214 74 246 -252 -79 175 24 -104 -152 211 44 -269
4217b69L57L0j39j19J18K72m03KL15j42q2p5K61nl69K74J18j69n2K5K53k47j34
$$ -269 88 118 -21 -140 -22 250 -153 -151 164 22 -60 -135 126 121 -248 26 144 -25 -77 -52 201 -46 -180
4240a80L29j02j11k7J52R0l37J53J90k01k5J4J94j26k23L17l7j56K5O5J26k49
$$ -180 149 47 -64 -91 61 151 -186 -33 157 -44 -69 -55 139 13 -210 107 70 -86 -61 4 130 -119
4262a19K6K56j85n4L9J05rk31K27N7k04M0N9J01j42r5K62j04j11O3P7K5k07J11
$$ -119 -93 163 -22 -76 -37 68 59 -172 55 112 -92 -52 7 108 -34 -129 133 29 -82 -19 58 83 -124 -13
4286a3J48j86nP0N7p4j24K00k1j44Q0M6K8j42K1J69j35n6P9M9j6j40J33N4j33
$$ -13 135 -51 -56 14 71 -3 -127 73 52 -92 -12 34 62 -80 -59 110 -25 -81 -2 47 31 -109 24 78 -55
4311e5K3O1K1q5l9J49m4r8N8N0J0j11M9J04j16k9O8K8l7q3J07J5q5J6M6J3o5j4
$$ -55 -32 29 50 -35 -74 75 31 -67 -9 41 51 -60 -11 93 -23 -52 16 44 7 -76 31 46 -39 -23 23 36 -29 -43
4339d3R2m4n2M4L5k6n0M1N3p8pM4K4l9l3O4Rm9JL9%m2%N3j8k8QK4ql1J4L6k8l1
$$ -43 49 5 -47 -3 32 6 -44 -3 50 -28 -35 9 33 -6 -39 25 34 -15 -14 25 25 -17 -17 36 18 -10 -2 22 14 -17 -3 33 5 -26
4373b6K4J7j3k7L4jl2mL6nj9lJ7J7m0J5K4j2j9NK1j1j6L3Kj6MkJ1k8J1L3m3RJ4
$$ -26 -2 15 2 -25 9 8 -24 -28 8 3 -16 -19 -2 15 -25 -10 14 2 -17 -12 9 -2 -18 15 17 1 5 3 14 -14 -3 30 -13 -4 10
4408A0Llk2L5ql8L1Pj0l4K1L7m4rL0J0k0k8N4J5p9K5M6k0l5%P8m2n4N2K4j8o2
$$ 10 13 10 -12 23 15 -23 8 15 5 -29 -8 29 -15 -24 6 16 -4 -32 22 37 -42 -17 29 9 -26 -26 52 10 -44 8 32 14 -48
4441d8O2N9j12j4R7lp2j5J02j2j15N5P5l0r8M8J14r8q2Q9N9p0p7J11M4j24qJ16
$$ -48 14 73 -39 -53 44 41 -31 -46 56 44 -71 -16 59 29 -69 -21 93 -5 -87 2 61 -9 -86 25 69 -55 -63 53
4469E3Qj20nJ39k2j30N4R6n4j03P2J04r4p5R9N6q8o8J22M1j33pJ06mr4KJ13l5
$$ 53 61 -59 -64 75 53 -77 -23 73 19 -84 -12 92 -2 -77 22 78 -10 -78 44 85 -48 -55 51 47 -47 -45 68 33
4497C3r6L6Q8n1p5N2Q2p0o5N6M7o1k8O1L3o6rN0Pn6PM1J0m3mL4Mk3PJ1Ok7LK4
$$ 33 -63 -27 61 10 -65 -13 69 -1 -66 -10 37 -24 -52 9 42 -24 -33 17 24 -32 -25 16 26 -17 -21 13 17 -6 1 12 18 -9 -6 18
4531A8j1kl0L0J7l0mJ3J5j1l7M3J0m2NK2J0l9j7O0%m4kN4Jp7L7O3n2l2K0N5k3
$$ 18 7 5 -25 5 22 -8 -12 1 16 5 -32 11 21 -21 -16 6 16 -23 -40 20 20 -24 -26 28 29 -48 -11 52 0 -32 -12 43 20
4564B0p7O9K7m8l1M6M4p1k6R9l9l7kN4Pq8M6M2n3k1K4M5m2k7N6qk5j0L0J9n8K1
$$ 20 -57 12 39 -9 -40 6 50 -21 -47 52 13 -24 -26 28 35 -53 -7 35 -18 -39 -15 30 -12 -39 17 9 -16 -26 4 23 -35 -14
4596a4L9n2J9OPmk8N4m1j8M8j4rj2L0K7q7M3M1l6l0J4P5n7p2R5K3q5pN3P2j56
$$ -14 25 -27 -8 -2 5 1 -27 27 -14 -32 16 2 -7 -19 11 38 -49 -6 35 -1 -31 -17 58 1 -71 24 47 -38 -45 8 80 -76
4628g6J2J26m9o9jJ20k2j62J16R3j11o8Q8J21j56q7J97Mj50rJ62K6k33P3J89j06
$$ -76 -64 62 13 -56 -57 63 41 -121 -5 88 -23 -91 -3 118 -38 -125 72 76 -74 -83 79 105 -128 -55 134 28
4654B8j32O0J86j26j80J94J03j80q8J72J04k27n2K57l2j93J4K11l6k47J14K04
$$ 28 -104 -44 142 16 -164 30 133 -47 -135 37 141 -86 -138 119 87 -106 -92 119 83 -164 -50 154
4676A54j50j50J12J92j71j62K31P7k02m9J87O4k44J1K27q1j60O5J86q9k09J70
$$ 154 4 -146 -34 158 -13 -175 56 133 -69 -118 69 133 -111 -100 127 46 -114 -49 137 48 -161 9
4698IJ33j69q1J42R5j94m7K03j1j72J7J72m6j81J03J33j15r9J16J00j42q1J74
$$ 9 142 -27 -108 34 129 -65 -112 91 80 -92 -75 97 51 -130 -27 106 -9 -108 8 108 -34 -115 59
4721E9K8j58kJ37kj69O8J57j09j15J05J10j24r4J58M4j69NJ40%j63L2J80r5j23
$$ 59 87 -71 -73 64 62 -107 -39 118 9 -106 -1 109 -15 -109 49 93 -76 -71 69 69 -94 -62 118 23 -100
4746a00R7J10j25r6J50P4j75l4J71J1j81J1K03p5j57P8J44r6j42J32J25j65q7
$$ -100 -3 107 -18 -114 36 110 -65 -99 72 83 -98 -87 116 41 -116 -38 106 10 -132 0 125 -40 -127
4769a27J65Q3j93m3K09nj84K9J80n2j97R1J82j24j52J32J32j44j19J83P3j78m6
$$ -127 38 121 -72 -115 94 89 -95 -66 114 62 -135 -44 138 14 -138 -6 126 -18 -137 46 119 -59 -105
4792a05J68K8j88JJ89l9j80P2J72r1j46J12J30j32j03J38Q5j50o8J62K6j39j6
$$ -105 63 91 -97 -96 93 54 -126 -54 118 27 -119 -7 123 -9 -112 26 111 -39 -107 55 81 -58 -74
4815g4J39qj37L3J41o4j09O1J03p2j01J06N6r4m9Q8M5j15j5J10rq2QQ2j6q8M1
$$ -74 65 57 -80 -47 94 30 -79 -18 85 13 -88 18 74 -20 -69 19 64 -51 -66 44 35 -47 -39 43 27 -61 -20
4842b0O7m7n4M6M7m9n0P3K3n7j6M4J7o1K3M5k8j2PK5j0m6M6Ql1rK3Ll1OM0l2j4
$$ -20 47 0 -54 -8 39 -10 -60 13 36 -21 -37 7 24 -37 -14 31 3 -9 -2 23 13 -33 13 21 -10 -19 4 7 -24 -18 22 -10 -24
4875b4J9kKk5L5Pl0RJ1mj9lM1l1lJ6Pj3pL2Kl9K3OLk3NL6l2k2M3jk3k9L0K8m9
$$ -24 -5 -7 -5 -30 5 12 -18 -9 2 -2 -21 -24 17 -14 -17 -1 6 -7 -14 18 20 -19 4 10 13 -10 -5 31 -1 -23 20 19 -4 -33 -3 25 -24
4912b4RK8j0j7j1L9lm5K2K8j7k4NM2l9j7K9J9k7nK5K5m9PJ8Jj9j1M3Om4J6J5j
$$ -24 -15 13 3 -14 -25 14 11 -34 -12 16 -1 -25 -20 22 -17 -34 -5 14 -13 -18 7 32 -17 -10 8 9 -10 -21 22 28 -16 0 15 14
4946A4k7OL9k4k7K5J6j7k8L4J8n1J5QJ4k4j9M7ml8J4RRl4J1L7k7j4J1K0ll6L8
$$ 14 -13 -7 32 8 -19 6 22 5 -23 11 29 -22 -7 1 15 -9 -28 19 15 -23 -9 0 9 -25 -14 23 -4 -18 -7 13 10 -26 12
4979A2J1k9nJ8J9l0j2M3j1j7%K0Nl5nL5j9j7NK1jm0K9K7l4nPJ8k3k4M7pj4jjL5
$$ 12 23 -6 -11 7 26 -4 -16 27 16 -1 -1 19 24 -11 -16 19 0 -17 -12 9 8 -32 -3 24 -10 -15 -8 10 -13 -37 10 3 -11 -12 -13 22
5015B2m0J0L5k9Lk2L2Km4M1nqoML9l4k8M1ok1mJ4K3m1JK9mk3mL6qm7M3Pj3j2N
$$ 22 -18 -8 27 -2 1 -21 11 13 -31 10 5 -3 -9 -5 34 0 -28 13 7 -14 -18 -4 19 -22 -21 8 4 -19 -23 13 5 -42 1 8 -5 -17 -12
5052a2M3m4k7N7j4j2j5K8K1o0J9L5j4j8j4O2j9o0O0Nk9rJ3N2p2j9P5l2k6j7O3
$$ -12 31 -13 -40 17 3 -9 -24 4 25 -35 -16 19 5 -13 -27 35 16 -44 16 21 -8 -17 -4 48 -24 -43 32 0 -26 -43 20
5083B0K3j02N2L6m3j4PO3n2n4R7j8l8j8L9N1r7J9P3m0k7oP4k5r3Q7L7o7j7K8Q1
$$ 20 43 -59 -7 29 -14 -28 -21 42 -10 -64 33 15 -23 -41 -2 49 -48 -29 44 4 -23 -29 45 20 -73 14 51 -16 -33 -5 76
5114G6j03l5J25m6m5j8P9K7j43O2R0q7l4K4J00o8j08J50Qr0nN4O6j48J0J45p7
$$ 76 -27 -62 63 17 -28 -46 33 60 -83 -21 69 -18 -52 -28 72 4 -104 46 54 -36 -41 13 79 -69 -59 86 9
5141In3nJ09j4j54J21O5j03l1M8R3j17p1J81l6r7J1R5K0j79O2J49j19l6K0J06
$$ 9 -44 -49 60 46 -108 13 78 -25 -56 -8 85 -32 -103 78 42 -55 -44 51 71 -108 -46 103 -16 -52 -32 74
5167G4o2j44J67L1j23KO6Q1j70j3J90r2q3M3R0j7j77J41Q9j33j8O0Q0j11p9J98
$$ 74 12 -132 35 66 -57 -55 11 92 -78 -91 99 7 -76 -33 57 40 -137 4 93 -40 -58 2 82 -29 -108 90
5193I0l8j20L5P3M5j83O8J54j47m1N9Q1o3j42J74K4j38J3P4M4j36j9J97r9r2P3
$$ 90 52 -68 -33 40 85 -98 -30 124 -23 -64 -5 76 13 -129 45 69 -69 -56 18 62 -74 -93 104 5 -87 -14
5219a4O8k1j57J38R7j70nQ9N7j13q3K12m8j37O6P3J5j65P4J54j51m6Q3M6n7j18
$$ -14 54 33 -124 14 111 -59 -64 25 82 -31 -114 98 50 -87 -21 52 67 -98 -24 130 -21 -67 16 62 5 -113
5245a13J68L5j83O4O4K1j11k9J86r4j02R6M0j8j25R5J15j91K9R5ko0n9J68k9j49
$$ -113 55 90 -93 -29 35 56 -55 -84 102 8 -94 2 42 24 -101 -6 109 -82 -53 42 40 -20 -79 89 60 -89
5271h9R8K0Kr0L4J35j40l2J07nk9j00J28M0j64P4M9j5n8j6J38r0q2J04%mp7N3
$$ -89 9 29 31 -59 -25 110 -30 -62 45 40 11 -89 39 79 -85 -11 38 23 -35 -51 87 -3 -85 19 19 15 -62 -9
5299iR3j58L1P3j6l8l1J08j9j00Q5J8m2k6J7Q5j02j3J03m4k1j8N6J4j06P3K6n5
$$ -9 84 -74 -43 30 14 -24 -55 53 34 -66 19 37 -5 -31 -14 71 -31 -44 59 15 -6 -24 32 46 -60 13 39 -16
5327a6rLP3o6m2R9l5m3J2L1M4j09N0N5o5kMM8l4o5J03lo0QK9L7q3J0Q8o3k1J3
$$ -16 -25 -22 51 -15 -57 42 7 -36 -24 7 51 -58 -8 47 -18 -20 -16 32 -2 -67 36 33 -27 -19 10 47 -36 -26 62 -1 -22 -9
5359iM4j0q0P5M2r6K3J5L3o3j6R8m1n5K8K1J2o8L8O7p9nL1K3l4m5P3Po1K9J8R
$$ -9 35 25 -55 20 62 -34 -11 4 37 -26 -42 56 15 -40 -12 9 21 -47 -9 58 -21 -26 5 28 -6 -51 22 29 -32 -3 15 24
5391B4m2lO6m0l4K5K4kn2L9K6n3NK1Pk6k0N8j2k7J4J2Kl6J1M2m3kJ8jQl2QK6k4
$$ 24 -18 -21 45 5 -29 -4 20 18 -34 5 31 -22 -17 4 11 -15 -35 23 11 -16 -2 10 12 -24 -13 29 -14 -16 2 1 9 -23 -15 11 -13
5426a3J1llpjK8j7oJ9lPj5OJ4l0K7Kj4Lj1RJ3k3K0oj0MqJ3j8OJ4j6LJMoj4K4n
$$ -13 -2 -5 -8 -15 -16 12 -5 -11 8 5 12 -3 3 17 -13 14 16 2 5 -6 3 16 -7 13 7 -3 1 -7 6 -12 -6 8 -8 -5 -4 0 -6 -20 4 -1
5466ak1K9rNj6j2L7k7J2J3j2J6k0K7%l6K5Kqoj3L6j8j5K2qJ0j9RJ1k5QJ4j5qm
$$ -1 -22 7 -2 3 -13 -25 12 -15 -3 10 -2 14 -6 21 21 -15 10 12 4 -2 -15 21 3 -12 10 2 12 -7 2 13 -12 -4 10 -5 -13 -17
5502a7L2k1j7L6k1LMj5K9k2MJ9k7J3j5J6Ml0L2qrOLJ9k9J4K7l6J1j0K3pm5M3%
$$ -17 15 -6 -23 13 -8 -5 -1 -16 13 -9 -5 14 -13 0 -15 1 5 -25 7 -1 -10 -4 -1 18 -11 3 30 -6 5 -5 18 11 -34 9 9
5537Ik1J4nK0l0oM6m8kJ9QOn2L3L6n1K2OJ5k2l1O5k9k5K4j2M1m7JN7n5OJ7JJ0
$$ 9 -12 2 -3 17 -13 -19 27 -21 -23 -4 4 10 -42 -9 27 -24 -2 4 19 -3 -34 31 2 -23 1 -11 30 -17 -16 41 -14 -8 9 10 20
5572B0o3O1Ln7M0NJ3l6j6P5n0k9L7mJ8n5K6N4q9L1PJ2j3m5R2k3o0N6oK4n3jR4
$$ 20 -43 18 21 -36 4 9 22 -14 -30 45 -5 -34 3 -1 17 -38 -12 42 -47 -16 -9 3 -10 -55 37 14 -46 10 4 28 -25 -26 68
5605F8r4lM9rJ3p5P3K7j05P0JOk3m4J13p4m0P4k8J2o0M1P9j38M8L8k6No0J01k2
$$ 68 -26 -29 20 11 24 -51 22 49 -56 14 15 21 -2 -46 67 -7 -47 27 -1 11 -49 -8 71 -67 -19 19 -7 -2 -62 39 17
5636A7q8J00j9j5k1pJ13j16jQ5n0Kl8O3L2j32P8L5n4J3n5J37q5o6J29n9nl7L8
$$ 17 -71 29 10 -5 -26 -33 80 -36 -37 48 -2 0 -38 25 57 -75 3 38 -16 -3 -58 79 -6 -72 57 -2 -7 -44 -6
5665fQ8j56M4O8n9J6o0J09j2j30J40j8m0j2jJ16j36k1J51r2pj8N6M7j75J21M0
$$ -6 82 -74 -30 38 -21 -5 -65 44 32 -98 42 24 -16 -28 -29 87 -49 -70 81 -11 -18 -36 20 67 -108 13 53
5692E3o8kk8J24p6j05J79o3m4LK8Q5j72N0J10j00J1j5P7lj55J39J9r4K6oJ04j26
$$ 53 -15 -17 -45 79 3 -102 77 14 -30 -27 1 86 -86 -36 74 -26 -15 -30 47 44 -111 28 47 -47 -21 -27 77 -49
5720d9l4J68r1j8RM1M7j62Q5Q5j24M5k7Q8n4j01J59m0n6K6pQ1j33QJ53j22NKM6
$$ -49 -83 85 -6 -24 -15 26 73 -89 -4 81 -43 2 -25 63 9 -92 67 27 -29 -3 -10 71 -62 -54 99 -23 -18 -16 30
5749C0Nj34J32K2j13O1k1N9n4o3J64r1l1L8pM8j23P0Q8j36N3OK5pr2J36l8q2P5
$$ 30 35 -99 33 55 -58 3 -18 41 -13 -76 88 -3 -34 4 -3 45 -78 -8 80 -56 -3 3 28 21 -71 65 27 -55 20
5778B0k7M2p1jJ26j26K2L4k4L6r4Q7L1j13Q2k0Jj4n4J35q8k8P8m2J8o2M6Q0j37
$$ 20 -7 35 -36 -37 89 -37 -15 19 -5 31 -63 24 55 -58 24 4 5 -9 -63 72 -16 -44 34 -8 10 -52 -6 74 -63
5807f3N5L8l6J9n8R1k7q0J03k7mk5j0R3j00NO7m1Kl8M6L8j18Q4Ml5J6l0Q0o6l2
$$ -63 -8 30 -6 13 -45 46 19 -61 42 15 11 -14 -24 69 -31 -26 41 0 2 -36 10 48 -70 14 18 -17 -1 -31 49 -17 -49
5838d9Q8n5J1j9K1M9r6M6M3o2K3k4L6Oo9P8j5k0J8k2M2n4nN7m8K5kj3L7n9N1m
$$ -49 39 -16 -5 -24 -3 46 -50 -4 39 -23 0 -24 12 18 -51 27 12 -8 10 -12 30 -24 -29 28 -20 5 3 -10 27 -32 19 15
5870A5l6L4k8L7j8l0N7l5oJ8j6J9l4K1L4n9L7Kk0K0k9M0k9j9N4k6nrKM6o1L2K3
$$ 15 -21 13 -15 22 4 -26 31 -4 -10 8 -8 11 -23 -2 32 -27 10 12 -8 12 -17 23 -6 -25 29 3 -2 -11 -9 37 -24 8 31
5903C1m4RpK7j2m2O1j0j9J2j0K5l7j1O1l5k3J0K2Pn1M1J9l5%RK4k6k9N9j0l9J7
$$ 31 -13 -4 -11 16 4 -38 23 13 -6 6 -4 21 -16 -27 34 -1 -24 -14 8 15 -36 5 24 -11 -11 -2 22 -4 -33 26 16 -23 -6
5936fJ3K3n8K2M7l9j9J3L7j7m5M7J6n9K2QK1m7kN0j6m0K0K2j2l4L0K3l5jJ1K5
$$ -6 7 30 -28 -6 41 2 -17 -4 33 16 -29 18 34 -25 -3 5 26 -21 -23 27 11 -29 -9 13 1 -33 -3 20 -15 -16 -5 20
5968B0k6k0L0J1k7QJ0J3l1rL9j4j8K0Lnj7J6J7k4J7pKj0k1M7j7l0K4pQ%qK4l4
$$ 20 -6 -26 4 15 -12 -4 6 19 -12 -21 18 4 -14 6 9 4 -13 3 20 -4 13 6 8 -2 -23 24 7 -23 1 -6 2 2 -6 18 -16
6003a6J9J5k5Ok1L2j2k2L6j6JQrJ1k8J9L6m2J8j1J6nl1M4ml2J5OJ1l1KM2l5pP
$$ -16 3 18 -7 -1 -22 10 -2 -24 12 -4 -3 5 -4 7 -21 -2 34 -8 10 -1 15 10 -21 23 19 -13 2 8 19 -12 -10 32 -3 -10 -3
6038cK2pn4N7Pm8J7J7K2m2k4P0l7l0L0K2jn8L3N0o0lK0L0k2m3P0rm7J3J5L7n9
$$ -3 19 12 -42 15 22 -26 -9 8 30 -12 -36 34 -3 -33 -3 19 18 -40 -7 43 -17 -20 0 30 8 -35 35 26 -21 -8 7 44 -15
6071a5qQ0n8j3J9RJ5p2N4L2o6K0oM4m1m4R0k9m1J9J6K7p6J5P2o0J1oK8Mq9R3O
$$ -15 -23 57 -1 -14 5 14 29 -43 11 43 -23 -3 -9 35 -6 -50 40 11 -30 -11 5 32 -44 -29 43 -17 -6 -12 16 20 -69 24 30
6104C0n3K4qL8m7k1Q8n7j5K2NM0r0N1M5q2L0oK9k6n3R6l6m2N5l1M8p2J2P9j01
$$ 30 -23 1 -7 31 -16 -37 51 -6 -21 1 6 46 -44 7 52 -30 0 -6 23 -3 -56 40 4 -38 17 -14 34 -38 -26 53 -48
6135d8M7QlK8r7J07rp6O6j5K1m4k3J03q0j2O2l6K8p3N6N7j12N5KOj5o0J30o5n7
$$ -48 -1 7 4 32 -65 42 33 -43 23 8 29 -15 -38 65 -15 -27 35 -1 27 -46 10 67 -45 10 12 18 3 -57 73 8 -49
6166d9P7l0K5n0JJ05j29L4M0l4L4r9J00J5j09Q7j8Lqn0J35r7l4R5m5K7p1M6Q0
$$ -49 28 -2 23 -27 -26 79 -50 -16 24 -10 24 -75 25 40 -69 18 0 3 -5 -55 80 -17 -51 44 -1 26 -45 1 81
6195H1j51P5K5l3K3p0R7k1r0J02l4Mk3k5J22j26LP0m1K1o8P2M1j27Q5Nk2J2n9
$$ 81 -70 5 30 -3 20 -50 47 26 -64 38 4 8 -15 -40 82 -44 -41 29 -12 9 -59 13 54 -73 12 17 -5 7 -52
6224e2J30q5m9J10n9L8o1K6Q1j28L5O1n7L1o7Q7Nj28J20l6Oj0l5J15j17qQ9o2
$$ -52 78 -7 -56 54 -5 33 -28 -2 79 -49 -14 47 -10 21 -46 41 46 -82 38 2 8 -2 -37 78 -39 -47 42 -20
6252b0L0n3M1O8j40Q4J8n0K5m6J01m3p7J05m9kOk2R8j14K4P2p4L9n0M5L3j14J08
$$ -20 10 -43 -2 66 -74 10 28 -22 3 -43 58 15 -62 43 -6 -8 -2 -24 74 -40 -16 56 -18 21 -29 16 49 -65 43
6281D3j3m8L2n2R2o8l5J09p8J7j4oO9j05N3M2o8M7m3L8Qp8J05n0k0L7l4P1q2M
$$ 43 30 -18 14 -38 54 -14 -49 60 -18 -1 -15 -21 48 -57 -4 38 -30 17 -26 12 20 -58 47 -3 -23 14 -20 51 -31 -27
6311b7R3r3L6j0NK6q4P8J3o5N3l0L5l2l9R3o2j0M1l2M5p7L7O0r3M8j3NQo3Q3j5
$$ -27 66 -27 9 -1 4 30 -54 24 37 -28 25 -5 30 -2 -41 52 -10 -20 21 -11 34 -43 -6 54 -39 9 -4 1 9 -54 29 14
6343A4n7N4j6L4l6k0O8o6OJ5LK3m6M3Oo2N8j1%j0k6O4l7j6L1l3K7l2KN0o2L4R
$$ 14 -43 11 -5 29 -7 -27 41 -25 -19 -4 -1 22 -24 19 25 -37 21 10 10 0 -26 38 1 -15 16 -17 10 -22 -20 30 -32 2 11
6376A1k1K6m5L8mm1N1k9J3Kl2N9m1nL8l3K7j7%K7l9L4j3j1Nk1L7nk9M1l2QJ5k9
$$ 11 -10 16 -29 9 5 -36 15 -14 -1 1 -31 28 -13 -18 20 -13 14 -3 -3 24 -15 19 6 -5 0 -21 16 11 -18 23 -9 -1 14 -15
6410a5L8l3J2J4k4J3k0J1Ok7L0j3qJ9k1K3j2rK5k0mK0j6J7k6K0Pk0K1kj2J7j4
$$ -15 23 -10 2 16 -8 5 -15 -4 2 -25 5 -8 -16 3 -18 5 -7 -16 9 -11 -15 5 -11 6 -20 0 7 -13 8 6 -6 11 -3
6443cK1k0oJ9j6POrJ3k6MK1k2J9k1QlkJ7j3lJ0j6K3j3%J4k5K0rJQk2K3jqJ9j5
$$ -3 18 -2 -8 11 -5 2 8 -1 12 -14 -10 11 -11 8 -13 -5 -8 -10 7 -6 -9 1 -15 8 -5 -5 9 -16 4 -5 -4 4 -18 5 4 -4 15 0
6481@LLpJ1j4J1Nj3Rj8J5KrJ4pk0K0j5J8qj6L0k5PjkJ7k9K3J4k9PjJ6nk5L9j2
$$ 0 3 6 -1 10 -4 7 12 -1 8 -10 5 7 -2 12 5 -15 5 -10 8 0 -16 14 -11 -4 -5 -7 10 -19 4 18 -11 -4 -5 11 6 -19 20 8
6519HjNj0K8k7pL3l2Rj2K8pl8L3Mj6jjK9m0j6L8rjpPJ5m5K2K4k6LNJ8j3k9L4R
$$ 8 7 12 2 30 3 -4 29 -3 6 -6 22 15 -23 10 14 -2 -3 -4 25 -15 -31 7 -2 -3 -10 -3 12 -33 -11 13 -13 -10 -5 13 0 -29 5 14
6557A4j8J0j1K9k8jK3rPj7J6Rm0L3Ll1J2j3M2l4k2M9l4J2%lL2n7L0J6k6J0j6K4
$$ 14 -4 6 -5 24 -4 -5 18 9 16 -1 15 24 -16 17 20 -11 1 -12 30 -4 -26 23 -11 1 1 -2 30 -27 3 19 -7 3 -13 11
6591A1kl6M5j0oNj9L5m3J5K7m7K5NLKk9L7nk8K4j5K2j7j5M5m1QJ3oJ4n1M6Rm4
$$ 11 9 -27 18 8 2 7 -12 23 -20 -5 22 -25 0 5 8 10 -19 18 13 -15 9 -6 16 -1 -16 29 -12 -4 9 3 17 -34 12 21 -23
6626b3K4pJ0%l9P2m4j2L6k4K6m5K0N6p8K4NMJ8n5O4j6n1M3KJ4l4k7R1p3MK4j2
$$ -23 1 -6 4 4 -35 37 -7 -19 17 -7 19 -26 -6 50 -28 -4 1 5 23 -32 32 16 -35 8 10 24 -10 -37 54 -19 -15 9 -3
6659cL4p1N0L5q2L5NOLn5Q0k9m2M1j7L6m5j4Q3q1J4K5pM2r2P1J7p2M3rJ3lm4Q8
$$ -3 31 -40 10 45 -37 -2 3 9 12 -43 37 8 -34 7 -10 26 -19 -33 50 -31 -17 8 1 43 -49 22 39 -33 10 1 14 11 -33 55
6693E5o0j4M1k9L7n5K0O1q1J9J7%Mp2Q1rn6O1m5M7k5m1R6p1J2K8l4M3p1L5M3p7
$$ 55 -5 -19 22 -7 30 -25 -5 56 -25 -6 11 11 15 -57 24 15 -41 20 -25 22 -3 -44 52 -19 -7 21 -13 30 -41 -6 37 -40
6725d0N9j8RPo0Q4l2m0O3m7N0l9j9Q3r5L9J4k1K7m8N0ln9O2l0PLl7P8o8kN3m4
$$ -40 19 1 10 17 -43 41 9 -31 32 -15 35 -4 -23 60 -35 4 18 -3 24 -24 26 23 -36 26 -4 3 6 -31 47 -21 -23 30 -14
6758a4K7m3K3M4q9P0j2j5K9o2P9k9l8O6m7J5Ol4O8p6K5L6m2M1n0M0K1q2P4k6j9
$$ -14 13 -30 -7 37 -52 18 6 -9 20 -42 37 8 -30 36 -11 4 10 -24 44 -32 -7 29 -13 28 -22 18 39 -43 31 5 -14
6789a4K4m2O8m1k7P3n7K6j1nL5p3M8Lk0K6m4N7j2n6Q5l8qRj7O1p5%O9n6L0k2J0
$$ -14 10 -32 36 -5 -32 41 -16 10 -1 -6 29 -44 4 7 -13 13 -31 26 14 -42 43 5 -3 6 -11 50 -25 -25 44 -12 18 -4 6
6822FK9p5O5qk6K8l3M4k1m8O9l9MJ1k4M6o0K3L6n8L4k5K7J1n0N3j7j3K2l1L1k0
$$ 6 35 -40 25 17 -9 19 -14 30 9 -39 30 -9 -5 6 -18 28 -32 -9 27 -31 3 -22 5 16 -34 19 2 -11 11 -20 11 -9
6854iqN6n3J9Pj6K8m7K1K0l2L8m3K4J2l5M6l9QK3l1L3l8LL6l9J9j1LJ2l4L0j2
$$ -9 -17 39 -14 5 12 -4 24 -23 -2 18 -14 24 -19 5 17 -18 28 -11 -3 20 -11 22 -16 -13 23 -16 3 -8 -5 7 -27 3 -9
6887ij2K7j8J6nj9L7l1J5K4l4J9k1J7K2m2K3mpJ2j6K1rj5L1l7NJ3j7L0l5K0nj1
$$ -9 -21 6 -12 4 -1 -20 17 -14 1 25 -9 10 -11 6 28 -14 9 5 -2 10 -6 15 6 -9 22 -15 -10 3 -14 16 -19 1 -4 -15
6921a5J6j3J7ok1K9q%Mj0K3j7jJ9k2J2njJ0k8K2Pj5M%PPm0M5j3pjkJ5j5mL3l2
$$ -15 1 -12 5 -1 -22 7 -1 -1 3 -7 16 -1 -2 17 -5 7 2 1 11 -17 5 12 -3 1 1 8 15 -25 20 7 0 -1 -3 12 -3 -7 26 -6
6959fjMjJ1j9J5Lj8J3mNj4MJ7qLNpJ1k5J7K0k8MnJ5jj4J3J0k4MPRjj9J4j9R%m
$$ -6 -7 -3 -4 7 -12 3 6 -12 1 -3 2 -12 -8 9 1 4 9 2 13 -12 5 25 -3 1 -4 11 10 -4 9 19 -5 -1 6 15 14 -5 9 -10 -1 -1 -5
7000eK0j9KJ6j3Mk4J8Rj2QllJj0J8pqJ7j0OomK1j8NQj0J0j6NNrJ0j1OjrJ0%KO
$$ -5 15 -4 -2 14 1 5 -19 -1 8 -4 4 1 -2 -1 -11 7 0 -8 9 -1 5 -1 -5 16 -2 3 11 1 11 -5 0 5 -4 6 -5 1 0 -9 1 1 3 9
7042Ik3K0k%pjJ0j3J0J4k7QQqQj8J6Qj7K0rLqqK9l1J0PlJ2j9PRk4J4nJ4oj8K1
$$ 9 -14 6 4 4 -3 -4 6 -7 3 17 -10 -2 6 -2 6 -12 4 12 -5 15 6 9 1 -7 22 -9 1 8 5 17 -2 5 14 -10 4 -1 13 7 -11 10
7082A0j2qK1j1Pk1PJ8k9RJ3j0J2k2K1Jk0L8k6oJ6j9L7l0PJ8k6K5l2K5Lk9K6j1
$$ 10 -2 -10 11 0 7 -14 -7 11 -18 -9 4 -6 6 -16 5 6 -14 24 -2 -8 8 -11 26 -4 3 21 -5 20 -12 13 16 -13 13 2
7116BLjj2L3j9kKj8J2j4J5J1l9K7orK5k7K4kk8L5j9MLj3K8l0K3OrPj8RK3m4L2
$$ 2 5 4 -8 25 6 4 6 -12 0 -14 1 12 -27 0 -6 -15 10 -17 7 5 -23 12 -7 -3 0 -13 15 -15 8 14 5 12 -6 3 26 -18 14
7153A4ok3K6j9L4k9j8M6k8Mj2PK3m6K0J3k2K4k4K7j1k5M2k8pJ7j8M4l5JL0k6J7
$$ 14 8 -15 11 -8 26 -3 -21 25 -3 1 -11 -4 19 -27 -7 6 -16 8 -16 11 0 -25 17 -11 -18 -1 -19 25 -10 -9 21 -5 12
7186A2j7J9J6n1L5jj9K0l0M0k0l0O0m3J0Mj3M6n5J0L0m4L0k4K1J0m5N4l1pK7l4
$$ 12 -5 14 30 -21 14 13 -6 14 -16 24 4 -26 34 -9 1 5 -8 38 -17 -7 23 -21 9 -15 6 16 -29 25 -6 -13 14 -20
7218b0L4j8j7N8n4K5kj8L8m6K9Ol0K7j9J9Ll0M6m1RJ6k1L4l8J2K8n7L2j1J9Km4
$$ -20 14 -4 -21 37 -17 8 6 -12 26 -20 9 15 -15 12 -7 12 15 -15 31 -10 -1 15 -6 28 -10 2 30 -27 5 -6 13 15 -29
7251b9M9j4k7M2m1K2Ll6N2l4RK4k5J1l0L4J2m8M6j9NKl7P7m5k3M0k9K7l9J1M3
$$ -29 20 6 -21 21 -20 2 5 -31 21 -13 -4 20 -5 6 -24 10 22 -26 20 1 6 8 -29 48 3 -20 20 -9 18 -21 -10 33
7283C3n6K9Mj7Rk9M0mn0O1k9J9k4pN2l8pK1j4K0l2K2K6n6L6Jj2Jk2M1rl4L9k0
$$ 33 -23 6 10 -7 2 -27 13 9 -41 20 -9 10 -14 -21 31 -7 -14 7 -7 13 -19 3 29 -27 9 10 -2 -1 -23 18 9 -25 14 -6
7317fJ7oj8M8n6K6J8l2K9m5L3Rn2M8j0qJ2k3L6k6oK6j9J1k0PL2m2K4Jj5K2k7J9
$$ -6 11 5 -13 35 -21 5 23 -9 20 -25 8 17 -35 13 3 -5 7 -16 20 -6 -12 14 -5 6 -14 -7 25 -17 7 8 -7 15 -12 7
7351GRk4K4j5pJ5j0K5j7pK5k8K0rlJ4l8K9Lk2K2j0LnrL3m1MOrJ8j0J5J2l7L5k3
$$ 7 16 -8 16 1 -6 9 -1 24 7 0 25 -3 17 8 5 19 -19 10 13 -9 13 3 6 1 -8 25 -16 -12 -6 -15 3 -7 8 20 -17 18 -5
7388eMOj4K6j6j3K6k2NNKK6l0J1Oj8PpJ1Nk6L7k9J3j5j0L4j4j1K3j6NlNjj8J1
$$ -5 -1 5 -9 17 1 -12 14 -8 -3 2 4 30 0 11 17 -1 6 -1 10 15 -11 26 -3 10 -5 -15 19 5 -6 17 1 6 3 8 7 -11 0
7425@OmRj3J7j5j3K5ljJj5K0j3KRj3QkMNk0J9qm%kOnj4J0LLLj1Pj4ORj1JQPj0
$$ 0 6 2 11 -2 15 0 -13 12 9 8 9 -6 14 1 3 12 -1 7 5 9 14 -6 13 5 1 1 -1 5 0 -14 -4 -1 2 5 -6 1 -13 -7 2 -9 -8 0 7 -3
7469coJ2lrK6k1QOj2J5j3J7j0jQrqQkNj1KOkPrlJ5l3J5NkqpJ8jj7K2qkjrJ5lm
$$ -3 -9 3 0 -9 17 -4 4 10 -2 13 0 17 7 6 14 5 -3 5 3 8 -3 -1 5 3 10 1 -2 13 -20 -5 0 -2 -10 -17 1 0 -17 5 -3 -5 -6 -15 0 -3 -7
7514gJ0lJ0k7OK2k1J3nKOj2K2j3lQn%oj0K4j8POkmk0J9%loJJ1kj0J9orkj0K4j4
$$ -7 3 0 10 -17 -11 11 -10 3 -2 0 6 -6 16 3 0 8 3 3 -3 -13 11 -7 0 6 4 0 -20 -1 -1 -4 -10 -9 2 0 -10 9 3 -6 -8 -18 6 -8
7556h%J2ojjQNj7J6qOmjM%oJ6k9K0knRqJKnO%kQj2ljmJ8j5JKnJ6j7J2rlJ5%Mo
$$ -8 -8 4 -2 -3 -4 4 9 -8 8 0 6 2 1 5 5 -1 15 -14 6 4 -1 8 0 1 3 -2 4 4 2 10 -2 -5 -6 -10 8 -7 -6 -4 -9 7 -10 2 -7 -10 5 5 9 3
7604CrJ6j0J6pmPrP%r%j0J4lk0K5j0J0nkPk0RQj8OpK1mk9K5LmpjK6k2j4L2plM
$$ 3 -6 10 0 16 9 5 12 3 10 10 1 1 -9 5 2 -18 7 -3 7 2 0 7 -13 -4 4 -14 -8 -15 6 2 -27 -2 1 -3 -10 -11 15 -7 -21 11 4 1 5
7647EpK5l6JL0k1Qk2K6Jk1L1j8nKpL5l6mK5j2kq%J8l5K2OlMj4K4j2j3K1j0Kml
$$ 5 -2 23 -13 -12 18 -3 5 -17 9 10 -11 20 2 -3 -1 -8 27 -9 -13 12 0 -2 -10 -10 8 -27 -5 1 -2 2 -12 12 0 -13 8 -2 0 -4 -7
7686gL2m2J7K7k9J6j9J5J4m1K7j2%mnK3j4qK1j3Pj7KL3n0J8J7k2J8k1L1jm6L8
$$ -7 25 -17 0 27 -2 14 -5 10 24 -17 10 -2 -2 -6 -11 12 -2 -10 11 -2 5 -12 -10 23 -27 -9 8 -14 4 -17 14 13 -33 5
7720EnJ0j0j3L7l9NK8k2J9k0J9J0n1L4Mj1J9l1K3qk1L9k5OkpJ4k5J8K0l1J5j6
$$ 5 0 10 0 -13 24 -15 -10 18 -4 15 -5 14 24 -27 7 11 0 19 -12 11 3 -18 21 -4 2 0 -7 7 -18 0 20 -11 4 -12
7754a2J9j2k0L2nj9J8lJ6k4pL5l2J5lJJ5m1L7%k1J9j7L1j2l7O0l5lPpK2l3LM0
$$ -12 7 -5 -25 7 2 -17 1 -2 14 -10 -17 18 -14 1 -2 -1 14 -27 10 10 -11 8 -9 22 10 -27 33 -2 -5 2 -5 17 -16 -13 27
7789B7m6J3OJ1jl8M0mk7J8j1J8j4j1L9l1LO%J6k7K4J4l9K8j3RJl1M5j9k0L3j6
$$ 27 -19 -6 0 11 10 -28 12 8 -19 -1 -12 6 -8 -19 20 -11 -8 -2 -2 14 -13 11 25 -14 14 1 10 11 -20 25 6 -14 19 3
7823CK8m1ML4l8LJ2nLl0L5lj7J2oPj2j1L1k1LJ4j0Rj8RJ9k9J7OqNj8K8j0k0M0
$$ 3 31 -10 -6 28 -10 -7 5 0 3 -27 8 5 -12 0 -6 1 -11 -22 9 -12 -9 5 -5 4 -14 -5 14 -15 2 8 0 5 -13 15 5 -15 25
7860B5k3JpkK3k6RJ4k1J3j7J4Rl1L6j7j1J5j4K5k0jJ4j5NoJ4lj7J8Oj4J5r%mm
$$ 25 2 3 -4 -6 17 -9 0 14 -7 6 -11 3 12 -19 17 0 -11 4 -10 15 -5 -6 8 -7 -2 -8 6 3 -14 4 10 -4 11 2 2 -2 -6
7897fK2j0j1J5j4J6k2NLMJmJJ1j7LOj1PoQq%J6j6%NKLk0J4J7j6oLJ1Kj6RJ8k7
$$ -6 16 6 -5 10 -4 12 -10 -5 -2 2 3 -1 0 11 -6 -3 3 -8 -1 -7 1 -7 -7 9 -7 -7 -2 0 3 -17 -3 14 -2 -8 -5 6 8 -8 1 19 -8
7938hJ3jJ1j8qK4kj8NMJrJ1Nj4jJ0jJk4K4rrK1j7J0j6PPj2J2mOLo%MmJ3j3J2p
$$ -8 5 4 15 -3 -11 13 11 -7 -2 2 3 -6 5 10 -4 -5 5 4 5 -19 5 -4 -13 8 -9 1 -15 -8 -1 -13 -1 -5 1 4 -2 -2 2 -2 11 -2 10 3
7980Cj1PLOmmMLj1PqJ5pljjMmj7K7nqNj9J2KKLj8L2j4pKqJ9noJ3j9RoJJ1lOJ1
$$ 3 -8 -1 2 8 4 0 4 7 -4 3 -5 10 3 0 -1 -2 2 -2 -19 8 3 -5 0 -19 -7 -5 -3 0 -18 14 0 -7 -5 -13 6 1 -5 8 -11 -2 -8 -7 4 1 7 18
8026A8j2Jj0J4%j1J2nlojJ4j2MJ3k0KKOnpKkmLlJ3jj1J8j4mJ3llOQKk0NmRLpK5
$$ 18 6 7 -3 11 11 0 12 7 4 -2 -3 11 -1 3 16 -4 -2 0 6 1 -6 -4 -6 -10 -7 -10 3 2 -9 9 -5 -9 4 1 -2 4 12 14 -6 -1 -5 4 7 0 25
8071B5k3j1J3krOnNj1J5%j2J0qMKj3MkjMkJ1nlPrJ3j1OJ0j5KJ3pNoJ1lj4J4j2
$$ 25 2 -9 4 2 -7 -1 -6 -1 -12 3 3 -9 1 -7 -3 -1 -14 -10 -12 -13 -9 -11 0 -5 -8 -1 -10 3 -8 -2 8 -7 -5 8 1 6 0 11 8 -6 8 -4
8113dLrJ5LkjNj1Jk2K5jj6J5rNpPJ1j4kjlRj0J4Kj5MJkPrJ7j0rJ7pkoOJ4k0J3
$$ -4 -1 -10 5 8 6 5 10 -1 0 -22 3 2 -14 1 -8 -3 -10 -3 8 -6 -8 -9 -12 -3 -13 1 3 -12 -8 -7 -9 -2 -11 6 -4 -13 4 -3 -5 -11 -5 9 -11 2
8157BLj1Nk2J9Kj2K1j2KlQjj3%J1oJ1j9KJ1j3J4mmJ6k4L0j5j0J5qQo
$$ 2 5 -6 -1 -23 -4 -2 -14 7 -5 -3 -6 2 1 -12 -12 -1 -7 4 -15 -13 -2 -15 -1 -5 -9 7 -17 13 -2 -12 3 -5 3 -3
8191c
$$ Imaginary data points
##PAGE= N=2
##DATA TABLE= (X++(I..I)), XYDATA
0@%%%%%%%%%%Qj6J6j6K4l2M0n4O2p2Q8j10J34j60J88k16K52k94L40l90M46n10
$$ 0 0 0 0 0 0 0 0 0 0 0 8 -8 8 -8 16 -16 24 -30 32 -40 48 -62 72 -88 100 -116 136 -158 182 -208 238 -272
32b72N81o59P43q38R45j059J184j324J477j641J822k021K237k473K732l013L320
$$ -272 309 -350 393 -445 500 -559 625 -699 778 -863 959 -1062 1175 -1298 1434 -1579 1741
49A741l658M029m440M891n391N949o576P285q093R025j0109J1395j2948J4865
$$ 1741 -1917 2112 -2328 2563 -2828 3121 -3455 3830 -4263 4762 -5347 6048 -6900 7965
63G965j7298K0510k4972L1630m2784O6147j95387K09299K02413l16388o5500K4213
$$ 7965 -9333 11177 -13795 17835 -24949 41198 -154189 55110 257523 -58865 -124365 -100152
75a00152L39071k80336j08302K94036j71460m2904O4757J00937M170l83720L03672
$$ -100152 238919 -41417 -149719 144317 -27143 -70047 -5290 95647 99817 -283903 19769
86A9769K32870k97166r5347L9000L06720j14047l27218K81022J4767o2360n386
$$ 19769 252639 -44527 -139874 -100874 205846 91799 -235419 45603 60370 -1990 -7376
97g376l3721J40392k10832O7625K34434k44083m2411M5954J71328K763l38275
$$ -7376 -41097 99295 -111537 -43912 190522 -53561 -95972 -50018 121310 124073 -214202
108b14202J90987J40749j04791j5157j01878J67162l4223r2706J62722j54424
$$ -214202 -23215 117534 12743 -2414 -104292 62870 28647 -64059 98663 -55761
118e5761L37Q9069L30M1657k19016J10996J69595j52977j4o0417J00093O5161
$$ -55761 -55424 33645 33975 75632 -143384 -32388 137207 -15770 -15784 -76201 23892 89053
130H9053j52294R1044o4417o82J27719j01365P510o5511O2489J38987j88766M790
$$ 89053 -63241 27803 -36614 -37296 90423 -10942 -3432 -68943 -6454 132533 -56233 -51443
142e1443N2650J5943N2346j35355O2154J6371n2187J21056r1335l9485K8115L4598
$$ -51443 1207 17150 69496 -65859 -3705 12666 -39521 81535 -9800 -49285 -21170 13428
154A3428R8320j82224j8505J54551k6864k1634r4418O9758Q0977j17791O3885
$$ 13428 111748 -70476 -88981 65570 38706 17072 -77346 -7588 73389 -44402 19483
165A9483q768n1177M2982K236P1818j21788n7516J84852k1792q3617n8183P5060
$$ 19483 10715 -40462 2520 4756 76574 -45214 -102730 82122 60330 -23287 -81470 -6410
177f410J20917j49725j9144P7935k1083J3700l9013N0162k3571q2271J31567N395
$$ -6410 114507 -35218 -54362 23573 2490 16190 -22823 27339 3768 -78503 53064 58459
189E8459r3839k7575N5882J18589j25373q3280J18093K3685k2243o8823K7360
$$ 58459 -35380 -62955 -7073 111516 -13857 -97137 20956 44641 22398 -46425 -19065
200a9065O4531p4490L5796K4751n7660l4K1290P4211o7196r4117J06190M7070
$$ -19065 45466 -29024 6772 31523 -26137 -26171 -4881 69330 2134 -91983 14207 61277
212F1277m4906o9100J1978J03222m7996m4128K8142o729J9597j2081J4515p872
$$ 61277 16371 -52729 -40751 62471 14475 -29653 -1511 -8240 11357 -724 13791 5919
224E919n7853O3962L5829m8211l8906P058Q5126k2309p3615K3245K6616K3928
$$ 5919 -51934 12028 47857 -354 -39260 -32202 52924 30615 -43000 -19755 6861 30789
236C0789k7657k9163K6414o977K1390N956m0547R95J4840L5475j3773n6306K2504
$$ 30789 3132 -26031 383 -6594 14796 20752 -19795 -18800 -3960 31515 17742 -38564 -16060
249a6060L3865Q588k6403l5781L2302K4024m822j8554k7078K7440K5358r652k1746
$$ -16060 17805 26393 -10 -35791 -3489 20535 15713 -2841 -29919 -2479 22879 13227 -8519
262h519j8926L0166K1754j7362j8463j0366K5014K0370j5858k2409r436L1873
$$ -8519 -27445 2721 24475 7113 -11350 -21716 3298 23668 7810 -14599 -24035 7838
274G838K3341k9860k8126J1353L6870K615l7149q964K1924J6861n509j8885o318
$$ 7838 31179 1319 -26807 -15454 21416 24031 -13118 -22082 -158 16703 11194 -7691 -14009
287a4009Q344J8088O323k5028j9272K1591L1172j1793l8522K58L7582J0558k8926
$$ -14009 -5665 12423 18746 -6282 -25554 -3963 27209 15416 -23106 -22848 14734 25292 -3634
300c634j7551J4973J9357r78j4122r111J054J6096J3490j7507k3810R343L1755
$$ -3634 -21185 -6212 13145 12167 -1955 -11066 -10012 6084 19574 2067 -21743 -12400 19355
313A9355K745l5531j1595K9012J9213j6490k4546O011J9961M291q097j4245k524
$$ 19355 22100 -13431 -25026 3986 23199 6709 -17837 -11826 8135 12426 4329 -9916 -12440
326a2440J5256J3082p499k4631q55K9014R450k3916j9872J5893K5473o601k2581
$$ -12440 2816 15898 8399 -16232 -17087 11927 21377 -2539 -22411 -6518 18955 12354 -10227
339a0227m908J5393J3347n786j4801o162J0951J6498l420k1675o314K0509J5801
$$ -10227 -15135 258 13605 7819 -6982 -13144 -2193 14305 10885 -10790 -17104 3405 19206
352A9206j3759k3130N300K4176L175j7277j2845Q713J7949j153j2907j0189N553
$$ 19206 5447 -17683 -12383 11793 14968 -2309 -15154 -6441 11508 10355 -2552 -12741 -7188
365g188J9432n74j6656j0386J0548K2387q615k0731j137J4141J6363j4438j7015
$$ -7188 12244 11670 -4986 -15372 -4824 17563 8948 -11783 -12920 1221 17584 3146 -13869
378a3869O677R916J1826j2528j6096Q508R025J1341j3667j8614J4185J0769O079
$$ -13869 -7192 2724 14550 2022 -14074 -5566 3459 14800 1133 -17481 -3296 7473 13552
391A3552j6351j6503K1629P591j471j3099j3181K4010L631n753p883j3048K4288
$$ 13552 -2799 -19302 2327 9918 8447 -4652 -17833 6177 9808 4055 -3828 -16876 7412
404G412L391r513n311j2927K6382L783j6315k488r326K7716J013k3701N028m709
$$ 7412 10803 1290 -4021 -16948 9434 13217 -3098 -5586 -14912 12804 13817 -9884 -4856 -9565
418i565K2557j547k5290J2801n427J5555L208k6245J2430m397J5466N889l4784
$$ -9565 12992 11445 -13845 -1044 -6471 9084 12292 -13953 -1523 -5920 9546 15435 -19349
431a9349J5274N769Q974m8l5047K6184P213p093N513k6179K2696K594q845J5763
$$ -19349 -4075 1694 10668 10620 -24427 1757 8970 1877 7390 -18789 3907 6501 -2344 13419
445A3419l2103J5148J5729j0398P023l3790K5849K2587l1352P784j4942K1978
$$ 13419 -18684 -3536 12193 1795 8818 -24972 877 23464 -7888 -104 -15046 6932
457F932J1037l5169K4853j4520J925K2438k6112J4904k0639R058L6630m5369N270
$$ 6932 17969 -17200 7653 -6867 -4942 17496 -8616 6288 -14351 -5293 31337 -14032 -8762
470h762N103R045J8589n0912K5376J3811k0416K2677k8225J6111O56j7319M2911
$$ -8762 -3659 5386 23975 -26937 -1561 12250 -8166 14511 -13714 2397 3053 -14266 28645
483B8645l9755n988K6707q358K0173m7322J3509M2652m0120J2782j3377Q821K0802
$$ 28645 -11110 -17098 9609 1251 21424 -25898 -12389 30263 -9857 2925 -10452 -1631 19171
496A9171m0490L6841j4465k3193L9515j9212J3668k6856o298O0963m6911o294
$$ 19171 -21319 15522 1057 -22136 17379 -1833 11835 -15021 -21319 39644 -7267 -13561
508a3561J2580k029L0311n1079K0799K1809m0694L6238j5780J966L14k7294O2692
$$ -13561 -981 -3010 27301 -23778 -2979 18830 -21864 14374 -1406 560 874 -26420 36272
521C6272l4815l0544L7985r506K5447m4598j530N6200m9421J4556K483r877K2667
$$ 36272 1457 -29087 8898 -608 24839 -19759 -21289 34911 -14510 46 2529 -7348 15319
534A5319m0935M4946m150n1242M8032p034Q765k3135k3493P2734l9985j8564K5136
$$ 15319 -25616 19330 15180 -36062 11970 4936 13701 -9434 -32927 39807 -178 -18742 6394
547F394j4829L0727m0257J3297L1662n6815L6097M342j0818K739l5473O3954j6099
$$ 6394 -8435 22292 -17965 -4668 26994 -29821 6276 10618 -200 2539 -32934 31020 14921
560A4921m7588M0568j0708K2093k6519j7281N6495m6510R264J9770k5185K1303
$$ 14921 -32667 7901 -2807 19286 -7233 -24514 31981 -14529 -5265 14505 -10680 10623
572A0623l3293L6240J1453o2064M3476P16P69n742l4725O1066k5290k1454L3929
$$ 10623 -22670 13570 25023 -37041 6435 7151 7920 2178 -32547 28519 3229 -18225 15704
585A5704k9046K4437j7761J534L1967n7245L2133J6176k4394J2558l1712M3904
$$ 15704 -13342 11095 -6666 -5132 26835 -30410 1723 17899 -6495 6063 -25649 18255
597A8255j937m3970M1363j9592R080L329k2273L7177l8686J1248L1996m1134J6416
$$ 18255 16318 -27652 13711 -5881 3199 6528 -15745 21432 -17254 -6006 25990 -15144 1272
610A272j1449J8639J2711n3331M0376J577j7078J5980k4642L1232j8785j2698
$$ 1272 -10177 8462 21173 -32158 8218 9795 -7283 8697 -15945 15287 -3498 -16196
622a6196M4221m0381L897J1371n0J7623n1646L0282K7591l9887J3554j0653K2145
$$ -16196 28025 -12356 -8459 2912 2862 20485 -31161 -879 26712 -13175 379 -10274 11871
635A1871l165l4988M7666k0229j7133K3192p381J7734l9838R589M8162m5343j760
$$ 11871 8706 -26282 21384 1155 -15978 7214 -167 17567 -22271 -12682 35480 -9863 -11623
648a1623P421J3887Q090m8184L6645J1529l3272J8034n082J5989k0473j5077N2336
$$ -11623 -4202 9685 17775 -30409 6236 17765 -15507 2527 -2555 13434 -7039 -22116 30220
661C0220k9438j9769J7731Q198J4085m6259J4725L7919l4666J724M40J3505L5
$$ 30220 782 -18987 -1256 6942 21027 -25232 -10507 27412 -7254 -5530 -5090 8415 8450
674H450l2286L8133l528k8084J7066K866J4509k9982p371M5812k3206j2649M233
$$ 8450 -23836 14297 10769 -17315 -249 2617 17126 -12856 -20227 25585 2379 -10270 -6037
687f037Q303J5551l4599J3403J7212k2967J0763l754Q601n211j9237L2627q285
$$ -6037 2266 17817 -16782 -3379 13833 -9134 1629 -2125 6476 1265 -17972 14655 6370
700F370j6292P606p71J8701k0583p700K2466j1632N582o245l139J3856j4690J0215
$$ 6370 -9922 -2316 -3087 15614 -4969 -12669 9797 -1835 3747 -2498 -5637 8219 -6471 3744
714C744m79j1483J2915p623O925j326j2214J4170n037L427o71j3577J6119k59
$$ 3744 3265 -8218 4697 -2926 3999 2673 -9541 4629 -408 3019 2348 -11229 4890 4631
728D631m457k613o008J8709p246j1207R659j038L505p939K159J0618j6243L612
$$ 4631 174 -2439 -8447 10262 3016 -8191 1468 430 3935 -4004 -1845 8773 -7470 -3858
742c858J1445m024q211o258K1183P10k4183O879J4329O22j5982k585K1608q227
$$ -3858 7587 3563 -4648 -10906 10277 10987 -13196 -6317 8012 8634 -7348 -9933 11675 3448
756C448j3512J0770P001p562j1911J5091J1504k3004m714K0389O112j9740r750
$$ 3448 -10064 706 7707 145 -11766 3325 14829 -8175 -12889 7500 13612 -6128 -15878
769a5878K4513N009k2833l96J7271O23j7231K978J7837j0036j4600J3163J3339
$$ -15878 8635 13644 -9189 -9585 7686 8309 -8922 -5944 11893 1857 -12743 420 13759
782A3759j4569j4922J7799J4244j9264j2053J7865J0723j6757q452J6055M592
$$ 13759 -810 -15732 2067 16311 -2953 -15006 2859 13582 -3175 -11627 4428 9020
794I020j4951o22J4315l248j3995O296J3913p819j4775R293J4636j0047j2647
$$ 9020 -5931 -6553 7762 4514 -9481 -3185 10728 2909 -11866 -2573 12063 2016 -10631
807a0631Q484J1264p229r808P831N765p236k034N957J017p625Q51R567l733q357
$$ -10631 -2147 9117 1888 -7920 -89 5676 -1560 -3594 2363 3380 -4245 -3394 6173 2440 -5917
822e917K999P855p51r197J334P340j328l447j242K388J289j500J144j920r26K974
$$ -5917 -2918 4937 4186 -5011 -3677 3663 2335 -1112 -2354 34 1323 -177 967 -953 -1879 1095
838A095P5p00k044K79K533n85L23k069j836M306K016l549m357L418O590m548n921
$$ 1095 1170 470 -1574 -1295 1238 653 976 -1093 -2929 1377 3393 -156 -4513 -1095 5495 947 -4974
855d974L829N116k739n056L819L263n181o22N852p43p315J528R324k435j0594
$$ -4974 -1145 3971 1232 -3824 -5 3258 -1923 -2545 3307 2564 -4751 -3223 6101 3666 -6928
870f928K858J1161l149j0658L206R516l281q609M807O775o871m036P685L249r449
$$ -6928 -4070 7091 3942 -6716 -3510 6006 2725 -5884 -1077 5698 -1173 -5209 2476 5725 -3724
885c724l254J2681J159j3112j14J1628J995j2911j058J3295k679r093K651P175
$$ -3724 -6978 5703 6862 -6250 -6364 5264 7259 -5652 -6710 6585 3906 -5187 -2536 4639
899D639k237r229P326O992j0496l039P919N793r493p781J4124K541j0680j423
$$ 4639 2402 -6827 499 7491 -3005 -6044 1875 7668 -1825 -9606 4518 7059 -3621 -5044
913e044O158N641j0186j472J0728n611l584K649M574j358j0873R753O152j0289
$$ -5044 1114 6755 -3431 -4903 5825 214 -3370 -721 3853 2495 -8378 1375 7527 -2762
927b762j215K502Q242n983q802J1892j628l793R13l80N662r123K791Q532j0014
$$ -2762 -3977 -1475 6767 784 -8018 3874 2246 -1547 -634 -1014 4648 -4475 -1684 6848 -3166
942c166J330Q60M189N15j2068J0467J788o204L367m718P332l558m310J0162r507
$$ -3166 -1836 -976 3213 3728 -8340 2127 3915 -2289 1078 -3640 3692 134 -4176 5986 -3521
957c521K217L600l386N184j0565P044N603j1221O837m009L314K338r666J1467
$$ -3521 -1304 2296 -1090 4094 -6471 573 6176 -5045 1792 -2217 1097 3435 -6231 5236
971E236o879j860R164r040N898n872J760J0387j6019P168K281l842O276j1933
$$ 5236 -1643 -3503 5661 -3379 2519 -3353 -1593 8794 -7225 -57 2224 -1618 4658 -7275
985g275J0939o70j0272J3785q860K204N41m962J4505j5915J562J1397j0043O785
$$ -7275 3664 2994 -7278 6507 -2353 -149 392 -4570 9935 -5980 -4418 6979 -3064 3721
999C721r804O300Q343j8093J3045k078m308O488j0263J4538q825q155J8286j1294
$$ 3721 -6083 217 8560 -9533 3512 1434 -2874 3614 -6649 7889 -936 -9091 9195 -2099
1013b099K884l472j070J5815k0435O120Q453j0534R001j1126R766K237j7369J9575
$$ -2099 785 -2687 -3757 12058 -8377 -2257 6196 -4338 4663 -6463 3303 5540 -11829 7746
1027G746o666m178M352p548J8132j6175m248J8631j3745O305o609K209J2619k2503
$$ 7746 1080 -3098 1254 -6294 11838 -4337 -8585 10046 -3699 2606 -4003 -1794 10825 -11678
1041a1678J4385L195j2131R820r928J4421o366j5225K4242j0790j750J233m890
$$ -11678 2707 5902 -6229 3591 -6337 8084 1718 -13507 10735 -55 -1805 -572 -5462
1054e462J8450k0857K986J5221j6586R010o843O459N427k2581K1566j121j1627
$$ -5462 12988 -7869 -4883 10338 -6248 2762 -4081 2378 7805 -14776 6790 5669 -5958
1067e958P519p929J7654j2777j0604K3821j4103J753o88j463J4424k3429J1281
$$ -5958 1561 -6368 11286 -1491 -12095 11726 -2377 -624 -1312 -2775 11649 -11780 -499
1080d99J1131j7965Q865o508J1742j650k1091K5088n536p936N043o579J8100j7672
$$ -499 10632 -7333 1532 -4976 6766 5116 -15975 9113 3577 -4359 684 -5895 12205 -5467
1094e467k948K1010j7636M902k315L373R310k5032J7621O304j5428P707p884J5432
$$ -5467 -8415 12595 -5041 -139 -2454 919 10229 -14803 2818 9122 -6306 1401 -6483 8949
1108H949o459j6281K3937j0098k532K768m563J5810k0142L903J6331j7142O106
$$ 8949 2490 -13791 10146 48 -2484 284 -4279 11531 -8611 -4708 11623 -5519 587
1121E87m879P419N398k2565J8410R63r656O448q627J5033r099r099J9817j2940
$$ 587 -4292 3127 8525 -14040 4370 5333 -4323 2125 -6502 8531 -568 -9667 10150 -2790
1135b790J675O21j785J2373j9862Q231J0112j3617P453p701Q698K322j6538J6918
$$ -2790 -1115 -494 -2279 10094 -9768 -1537 8575 -5042 2411 -5290 3408 5730 -10808 6110
1149F110n387l656N855q284J3017j0999k363J4636j3301N437k708L4R744j6505
$$ 6110 723 -2933 2922 -5362 7655 -3344 -5707 8929 -4372 1065 -1643 -1609 8135 -8370
1163h370R670K628q373Q804r218P685n73r281J3911r143O72L979o400J0387j0447
$$ -8370 1300 3928 -4445 4359 -4859 2826 2253 -7028 6883 -2260 -1588 2391 -4009 6378 -4069
1178d069J637Q285j0513P726m729K13O255j0556R433l197m516Q459p675N862l002
$$ -4069 -2432 5853 -4660 3066 -1663 -1450 4805 -5751 3682 485 -4031 4428 -3247 2615 -387
1193c87l734J0207r434L379J501m673P648q046M041K357p653Q598m863M56K342
$$ -387 -4121 6086 -3348 31 1532 -3141 4507 -3539 502 2859 -4794 3804 -1059 -603 1739
1208A739n864Q886n835j778O038n607N104m151m18O141p926M946k56l013M345
$$ 1739 -4125 4761 -1074 -2852 3186 -2421 2683 -1468 -1886 4255 -3671 1275 1019 -1994 2351
1223B351n420N436j070n391O869l308J200o92k887O941n327j38L270l357L353
$$ 2351 -3069 2367 1297 -4094 2775 -533 667 -25 -2912 4029 -1298 -1436 1834 -1523 1830
1238A830l523J638K718n952M260k6j302Q75l295N417j686l725L838j332J566k009
$$ 1830 -1693 -55 2663 -3289 971 945 -357 518 -2777 2640 954 -2771 1067 -265 1301 -708
1254g08j037M470l938M84J767j324J032k849L027J297m618K064R49O60j480k397
$$ -708 -1745 2725 -1213 -729 1038 -286 746 -2103 924 2221 -2397 -333 616 1276 -204 -2601
1270b601M534r14k515J398L16R61k501O08K970l055n93J803J061j304k825L352
$$ -2601 1933 1019 -1496 -98 218 1179 -1322 -714 2256 -799 -1392 411 1472 168 -2657 695
1286F95J675l470n19K024J463k538j304L366k60k621O55K370o36l081J569L107
$$ 695 2370 -1100 -1619 405 1868 -670 -1974 1392 1132 -1489 -834 1536 900 -2181 -612 2495
1302B495k253k752K280K812k495k714K790K322l002j798L296R91l309l93L342
$$ 2495 242 -2510 -230 2582 87 -2627 163 2485 -517 -2315 981 1972 -1337 -1730 1612
1317A612J34l960O73M198j571l691J467L824j604m141K594L215k768k318K308
$$ 1612 1746 -2214 -1541 2657 1086 -2605 -1138 2686 1082 -3059 -465 2750 -18 -2336 -28
1332b8K584l226j973M218M19l642l44L658P41m863M81M625j302l493N97L904j063
$$ -28 2556 -670 -2643 1575 1994 -1648 -1992 1666 2407 -2456 -1975 2650 1348 -2145 -1548 2356 1293
1349A293m094K573K579k469j976K159K651l558j873M259N78l326j047L499J214
$$ 1293 -2801 -228 2351 -118 -2094 65 2716 -842 -2715 1544 2122 -1204 -2251 1248 2462
1364B462m318J28L489n85k602J77L092j086k920K173J800j861j811J858K222k695
$$ 2462 -1856 -1728 1761 1176 -1426 -1249 1843 757 -2163 10 1810 -51 -1862 -4 2218 -477
1380d77j491K593R32j977j094K088P01k071oJ593j88j494M96J492r60j162R20
$$ -477 -1968 625 1557 -420 -1514 574 1275 -796 -802 791 603 -891 -395 1097 137 -1025 -105
1397a05J171r73j150J137O21o02o23L38P52p88J86K72o61O18j86J32j56n27J190
$$ -105 1066 93 -1057 80 701 99 -524 -186 566 -222 -36 236 -425 193 7 139 -17 -544 646
1416F46q48j24R01r75M24l09P28J84k227K038N76j408o0l33K536j764j944L199
$$ 646 -202 -326 575 -400 24 -285 443 627 -1600 438 1014 -394 -454 -787 1749 -15 -1959 1240
1434A240p96n99p55P93K391m167R62K856j981l78j380L675o1n280L972J131j417
$$ 1240 444 -155 -910 -117 2274 -1893 -931 1925 -56 -434 -1814 1861 1800 -3480 492 1623 206
1451B06j316p99N506l946k826N107j185n37k624K552L984p513J904L974j813j072
$$ 206 -1110 -1909 3597 -349 -3175 1932 747 210 -2414 138 4122 -3391 -1487 2487 674 -398
1467c98l256O735m34p385N408R32n57k752j060Q042o274k753O055j360R7n055
$$ -398 -3654 3081 2647 -4738 670 1602 1045 -1707 -2767 5275 -999 -3752 2303 943 1040 -4015
1483d015M376N202r868K896L361n91j114n373R190j509p653O368m25J154m434
$$ -4015 361 5563 -4305 -1409 1952 1361 247 -5126 4064 2555 -5098 1270 845 1999 -2435
1498b435p69R918q733j485N541j224J443p634O195M929j0624M613J153P43j134
$$ -2435 -3204 6714 -2019 -3504 2037 813 2256 -5378 817 5746 -4878 -265 888 1631 497
1513D97o192J0929l811o318O826j975K936n939O8R993j0043R64L555j328K758
$$ 497 -5695 5234 1423 -4895 1931 -44 2892 -3047 -2979 7014 -3029 -2065 1490 162 2920
1528B920q583P418K747r617O502j588J804j295n576J1191o408l270O345l788M376
$$ 2920 -5663 1755 4502 -5115 1387 -201 1603 308 -5268 5923 -485 -3755 2590 -1198 3178
1543C178o627J871P768j0797M836Q82j734L195p897Q955j552p365Q694m526K590
$$ 3178 -3449 -1578 6190 -4607 229 1111 -623 2572 -5325 3630 2078 -5287 3407 -1119 1471
1558A471k005l264J0191r511J263N090n536N173o457M339L579j0397Q834k051
$$ 1471 -534 -3798 6393 -3118 -1855 3235 -2301 2872 -3585 754 4333 -6064 2770 719
1572G19j876K768n977R531n812l942R383o835L194k395m88P515j1194N645L287
$$ 719 -1157 1611 -4366 5165 -647 -4589 4794 -2041 1153 -1242 -1730 5785 -5409 236 3523
1587C523o444M839n386O542q58q953J1302m303j530J715l457R048r336O1Q900
$$ 3523 -2921 1918 -3468 3074 2216 -6737 4565 262 -1268 447 -3010 6038 -3298 -3237 5663
1602E663q364L433k682K718L929j1920R541R30o204L982m263Q176n094o146J2159
$$ 5663 -2701 732 -1950 768 4697 -7223 2318 3248 -2956 1026 -3237 4939 -155 -6301 5858
1617E858o590l23N34q84P459j1544M075O983q605L565l081N170O09j0765J1231
$$ 5858 -732 -1055 -521 -1405 6054 -5490 -1415 5568 -3037 528 -2553 2617 3226 -7539 3692
1632C692j484m681K890l074Q192p559k852J0932p542P60m24J202N142j1513O577
$$ 3692 2208 -2473 417 -2657 5535 -2024 -4876 6056 -1486 -726 -1150 52 5194 -6319 258
1647B58M377p522L341k966O032k060q016J1104l721k792K071j821O932q726N75
$$ 258 4635 -2887 454 -2512 3520 1460 -6556 4548 827 -1965 106 -1715 5217 -3509 -2934
1662b934Q440p644J936j322K606K701r932P932J156n431L152k993O100l942m678
$$ -2934 5506 -2138 -202 -1524 1082 3783 -6149 1783 2939 -2492 660 -2333 3767 -175 -4853
1677d853R485n151n66Q63p23N346q376K849N231o301K656k110L159P98p223P484
$$ -4853 4632 -519 -1085 -222 -945 4401 -3975 -1126 4105 -2196 460 -1650 1509 2307 -4916 2568
1693B568j276l158K571k431N035m514j820O940n102Q46q4L3L515o624L721K221
$$ 2568 1292 -1866 705 -1726 3309 -1205 -3025 3915 -1187 -341 -425 -392 3123 -3501 220 2441
1709B441m427K841k258K880n74m328O080k613j121J635j840L918m177J07M089
$$ 2441 -1986 855 -1403 1477 903 -3425 2655 42 -1079 556 -1284 2634 -1543 -1436 2653
1724B653m081J882j028M64K040m548L646p1k334K368k218K558j218k110M032k719
$$ 2653 -1428 454 -574 -110 1930 -2618 1028 957 -1377 991 -1227 1331 113 -1997 2035 -684
1740f84M84N44j326K681k979J018J574k622K110j281M48R15k414K635j123p46
$$ -684 -200 344 -982 1699 -1280 -262 1312 -1310 800 -481 -33 882 -1532 1103 -20 -766
1756g66J647j801J688r33n77J932k127J224N2j021J435j475J121n3j314J804j095
$$ -766 881 -920 768 -165 -742 1190 -937 287 339 -682 753 -722 399 346 -968 836 -259
1773b59J83K98p87J403j369K79J005j339P54l26L12K74j386J386qq74M20j62Q27
$$ -259 -76 222 -565 838 -531 -252 753 -586 168 -158 154 428 -958 428 420 -454 -34 -196 631
1792F31q48m69J374o47l33J17L59L24j225N60R08q78l49L68P41n11r63J017N13
$$ 631 -217 -686 688 41 -292 -175 184 508 -717 -157 751 -127 -476 -108 633 122 -841 176 689
1811F89r11l42P58M39r63k68J104mj099J86J054k56j068K54J243n19j219Q39Q29
$$ 689 -222 -564 194 633 -330 -598 506 502 -597 -411 643 387 -681 -427 816 297 -922 -83 746
1830G46o98p84O47J020j155o58J330J70r55m12J171M65j698K64J292l37r56r9
$$ 746 48 -736 -89 931 -224 -882 448 618 -337 -749 422 887 -811 -547 745 408 -548 -647
1848f47J533m22j557J108P40o60q23N15J351j394p11J453J43q54o60J284N89j835
$$ -647 886 464 -1093 15 755 95 -728 -213 1138 -256 -967 486 629 -225 -885 399 988 -847
1866h47L28J179k37q99k41J616m98j448J075O38n53q87N95J258j360n80J244K32
$$ -847 -519 660 423 -476 -717 899 401 -1047 28 666 113 -774 -179 1079 -281 -861 383 615
1884F15p85o72J218M39j486K50R23j24q11o7J224m83j000P43O09n16p10N76P69
$$ 615 -170 -842 376 815 -671 -421 502 378 -433 -500 724 241 -759 -16 593 77 -633 -57 712
1903G12q42m70P70L22o67k83O98J42p16RP01j88n81K68M06r4n61K01O44n56j47
$$ 712 -130 -600 170 492 -175 -458 240 382 -334 -325 376 188 -393 -125 281 187 -374 -173 471 -85 -232
1924b32K76L4Q0m88L94K11n73M08j45Q0Q5m96O92l66j19M21o42O99l10l13O56
$$ -232 44 78 158 -330 64 275 -298 110 -35 45 130 -366 326 -40 -159 262 -380 319 9 -304 352
1945C52p08O84l16m95J080r06L55L4m33J019j275O00N46j102R34p83O28K71j536
$$ 352 -356 328 12 -483 597 -309 46 80 -353 666 -609 -9 537 -565 369 -414 214 485 -1051
1964a051J731o20l85O57j022J592j155m77J717j561Q29m12j76J438k258J383M22
$$ -1051 680 60 -325 332 -690 902 -253 -730 987 -574 255 -157 -333 1105 -1153 230 652
1981F52j357J341j454J373j0j933K454j324J11N74j436K300j898K4J729k135J681
$$ 652 -705 636 -818 555 545 -1388 1066 -258 -147 427 -1009 1291 -607 -583 1146 -989 692
1998F92j106Q3J603k778K201m42j025J867k368K039m45j556K645k437J358K15
$$ 692 -414 -331 1272 -1506 695 253 -772 1095 -1273 766 321 -1235 1410 -1027 331 546
2014E46j822K735k441J064P94k342K932k226M46J479k622K776j979P4K225l298
$$ 546 -1276 1459 -982 82 876 -1466 1466 -760 -314 1165 -1457 1319 -660 -586 1639 -1659
2030a659K517r27n71K138l381K891m77j979K832k560K020o61j944L991l286O88
$$ -1659 858 -69 -640 1498 -1883 1008 531 -1448 1384 -1176 844 183 -1761 2230 -1056 -368
2046c68J133j833K876l491J485K221l941K747j252O27R67l755M487j522j933K672
$$ -368 765 -1068 1808 -1683 -198 2023 -1918 829 -423 204 1171 -2584 1903 381 -1552 1120
2062A120k180K763k536q63M602m342J201N41p46K413m665L319J340m097K965j618
$$ 1120 -1060 1703 -833 -1696 2906 -1436 -235 306 -440 1973 -2692 627 1967 -2130 835 -783
2078g83J902o17l410N594k802j225K115j699L174m034N70M275m832J817k37L41
$$ -783 1119 502 -2908 2686 -116 -1341 774 -925 2249 -1785 -1215 3060 -1772 45 -192 149
2094A49J670n018M563J95l573K877j818K654j890k492N763l703l16J427j195L066
$$ 149 1819 -3199 1364 1559 -2014 863 -955 1699 -191 -2683 3080 -623 -939 488 -707 2359
2110B359m684J891L131m725K510r60J045O88m395N223j380k433K695k064L023
$$ 2359 -2325 -434 2697 -2028 482 -478 567 1255 -3140 2083 703 -1730 965 -1099 1924
2125A924k795j045M903m381J167N03q21K574m604L141J319l965L048j756J672
$$ 1924 -871 -1916 2987 -1394 -227 276 -545 2029 -2575 566 1885 -2080 968 -788 884
2140H84k37l268N037k676q46K130k155K953l089L59L396m344K295l30m99J860
$$ 884 647 -2621 2416 -260 -1106 1024 -1131 1822 -1267 -908 2488 -1856 439 109 -390 1470
2156A470l769L540l82k714L195k229J659p03j773M028l468O60J556k148K438k719
$$ 1470 -2299 1241 859 -1855 1340 -889 770 67 -1706 2322 -1146 -486 1070 -1078 1360 -1359
2172a359J444J562l723L088j055k37J133k617L428j789j220K859k467J670j102
$$ -1359 85 1647 -2076 1012 -43 -280 853 -1764 1664 -125 -1345 1514 -953 717 -385
2187c85l97K739l600J815O66j715J860k309K097N3k652L106j557J71M22j467K840
$$ -385 -782 1957 -1643 172 838 -877 983 -1326 771 824 -1828 1278 -279 -108 314 -1153 1687
2204A687k504K1K156k214J397j176N53J467l116K254K5j194J213j596K057q88
$$ 1687 -817 -796 1360 -854 543 -633 -80 1387 -1729 525 550 -644 569 -1027 1030 142
2220A42j498K626j630L56j4n56J971k456P81J283j689J125j102R81M83k188K104
$$ 142 -1356 1270 -360 -4 -18 -574 1397 -1059 -278 1005 -684 441 -661 320 803 -1385 719
2237G19n15n35O17j042J774j286n67J791j348N66m69O4J263k006J003M84r12P58
$$ 719 204 -331 286 -756 1018 -268 -835 956 -392 174 -295 -231 1032 -974 29 513 -399 359
2255C59j013J109p2j316J524o21k0J09n73J335j145q9R42p96N58o30K53P41j274
$$ 359 -654 455 383 -933 591 -30 -50 59 -514 821 -324 -413 529 -267 291 -339 -86 655 -619
2274f19P38O3l07L69p64Q88j56p11P75l64K51k43k89R17p19l9L50k11L47o62L50
$$ -619 119 182 -125 244 -520 368 212 -499 276 -88 163 -80 -369 548 -171 -210 140 -71 276 -386 -36
2295c6M64p28K63L1J52m6n19O69n0m36J86O2K96m79j07O32l00k23P4K52O3n35
$$ -36 428 -300 -37 -6 146 100 -419 250 200 -236 -50 12 308 -171 -278 354 54 -169 -95 157 220 -315
2317c15K53L94l57k14K19L01k93l14M24J87m15j59M21J03m12p0M38K3m91J22M18
$$ -315 -62 332 -25 -239 -20 281 -12 -326 98 285 -130 -289 132 235 -177 -247 191 214 -277 -155 263
2338B63j87l02R9M32k24m55M30K19l38j51J94L54m37k04N34q7k53n8L09J41n98
$$ 263 76 -226 -127 305 81 -374 56 275 -63 -214 -20 334 -103 -307 227 140 -113 -171 138 279 -319
2359c19K23L75k78j15o4M38j50m72M71M6k13o2L7L73m21r5M34j98n3j21K32J53
$$ -319 -96 279 1 -114 -178 260 110 -362 109 155 -58 -120 -83 290 -131 -226 208 10 -43 -164 68 221
2381B21n06K75J56j92M1j43L25j18k88L71j15m3j0k2K41l11M1K11j79P5j12J22
$$ 221 -285 -10 146 -46 -5 -148 177 59 -229 142 27 -16 -26 -48 193 -118 -77 134 -45 30 -82 40
2403D0O2k44K10k7j00R3r5J07o4n6J56j31L6L1l1L4o9O6J0q3O0K5m0rL3K6l5o1
$$ 40 102 -142 68 41 -59 34 -61 46 -18 -74 82 -49 -13 18 -13 21 -48 18 28 -55 5 30 -10 -19 14 40 5 -56
2431e6Q0N6j44N1N6l0J3j06J50Jj84J77n3Jk4j03K86k25o2K23j74J62k21O6K73
$$ -56 24 80 -64 -13 43 13 26 -80 70 71 -113 64 11 12 -12 -115 171 -54 -116 107 -67 95 -126 -60 213
2456B13m22K55j2r9J83l65M11o9l60M44k79J94r8k31O04n47J00K55l63M50n29
$$ 213 -209 46 34 -65 118 -247 164 95 -265 179 -100 94 -4 -235 369 -178 -78 177 -186 264 -265
2477b65K70L40p37N91k28j3K71o57P95l44l40O48n92M90l21j95Q44r77M38J75
$$ -265 5 345 -392 199 -29 -42 229 -428 367 23 -317 331 -261 229 -92 -287 557 -420 18 193
2497A93m76O66q48O40J75r62J005n17J33J70p24J193q60j45Q49q50P12o53J51
$$ 193 -283 383 -465 175 350 -612 393 -124 9 179 -545 648 -212 -357 492 -358 354 -299 -148
2516a48Q98j494R44L4m99O53j078J248l27j043J445q44L56j97m86J545j609K99
$$ -148 750 -744 200 234 -265 388 -690 558 231 -812 633 -211 145 -52 -538 1007 -602 -303
2534c03R14j002P99j072Q56O22j957J546k17l12L40j105J920j060r27J765j039
$$ -303 611 -391 408 -664 192 814 -1143 403 186 -126 214 -891 1029 -31 -958 807 -232
2551b32N24p10L8J722k347Q01Q77r61P04j406J608J74k193K020m59j10n3r17K363
$$ -232 292 -418 -380 1342 -1005 -204 673 -288 416 -990 618 792 -1401 619 160 50 -3 -920 1443
2570A443j821n60J859j181O82j199O78J542k802J384N28p51N51j578K258n47j938
$$ 1443 -378 -938 921 -260 422 -777 -99 1443 -1359 25 553 -198 353 -1225 1033 486 -1452
2587a452K270q68L15n62n38K508k469J34J521j156Q68j633J313J033k787J899
$$ -1452 818 -50 265 -297 -835 1673 -796 -662 859 -297 571 -1062 251 1284 -1503 396
2603C96p8l84L44j510K546j229j324K196j247P02q70j16K157k699R10R31j179
$$ 396 318 -66 278 -1232 1314 85 -1239 957 -290 412 -458 -574 1583 -1116 -206 725 -454
2620d54J027j633J594K74k296K280q13n9K82j168K307j812l25J860j662J027r22
$$ -454 573 -1060 534 808 -1488 792 -21 -80 202 -966 1341 -471 -796 1064 -598 429 -493
2637d93L43J355k572J770J03j077J110j399J723p08j383K419j527K49J62n99J763
$$ -493 -150 1205 -1367 403 506 -571 539 -860 863 155 -1228 1191 -336 -87 75 -524 1239
2654A239k265Q09J286j878J146q07Q17L05k153K409o09r72R87q57J571j505m47
$$ 1239 -1026 -217 1069 -809 337 -470 347 652 -1501 908 299 -673 314 -543 1028 -477 -924
2671i24K327j932L59J41%J012k368J652P63j920J058n07J057n49j605K667j084
$$ -924 1403 -529 -170 -29 -29 983 -1385 267 1030 -890 168 -339 718 169 -1436 1231 147
2688A47p86P45l08J291k027L49J988j970L53kO41K91k264K096L03j586O87k64
$$ 147 -639 106 -202 1089 -938 -589 1399 -571 -218 -220 421 712 -1552 544 847 -739 -52 -316
2706c16J330j266j014K508j188n42K82K52J036k231Q33J496j604K36k02J044j57
$$ -316 1014 -252 -1266 1242 54 -488 -206 46 1082 -1149 -316 1180 -424 -188 -390 654 497
2723D97j906K020Mj082L05j21J325j428n66J952j008k38q7M64P66j914Q79R46
$$ 497 -1409 611 615 -467 -162 -283 1042 -386 -952 1000 -8 -246 -333 131 897 -1017 -138 808
2741H08j088J72l55J102l40j371J579k08m92mp8J129j249j82J220p06M7l65N33
$$ 808 -280 -108 -463 639 299 -1072 507 299 -193 -197 -275 854 -395 -577 643 -63 -16 -381 152
2760A52M84j378P75L43m93J38m36R05l58p38R75l31j4j19j28P61q21R3M88m41
$$ 152 636 -742 33 376 -117 21 -415 490 132 -606 369 38 24 -95 -223 538 -283 -190 298 -143
2780a43K84l78K88K38o78N31j16j26K38l71M25k14j57M16m25K26L1j91K61l20
$$ -143 141 -237 51 289 -389 142 26 -100 138 -233 192 -22 -179 237 -188 38 69 -122 139 -181
2800a81K94k5l50M46j79k5k1m5L62m24k3M01k09p4r6K97M9n20K99K70k43j97Q9
$$ -181 113 88 -262 184 5 -20 -41 -86 276 -148 -171 230 21 -53 -149 148 197 -323 -24 246 3 -194 -105
2823a05M37l40l60M87J42l47k00L78K46n52q7N51k8m75K4N11p2n65J89N39k76
$$ -105 332 -8 -368 119 261 -86 -286 92 338 -214 -301 250 222 -253 -229 282 210 -355 -166 373 97
2844I7m64L12M60l87m43M66L94n55k61N53J88n29k10O41Q3o85J08N44q9n50R0
$$ 97 -367 -55 405 18 -425 41 435 -120 -381 172 360 -169 -379 262 345 -340 -232 312 223 -327 -237
2865b37O64k98n69M09L96l06m80L92M96o04k36N18J55m09k68N97J07o58J40M38
$$ -237 427 129 -440 -31 365 59 -421 -29 467 -137 -373 145 300 -109 -377 220 327 -331 -191 247
2885B47m2m50j3O40k71m51L36K63j62m19L01M11n00j25L56J06k81k47M78N8m62
$$ 247 205 -245 -258 382 111 -340 -4 259 97 -322 -21 390 -110 -235 121 227 -54 -301 177 235 -227
2906b27J24K57j9l16K8L99k21k45K12J56j05k49K07K27l28l1J91M6j42j08K42
$$ -227 -103 154 135 -181 -153 246 25 -220 -8 148 43 -206 1 228 -100 -131 60 106 -36 -144 98
2927I8J0k28O9J33k0j45M0J50r3r9R6P4q3o1P3N4r5l3J08j6o9L6NK2o4%Q3q6L4
$$ 98 108 -120 -51 82 62 -83 -43 107 14 -85 11 85 2 -59 14 68 -27 -60 48 32 -37 -1 4 26 -38 -38 45 -41 -7
2956gL2n6O3o8M5K2j09J37p8jO7j03J21j11K0J45k07J20k2l6J20k17J96j0j71
$$ -7 25 -31 32 -36 9 31 -78 59 -19 -20 47 -56 65 -46 -26 119 -88 32 10 -26 94 -123 73 63 -108
2981a08J92j52J35m2j75L26k44M2Q7j68K71k92Q0K14l36K37j40O7J44l90L88j05
$$ -108 84 -68 67 25 -150 176 -68 -26 61 -107 164 -128 -48 166 -170 67 -73 -6 138 -252 136 31
3003C1j48K30l00L72k05j99M84l81J57n5j22M49n57K30K31l75L25l64K93J31n97
$$ 31 -117 113 -187 185 -20 -219 265 -116 41 -14 -136 313 -244 -14 217 -158 167 -197 96 227 -370
3024c70N76j74q5J37l78O58m27k30N96m41K69l02N4N84q77L81K16l02K79n81O68
$$ -370 206 32 -53 84 -294 364 -63 -293 303 -138 131 -171 -117 467 -410 -29 187 -115 164 -417 251
3045B51op69P76k71J04j20l43R81p84j36O35m21L54o34L54O34j138N57J28j31
$$ 251 245 -524 252 -19 85 -35 -378 603 -181 -317 318 -103 251 -383 -29 605 -533 24 152 21
3065B1J44p53J058k45q06Q67l32K75m17k32J192j089K0N85l70L83q62O56N18j264
$$ 21 165 -588 470 225 -581 286 -46 229 -188 -420 772 -317 -297 288 -82 301 -561 95 613 -651
3085f51P56m0L6Lp69J316n73o22Q65m26M51o71J8J122j285L31L58k66L88j003
$$ -651 105 65 101 104 -665 651 78 -544 321 -105 346 -325 -307 815 -470 -139 219 -47 341 -662
3105f62R59J74j119Q96k97K52j88o13J342q90k71P39n16N64q02K91Q41j307O75
$$ -662 297 471 -648 248 -49 203 15 -598 744 -146 -417 322 -194 370 -432 -141 700 -607 68
3124F8M6k02L62r15J080k41q17J014n62L54k45l68J147j104K10N42o51O20p50
$$ 68 114 -88 274 -641 439 198 -619 395 -167 187 -58 -426 721 -383 -173 369 -282 338 -412
3143d12N15L83j164J010k76j58L02o77J051o90l44J007q03L88k87PP62j245O88
$$ -412 103 486 -678 332 56 -102 200 -477 574 -116 -460 547 -256 132 -155 -148 614 -631 57
3162E7K89o54N23o11P51j65q97J215n36r2J42l06R37j068J10R07q82L66l43L85
$$ 57 346 -308 215 -396 355 190 -707 508 -28 -120 22 -284 653 -415 -305 602 -280 86 -257 128
3182A28L82j275J003P9n73L44m27Q83n73o11J221o22l4m5k0P98j210L63P20p64
$$ 128 510 -765 238 317 -256 88 -339 544 -29 -640 581 -41 -75 -120 -140 658 -552 -189 531 -233
3202b33K76l88O30Q0j139J063n4l85R7k90R65p90l73J027n21M9k89K53O51j195
$$ -233 43 -345 285 365 -774 289 235 -150 -53 -343 622 -168 -541 486 -35 14 -275 -22 629 -566
3222e66M80M70m83J48m62Q02j18q99Q77j24r8j30k14R07p68j93O90l53J66m64
$$ -566 -86 384 -99 49 -413 389 271 -628 249 125 27 -103 -317 590 -178 -371 319 -34 132 -332
3242c32L22N12r58M17K04j71P9n00P36j28o17O02j66J23k35j62P33o13m4L44j85
$$ -332 -10 502 -456 -39 165 -6 73 -427 309 181 -436 166 0 123 -112 -274 459 -154 -198 146 -39
3263c9K27m77K98L36o40L31j1J8N1m09N58j64k91L17j74K25k40r0M35l91R6P1
$$ -39 188 -289 9 345 -295 36 25 43 94 -315 243 79 -212 105 -69 156 -84 -174 261 -130 -34 37
3285C7j10K25l47K18J01k91K49j50P6O3k35L01j83j4J67k20J78q5%J25k40K17
$$ 37 -73 152 -195 23 124 -167 82 -68 8 71 -164 137 -46 -60 107 -113 65 -20 -20 105 -135 82
3307H2l2j47J59r1R9j02o4K61k06m7J18OK6k21J69J56k80L1J22O6j51j40L07k1
$$ 82 50 -97 62 -29 70 -32 -96 165 -41 -88 30 36 62 -159 10 166 -114 -83 39 105 -46 -186 121 100
3331A00k57P5J72J6k84P3K94j69k01J39K19j52k47K51J93k90j28K65J32k85j07
$$ 100 -157 -82 90 106 -178 -105 189 20 -181 -42 177 25 -222 29 222 -68 -196 69 201 -84 -191
3352a91L25M0l18rL14l7l01P2K97j08k98J72K55k08k00J87K18k54j72K93P7k48
$$ -191 134 174 -144 -153 161 124 -177 -105 192 84 -214 -42 213 5 -195 -8 210 -44 -216 77 154 -94
$$ [...]
8191@
##END NTUPLES=NMR FID
##END=
