##TITLE=1H_ES-aq-EtCel-c2
 
 8 sc, 
 14.1.2022
##JCAMPDX= 6.0         $$ Bruker NMR JCAMP-DX V2.0
##DATA TYPE= NMR FID
##DATA CLASS= NTUPLES
##ORIGIN= UXNMR, Bruker Analytische Messtechnik GmbH
##OWNER= root
$$ XWIN-NMR		Version 3.5
$$ Fri Jan 14 11:12:32 2022 Russian Standard Time (UT+4h)  she@DPX200
##.OBSERVE FREQUENCY= 200.131346
##.OBSERVE NUCLEUS= ^1H
##.DELAY= (6, 6)
##.ACQUISITION MODE= SIMULTANEOUS
##.ACQUISITION SCHEME= undefined
##.AVERAGES= 8
##.DIGITISER RES= 18
##SPECTROMETER/DATA SYSTEM= spect
##.PULSE SEQUENCE= zg30
##.SOLVENT NAME= D2O
##.SHIFT REFERENCE= (INTERNAL, D2O, 0, 15.7039)
##AUDIT TRAIL= $$ (NUMBER, WHEN, WHO, WHERE, WHAT)
$$ ##TITLE= Audit trail, XWIN-NMR		Version 3.5
$$ ##JCAMPDX= 5.01
$$ ##ORIGIN= Bruker BioSpin GmbH
$$ ##OWNER= she
$$ F:/spectra/data/she/nmr/H-F/1/audita.txt
$$ ##AUDIT TRAIL=  $$ (NUMBER, WHEN, WHO, WHERE, WHAT)
(   1,<2022-01-14 11:11:22.67 +0400>,<she>,<DPX200>,
      <created by zg, POWCHK disabled, PULCHK disabled
       configuration hash MD5:
       00 E9 B6 7A A2 85 ED C7 34 08 36 98 17 FE 4E 26
       data hash MD5: 16K
       B1 68 C3 2C 6C F3 41 74 30 D2 20 1A 5D 0F 90 A0>)
$$ ##END=
$$ 
$$ hash MD5
$$ 9D 34 8A 1C 75 FC 3D 92 14 ED 1A 69 24 7D A7 A9
##$RELAX= 
##$RELAX= 
##$RELAX= 
##$RELAX= 
##$RELAX= 
##$RELAX= 
$$ Bruker specific parameters
$$ --------------------------
##$DU= <F:/spectra>
##$EXPNO= 1
##$NAME= <H-F>
##$PROCNO= 1
##$TYPE= <nmr>
##$USER= <she>
##$AMP= (0..31)
100 100 100 100 100 100 100 100 100 100 100 100 100 100 100 100 100 100 
100 100 100 100 100 100 100 100 100 100 100 100 100 100 
##$AQSEQ= 0
##$AQ_mod= 1
##$AUNM= <au_zg>
##$AUTOPOS= <>
##$BF1= 200.13
##$BF2= 200.13
##$BF3= 200.13
##$BF4= 200.13
##$BF5= 200.13
##$BF6= 200.13
##$BF7= 200.13
##$BF8= 200.13
##$BYTORDA= 1
##$CFDGTYP= 0
##$CFRGTYP= 5
##$CHEMSTR= <none>
##$CNST= (0..31)
1 1 145 1 1 1 1 1 1 1 1 1 1 1 1 1 1 1 1 1 1 1 1 1 1 1 1 1 1 1 1 1 
##$CPDPRG= <>
##$CPDPRG1= <>
##$CPDPRG2= <>
##$CPDPRG3= <>
##$CPDPRG4= <mlev>
##$CPDPRG5= <mlev>
##$CPDPRG6= <mlev>
##$CPDPRG7= <mlev>
##$CPDPRG8= <mlev>
##$CPDPRGB= <>
##$CPDPRGT= <>
##$D= (0..31)
0 1.2 0 0 0 0 0 0 0 0.06 0 0.03 0 0 0 0 0.0002 0 0 0 0 0 0 0 0 0 0 0 0 
0 0 0 
##$DATE= 1642144282
##$DBL= (0..7)
120 120 120 120 120 120 120 120 
##$DBP= (0..7)
150 150 150 150 150 150 150 150 
##$DBP07= 0
##$DBPNAM0= <>
##$DBPNAM1= <>
##$DBPNAM2= <>
##$DBPNAM3= <>
##$DBPNAM4= <>
##$DBPNAM5= <>
##$DBPNAM6= <>
##$DBPNAM7= <>
##$DBPOAL= (0..7)
0.5 0.5 0.5 0.5 0.5 0.5 0.5 0.5 
##$DBPOFFS= (0..7)
0 0 0 0 0 0 0 0 
##$DE= 6
##$DECBNUC= <off>
##$DECIM= 32
##$DECNUC= <off>
##$DECSTAT= 4
##$DIGMOD= 1
##$DIGTYP= 9
##$DL= (0..7)
0 120 120 120 120 120 120 120 
##$DP= (0..7)
150 150 150 150 150 150 150 150 
##$DP07= 0
##$DPNAME0= <>
##$DPNAME1= <>
##$DPNAME2= <>
##$DPNAME3= <>
##$DPNAME4= <>
##$DPNAME5= <>
##$DPNAME6= <>
##$DPNAME7= <>
##$DPOAL= (0..7)
0.5 0.5 0.5 0.5 0.5 0.5 0.5 0.5 
##$DPOFFS= (0..7)
0 0 0 0 0 0 0 0 
##$DQDMODE= 0
##$DR= 18
##$DS= 0
##$DSLIST= <SSSSSSSSSSSSSSS>
$$ [...]
##$SUBNAM2= <"">
##$SUBNAM3= <"">
##$SUBNAM4= <"">
##$SUBNAM5= <"">
##$SUBNAM6= <"">
##$SUBNAM7= <"">
##$SUBNAM8= <"">
##$SUBNAM9= <"">
##$SW= 18.0517287032376
##$SWIBOX= (0..15)
0 0 2 0 0 0 0 0 0 0 0 0 0 0 0 0 
##$SW_h= 3612.71676300578
##$TD= 16384
##$TD0= 1
##$TE= 0
##$TE2= 300
##$TE3= 300
##$TEG= 300
##$TL= (0..7)
0 120 120 120 120 120 120 120 
##$TP= (0..7)
150 150 150 150 150 150 150 150 
##$TP07= 0
##$TPNAME0= <>
##$TPNAME1= <>
##$TPNAME2= <>
##$TPNAME3= <>
##$TPNAME4= <>
##$TPNAME5= <>
##$TPNAME6= <>
##$TPNAME7= <>
##$TPOAL= (0..7)
0.5 0.5 0.5 0.5 0.5 0.5 0.5 0.5 
##$TPOFFS= (0..7)
0 0 0 0 0 0 0 0 
##$TUNHIN= 0
##$TUNHOUT= 0
##$TUNXOUT= 0
##$USERA1= <user>
##$USERA2= <user>
##$USERA3= <user>
##$USERA4= <user>
##$USERA5= <user>
##$V9= 5
##$VALIST= <valist>
##$VCLIST= <CCCCCCCCCCCCCCC>
##$VD= 0
##$VDLIST= <DDDDDDDDDDDDDDD>
##$VPLIST= <PPPPPPPPPPPPPPP>
##$VTLIST= <TTTTTTTTTTTTTTT>
##$WBST= 1024
##$WBSW= 4
##$XGAIN= (0..3)
0 0 0 0 
##$XL= 0
##$YL= 0
##$YMAX_a= 261731
##$YMIN_a= -319199
##$ZGOPTNS= <>
##$ZL1= 120
##$ZL2= 120
##$ZL3= 120
##$ZL4= 120
##$ABSF1= 10
##$ABSF2= 0
##$ABSG= 5
##$ABSL= 3
##$ALPHA= 0
##$AQORDER= 0
##$ASSFAC= 0
##$ASSFACI= 0
##$ASSFACX= 0
##$ASSWID= 0
##$AUNMP= <proc_1d>
##$AZFE= 0.1
##$AZFW= 0.1
##$BCFW= 1
##$BC_mod= 2
##$BYTORDP= 1
##$COROFFS= 0
##$CY= 11.3945322036743
##$DATMOD= 1
##$DC= 2
##$DFILT= <>
##$DTYPP= 0
##$F1P= 2.36226072786647
##$F2P= -0.459571619588291
##$FCOR= 0.5
##$FTSIZE= 0
##$FT_mod= 4
##$GAMMA= 1
##$GB= 0.15
##$INTBC= 1
##$INTSCL= 1
##$ISEN= 128
##$LB= 0.24
##$LEV0= 0
##$LPBIN= 0
##$MAXI= 10000
##$MC2= 0
##$MEAN= 0
##$ME_mod= 0
##$MI= 1.114404
##$NCOEF= 0
##$NC_proc= 0
##$NLEV= 6
##$NOISF1= 3.799351
##$NOISF2= 2.8
##$NSP= 1
##$NTH_PI= 0
##$NZP= 0
##$OFFSET= 15.70392
##$PC= 1
##$PHC0= -15945.62
##$PHC1= 7.80079
##$PH_mod= 1
##$PKNL= yes
##$PPARMOD= 0
##$PSCAL= 0
##$PSIGN= 0
##$REVERSE= no
##$SF= 200.130013532006
##$SI= 16384
##$SIGF1= 3
##$SIGF2= 2
##$SINO= 400
##$SIOLD= 16384
##$SREGLST= <1H.CDCl3>
##$SSB= 0
##$STSI= 0
##$STSR= 0
##$SW_p= 3612.71676300578
##$SYMM= 0
##$S_DEV= 0
##$TDeff= 0
##$TDoff= 0
##$TI= <>
##$TILT= no
##$TM1= 0
##$TM2= 0
##$TOPLEV= 0
##$USERP1= <user>
##$USERP2= <user>
##$USERP3= <user>
##$USERP4= <user>
##$USERP5= <user>
##$WDW= 1
##$XDIM= 8192
##$YMAX_p= 0
##$YMIN_p= 0
$$ End of Bruker specific parameters
$$ ---------------------------------
##NTUPLES= NMR FID
##VAR_NAME=  TIME,          FID/REAL,        FID/IMAG
##SYMBOL=    X,             R,               I
##VAR_TYPE=  INDEPENDENT,   DEPENDENT,       DEPENDENT
##VAR_FORM=  AFFN,          ASDF,            ASDF
##VAR_DIM=   8192,          8192,            8192
##UNITS=     SECONDS,       ARBITRARY UNITS, ARBITRARY UNITS
##FACTOR=    0.0002768,     1,               1
##FIRST=     0,             0,               0
##LAST=      2.2672688,     0,               0
##MIN=       0,             -319199,         0
##MAX=       2.2672688,     261731,          0
$$ Real data points
##PAGE= N=1
##DATA TABLE= (X++(R..R)), XYDATA
0@%%%%%%%%%%%%%%Qj6J6j6J6j6K0k8L2l4M2m8N4o2O8p6Q8j00J12j28J44j60J76
37I2j93K13k37K62k88L17l49L85m22M62n08N59o17O78p45Q24r13J013j128J264
57F69j424J616j850K143k522L023l712M707o249Q870j4015K7250j13250k24455
71c19199M13515O4609j10276k28992J21413K80867l39672P9492J53445j66825
81e1623n42j3535K70800j65615l44572L79826J06651j58654j83335M0035L72039
92B51475k51953j45476J95592n4766M4822r4127R0995M3896k71570K34956J01189
103A45033j72829o5489r429K98530j37797k44085K05208J4499L1708r4321m7416
114g6388J60981j53041Q5149P3891j67398N1713o327J34391n1117k20617J97549
$$ plain form
0 0 0 0 0 0 0 0 0 0 0 0 0 0 0 0 8 -8 8 -8 8 -8 12 -16 16 -18 24 -24 30 -32 36 -40 48 -52 60 -68 76 -84 92
37 92 -101 112 -125 137 -151 166 -183 202 -220 242 -266 293 -324 354 -391 433 -480 533 -595 669
57 669 -755 861 -989 1154 -1368 1655 -2057 2650 -3599 5271 -8744 18506 -94744 -319199
71 -319199 94316 158925 48649 -180343 -58930 221937 -117735 -38243 115202 -51623
81 -51623 -52165 -65700 205100 39485 -305087 74739 181390 22736 -160599 -120564 251475
92 251475 -478 -145954 49638 -5128 39694 -54433 36562 80458 -191112 43844 145033
103 145033 -27796 -93285 -102714 195816 58019 -186066 19142 33641 65349 -28972 -76388
114 -76388 84593 -68448 16701 90592 -76806 -25093 -31420 102971 51854 -168763 28786
125B8786L2603l7186l2693r1025J67238n7203k1847O2496j44417J02311L4166
136D3229k1011j1259j32232J75515K6376j27472L7568l9086J00808k4800p2441
147d4805Q5918j03049O1987P3909q8557n090n5040J37453K8356j87961O9250M9583
159B1954K5780m1178q3314J25726n0059l0612Q5760o6964n371k3302Q0871N0444
171H9735j88577N1314J12575j8924o2162p7506J44336Q230j15716O2688k289L027
183F731k3548J1026P6363j26993K466J18856k7427n8942o1431J18347N3682j46922
195e7792J9954N5233J5034l1649m5744Q3374l8560m1973P7372j5099l2907l6358
207d9115O1958O6029j20110j2639P7334J7444l3853o6252O9415K9060o2334K3754
$$ plain form
125 28786 61389 24203 -8490 -99515 67723 10520 -11327 51169 -93248 9063 43229
136 43229 22218 10959 -121273 54242 80618 -46854 -9286 -48372 52436 27636 -44805
147 -44805 41113 -61936 51 73960 -14597 -19687 -74727 62726 91082 -96879 -27629 21954
159 21954 47734 6556 -76758 48968 -1091 -31703 54057 -12907 -18278 -41580 39291 89735
171 89735 -98842 -47528 65047 46123 -16039 -93545 50791 59021 -56695 5993 3704 6731
183 6731 -16817 -5791 70572 -56421 -53955 64901 37474 -21468 -82899 35448 89130 -57792
195 -57792 -37838 17395 32429 780 -44964 38410 -150 -42123 35249 20150 -12757 -49115
207 -49115 12843 78872 -41238 -53877 23457 40901 7048 -59204 10211 39271 -23063 691
219F91J564j208j1435L325N0057o1536k2196O2298O547k3527m9769M0255N2023
232D7089n5136j0420J1350J5559O736l0202K1038p958j3587L2390r650j1189j4023
245a8003J3588L5632l4774j6448J5685J2761J0255l0889r75J7531o66Q064j9423
258g662m425J5909J524L882j7772k614J7405j067M35j2128m210J5361L638k271
272F005j6935j816K4720L59j7407r300J3618J6262j4271j1050P273N560N77k846
286G49m21m668j588J3534K548j7252o446J7964J1794j7470j4748J4792J4662j0451
300B999j1644N356P446j990k914K943m063m921J0837N846j2295r747J1584J5202
314A4639j2235j5543R444J3232l377j2827J624R145k543j116Q76l302j577M162
$$ plain form
219 691 2255 1047 -10388 -7063 42994 -18542 -40738 21560 28107 4580 -45189 -4934 47089
232 47089 -8047 -18467 -7117 8442 15178 -15024 6014 -1944 -15531 16859 7209 -3980 -18003
245 -18003 -4415 31217 -3557 -20005 -4320 8441 18696 -12193 -13168 4363 3697 11761 -7662
258 -7662 -12087 3822 5346 9228 -8544 -11158 6247 5180 5615 -6513 -10723 4638 8276 6005
272 6005 -10930 -12746 11974 12333 -5074 -14374 -756 15506 1235 -9815 -2542 3018 3595 749
286 749 328 -4340 -5928 7606 10154 -7098 -13544 4420 16214 -1256 -16004 -1212 13450 2999
300 2999 -8645 -3289 4157 2167 -747 2196 -1867 -6788 4049 9895 -2400 -12147 -563 14639
314 14639 2404 -13139 -3695 9537 6160 -6667 -5043 4102 1559 443 1319 -1983 -3560 602
328F02P440p243j1240Q876J1362n177j2831J506J3591m75r909j433N316L001k263
343A123j271j111k041M090N020n038p491L738R177n83j0848j656J0706J838o257
358f04l852K211N975k152j866o76l012N801J891l026m045k043J1058r21q805N41
374c525J781Q406n191p621O617j347M481j965o751O087l100N853l16j0733P783
389D59l99M068k041j1746J2811r02j276M58j0284J3860k916m103N264j1366J2299
404D186j582n478P271j3420J2730J411r600Q016j2465J4020J934j5794J2323q947
418e395J0078J097j7083J8053j0017L321O793j6224J5829j1303M071J2410k3686
431a2056J4449k608J313Q246k5964K2572J61j2222J2754j7594J8742n229j3059
$$ plain form
328 602 8042 799 -10441 -1565 9797 4620 -8211 -6705 6886 6411 -3498 -4931 385 3386 1123
343 1123 -148 -1259 -3300 790 5810 772 -6719 -2981 6196 5613 -5235 -6891 3815 5653 -604
358 -604 -4456 -2245 3730 1578 -288 -964 -3976 1825 3716 690 -3355 -5398 5660 4739 -4066 -3525
374 -3525 -1744 6662 1471 -6150 467 -880 3601 1636 -5115 972 -2128 3725 3409 -7324 459
389 459 60 4128 2087 -9659 3152 2250 974 1432 -8852 5008 2092 -2011 3253 -8113 4186
404 4186 2604 -2874 4397 -9023 3707 5118 -4482 3534 -8931 5089 7023 -8771 3552 -5395
418 -5395 4683 5780 -11303 6750 -3267 54 6847 -9377 6452 -4851 -780 11630 -12056
431 -12056 2393 -215 1098 9344 -16620 5952 6113 -6109 6645 -10949 7793 2564 -10495
444a0495K4282k2977Q367O204j0409J7256k8055J6429J5240k7479J5880j2308
456h065J3983N061l1048L2154j2158o085J5176j9688K3792k1580n46L1498l5539
469a3045J2332m29J668J6801m1872L0149P340k5303K1029k0223K1918p407k2594
482a9636M2820l0572p01J4808j2117K4262l9734J6077K9713m0532J8872r749J1135
495D646R049m0258M3472j2584j9960K6979j9641K3623k6252n175M7800m5192P215
508f278Q338l186K1094m7932L3600J3493m0075L0532j5963J5340p399k7284N6766
521C1046l5759j2786K7570j4391K4484m2954J4555M0558n3140K1547n99K001J0440
534A2572m2821N1644j1688l5541L8421j6119J8182k6202r392N8191n0155J097
$$ plain form
444 -10495 13787 -9190 -823 5381 -5028 12228 -15827 602 15842 -11637 4243 -8065
456 -8065 5918 10979 -20069 12085 -73 -6158 9018 -10670 13122 -8458 -9004 22494 -13045
469 -13045 -713 -1142 526 17327 -24545 5604 12944 -12359 8670 -11553 10365 2958 -19636
482 -19636 23184 -7388 -8089 6719 -5398 18864 -20870 -4793 24920 -15612 3260 -6489 4646
495 4646 13695 -26563 16909 4325 -15635 11344 -8297 15326 -10926 -16101 31699 -13493 -6278
508 -6278 2060 -1126 19968 -27964 5636 19129 -20946 9586 -6377 8963 1564 -25720 31046
521 31046 -4713 -17499 10071 -4320 20164 -22790 -8235 32323 -20817 730 131 2132 12572
534 12572 -30249 21395 9707 -25834 12587 -3532 14650 -11552 -20944 37247 -12908 -11811
546a1811J9201j0167K1143m5431L2327J8569n0798L5165p714N526m546k9133N9432
559C1763l2101k2110L4758j6586K1416l4898P357M2719n3984K1080P081r063J3761
572A1193l7871M5897o989m0537M2054j5705J1418j5069j4812N3001m4746J462
584a0704K3653k1568K2707l2199K2017J6764m8401L8731p116o145P235k6066M5557
597B4465k6291j7225L6991k7080J7199j3928j198K9656m5143K6930Q216k4879
609a2287K0280k1641K7800q314l0678M4336k1876r73N958j2591L0670l6797J0865
622e248K6644l6695J8164p269J1143M018l8831M4090o720k3057J7805j1293K5040
635A7791k6772p327M2472l5705L220P829J032J1806m1026L2888J4672l8073J6728
$$ plain form
546 -11811 7390 -2777 18366 -27065 5262 23831 -26967 8198 484 6010 1464 -27669 31763
559 31763 -338 -22448 12310 -4276 17140 -17758 -10401 32318 -21666 -586 6495 -2568 11193
572 11193 -26678 19219 12230 -28307 13747 -1958 9460 -5609 -20421 32580 -12166 -10704
584 -10704 12949 -8619 14088 -18111 3906 20670 -27731 11000 3884 -2261 4974 -21092 24465
597 24465 -1826 -19051 17940 -9140 8059 -5869 -7067 22589 -22554 4376 12592 -12287
609 -12287 7993 -13648 14152 5838 -24840 19496 -2380 -3353 2605 -9986 20684 -16113 -5248
622 -5248 21396 -15299 2865 -4404 6739 10757 -28074 16016 9296 -13761 4044 -7249 17791
635 17791 -8981 -16308 26164 -9541 -6321 1508 2540 14346 -26680 6208 20880 -17193 -465
648d65k654J7307j4523k4518M7658k0139j6309J5697j572J5701l5533J2334L3375
661B6359l8012M557O298J0705j904l4706L8699K402k9058J3512%J6293k3335r071
675a7261M0226k4776q904J0157N127Q591l4005K0026K0237k9368O219P50J3328
688A0347o989k3236L2605o683j5191Q975j625J4555k1649o93K5233j9386Q02P1
702b864M830Q070k3445J5129N889j2918P581p617J1175l524j2133J7237q171n0
716h11J587o002J3407j1139m04P198p276Q875q827N7R588r439M628l780K128O576
732F366j3525P519L991n353K64m341J2257m554j2209J2135K129l487p318L431
746b695J3871j4301n003J2606P73o681p485J3770M620j8596L938J2643j888j2736
$$ plain form
648 -465 -3119 14188 -335 -24853 22805 2666 -13643 2054 482 16183 -19350 -7016 26359
661 26359 -11653 -7096 -798 9907 8003 -26703 11996 14398 -14660 -1148 -1148 15145 -8190 -17261
675 -17261 22965 -1811 -10715 -558 4569 13160 -20845 -819 19418 -9950 -3731 -2981 10347
688 10347 3358 -19878 12727 6044 -9147 -172 -1797 12758 -8891 -9584 15649 -3737 -2935 -2864
702 -2864 1966 10036 -13409 1720 7609 -5309 2272 -5345 5830 2306 -9827 7410 -761 -811
716 -811 776 -5226 8181 -2958 -3362 3836 -3440 5435 -3392 -3335 6253 -3186 1442 -2338 -210 6366
732 6366 -7159 360 4351 -1002 -738 -5079 7178 2624 -9585 2550 4679 1192 -6126 -2695
746 -2695 11176 -3125 -8128 4478 5251 -1430 -8915 4855 9475 -9121 -5183 7460 5572 -7164
760g164l03J8606o838j5709J0012J0732p044j3180J0044J3435j5496p899J4738
773C934O135j4116p096J7608L763j8406kJ6289n36j6449K271J6808n824j4763
787a0384P762J2971q968j2174J0990J0612j2486q827J3261P175j3771n160J3335
800D336L664j2931k210J2989m12j1757K331J0188k893j0260M617R713o564p452
814f641O008O779n568p042P115M678o811k356M832K729n408j880O424p68m619
829b528P74L650M73m951Q47M027j475j667o49K080J020k508L54L84P06K71k157
846a349J237J158j132q32N08K360k082k531L520J799l254k707L946L441n356k639
862c913N460K161n309k032N851J134o242J07O467j340o714K617O667l358o998
$$ plain form
760 -7164 -7467 11139 4301 -11408 -1396 9336 2292 -10888 -844 12591 -2905 -10804 3934
773 3934 10069 -4047 -11143 6465 10228 -8178 -8180 8109 7573 -8876 -6605 10203 4379 -10384
787 -10384 -2622 10349 1381 -10793 197 10809 -1677 -10504 2757 9932 -3839 -8999 4336
800 4336 8000 -4931 -7141 5848 5436 -6321 -3990 6198 3305 -6955 -2338 7375 811 -6641
814 -6641 -633 6146 578 -6464 651 5329 -1482 -3838 994 3723 -1685 -3565 2859 2091 -2528
829 -2528 -1754 1896 2369 -2582 -1735 2292 817 -850 -1499 581 1601 -907 -553 -169 537 808 -1349
846 -1349 -112 1046 -86 -918 -410 1950 -132 -2663 857 2656 -598 -3305 641 4082 -1274 -3913
862 -3913 1547 3708 -1601 -3633 2218 3352 -2890 -2783 3684 2344 -4370 -1753 4914 1556 -5442
877e442M216P362n681o389O054N476n789n696P317M230q510j505P385J340p935
892c567j310J0408j896r503L374P440j562r286L194R648o681n396N067M694m017
907F07p032Q587L481r499M93N546K693p755l033J1722l068p106K567M157J683
922D043r208L340P830p885o27K401L419k364p650J0218L29p644K684R89M775o891
938b241k490J0360o311j037J562K74L468q774N985L595q380M640j592L301j397
953I63o776J0619m703k520M273m303O135o194R02O755r895O041n43j785L896q358
969e493R283k201o416Q851o644M401j647l818R926j0965M313M417p682O753p185
984d107O199K078j1825J2138m552j077L264p266J1775r179j566J0917j0946N871
$$ plain form
877 -5442 -1226 6136 455 -5934 120 5596 -193 -5889 1428 5658 -2852 -4357 3028 4368 -3567
892 -3567 -4877 5531 3635 -5868 -2494 4946 3384 -5902 -2708 6940 259 -5137 -70 4624 607
907 607 -6425 2162 5643 -3856 -3363 2183 4876 -2879 -5912 5810 2742 -4364 -1797 2360 4043
922 4043 -5165 -1825 6005 -1880 -2507 -106 3313 949 -6701 3517 3846 -3798 -1114 -125 4650 -2241
938 -2241 -4731 5629 -682 -1719 -157 117 3585 -5189 796 4391 -3989 651 -941 2360 963
953 963 -5813 4806 103 -2417 1856 -2447 3688 -2506 -1604 5151 -4744 1297 754 -1031 2865 -5493
969 -5493 3790 1589 -4827 4024 -2620 1781 134 -3684 6242 -4723 -410 4007 -3675 3078 -4107
984 -4107 2092 4170 -7655 4483 -69 -1146 2118 -5148 6627 -2552 -4118 6799 -4147 1724
998A724l471J060P552j5450J0842J661p797O846q165J0298l711r392J5465r544
1012b082J209J775m376J1639j4911M869R488j2792P502n836N637L297j5653J6034
1026E800m076n606O837p793J2253j0430l319J6252j4478M558n93m50R084j8245
1040a0206J2402M143j2727R657p394Q994l365j1517J9809j1252k124N815n463
1053c228J1718j6018M653J3125j6993P970k890L252L863j6998J8211l056j0388
1066f779J0093o717J0285r953m764J9598j5915J713L472k020Q674j8134J1935
1079A488P129j6606J0151m266O290k553j2750K1338r859o322Q670n079J0279j5007
1093g097K848J5914j8224O027K63J479M449j7409J7430j90j3234J0501n397Q827
$$ plain form
998 1724 -1747 -687 6865 -8585 2257 3918 -3879 2967 -5198 5100 1389 -8003 7462 -2082
1012 -2082 -873 902 -3474 8165 -6746 -1877 7611 -5181 2321 -3515 2122 5419 -10234 5800
1026 5800 1724 -3882 2955 -4838 7415 -3015 -6334 9918 -4560 -2 -595 -1045 8039 -10206
1040 -10206 2196 6339 -6388 3269 -4125 4869 1504 -10013 9796 -1456 -3580 2235 -3228
1053 -3228 8490 -7528 -2875 10250 -6743 1227 -1663 1589 5452 -11546 6665 3609 -6779
1066 -6779 3314 -3403 6882 -3071 -7835 11763 -4152 -2439 1033 -987 7687 -10447 1488
1079 1488 8617 -7989 2162 -2104 4186 1633 -11117 10221 362 -5960 2710 -2369 7910 -7097
1093 -7097 -4249 11665 -6559 -532 -269 1210 5659 -11750 5680 5490 -7744 2757 -2640 6187
1107F187q086p004K0219j3958q86M993k866R003j6612Q602R529j6160Q356k947
1121a630M595J63j3666J8192n678p541Q071n346R524j0771j299J5078j4260L887
1135f81Q58p07O438j4726J1572K523j1401Q870n478O513k984q508J5498r262r84
1150b459M509n053R126j1087L258Q321j1855P359l387J366M045j1253J1469l100
1164A259n075P240p004P360m473l588J0362r598L992N74l715P372r140N314K146
1179C026p374P876n686K577J760o610Q758n890R1M527o432O430m519J53M989p673
1195c997O313k193k108M956o202N597k178l120O633o093L178k26k763N679o354
1210b878L283J589m747M999l930K386Q06m989O342l388m12K227l403M804l936
$$ plain form
1107 6187 -1899 -8903 11316 -2642 -3528 1465 -1401 7602 -9010 -408 9121 -7039 1317 -1630
1121 -1630 2965 3128 -10538 7654 1976 -5565 2506 -2840 6684 -4087 -5386 9692 -4568 -681
1135 -681 177 -530 5908 -8818 2754 5277 -6124 2746 -2732 3781 797 -7711 7787 -1475 -2459
1150 -2459 2050 -3003 6123 -4964 -1706 6615 -5240 2119 -1268 98 4143 -7110 4359 1259
1164 1259 -3816 3424 -3580 3780 -693 -4281 6081 -3517 475 1049 -2666 4706 -4434 880 3026
1179 3026 -4348 3528 -2158 419 2179 -4431 4327 -1563 -1472 3055 -3377 3053 -1466 -1313 3676 -3997
1195 -3997 2316 123 -1985 2971 -3231 2366 188 -2932 3701 -2392 786 560 -2203 3476 -2878
1210 -2878 405 1994 -2753 2246 -1684 702 1508 -3481 2861 -527 -939 1288 -2115 2689 -1247
1225a247j92M138m705K889j288m9K567n006M079n7k715K573k426L089j410k650
1241b410M569k640L33K42j060L086l698J068K199k734J432j282J569N18l490L157
1257H59j78j060L13j051K900k020j316K743j198J41r55P44J774l124R39J534q92
1274A53m27r54K475l76k584J793P83m58j345K89K369j935j142J922L94j154j211
1291a408K006R47k692J5K165J08k170k19K628m58k407Q86K062j045k026J458J885
1308A735j875j702K280J481k654j058K674Q60k697p97L092J29l017N23K542n26
1324I90k773J037K953k021k227K066J929j862k422K757J825l174p95K487R79k701
1340i52r30L522l86k986Q39K420m02l177J235L180k240k043J732K076j659k539
$$ plain form
1225 -1247 -1439 2699 -2006 883 -405 -454 2113 -2893 1186 1129 -1586 987 -1439 1650 240 -2410
1241 -2410 2159 -481 -148 94 -966 2120 -1578 -510 1689 -1045 387 -895 674 1192 -2298 859
1257 859 681 -379 -66 -1117 1783 -237 -1553 1190 -8 133 -822 -78 1696 -1428 -489 1045 153
1274 153 -274 -1228 1247 871 -1713 80 863 405 -940 -651 1718 -217 -1359 563 957 -197 -1408
1291 -1408 598 1545 -1147 -1132 1033 1141 -1029 -1248 1380 922 -1485 -599 1463 418 -1608 -150 1735
1308 1735 -140 -1842 438 1919 -735 -1793 881 1741 -956 -1753 1339 1468 -1549 -1026 1516 990
1324 990 -1783 -746 2207 186 -2041 25 1954 92 -2330 427 2252 -922 -1717 770 1749 -952
1340 -952 -1882 1640 1254 -1732 -893 1527 1125 -2052 -817 2363 123 -1920 -188 1888 229 -2310
1356b310K805J469k837n71K092J032k679o82L278n52k501N37K264k25k902J105
1372f77K467j597j573J068J752j272j801J992R17j788n76J512P63j897l74J941
1388H57p1j546MJ515j37j449M05J176m79r90N99P78o43n75M88P28p02n75Q46K7
1408B56k04l32O6P27o49k3J82j59O39q52J15O04m81L62q29P07O53j608Q41J96
1428B11J9j91j179K213o28j563J294l8P61j776j11K864k306l36Q04M13O12l133
1446b070K392J556l172R34J82J656j462k657M669j139k267J025L89K228m182L83
1462a535M517l621l28L08J916M86n428M465J731l939P44j73L680l107l334O506
1478B888k137j940K25J009L403o547J630M981m298J50j056L771N9o824O227N94
$$ plain form
1356 -2310 495 1964 -873 -1444 648 1680 -999 -1681 1597 1045 -1456 -919 1345 1120 -1782 -677
1372 -677 1790 193 -1380 -312 1440 168 -1633 359 1276 -512 -1088 424 1187 -710 -1084 857
1388 857 786 -760 -756 759 622 -827 -422 754 275 -715 -116 662 19 -556 -68 660 -42 -617 229 256
1408 256 52 -280 -214 513 -136 -159 23 -136 503 -349 -234 370 -111 251 -578 129 782 -826 15 211
1428 211 230 39 -1140 1073 445 -1118 176 138 899 -877 -988 1876 -430 -766 38 451 1063 -2070
1446 -2070 322 1878 -1294 -360 -178 1478 16 -2641 2028 889 -1378 -353 36 2264 -1918 -1535
1462 -1535 2982 -639 -967 -659 1257 1743 -3685 780 2511 -1428 -684 -857 2823 -284 -3618 2888
1478 2888 751 -1189 -964 45 3448 -3099 -1469 3512 -786 -636 -1692 2079 2138 -4686 1541 2135
1494B135l270M23q24N548n136k588P255l421o28j249K013L867q347L613L764m182
1510a027R69k452N453j399o520P526j426j728j99r45O407o874n47O311m329J188
1526D08k629K961K974q432N583J188l133J608l316O286l217m388P467l858N58
1541F0q27n63N697p845K716L749m873L144l578L852O29o798P507k592j412K069
1557I35l316O112n442n47O120o173L182j564K52L608p441O083j43m329M622l969
1573b010M192k117l562P774n974R67J890k710M682o417L424L260p031N144k060
1588e48J085P79n535Q098l890k799N010l630L822m417L52O474q211L311J215j608
1604d92K479o243O862m04o441O334k590J901k046k615Q466p128k09M361l082L011
$$ plain form
1494 2135 -1135 -712 -1536 4012 -1124 -3712 3543 122 -506 -1755 258 4125 -4222 -609 3155 -1027
1510 -1027 -58 -2510 2943 1544 -4976 2550 1124 -604 -803 -1748 4659 -2215 -2762 3549 -780 408
1526 408 -2221 740 3714 -4718 865 2053 -1080 528 -2788 3498 281 -4107 3360 -498 60
1541 60 -767 -1330 4367 -3478 -762 2987 -1886 1258 -2320 1532 2161 -4637 2870 278 -1134 935
1557 935 -2381 3731 -1711 -2258 3862 -2311 871 -693 -441 3167 -4274 1809 1666 -2663 1959 -2010
1573 -2010 2182 65 -3497 4277 -1697 -730 1160 -1550 3132 -3285 139 3399 -3632 1512 -548
1588 -548 537 1316 -4219 3879 -11 -2810 2200 -1430 2392 -2025 -1673 4801 -3410 -99 1116 -492
1604 -492 1987 -4256 2606 2202 -4239 2095 -495 1406 -640 -3255 5211 -1917 -2126 2235 -847 2164
1620B164n716M067L710q645N214p6k93K87m898Q366l678m273O097k862K261l795
1636b070L45O852q320K110K889k100J778n432O116O08p123N832j189O04j369k655
1652c124P775n806j488M911k776K060m347K789M063p816L941R44j060O53m212
1667c493O661k258m398N419k210J430k461m62N944o434J091K805k131J835m186
1682b848M018J287n814M445q09J03k72k620N707l688j623L895k369J729k699J059
1698d99L474n410K455Q58j216J230l139L910p50l245L715j711Q44q33j112L954
1714B525l767M50J966j880J743k494J709J363l567K712p06j38O45k142L150j690
1730a21j041K297j846J465j233j78K256k812J391K28r72J470j981J586K8j646
$$ plain form
1620 2164 -3552 515 4225 -4420 794 718 425 712 -4186 4180 502 -3771 2326 -536 1725 -2070
1636 -2070 -1725 5127 -3193 -1083 1806 -294 1484 -3948 2168 2776 -4347 1485 296 900 -469 -3124
1652 -3124 4651 -1155 -2643 2268 -508 1552 -2795 -6 4057 -3759 182 1126 66 719 -3493
1667 -3493 3168 910 -3488 1931 -279 1151 -1310 -1772 4172 -2262 -1171 1634 -497 1338 -2848
1682 -2848 1170 2457 -3357 1088 279 382 110 -2510 3197 -491 -2114 1781 -588 1141 -1558 -499
1698 -499 2975 -2435 20 878 -338 892 -2247 1663 913 -2332 1383 -328 516 -317 -1429 2525
1714 2525 -1242 -792 1174 -706 1037 -1457 252 1615 -1952 760 54 -84 561 -1581 1569 -121
1730 -121 -1162 1135 -711 754 -479 -657 1599 -1213 178 406 -566 904 -1077 509 537 -1109
1746a109J997j360O13J67j221J920j494K87P96j378J475j018R6Q39j383J350o99
1763a22k59J025j221R12l81k38R14j281Q92K5o61P38p64P89k15p84J161o15K7
1782e8N8k20Q04r95J82P05o15J30k72N29R7r67P24K02l65j23m2P41n77m51P68
1803B55pl65k56M91L43q01J3O68p0n78j2P09j31p16K85O42l58n93M36N26m48n46
1825e13N42N62p78l04P36J70n85l57Q56J57r93K13O76p6p16LJ037m91p44N88M49
1846D32k59q00N57Q14r94k55O99K55n20o18J064J66j073K77N74Q5q26l9J179o03
1866A15o94N33M76j83r38O47P76r95j88N63L52n76n61J069N7r34J97N68J18q56
1886d54N7J005n08n89M04M65k10p35N59N60p31k21N35K69n46l09P21J04o89M6
$$ plain form
1746 -1109 888 -472 141 308 -913 1007 -487 -200 596 -782 693 -325 -229 610 -773 577 -122
1763 -122 -381 644 -577 335 -46 -284 630 -651 241 266 -395 343 -421 368 153 -631 530 -85 -58
1782 -58 0 -220 584 -411 -229 476 -139 -9 -281 248 345 -622 102 304 -61 -184 -226 515 -62 -513 255
1803 255 248 -117 -373 118 461 -340 -327 341 271 -307 -319 390 259 -457 -172 470 112 -481 -45 481 33 -513
1825 -513 29 591 -187 -491 245 415 -170 -527 329 486 -507 -294 382 306 -410 -407 630 139 -605 -17 432
1846 432 173 -627 -70 744 -250 -505 194 449 -71 -689 375 541 -532 -255 319 404 -422 -461 718 115
1866 115 -579 -46 430 247 -691 -44 732 -263 -451 112 464 -112 -673 396 453 -481 -284 284 402 -454
1886 -454 -397 608 100 -489 -85 380 170 -565 -6 554 -177 -398 137 406 -140 -449 272 376 -313 -267
1906b67N37k3n21L1N87j93n21L36L03k49k64J43M62l89l27N10j2j81j31J06L83
1927C20n08K1L58k37J30k95K63K30o05M19n9m6J72n46O42j45l95M90m27M79k48
1948A3m07Q64o52J66O8k89P57r56L42N16q03O48o01M60L06j187J153l34k45M36
1968B55q33J219p41m54J189j005O28m23j48J179j625Q39L02p89R23j198J045J00
1986D63j380J593r15K79K27j054J741j360M0J066j357J282j047J83J157j918J507
2003E07m99m13J202j781J604m86q73J677j768J255j96j077J897j834J009J89j394
2020i81K130j836O31O93j602K039j760M78J240k181J908j094J51J152k381K360
2036I47q47q59J638j855J928j138q98K636k438R90L1p27J994k889J671Q93k262
$$ plain form
1906 -267 270 247 -274 -243 344 151 -370 -34 269 20 -244 -101 361 -28 -355 155 143 -38 -169 -63 320
1927 320 -188 -167 191 -46 84 -211 52 282 -323 96 37 -9 163 -383 259 114 -281 209 -218 261 13
1948 13 -394 470 -182 -16 52 -237 520 -436 -94 422 -381 267 -334 126 432 -755 398 64 -181 255
1968 255 -578 641 -100 -554 635 -370 258 -165 -313 866 -759 80 382 -407 516 -682 363 463
1986 463 -917 676 -239 40 267 -787 954 -406 -366 700 -657 625 -422 -239 918 -1000 507
2003 507 8 -405 797 -984 620 134 -739 938 -830 425 229 -848 1049 -785 224 413 -981
2020 -981 1149 -687 -56 637 -965 1074 -686 -208 1032 -1149 759 -335 -184 968 -1413 947
2036 947 100 -759 879 -976 952 -186 -1084 1552 -886 104 135 -592 1402 -1487 184 1077 -1185
2053a185J903j455J329k1k409L373j645m80J049j312K452k618J95K636k888J387
2069C11o89M68J257l486L035n9j918J664j565K378j519j670L765k517K99K51n52
2086e47K410l664J585J875k862J655j274J557J94l261L780j107j143J200j363
2101i65K760k640m91L362k907R85m58K61J768l809K659O23k290J763j592K137
2117A166r32k197L804k192k2O03j002K562l222R81K099k874J769j148Q82Q12l167
2134b078L310r01j217J574j708K380j792p86K999k753J127j08n59J955l048K002
2150C97N63k193K099j588J230n6j970L038j985%J201j606K012j985N26J660k674
2167a331J939o82k13J140k237K393q94j139K056j788J308p06o23K213k515J148
$$ plain form
2053 -1185 718 -737 592 571 -1838 1535 -110 -590 459 -853 1599 -1019 -824 1812 -1076 311
2069 311 -378 90 1347 -2139 896 837 -1081 583 -982 1396 -123 -1793 1972 -545 -246 5 -547
2086 -547 1863 -1801 -216 1659 -1203 452 -822 735 929 -2332 1448 341 -802 398 -965
2101 -965 1795 -845 -1336 2026 -881 104 -354 -93 1675 -2134 525 1148 -1142 621 -971 1166
2117 1166 234 -1963 1841 -351 -373 230 -772 1790 -1432 -451 1648 -1226 543 -605 277 1089 -2078
2134 -2078 1232 331 -886 688 -1020 1360 -432 -1218 1781 -972 155 47 -512 1443 -1605 397
2150 397 960 -1233 866 -722 508 452 -1518 1520 -465 -465 736 -870 1142 -843 -317 1343 -1331
2167 -1331 608 -74 -287 853 -1384 1009 115 -1024 1032 -756 552 -154 -777 1436 -1079 69
2183F9M74j225J532j838J414K57j983K239j219K64L43j279K199j774j4J466j606
2200f81J228j039L91J124k273J717j78p21R04j333J676p52j060J945j326M82j61
2217e7m20J547j915P43P76j210R56r90Q93K01j579J713o34k13M04q10J462j178
2235c11k11J275j141O25n12J91Q41j591J055Q4o10N90q46J057l54q55J265p26
2253a74K27o7l57J057j130K71N66o81N57o34M74L07j003Q52k38p4K12n87Q60m58
2273b0k93O36m99L61l15n4O33p54K98J11j83K92n63M86Q1n11M14j93K00j15l42
2294c30O30l19j29J93j03K71m27J13L88l99N3kJ73K1m36M01Q6k68J9L2K64k88
2316e7j62M07p8k05j7K22N7l62J11K81j49k19R4K87j83k59K40J88k33j81K91J04
$$ plain form
2183 69 543 -682 850 -988 426 683 -1300 939 -280 -16 327 -952 1247 -527 -541 925 -681
2200 -681 547 -492 -101 1023 -1250 467 289 -432 472 -861 815 63 -997 948 -378 104 -57
2217 -57 -477 1070 -845 -102 674 -536 420 -570 323 524 -1055 658 24 -189 215 -595 867 -311
2235 -311 -522 753 -388 237 -275 -84 757 -834 221 305 -305 285 -561 496 142 -713 552 -174
2253 -174 53 -14 -371 686 -444 -173 393 -288 269 -365 109 416 -587 265 27 -47 165 -422 438 -20
2273 -20 -313 323 -176 185 -130 -184 449 -305 -7 104 -79 213 -350 136 217 -294 120 -73 127 12 -330
2294 -330 300 -19 -148 45 -58 213 -214 -101 287 -112 -59 -61 112 133 -303 98 184 -84 -65 -33 231 -57
2316 -57 -219 188 110 -95 -112 110 167 -195 -84 197 48 -171 -77 210 27 -232 8 196 -37 -218 73 177
2338A77k76p9K69R9l66J9L56j20k33M8K64m9l54K46J92k19j02J18K21k62j72L72
2360A49m7j68n0J70J58l99R2K67j69p0k6K26p0l01L03M0j50l7L2K36k67o4K78
2383A33j25l6o6J17J13k88J42J19j41J8m5J71q5j49K02n0m4rOJ15j48J9J05j08
2407c4L1j4K4K7r9Q5K1q6N8j5Jpj0M4l6l7Q5m9k3L8j1M4o7NJ11j30J8N0k5M9j15
2438f7Q0O3j74J42l8lJ3j28K31j01j36K15j45J18j16n2K95l37J24Q4j44J82k71
2461a65K30N5l49L39j47N5K1k60M91l50n8L24l36L09k99P7L63n91L89l7j57K88
2483A92m86N19j42l73N69m28K49r5k56O53o85K38K79m70M84n16L29K42p87P54
2503B70k99o1K65n59Q19n54k03P47p02M47l08rO93j088O55J43n27N49p05P76j80
$$ plain form
2338 177 -99 -178 91 190 -176 -157 199 79 -154 -106 158 109 -245 1 193 -26 -128 -10 211 -51 -223 149
2360 149 102 -66 -116 54 212 -187 -95 172 3 -67 -93 133 63 -238 65 105 -45 -82 -50 186 -81 -145 133
2383 133 8 -28 -94 23 136 -152 -10 109 -32 -14 -59 112 27 -122 80 30 -14 -23 -17 98 -50 -31 74 -34
2407 -34 -3 -17 7 34 -65 20 41 -45 13 -2 -1 -8 -18 26 -10 -47 38 -11 -34 4 -7 37 -30 -25 86 -44 -26 24 -1 48 -67
2438 -67 13 76 -98 44 6 3 16 -112 119 18 -118 97 -48 70 -46 -98 197 -140 -16 68 -76 106 -165
2461 -165 65 120 -229 110 -37 18 39 -221 270 -80 -138 186 -150 159 -140 -63 300 -291 98 61 -96 192
2483 192 -294 225 83 -290 279 -149 100 5 -251 402 -283 -45 234 -236 248 -268 61 303 -484 270
2503 270 -29 -90 175 -384 435 -119 -322 425 -277 170 -138 -147 546 -542 113 256 -271 278 -427 349 169
2524A69p99J146o43J21M8m06J068j148K15P68r02O11o07M78M27j403J216j86l93
2543b20M00p28J254q16n65J372r35L29l05J3J079j681P62N98r16O15q40J055o2
2562D09j421J628n45j73J38n55J502j443q7J337j118N48o75N13P94j923J332J29
2580C90o78N18r37J494p04j051J752r50K44k70k04J489j894N80Q84j045P31j006
2598f57J012K85j764J687m68k33L13q67J664j257l71J474j222O82n89J24J113
2615I26j900J177K07q40Q54j095J208l12j142J713j080K56J60o60J406j509M65
2632a66Q43j316J066p73M08M84j496J604o44m09Q63j017J184q67k41J383j537
2649f31P75n4l30Q73j480J221N0j154J228q17O09k36q00J706j318M1P27p45Q92
$$ plain form
2524 169 -630 516 -127 -6 42 -364 704 -444 -229 539 -363 248 -359 119 546 -857 359 173 -220
2543 -220 180 -548 706 -110 -675 697 -238 91 -214 -201 878 -803 -41 557 -359 256 -584 471 409
2562 409 -1012 616 71 -102 36 -519 983 -460 -547 790 -328 220 -455 58 852 -1071 261 390
2580 390 -288 230 -707 787 83 -968 784 -166 78 -192 -396 1093 -801 -221 663 -382 349 -657
2598 -657 355 640 -1124 563 95 -138 175 -692 972 -285 -656 818 -404 278 -311 -187 926
2615 926 -974 203 410 -430 424 -671 537 225 -917 796 -284 -28 132 -528 878 -631 -166
2632 -166 677 -639 427 -346 62 546 -950 654 10 -399 464 -553 631 -236 -477 906 -631
2649 -631 144 90 -240 633 -847 374 424 -730 498 -319 290 54 -746 960 -358 -317 410 -335 557
2668E57j200O08Q49j646J056j91j5K61j158J646o48q41J181o51O12p70r3J478
2686A035j606L72M83l38M82j268J201K62j440J053k55L27l58p26J705j024m38
2703e33Q25l71N66j132M81J068j519N35J46J13P6j139J421j66r90P85k52N54p24
2722b56l16J428j068q7L98q5M83j187P05O31j107M84j24M09j51q89J255l54n13
2741c44M11k18O50q18o0R78p98J25k9J48L60r91O88K39n94L06k75N57k71n61Q61
2762C64l52p1K5j23N95o96R3M72m33K28k96K54K22o35M53j2j31J25l37N03k15
2783C3k71L97k46J88j46j21M18l95R8J00j42K49l42J67J46k71K04j54J23Q4l13
2804a94K72m1m0K7j64K98j44j61K11m8O4j82M4K43k49l0J12O0k4k41K36J16k66
$$ plain form
2668 557 -643 -35 814 -832 224 33 18 279 -879 767 119 -722 459 -192 420 -350 -443 1035
2686 1035 -571 -199 284 -54 428 -840 361 623 -817 236 -19 308 -50 -776 929 -95 -533
2703 -533 292 -79 487 -645 -164 904 -615 -80 66 179 255 -884 537 371 -619 166 -86 468 -256
2722 -256 -572 856 -212 -299 99 14 497 -690 15 646 -461 23 -101 308 157 -732 523 169 -344
2741 -344 67 -151 499 -319 -379 599 -199 -74 -103 45 405 -586 102 341 -253 53 -222 335 64 -497 364
2762 364 12 -59 -34 -157 438 -258 -165 307 -126 102 -194 60 282 -353 100 88 -43 82 -255 248 33
2783 33 -238 159 -87 101 -45 -166 252 -143 -45 55 -87 162 -180 -13 133 -138 66 -88 35 119 -194
2804 -194 78 37 -3 24 -140 158 14 -147 64 16 80 -102 -58 185 -64 -94 18 78 54 -187 49 165 -101
2827a01PJ19J06j91j25L06rk39K3K25mk74O1K76j19k41J25K40j40k35J88K09k29
2850b2j85K70J47k77j19K79J27l45o8L69l8k88QL24k9l90J50L11j84k41J30L13
2872B42k40k70L25J41k49j55K44J96l59p0L57l2k58l2L20jl80J58K53j32k04Q0
2894f6K92k10k28K67J11j92j39K01J76l19l4K56j7j86m2K43nk69J15J77r2j67
2916a28O6K11j44j62J80Q4j24j00J39J06j89m2J75Kj36j4J53qj53M2J30o2r5N1
2940a8R4n1j12R7P7j22j5M5O1o0q4J38k0q4M4MN0r0j1J40j22K3J3j2P5j30O5O1
2968E6j18R5p2O2K4j39J76r3k4J06j36J55j16j0J31j91J48n2n3J49j95J62n9r9
2992i3K02j98J14nj15K18k44J28Q1k25K28j72J11N6k67L33j76l9J42k06K97k56
$$ plain form
2827 -101 -94 25 131 -60 -185 121 112 -127 -104 121 117 -157 -96 180 61 -180 -55 185 45 -190 -2 207 -22
2850 -22 -207 63 210 -67 -186 93 220 -125 -193 176 138 -150 -142 182 153 -237 -87 224 40 -201 -71 242
2872 242 2 -268 57 198 -51 -206 38 234 -125 -195 162 130 -128 -160 160 159 -221 -63 190 58 -146 -66
2894 -66 226 16 -212 55 166 -26 -165 36 212 -107 -141 115 98 -88 -130 113 108 -161 -46 131 39 -128
2916 -128 -62 149 5 -157 23 107 -17 -117 22 128 -61 -103 72 74 -62 -76 77 69 -84 -42 88 26 -69 -18
2940 -18 76 25 -87 10 87 -35 -50 -5 56 -4 -88 50 30 -54 -10 -6 44 -46 -57 83 -39 -16 -3 -15 60 -70 -5 56
2968 56 -62 33 -39 23 47 -92 84 -9 -33 73 -63 92 -24 -34 97 -94 54 2 -51 98 -97 65 6 -93
2992 -93 109 -89 25 20 -95 123 -121 7 88 -137 91 -81 30 86 -181 152 -24 -63 79 -127 170 -86
3014h6j1L02l41J82p8%K20m36L38L3k72K48k25K87j36k92N31l13j1P6j23L79n23
3037b51J69L66m66K31j79K23Q9n86O27j23k41J92k12M81m47j66O73m71O3o5R4
3058AL57p85M54K85m94K24k37M87j82n99Q22k60j88Q0j05O02p67M4O97n82J41
3079ej85L13K26r16P24J10m65K05k44O56m76m30R38m78m5l7N1N46r42L67M87o08
3101b08K48k81N14o6p87R14k19k53J48k08O79p26p2P77o30J83j68J87L54r22O63
3122A27J38n11L39l31N54l14m57Q98n31%J20j72N50p85L23M60p11M30k44K27Q6
3143A96o75Q50l24k95M30l45M61n01kO97q01K99P7j09K76o73O74po39N95k50K20
3165A54k29k63Q56p05k8M17k70K76n93M56L64q88N16L2l9k3m54Q79l97m78O48
$$ plain form
3014 -86 -97 205 -136 46 -32 -32 188 -248 90 123 -149 99 -126 161 25 -267 264 -49 -60 16 -107 272 -251
3037 -251 -82 284 -182 49 -130 93 182 -404 223 100 -141 51 -161 320 -127 -293 380 -91 -28 -93 1
3058 1 358 -427 27 312 -182 42 -195 292 110 -489 333 73 -115 -35 -140 462 -305 -261 436 -146 -5
3079 -5 -190 123 349 -567 157 267 -198 7 -237 419 -57 -487 451 -27 -72 -109 -58 488 -454 -87 400 -208
3101 -208 40 -241 273 207 -580 334 115 -138 10 -198 481 -245 -317 460 -170 13 -155 32 386 -536 127
3122 127 265 -246 93 -238 316 2 -455 443 -88 -88 32 -140 410 -375 -52 408 -303 127 -117 110 196
3143 196 -479 371 47 -248 182 -163 298 -203 -205 492 -309 -10 67 -42 234 -439 235 228 -411 184 -66 154
3165 154 -75 -338 518 -187 -215 202 -68 208 -385 71 435 -453 63 95 56 33 -421 458 61 -417 231
3186B31k33J70m26J13O93q77J82L55j82Q8n45O84O0p94N80j8K4k26k14Q58o21
3207i8k44N23j57J41n36L68M75q35K88J98k7n0m71P71j67n58M78n6J44l76l8P00
3229D73o21m0K90m8J19n30M34K47o20K94KJ20j06l61O35k37k63K77j07K33l63
3250a72K3M56m50R2N6J6J31m29L69O2l08K10j27J96j05k29L94j98k4N9j03K60
3272A79k83M8J90k20J49j32O0J21k56K17p1m5J13j87J81m5j03J45j42J33l8j14
3294a00J84j16M4j7n6J85j80J6R7p9P6j26Q2Q2j81R4QJ6j7j17K13n2j45R1K9N4
3320H5j48j0K04j31p9O5Q5j7j89J20J37j48o2P3J21j18j26J85N0j51l9J35P0j92
3344h0k1K09l8j54RJ80k0k05O8J85r1j66R6J65j24j41J33J27j61j00J71Q3j70
$$ plain form
3186 231 -2 168 -258 -145 548 -329 -147 208 26 114 -431 253 313 -481 99 81 105 -121 -335 523 -98
3207 -98 -342 181 24 165 -371 -3 472 -363 -75 123 96 46 -425 346 179 -379 99 43 187 -189 -227 473
3229 473 -148 -188 102 54 173 -357 77 324 -296 -2 0 120 14 -347 288 51 -212 65 -42 191 -172
3250 -172 -149 307 -143 -51 5 21 152 -277 92 154 -154 56 -71 125 20 -209 185 -13 -37 22 -81 179
3272 179 -104 -56 134 -86 63 -69 -9 112 -144 73 2 -43 70 -117 64 19 -84 61 -81 52 14 -100
3294 -100 84 -32 12 -5 -61 124 -56 -40 57 -22 54 -72 10 92 -89 5 13 29 12 -105 108 56 -89 2 31 85
3320 85 -63 -73 131 0 -79 -14 71 54 -135 -15 122 -26 -88 -15 106 -12 -138 47 97 -54 -93 42 112 -80
3344 -80 -101 108 70 -84 -75 105 85 -120 -52 133 42 -124 -28 137 13 -128 5 132 -29 -129 42 125 -45
3367d5q0J89L6j75k7J84qj69J0J81l4j68O1J35o0j21N5J43r4j07R9Q5p7j03J09
3392A9Q4j35l4R2M5q2o8J17K3j05pP1L5q2l1J02j9m5l2O7L4q9j2P8J2n7m1Q4K8
3421E2r9MP6K4q8l0J14nr1jR9jj22K3J28n0j11M0J25n6j26Q4J09j02j04J24Q8
3448A04j32q2J40O9j47o6J67M3j74k3J76J7j94K8J58l4j41K8J73p5j55J07J17
3471A04r4j11R8J31j53p5J42L6r1q4J35O0j74J4J09J9j03o0J78k7j49O4N9K8j25
3496f9j0J80j01n2K6P6K5j87Q9J20j19k1MJ30m9j86J98K3r1m3K5J73j84p8K14
3521I3l4n9j16J46J34k97P0J52m4q1r8K65n8k62K17N3m3j43J7L17k97p6K36l2
3545F0l4k03K47J30l96J54J36l1j12j18L90j73k60K76J1j3k16J13L16m07K7K25
$$ plain form
3367 -45 -125 64 100 -75 -102 82 74 -95 -85 96 62 -106 -45 90 30 -91 -36 107 13 -94 5 90 13 -90 19
3392 19 103 -32 -66 26 71 -11 -79 38 61 -44 -51 20 55 -27 -58 44 25 -20 -52 15 49 -40 -52 26 38 -19 -60 24 52
3421 52 -47 -43 33 57 -31 -61 53 48 -43 -44 55 54 -68 -45 83 33 -78 -38 87 31 -95 -11 98 -4 -108 16 104
3448 104 -28 -110 30 99 -48 -114 53 96 -78 -101 75 92 -102 -74 84 50 -91 -63 110 35 -120 -13 104
3471 104 10 -101 -3 128 -25 -100 42 78 -13 -97 38 98 -76 -62 47 66 -37 -97 81 54 -95 -31 28 56 -69
3496 -69 -79 101 0 -52 -26 50 75 -112 -23 97 -22 -43 -39 91 42 -144 54 77 -14 -57 -32 141 -43 -121 93
3521 93 59 0 -116 30 164 -133 -63 89 45 -36 -134 131 73 -189 28 81 38 -105 -88 229 -68 -144 92 60
3545 60 26 -177 70 200 -196 -42 94 63 -49 -167 223 50 -210 66 77 64 -152 -39 277 -130 -103 122
3567A22o4m7k17L57Mm02K75N3k7j54k9M09l58j30L26p0l5j97K47J70m73K14J67
3590A41j30n3j27M19k07k95M00q2p3j12J03K83m58R6L04k24j7j09L19n5m22M25
3612A26j5j81PjL37m13o0M40k47n8m6K18P2m98L71J65l12L3jL04k92k23N31k04
3636E3j66N5J15J70m95K23L40m08K9M5K26j42l76N44o7l30J58O3J85m29M6M90
3658C29m11p2J52J31m1m16M49J23m48J48J04J50l14j32N75k97k45K36R9K2m38
3679b96K96L41n25O5J87J12k11k63N79j40m23K67J19M7l85R7N03m71r9K61R0j17
3701C4l51M54J11n04J93J64M5k67j05N43k96k61K86O9j7l56K42L32m87M3K11M9
3723A32j56k30M51m8l76K16R8L5k74L0M03l35j12K23K7k3k83K89J27l55J26P6
$$ plain form
3567 122 58 11 -206 151 155 -247 28 81 54 -100 -129 280 -78 -208 118 48 13 -184 63 233 -240 -26 141
3590 141 11 -42 -169 250 43 -252 148 66 -7 -119 -16 267 -191 -95 209 -15 -32 -141 178 123 -299 126
3612 126 111 -70 -63 -64 273 -140 -200 240 -7 -65 -111 107 179 -319 52 217 -95 -62 -63 241 -51 -274 257 53
3636 53 -113 -58 57 227 -268 -45 295 -113 -84 -39 187 45 -331 213 146 -184 -26 37 222 -207 -161 329
3658 329 -82 -154 -2 129 88 -328 121 244 -204 -56 48 198 -116 -248 327 30 -215 21 120 142 -296
3679 -296 0 341 -184 -119 68 180 -31 -294 285 145 -278 -11 108 155 -230 -133 370 -101 -200 61 151 34
3701 34 -317 137 248 -256 -63 101 146 -121 -226 317 21 -240 46 115 98 -258 -16 316 -171 -128 83 132
3723 132 -24 -254 197 149 -227 -11 87 122 -152 -122 281 -54 -166 57 84 61 -222 67 194 -161 -35 41
3745D1L5j12j25L38j44j85J68KO0j88P7J95k43M6P6j9K1j54J78kj61J33l1K5m8
3770a7n4J67j40JR1r0Q0p9M1M0j20J13k8m8O3n4O8o8lJ11j26L6L0mJ7j03J19P
3798E0j16P3OK7p0l5J56q2p5P0L2kj10P1J01j42nN3O0o2j02J47K1j30J5P7M4j27
3826e5j9J54m0j16L7J03nj59P0J31q9r0N8J19r5j15J26Q6j20p6J13J00j44p8J62
3851E8L6j42l5J54K3j82PJ70k6j58J8J76n3j73Q8J49q9j44J09J38j24j38J52R9
3875A13j39q8J53P7j66o6J90K0j71j1J71J0j96M8J58o0j38N3J48o5j53R5J18j08
3899gr0R0R8j07q7J32L4j02m2R3O7j33k2J31nr7rR8Kr5K5O3j7n4JP4j2p6L3M2
3929B8mn7kQ7k5o7K0M7Rq1J4P9k8o4NR1j6j12N0Q9m3p7K2J01n9r3Q6Q0q3q9R2
$$ plain form
3745 41 76 -36 -161 177 33 -152 16 18 78 -110 -33 162 -81 -35 41 22 43 -111 67 65 -96 37 6 31 -17
3770 -17 -71 96 -44 -43 48 -42 38 -41 0 40 -80 33 5 -43 20 -34 34 -34 -37 74 -52 -16 14 10 27 -76 43 50
3798 50 -66 7 13 40 -30 -65 91 9 -66 4 36 34 -76 -5 96 -46 -51 2 62 0 -102 45 66 -64 -49 28 72 -55
3826 -55 -74 80 40 -76 -39 64 59 -100 -30 101 12 -78 -20 99 4 -111 15 101 -19 -95 18 118 -26 -104 58
3851 58 94 -48 -83 71 94 -88 -81 89 63 -95 -77 99 46 -127 -39 110 21 -123 -14 124 0 -138 14 113
3875 113 -26 -114 39 116 -50 -116 74 94 -77 -88 83 93 -103 -55 103 43 -95 -42 106 41 -112 -17 101 -7
3899 -7 -97 -7 91 -16 -103 29 63 -39 -81 12 79 -54 -76 55 50 -47 -56 42 44 -51 -26 37 20 -34 -33 41 29 -47 -14 28
3929 28 24 -33 -35 52 27 -40 -20 27 36 -45 -31 48 20 -44 -39 52 36 -76 -26 63 20 -57 -35 66 7 -86 0 80 -3 -92 0
3960@R3j23n3J24M9j22n8J47L7j53j3J42lj30J2J37l0j32L6J33o0j22O3J11p8
3985Gj08J00J06j17q5J05P9j11p6J27N8j35k3J01M9j21k5J31kj16J0J03Lj28L0
4010c8J21n7q1J9R3j2j38P5R2n7p7J3J36p6r8R2N8n5q4O3J15j35n0J12K6p8p8
4037i9J39M6j69K4J09Qj06m0J84n9j45J01P9k3j52P0J65j58n6R8O2p6j23J75M8
4062A02j68J0R0M5j30m6J91p3j01O4N0J3j36P4J15j51PN6K9l8j02J64k0j13Q6
4087A8mJ2o5K0J01j30J8O6l6Jm6R6k8j14J46k9o6K0K6P7j61L3J54j30m8N0R8m5
4115C4j91K14M2j89K0J06R1k12m5K93j36j53Q5J58l7k78J97K09k66q8J74J59k47
4138f0j60L75k2k83M5K26L4l61Q4L83k47k16J67K30j69l21L67J60l63m7K48J43
$$ plain form
3960 0 93 -30 -83 41 90 -32 -90 57 94 -59 -72 70 67 -63 -51 86 56 -76 -40 93 33 -89 -26 85 7
3985 7 -101 -1 105 -12 -97 8 87 -24 -100 27 85 -50 -73 28 77 -44 -69 62 60 -56 -46 57 60 -68 -38
4010 -38 83 26 -55 -36 57 45 -93 -18 74 17 -60 -47 89 13 -85 7 65 10 -74 -11 104 -31 -81 31 57 -21 -99
4037 -99 40 86 -83 -59 50 58 -48 -88 96 37 -108 -7 72 49 -103 -33 132 -26 -82 16 78 2 -121 54 102
4062 102 -66 -56 34 79 -51 -97 94 21 -80 -16 34 47 -89 -15 100 -51 -44 12 41 3 -99 65 45 -68 18
4087 18 14 26 -39 -19 82 -48 -30 36 0 1 -45 51 23 -91 55 26 -40 -20 6 83 -78 -45 109 -21 -69 -19 79 34
4115 34 -157 57 99 -90 -70 36 127 -85 -130 163 27 -126 -41 117 80 -198 -1 208 -58 -146 28 187 -60
4138 -60 -220 155 133 -150 -105 121 155 -206 -122 261 14 -202 -35 195 26 -295 72 232 -131 -178 70 213
4160B13l58p9M48j04l43J31K65n4l88K25L12l20j49K26J92k55k37M24N4l64K5
4181a36K61N2l82N3M10k24k38J71K14j30l21L08J91l48m0K24R9k77q4L89j01k73
4203a82J25J91n0k85J71K49k81q8J86J03j65j54K97Rk67R9J29ok10O5K60k15j12
4226a31J63P3q8j75K20O2k57Q1J35k6j39j8K51j32j66J80N0q6j16J36J15k40M6
4249f2J52m7j02k0J95p6j90J77N9r8p1R0J25k03j7J80o4q4k0J61pk15J33J04j10
4274a0o2N4J23j40p3J87l4j02lJ05M6j94O7J34j04n7M8J04q0j26J70K0j27RQ1
4299C6M5j42%J54q2p3M1Q3k2j34J02P3j10j6N6O0j06l7J20j7q0J4O7Qj04L7R5
4326F8q1m0M4N4m5o4Q1M1q7RL0L5p1k0R5l3m5J9L4Rp8M0N2m7k3K1L6k7m9O0J8
$$ plain form
4160 213 -145 -224 224 120 -223 -92 173 119 -269 -44 268 -52 -201 25 217 -38 -275 149 203 -161 -136
4181 -136 125 177 -205 -152 258 34 -204 -33 181 51 -270 38 229 -119 -159 65 164 -113 -197 192 91 -182
4203 -182 -57 134 84 -201 -30 219 -62 -150 36 139 -26 -180 117 126 -141 -42 87 81 -129 -64 196 -19 -131
4226 -131 32 105 17 -158 62 124 -133 -52 83 57 -82 -100 151 19 -147 33 83 -3 -119 17 132 -108 -62
4249 -62 90 43 -59 -79 116 40 -150 27 86 -12 -83 7 132 -71 -88 92 28 -56 -76 85 78 -137 -4 100 -10
4274 -10 -72 -18 105 -35 -108 79 45 -57 -60 45 91 -103 -36 98 -6 -63 -15 89 9 -117 53 73 -54 -45 36
4299 36 81 -61 -61 93 11 -62 -21 62 40 -94 8 81 -29 -45 11 71 -35 -72 48 31 -49 -35 32 40 -64 -27 68
4326 68 -13 -53 -9 45 0 -64 17 58 -29 -20 10 45 -26 -46 49 16 -29 -10 24 33 -45 -5 47 0 -23 -2 34 7 -42 18 36
4357C6n1OJ0J9l4j8L8Pk7pJ9K7m0JK6Jk0kK5J0k7jK7k2mrL2j1k8J4J6mk2NM2k5
4393Ij9MJ3Jk5LK7k2KQ%Nj7J2Rk0llL4j9k3K5J6j4j5JL6k7j8L3Prl2J6M2m6rK8
4431A0K7l7l8O7Ln1lM1K3o9j6Q4j7p1K5N8lp8K6P5m9n0L7O2n4o8P7N1q6l6O7N5
4463F2r2l3J16Mr4JR1lj23M5R9m5q4L1R9n2j04Q4P2p2p2Q0P2j11m3R5K8p9l3R9
4493C8J6j04NR2Kr8%J13l7r2L3R1l1r7N6Q8o3o9N3P6o7p3Q3M7p4m1O0P0r8m3R7
4524C3J0o5l9Q6L1j05QQ8j9o7j0J11k8j07O0N8k1q3J9J23q4p1Q2M8m6q8R5N7j22
4553d6PO7K7o7o0J28j5r6L0N7Kq7K0J04p1n2N1L7k0q3Q5L5r3J7J2M6m8m8J05k9
4583A5m6L4oL1n5J6N7q6K6J7k1K8m6O5m2j3P6p0OJ0J3J1r3R7K5j09M4J9M6p8m6
$$ plain form
4357 36 -15 -9 1 20 -14 -32 6 13 -14 -21 -2 25 -15 -14 12 13 -7 -9 16 26 -1 -2 25 3 -1 -10 22 11 -17 -3 13 9 -13 -8 34 9
4393 9 -10 -6 7 8 -17 -14 13 -9 -7 1 1 6 -11 1 10 -10 -13 -16 18 -1 -24 1 17 3 -12 -11 25 -2 -20 13 20 11 -21 -5 37 -9 -18 10
4431 10 37 0 -38 29 32 -19 -22 19 42 -27 -43 41 24 -47 -22 36 33 -45 -19 56 7 -43 -6 56 2 -66 11 62 -24 -60 7 62
4463 62 -30 -63 53 57 -37 -36 55 52 -71 -26 73 28 -56 -25 74 22 -82 2 74 2 -70 10 82 -29 -72 23 51 -28 -61 38
4493 38 54 -50 -45 47 49 -49 -49 64 27 -65 -32 59 28 -69 -13 75 12 -57 -4 72 5 -68 15 62 -12 -53 7 77 -21 -64 33
4524 33 43 -22 -61 25 56 -49 -41 47 28 -39 -49 62 34 -73 -13 45 24 -59 -40 83 -1 -72 10 58 12 -76 19 76 -46
4553 -46 -39 28 55 -12 -72 56 41 -55 -25 32 34 -53 -33 71 0 -52 -1 36 16 -67 18 53 -40 -23 -11 35 -13 -61 44 15
4583 15 -31 3 -3 28 -27 -11 46 -40 -14 3 -18 10 -36 29 -13 -26 50 -20 -14 -4 9 20 -73 24 49 -60 -16 3 49 -29 -75
4614g5J59o1r2O5N7Lj57P4J42j61l8R0R1j03j34K24K0j89K6J12O3k33J6K75j52
4639B2j51R6J46n4k48J99J81k65n8J62J35k18j45L44k6k55M9J90L1l20J04L04
4661B23k20j55J25J88j32k62L00J18k77l2J77J22k69p8L59j03k16O5J93j2l13
4682a99J68K40k41q7J12J75j73k03L23Qk31L1J29P6k53K2K72j71r9P9J13l6k32
4705a77K23R0k35M9Q0O0j41n4K47j34j01J14K5Jj69J37J00k09M9Q7ko7o7K04q7
4730B3j33J49J4n1q6Q0J28k20L3J50o3p1l3J82n7j95J96M9j06p9Q7J57k21m1K29
4755A21o3j17k0J76Ok71J56J46j49q0O6J86j88j44K64Mj63l3J63Q5k85N3K32j12
4779C3j39M3K03r0k42K13J14j61r9J30J49k12q5K65m7j40k8J80L6k58Q9J84j12
$$ plain form
4614 -75 84 23 -69 -4 53 56 -101 -27 115 -46 -84 6 97 -6 -140 84 104 -85 -59 53 116 -117 -101 174 22
4639 22 -129 -33 113 59 -189 10 191 -74 -132 30 165 -53 -198 146 120 -135 -86 104 135 -185 -81 223
4661 223 3 -152 -27 161 29 -233 67 185 -92 -124 53 175 -94 -172 187 84 -132 -67 126 114 -199
4682 -199 -31 209 -32 -119 -7 168 -5 -208 115 123 -108 -77 52 128 -125 -103 169 -2 -101 -22 91 55 -177
4705 -177 46 136 -99 -50 30 90 -51 -105 142 8 -93 21 46 47 -122 15 115 -94 -45 42 40 -27 -94 110 23
4730 23 -110 39 53 2 -84 -4 124 -96 -63 87 24 -47 -80 102 45 -150 46 95 -11 -90 -3 154 -67 -108 121
4755 121 58 -59 -79 97 103 -168 -12 134 -15 -95 -29 157 -31 -175 89 93 -70 -103 60 145 -140 -87 145 33
4779 33 -106 -63 140 50 -192 21 135 -26 -125 5 154 -58 -143 122 75 -65 -93 87 123 -135 -46 138 26
4802B6j01K9J84j11j70K00M3j24o6J20J05k04j0J62m2r3oJ33j3j70R5R4p6n9L3
4827b1J17r1j00J38J2n9n0Q5N8j27J4O9j7m5j9P3qq5O7L1k9k7qO6n3k8M6j9J1
4856Ak5K2K1m7J9J6j3%j2L1Pm3L3j6J5Qm3K8j0J9Jl1M2j5k6J8J5Nm2LM6m1LJ2
4890AJ2j2l0L1K4n0RJ9Pk2j7M2Jm0J0K0Qm4RN8l9k0J6K7km8M1L1n7JK2J5k0l0
4924b7N7nl7J2K3Nm2mM9k6j7MJ8J0m7K5J8k7kJ3J7j9k9N1mk6nJ5K6l9NL5k2k4
4958a9OK1Ll2J3L0k3j3J4J7pl6K7Npj6J5J7k2j9L6j1Jk0J6J7l2NJ5Ql1OM0k5j8
4993a9K4%Kk5J7K6l1nJ4%Kk4K5Lj5KJ0Nl0lM9l2rJ1%J1m5L3J7l5K%K9j6k6N0j0
5030Gk2KPL4n9J2L5k0j0j0M5mn8N9Ok5qoN1m7k3O4l2oj1K0M0r1M5L5m3Lj8O1k3
$$ plain form
4802 26 -75 -46 138 27 -143 57 100 -24 -90 30 135 -69 -79 83 41 -52 -58 75 62 -108 -13 81 5 -54 -21
4827 -21 96 5 -95 43 55 -4 -54 31 89 -38 -24 45 28 -17 -36 37 29 -56 11 42 13 -14 -22 44 -9 -37 9 -10 1
4856 1 -24 -2 19 -28 -9 7 -6 -6 -18 13 20 -23 10 -6 9 17 -26 2 -8 11 12 -19 23 8 -18 0 15 20 -22 -19 27 -14 -11 1
4890 1 13 1 -29 2 26 -24 -15 4 11 -11 -28 14 15 -25 -15 5 13 -31 -22 36 -3 -23 -7 20 18 -30 11 42 -15 -14 8 23 3 -27
4924 -27 30 25 -12 0 23 28 -14 -18 31 5 -12 -8 10 20 -27 -2 16 -11 -13 0 17 -2 -31 20 16 -10 -15 0 26 -13 -8 27 5 -19
4958 -19 -13 8 11 -21 -8 22 -1 -14 0 17 10 -26 1 6 -1 -17 -2 15 -7 -26 10 -1 0 -20 -4 13 -19 -14 1 9 -22 -16 24 -1 -19
4993 -19 5 5 7 -18 -1 25 -6 -11 3 3 5 -19 6 9 -6 -4 6 11 -19 -22 27 -5 -14 -3 -3 8 -37 -4 13 -22 -20 -20 9 -7 -33 17 7
5030 7 -15 -13 -6 28 -31 -19 16 -4 -14 -24 21 17 -41 18 24 -1 -9 -15 36 -11 -34 30 -2 -8 -19 1 41 -50 -5 30 -13 -10 -28 33 10
5065A0o2Q7j0m1%J2N9r7J8P1n9npN4rj00J05J5o5M%O5p3k2J24o2l5JL7L8j32O9
5097a0P8r8Q%P3n6q4J58l8p7J2N6N0j50M6J29j23l3L2Q4k2j52J64L1j33K8L4Q4
5125I1j35m8K08r1r1M7O5K4k02J21J25j66kN3R1j01j26K36m5j36M2P2N7k07N2
5150f6J99j66m1O3R0m2k01K19N1j94L8O9P6j75m1K66j32j19R3O9J1k11J41J50
5174A47k19J4P8N8r8j11K49o0j76J13M2M5j98M8K29k18l4J24K3n3j57K28L2k33
5198a27J05O4J8j31l0K60j71j04J43K0j0j66J54J14k60P9R3Qj00p2K48r6j83J78
5222C4K7m0j22Q0J71k30j3J70m6m7j06K08jk36J51O4m2r2LK28k00p7J84l0n0r4
5248a06J39R0k56J04J15p2n9l5K18j15j68J93Nn8q0Q4J38k39K5J63p8l7o0J72
$$ plain form
5065 10 -52 35 25 -16 -16 -4 55 -42 -24 47 -12 -17 -24 30 21 -79 26 41 -24 -20 -20 45 -28 -50 74 12 -23 -22 15 53 -79 -10
5097 -10 68 -30 -22 -22 51 -5 -89 69 31 -46 -34 22 72 -78 -32 97 -26 -59 -27 57 35 -117 47 78 -55 -27 7 91
5125 91 -44 -92 116 25 -66 -19 46 70 -132 -11 114 -52 -54 -1 90 -11 -137 99 54 -82 -40 32 89 -118 -66
5150 -66 133 -33 -74 -11 79 37 -164 55 106 -88 -50 19 95 -80 -121 145 13 -106 -13 56 67 -144 -3 147
5174 147 -72 -58 20 78 -20 -131 118 58 -118 -5 37 82 -116 -68 161 -57 -91 33 56 3 -154 74 106 -127
5198 -127 -22 42 60 -71 -101 159 -12 -116 27 47 37 -129 25 139 -121 -42 51 59 -41 -113 135 39 -144 34
5222 34 61 21 -101 -21 150 -80 -93 77 31 -16 -122 86 85 -151 0 64 22 -70 -67 161 -39 -116 68 38 -12 -106
5248 -106 33 123 -133 -29 86 14 -45 -80 138 23 -145 48 53 -5 -85 -1 137 -102 -77 86 8 -29 -89 83
5272H3j3k10J54N5q5l5J0J50j57n5J86o1n1l0R0N8j94R7Q1r3rj3J26q3r9J56k7
5299C1o0oK9Q2j40K5J07r1Oj7O0jj23J31Pq1K9JO0q8rJ14r4oL2QK4r6Q2K9r8O2
5331ILJ4m3k3J10p4m2O7%lo3M5P1j25L5M6j0k4m5J10l0q4O3J7k4m3K2Q7j04qP3
5362B7lk3m8Q2J2j05M7N6k8m7nQ6n1o0Q8kk8l3L8N8j05J9O1k2l6j6O4kp2M7J6
5393A5j0l6PO6n3l4N6kjl9L9K2n8LL5oj1k5M1jl3K7J2nk1kL8j5k4K3qNj9J7J4
5428A7k9jJ4kMl2L2J0l8J8j1J9pk0L2Mj4KnL0l3j5K0JJ3l0K6J3m2K4J1lj4k4M7
5463A7nm1L1LNk6RK9k5pJ2Ljl1L4J0m1K0J5onk0M0j2l5L0J3j2k1RL7l2%KMkk5
5500b4L0oj7J3oJ7j2nL2l5PLjJ2j7J9Ml8L1j1Lj3NJ4j7jK6k0Oj8K9J2m5L7nj4
$$ plain form
5272 83 70 -140 14 69 -16 -51 -41 109 -48 -103 83 22 -29 -59 31 89 -105 -8 73 -20 -29 -42 84 1 -98 58 31
5299 31 -29 -35 -6 76 -64 -39 68 -23 -17 -34 26 25 -98 33 40 -41 -12 -11 49 -39 -48 66 -28 -34 -2 6 30 -66 16 45 -53 9
5331 9 12 26 -17 -40 70 -4 -46 21 21 18 -45 0 71 -54 -19 27 17 -7 -52 58 28 -56 7 24 0 -43 -21 66 -38 -46 27
5362 27 24 1 -47 35 47 -58 -11 45 17 -30 -35 51 0 -60 28 26 -2 -35 3 61 -44 -25 36 14 -22 -38 26 24 -48 -1 15
5393 15 5 -31 -24 42 -11 -45 11 9 8 -31 8 30 -28 -25 10 4 -7 -32 9 8 -25 2 14 9 -12 -14 24 9 -15 8 0 5 -14 3 17
5428 17 -12 -13 1 -1 3 -29 3 13 -25 -7 -18 1 -6 -26 6 10 -4 -2 -7 23 -10 -25 -5 -4 9 -21 5 18 -24 0 11 8 -6 -30 17
5463 17 12 -29 2 5 10 -16 -7 22 -3 -10 2 5 4 -27 7 17 -24 -4 11 5 0 -20 20 8 -27 3 16 4 -17 -8 29 -3 -3 -1 3 1 -24
5500 -24 6 0 -17 -4 -10 7 -5 -10 22 -13 -6 -3 -4 8 -9 10 14 -24 7 -4 -1 -14 -9 5 -12 -13 13 -7 -1 -19 10 22 -23 14 9 -5
5536eQk1L7j9k1M8l6Rj2J1K8o5M0J5k3Mj5L7j6m8P2l4j1N%M5o8J0M5m2J0qK2J6
5570A8o8O6J3n3LPM7n1l3R2l1j0k0K0M4j13O3N5o3J4j8N2k8p8J15k8l8JKP4r8
5601d4PQ5o4LqM4J5j13Q5K3o9L1k9Q6p2m1J30p5j9RJ9N1j20O9N6p9J1j8P8m4r1
5632h4J32l4o3M4kO8j14J7J15j20J1K7K2Qj22J30Mr7N1PO2j01l1J68j21k1M9J7
5660B2J7j30R2Q0j51O1J3N3o3r8J91p4j00J09j4M0j32N6J52j89K1P2Nk1j28J83
5686F7lj69J18QK8j14mJ91j56m7J06Onj35J24J01k15P3O1%n1q8K16q5j26J23k
5713B2J8j22N3J59k14K2J07j8j6j31J82Jj73J21J7Mp8j8J86j59n1J35l9J2j15
5738i5J07Q7k04R7N1l3k2o3J70p4j22J44j7rn2RJ34j82L6J00o3Jo8J15Lj57J34
$$ plain form
5536 -5 3 -18 19 0 -21 27 -9 0 -12 -1 27 -38 2 17 -6 -2 -17 20 4 -44 28 -6 -17 -12 -12 33 -35 -25 20 -22 -12 -20 2 18
5570 18 -50 16 29 -24 -21 -14 33 -18 -51 41 10 0 -20 0 44 -69 -6 49 -14 0 -18 34 6 -72 43 15 -23 -22 -20 54 -44
5601 -44 -37 48 -16 -13 -21 23 38 -75 10 33 -36 -5 -34 52 -20 -61 69 -6 -25 -16 3 54 -66 3 59 -20 -9 -27 51 7 -84
5632 -84 48 14 -49 -5 -7 61 -53 -36 79 -41 -30 -3 19 27 -95 35 39 -58 -7 0 62 -39 -70 98 -23 -44 5 22
5660 22 39 -91 1 81 -70 -9 4 57 -6 -104 87 13 -87 22 8 48 -84 -28 124 -65 -44 28 33 12 -116 67
5686 67 64 -105 13 21 49 -65 -69 122 -34 -81 25 31 26 -109 15 116 -99 -26 35 35 -16 -104 112 27 -99 24 22
5713 22 40 -82 -29 130 -84 -62 45 27 11 -120 62 63 -110 11 28 32 -46 -64 122 -37 -88 47 8 20 -95
5738 -95 12 99 -105 -8 43 10 -12 -75 95 21 -101 43 26 17 -35 -26 108 -74 -38 62 -1 0 -68 47 50 -107 27
5765B7kl2j8k2J52j47j6J34q9J3m8N2P1j66J06L5p5K4l6J05o4q6J59p4j5QkQ7
5793H1j51O0Q0r9L0j9M5%j16J36k2n4K3nO1q3j9J28j06J0QK4L2j26J05K7j06O1
5821Ek1N6n1n7J46p7l6N2qL8j02N2P8j09J9K1J2oq8J12%p9M0qM9p3KR0p5j0L2
5852DmK5q3P1L1p6L3j6K8mn5P6k0l3K1kL8m8oO4o4K4lj4N1o7L0J5l8M5n0L9J1
5885B3m4M1l4J3Rl5M6l4jJ6j0L1l0jL5l9J3rML1n3K8J1j8Rj1L5k2l7N6mk9j6K8
5919BL1n6oN6j9k1KK8Kn4K7L5m0qJN1l3m0N4J2l7j2K4K9o2J0N3k1k8KL9Ln5L6
5953EJ8k0j8%N3l3l2L6Qk1j5J2L9n0mM1j3k0j2K8J5l5J9M%j0j4L7k7j0J6J3jk4
5987a5MK4j6OpKJ0l0K9Rpj1mJ8Jl3K7Mj2pqM4l1j7K7l%m5L8K7m8J0J3J3j4l0N9
$$ plain form
5765 27 25 -7 -25 -47 105 -42 -58 76 -13 0 -48 4 75 -91 15 50 -25 -1 -37 68 4 -82 77 3 -12 -4 -6 81
5793 81 -70 -10 70 -29 1 -18 27 27 -89 47 25 -29 -6 -11 50 -33 -52 76 -30 -20 -12 12 44 -82 23 50 -56 5
5821 5 -16 40 -11 -68 78 1 -35 17 9 47 -55 -3 75 -34 -15 6 18 12 -76 36 36 -43 -3 -11 38 -35 -33 57 -18 -28 4
5852 4 0 25 -58 13 44 -32 1 -15 13 9 -46 30 10 -23 -2 -4 34 -14 -20 44 -20 4 1 -13 38 -29 1 16 -22 23 -27 12 23
5885 23 -21 20 -14 -1 8 -27 19 -15 -16 0 -10 21 -9 -10 25 -14 -1 -10 -6 25 -28 0 11 -7 2 -9 26 4 -33 23 19 -10 -26 2
5919 2 33 -23 -29 27 8 -13 -11 17 19 -35 -8 27 -13 -21 -20 31 -2 -42 12 24 -13 -25 -1 28 -34 -24 29 8 -20 -18 21 24 -31 5
5953 5 23 3 -15 -15 38 5 -27 9 17 -4 -19 -7 32 -18 -22 19 6 -14 -26 2 17 -18 1 5 5 -5 -19 18 -9 -19 -3 10 9 -15
5987 -15 -11 13 -3 3 -4 -2 8 -22 7 16 9 -2 -6 12 13 -20 7 11 -1 -8 -16 28 -3 -20 7 4 4 -41 -3 24 -24 -14 -1 12 -2 -32 27
6024B7qm0J4K0Pm1kO5l6k7K1J1On5M9K7n3rJ7M4l7o4R6k3l6NJ5M7p6LP4m6ojM3
6059C1j4p2O1L3n2j6J9O2p2k9P7k1j4k1M4K6q8L2N0l7j4qN7k6n5P2Ll5k5J1Q6
6090F5r3j3P2l2ll3N5K2r5O9Ok9J4l2P5n2l7P1k6kk7J6O1j02L9N6n9K7m7P1j0
6121B7p5R2l8oQl3P6q6RQ2p6L5m3M0K5j12J02j4m2L2l9Q1o6k3J03r0J6J2LN0j11
6152f1P2M0r0N5l0N7m3o8J29n7l2L9l1P3j12M2R1j18L5PK2J1j14J39j7q9O1j9
6180hN9q3k1J44j18qN1j0M0j28R8N3j41P3j0M1j9r4J66p3n9P3k1N8j25M3J14j44
6208d9L4L0KJ4j27J46rj10R2k8M7p0l1J55j18k5O3oL5j30R9P4j57P5kK2k1q9J72
6237H8p4q5J02l4M7r7K8J25j64M6L5k4M2j15J31j5j20J13l0L0m6l3J44j20j8Q7
$$ plain form
6024 27 19 -21 -7 13 20 -21 -23 42 6 -21 0 11 17 -38 11 38 -15 -24 -7 37 0 -64 32 9 -27 -22 -7 40 -36 -33 41 -5 -11 -12 31
6059 31 17 -55 6 39 -13 -29 -10 52 -20 -49 28 7 -7 -28 16 42 -46 -14 36 -1 -15 -23 34 8 -47 25 28 -7 -32 -21 65
6090 65 -28 -41 31 -1 -4 -37 18 40 -55 14 20 -9 5 -27 48 -4 -41 30 4 2 -25 -9 52 -50 -11 45 -14 13 -34 37 27
6121 27 -48 44 6 0 8 -25 51 -35 -26 56 -20 15 -28 12 37 -75 27 13 -29 3 -36 45 -21 -44 59 -31 -15 -3 0 50 -61
6152 -61 11 51 -39 16 -14 43 0 -68 61 4 -28 11 -20 53 -59 -17 74 -44 -9 -2 20 31 -83 56 39 -50 11 -8
6180 -8 51 -32 -53 91 -27 -35 16 6 46 -82 16 69 -72 1 -9 32 13 -81 85 12 -47 26 5 63 -62 -19 95 -49
6208 -49 -15 15 17 31 -96 50 41 -69 23 -5 42 -28 -59 96 -22 -47 16 10 45 -85 14 88 -69 6 4 26 5 -84 88
6237 88 14 -71 31 -3 44 -53 -25 100 -64 -18 17 -7 35 -80 51 36 -84 29 -1 29 -17 -50 94 -26 -44 43
6263D3o0M3j00Q9N1j45R5Rk7J2o6J27o2p1J14o2K6m6JJ04j31M3M7n2K8n9Q7j1
6291B7q8J03l6j2nl2J09j03jR3p7K6m1M6M6j30R1Mm4L4m4P9n8m5J12o4KpJ7M9
6321E1j16N2N7q4M2l0N6j7p7J02k5k9J3j0P9r8mQ2o7J6rJ3L3q7O9J6p7M9k4N6
6351C2l9m7J02n7kPlM2q0L8M6o1J8qK8ln1N8j4k8K8k4M4m2j5P3m8mJ7kK1n2L3
6384GJ2m8L1j0K2j2k7M6k1j8K1j9L7m2ML4m3L2qjK0l5L1mk0K1k2J7%j9L3k3rJ7
6418Dk3L2j4qJ7k7K9j6OLj7K1orK1j7J2rj0J2j0J0Qk0L2k9QPj6L3k1nk%J2j1n
6455hK2k3RMJ%j9J3Oj9K2j4OPk1K2j0oJ6j8J4nqJ0j3J3j5OJ6npRNKj5KJ4k6J3
6494@nJ1j6jJ6mrN%Pj7LJ9j0okJ0pqK1Mj8KkRj5rM8k7qNQJ1m0J7K6j7JrK5j3k7
$$ plain form
6263 43 -17 26 -74 15 66 -79 16 25 -2 10 -56 71 9 -62 52 -10 16 -30 -29 75 -56 -13 34 -18 10 -49 38 27
6291 27 -61 42 6 -6 -11 -43 66 -37 -38 55 -22 4 -37 9 55 -75 16 20 -24 10 -34 45 -13 -58 54 -10 -8 -15 2 51
6321 51 -65 -13 44 -40 2 -28 28 11 -66 36 11 -18 -5 -15 64 -34 -38 44 -23 -7 -16 -3 30 -57 12 28 -49 0 -24 32
6351 32 -7 -54 48 -9 -11 -4 -7 35 -45 -7 39 -22 -4 -12 16 13 -38 20 6 -22 6 -18 26 -16 -31 42 -6 -10 7 5 26 -26 7
6384 7 19 -29 2 -8 14 2 -25 21 0 -18 3 -16 21 -21 -17 17 -26 6 -2 -3 17 -18 13 9 -11 10 -12 5 5 -14 19 -4 -13 4
6418 4 -19 13 -1 -9 8 -19 10 -6 0 3 -14 7 1 -8 13 -4 8 -1 -11 1 -9 1 9 -11 21 -8 0 7 -9 24 3 -2 -4 -4 8 -3 -8
6455 -8 14 -9 0 4 5 5 -14 -1 5 -14 8 -6 0 7 -14 8 -2 -8 8 -10 4 -1 -9 1 -12 1 -14 -8 8 3 -4 5 10 12 -3 -1 13 -13 0
6494 0 -5 6 -10 -11 5 1 -8 -3 -3 4 -13 -10 9 -1 -7 -9 1 -6 -14 7 11 -7 -5 -7 2 -13 -22 26 -1 -9 -4 4 15 -25 -8 18 1 2 -7 18 5 -22
6536b2M0qj5LjK0k6jK4j7loK3rk7K2PJj5rM0k8rK6j2Mj8J0K4n0J9J1OQk9L4j6
6573Ak7K9jlKqK7l5J4LoJ6j9J3J5l7K8j3Kkk3L0j5jL1l5K6k2RK3m6L7j5j0K8k4
6609hK7l5OL8l9J4Pk1K7m3L7jl0L1qJ8j0l6M7k1j1K3j5K9o1L4M0o0J7POkn2P6
6643C1j2m6L2j5K9m0pQ8p0jJ7%L7r0N6L7p8K3kL0j7o1J11m3l9K5NL6q4K1Q2q3
6675b8J5KK9J2j04J01J1p5K5KO0p6k2R8n4j4QJ1M8j04M5O2q2K9j3M6j3q2R9k1
6705A5m7L3j7P2r2lR6q1K0oJ7K1r2Q1J7o8K5pM7m1l8J03n7j7J4LM5q9L9N7p5K8
6737Cj0K7Kp7J04l6m5N0l7N6n9J0O1q2K2J6pK5p5P4%o7N9k2J9k0k9R0p1j1N7m7
6769b0L2n0L8L9q8N7Jj0J1n3R1l9l8N5k9K7m7J4O4r1K7K5k2J6n6P7qo9P4k7Ok8
$$ plain form
6536 -22 18 10 -5 -2 -3 17 -9 -10 14 -3 -6 -12 11 2 -25 -3 4 5 -10 -19 21 -7 -16 10 -2 2 -16 -6 18 -32 -13 -2 4 12 -17 17 1
6573 1 -26 3 2 -1 1 -7 20 -15 -1 2 -4 12 -7 6 21 -16 12 -1 1 -1 -24 6 -9 -10 21 -14 12 -10 -1 22 -24 13 -2 -12 16 -8
6609 -8 19 -16 -10 28 -11 3 10 -11 16 -27 10 9 -21 10 2 20 10 -26 21 0 -11 12 -3 26 -35 -1 39 -21 -4 3 9 7 -45 31
6643 31 19 -27 5 -10 19 -21 -28 60 -10 -11 6 6 43 -47 9 46 -32 -9 -11 19 2 -59 52 9 -30 -5 0 36 -48 -27 55 -28
6675 -28 -13 -11 18 30 -74 27 38 -37 -12 -10 50 -26 -48 50 -4 -18 -10 1 49 -55 -10 52 -30 -1 -14 32 19 -63 36 15
6705 15 -32 1 -16 56 -36 -39 57 -24 -4 -10 7 28 -64 17 34 -34 -9 -16 31 -10 -48 55 -2 -19 -5 -2 43 -46 -7 50 -25 3
6737 3 -7 20 22 -55 49 13 -32 18 -19 37 -22 -12 49 -33 -11 5 -2 23 -52 22 22 -45 14 -8 11 -9 -38 52 -19 -30 27 -20
6769 -20 12 -38 0 39 -49 8 9 -1 10 -43 48 9 -29 26 -3 24 -23 -9 55 -36 -9 16 -6 10 -46 31 23 -46 28 1 7 -21
6801b1qQ7p8j7P3m1J8m4M6K4r6O6Qk5Kl4Q5l7n2P0k0j3qlO6p6J8L9l2Nm1O1mo4
6835d6O7j0qqj8N6n6nN9l3Lj0J3K0n8L5J9k9J3k6N5m0j5N0l2%jkL0m5J1L0j6L
6869Fk6K6Qn1N6j7j5J3j4K8k5oL5k9J3k3K3Ol2L3%j9Rj4K0lj9L5k8RRj4K4l3Q
6904gJ6l0K5oNJk2K5j2j1J2rJ9j5JK0j8QLj2Rj9J9lj7K0Nnj0J5J1l2JJ4nJ0j9
6941a3K5lj2MPj4RmJ1j0j8K4j2PmRkj4J8lj2MjkJ0j0J5Kj2NpK1k2%Rj5NlJ0Rj0
6982AjLJolJ8j0lMoPPj9Qkj0J5j0Qj3%K7j3qKlJ0k3K6krjPOk0j5L0rNL%K0k1L
7026DRnp%J8j0j1jJ0pj6K5jj8oK1JopJ0Pk1pK2MqkJ6j6j8K7Mj2j4J6K2l3LK2j0
7066ELj1K1j0k0J5MkmoRKj1QPok2J9J7l3J2NPj0j4L0pk2J2JJ6k2MK3k5mRMOj8
$$ plain form
6801 -21 -29 58 -20 -37 36 -5 13 -31 15 39 -57 9 17 -8 -6 -40 45 8 -44 26 6 -7 -15 -18 48 -28 -10 29 -3 2 -39 22 18 -46
6835 -46 21 11 3 -5 -23 33 -23 -28 31 -2 1 -9 4 24 -34 1 20 -9 4 -22 33 -7 -22 28 -4 -4 -5 -7 23 -22 -11 19 3 6
6869 6 -20 6 14 -37 19 2 -13 0 -14 14 -11 -17 18 -11 2 -21 2 8 -24 9 9 -10 -1 -15 5 2 -17 18 -10 -1 8 -6 18 -15 -7
6904 -7 9 -21 4 -2 3 4 -18 7 -5 -16 -4 -13 6 -9 -8 12 -6 2 5 -7 2 -17 2 -1 -18 2 7 2 -8 7 18 -14 -13 1 -4 6 -13
6941 -13 12 9 -3 1 8 -6 3 -1 10 0 -18 6 -6 1 -3 6 4 -10 8 5 -7 -3 -4 -6 4 -6 9 11 -1 4 -3 18 -4 -4 5 -10 -5 -8 2 11 1
6982 1 0 3 4 -2 -5 13 3 0 4 -2 5 12 -7 1 -1 -11 4 -6 2 -11 -11 16 3 -5 -3 -6 4 -19 7 5 -4 -5 2 8 -12 -27 3 -6 -1 2 2 22 1 4
7026 4 13 8 1 1 19 9 -2 -3 7 0 -16 9 8 -10 -16 5 6 0 -7 3 10 -11 -18 4 8 0 -2 14 -2 -20 7 11 -1 -15 1 23 -10 -7 15 5
7066 5 8 -3 18 8 -12 3 7 5 1 -5 4 6 -5 3 10 4 -18 1 18 -15 -3 2 9 -1 -15 15 8 -14 -2 -1 15 -7 -3 20 -5 -9 0 4 10 -8
7106hK0lj4J1kKqPJ2j8oK0rnj5NK3l9K9MqNk4L5j5j4K4p%j2J5K7n8J2J6j1J3j0
7144fM4j9n0M5nj3Lj2L7l3KK8k7J5k4K6J7n7L1MqomM6l3l8N1j6jj0QL0o7L4L1
7179B3k0Jk3M3j1m5N0j1Jj5oN3n2oL7k3J1j9K5K6o2K8J3k2Pk7N3j8l6N6k7Kl2
7212b6K3L1o1K4K3k4Pk4L9J2p1O5j6j1jqO1n9nN5m3J2lRK1p1N4Ok5J0k0M1l5k8
7246c8P3m1j0NJ1L3o4L0L4n7K3j5K7mn4Q5l4l4K3oL7m0qN8n2NOJ4J3o6N8K2o3
7279b9L7kK3l3k6P8n0k1K5LJ6o5M9K7o1K0PK0rp0J00k6l6K6oK9n7RP4p8J3K5j1
7312Ajm1N3J8n2K3lK3j8l4P8m9k1L3j6L2o1K0N8n7J6lJ6km8N3j0l2L4j1K8n1m
7345b8O0m4J2NqK2n1L8J9m4K2oPpj8N1l3j4K1mJ5l6K3K8m2J8pLJ3l0L8j7k7L9
$$ plain form
7106 -8 12 9 -5 6 4 6 -2 5 17 -1 -7 13 4 -1 -16 -11 12 -27 2 6 -2 3 -21 14 -1 -15 9 2 2 -10 5 32 -26 -14 2 -9 4 -6
7144 -6 38 19 -31 14 9 -4 -1 -13 24 -9 -7 21 -6 9 -15 11 28 -29 2 6 -2 -8 -12 34 1 -37 14 -2 -3 -13 -5 25 -42 -8 23
7179 23 3 4 -19 24 13 -32 18 7 8 -7 -13 40 -12 -18 19 -4 7 -12 13 39 -23 5 18 -4 3 -24 29 11 -25 31 4 6 -26
7212 -26 -3 28 -33 -9 14 -10 -3 -27 12 24 -47 18 2 -9 -10 -18 43 -16 -21 34 -9 3 0 9 30 -41 13 19 -6 4 -16 25 -10 -38
7246 -38 35 -6 -16 -11 0 33 -31 -1 33 -24 -1 -16 11 7 -47 38 4 -30 -7 -13 24 -16 -24 34 -18 -13 -7 7 20 -46 12 34 -29
7279 -29 8 6 29 -4 -30 48 -2 -23 2 5 21 -44 5 32 -29 -9 -2 18 9 -61 39 13 -23 3 -3 26 -31 -22 52 -26 -13 12 1
7312 1 0 -41 12 30 -22 1 -2 21 3 -31 47 -2 -23 10 -6 26 -35 -15 43 -14 2 -1 15 13 -35 18 8 -24 10 -1 27 -24 -28
7345 -28 32 -12 0 5 -3 19 -32 6 25 -19 3 -3 4 -3 -21 30 -3 -17 4 0 15 -21 2 30 -12 6 -1 2 15 -15 23 6 -21 18
7379A8k8J8j3j0K4l0J6J7k4J1j2J4J2l0K8j4nRj4K7l2J2K7l0K6j0qJ6l4K2J1j1
7411CLoJ9j8j1L6l1%NMNj8J4J3k0LqK4j5k7L7nqPqJ1Jk1J3oJ5j7NJ0j2J4Jk4J5
7450CrK1pj9K5oj1Mm%%lJ0pPj5J7Pk2J2LJrj2J3J0k6K6jnpKJ2j2PoNnj3J4J4k5
7492a1J5j1J0kj5J6Kj5RMqJLJ6k2mMOjmkJ2nQpJ3pj3K1j6mPJ4kj8JK2k4QJkOr
7535cJ0oK%j%kj0J3n%%QRk1jJ6j0%oKJ1j2J1lQpj0J4pnJ1okNKMj6OlMPj6J5oj4
7581a4J8pkJj6K9j3PopJ1llOj3K6j9%J5k3J8j3K0lk1J3J2j8NkJ1nj5K8l2J6j2
7618a1nK6k4J3J7k5J6j8J8jl5M3k1qK1k3K9k3lL4k9J1j6J7K5o0L4J0j7Mj2M2k7
7651Bk5M0j2jj2OL8o5OK9j2J3k7L5om3M4j6J0j4k5O5l7j7L8k0Lk9J8M2n9K6Rj2
$$ plain form
7379 18 -10 8 -5 -15 9 -21 -5 12 -12 -1 -13 1 13 -17 11 -3 -8 1 -13 14 -18 -6 21 -9 17 7 -1 15 -19 3 14 3
7411 3 6 0 19 1 -10 26 -5 -5 0 4 9 -9 5 18 -2 1 -7 17 2 -25 12 7 -1 6 -2 9 10 -11 2 -4 11 -6 -1 9 -3 11 12 -12 3
7450 3 -6 15 8 -11 14 8 -3 1 -3 -3 -3 -6 4 -3 4 -11 6 13 -9 3 6 7 -2 -14 -1 9 -17 9 8 3 -4 -2 10 -2 5 -1 4 -1 -14 0 14 -11
7492 -11 4 -7 3 1 -14 2 4 -11 -2 2 -6 -5 -2 14 -8 -12 -8 -2 -3 -7 -9 3 -2 6 -1 12 5 -8 13 -3 -7 0 14 12 -6 -5 17 -7 1 2 0 6 -3
7535 -3 7 1 3 3 2 2 0 -10 3 -2 -2 -2 6 15 -6 -7 9 -1 -1 -7 -5 6 -6 5 2 10 3 -7 7 0 -5 6 0 -2 3 5 9 -7 -1 -4 0 7 -9 6 0 -14
7581 -14 4 -3 -5 -4 -20 9 -4 3 -3 -10 1 -2 -5 1 -12 14 -5 -5 10 -13 5 -8 12 9 -12 1 13 -5 0 -2 9 4 -11 17 -15 1 -11
7618 -11 -16 10 -14 -1 16 -9 7 -11 7 6 -29 14 -7 -15 6 -17 12 -11 -14 20 -9 2 -14 3 28 -32 2 12 -5 -1 -13 29 2
7651 2 -23 17 5 4 -8 -2 36 -29 -23 6 -6 7 -20 15 9 -34 10 -6 4 -10 -35 30 -7 -24 14 -6 -3 -32 -14 28 -31 -5 4 -8
7685hKk4N5j6l6L7j1J1k3mN1n0%K7rJ2m3M2J2o3M2Pj1j2k6Q3m9l3N5j4J1l3RN2
7719D3o9K0J5pPm1M9nm4M1j1Jlk2N7l9RK4l1K0m2K8L0p3O4j2k3K5m6O0m1j3M4
7752A5k8J7k0kM6o5L6J8l1K7m5M0Om8O4l4Lnj4M7m9K2L1n2K2oQJ4m9N0pl1K5k8
7786b3M7l2j4N9n4J0Rj8L8o5M3J8l6K7k3L6j3m8O4k6oOj2M4n8J0N4n6J7mJ3J1
7818A8n3N1Km3L3k5M1l7k0N1l9PJ9j3L1n3J9K9m5L4j3K2pl6N3l3j3K6j9L1k8p
7850a7M5n6L0jj1K8n1N2pm1M9k5K0k0j5N7n0LJ0k2L5l7J7J4l2L3k4PJ6l4M8k5
7882dj4L3k7K9k4%K1m3K7J7j7J7k6K7Nl9L3k1J5j3j3L6k8mK9k5%k1K0K1l1K7j7
7915a0lJ1k7L7nj6K4k6QRpK6m1J5Rj4J9j5J3Pl2L9j4j1J8k2J6oj1K3k6J6opK7
$$ plain form
7685 -8 -6 -30 25 9 -27 10 -1 10 -13 -17 34 -16 -16 11 2 14 -29 13 25 -38 4 11 0 -12 -38 45 -4 -37 18 4 15 -18 -9 43
7719 43 -26 -6 9 2 9 -32 17 12 -32 9 -2 -1 -4 -26 31 -8 1 25 -6 14 -28 0 30 -43 21 9 -14 11 -35 25 -16 -29 15
7752 15 -13 4 -16 -18 28 -37 -1 17 -14 13 -32 8 14 -34 30 -4 -1 -6 -20 27 -22 0 31 -21 1 -5 3 17 -32 18 11 -20 5 -23
7786 -23 24 -8 -22 37 -17 -7 2 -16 22 -43 0 18 -18 9 -14 22 9 -39 25 -1 -7 -1 -13 31 -27 -17 37 -19 -2 -6 7 18
7818 18 -35 16 18 -25 8 -17 24 -13 -33 18 -21 -14 5 -8 23 -30 -11 18 -27 7 -6 16 9 -27 26 -7 -20 6 -13 18 -10 -17
7850 -17 28 -28 2 1 -10 18 -33 19 12 -29 20 -5 15 -5 -20 37 -13 -10 0 -22 13 -24 -7 7 -25 8 -16 -9 7 -27 21 -4
7882 -4 -18 15 -12 17 -7 -7 14 -29 -2 15 -2 15 -11 16 21 -18 15 -6 9 -4 -17 19 -9 -13 16 -9 -9 -30 -10 11 -20 7 -10
7915 -10 -13 -2 -29 8 3 -13 11 -15 -7 2 -5 21 -20 -5 4 -10 9 -6 7 14 -18 21 7 -4 14 -8 8 2 -9 14 -12 4 -2 -9 18
7950A8l4J0J4pnkJ0Ql8L4kooj3J7kj4K9j9J5j1QQk5J4Rj4J4k7K3Jk6J8lRkpJ9
7988A5j5%J0j0Jj0%MqJ7qj5J7oJ0jj9K2mJqkK0rlOrJ9k4J2J4k1J7j0kJj4L0j5
8027CqJ3j1J2j4MNj7RmRJj5K3j0nMj6J0Pj2J7j6J3%mJ1k2J0J3rPj8J1J3j7J8k2
8065gJ1Qj1JJj1K1j8J7j3jOj6J8j2pK0j2J%rK3k8J3kONpLK0l0QJ0oJk2K8mj7K0
8105HpPk5J0J0rKLpJ1j8J9Mj5J1j1J4nk3M0k7KOj1K2j9lJ7k4K6j6J5Nk8L4j9j2
8142a3J4mK2j8pK6l2J1LmK4m0K8Ll2K1j9J7Kj5K6j7J1jj7L5m3J3K8m6L1k4K4J
8176Hl2M4j9k1M2l9L3j8rL1l1J9kj5J8
$$ plain form
7950 18 -16 -6 8 1 -4 -6 4 12 -26 8 6 0 -6 -19 -2 -4 -18 11 -8 7 -4 4 12 -13 1 10 -4 10 -17 6 7 -19 -1 -4 5 3 -4 15
7988 15 0 0 10 0 1 -9 -9 -5 -13 4 -4 -19 -2 -8 2 1 -18 4 0 1 -7 -9 11 2 -1 5 -4 15 -9 3 17 -4 13 3 1 2 -12 18 3
8027 3 -5 8 -3 9 -5 -1 4 -13 -4 -8 1 2 -13 10 0 -5 -1 -17 -7 0 -12 5 -11 2 2 -2 9 -13 -3 10 1 8 -10 1 14 -3 15 -7
8065 -7 4 12 1 2 3 -8 13 -5 12 -1 -2 4 -12 6 -6 -13 7 -5 -4 -4 -13 10 -18 -5 -7 -1 4 -3 0 20 -10 -2 8 2 3 -19 9 5 -12 8
8105 8 1 8 -17 -7 3 -6 -4 -1 -8 3 -15 4 8 -7 4 -7 7 2 -21 19 -8 -6 0 -11 11 -8 -11 6 -18 8 -8 7 12 -16 18 -1 -13
8142 -13 1 -3 19 1 -6 20 -12 -1 2 -2 22 -18 10 13 -19 2 -17 0 2 -13 13 -4 7 6 -11 24 -19 -6 22 -24 7 -17 7 8
8176 8 -24 20 1 -20 22 -17 16 -2 -11 20 -11 8 6 -9 9
8191I
$$ Imaginary data points
##PAGE= N=2
##DATA TABLE= (X++(I..I)), XYDATA
0@%%%%%%%%%%Qj6J6j6K4l2M0n6O4p2Q9j13J36j60J92k24K56k96L44l92M48n13
32b73N85o64P50q47R54j071J197j335J488j655J838k038K257k497K758l041L350
49A756l691M065m477M933n438O004o638P352q167R106j0204J1502j3068J5004
63H039j7464K0709k5216L1951m3240O6917j98186K07744K10477l15617p2435K2094
75a04227L40625k76131j00489K81420j78258l2066P1302J00917j6164l77735L25801
86C4995K17169l02162r3682M7455L09433j35619l07084K84143n925n0330l916
97e523k5057J22422k19921J06303K14174k59209l0687N1420J83667l2456l25682
108b20549K18806J09902r7617j5870r2855J68713o3517n6627J55199j76724K1961
$$ plain form
0 0 0 0 0 0 0 0 0 0 0 0 8 -8 8 -8 16 -16 24 -32 32 -40 49 -64 72 -88 104 -120 136 -160 184 -208 240 -273
32 -273 312 -352 398 -449 505 -566 631 -704 784 -871 967 -1071 1186 -1311 1447 -1594 1756
49 1756 -1935 2130 -2347 2586 -2852 3152 -3486 3866 -4301 4805 -5399 6103 -6965 8039
63 8039 -9425 11284 -13932 18019 -25221 41696 -156490 51254 261731 -53886 -126321 -104227
75 -104227 236398 -39733 -140222 141198 -37060 -69126 2176 103093 86929 -290806 34995
86 34995 252164 -49998 -143680 -96225 213208 77589 -229495 54648 48723 -1607 -5523
97 -5523 -30580 91842 -128079 -21776 192398 -66811 -97498 -46078 137589 105133 -220549
108 -220549 -1743 108159 10542 -5328 -98183 70530 7013 -49614 105585 -71139 -49178
119d9178Q0330J4899K0054k23140J50475J34493j50379R767o5605J17309L1586
130G0611j31060J00733r3332K8758J10650j00165J4000p9745R5179J04876j90920
141g0415L8108K8493K6157L5088j24369Q3177k4039k3597J18513j10420j7736
152d1040J5020N5262P1903j94871L6714J23779m1826j6524q2019R4644K6389j01139
164e3708R5518m0740m0127L5775J9086O2006j52805J141J68308n9929o5814m1821
176g3110R9992O2350j54603M5564M9519l7200R744j8599O4431p1972m7159J43832
188G2789l5488p8741j5517P6687P7347j50742j0213J06458j6084k5467m4918O0750
200A6861J1396p6804P4101K217n5264q05L3806O4719r9354m1810J10151J807m4943
$$ plain form
119 -49178 31152 46051 66105 -157035 -6560 127933 -22446 -12679 -78284 39025 70611
130 70611 -60449 40284 -53048 -24290 86360 -13805 195 -79550 15629 120505 -70415
141 -70415 -32307 -3814 22343 57431 -66938 16239 -7800 -31397 87116 -23304 -41040
152 -41040 -26020 29242 101145 -93726 -57012 66767 24941 8417 -73602 21042 47431 -53708
164 -53708 41810 1070 -39057 -3282 15804 77810 -74995 -73854 94454 34525 -31289 -73110
176 -73110 26882 89232 -65371 -19807 29712 -7488 2256 -16343 48088 -23884 -71043 72789
188 72789 37301 -41440 -56957 19730 97077 -53665 -63878 42580 26496 1029 -43889 16861
200 16861 28257 -48547 25554 27771 -27493 -28298 5508 70227 -29127 -70937 39214 41021 -3922
213c922m6777M7304N9421p8164N591K9900j8524N101q219L6359l2359m2962P3178
226B5927N336l9781k5970K4799O0991n5185k9936L7061N681O400k8359O716J5783
239I463k4093K7372j855k3617L044O503L0246k6635k8554L0614R463J129k2906
252i826q566K9259l980k295r456r407K2208jm908r132o041K1401j362q333m561
267e000m658J6702K510r224r135j709K3101K79k1927l687J4244J4289j4366j4665
281a3246J1796P600k513m406j339j86q52R560J928j6060m025J7733R241j7927
295b696j3668J6413J5082j2760j3497P923R541l179n400K002k24m114P890N315
309H628j2256p265J1791J2759j1910j6161J1563J4229o332j2942J724J1790k258
$$ plain form
213 -3922 -50699 -3395 56026 -22138 -16547 13353 -5171 -70 -8289 28070 -4289 -47251 25927
226 25927 31263 -8518 -34488 -9689 51302 -3883 -33819 3242 8923 15323 -13036 -6320 9463
239 9463 -14630 12742 10887 -12730 -9686 -3183 27063 428 -28126 2488 11951 13080 -9826
252 -9826 -18392 10867 6887 4592 -4864 -14271 7937 7936 3028 -6104 -12145 9256 7894 -439 -5000
267 -5000 -9658 7044 9554 330 -8805 -10514 12587 12866 -9061 -12748 1496 15785 1419 -13246
281 -13246 -1450 6150 3637 -769 -2108 -2294 -3146 6414 8342 -7718 -11743 5990 15231 -2696
295 -2696 -16364 49 15131 2371 -11126 -3203 6338 3159 -2241 -239 -463 -4577 3313 8628
309 8628 -3628 -10893 898 13657 1747 -14414 -2851 11378 5046 -7896 -6172 5618 3360
322C360n224J945j887m60L711M192n404j0003Q705J1426p516j1830K941J3677
336G633q83j2208k90P419K532l703k523O68l94K796L565m823o360M672Q397k282
352D216j0014q77J1271J792q912k463L703N423j973m721J503j235L653K882n567
367a319j880k73P851J317j1537K161M616L832k276j0088P618K654j731J499q095
382e651N817J687j428L733j1007N742N493l836K097j0847Q908O404r912M174p420
397f046P674N497j2697Q001o334L803P610j3392Q602o229K096J1072j6320P533
411H70l019J305J1854k0623R227K750m021J0621j9595J2017M052j1567J4743j5712
425g098P232M272j1310J8746j9464K640J3749j3113J2601j8594P501J7780k4993
$$ plain form
322 3360 -1864 81 -1806 -2266 1445 5637 233 -9770 -1065 10361 2845 -8985 -6044 7633
336 7633 6750 -5458 -5748 1671 4203 500 -2023 -1355 -1749 1047 4612 -211 -6571 -1899 6498 4216
352 4216 -5798 -6675 4596 6388 -2524 -4987 -1284 4139 2166 -2555 -1052 -2287 1366 4248 -1319
367 -1319 -3199 -3472 4379 5696 -5841 -3680 936 4768 2492 -7596 22 2676 945 2444 -5651
382 -5651 166 1853 425 4158 -6849 -1107 4386 550 2647 -8200 708 7112 -2800 1374 -6046
397 -6046 1628 7125 -5572 2429 -3905 -102 7508 -5884 2718 -3511 -1415 9657 -6663 870
411 870 -2149 -844 11010 -9613 -386 2364 -1657 8964 -10631 1386 5438 -6129 8614 -7098
425 -7098 134 4406 -6904 11842 -7622 -4982 8767 -4346 8255 -10339 -2838 14942 -10051
438a0051J3503o647J814J2332k4313K1679p601j0837K2062j8217J1785r982m972
451i445L0341l1008N586Q227p248J8331l1424J7568J2045k7187K3985j5051O686
464A406L633k1720L7160k4681r200K4153j5993J9003k7572N045L3140l9323J6574
477A625j357l384J6534l4221L3785n733k7891L4156j7459J1748j3265j2195M7154
490B9497l9511l66J8433j3774K2242l5886K0163J9318m3290L2657q429j196M455
503D313k7132M9517k6730k2475L6757j8639J7809k6927J646M2573n0694J8553
515a429J0078j4702J7513l4948M0388l599m4331M5983j3565M395j0989j6380N6562
528C4976m5407o155L2356k2761K0016l2142K1361K4068n7787L8887K355j2277
$$ plain form
438 -10051 3452 -3195 -1381 10951 -13362 8317 716 -10121 11941 -6276 5509 -4473 -9445
451 -9445 20896 -10112 -4526 3701 -3547 14784 -16640 928 12973 -14214 9771 -5280 1406
464 1406 5039 -16681 20479 -4202 -13402 10751 -5242 13761 -13811 -8766 24374 -14949 1625
477 1625 268 -3116 13418 -20803 12982 7249 -20642 13514 -3945 7803 -5462 -17657 29497
490 29497 -10014 -10380 8053 -5721 16521 -19365 798 20116 -23174 9483 1054 -142 4313
503 4313 -22819 26698 -32 -22507 14250 -4389 13420 -13507 -11861 30712 -19982 -1429
515 -1429 8649 -6053 11460 -23488 16900 13301 -31030 14953 1388 5783 -5206 -21586 34976
528 34976 -10431 -16586 15770 -6991 13025 -19117 2244 26312 -31475 7412 9767 -2510
540b510N500k8368N4763k5283l3510M7092k0114J1562j9789j747M5627n5546J6747
553e576K2267k4406J5799l0155L8111J866n2335M8020q456l360l241j9890N3125
566C1769m0133j0220L8946k8935J6720k1589J4109K5753n7638L6742P775k0016
578f717J2193k7326M4605j7179l2891M7405k5127P836m803r416L8177m7767J7019
591c991K3782l3246K0821k0743K2680N226m3387M4901j3735r077J4011k1733L4010
604A9519k8685k989L5915l8693J6756k587j24J7004m1736L5470K585k8692K5095
617H838j7474J9557j1743j7635M3472l4505Q27J7391j2596J7252l4329K3074K0729
630B2858m3765K3429j678M505j486k6882M5090j9978k0917K9488j1854J1201k4925
$$ plain form
540 -2510 2990 -25378 29385 4102 -29408 17684 -2430 9132 -10657 -12404 33223 -22323 -5576
553 -5576 16691 -7715 8084 -22071 16040 17906 -34429 13591 5135 1775 -1466 -21356 31769
566 31769 -8364 -18584 20362 -8573 8147 -13442 667 26420 -31218 5524 13299 -6717
578 -6717 5476 -21850 22755 5576 -27315 20090 -5037 2799 -2004 -11420 26757 -21010 -3991
591 -3991 19791 -13455 7366 -13377 9303 14529 -28858 16043 2308 -6769 7242 -14491 19519
604 19519 -9166 -12155 23760 -14933 1823 -764 -888 16116 -25620 9850 12435 -16257 8838
617 8838 -8636 10921 -822 -18457 25015 -9490 -8663 8728 -3868 13384 -20945 2129 22858
630 22858 -20907 2522 844 5349 3863 -23019 22071 2093 -18824 10664 -1190 10011 -14914
643a4914P480L6639m6064Q729J5995m468L285l0722L7214K358l8188K7365j271
656C438M226j5133q747M3777l2656j2042K5703m659M541k8683K1056K3351m1970
669a7798J3390J0232M55n980k0660L8646j0665k6970K3930n86M779k0892K258
682i861L3927l1810k701J5285r29K907k4501K2832R703k9083J4480J583M396p547
696a319j3055K9593j3542j1799J3122l570R400j7144K908J8580j9440N431Q32
709cJ64O259j6589J4002J184j0965R180p307Q505k438r650J3281p121K549J22
724A173p455J2991p629j614M268m367Q546r959N57J0620r430R49r61N569J966
739E224j5011J0596O384q701k655J048J2340r166j0638J5493Q99q467m053Q958
$$ plain form
643 -14914 -7434 29205 -16859 -8130 7865 3397 6682 -24040 13174 15532 -22656 4709 3438
656 3438 7664 -7469 -16216 27561 -5095 -17137 8566 3907 8448 -20235 821 24172 -17798
669 -17798 -4408 5824 6279 299 -20361 18285 7620 -19350 4580 3994 8773 -12119 -9861
682 -9861 24066 -7744 -10445 4840 3911 6818 -17683 5149 14852 -14231 249 1832 6228 -1319
696 -1319 -14374 15219 1677 -10122 3000 -570 8830 -8314 -5406 13174 -6266 -835 -3
709 -3 161 6420 -10169 3833 5017 -5948 3232 -4075 4430 1992 -7658 5623 -1498 1051 1173
724 1173 -6282 6709 -920 -2534 1734 -2633 5913 -4046 -3489 7131 -2299 -1350 -2311 3258 5224
739 5224 -9787 809 7193 -1508 -4163 -3115 9225 59 -10579 4914 5813 -2654 -6707 2251
753B251P932j7836L66J6071m199j1160m18J6077k677j8414R689J2444q450j1346
767i670P491J4327j3315j0807J5783O196j3793o872J5708N943j8660j480J7326
780H177m77j6042J032J6897m072j5983P060J3671q283j2583R944J1505j1864r674
794a0692J2900Q049j3606o191J3665M307j3021l054J3016R99j2588J606J0816
807F206k618j0068L522J0283n824q606O557O782n501p096O296O190p390l174N706
822A265K363m742k711O216M75n757J232L735M6m284o8M950j571k687N22J549J268
839A801k635k25J608k00L82j690M62J878j505o81O34J555j079k727L051K048l459
856g82k052L374L286m734l164N588K277n309k146N545J672o103m98O345p15o603
$$ plain form
753 2251 10183 -7653 -7287 8784 4585 -6575 -6993 9084 6407 -12007 -2318 10126 1676 -9670
767 -9670 -2179 12148 -1167 -11974 3809 10005 -3788 -10660 5048 10991 -7669 -9149 8177
780 8177 7700 -8342 -7310 9587 5515 -10468 -3408 10263 1980 -10603 -659 10846 -1018 -10692
794 -10692 2208 10257 -3349 -9540 4125 8432 -4589 -7643 5373 6372 -6216 -4610 6206
807 6206 3588 -6480 -2958 7325 1501 -7105 -548 6234 733 -6363 -67 6123 -1267 -4441 1265
822 1265 3628 -1114 -3825 2391 2866 -2891 -1659 2076 2122 -2162 -2230 2720 1149 -1538 -1016 533 1801
839 1801 -834 -1059 549 349 731 -959 -497 1381 -124 -805 -171 1384 305 -2422 629 2677 -782
856 -782 -2834 540 3826 -908 -4072 1516 3793 -1516 -3662 1883 3555 -2548 -3046 3299 2584 -4019
872d019K001O699l055o754L682P306m961p036O078N755n784n592O334N312q209
887b243k748Q070J048p193j685R271m1j0521L240Q125k505p969J695J0169n290
902A423p691O483M198l791o148N967O088j0083p10P385N14n585m020J0514K3j0276
918e709M129M420J88o402l30J0058o880l776N758N67o95o751O499M961j0726L000
934a689L266Q98k602n685J0502k746o288N707j580K703n010K65Q298r555K093
949a423L343k164K533p421P296J479q591P226l185J801N7n094R396p528L9O242
965D006o789N174n080K533N243j1119Q472j472l055N221p612Q572m412m321J0950
980F311r614L580P7k459Q313j2640O996M201r461P853o499N641L58j0141J4204
$$ plain form
872 -4019 -2018 4681 1626 -5128 -1446 5860 899 -6137 -59 5696 -88 -5680 654 5966 -2243
887 -2243 -4991 3079 4127 -3066 -4751 4520 4479 -6042 -2802 5323 2818 -5151 -3456 6713 1423
902 1423 -6268 215 4413 622 -5526 441 6529 -3554 -4264 3121 3635 -1950 -5970 4544 4567 -5709
918 -5709 -1580 2840 3028 -3374 -3704 6354 -526 -4302 1456 2023 1328 -5423 1076 6037 -4689 -1689
934 -1689 1577 2475 -127 -5812 4690 1944 -4344 1363 -217 2486 -2524 -2259 6039 -3516 -1423
949 -1423 1920 -244 2289 -5132 2164 3643 -4948 2278 -907 894 951 -4143 5253 -2275 -2236 4006
965 4006 -2783 2391 -2689 -156 5087 -6032 2440 968 -2087 3134 -4478 4094 -318 -4639 6311
980 6311 -3303 277 354 -2105 6208 -6432 564 4765 -4696 3157 -3342 2299 2657 -7484 6720
995F720p746j919N857o351R622j0783J472J1413j3626O493k035P07N721j4328
1009h783J3138j142r037R743p313P938n481o102J6719j3187J318M179m379R342
1023F953j4717P945P401j4931J0325m661L422J141j2417J8201q531o092J0251
1036D290p482R421j1128N11J5256j7767O878J349k397O606j5423J5118k05j3971
1050h944J3555o570N671m654p285J9870j5337q08Q711o717Q612j4018Q014R555
1064I655j9182J1621j220q1J724j2652J9505p832j0144J3783p070O734r377m67
1078e003J7270j9436M980N883m911N830j4405J4661K107j7583J4460l791K609
1091B671l390q041K0705j4414m096J1734p012P091j2601O435J1874k0371R979
$$ plain form
995 6720 -1026 -2945 2912 -3439 6183 -4600 -3128 8285 -5341 1152 -883 -176 5545 -8783
1009 -8783 4355 3213 -5824 3919 -3394 4544 -937 -7039 9680 -3507 -2189 1990 -2389 6953
1023 6953 -7764 181 7582 -7349 2976 -1685 1737 2878 -9539 8662 131 -5961 4290
1036 4290 -3192 6229 -4899 -4388 10868 -6899 -21 1328 -1069 5537 -9886 5232 5027 -8944
1050 -8944 4611 -1959 3712 -942 -8227 11643 -3694 -4502 4209 -2508 6104 -7914 100 9655
1064 9655 -9527 2094 874 793 2517 -10135 9370 1538 -8606 5177 -1893 4841 -4536 -5003
1078 -5003 12267 -7169 -2189 3694 -1217 4613 -9792 4869 6976 -10607 3853 62 2671
1091 2671 -719 -8760 11945 -2469 -6565 5169 -1843 5248 -7353 -918 10956 -9415 564
1104E64J644j851K502j2965J8260m850j2497J3829n864N369p317k883J7702j6936
1118e293J951P150n223O237j3170J0718N377j6724J1487k287J502n80r548J7301
1132H898r199n691J0377o588O739q968J690J1955j5828O641J831k814M919j1679
1146g717J2130p32j0536J0802n908M508k639n706J3671j1027J011N333o161P572
1160D601r227M466N788j1683Q800l251P7L454q923J0649m628l841P693p251O137
1175B861l664k241Q470r556N091N45m359O651p486N145O36o393Q124n758J991
1190E7J775n456P547n995J186L960o629O143l682L38L576o810O692k641k163M743
1206B641n354M902k490k029N914o215L249J45k396M329n677L962R08m706M729
$$ plain form
1104 564 2208 357 2859 -10106 8154 3304 -9193 4636 -1228 4141 -3176 -6059 11643 -5293
1118 -5293 -3342 3808 -1415 4822 -8348 2370 7747 -8977 2510 223 1725 1145 -8403 8898
1132 8898 -301 -5992 4385 -2203 4536 -4432 -2742 9213 -6615 26 1857 -957 3962 -7717
1146 -7717 4413 3681 -6855 3947 -1961 2547 -92 -5798 7873 -3154 -2143 3190 -2971 4601
1160 4601 -4626 -160 5628 -6055 2745 -506 -429 3025 -5898 4751 123 -3718 3975 -3276 2861
1175 2861 -803 -3044 5426 -4130 961 1506 -2853 3798 -3688 1457 2093 -4300 3824 -1934 57
1190 57 1832 -3624 3923 -2072 -886 3074 -3555 2588 -1094 -756 2820 -3990 2702 61 -2102 2641
1206 2641 -2713 2189 -301 -2330 3584 -2631 618 763 -1633 2696 -2981 981 1889 -2817 1912
1221A912l190K058J94l952N826l610k57K431k947L520l512Q10L384m836K651n40
1237e8L9J512m219M101m03k546K484j895K271j459j594L982k937K23P88o01J873
1254A561l385J715J863k814J121o74J510j59k810L144m34j253N11l43J965k258
1270g40m84K738j477n07k43J318O85k999J435J581j296p06KK082j125j935K211
1287E40N07j400p59J407J297k517m18K493q5k032k69K451q2k602P45K178r38k023
1305a507J205J984j687j775K068J615k498j284K713R00k621q84K887N50l165K78
1321a221K733n57k535O33K977j558k655K175J929j855k195K228K302l157j206
1336a962K852P47k389j141L195L24l436Q30K555n72k733O29L418j902k594K120
$$ plain form
1221 1912 -1278 780 974 -2978 2848 -762 -1019 1412 -1535 1985 -1527 -717 2667 -2169 482 -58
1237 -58 -19 1493 -2726 1375 972 -1574 910 -985 1286 -173 -1767 2215 -722 -499 289 -312 1561
1254 1561 -1824 -109 1754 -1060 61 -613 897 738 -2072 1072 638 -615 -104 -447 1518 -740
1270 -740 -1224 1514 37 -470 -713 605 1290 -1709 -274 1307 11 -695 -693 1389 264 -1671 540
1287 540 1047 -353 -1112 295 1592 -925 -1343 1150 1065 -967 -1236 1215 1133 -1469 -724 1454 516 -1507
1305 -1507 -302 1682 -5 -1780 288 1903 -595 -1879 834 1734 -887 -1771 1116 1666 -1499 -1221
1321 -1221 1512 955 -1580 -947 2030 472 -2183 -8 1921 66 -2129 99 2401 -756 -1962
1336 -1962 890 1637 -752 -1893 1302 1626 -1810 -980 1575 1003 -1730 -1101 2317 415 -2179 -59
1352e9J828j468k440K209K172l044q48K387P57k234j057L159Pk993P31K188k44
1369A051k591N55K870j527j921J340J555j020j904J705J394k006o16J554O92j668
1385e37o39K006Q6j730P4J472j7j527K80J308m45j052N14R15o71o32N54O13n15
1404E7p32Q45K78n87n6k0O42l75m61N92k48L49l32m30R83n38Oj17o9J079j460
1425e94K17J039p57K21r06J240N32k329J423M74k87n09j021K850j345j750K054
1442E52k72M33j942O08K976l523J96J647r2m7k938L491Q96m126J980N74R02j967
1460f52j754N333k719k278K491J39J106m299J927M338n322M98J445J152n04m732
1476c831N760L39m799K349K03K425l812j692P084m241j750J870P42K004o518L554
$$ plain form
1352 -59 1769 301 -2139 70 2242 -802 -1650 737 1494 -740 -1797 1362 1369 -1624 -893 1295 1051
1369 1051 -1540 -985 1885 358 -1563 -223 1332 312 -1592 113 1507 -499 -1115 439 1131 -537
1385 -537 -1176 830 916 -814 -740 732 715 -812 -532 776 331 -721 -207 708 37 -595 -41 572 57
1404 57 -675 170 448 -139 -195 -215 427 52 -409 183 -65 284 -48 -478 505 -33 -27 -144 -213 866 -594
1425 -594 -377 662 -95 126 -780 460 992 -1337 86 560 273 -236 -1257 1593 248 -1502 552
1442 552 280 713 -1229 -621 2355 -1168 -972 675 583 536 -2402 1089 1985 -2141 -161 413 1315 -652
1460 -652 -2406 2927 208 -2070 421 560 1666 -2633 -706 3632 -1690 -1192 253 1405 901 -3831
1476 -3831 1929 2268 -2531 -182 21 2446 -1366 -3058 4026 -215 -1965 -95 647 2651 -3867 -313
1492c13M239o049J427J20K780j352n578P762j358m030K182l24M074n897n50P435
1508D568n641l7M34J538K123p779N635K489n704K386j326M223k666m878Q488l482
1524C71j964J514p48M731p099J530N856o212K098j213K216J398p363P157n35m007
1540b270L172k640M898m100k407P712n894J074N59q75M177p377M546K419o063
1555c069M541k820K764l66n191Q023m470j106L382l538M774n212J178N102p443
1570c451M442q12o96K676o154O771j790m318N937m060K928k034j901P014p376
1585b824K146K758l639L667n270M481J527p362O734k095k08O68l833P673n666
1600a243j613O150m683K696l392J785M654q951N245J279l053K228m526O848k494
$$ plain form
1492 -313 3926 -2123 -696 -576 2204 852 -4726 3036 1678 -2352 -170 -494 3580 -2317 -2867 4568
1508 4568 -1073 -1110 -676 862 2985 -4794 841 3330 -2374 12 -1314 2909 243 -4635 3853 371
1524 371 -1593 -79 -827 3904 -3195 -1665 4191 -2021 77 -1136 1080 2478 -4885 2272 1737 -2270
1540 -2270 902 -1738 3160 -940 -3347 4365 -1529 -455 104 -771 3406 -3971 575 2994 -3069
1555 -3069 1472 -1348 1416 1050 -4141 3882 -588 -1694 1688 -1850 2924 -2288 -1110 3992 -3451
1570 -3451 991 179 -517 2159 -3995 2776 986 -3332 2605 -1455 1473 -561 -2462 4552 -2824
1585 -2824 -678 2080 -1559 2108 -3162 1319 2846 -4516 2218 123 -85 583 -3250 4423 -1243
1600 -1243 -2856 3294 -1389 1307 -2085 -300 4354 -4597 648 1927 -1126 1102 -3424 3424 930
1615I30n537P879l569N68j174r70O919q306J635M860m517K364l992M517J551q279
1631e121P005o44j884Q11l011P263n335k726P161m169J119k270J458M756q633
1646d220M033K741l671J771l503N671j441n963P311k341o74l03j149O093o746
1661b391L59N170m159J644k759L094K021p243N513J81k230J133k688N677l568
1676b46k982O059l307P42j284K90M238o476K518K559l175J777k734L663k25m824
1692c407N275j528p25L99j574M467m147m47L923l125J420j623J169K103m828L307
1708F59L43j826J456k192L288j520k318L927k263N79l13p04K991l614J152J629
1724A274k194J682j822J554N61k918K941j072l06P66j646K576j815m73K073j993
$$ plain form
1615 930 -4607 3272 -297 271 -903 -1873 5046 -3260 -1625 3235 -1282 1082 -2910 1607 3158 -5121
1631 -5121 1884 1240 -644 167 -2844 4419 -916 -3642 3519 -650 469 -1801 -343 4413 -4220
1646 -4220 -187 2554 -1117 654 -2849 2822 1381 -4582 2729 388 -286 -589 -1738 4355 -2391
1661 -2391 -2032 3138 -1021 623 -2136 958 2979 -4264 1249 1430 -800 333 -2355 3322 -246
1676 -246 -3228 2831 -476 266 -1018 -728 3510 -2966 -448 2111 -1064 713 -2021 1642 1417 -3407
1692 -3407 1868 340 -385 14 -1560 2907 -1240 -1687 2236 -889 531 -1092 77 2180 -2648 659
1708 659 1002 -824 632 -1560 1728 208 -2110 1817 -446 133 -180 -884 2107 -1507 -355 1274
1724 1274 -920 762 -1060 494 1055 -1863 1078 6 -300 466 -1180 1396 -419 -892 1181 -812
1740h12J336q18j21J598k368J567k3r82J372j582J314j71j181J750j407O31K71
1757C74j098J490j216M31N13j234J366q43J2O48r98J081p90j1R12j188P27k18
1775d2n4N51j142R78op06O20m24N82m21m68J101o24j52J74N5M14r40L94O25o83
1796a68J5L0M69k13p14P96J42n61n2L26L90p07j81P90r5n72jO42m9p38K27O74
1818D50l14o25M01N64m47n29M76N95o82m47P82K00o20k70O84L34r99O5Q38k07
1838B49n92m3R18k15r88O37N32m15n61K92R18q58n25R26J39n16m87P69M90j201
1858e31J57P93j38n99j88J107k98j017O94M56k82o91L19J001r26m45Q10J91m77
1877f4n21Q36L49j112J97O87m7o56j25J034l22q30M99M66k39o25L43P15o98l58
$$ plain form
1740 -812 524 -294 -415 1183 -1185 382 359 -623 749 -833 481 310 -871 879 -528 103 374
1757 374 -724 766 -450 -19 494 -740 626 -217 -205 443 -555 526 -264 -275 637 -551 176 -42
1775 -42 -96 455 -687 291 285 -421 199 -225 357 -64 -532 569 -55 -207 -33 22 436 -504 -110 515 -168
1796 -168 -153 -123 346 133 -581 215 357 -204 -256 70 460 -247 -428 362 267 -305 -306 336 287 -451 -224 450
1818 450 136 -489 -88 476 29 -500 -24 571 -111 -558 224 424 -196 -466 218 552 -447 -382 456 249
1838 249 -343 -386 532 317 -671 -34 498 83 -478 -186 732 -126 -651 275 414 -102 -589 180 670 -531
1858 -531 -374 419 281 -318 -506 601 303 -714 -20 436 154 -537 -218 783 -143 -588 222 413 -64
1877 -64 -585 251 600 -512 -315 372 325 -331 -456 578 256 -574 -75 391 152 -473 -130 585 -113 -471
1897d71O36J96m86l29O48K35p42rO17n4n03PN42q1n83L05M24l54k27J68L52k14
1919G7m66N16J25l76L0L9L26l19k51N36k31n6Mm8M08n51J23L57m00K95l66K34
1941FL30p34N17j05o3K67o81P70j98m41O03n26N52l57l71J036q86K42J46l50Q12
1962E69j140N56N43j015P79n99M80K29j217J379n60k70N72q27J197r42k64J327
1980G97j299P16l42j44J128j758J107J92r47J102j198J062p8j275J792j207L36
1997a6L31j070J746j534K88J025j579J511j100J76J092j914J715p64l55J328j897
2014a017J662n93p40J670j959J496k90j164K005j862J110j7j327K319k069O60
2030a16P66j549J973j919P77J147k386K084j038J54Q85k253K704j197r75J893
$$ plain form
1897 -471 165 361 -125 -454 194 429 -313 -322 295 241 -262 -255 287 206 -377 -72 352 -2 -229 -61 291 77
1919 77 -389 127 252 -124 -94 -55 271 -48 -299 237 6 -50 -46 -94 314 -237 -114 243 -157 138 -228 6
1941 6 336 -398 119 14 -49 218 -463 307 109 -332 271 -255 297 -60 -431 605 -281 -39 107 -243 569
1962 569 -571 -15 528 -487 292 -307 173 402 -815 564 4 -266 306 -521 676 -266 -530 797
1980 797 -502 214 -128 -272 856 -902 205 397 -550 552 -646 416 338 -937 855 -352 -16
1997 -16 315 -755 991 -543 -255 770 -809 702 -398 -222 870 -1044 671 -93 -448 880 -1017
2014 -1017 645 52 -688 982 -977 519 229 -935 1070 -792 318 301 -1026 1293 -776 -116
2030 -116 650 -899 1074 -845 -68 1079 -1307 777 -261 -107 778 -1475 1229 32 -943 950
2046I50j762J740j353m88K678k888J162K86p76J606k786K245M37k565K303j285
2062d96J118m21j922L625k332l82J513j341J980k678R65K283l455J827l48K28
2078A64P61l054L532p87k047K240j467J852j730r02L721l224N21Q03p06J745l355
2095a933K257J310l279K188r48J066k39k538M030j926j110J813j354K092k584
2110a155L33K958l516J460k2j02J177l212L156j77k412K348j479J613j118j430
2126a578L670k878L19J046j213K005k875J570J477l123K234r46N16M81k536L348
2142A517j535j011J988j808J885j631k20K592l074J494J26q69J619k515K142k3
2158F77k070K463j639Q56l4j422K724k340M08J315j837J776j625P39J116k575
$$ plain form
2046 950 -812 928 -425 -913 1765 -1123 39 325 -451 1155 -1631 614 1051 -1514 789 -496
2062 -496 622 201 -1721 1904 -428 -810 703 -638 1342 -1336 -371 1912 -1543 284 -64 164
2078 164 925 -2129 1403 616 -1431 809 -658 1194 -536 -1438 2283 -941 -420 383 -323 1422 -1933
2095 -1933 324 1634 -1645 543 -405 661 422 -2116 1914 -12 -1122 691 -663 1429 -1155
2110 -1155 -822 2136 -1380 80 58 -44 1133 -2079 1077 900 -1512 836 -643 970 -148 -1578
2126 -1578 2092 -786 -467 579 -634 1371 -1504 66 1543 -1580 654 -292 224 705 -1831 1517
2142 1517 -18 -1029 959 -849 1036 -595 -815 1777 -1297 197 323 -546 1073 -1442 700 677
2158 677 -1393 1070 -569 287 253 -1169 1555 -785 -377 938 -899 877 -748 -9 1107 -1468
2174a468K287p93m37J095j782K186j270p31K124k003J167m95l80J733k464J518
2190B87L19j400J490j480J316j53j620K335j406J31M86r85J770j840M23J361j836
2207h02J188o98L74O93k001J912l84q48J012j033J316r14o00J842j539M64P3l32
2225b77J116j763J044N35j328J031p47P17n9j216J713q32k31N20o33J126j192
2242d76J43J086j248O54l38J96N35j364J154q3o23O28o54Q33m56n45J163q03J87
2261a1K6k43P80j013M05M28o90N25m83L97J57q17Q20k66j17K14m27O93m62j85
2281b69N71m55K81k77M5M86o90L13J29j91J97m29M70pm64M03j18J11j59j63N20
2302C04l53j24K30k6J13l89K07K97l95M0R9J29j28k60L90Qk97O0J72P6l14J6L61
$$ plain form
2174 -1468 819 26 -411 684 -1098 1088 -182 -913 1211 -792 375 -120 -500 1233 -1231 287
2190 287 606 -794 696 -784 532 379 -1241 1094 -312 -181 305 -680 1090 -750 -327 1034 -802
2207 -802 386 -312 62 755 -1246 666 282 -566 446 -587 729 -185 -785 1057 -482 -18 55 -277
2225 -277 839 -924 120 655 -673 358 -389 328 269 -947 766 -66 -297 223 -410 716 -476
2242 -476 -333 753 -495 159 -179 17 552 -812 342 259 -364 264 -390 443 -13 -558 605 -198 -11
2261 -11 15 -228 552 -461 -56 372 -318 207 -276 121 278 -539 281 15 -102 112 -315 378 -84 -269
2281 -269 302 -153 128 -149 -104 382 -308 5 134 -57 140 -289 181 174 -290 113 -5 106 -53 -216 304
2302 304 -49 -173 57 31 144 -245 -38 259 -136 -96 3 132 4 -256 134 142 -155 -95 77 153 -161 -145 216
2325B16j61k29J09K49j35k78K31K10k29j86K55J51k99o4K57Q4l08n4L70p3k89
2346a73Q5K26j5l42J56K89k68j16J47J75j74k50L67M4k76K8J27J46k84o2L81j89
2368B2j33P9J15L6l17K08J73k56J5M5J59j41k04L38q1j43O4J1J38k32K0K32j96
2391d8LK9N1K0j98J84L1j38N4k2J00q3p6J77q6l4N7l1M6p3L3O7j14M6K8j9Rk9
2419a6M2j0o8Q4j4o8N5o%ol6J10q2n9J22o6K1l3oJ33j81M9R7j21Q5j06J19N3k54
2448a62K25m9m7O5j57K73j73j04K90k33J21q1k6K75m17K16R8k23K22l00K97j3
2470I7l66M72k65L3P7k53M89m53L7L78m48L46k67J03L00o55N52j17k16L54m70
2491b72N33k60l23O96n74K52j9k26O25p94L64L03o08N45m68L46J13p60R38m49
$$ plain form
2325 216 55 -174 -65 184 49 -229 2 212 -17 -203 52 203 -96 -160 97 181 -127 -181 189 116 -173
2346 -173 -88 138 123 -219 -63 226 -42 -158 -11 164 -10 -260 107 151 -125 -97 30 176 -108 -170 211 22
2368 22 -111 -32 83 119 -198 10 183 -73 -58 -13 146 5 -199 139 58 -85 -21 -10 128 -104 -84 148 -48
2391 -48 -45 -16 35 55 -143 41 72 -66 -12 -34 66 -17 -93 84 -2 -36 21 -10 36 -37 -4 63 -51 -5 23 4 13 -16
2419 -16 26 16 -52 32 18 -50 5 -1 -1 -7 -43 67 -15 -74 48 -18 3 -30 -36 97 -84 -35 62 -59 26 -80 39 92 -162
2448 -162 63 14 -33 32 -125 148 -25 -129 161 -72 49 -32 -58 217 -200 16 114 -109 113 -187 110 97
2470 97 -269 203 -62 -29 48 -205 284 -169 -132 246 -202 144 -123 -20 280 -375 177 60 -156 198 -272
2491 -272 261 1 -322 374 -200 52 33 -193 432 -362 2 305 -303 242 -226 120 233 -527 411 -38
2511c8j26L66n34P94p04m6Q36r30N02k09QN45j127R17K0o75O68o18P43l84o39
2532f31J321r06J12J98l44R11j278N33P41j158P01m52M72J62j288J491m23n49
2550c87N94n92J081j026k68J487j267L52p2L1P93j680J128M45j200P85o03R17
2568E18l63j162J869r03k55M03m46J233j567L14J306j472O59m11M55M58j782J685
2586E39j58q77P46p40J274r60o68J847j335K74nj65J143j874R80P11j338R08p56
2605d54Q39j0j472J896p91l37N73p59J365j330NJ403j533Q13l45L9Q20j713J426
2624D35q6r48J082r78R79m60p83J686j373L69L34o85J135j397P40N82j431J276
2642D77p01K52L17j193J645r76l07J061j047R42q21P6J161j703J010L7n02P20
$$ plain form
2511 -38 -164 202 -332 462 -242 -288 548 -382 120 -89 -81 464 -663 254 274 -401 267 -351 392 8 -631
2532 -631 690 -216 -104 94 -250 661 -617 -84 657 -501 200 -252 220 382 -906 585 162 -387
2550 -387 207 -385 696 -330 -598 889 -378 -26 -98 -67 726 -954 174 619 -581 204 -399 518
2568 518 155 -1007 862 -41 -296 107 -339 894 -673 -359 947 -525 134 -277 178 636 -1146 539
2586 539 381 -496 250 -490 784 -176 -844 1003 -332 -58 -63 -228 915 -959 21 732 -606 302 -454
2605 -454 385 375 -1097 799 8 -329 244 -515 850 -480 -475 928 -605 208 -137 -98 722 -991 435
2624 435 349 -599 483 -495 484 24 -759 927 -446 -77 257 -428 707 -690 50 632 -799 477
2642 477 -224 28 345 -848 797 -179 -486 575 -472 470 -351 -275 886 -817 193 230 -272 448
2660D48j192J305l12j090J492q56L39j84m64J497j548K71Q79r15O86r35P85M66
2678F72j665J362j97k81K20p93J544r65o38J380q03L65n88J97J141j747O85N51
2696D40n73L37r15J268j46j329J321l10L0k95l42J482j299j73R80n32L27q83O97
2715H5P01j561Q15J75j43Np84J375m86q73R95l07K76o07l6J192j203J06M96k24
2735cK83q99Q24L14j082O49p2K01j97n89J152n35m12N25k27M28p03J48P67q82
2755c10K38P1O1J85p75P32N6n65L92k50M24k95l63P70m36l0J02j11M32o00J73
2776i9L69m38K41k16K09J40n24M45o6j11J35k78L88j78k04L39k32J60j15r6L63
2797B32l44Q4O0r4K07l05J36J46k07J21j35J52N1k99K55lp7k9o1K76j80j44K21
$$ plain form
2660 448 -744 561 249 -841 651 -205 134 -50 -514 983 -565 -294 585 -330 356 -579 206 672
2678 672 -993 369 172 -109 111 -682 862 -103 -741 639 -164 201 -387 -190 951 -796 -111 440
2696 440 -133 204 -711 557 411 -918 403 93 123 -172 -514 968 -331 -504 476 -56 271 -612 85
2715 85 786 -775 40 215 72 77 -707 668 182 -691 304 -3 273 -334 -370 822 -381 -275 221 -3
2735 -3 280 -619 205 519 -563 86 14 215 18 -571 581 46 -366 159 -68 360 -343 -195 572 -310
2755 -310 -72 -1 60 245 -530 202 258 -307 85 -165 259 -36 -399 371 -65 -95 7 -104 328 -272 -99
2776 -99 270 -168 73 -143 66 206 -318 127 61 -50 85 -193 195 17 -187 152 -80 80 -35 -131 232
2797 232 -112 -28 32 -62 145 -160 -24 122 -85 36 -99 53 104 -195 60 57 -20 -49 -110 166 -14 -158 63
2820F3ll8j60J19K07k75k5J82L4j27j35K58N2k89N2J89J4k51J9K84r3k63J25K44
2844A83j31k50J65K30k09k10K49J73k67j34K71J06k86j07L70Ll18K3K90kl47Q0
2866a18L53j83k48J45K66j63l16K95K04k94j36K41J71l01j54L97qk96%K61N4l69
2888a99P8L21j60k05Q9K57j30l06K77J62k36r4J61J82k65j21L17j6k04k1K10L2
2910A29k83Q2K36j21j54O0J97j03k10J94R4j54p5J41Q2j63p5J87Oj42oJ34J6j66
2934i4K0J65o3j19P3O8l6r7N7J12j08m0Q7K1l6q4J13K6j28N4K4J2j8q1J44n8p6
2961f2J06o0O3q2j8J24j33M7J6l5Q7j32Q8M1j37J37r2L8L9j34J81j27J7J08j75
2986i5J90j35QJ28k19K14q7o4J65k02J75p9q8K46k58J38J4j40K28k93K09M6k70
$$ plain form
2820 63 60 22 -138 -19 188 -87 -112 70 104 -23 -158 100 152 -137 -85 104 118 -133 -114 170 77 -186 -61 183
2844 183 52 -198 -33 197 -12 -222 27 200 -67 -201 70 176 -110 -217 153 156 -162 -139 151 149 -198 -118
2866 -118 235 52 -196 -51 215 52 -264 31 235 -59 -195 46 217 -84 -238 159 151 -145 -145 116 170 -199
2888 -199 -121 200 40 -165 -76 181 51 -255 22 184 -52 -146 15 197 -68 -189 128 112 -92 -113 97 129
2910 129 -154 -72 164 43 -111 -51 146 43 -167 27 121 -33 -108 33 115 -48 -123 64 70 -72 -78 56 72 -94
2934 -94 -74 91 28 -91 -18 50 14 -83 -26 86 -22 -62 25 46 10 -74 39 65 -63 -9 15 27 9 -72 72 14 -62
2961 -62 44 -16 47 -35 -53 71 -62 -15 1 -34 53 -79 9 50 -87 50 -42 -4 35 -99 82 -45 -28 80 -95
2986 -95 95 -40 -32 96 -123 91 4 -60 105 -97 78 -1 -89 157 -101 37 51 -89 139 -154 55 101 -169
3009a69K80j94J31J7k59L87k53n7K19k20K69k88N6L07m26K27k7k4J70m30M43m4
3031A15l24L36k17K52k04k04N85m67K5J77j23K88n45L18L00n80L26j27J91l3m99
3052d10P34k66l05L22j62L70n14JO73o41J06P8O7K00p42O39J66o40L78j44L66
3073B76k98m32R33m92k15K88r8M04p51K84O06p99K63k3K09L6p64R01j15n42L95
3094F6j81M68n55j75R18p11L3J35J1L31q60O09L12p36M02j86L61j72n85R80m52
3115A3k43L32k05M86o96J59O66q21L29k1M2K07p57P97j07n38N37l11L67l31k51
3136c46Q40p25J17K57k56L73o37M67K41p71O07j93N6M0m44Q11n24j98N70m26L04
3157A63l84J68N06q93M87J27k52J92m64P12k57n67P75l33O0j55n5O98q71J59N21
$$ plain form
3009 -169 111 -83 48 65 -194 193 -60 -117 102 -118 151 -137 -81 226 -200 27 0 -24 146 -284 159 115
3031 115 -209 127 -90 162 -42 -246 339 -128 -103 74 -49 239 -306 12 312 -268 58 -69 122 89 -410
3052 -410 324 58 -247 75 -87 283 -231 -230 443 -198 -92 -14 53 253 -489 150 316 -324 54 -90 276
3073 276 -22 -454 479 -13 -228 60 -38 366 -385 -101 505 -294 -31 -54 155 191 -573 328 213 -329 66
3094 66 -115 353 -202 -377 541 -170 -137 -2 9 340 -520 89 401 -335 67 -119 242 70 -515 465 13
3115 13 -230 102 -103 383 -313 -154 512 -309 20 -1 41 248 -509 288 181 -357 180 -131 236 -95 -346
3136 -346 494 -231 -114 143 -113 260 -377 90 331 -440 167 -26 30 70 -374 437 -87 -285 285 -141 163
3157 163 -221 -53 453 -440 47 174 -78 114 -350 362 105 -462 313 -20 40 -115 -170 528 -343 -184 337
3178C37m46J87l90M98J25q65P36k7k20K5k28P54o05k77P54l79L6k36K25M76r38
3199d58M07L52l62O9l23O68j92o81P59j13j30j53j9O88p54n3O04l20M6l44M30
3220A21K39q19M88J39j74l2k65O85l51m17N83j49J1k55R2N21o61J20L01j78P6
3241G5l54M36Q4n50L86k2Np1k19N40l27j77L21j63J53k79R0L26m50J73N4l6J07
3264A02l33L32Nk60K25j38J42q0j55L26k21K6O3j20K16k20O8J26j90J70j43N0
3286iJ13k16J75p6j1J09j86J64l1r3J07j17J50o1j23J87j01J8l2j8J57j89L2J05
3310E4o5Pq8J21N7k02R7P0lp0o9K05p4j47J09N4j0j39N2J85j57p2R8P7p9j52J66
3337B5Q9j83j2J19P4j75n2K00rj64KJ79k0j95N8J77o8j79R6J64j06j62J35J48
$$ plain form
3178 337 -109 78 -312 186 311 -554 182 155 -65 -40 -268 486 -119 -396 358 -21 15 -221 4 480 -458
3199 -458 -51 301 -61 8 -315 353 161 -520 239 126 -4 -157 -176 512 -242 -295 309 -11 35 -309 121
3220 121 360 -459 29 168 -6 -38 -303 382 31 -386 197 48 59 -196 -104 417 -244 -124 177 -1 75
3241 75 -279 157 241 -309 77 55 60 -11 -230 310 -17 -194 127 -36 117 -162 -72 254 -196 -23 31 -5 102
3264 102 -231 101 106 -154 71 -67 75 -5 -160 166 -55 -29 34 -86 130 -90 -22 104 -86 84 -59 -9
3286 -9 104 -112 63 -13 -24 85 -101 63 32 -61 46 -71 79 18 -105 82 -19 -1 -33 -51 106 -83 -51 54
3310 54 -11 -4 -92 29 86 -116 -19 51 48 -22 -91 114 40 -107 2 56 46 -93 -41 144 -13 -85 13 90 11 -141 25
3337 25 114 -69 -81 38 112 -63 -115 85 76 -88 -86 93 73 -122 -64 113 45 -134 -38 126 20 -142 -7 141
3361A41j63j06J50J03j70p0J72P1j95k9J79Mj67mJ83j8j87M4J55o3j30N5J38o7
3385B6j43J25Q1r2r2P7J09j21n9J07L2o0p1R8N9j17pQ0J5o1m1R3Qo5j5M7M8p6
3413a5l7Q4Rn5k2M8M3j02oR2j2n9m0J08Rj11J3R5Mj28RJ50l6j30N0J22m1j45P7
3442b6J21p6j20J13R0j14q7J34Q3j47o3J43O3j74k0J49K9j84OJ80n1j41L9J46
3466I3l9j85J08J39j14j14R1J24r7j31J58O4j29n2R6R1j63k3J59j9r0m6J38K7
3490H6j76O0Q9j8o8m8J61m8j25Q8L9K1j41J9J76j34n6N5O1Rj79J23J11j57KJ4
3516c6J24p5j64K31j3j15j3N8J63k54k3K48j10o4m5J65O0l20J76J55j60m7k6K71
3540A86j61k36L16k6j11p6R2K37l77L2K79j33o7q7K58Ll84K83Q9j33o1k3L38k81
$$ plain form
3361 141 -22 -128 22 125 -45 -115 57 128 -67 -96 83 87 -80 -84 99 81 -106 -62 93 30 -100 -45 93 26
3385 26 -117 8 89 -3 -95 -18 91 -30 -89 18 50 -10 -81 17 76 -41 -48 32 47 -14 -55 38 46 -19 -34 13 61 -15
3413 -15 -52 32 41 -14 -36 12 55 -47 -53 39 27 -32 -72 36 45 -66 -53 42 46 -82 -73 77 41 -89 -39 83 42 -103 -26
3442 -26 95 19 -101 12 102 -12 -99 35 118 -29 -92 51 114 -60 -80 69 98 -86 -80 100 49 -92 -53 93
3466 93 54 -131 -23 116 2 -112 -21 103 6 -125 33 97 -32 -84 12 103 -60 -83 76 57 -33 -79 59 86
3490 86 -90 -30 59 41 -27 -75 86 38 -87 1 40 61 -80 -61 115 -19 -75 -20 41 50 -129 -6 105 -52 -50 -36
3516 -36 88 13 -151 80 67 -48 -61 -3 160 -94 -117 131 21 -43 -88 77 137 -183 -7 148 -12 -59 -85 186
3540 186 25 -211 105 79 -32 -108 -16 221 -156 -124 155 22 -45 -132 126 129 -255 28 117 -16 -77 -100 238 -43
3564d3j63L69j12q8r6J88J70m59K04K09j95l3q2L25j39l13M00n1j41l7O7K70m31
3587a81L6L68k61j8n9K32J1m33L90O4k51L8JK74l11j28M64k48q6N0J06J21m55
3610b76K88K32l73Q8J0K01j79k68N16j64k32J50N0J50m18J31L92m17K3J01J14
3631A19p8l61M90ll97K11N1J25l10l3N15m08j01K31L0Pl72L77J73n07K10J12M4
3654A25j88j75N55k94k72L32J7ol29K23L52n57J06K48l7j35k41N18j01m54L52
$$ plain form
3564 -43 -206 163 51 -37 -133 55 225 -234 -30 179 -16 -49 -131 194 55 -258 142 91 -50 -87 -20 250 -181
3587 -181 -145 223 -38 -56 -115 117 128 -305 85 149 -102 -64 -63 211 -100 -228 236 -12 -98 -48 58 179 -276
3610 -276 12 244 -129 -41 -31 170 -9 -277 239 75 -157 -7 43 193 -225 -94 298 -119 -96 5 119
3631 119 41 -320 170 167 -230 -19 32 157 -153 -186 329 -79 -180 51 81 88 -284 93 266 -241 -31 81 125
3654 125 -63 -238 317 23 -249 83 100 94 -235 -12 340 -217 -111 137 100 -35 -276 242 141 -313 39
$$ [...]
8190ek3
8191b8
##END NTUPLES=NMR FID
##END=
