##TITLE=1H_ES-aq-EG-st
 
 8 sc, 
 14.1.2022
##JCAMPDX= 6.0         $$ Bruker NMR JCAMP-DX V2.0
##DATA TYPE= NMR FID
##DATA CLASS= NTUPLES
##ORIGIN= UXNMR, Bruker Analytische Messtechnik GmbH
##OWNER= root
$$ XWIN-NMR		Version 3.5
$$ Fri Jan 14 14:00:08 2022 Russian Standard Time (UT+4h)  she@DPX200
##.OBSERVE FREQUENCY= 200.131346
##.OBSERVE NUCLEUS= ^1H
##.DELAY= (6, 6)
##.ACQUISITION MODE= SIMULTANEOUS
##.ACQUISITION SCHEME= undefined
##.AVERAGES= 8
##.DIGITISER RES= 18
##SPECTROMETER/DATA SYSTEM= spect
##.PULSE SEQUENCE= zg30
##.SOLVENT NAME= CDCl3
##.SHIFT REFERENCE= (INTERNAL, CDCl3, 0, 15.7039)
##AUDIT TRAIL= $$ (NUMBER, WHEN, WHO, WHERE, WHAT)
$$ ##TITLE= Audit trail, XWIN-NMR		Version 3.5
$$ ##JCAMPDX= 5.01
$$ ##ORIGIN= Bruker BioSpin GmbH
$$ ##OWNER= she
$$ F:/spectra/data/she/nmr/H-F/1/audita.txt
$$ ##AUDIT TRAIL=  $$ (NUMBER, WHEN, WHO, WHERE, WHAT)
(   1,<2022-01-14 13:59:15.26 +0400>,<she>,<DPX200>,
      <created by zg, POWCHK disabled, PULCHK disabled
       configuration hash MD5:
       00 E9 B6 7A A2 85 ED C7 34 08 36 98 17 FE 4E 26
       data hash MD5: 16K
       89 F9 30 37 78 6A ED 6F DB 7E A7 E2 1C 15 DF 23>)
$$ ##END=
$$ 
$$ hash MD5
$$ 9F 3B 9C 69 91 D7 12 70 D5 86 57 F9 DC FC 41 C5
##$RELAX= 
##$RELAX= 
##$RELAX= 
##$RELAX= 
##$RELAX= 
##$RELAX= 
$$ Bruker specific parameters
$$ --------------------------
##$DU= <F:/spectra>
##$EXPNO= 1
##$NAME= <H-F>
##$PROCNO= 1
##$TYPE= <nmr>
##$USER= <she>
##$AMP= (0..31)
100 100 100 100 100 100 100 100 100 100 100 100 100 100 100 100 100 100 
100 100 100 100 100 100 100 100 100 100 100 100 100 100 
##$AQSEQ= 0
##$AQ_mod= 1
##$AUNM= <au_zg>
##$AUTOPOS= <>
##$BF1= 200.13
##$BF2= 200.13
##$BF3= 200.13
##$BF4= 200.13
##$BF5= 200.13
##$BF6= 200.13
##$BF7= 200.13
##$BF8= 200.13
##$BYTORDA= 1
##$CFDGTYP= 0
##$CFRGTYP= 5
##$CHEMSTR= <none>
##$CNST= (0..31)
1 1 145 1 1 1 1 1 1 1 1 1 1 1 1 1 1 1 1 1 1 1 1 1 1 1 1 1 1 1 1 1 
##$CPDPRG= <>
##$CPDPRG1= <>
##$CPDPRG2= <>
##$CPDPRG3= <>
##$CPDPRG4= <mlev>
##$CPDPRG5= <mlev>
##$CPDPRG6= <mlev>
##$CPDPRG7= <mlev>
##$CPDPRG8= <mlev>
##$CPDPRGB= <>
##$CPDPRGT= <>
##$D= (0..31)
0 1.2 0 0 0 0 0 0 0 0.06 0 0.03 0 0 0 0 0.0002 0 0 0 0 0 0 0 0 0 0 0 0 
0 0 0 
##$DATE= 1642154354
##$DBL= (0..7)
120 120 120 120 120 120 120 120 
##$DBP= (0..7)
150 150 150 150 150 150 150 150 
##$DBP07= 0
##$DBPNAM0= <>
##$DBPNAM1= <>
##$DBPNAM2= <>
##$DBPNAM3= <>
##$DBPNAM4= <>
##$DBPNAM5= <>
##$DBPNAM6= <>
##$DBPNAM7= <>
##$DBPOAL= (0..7)
0.5 0.5 0.5 0.5 0.5 0.5 0.5 0.5 
##$DBPOFFS= (0..7)
0 0 0 0 0 0 0 0 
##$DE= 6
##$DECBNUC= <off>
##$DECIM= 32
##$DECNUC= <off>
##$DECSTAT= 4
##$DIGMOD= 1
##$DIGTYP= 9
##$DL= (0..7)
0 120 120 120 120 120 120 120 
##$DP= (0..7)
150 150 150 150 150 150 150 150 
##$DP07= 0
##$DPNAME0= <>
##$DPNAME1= <>
##$DPNAME2= <>
##$DPNAME3= <>
##$DPNAME4= <>
##$DPNAME5= <>
##$DPNAME6= <>
##$DPNAME7= <>
##$DPOAL= (0..7)
0.5 0.5 0.5 0.5 0.5 0.5 0.5 0.5 
##$DPOFFS= (0..7)
0 0 0 0 0 0 0 0 
##$DQDMODE= 0
##$DR= 18
##$DS= 0
##$DSLIST= <SSSSSSSSSSSSSSS>
$$ [...]
##$SUBNAM2= <"">
##$SUBNAM3= <"">
##$SUBNAM4= <"">
##$SUBNAM5= <"">
##$SUBNAM6= <"">
##$SUBNAM7= <"">
##$SUBNAM8= <"">
##$SUBNAM9= <"">
##$SW= 18.0517287032376
##$SWIBOX= (0..15)
0 0 2 0 0 0 0 0 0 0 0 0 0 0 0 0 
##$SW_h= 3612.71676300578
##$TD= 16384
##$TD0= 1
##$TE= 0
##$TE2= 300
##$TE3= 300
##$TEG= 300
##$TL= (0..7)
0 120 120 120 120 120 120 120 
##$TP= (0..7)
150 150 150 150 150 150 150 150 
##$TP07= 0
##$TPNAME0= <>
##$TPNAME1= <>
##$TPNAME2= <>
##$TPNAME3= <>
##$TPNAME4= <>
##$TPNAME5= <>
##$TPNAME6= <>
##$TPNAME7= <>
##$TPOAL= (0..7)
0.5 0.5 0.5 0.5 0.5 0.5 0.5 0.5 
##$TPOFFS= (0..7)
0 0 0 0 0 0 0 0 
##$TUNHIN= 0
##$TUNHOUT= 0
##$TUNXOUT= 0
##$USERA1= <user>
##$USERA2= <user>
##$USERA3= <user>
##$USERA4= <user>
##$USERA5= <user>
##$V9= 5
##$VALIST= <valist>
##$VCLIST= <CCCCCCCCCCCCCCC>
##$VD= 0
##$VDLIST= <DDDDDDDDDDDDDDD>
##$VPLIST= <PPPPPPPPPPPPPPP>
##$VTLIST= <TTTTTTTTTTTTTTT>
##$WBST= 1024
##$WBSW= 4
##$XGAIN= (0..3)
0 0 0 0 
##$XL= 0
##$YL= 0
##$YMAX_a= 716315
##$YMIN_a= -661440
##$ZGOPTNS= <>
##$ZL1= 120
##$ZL2= 120
##$ZL3= 120
##$ZL4= 120
##$ABSF1= 10
##$ABSF2= 0
##$ABSG= 5
##$ABSL= 3
##$ALPHA= 0
##$AQORDER= 0
##$ASSFAC= 0
##$ASSFACI= 0
##$ASSFACX= 0
##$ASSWID= 0
##$AUNMP= <proc_1d>
##$AZFE= 0.1
##$AZFW= 0.1
##$BCFW= 1
##$BC_mod= 2
##$BYTORDP= 1
##$COROFFS= 0
##$CY= 11.3945322036743
##$DATMOD= 1
##$DC= 2
##$DFILT= <>
##$DTYPP= 0
##$F1P= 2.36226072786647
##$F2P= -0.459571619588291
##$FCOR= 0.5
##$FTSIZE= 0
##$FT_mod= 4
##$GAMMA= 1
##$GB= 0.15
##$INTBC= 1
##$INTSCL= 1
##$ISEN= 128
##$LB= 0.24
##$LEV0= 0
##$LPBIN= 0
##$MAXI= 10000
##$MC2= 0
##$MEAN= 0
##$ME_mod= 0
##$MI= 1.114404
##$NCOEF= 0
##$NC_proc= 0
##$NLEV= 6
##$NOISF1= 3.799351
##$NOISF2= 2.8
##$NSP= 1
##$NTH_PI= 0
##$NZP= 0
##$OFFSET= 15.70392
##$PC= 1
##$PHC0= -15787.83
##$PHC1= 18.40079
##$PH_mod= 1
##$PKNL= yes
##$PPARMOD= 0
##$PSCAL= 0
##$PSIGN= 0
##$REVERSE= no
##$SF= 200.130013532006
##$SI= 16384
##$SIGF1= 3
##$SIGF2= 2
##$SINO= 400
##$SIOLD= 16384
##$SREGLST= <1H.CDCl3>
##$SSB= 0
##$STSI= 0
##$STSR= 0
##$SW_p= 3612.71676300578
##$SYMM= 0
##$S_DEV= 0
##$TDeff= 0
##$TDoff= 0
##$TI= <>
##$TILT= no
##$TM1= 0
##$TM2= 0
##$TOPLEV= 0
##$USERP1= <user>
##$USERP2= <user>
##$USERP3= <user>
##$USERP4= <user>
##$USERP5= <user>
##$WDW= 1
##$XDIM= 8192
##$YMAX_p= 0
##$YMIN_p= 0
$$ End of Bruker specific parameters
$$ ---------------------------------
##NTUPLES= NMR FID
##VAR_NAME=  TIME,          FID/REAL,        FID/IMAG
##SYMBOL=    X,             R,               I
##VAR_TYPE=  INDEPENDENT,   DEPENDENT,       DEPENDENT
##VAR_FORM=  AFFN,          ASDF,            ASDF
##VAR_DIM=   8192,          8192,            8192
##UNITS=     SECONDS,       ARBITRARY UNITS, ARBITRARY UNITS
##FACTOR=    0.0002768,     1,               1
##FIRST=     0,             0,               0
##LAST=      2.2672688,     0,               0
##MIN=       0,             -661440,         0
##MAX=       2.2672688,     716315,          0
$$ Real data points
##PAGE= N=1
##DATA TABLE= (X++(R..R)), XYDATA
0@%%%%%%%%%%qJ6j6J6j6K4l6M4m8N6p2Q8j04J20j38J62j88K14k46K85l25L68m16
$$ 0 0 0 0 0 0 0 0 0 0 0 -8 8 -8 8 -8 16 -20 24 -24 32 -40 48 -56 64 -74 88 -100 114 -132 153 -172 196 -220
33b20M69n31O00o70P46q37R34j035J146j271J408j556J719j893K084k299K533
$$ -220 249 -282 318 -352 394 -443 491 -544 602 -669 739 -817 902 -991 1093 -1206 1327
50A327k787L072l388L738m136M586n097N690o385P208q206R447j1028J3124j6039
$$ 1327 -1460 1612 -1776 1962 -2174 2412 -2685 3005 -3380 3828 -4378 5069 -5959 7165 -8874
65h874K0360k7419M0791p4301L00520M65238r88049j89916O92113j37219l30020
$$ -8874 11486 -15933 24858 -49443 251077 716315 -271734 -461650 230463 93244 -236776
76b36776N42531n7248q13298L04937Q96871m45124o98070M69915L03715m67865
$$ -236776 305755 248507 -564791 -259854 637017 191893 -506177 -36262 267453 -200412
86b00412J88834M41553n94015m05314Q07409L02124p66068j15905N29705j58904
$$ -200412 -11578 429975 -164040 -569354 238055 540179 -225889 -341794 187911 29007
96B9007j93282M50816j16514o71641L27168P23733m11678n73014M06131K48894
$$ 29007 -164275 286541 170027 -501614 -174446 549287 137609 -435405 -29274 219620
106B19620l56488J44964L00960m83551k39526O60104J50596o34655q007M38195
$$ 219620 -136868 8096 309056 -174495 -414021 246083 396679 -237976 -245983 192212
116A92212j85508j57847L90162j07635n36483K85263N58051l52115m24011L30448
$$ 192212 6704 -151143 239019 131384 -405099 -119836 438215 86100 -337911 -7463
126g463J60492k65313J55605J94289m23792j30334N60625O1740n31731L1034L62076
$$ -7463 153029 -112284 43321 237610 -186182 -316516 244109 305849 -225882 -194848 167228
137A67228j53086j21756K82515j06083l74460K58518L81350l12675k78745K85529
$$ 167228 14142 -107614 174901 68818 -305642 -47124 334226 21551 -257194 28335
147B8335Q2263k16099J53304J40906l53006p7028M51340K0112m18956M4805K72769
$$ 28335 110598 -105501 47803 188709 -164297 -241325 210015 230127 -188829 -144024 128745
158A28745j25549o7392K10834j28502k71315K59820K72638l02958j95085K68665
$$ 128745 3196 -64196 146638 18136 -253179 6641 279279 -23679 -218764 49901
168D9901M8080j89876J28652J02276k78387k8082L49685k9012l17997P8074J95466
$$ 49901 97981 -91895 36757 139033 -139354 -167436 182249 153237 -164760 -86686 108780
179A08780j28027k5501J76509j35239k07748K39487J99840k65747j38281K22132
$$ 108780 -19247 -44748 131761 -3478 -211226 28261 228101 -37646 -175927 46205
189D6205K7943j37990J04198M7492k17028K5332K71245p3311k46174J02947J49131
$$ 46205 74148 -63842 40356 87848 -129180 -103848 167397 94086 -152088 -49141 99990
200I9990j24662j2807J42480j17592j49792K02323J32982k21290q1191J79201
$$ 99990 -24672 -37479 105001 -12591 -162383 39940 172922 -48368 -129559 49642
210D9642l839j00004J03691J4520j88256N3247K26938r3142k02583J08772J19772
$$ 49642 45803 -54201 49490 64010 -124246 -70999 155939 62797 -139786 -31014 88758
221H8758j10421m113J06018j07231r5815J79932P3269j95422l1255J56294l0222
$$ 88758 -21663 -25776 80242 -26989 -122804 57128 130397 -65025 -96280 60014 29792
232B9792q2885R9634L323j56493N8965J78641r2615j52903R9618Q2218r0090J3753
$$ 29792 -53093 46541 49864 -106629 -47664 130977 38362 -114541 -14923 67295 -22795 -9042
244i042P4412j05370n7146J64436L5899j74587n545J37048l5685o8663Q1648n970
$$ -9042 65370 -40000 -97146 67290 103189 -71398 -76943 60105 24420 -44243 37405 31435
256C1435j18765O4956J30856r6184j07458R9922M9898q5048K7069O2504j00028
$$ 31435 -87330 -22374 108482 12298 -95160 4762 54660 -30388 -3319 59185 -40843
267d0843l9353J45604J6646j49624Q435J12436l7852m8287O8734k1061r2626P5233
$$ -40843 -80196 65408 82054 -67570 -59135 53301 15449 -32838 35896 14835 -77791 -2558
279b558R8341j02076p8098J00869L2485p9695K7525N0172q3952k1374J18233l018
$$ -2558 95783 -6293 -84391 16478 48963 -30732 -3207 46965 -36987 -58361 59872 56854
291E6854j18685K4060Q5297m4093k9616O2884k9916p6091P5516P6341r5937n8056
$$ 56854 -61831 -37771 47526 3433 -26183 36701 6785 -69306 6210 82551 -13386 -71442
303g1442R0009K1294o5049K6239L2299p0934j512R7951k2096r7578L8446O9111
$$ -71442 18567 39861 -25188 1051 33350 -37584 -39096 58855 36759 -60819 -22373 46738
315D6738m9775k1777N7623k9091o0603O7860N4812q4303l6654P6778O087n1460
$$ 46738 -3037 -24814 32809 3718 -56885 10975 65787 -18516 -55170 21608 27695 -23765
327b3765L1311J9019o5523J0632Q5194l1503q2547M2650N6903m6442j5659M5758
$$ -23765 7546 26565 -38958 -28326 56868 25365 -57182 -14532 42371 -4071 -19730 26028
339B6028k8408m1598O1964L2510p5837j6423O8126o849m4126L3836J3486n7654
$$ 26028 -2380 -43978 17986 50496 -25341 -41764 26362 19513 -24613 9223 22709 -34945
351c4945J4306O9918l2990o4669M1029M1359m0728n746L5534l1681k7922N9751
$$ -34945 -20639 49279 16289 -48380 -7351 34008 -6720 -12466 23068 -8613 -36535 23216
363B3216J8073p0411m954O1769j1838l8334L0365Q770m6082J7905N3128l5458
$$ 23216 41289 -29122 -34076 27693 15855 -22479 7886 16656 -29426 -11521 41607 6149
375F149m6906M1882K6972l9196K220L1227l2404k1206N4337J0555o1256Q64N1520
$$ 6149 -40757 1125 28097 -11099 -8879 22348 -10056 -31262 23075 33630 -27626 -26762 24758
388B4758j3495k8970K6437J288l6957K3282M0945l8675l5085M2844J8857l7582
$$ 24758 11263 -17707 8730 10018 -26939 -3657 37288 -1387 -36472 6372 25229 -12353
400a2353M401K6862k8276j4580M5356K894m9922P598M0546j7255k0388K5946l912
$$ -12353 -7952 18910 -9366 -23946 21410 24304 -25618 -18020 22526 5271 -15117 10829 6917
413F917l2254K5078L3560l7565k7524L9359J3720l2114N407J9718k4780o420L8565
$$ 6917 -25337 -259 33301 -4264 -31788 7571 21291 -10823 -5416 14302 -10478 -16898 21667
426B1667n134m1980J3933L3682k0362j6240K4860m793k7030K2920K5625l3283
$$ 21667 16533 -25447 -11514 22168 1806 -14434 10426 5633 -21397 1523 27148 -6135
438f135j9054L3901P060k6218Q552J3921k3989j147L4610r211l6602J5985K8786
$$ -6135 -25189 8712 15772 -10446 -1894 12027 -11962 -13109 21501 12290 -24312 -8327 20459
451B0459j9525j3215K0722n382j9983K1368J6971l0409j0725L0609J073k3160
$$ 20459 934 -12281 8441 3059 -16924 4444 21415 -8994 -19719 10890 11963 -11197
463a1197J0748J1482k2073N28K9391r926k9760J5421K2190j7321q395J6724p643
$$ -11197 -449 11033 -11040 -10512 18879 8953 -20807 -5386 16804 -517 -8912 7812 169
476A69j4646K1326J1139k8711n860K8119j380k0623R924R241j7933K350K2836
$$ 169 -14477 6849 17988 -10723 -16583 11536 10156 -10467 -543 8698 -9235 -6885 15951
489A5951j1216k2388J6014J5740j6894m281J5132q865j1983J9872P997k5338l214
$$ 15951 4735 -17653 -1639 14101 -2793 -7074 8058 -807 -12790 7082 15079 -10259 -13473
502a3473K3864k520j6370Q892N517j4651N274J8030j3208j7331J6882J1903j6583
$$ -13473 10391 7871 -8499 393 5910 -8741 -3467 14563 1355 -15976 906 12809 -3774
515c774k619J3466p939r155J6702M535k0872R0J9145m722j2306R320K670j3198
$$ -3774 -6393 7073 -866 -10021 6681 11216 -9656 -9566 9579 4857 -7449 1871 4541 -8657
529h657O740J5187j3343j4065J5850R285j4477j524J0457p196n483J4385P46j7762
$$ -8657 -1917 13270 -73 -14138 1712 10997 -3480 -5004 5453 -1743 -7226 7159 7905 -9857
543i857L300J6179o659j0189R427J808j1417O305J2011j1899j0336J3719O037
$$ -9857 -6557 9622 2963 -7226 2201 4009 -7408 -1103 10908 -991 -11327 2392 8429
556H429j1990M06P893p507l028J3225j288j5749M542J4043o707q582Q051J094
$$ 8429 -3561 -3155 4738 -2769 -5797 7428 6140 -9609 -5067 8976 2269 -6313 1738 2832
570B832q681O137Q361j1092o547J2611K974j0779J984O819p353k145J1483j887
$$ 2832 -5849 288 8649 -2443 -8990 3621 6595 -4184 -2200 4619 -2734 -4879 6604 4717
584D717j2984M664J1073o136o137O676m01o603O646N831j0734m226J1732J504
$$ 4717 -8267 -3603 7470 1334 -4803 1873 1472 -5131 1515 7346 -3388 -7614 4118 5622
598E622r691K102N729n988j123Q881k739r800N213Q083o249l994O249j401n553
$$ 5622 -4069 -1967 3762 -2226 -3349 5532 2793 -7007 -1794 6289 40 -3954 2295 894 -4659
613d659O419M454r591k866J0030O71p856K085L998n009L95P123l918p678N934
$$ -4659 1760 6214 -3377 -6243 3787 4458 -3398 -1313 2685 -2324 -1929 5194 1276 -6402 -468
628d68O226o407k946N766j408m465N437K905p894j231Q070o14o045K670K551m682
$$ -468 5758 -649 -3595 2171 763 -3702 1735 4640 -3254 -4485 3585 2971 -3074 -404 2147 -2535
644b535J273O044m212o269N681M948n618k240M540j365k874M716J179o708K97
$$ -2535 -1262 4782 570 -5699 -18 4930 -688 -2928 1612 247 -2627 2089 3268 -3440 -3143
659c143O833j654n091K987K020m145J288M873l838m720N013L451m784j111L569
$$ -3143 3690 2036 -3055 -68 1952 -2193 -905 3968 130 -4590 423 3874 -910 -2021 1548
674A548j886j845M579K04o122J047O054j980m375K710J568l237J427L471l750
$$ 1548 -338 -2183 2396 2600 -3522 -2475 3579 1599 -2776 -66 1502 -1735 -308 3163 -587
689e87l120M767K031m440j93L149k021j479M051j01n125J214M880j886l304K287
$$ -587 -3707 1060 3091 -1349 -1542 1607 -414 -1893 2158 2057 -3068 -1854 3026 1140 -2164 123
705A23P98k480J832K473l807k117M583J317m157M8K785j708j037L171n10l990
$$ 123 921 -1559 273 2746 -1061 -3178 1405 2722 -1435 -1387 1398 -310 -1347 1824 1314 -2676
721b676J612L702k163k349K344K30k261J930K053l510j650M070R05l492J80K092
$$ -2676 -1064 2638 475 -1874 470 700 -1561 369 2422 -1088 -2738 1332 2237 -1255 -1075 1017
737A017j438m34K634j062l226J990L021k348j931K264K20j940J579J521k874j019
$$ 1017 -421 -855 1779 717 -2509 -519 2502 154 -1777 487 707 -1233 346 1867 -1007 -2026
753b026L286L67k775M74J553j446q8K314j173k762J922K547k097j607J824J80
$$ -2026 1260 1627 -1148 -674 879 -567 -655 1659 486 -2276 -354 2193 96 -1511 313 493
769D93j386J373Q57k492l46K862j56k433P51J371j389q4J956j037k184J687J901
$$ 493 -893 480 1337 -1155 -1501 1361 1205 -1228 -477 894 -495 -579 1377 340 -1844 -157 1744
786A744j806j065J504j23r98J379M60k278m0K555l20k139O67J187j062kJ375j010
$$ 1744 -62 -1127 377 254 -744 635 1095 -1183 -1223 1332 1012 -1127 -460 727 -335 -337 1038 28
804B8j508J629J236j669o32J345k62q47J227L27j892N0K089l64j651N86P86q03
$$ 28 -1480 149 1385 -284 -916 429 167 -680 547 874 -1018 -968 1121 757 -894 -308 478 -325
822c25K49R98j131j066J620R05j608m78J253k16o93R49J20j438K68J562n10j251
$$ -325 -76 922 -209 -1275 345 1250 -358 -836 417 201 -492 457 577 -861 -593 969 459 -792
840g92O93N12p88L46Q60j051q73J400P34j352l58R57j89m09P51j16j172M79J293
$$ -792 -99 413 -375 -29 831 -220 -1093 307 1041 -311 -669 288 99 -310 441 325 -847 -368 925
859I25o63j029P14M44o60K29O61q32n96J142M44j094j48P38k64k40P09j98j058
$$ 925 262 -767 -53 391 -269 -40 621 -211 -807 335 779 -315 -463 275 11 -229 480 282 -776
878g76M90J121n99r03N79L99m92K16L91p30l09J026J70r52j9O79k65k74N98j50
$$ -776 -286 835 236 -667 -88 311 -181 35 426 -304 -613 413 583 -369 -388 291 26 -248 350 200
898B00q06M09Q64n04o64M47K65l57K42K76o95j97R24J25q81MO12j98k13L92j64
$$ 200 -606 -197 667 163 -501 -54 211 -146 96 372 -323 -520 404 529 -352 -348 264 66 -147 245 81
919H1n50M06O23n15m71M45J67l41K27K29n66j56P41Q9p02k0M80j20j16K81k19
$$ 81 -469 -63 560 45 -426 19 186 -155 72 301 -265 -421 320 409 -293 -313 167 47 -69 212 -7
940gm31M39M99n06l81M15J87l18J37J61m01o5N70k8n18O3L38j39p6K68j97l51
$$ -7 -438 1 500 -6 -387 28 215 -103 34 195 -206 -271 299 271 -247 -184 154 15 -61 207 10 -341
962c41L66L93m14l35L32J39j65P5N4l27L8M68p7m60R0L39j50r3J95j48k36L01
$$ -341 25 418 4 -331 1 140 -25 50 104 -223 -185 283 206 -254 -164 175 25 -68 127 -21 -257 44
984D4K61l15k13K43Q7j17Q2J0k80O5L99r1m01J06K55p3q7J09j38j24K75J34k96
$$ 44 305 -10 -223 20 107 -10 72 82 -198 -133 266 175 -226 -120 135 62 -25 84 -54 -178 97 231 -65
1007f5j07K32K4j26Q4nk06O8K98q0l00P1J90n4k2O6j68n5K55R4k86q6K36L1j08
$$ -65 -172 60 84 -42 42 37 -169 -101 197 117 -183 -112 78 24 2 68 -100 -155 100 194 -92 -178 58 89 -19
1032a9O0k4j31Q2K17j22k11J07J12o8QN7j39p1K39O5k38p3J79K4o4M0m8j21J39
$$ -19 41 17 -114 -32 185 63 -148 -41 71 3 11 68 -71 -142 97 162 -76 -149 30 54 -10 30 -18 -139 0
1057@J61j52j63J24J15q7qM4r3k3J68J7j71k9J39jn0N3n3r8J21J31j15j57R0J26
$$ 0 161 9 -154 -30 85 -2 -10 34 -59 -82 86 103 -68 -97 42 41 -9 44 -9 -107 14 145 30 -127 -37 89
1083H9o6l0K8p6OJ40Kj87K0J27j5o3N4m6p9Q2J27j05j05P1O8l8j0J6q1J7J45j0
$$ 89 23 -7 21 -55 -49 91 93 -94 -74 53 38 -25 29 -17 -96 -14 113 8 -97 -26 42 4 -6 10 -71 -54 91 81
1111H1j53J9J03J4o9J7k0m3R1O7j07p2P3O5o1NK9q6kJ28k1j34K3P8lk4Mk5m2O3
$$ 81 -72 -53 50 64 -5 12 -8 -51 40 107 0 -72 1 66 5 10 39 -47 -49 79 58 -76 -53 25 22 -2 2 -23 -65 -2
1141bP9r6q3J12M8o0j1K5l2lQ4jj05OP7rk0Jk1l0P1M9q0p7Q0M6l5k0Nl2J1P7l4
$$ -2 77 -19 -102 10 58 -2 -13 12 -20 -23 61 60 -45 -39 38 29 9 10 -11 -41 30 79 -1 -78 2 48 13 -7 -2 -34 -23 54 20
1174B0r6M1P5l3k4PNm9N6L9o7k5O3Rk8nPl1J0P1j9r2L6P0pl4Oj1lL6J0n3l5P8
$$ 20 -76 -35 40 7 -17 -10 -5 -54 2 41 -26 -51 12 21 -7 -12 -5 -36 -26 45 26 -66 -30 40 33 -1 5 -6 -9 27 37 -16 -51 27
1208B7Jm1J0okMM1j2q0K1O1l0j7J9rj4K6K9o4oM2M0m4j6J8j9K4L0j5m9L4L3l2
$$ 27 28 -13 -3 -9 -11 -7 34 22 -58 -37 24 -6 -23 -4 -13 -27 -1 28 -36 -42 0 40 -4 -20 -2 -21 3 33 18 -31 3 36 4
1241Dp%pj6M5J7m3l0N1Mj9Mj0j8K4K5k2m6L4L0j9l1L2j2MK1rj6k3M6J4l4KmoK8
$$ 4 -3 -3 -10 -26 19 36 -7 -37 14 18 -1 3 -7 -25 -1 24 2 -44 -10 20 1 -30 2 -10 -6 15 6 -10 -33 13 27 -7 -5 -9 -15 13
1277A3K5k7m7J6N1j1l3L2k0rK4J6l7oM0j0l8K5j1mKK7k8k5K2K8j7j2J3j1RJ9p
$$ 13 38 11 -36 -20 31 20 -13 19 -1 -10 14 30 -7 -13 27 17 -21 4 -7 -11 -9 18 -10 -35 -13 15 -2 -14 -1 -12 -3 16 9
1310Ik8rM1J5m5jMNJ0J6j3k2J2L1j0l4K1Nj2K7j4l2kK1J3j4j9K0LoK2l3qJ3K3
$$ 9 -19 -28 13 28 -17 -18 -14 -9 1 17 4 -18 -6 25 15 -19 2 7 -5 22 8 -24 -26 -5 8 -6 -25 -5 -2 -8 14 -19 -27 -14 9
1345Ij8nJ2oqK4nk3LK5JplNKLjrknK3J2l1jJ9j8J2qrkK3kl2PL0k7kK0rk0K5Jq
$$ 9 -9 -14 -2 -8 -16 8 3 -20 -17 8 9 2 -1 4 6 9 8 -1 -3 -8 15 27 -4 -5 14 -4 8 0 -9 -11 12 10 -22 -15 15 -12 -14 6 -3 -23 2 3 -5
1388ej5J5J2k4L2pk4%J6Ok2J7kJ8mk6J4j1K5Klj4lJ8j3jnk0J2L1mk4nRJ1pPNj7
$$ -5 -20 -5 7 -17 15 8 -16 -16 0 6 -16 1 -1 17 13 -13 1 -10 15 17 14 0 -3 15 2 1 -4 -24 -12 19 15 -9 -14 -5 6 -1 6 11 -6
1427fJ9j3QqKQpoJ5j1JMRr%kJ7j6J2KppJ7j8Pq%J3j2J4l9J2Oqmj1K1Mn%mOOQk0
$$ -6 13 0 8 0 2 10 3 -3 12 1 2 6 15 6 6 4 21 5 17 19 12 5 22 4 11 3 3 16 4 18 -21 -9 -3 -11 -15 -26 -5 -1 -6 -6 -10 -4 2 10 -10
1472a0OJj2J5Rj3j2J2J7lj8J5qNmLnPjKqPkmJ2rj8KJ3nlj4JJ6%jMmlQORj4Lj9
$$ -10 -4 -3 -15 0 9 -4 -16 -4 13 10 -8 7 -1 4 0 3 -2 5 4 6 -2 5 3 -1 11 2 -16 -14 -1 -6 -9 -23 -22 -6 -6 -7 -3 -7 -10 -2 4 13 -1 2 -17
1517a7J5Pk0J1J9kpkOoQpJkKqJj1J0J3Mj5KjrJ7%j8qJ3NqmjJ6nmonJ2Oj5J6Pj4
$$ -17 -2 5 -15 -4 15 13 6 4 10 4 12 5 6 4 6 -2 -1 -12 -2 11 15 0 2 1 -8 9 9 -9 -17 -4 1 -7 -11 -12 4 -1 -5 -11 -16 -4 2 -13 3 10 -4
1562dJ3Oj3kJ4Mj4J2j6Rpj2K4jlOj4MkqoJ4Opk3J1MOJrQoQj6MJ%J4JoqpKK0j1
$$ -4 9 15 2 0 14 18 4 16 0 9 2 -10 14 13 10 16 2 6 4 -4 -10 4 10 3 -20 -9 -5 1 2 -7 1 -5 3 -13 -9 -8 -8 6 7 1 -7 -14 -12 8 -3
1607cnKK0rJK%qorJ4PJ1j6jJ0mmnnmOj1J0mkNjmLOj2nK1mlJ0n%jL%rJ6KjMJp%
$$ -3 -8 -6 14 5 6 8 8 0 -6 -15 -1 6 17 1 0 10 6 2 -3 -8 -12 -6 -17 -7 -11 -13 -8 -9 -13 -10 -4 -16 -21 0 -4 -7 3 -2 -2 -3 0 0 -9 7 9 8 12 13 6 6
1657FJnNj2oJ1%M%k5ROLpoJ3j0NkOj6PPJo%%%J0RroJ3qj5KL0%k2NOPqpOkNpJ5
$$ 6 7 2 7 -5 -11 0 0 4 4 -21 -12 -6 -3 -10 -16 -3 -13 -8 -10 -4 -20 -13 -6 -5 -11 -11 -11 -11 -1 8 -1 -7 6 -2 -17 -15 15 15 -7 -2 4 11 3 -4 2 0 5 -2 13
1706A3k7KPoMqmK3j5%jMpJ3j2K2j2rK3j6Nm%PjJ2j0Jj2PNj2K7j1qRJ1j8nkKj1
$$ 13 -14 -12 -5 -11 -7 -15 -19 4 -11 -11 -12 -8 -15 -2 -14 8 -4 -13 10 -6 -1 -5 -5 2 1 13 3 4 -8 -1 4 -8 19 8 0 9 20 2 -3 -5 -3 -14
1748a4J4j1J3LqJ0nmmj2K2j0JoRjOl%Okj1J3jPQk5J2kj7L4j6j1R%j1NMrj3J4j0
$$ -14 0 -11 2 5 -3 7 2 -2 -6 -18 4 -6 -5 -11 -2 -3 3 0 0 6 4 -7 6 5 12 20 -5 7 5 -12 22 6 -5 4 4 -7 -2 2 -7 -20 -6 -16
1790a6J4lMkkj5MJ7j7Rj0O%J2j5P%jJ7j7QjM%lMKlJj6NJJ8qj6KQRKj8lJ0Lj1l
$$ -16 -2 -5 -1 -3 -5 -20 -16 1 -16 -7 -17 -11 -11 1 -14 -7 -7 -8 9 -8 0 -1 3 3 0 4 6 3 4 -12 -7 -6 12 4 -12 -10 -2 7 9 -9 -12 -2 1 -10 -13
1835a3OJ0k6J2mjRnlO%J5k0J0jMoJ1M%pJ3Omj6J5j2OnkmMKRk1RmlJ1%j1j9K8k3
$$ -13 -7 3 -23 -11 -15 -16 -7 -12 -15 -9 -9 6 -14 -4 -5 -1 -7 4 8 8 1 14 20 16 0 15 3 9 4 2 -2 2 4 13 -8 1 -3 -6 5 5 -6 -25 3 -20
1879b0J9k0K4j7J6kO%j7RlJJ4mpnKKJ0%Oo%llmMlMNMj4qJ8jj1LKnKj2lJ0PKj3
$$ -20 -1 -21 3 -14 2 0 6 6 -11 -2 -5 -4 10 6 -1 -6 -4 -2 8 8 14 8 8 5 2 -2 2 -1 3 8 12 -2 -10 8 7 -4 -1 1 -4 -2 -14 -17 -7 0 2 -11
1925a1J2J4k8J3nK5j6mRoJ1j6J8kjJ2k6PnLjkJ5j0J%j1J6qlQj2oJ0Lnj4KONjn
$$ -11 1 15 -13 0 -5 20 4 0 9 3 14 -2 16 14 13 25 -1 6 1 4 3 1 16 6 7 7 -4 12 4 1 9 -3 -9 1 4 -1 -15 -13 -7 -2 -3 -8
1967hJ5rJJqLJ1Kkj1J7j1QJ0j3Rj9O%%lJ3pnj9L1mKmm%j0kJ7j3J9j4L%kmoJ2K
$$ -8 7 -2 -1 0 -8 -5 6 8 6 -5 12 1 9 19 6 15 -4 2 2 2 -1 12 5 0 -19 12 8 10 6 2 2 -8 -10 7 -6 13 -1 2 2 0 -4 -10 2 4
2011DlrNQPlNllPpj2RK0j4Opj9J3%ojNkLjj6PKnJ2k2K1Kj6J2j3J3Pj5J0nJ5j6
$$ 4 1 -8 -3 5 12 9 14 11 8 15 8 -4 5 25 11 17 10 -9 4 4 -2 -3 2 0 3 2 -14 -7 -5 -10 2 -20 1 3 -13 -1 -14 -1 6 -9 1 -4 11 -5
2055eNmJ3k0K9nj8N%NMlK6l4J8rj3JNJ1j4J3%j5JLj4J0kMJKjJ0rqM%J6j9J6m%
$$ -5 0 -4 9 -11 18 13 -5 0 0 5 9 6 32 -2 16 7 -6 -5 0 11 -3 10 10 -5 -4 -1 -15 -5 -7 -3 -2 0 -1 9 0 -8 -4 -4 12 -7 9 5 5
2098EJ%LoK9k6LqJ1lmOj3NqJ0Qj4pkJ0mpPMLj2jJ0Kj9QmnK6j3JMPlJ0rMmoLkN
$$ 5 6 6 9 3 32 6 9 1 12 9 5 11 -2 3 -5 5 13 -1 -8 -10 0 -4 -11 -4 0 3 -9 -10 0 2 -17 -9 -13 -18 8 -5 -4 0 7 4 14 5 9 5 -1 2 0 5
2146EOj8J3j4JK0j9PJ3j0Jj0plJ6%j4Oj1JJ3LOnk2RK4j2jmK3j3JJ0k2PJ5pK1j7
$$ 5 11 -7 6 -8 -7 13 -6 1 14 4 5 -5 -12 -15 1 1 -13 -7 -18 -17 -4 -1 5 0 -22 -13 11 -1 -2 -6 17 4 5 15 -7 0 15 8 29 12
2186A2oRpoJ5oJ1k0LR%ojj2MLMLopjJ0j5jJ7rOqMomJJ7Kj8K5j4J4j6J5mJ1lj2
$$ 12 6 15 8 2 17 11 22 2 5 14 14 8 7 -5 -1 2 6 9 3 -4 -5 5 -10 -11 6 -3 3 -5 -1 -7 -11 -10 7 9 -9 16 2 16 0 15 11 22 19 7
2230GlPjjp%Mj1oJ8KJj6%%LqJ0lkMJ3k2J3Pj1j1K3l%pRj3MMqK2j2J0rJ5j8Qj5
$$ 7 4 11 10 9 2 2 6 -5 -11 7 9 10 -6 -6 -6 -3 -11 -1 -4 -6 -2 11 -11 2 9 -2 -13 10 7 7 0 9 -4 0 4 -4 18 6 16 7 22 4 12 -3
2274cjK5k2lJ2j8K1j6QlnLM%qJ1j7J1Mj0pJ5Pj9K0mJmLkKkrJ8Kj0J5kj1JlNj8
$$ -3 -4 21 -1 -4 8 -10 11 -5 3 0 -5 -2 2 2 -6 5 -12 -1 3 -7 -14 1 8 -11 9 5 6 2 5 3 5 3 -6 12 14 4 19 17 6 7 4 9 -9
2317iJ4jmKJ4lj6K2j5j1J0Nj7OLrOlJ6kj6OJ3mJ0rj4K4j1%J8j0j6KjJ3okJ8k3
$$ -9 5 4 0 2 16 13 -3 19 4 -7 3 8 -9 -3 0 -9 -3 -6 10 8 -8 -2 11 7 17 8 -6 18 7 7 25 15 -1 1 0 13 7 5 23 0
2357@KJqJ9j7K1k2j%OpJ0j0J4j2j0nJ1NLPrOOLoknMMqORpJ4k2J4NnQk9L4j7qJ2
$$ 0 2 3 -5 14 -3 18 -4 -5 -5 1 -6 4 -6 8 -4 -14 -19 -8 -3 0 7 -2 4 10 13 7 5 0 4 8 0 6 15 8 22 0 14 19 14 22 -7 27 10 2 14
2402A4j9J4kplNmQjj1kpJ0J1Mj4j%NjoJ4jRqrNmJ1qJ1jKJK%pKNpPk2JJ1jj2Pj6
$$ 14 -5 9 7 0 -3 2 -2 6 5 -6 -8 -15 -5 6 10 -4 -5 -5 0 -1 -7 7 6 15 7 -2 3 -1 10 2 13 12 14 15 17 17 10 12 17 10 17 -5 -4 7 6 -6 1 -15
2450a5J3pJ0kmjqKnL5j5qPnLLNkpL%J4j6kLQLnJj0oK0Jj3pQN%j6K5j1nNlpPj6
$$ -15 -2 -9 1 -1 -5 -6 -14 -12 -17 18 3 -5 2 -3 0 3 8 6 -1 2 2 16 0 -2 1 9 12 7 8 -2 -8 12 13 0 -7 1 6 6 -10 15 4 -1 4 1 -6 1 -15
2497a5J1NoJ6jojJoPrJ6mnPj1J1Nj8J3koRLj1JJjMJ2k1Rj7L0j0Jj2kR%JKkk2J2
$$ -15 -4 1 -5 11 10 4 3 4 -2 5 -4 12 8 3 10 -1 10 15 -3 10 8 2 11 14 3 4 5 4 8 20 -1 8 -9 21 11 12 0 -2 7 7 8 10 8 -14 -2
2542bJ%mnJ2KJqJ1jQk2J2J6m%rknK4j1j4K9j3j6KqLMqJ1mmMoJmK1j5jJ2%rkJ3
$$ -2 -1 -1 -5 -10 2 4 5 -3 8 7 15 -7 5 21 17 17 8 6 1 25 14 0 29 16 0 2 -6 -3 1 -7 4 0 -4 0 -6 -5 -9 12 -3 -4 8 8 -1 -3 10
2587A0j0K2j7J1k2K0%jqQnj1K1rJ1pOj1Nj4KLRj2LPo%%%rNKOj6PJ1j3jkRmKKk
$$ 10 0 22 5 16 -6 14 14 13 5 13 8 -3 18 9 20 13 19 8 13 -1 1 4 13 1 4 11 5 5 5 5 -4 1 3 9 -7 0 11 -2 -3 -5 4 0 2 4 2
2632BPj1OJ6qQj3Qlj3J3Oj6Lj0K1j9J0%Jj2rJ3OpqJ1j0nRj1QJ8j3Pj9J0j2J3j0
$$ 2 9 -2 4 20 12 20 7 15 12 -1 12 18 2 5 -5 16 -3 7 7 8 -4 -13 0 6 -1 -9 2 -8 -13 -4 -15 -7 11 -2 5 -14 -4 -16 -3 -13
2672a3J4J5j3J6j5LNOj1%qJ2j4RpQlj1K0j6J6nk9K1pJ0j1LKKjNj2kJ9j3lJ6j6
$$ -13 1 16 3 19 4 7 12 18 7 7 -1 11 -3 6 -1 7 4 -7 13 -3 13 8 -21 0 -7 3 -8 -5 -3 -1 -2 3 -9 -11 8 -5 -8 8 -8
2711hkK2Kj5QoK3j1j6PJ0nkKkkpQMLrj3OPmRpoJ1oNoNJj7J7rKRk3J2NJ0Oj0Ml
$$ -8 -10 12 14 -1 7 1 24 13 -3 4 14 9 7 9 7 5 -2 6 10 13 4 -9 -3 4 0 9 2 -4 7 1 6 0 5 6 -11 6 -3 -1 8 -15 -3 2 12 18 8 12 9
2758I%llkJ6kLj7mRPj0OrMj1OOomMJ0k0LK0qj8J8pnK1rMj3lMPM%loRQkj6QPrR
$$ 9 9 6 3 1 17 15 18 1 -3 6 13 3 9 0 4 -7 -1 5 -1 -5 -1 9 -11 -8 12 4 -14 4 -3 -8 13 4 8 -5 -8 -4 3 7 7 4 -2 7 15 13 -3 5 12 3 12
2807A2nqQnRpJ9j5%Kkn%J0j4Kq%jmKQJ%JOrKK5l5J1J6Lj9J3ojmjKlJ5j4PNj6J5
$$ 12 7 -1 7 2 11 4 23 8 8 10 8 3 3 13 -1 1 -7 -7 -8 -12 -10 -2 -1 -1 0 6 -3 -1 24 -11 0 16 19 0 13 7 6 2 1 3 0 15 1 8 13 -3 12
2854A2okLj0j0LNkqNJ3lmJ1mmJ2oomKRNoMj2lJ1MoJ0Oj9J1%qPJ2k0Qpj0jRj5J6
$$ 12 6 4 7 -3 -13 -10 -5 -7 -15 -10 3 0 -4 7 3 -1 11 5 -1 -5 -3 6 11 5 9 -3 -6 5 9 3 13 19 0 11 11 3 10 22 2 10 3 -7 -8 1 -14 2
2900BoJ3rpMMqOqLJ4rJ1j%j8J6j0J5j4MJ5qQKj2JP%l%%Mj4%OomkMjOj3jJ0%JJ
$$ 2 -4 9 0 -7 -3 1 -7 -1 -9 -6 8 -1 10 9 9 -9 7 -3 12 -2 2 17 9 17 19 7 8 15 15 12 12 12 16 2 2 8 2 -2 -4 0 -1 5 -8 -9 1 1 2 3
2948CmJkMJj3J2k2J5J8k1OJ2kmjMj1K1lLj2mRk0J5J1j5oP%J2j9j%MKJ0rmNkoJ2
$$ 3 -1 0 -2 2 3 -10 2 -20 -5 13 -8 -2 10 8 4 3 7 -4 17 14 17 5 1 10 -10 5 16 1 -5 2 2 14 -5 -6 -6 -2 0 10 1 -3 2 0 -6 6
2992Fj8QK2ojOk5RMrJ6j2LpQ%Mk3K2j1JJ7JPk7J8oJ2j2nlPn%PqLj1J%ONJ5rj0
$$ 6 -12 -4 18 12 11 17 -8 1 5 -4 12 0 3 -4 4 4 8 -15 7 -4 -3 14 15 22 -5 13 7 19 7 2 -1 6 1 1 8 0 3 -8 -7 -7 -1 4 19 10 0
3037@J3m%nNmnNkNNLk4K3j2J5qnKlJ4Lj1j2KlORj7KMrP%qJ7nlj4K2j6J2PJj4m
$$ 0 13 9 9 4 9 5 0 5 3 8 13 16 -8 15 3 18 10 5 7 4 18 21 10 -2 0 -3 3 12 -5 -3 1 -8 -1 -1 -9 8 3 0 -14 8 -8 4 11 12 -2 -6
3083fJ2Qj2NjkK7m3L2j1qNMj0Mqj0OJ9lj1kP%j4NpJ3j4QOkoOLJrJ9jj3J%oONJ0
$$ -6 6 14 2 7 6 4 31 -12 20 9 1 6 10 0 4 -4 -14 -8 11 8 -3 -5 2 2 -12 -7 -14 -1 -15 -7 -1 -3 -9 -3 0 1 -8 11 10 -3 -2 -2 -8 -2 3 13
3129A3j0QPkKnmJ0j6PJpJ0j0J5j2k0RJ3j7MoJNj2kKJ3jnJ1LPj7J4j5QpQ%OmlQ
$$ 13 3 11 18 16 18 13 9 19 3 10 11 4 14 4 19 7 -13 -4 9 -8 -4 -10 -9 -4 -16 -18 -16 -3 -4 -9 2 5 12 -5 9 -6 2 -5 3 3 9 5 2 10
3173A0j2OJ7j5JJOj4mQJkqjj1MRmOJ3j8j6K0rJ5kmkMPKm%J0Rk7J4j2QOj0kPnK
$$ 10 -2 4 21 6 7 8 14 0 -4 4 5 3 -5 -6 -17 -13 -4 -8 -2 11 -7 -23 -3 -12 3 1 -3 -5 -1 6 8 4 4 14 23 -4 10 -2 6 12 2 0 7 2 4
3218D%Prj7J4oJ2Pjooj6K0j0lJ2%Kj4OpJ0Pj3LNJ5okpPpJQJmnJ%nJ2j6QOKMrK
$$ 4 4 11 2 -15 -1 -7 5 12 11 5 -1 -17 3 -7 -10 2 2 4 -10 -4 -11 -1 6 -7 -4 1 16 10 8 1 8 1 2 10 11 7 2 3 3 -2 10 -6 2 8 10 14 5 7
3266Gj3J0%NPk1KQj5j1K1%jOj1P%mMJ0j4MnJ9Jj9K2j7Rj0JJ4Kk3J1j1J8j1OMl
$$ 7 -6 4 4 9 16 -5 -3 5 -10 -21 0 0 -1 5 -6 1 1 -3 1 11 -3 1 -4 15 16 -3 19 2 11 1 2 16 18 -5 6 -5 13 2 8 12 9
3307IKkj5OkJ0j4J0OpjkNpLj4J7kK0k5NNNj%qRpNKLj0PPj0rJ0pJ3j6NOLpnk4J8
$$ 9 11 9 -6 0 -2 8 -6 4 10 3 2 0 5 -2 1 -13 4 2 22 -3 2 7 12 11 11 3 12 5 10 12 15 5 12 19 9 0 10 3 16 0 5 11 14 7 2 -22 -4
3354dNOJollnpOJ1jRlj3OqJ5JLKJj2J6J1j1j7NLpRqNk%%MoJ2j3Njj2lJ0J1mJr
$$ -4 1 7 8 2 -1 -4 -9 -16 -10 1 0 9 6 -7 -1 -9 6 7 10 12 13 1 17 28 17 0 5 8 1 10 2 7 5 5 5 9 3 15 2 7 6 -6 -9 1 12 8 9 0
3402@NLj0mQjj0J3j0RMMKJ2j2j9KMLMLQop%oNqJ5j0Nj5K1n%j6J3j0%k%PLJKJ1
$$ 0 5 8 -2 -6 2 1 -9 4 -6 3 7 11 13 25 13 -6 -4 0 3 7 10 18 12 5 5 -1 4 -4 11 1 6 -9 12 7 7 -9 4 -6 -6 -8 -8 -1 2 3 5 16
3448A6k3RokJ0LQj3J0%J1lrj3J5Kj4mJ4QqPrn%J8j5pLrJ0pnKmlJ0MMrJ8j4j1J9
$$ 16 -7 2 -4 -6 4 7 15 2 12 12 23 20 11 -2 13 15 1 -3 11 19 11 18 9 4 4 22 7 0 3 -6 4 -3 -8 -6 -10 -13 -3 1 5 -4 14 0 -11 8
3492HQj3OkJ0mlj5K1j3LoJ1kjkNJon%Rk1J0pJ4mlnOrNjJ3j7RjPOk8K1lLJpJ5j5
$$ 8 16 3 9 7 17 13 10 -5 16 3 6 0 11 9 8 6 11 12 6 1 1 10 -11 -1 -8 6 2 -1 -6 0 -9 -4 -5 8 -9 0 -1 6 12 -16 5 2 5 6 -1 14 -1
3539aRj3J2nN%J3rj0MNjLkkok0K3rJ5onOqjPmnj0J4kL%mkJlJ0PnMj2K4rjJJ4j5
$$ -1 8 -5 7 2 7 7 20 11 1 5 10 9 12 10 8 2 -18 5 -4 11 5 0 6 -2 -3 4 0 -5 -15 -1 -3 0 0 -4 -6 -5 -8 2 9 4 8 -4 20 11 10 11 25 10
3587A0MqmRoJ6j7Oj4J1rNjj3J3qKLJ6j9JmrJ8JkOkLj3LJOKJ0nqJ2roOMlj0kPk
$$ 10 14 6 2 11 5 21 4 10 -4 7 -2 3 2 -11 2 -6 -4 -1 15 -4 -3 -7 -16 2 3 1 7 5 8 -5 -2 -1 5 7 17 12 4 16 7 1 7 11 8 -2 -4 3 1
3634ApJ5nJ6j0j9J8j3M%nP%j7J9oMJNjj0JjPjjJ4rj1RJ2ojJrR%NKj1kQj1Oj0J0
$$ 1 -6 9 4 20 10 -9 9 -4 0 0 -5 2 2 -15 4 -2 2 3 8 7 -3 -2 -3 4 3 2 16 7 -4 5 17 11 10 11 2 11 11 16 18 7 5 13 2 8 -2 8
3680Hj0pL1j6j1mNnLPJ0k2%JJ3OrJ5lj1PJ2j8pQRjNLj1kqNJMjjKk0J4Oj6Qj1M
$$ 8 -2 -9 22 6 -5 -9 -4 -9 -6 1 11 -11 -11 -10 3 9 0 15 12 1 8 20 2 -5 3 12 11 16 19 8 6 -2 3 4 8 7 6 8 -12 2 8 -8 0 -11 -7
3725gJPMj8m%PKK2j2JoqJ2oJ1J6kj9J1pjjJ1klNJj4J2kkRj6M%Kkj2NmLJ1k2K7
$$ -7 -6 1 5 -13 -17 -17 -10 -8 14 2 3 -3 -11 1 -5 6 22 20 1 12 5 4 3 14 12 9 14 15 1 13 11 9 18 2 6 6 8 6 -6 -1 -5 -2 9 -13 14
3770A4j3oklLRKj8J5J0%pKj0kJ2J2j0%noK4j9lRkJmJ4mj6K0j5Jj1NJ0nmkj6K0
$$ 14 1 -5 -7 -10 -7 2 4 -14 1 11 11 4 6 -4 -6 6 18 8 8 3 -3 21 2 -1 8 6 7 3 17 13 -3 17 2 3 -8 -3 7 2 -2 -4 -20 0
3812@Lj3J2%oRj1OoOMKqRkQj8MRnK0k5RkRqlqJ2qj6K0j4LmNMonJ6J6l0QrJ0%n
$$ 0 3 -10 2 2 -4 5 -6 0 -6 0 4 6 -2 7 5 13 -5 -1 8 3 23 -2 7 5 14 6 3 -5 7 -1 -17 3 -11 -8 -12 -7 -3 -9 -14 2 18 -12 -4 -13 -3 -3 -8
3859hJ1%p%lJ9j7J8oj6MJ1Mk5L0j7J1Nj2J3Mrj1kQKj3KJ1oRKk4J1J3qj0LRkjL
$$ -8 3 3 -4 -4 -7 12 -5 13 7 -9 -5 6 10 -15 15 -2 9 14 2 15 19 10 -1 -3 5 7 -6 -4 7 1 10 12 -12 -1 12 4 -6 -3 6 4 3 6
3901FMj3nRLj0L0k1OqPqKoK0qJ0rRnmLpMj5rJ6Rnk0J0qQkPjOpOj0J0j1%K0lpJ
$$ 6 10 -3 -8 1 4 -6 24 3 9 1 8 0 2 -4 16 8 18 9 18 13 9 12 5 9 -6 -15 1 10 5 -15 -5 -13 -5 -7 0 -1 5 -2 4 -6 4 -7 -7 13 10 3 4
3948DJ4j8J9lOppj0NJ3nj1M%mJ3oJoJj8J6RrNJ2oj0lJ2j8MjMJ1m%nlJ0nokOJ0
$$ 4 18 0 19 16 22 15 8 -2 3 16 11 0 4 4 0 13 7 8 2 3 -15 1 10 1 6 18 12 2 -1 11 -7 -3 -4 0 11 7 7 2 -1 9 4 -2 -4 2 12
3993A2nOjLj2J0mrRk%j3JpJ6krkNNMj6J3KRk8LJ0Jkp%J2OnpJ1qOoLKkNRj1qRl
$$ 12 7 13 12 15 3 13 9 0 9 7 7 -6 -5 -12 4 2 -7 -9 -4 1 5 -11 2 4 13 -15 -12 -2 -1 -3 -10 -10 2 8 3 -4 7 -1 5 -1 2 4 2 7 16 5 -3 6 3
4042COj9J7j7K7j6qJNJ2JqoJMlNj3JoLJ2qOpK3j3JJ0pMrKMlj9PRLLj2K1pqkKj
$$ 3 9 -10 7 -10 17 1 -7 -6 -1 11 12 4 -2 -1 3 0 5 -8 -7 -13 -10 2 -6 0 -7 16 3 4 14 7 11 2 4 8 5 -14 -7 2 5 8 -4 17 10 2 0 2 1
4089ApJ2j5jJ0oJ0ok%lOj4J8lJ4k0kJ0oPlOJKjljQ%nj4J3j1kJ6j2pJ9Nk5mMJ6
$$ 1 -6 6 -9 -10 0 -6 4 -2 -4 -4 -7 -1 -15 3 0 14 -6 -8 2 -4 3 0 6 7 9 8 5 4 12 12 7 -7 6 -5 -7 9 -3 -10 9 14 -11 -15 -11 5
4133Ej7O%rK1qnQqKK0oj2pJ3LrKj0K4k9K3%jjNJ3j5k3J9OOqkNj7JJ2loKQk2lJ0
$$ 5 -12 -6 -6 -15 6 -2 -7 1 -7 -5 15 9 -3 -10 3 6 -3 -1 -11 13 -16 7 7 6 5 10 23 8 -15 4 10 16 8 6 11 -6 -5 7 4 -2 0 8 -14 -17 -7
4178g%PNLj1kKJ3kj3LjJ0Rpj0lJ5%r%%KOoRLlk1J0LrLJ1pmNjLpJ3j4rJ6rjj3J1
$$ -7 -7 0 5 8 -3 -5 -3 10 8 -5 -2 -3 7 16 9 -1 -4 11 11 2 2 2 4 10 4 13 16 13 -8 2 5 -4 -1 10 3 -1 4 3 6 -1 12 -2 -11 5 -4 -5 -18 -7
4226gQJKjOj5J2Lj2jOPkj1J3nJ1l1K6mJ5j3JJj5J5pJ5j5OKmj1LLj6J9Ok1J6k2
$$ -7 1 2 4 3 9 -6 6 9 -3 -4 2 9 7 -4 9 4 15 -16 10 6 21 8 9 10 -5 10 3 18 3 9 11 7 -4 -1 2 -14 5 11 -10 6 -16
4267a6J6lmJkK1l1J5J3jjJ0j7lLKJ5j0Qj6NMpLlj2J4jpMJj7KPNKPLj9QJlJnJ3
$$ -16 0 -3 -7 -6 -8 13 -18 -3 10 9 8 18 1 -2 1 3 18 8 16 0 5 9 2 5 2 -10 4 3 -4 0 1 -16 -14 -7 -2 0 7 10 -9 -1 0 -3 -2 -7 6
4312FNj9J7j3K1Rk6J4j8JJ8j0lqjMJ8rJ0j1j1J3j7J2Pj3J0j9KjJ7j8J0J2j2J3
$$ 6 11 -8 9 -4 17 26 0 14 -4 -3 15 5 2 -6 -7 -3 15 6 16 5 -6 7 -10 2 9 -4 6 -13 -11 -12 5 -13 -3 9 -3 10
4348A0k4J2JljNQjlJ3mn%JJ2j5Qj2kQPoMmj5K4j3j1J5j7PLJpoNlJ0Ln%LqPmqQ
$$ 10 -14 -2 -1 -4 -5 0 8 7 4 17 13 8 8 9 21 6 14 2 0 8 15 9 13 9 -6 18 5 -6 9 -8 -1 2 3 -4 -10 -5 -8 2 5 0 0 3 -5 2 -2 -10 -2
4395bOqKKJ5Rrj3PQk1KK6j0oRj1j3J7nj0RM%jOj5pPKOmLqNnJ3j0k0K1jkjNj5R
$$ -2 4 -4 -2 0 15 24 15 2 9 17 -4 -2 24 14 8 17 6 -7 10 5 -5 4 8 8 7 13 -2 -9 -2 0 6 2 5 -3 2 -3 10 0 -20 1 0 -2 -3 2 -13 -4
4441dK4j8J0jjMnj2OOOrPj5OJ8j7j%j%jmj4K4k3J3j0%NjJ3KJ1j7rJ6kJj5ROPj
$$ -4 20 2 12 11 10 14 9 -3 3 9 15 6 13 -2 4 22 5 4 4 3 3 2 -2 -16 8 -15 -2 -12 -12 -7 -8 5 7 18 1 -8 8 6 7 -8 1 7 14 13
4485A3jrj3OJ1J2k3J5Jj1J3k%pjJ2k1J6rjNj1J7j7kJJ1k2J2NJ%J1j6PrPJ6j7J0
$$ 13 12 3 -10 -4 7 19 -4 11 12 1 14 12 12 5 4 16 -5 11 2 1 6 -5 12 -5 -7 -6 5 -17 -5 0 1 1 12 -4 3 -6 1 17 0 10
4525A0lklORj1n%MqJ3j2nNNlMj8J5rJJRRk6J9k1J7oOj1J2j0jJ9mprK5jj6NnJ5
$$ 10 7 5 2 8 17 6 1 1 5 -3 10 -2 -7 -2 3 0 4 -14 1 -8 -7 -6 3 12 -14 5 -16 1 -5 1 -10 2 -8 -9 10 6 -1 -10 15 14 -2 3 -2 13
4569A3lPk3J5pMj1jRljOPqnj0ROj5J2j1J7Oj8%KNqQj7QJ5kkOkpLQj0K5k4lJ1j7
$$ 13 10 17 -6 9 2 6 -5 -6 3 0 -1 5 12 4 -1 -11 -2 4 -11 1 -10 7 13 -5 -5 -3 2 -6 2 -15 -7 8 6 4 10 8 1 4 12 2 27 3 0 11 -6
4614fK3j6QJrkNNNnj7RmPJ6oj9J4j1J0qpjJ1oJPlPj1j0J5J9j4lkJ0j0J5j2Rj8
$$ -6 17 1 9 10 1 -1 4 9 14 9 -8 1 -3 4 20 14 -5 9 -2 8 0 -7 -8 3 -3 -2 5 2 9 -2 -12 3 22 8 5 3 13 3 18 6 15 -3
4656cJKNpPrnJ0nJ0pmRlJ7k8J4Lj2JkKkNlmPoj3K5j0P%njJ8j7J6rJ0l%rJ1lk3
$$ -3 -2 0 5 -2 5 -4 -9 1 -4 6 -1 -5 4 1 18 -10 4 7 -5 -4 -6 -4 -6 -1 -4 -8 -1 -7 -20 5 -5 2 2 -3 -4 14 -3 13 4 14 11 11 2 13 10 -13
4702a3J7MqJ4jj8j5K1J0j9J8jKOqj4Rj0J4j9QJ1j0n%OJ2Kj1nmJ4MrrJ6J0k0NP
$$ -13 4 8 0 14 13 -5 -20 1 11 -8 10 9 11 17 9 -5 4 -6 8 -11 -3 8 -2 -7 -7 -1 11 13 2 -3 -7 7 11 2 -7 9 19 -1 4 11
4742A1nnjNpj4J5nMjJ4qrQj8J8Lj6J3pOpOj0NkJ3jpJ3j0PrJJ6j9pK0j1J4k1LK0
$$ 11 6 1 0 5 -2 -16 -1 -6 -2 -3 11 3 -6 2 -16 2 5 -11 2 -5 1 -6 0 -10 -5 -7 6 5 -2 11 1 8 -1 0 16 -3 -10 10 -1 13 -8 -5 15
4785A5oPmj3qPlqLNJ7rpJ3qj5Jo%J7Opj0K5j7mJK1j0qJ4l%J2pj4OOjklOJ2k3%
$$ 15 9 16 12 -1 -9 -2 -5 -13 -10 -5 12 3 -4 9 1 -14 -13 -19 -19 -2 4 -3 -13 12 -5 -9 -8 13 3 -5 9 6 6 18 11 -3 3 9 8 6 3 9 21 -2 -2
4830bOj1PLJj7PMrJ3mJJ3k1OLPLj%l%KLmkNk7K5jnpKJ2rMj0MmRjjj1J9Mk1PMj4
$$ -2 4 -7 0 3 4 -13 -6 -2 -11 2 -2 -1 12 -9 -3 0 7 10 9 9 6 6 8 11 7 5 10 -17 8 7 2 -5 -3 9 0 4 -6 -2 -6 3 2 1 -10 9 13 -8 -1 3 -11
4879a1%J2j3lOJ0lrJ7j2MK1k0MKnjMLOLj5MnJ0MojMqRooJNnLj3O%j4J8Nj8K8k4
$$ -11 -11 1 -12 -15 -9 1 -2 -11 6 -6 -2 19 -1 3 5 0 -1 3 6 12 15 0 4 -1 9 13 7 6 10 2 11 5 -1 0 5 0 3 -10 -4 -4 -18 0 5 -13 15 -9
4925iK0j7LjKpMJ5qlQ%J0pj1jNOj2K4j9rKJ0j4PJ0qL%J8j8mr%J7j6j1K3j8J3n
$$ -9 11 -6 -3 -4 -2 -9 -5 10 2 -1 7 7 17 10 -1 -2 3 9 -3 21 2 -7 -5 5 -9 -2 8 0 3 3 21 3 -1 -10 -10 7 -9 -20 3 -15 -2 -7
4967gJ3j8RJ3Lk7LPQJ4k3K8j3MMk2K0rLj0kLpPj2J6j0J0j7oJ0p%QmLMrK0j2j3
$$ -7 6 -12 -3 10 13 -14 -11 -4 4 18 -5 23 10 14 18 -4 16 7 10 0 -2 1 -6 1 -11 5 -5 5 -12 -18 -8 -15 -15 -7 -11 -8 -4 -13 7 -5 -18
5008a8QpPMJ5j8J8j4J0pj6RJ8mlRqMqJ0pNqJ0KrpKkqPrOPkj5K9j9nJ5Pj5OrnQ
$$ -18 -10 -17 -10 -6 9 -9 9 -5 5 -2 -18 -9 9 5 2 11 3 7 -1 9 2 7 -1 9 11 2 -5 -3 -5 -13 -6 -15 -9 -2 -4 -19 10 -9 -14 1 8 -7 -1 -10 -15 -7
5054gJ6pJj2J0nkJ9j8PJ0oj2RMroJ4pQqlQj7PLJ6l5KK4jj4OnPKJJj0J0jJ2j8J6
$$ -7 9 2 3 -9 1 -4 -6 13 -5 2 12 6 -6 3 7 -2 -8 6 -1 7 -1 -4 4 -13 -6 -3 13 -22 -20 4 3 -11 -5 -10 -3 -1 0 1 -9 1 0 12 -6 10
5098A0q%KKpoJ0%omJ4Pnj6J5Oj3mrKJ1qJ3j5J2j6MJ1kj2J6j6J3j8MJ5j4J0Jj%
$$ 10 2 2 4 6 -1 -7 3 3 -3 -7 7 14 9 -7 8 14 1 -3 -12 -10 1 -7 6 -9 3 -13 -9 2 0 -12 4 -12 1 -17 -13 2 -12 -2 -1 -2 -2
5139bJ1j1J3oj2J4j3K0rKj9J4nK0j1qJjJ3njj8OrMJ2LKj4lK1k4J7NpJpkJ3%j0
$$ -2 9 -2 11 5 -7 7 -6 14 5 7 -12 2 -3 17 6 -2 -1 -2 11 6 5 -13 -7 -16 -12 0 3 5 -9 -12 9 -15 2 7 0 1 -6 -8 5 5 -5
5180eOrJ7ppOmj2QRlm%N%LNl5L4j8J8j0j1oJ3mLMLmj8J6NpNmjJ0oNNmoPLoMj2
$$ -5 1 -8 9 2 -5 1 -3 -15 -7 2 -1 -5 -5 0 0 3 8 -27 7 -11 7 -3 -14 -20 -7 -11 -8 -4 -1 -5 -23 -7 -2 -9 -4 -8 -9 1 -5 0 5 1 -5 2 5 -1 3 -9
5228iL3k5LomQNkqJ4%pjj2J2LlkqjMnP%j9K3pJ2j9J7pMpJ2J5k1J0qpJ0k2J9J1
$$ -9 24 -1 2 -4 -8 0 5 3 -5 9 9 2 1 -11 1 4 1 -1 -9 -10 -6 -11 -4 -4 -23 0 -7 5 -14 3 -4 0 -7 5 20 -1 9 1 -6 4 -18 1 12
5271A2pk0J8OmQj1QmjLpj0KLj3RJ0j3pJ0k%KJ4kRnkPj2Kj3J1%K6j8lj4K4LoJ0
$$ 12 5 -15 3 9 5 13 2 10 6 5 8 1 -9 -7 -4 -17 -8 2 -11 -18 -8 -10 -10 -8 6 4 13 8 6 13 1 3 -10 1 1 27 9 6 -8 16 19 13 23
5314B3j2j1Mj3J7j1MPqj3J5j0pLJ3kjK1j4j1Mj1K6oqlJ1nkjkK9k7J0jmJ0j5JM
$$ 23 11 0 4 -9 8 -3 1 8 0 -13 2 -8 -15 -12 1 -1 -2 19 5 -6 -2 -13 13 7 -1 -4 7 2 0 -1 -3 26 -1 9 8 4 14 -1 0 4
5354DlOJ4j7rKmJ9klKj4jNrJ3J0k1J3j0rJ3JJ2qQj1kJ7k1J1jMjnLj7J0J0l%k%
$$ 4 1 7 21 4 -5 -3 -7 12 10 7 9 -5 -6 -1 -10 3 13 -8 5 -5 -14 -1 0 12 4 12 1 -1 16 -5 6 5 9 8 3 6 -11 -1 9 6 6 4 4
5397Dj3K2j0Pj2JKPj6NOpJ1%j1k%lLklJ8nkKjKjNj2K6j6ojllNJ6rJ2rnPrJ3kk0
$$ 4 -9 13 3 10 -2 -1 1 8 -8 -3 3 -4 7 7 -4 -6 -6 -9 -6 -8 -11 7 2 0 2 1 3 2 7 -5 21 5 -1 -2 -5 -8 -3 13 4 16 7 2 9 0 13 11 -9
5444iRJqPj1RLMnnjK0j3jl%mJ1rqJ4njN%lP%olJJ4j3Lj2J5j2lK4j0o%%Qj4J8j1
$$ -9 0 1 -7 0 -11 -2 1 5 0 -5 -6 14 1 0 -3 -3 -7 4 -5 -13 1 -4 -5 0 0 -3 4 4 -2 -5 -4 10 -3 0 -12 3 -9 -12 12 2 -4 -4 -4 4 -10 8 -3
5491cjmKkj5K3lJ1k7J3L0k9oJ4rK0o%pJ0Qk2J8koJ1pj2J1k0J6Prj1QJ2j0mRnj2
$$ -3 -4 -8 -6 -8 -23 0 -3 8 -19 -6 24 -5 -11 3 -6 14 8 8 1 11 19 -3 15 13 7 18 11 -1 10 -10 6 13 4 -7 1 13 3 -1 8 3 -9
5532iJ3j2J3j5J9pj1kJ4pJ0loJJJQmO%KpoLnpK4j2Mj7J3qlNJ0MNj6Oj6PMlKlO
$$ -9 4 -8 5 -10 9 2 -9 -11 3 -4 6 3 -3 -2 -1 0 8 4 10 10 12 5 -1 2 -3 -10 14 2 6 -11 2 -6 -9 -4 6 10 15 -1 5 -11 -4 0 -3 -1 -4 2
5578BnKj0J8kk2J4KrOJ4j2%j6L2j6J0Klj5J2J2j1LmPj4J3j9J2lMqK9j8j5kQOL
$$ 2 -3 -1 -11 7 5 -17 -3 -1 -10 -4 10 -2 -2 -18 14 -2 8 10 7 -8 4 16 5 8 4 11 -3 10 -9 3 0 4 -4 25 7 -8 -10 -2 4 7
5618GrlPj5kJ2J3j7LOJ3j0NjkrP%Pjmj1JQmK0k7J9pKKj3J5lj0LoJ2kL%j3JrJ6
$$ 7 -2 -5 2 -13 -15 -3 10 -7 -4 2 15 5 10 9 7 -2 5 5 12 11 7 -4 -3 5 1 21 -6 13 6 8 10 -3 12 9 -1 2 -4 8 6 9 9 -4 -3 -12 4
5663Dj3qK2j0J6j8Qj2OJ3j7QJ1o%qJj0QJ1lOj0oJ1JnmPk1L0Jk9K1k5J7mmJ8j1
$$ 4 -9 -17 5 -5 11 -7 1 -11 -5 8 -9 -1 10 4 4 -4 -3 -13 -5 6 3 9 -1 -7 4 5 0 -4 3 -18 12 13 -16 5 -20 -3 -7 -11 7 -4
5703dJ0j7RRj5QJ0k1K2qNnOnoPmJ4oOnj1J6kKprpK4jk5RPrlKKQlk1LJ5j2J4lJ0
$$ -4 6 -11 -2 7 -8 0 10 -11 11 3 8 3 9 4 -2 5 1 15 9 15 10 -1 15 13 15 8 -1 -8 16 15 -10 -1 6 -3 -6 -4 -2 6 3 -18 -15 0 -12 2 -1 9
5749IqlqNLPJlJj6K7k2RpLJ7op%J4Kj1oj2J0J4j5J5j7jPoJj8J6OpjJ0j2PjKQo
$$ 9 1 -2 -10 -5 -2 5 6 3 4 -12 15 -7 2 -5 -2 15 9 2 2 16 18 7 1 -11 -1 13 -2 13 -4 -5 2 -4 -3 -21 -5 1 -6 -7 3 -9 -2 -3 -1 7 1
5794AnJ4Pk3j3J7Nj0Oj0K6j6JJkKJ0rj0QNlKOkj4LKJnMkpKnJ8Jj1KqJ2QpRk0O
$$ 1 -4 10 17 -6 -19 -2 3 -7 -1 -11 15 -1 0 1 -1 1 11 2 -8 0 5 2 4 10 8 -6 -3 -1 0 -5 -1 -3 -10 -8 -13 5 6 -5 -3 -11 1 9 2 11 -9 -3
5840cKJ1j0%mK1k5J0QlJj5K1omJ8j9j4J4klljmK0j7ProK6k1J9k6J3nJ3KOnk2R
$$ -3 -1 10 0 0 -4 17 -8 2 10 7 8 -7 14 8 4 22 3 -11 3 1 -2 -5 -6 -10 10 -7 0 -9 -15 11 -10 9 -17 -4 -9 4 6 12 7 -15 -6
5881foJ8nLQj1JPrMnkj2K3lqkORrlMnJJ0J0l0KJ2lOj1NJ3j0OlROj0qPN%qNkNl
$$ -6 -12 6 1 4 12 1 2 9 0 4 -1 -3 -15 8 5 -3 -5 1 10 1 -2 2 -3 -2 8 18 -12 -10 2 -1 5 -6 -1 12 2 8 5 14 20 10 2 9 14 14 6 11 9 14 11
5930A1MLj1mKLKmkKJ3k2kJ0qJ1pmkJ1pJJQj4J6j3LJ0pmNOnKqOJrJ2rj1NPRnj2
$$ 11 15 18 7 3 5 8 10 6 4 6 19 -3 -5 5 -3 8 1 -3 -5 6 -1 0 1 9 -5 11 -2 1 11 4 0 5 11 6 8 0 6 7 -2 10 1 -10 -5 2 11 6 -6
5977fK3j%pKj3J0qrQo%nMJ4nqPQj3nJ3k0J2Mj5K5kj0RmRmmKklNj0PmJ6j4j4K1
$$ -6 17 16 16 9 11 -2 8 0 -9 -1 -7 -7 -12 -8 6 1 -7 0 8 -5 -10 3 -17 -5 -1 -16 9 7 -3 6 2 11 7 3 5 3 0 5 -5 2 -2 14 0 -14 7
6022G%j3J1j0JJ5j5J5k0J9Qj4KjQpm%JQj2J0j8J9rMKj5K5j6NqRn%nmJ2koNkmk
$$ 7 7 -6 5 -5 -4 11 -4 11 -9 10 18 4 6 5 13 6 2 2 3 11 -1 9 -9 10 1 5 7 -8 17 1 6 -2 7 2 2 -3 -7 5 3 -3 2 0 -4 -6
6066flLJ8j7qKJ5lPj6NK2k1MJjjjRmmOnQLj5KjJ3mj0J1Kj3lJ1mJ5j3KNj1j0J3
$$ -6 -9 -6 12 -5 -13 -11 4 1 8 -8 -3 19 -2 2 3 2 1 0 9 5 1 7 2 10 13 -2 0 -1 12 8 -2 9 11 -2 -5 6 2 17 4 6 11 0 -10 3
6110Cj5J6j6J1Kjk2K0Pj4J4j6K5j5%J4qmJ9j1RJpPj6RLj9KKJ0nj3J6krLMlj9J5
$$ 3 -12 4 -12 -1 1 0 -22 -2 5 -9 5 -11 14 -1 -1 13 5 1 20 9 18 19 12 19 3 12 15 -4 -2 0 10 5 -8 8 6 -3 0 4 1 -18 -3
6151c%RLj2nJJ2KnmqJ4j6J3OJ1k2NJ5j1KrNJPNj7J3J4k2kOkoJ7k1J0j2J8KomK
$$ -3 -3 6 9 -3 -8 -7 5 7 2 -2 -10 4 -12 1 7 18 -4 1 16 5 7 -2 3 4 11 16 -1 12 26 4 2 8 6 0 17 -4 6 -6 12 14 8 4 6
6194Fq%kNPj7J1%J3oj1Oj3MJ3Qnkj3J1j1QlJ3onPmPpNJqJ4j6qmMkJ3LPj2LMoj0
$$ 6 -2 -2 -4 1 8 -9 2 2 15 9 -2 4 -9 -5 8 16 11 9 -4 7 -4 4 1 14 8 3 10 6 13 6 11 12 4 18 2 -6 -10 -6 -8 5 8 15 3 6 10 4 -6
6241fJ1j4%J0j7J6kPj3J1J7j3j2J1JJKoJpJ1l%qJ0JroLJ6qrJ0j3PLJ2j2pKJMk
$$ -6 5 -9 -9 1 -16 0 -2 5 -8 3 20 7 -5 6 7 8 10 4 5 -2 9 6 6 -2 8 9 0 -6 -3 13 5 -4 6 -7 0 3 15 3 -4 -2 -1 3 1
6284AJ1j3jJ8olJ0j2J0j5PpqNNjLoJ2Kj4KRnJ0j4OJrNnmJ3j9Ql%kJ0OJJrJ2pJ
$$ 1 12 -1 -2 16 10 7 17 5 15 0 7 0 -8 -3 2 1 4 -2 10 12 -2 0 9 4 14 0 6 7 -2 3 -2 -6 7 -12 -4 -7 -7 -9 1 7 8 9 0 12 5 6
6330Fj2K0j9J4JmJ0qj2J4j0J5kjprj2J8j4nJ8Rkj4J7j2j4J7morK3%l%j1LJ2Lk0
$$ 6 -6 14 -5 9 10 6 16 8 -4 10 0 15 13 12 5 -4 -16 2 -12 -17 1 10 8 -6 11 -1 -15 2 -2 -8 -17 6 6 3 3 -8 -5 7 10 -10
6370a0OPjkNj0%RJ0%lJrQqJqJ3lKpkoJ%J3lj6J4mJkJ2j3PnLJ0lj2J3Oj3Ojj2k
$$ -10 -4 3 2 0 5 -5 -5 4 14 14 11 12 3 11 3 4 -4 9 6 8 1 -1 -7 -6 -6 7 4 -12 2 -2 -1 -3 9 -4 3 -2 1 11 8 -4 9 15 2 8 7 -5 -7
6417gOPRj0JQnnnKQJorK2npj3KoJ2j2J6Pj6MkQk7J9%J0%pNJOlqKKjnJ3lJQqj3
$$ -7 -1 6 15 5 6 14 9 4 -1 1 9 10 4 -5 17 12 5 -8 -6 -12 0 -12 4 11 -5 -1 -3 5 -22 -3 -3 7 7 0 5 6 12 9 1 3 5 4 -1 12 9 10 18 10 -3
6466cjMJ1moMOrMljqJ1mrJ7l0J6nJ0lMkPj0j1J8OjqrJ7qJ1j8J2Q%j5J5j2J1kk4
$$ -3 -4 0 11 7 1 5 11 2 6 3 2 -6 5 1 -8 9 -21 -5 -10 0 -3 1 -1 6 -4 -15 3 9 8 0 -9 8 0 11 -7 5 13 13 -2 13 1 12 10 -14
6510a4J5KnNNonPJ1j1j5RJmnKKOj2nK3Oj1J4k2pK7k0lJ6rrRnJ4lJ2j1pJ7k2PP
$$ -14 1 3 -2 3 8 2 -3 4 15 4 -11 -2 -1 -5 -10 -8 -6 0 -12 -17 6 12 1 15 -7 -14 13 -7 -10 6 -3 -12 -3 -8 6 3 15 4 -3 14 -8 -1 6
6553FLj7J4r%j3J1jJ7onrR%lPqJ1j8J8Pm%Oj0JJLlj1J2Pj1jJ2j9J7nj5J5k2K5
$$ 6 9 -8 6 -3 -3 -16 -5 -6 11 5 0 -9 0 0 -3 4 -4 7 -11 7 14 10 10 16 6 7 8 11 8 -3 9 16 5 4 16 -3 14 9 -6 9 -13 12
6595A2qj7K0llOj0KRj5J2k3K3J3j6Lj0%OOj0KmJNNJnj0J0oRMLj6NMj4RQMKj2Q
$$ 12 4 -13 7 4 1 7 -3 -1 8 -7 5 -18 5 18 2 5 -5 -5 1 7 -3 -1 -5 -4 1 6 7 2 -8 2 -4 5 9 12 -4 1 5 -9 0 8 12 14 2 10
6639A0jlj3JJ0Qj1jj2J2J0k7K0m%NoJ0KMj0J2jk%kk1QlJ6l%Lj7PJLkmqMJ7lkj5
$$ 10 9 6 -7 -6 4 12 1 0 -12 0 10 -17 3 -1 -1 4 -2 8 10 14 4 16 15 13 13 11 -10 -2 -5 11 8 8 11 -6 1 2 5 3 -1 -9 -5 12 9 7 -8
6684hO%rLKJ2kk1RkQmRQj8MJ0pnLJLj0K3rj3J1lJkRj9J4KKqlPJ6j5JLj3KmkON
$$ -8 -2 -2 -11 -8 -6 6 4 -17 -8 -10 -2 -6 3 11 -7 -3 7 0 -5 -2 -1 2 -8 15 6 -7 4 1 2 0 9 -10 4 6 8 0 -3 4 20 5 6 9 -4 -2 -6 -8 -2 3
6732CmRj0J0j0%NnRj2J8lqPjLj1qOJNnj4K4%NqNj4pK6k7%KRlKMkqRPm0K3%J3m
$$ 3 -1 8 -2 8 -2 -2 3 -2 7 -5 13 10 2 9 8 11 0 -8 -2 -1 4 -1 -15 9 9 14 6 11 -3 -10 16 -11 -11 -9 0 -3 -1 3 1 -7 2 9 -31 -8 -8 5 1
6779Aj8J2LPpNj0PMplJ5k3ROj6J1QppLJ3j7J8j4RoklJMoQjMpOl%jpK1k2RjJ1O
$$ 1 -17 -5 -2 5 -2 3 -7 0 4 -3 -6 9 -14 -5 1 -15 -4 4 -3 -10 -7 6 -11 7 -7 2 -4 -6 -9 -8 -4 -10 -2 -3 1 -6 0 -3 -3 -4 -11 10 -12 -3 -4 7 13
6826A3j4K3k7OJLkmJ4rljJ0Nj1Rj1%%j7J2rJ8j2OKj2Qj2L0pj2Q%Nj6J0%j6K5j2
$$ 13 -1 22 -5 1 2 5 3 -1 13 4 1 0 10 15 4 13 2 2 2 -15 -3 -12 6 -6 0 2 -10 -2 -14 16 9 -3 5 5 10 -6 4 4 -12 13 1
6867AJnlNRk2J6J7nj1j3J7j1nNMnPnJ4k4PJ2j2J1k1ROJ5k0J9j7LNKNmQpj0PPj0
$$ 1 2 -3 -6 -1 8 -14 2 19 14 3 -10 7 -4 -9 -4 0 -5 2 -3 11 -13 -6 6 -6 5 -16 -7 -1 14 -6 13 -4 -1 4 6 11 7 15 8 -2 5 12 2
6910BkjOJ0j3RMj9LPj0J3j4qK1j1j8J8jkOJ6k2RKj0J9k2Rnj1OJ4qJ1KPj5j2PQ
$$ 2 0 -1 5 15 2 11 15 -4 -1 6 -4 9 -5 -13 8 -3 -21 -3 -4 -6 0 16 -6 3 5 -5 14 -8 1 -4 -15 -9 5 -3 8 10 17 2 -10 -3 5
6951EkJ6j1%%oJoRJRj0j3J5j3QjlJNj7J1J1k1lJ0JpJ2OmJ3j1mqJ9j4QkOpNmkn
$$ 5 3 19 8 8 8 2 3 -3 6 7 16 6 -7 8 -5 3 2 -1 0 5 -12 -1 10 -11 -14 -4 -3 -10 2 8 4 17 6 2 -6 13 -1 7 5 11 4 9 5 3 -2
6996bpjJ8Jj5lJ1KRlLLj4Qj2K%jMoMj2J0oJPjmNj5J4LJKjoJ6j1LkjQkj0KMMMl
$$ -2 -9 -10 8 9 -6 -9 2 4 13 10 13 16 2 10 -2 0 0 -1 3 -3 1 -11 -1 -7 -6 1 0 -4 1 -14 0 3 4 6 5 -1 15 4 7 5 4 12 10 0 2 6 10 14 11
7045A1Ok3J1rJK1k3J%KKPQk1MkJ6Jrj0J0nKJ0mqO%Pmj0J3j2KPKj0lQMkQj3nJ2
$$ 11 17 -6 5 -4 -3 18 -5 -4 -4 -2 0 7 15 -6 -2 -4 12 13 4 -6 4 -1 1 11 7 -1 5 5 12 8 -2 11 -1 1 8 10 0 -3 5 9 7 15 2 -3 9
7090Ij0J0j1NoJ0mkJ3k3J5jmlMMjo%K1pRj7kkJ3j4J6j2j4RMNpmJ7j2KJ0lqkMj
$$ 9 -1 9 -2 3 -3 7 3 1 14 -9 6 5 1 -2 2 6 5 -1 -1 20 13 22 5 3 1 14 0 16 4 -10 -1 3 8 1 -3 14 2 4 14 11 3 1 5 4
7134Dmjj8J3Nj1K3mnoKOMmmmL1j6nljjrJ1%NnJ0o%oJ5j6KJ%kKomOLJ1j6MjpJ3
$$ 4 0 -1 -19 -6 -1 -12 11 7 2 -4 -2 4 8 4 0 -4 27 11 6 3 2 1 -8 3 3 8 3 13 7 7 1 16 0 2 3 3 1 3 -3 -7 -1 2 13 -3 1 0 -7 6
7182Fj2J8j3NoKRpj2J3njmJ7j6Rj2QOjJKj2MLoPJjMqNL%j5kJ8rpONjJ3k2kQJN
$$ 6 -6 12 -1 4 -2 0 9 2 -10 3 -2 -3 -7 10 -6 3 -9 -1 5 4 5 7 -5 -1 2 -4 3 4 3 7 -1 4 7 7 -8 -10 8 -1 -8 -2 3 2 15 -7 -9 -1 0 5
7230ENqMj0QpKJ3j1k%RkJ3k3J3pJMQk0QoqJ3J4rj5K3j7j1K4j8NK0k1KRrlJ8j6
$$ 5 10 2 6 -4 4 -3 -1 12 1 -1 -1 8 6 19 -4 9 2 3 7 15 -5 3 -3 -11 2 16 7 -8 15 -2 -13 11 -7 -2 18 -3 -1 8 -1 -4 14 -2
7272b%J2mjKpoj2J5NJ5qoN%j3%LJ4jk4J1oJ8j1J4j1Jj3J4Mj8J3k3L5j5OrqJ1n
$$ -2 -2 10 6 5 7 0 -6 -18 -3 2 17 9 3 8 8 -5 -5 -2 12 11 -13 -2 -8 10 -1 13 2 3 -10 4 8 -10 3 -20 15 0 6 -3 -11 0 -5
7313eJ6Kj2QlJMnlJ5j0mJ3j8oJ5Jj0j0NJ1k0J5JpJ4j0JmRj3OJ0j3RroK1pQkMm
$$ -5 11 13 1 9 6 7 11 6 3 18 8 4 17 -1 -7 8 9 -1 -11 -6 5 -15 0 1 -6 8 -2 -1 -5 4 -9 -3 7 -6 3 -6 -12 9 2 10 8 12 8
7356Hm%oJ4lOklj4K1k1j%LK0mqOjKj2LmJ1k0R%j0MjNqkQPLj4LmK0j4J6lj4NMJ
$$ 8 4 4 -2 12 9 15 13 10 -4 17 -4 -5 -5 -2 18 14 6 12 11 13 1 4 0 11 -9 0 0 -10 -6 -7 -2 -10 -12 -4 3 6 -8 -5 -9 11 -3 13 10 -4 1 5 6
7403FpLPLj0JMj3J3oj3LJ0Oj4K0j5J2j1j0Qj1K0rLJj2kJ1J0j7OJmORKj2PqKOj1
$$ 6 -1 2 9 12 2 3 7 -6 7 1 -12 -9 1 7 -7 13 -2 10 -1 -11 -3 -14 6 -3 0 1 -11 -13 -2 8 -9 -3 -2 -6 0 9 11 -1 6 -2 0 6 -5
7446ekQJ4k0PJMoOMj1J0j7lQQnOj2PLojokOJ0qJjlrJ4RlNj2RRj7QoJJ%lnOPmm
$$ -5 -7 1 15 -5 2 3 7 1 7 11 0 10 -7 -10 -2 6 1 7 -5 2 5 -1 -2 -8 -10 -4 6 -2 -1 -2 -5 -14 0 9 6 11 -1 8 17 0 8 2 3 4 4 1 -4 2 9 5 1
7497AJ4j8jJ3Rj2Qj1j3N%J4nj3J5noJ5j3MmpOrK0j0%LJ2j4J0LlJ2j6J4j0lrMK
$$ 1 15 -3 -4 9 18 6 14 3 -10 -5 -5 9 4 -9 6 1 -5 10 -3 1 -3 -10 -4 -13 7 -3 -3 0 12 -2 8 11 8 20 4 18 8 5 -4 0 2
7538BNmj6K5pknKoJ6J1k4J2rLpJ2n%jJRj6qMJ0lJ3k3PQj0JqK6j2pLlPpkRpJ1K
$$ 2 7 3 -13 12 5 3 -2 0 -6 10 21 -3 9 0 3 -4 8 3 3 2 3 12 -4 -12 -8 2 -1 12 -11 -4 4 -6 -5 -13 13 1 -6 -3 -6 1 -6 -8 1 -6 5 7
7584G%opJ1npJJ3kJj1jKJ1j4J8k5J1kJplJ6mNJ8j8Mj4K4j0%llNj2K%RpJ2kmnl
$$ 7 7 1 -6 5 0 -7 -6 7 5 6 -5 -6 -4 7 -7 11 -14 -3 -5 -4 -11 -14 2 -2 3 21 3 7 -7 17 7 7 4 1 6 -6 -4 -4 5 -2 10 8 4 -1 -4
7629dkKkknQmJ7j7J0Nj2J0QKj5Q%rqoK7oKjkJQj3J0Kkk4J7oO%mllJ0JlmNnmPN
$$ -4 -6 -4 -6 -8 -13 -5 -9 8 -9 1 6 -6 4 12 14 -1 7 7 -2 -10 -16 11 5 7 6 4 5 13 0 10 12 10 -14 3 -3 3 3 -1 -4 -7 3 4 1 -3 2 -3 -7 0 5
7678Ej8K1Nlmj1lkOJ4j7oK0mNJmJ3j1Jj3%nKmJ7J0lj7NMj1jNjjKpklROkpJJ%J2
$$ 5 -13 8 13 10 6 -5 -8 -10 -4 10 -7 -13 7 3 8 9 5 18 7 8 -5 -5 -10 -8 -12 5 15 12 -5 0 4 -7 -8 -3 -4 -5 -3 -10 -12 -15 -6 0 -2 -9 -8 -7 -7 5
7726EqKKj6J8j2J0%QmnNJl%Oj9JJ4pJ0pj0J3Lpj2J1mOj6J1lJ8rj8K9j7qKJ5pQ
$$ 5 -3 -1 1 -15 3 -9 1 1 9 5 0 5 6 3 3 9 -10 -9 5 -2 8 1 -9 4 7 0 -12 -1 -5 1 -15 -4 -7 11 2 -16 13 -4 -12 -10 5 -2 6
7769FJkKrjJJ0j3K1J4l2J3mj5J1LppKK6k3J2p%nj1J1J8j8JL2l0NnPj1PrNkJ3r
$$ 6 7 5 7 -2 -3 -2 8 -5 16 30 -2 11 7 -8 3 6 -1 -8 -6 20 -3 9 2 2 -3 -14 -3 15 -3 -2 30 0 5 0 7 -4 3 -6 -1 -3 10 1
7811AoJ3J5j0Nl0K9mj3K5qj7qK1%lj2J2lqjPJ3j4nqJ0qnK0%o%lLJ2j3jOj9J0Q
$$ 1 -5 8 23 13 18 -12 17 13 0 25 17 0 -8 13 13 10 -2 10 7 -1 -2 5 18 4 -1 -9 1 -7 -12 8 8 2 2 -1 2 14 1 0 6 -13 -3 5
7853EpJ1oKkRj2pkOkJ5lolnOKj3K4mj5QJpJ5rJ1j2OKmpmk%NNPnmMkPkJLlj2NR
$$ 5 -2 9 3 5 3 12 0 -7 -9 -3 -5 10 7 1 -2 -7 -1 1 -12 12 8 -7 1 2 -5 10 1 12 0 6 8 4 -3 -7 -9 -9 -4 1 8 3 -1 3 1 8 6 7 10 7 -5 0 9
7904IqMjJoJ6j6J2j8J4mMj1KjkMLmNjj4rK4pLPqjKmJ9j9J3j3MrLQjJ0j4J1j1O
$$ 9 1 5 4 5 -1 15 -1 11 -7 7 3 7 -4 -2 -3 -5 -1 2 -2 3 2 -12 -21 3 -4 -1 6 -2 -3 -1 -5 14 -5 8 -5 -1 -10 -7 1 0 10 -4 7 -4 2
7949BpJ2rK2k4Pj4NRkrJ6JqroJ3j6K4%oqR%Pj9JPQJJmqPO%lLjLj0oPoMQkopoK4
$$ 2 -5 7 -2 20 -4 3 -11 -6 3 1 -8 8 9 1 -8 -14 -1 -17 7 7 1 -7 2 2 9 -10 -9 -2 6 7 8 4 -4 3 9 9 6 9 8 11 1 -5 2 -4 0 8 6 0 -7 -13 11
8000A1%j9Qj2K2k0J1%J6j0Jj0J2j1NmNQnJj0Qpj0KJ5qNmLnNMMj2NKj5J8j4K%J3
$$ 11 11 -8 0 -12 10 -10 1 1 17 7 8 -2 10 -1 4 0 5 13 8 9 -1 7 0 -10 -8 7 -1 4 0 3 -2 3 7 11 -1 4 6 -9 9 -5 -3 -3 10
8043A0k1jJ2KQljpqnJ3nlJ2mKj3K3j3J0oKmmJ8knRj9oPJ2nj1J8k1PlLnmRpj5J7
$$ 10 -11 -12 0 2 10 7 6 -1 -9 -14 -1 -6 -9 3 -1 1 -12 11 -2 8 2 4 0 -4 14 12 7 16 -3 -9 -2 10 5 -6 12 -9 -2 -5 -2 -7 -11 -2 -9 -24 -7
8088gJ9pj7PLJJQrLj0J0JKnJ3j9ONk0J4j2NJ0Jj2NJ9j2j8J8j4J4j3pJ1LJOj3L
$$ -7 12 5 -12 -5 -2 -1 0 8 -1 2 -8 2 3 5 0 13 -6 0 5 -15 -1 -13 -8 2 3 -9 -4 15 3 -15 3 -11 3 -10 -17 -6 -3 -2 4 -9 -6
8129fkjJ3j2PJkpJ8j5j0K3j1lLRj0OJ4j2LqKjJ9k1KoK0j8Qj2J0jKj0J3okoJ3p
$$ -6 -8 -9 4 -8 -1 0 -2 -9 9 -6 -16 7 -4 -7 -4 5 -5 1 15 3 6 -2 0 -1 18 -3 -1 -7 13 -5 3 -9 1 0 2 -8 5 -1 -3 -9 4 -3
8171cQj9NLNj0J2%JPj1KL%%ljJ6j3L
$$ -3 5 -14 -9 -6 -1 -11 1 1 2 9 -2 0 3 3 3 0 -1 15 2 5
8191E
$$ Imaginary data points
##PAGE= N=2
##DATA TABLE= (X++(I..I)), XYDATA
0@%%%%%%%Qj6J6j6J6k4L8m6N6p2Q8j04J26j52J84k22K60l02L54m17M83n56O40
$$ 0 0 0 0 0 0 0 0 8 -8 8 -8 8 -16 22 -24 32 -40 48 -56 70 -82 102 -120 140 -162 192 -225 258 -298 342
30C42p35Q41r57J085j224J384j560J747j954K183k435K708l006L332l690M083
$$ 342 -393 448 -509 576 -648 736 -824 923 -1031 1152 -1283 1425 -1581 1751 -1939 2144
46B144m509M972n481O041o654P328q076Q904r830J0874j2049J3386j4932J6743
$$ 2144 -2365 2607 -2874 3167 -3487 3841 -4235 4669 -5161 5713 -6336 7050 -7882 8861
60H861j8888K1480k4694K8795l4234M1838n3290P2703j13951L47497m62563m74994
$$ 8861 -10027 11453 -13241 15554 -18680 23158 -30132 42571 -71380 276117 -186446 -661440
72f61440R43858j8949m73879L08755J56378p23569K19513Q67811l73392q44340
$$ -661440 282418 263469 -210410 98345 254723 -468846 -249333 618478 245086 -599254
82e99254M79493N08826m60506o7731M64671m18332m20684P24285L69637q22206
$$ -599254 -119761 389065 -71441 -139172 325499 -92833 -513517 210768 580405 -241801
92b41801k16073O62754r673l69302L11101K6275n74264K34984P24637l85752o71948
$$ -241801 -457874 204880 195207 -174095 137006 163281 -410983 -175999 548638 162886 -509062
103e09062M15765M28683l84931n1876L27730l28142k72691N97008J99896o71860
$$ -509062 -93297 335386 -49545 -101421 226309 -101833 -374524 222484 422380 -249480
113b49480q7089N53523q4274l01864K90191J7896m75436K10224N65890l31957
$$ -249480 -336569 216954 132680 -169184 121007 138903 -336533 -126309 439581 107624
123A07624n10272L49734L04561l00481k858K29086l01762j61698N12147R7901
$$ 107624 -402648 -52914 251647 -48834 -51692 177394 -124368 -286066 226081 323982
133C23982n66641j9245M60861q9099k45446K19309J564l36374J94193L90847k97599
$$ 323982 -242659 -261904 198957 109858 -135588 83721 85285 -251089 -56896 333951 36352
144C6352l43759L07036J89566k53483L5184J77578k62321j07392M17725M8578
$$ 36352 -307407 -371 189195 -64288 -29104 148474 -113847 -221239 196486 245064
154B45064m51466J0520L57317q3447j73147J69125l5751k46433K04544K81141
$$ 245064 -206402 -195882 161435 77988 -95159 73966 38215 -208218 -3674 277467
164B77467k92442k43903K93747J28383k32436L9961J45384k10567o2844L26205
$$ 277467 -14975 -258878 34869 163252 -69184 -29223 116161 -94406 -157250 168955
174A68955k213l46812N3825K65943j02761j12911J53171n9436j95636J96475K09927
$$ 168955 166742 -180070 -126245 139698 36937 -75974 77197 17761 -177875 18600 228527
185B28527k62504j75997K51156Q7981j82884L7805R1665j65734q024K53357n2278
$$ 228527 -33977 -209974 41182 129163 -53721 -15916 75749 -89985 -98009 155348 103070
196A03070k68834Q9728K05079j14296q3134J34216n5939j48248J67508J45268
$$ 103070 -165764 -76036 129043 14747 -68387 65829 9890 -138358 29150 174418
206A74418k20281j11743K06728M2027j42306N3642N6272j49972K2594K14859p6735
$$ 174418 -45863 -157606 49122 91149 -51157 2485 58757 -91215 -68621 146238 69503
217F9503k22899J03412J67306j10721o3800J08743n4502j01942J50059Q6591j95156
$$ 69503 -153396 -49984 117322 6601 -57199 51544 -2958 -104900 45159 131750 -63406
228f3406n4920J81702K522j22150O5071M2181j31095L1044J73019p9536j71981
$$ -63406 -118326 63376 65898 -56252 8819 51000 -80095 -49051 123968 44432 -127549
239a27549R8918J22264r6161l5643Q2519o2009o6007J40402M7326j75993k2115
$$ -127549 -28631 93633 -2528 -38171 44348 -17661 -83668 56734 104060 -71933 -94048
250i4048J61039j3885j05240N8782L0584j02341L8445J28842q4302j23847J01100
$$ -94048 66991 53106 -52134 6648 37232 -65109 -26664 102178 17876 -105971 -4871
261d871Q2290r4096j2461P4116o5621n0810J27448K8086j53143m608J35560k2645
$$ -4871 77419 -16677 -29138 44978 -20643 -71453 55995 84081 -69062 -73670 61890 39245
273C9245q2444N3526J2860q2260N1045R8393r2376r1672J04660N7968r2020l304
$$ 39245 -43199 10327 23187 -59073 -8028 90365 -2011 -93683 10977 68945 -23075 -26379
285b6379O5291n7405l5309J04853Q583j22965J3766J05752l4136n9169N3832q87
$$ -26379 38912 -18493 -53802 51051 59634 -63331 -49565 56187 22051 -37118 16714 15827
297A5827p0606N5366P8268q9178o9701R5991M1680p9251J888M8966m9902j6210
$$ 15827 -54779 587 78855 -10323 -80024 15967 57647 -21604 -19716 29250 -20652 -36862
309c6862Q7432j1297j01482L1082Q6490m4616m6936N4153m239n9936N0796N9087
$$ -36862 50570 39273 -62209 -31127 55363 10747 -36189 17964 13725 -46211 4585 63672
321F3672p9211m7388Q3305K2687o5719J2325L5451m9564l344P7787k2335q6877
$$ 63672 -15539 -62927 20378 43065 -22654 -10329 25122 -24442 -27786 50001 27666 -59211
333e9211L8197P2297m5272l7496M6518o898m4146M7219L7796p1651k5408P4476
$$ -59211 -21014 51283 6011 -31485 15033 8135 -36011 11208 49004 -22647 -48055 26421
345B6421N564n7609K0251K8995m6678J273O5686k4974o9674L8268N5046m1715
$$ 26421 31985 -25624 -5373 23622 -23056 -21783 43903 18929 -50745 -12477 42569 854
357H54k4519L8556j3453l2002M7531K3319o7534j1977O8357l038n1430K1111K3723
$$ 854 -23665 14891 1438 -30564 16967 40286 -27248 -39225 29132 26094 -25336 -4225 19498
370A9498l8916N389N1042k8065n1801M0010L8483m1470j3057L5626j7784k6322
$$ 19498 -19418 -14029 37013 8948 -42853 -2843 35640 -5830 -18887 16739 -1045 -27367
382b7367M4927J5937n9938m960N8359p052m1424K0071J5223l2254J1859M0011
$$ -27367 17560 33497 -26441 -31401 26958 19906 -21518 -1447 13776 -18478 -6619 33392
394C3392l2344l9369M2129K8169m1216p726L2639j6757k0735L8097Q578m9398
$$ 33392 1048 -38321 3808 31977 -9239 -16965 15674 -1083 -21818 16279 24857 -24541
406b4541K490M6874j2501l1455K1767Q277k9538J5299L3715l2635l1539L9767
$$ -24541 -22051 24823 12322 -19133 2634 10911 -18627 -3328 30387 -2248 -33787 5980
418E980K1492l6618m573K6276j5417j2985L2737L13m1730R875L9233j7442k5785
$$ 5980 27472 -9146 -13719 12557 -2860 -15845 16892 17205 -24525 -14650 24583 7141 -18644
431a8644K2869N752k6302J4571K6897k9293k3025L4780J3690l0927N20K0349j6563
$$ -18644 4225 9977 -16325 -1754 25143 -4150 -27175 7605 21295 -9632 -9112 11237 -5326
444e326p376L0173m451l6850J3072L3858j8108k1700K0378L928k0601J4015J8825
$$ -5326 -12702 17471 13020 -23830 -10758 23100 4992 -16708 3670 7598 -13003 1012 19837
457A9837k6964j4251L1597O281k7660M698J7604j6675n295K6448n675l0577J3166
$$ 19837 -7127 -21378 10219 16500 -11160 -6462 11142 -5533 -10828 15620 9945 -20632 -7466
470g466K6949j6765j5878J7252L79j5823J5046J3081k5984q745K9430K454k5092
$$ -7466 19483 2718 -13160 4092 4471 -11352 3694 16775 -9209 -17954 11476 13930 -11162
483a1162N588J5177j4134l271K0931p254k3353J4122J9797j6870j0452J6266k342
$$ -11162 -5574 9603 -4531 -7802 13129 5875 -17478 -3356 16441 -429 -10881 5385 3043
496C043j3649J4858J0087k3436n710K5478M46k0727N689J1112j1912Q6J6754r732
$$ 3043 -10606 4252 14339 -9097 -14807 10671 11117 -9610 -3921 7191 -4721 -4635 12119 2387
510B387j8258J5610J5184j7181p589J5256k691j1381J2751O847j9516k210K0759
$$ 2387 -15871 -261 14923 -2258 -9847 5409 2718 -8663 4088 10935 -8581 -10791 9968
523I968k399j6253P055P642j1428K261J4522j0526j5080J5138J2116j5574n677
$$ 9968 7569 -8684 -1629 6013 -5415 -3154 11368 842 -14238 900 13016 -2558 -8235
536h235J2673k864p986J1146L044j6684J368J7619n062j3628Q123O119j0540K436
$$ -8235 4438 1574 -6412 4734 7778 -8906 -7538 10081 5019 -8609 -486 5633 -4907 -2471
550b471J1956r543j1473J3300Q502j3235l020J0143m016n454J0666P62j4982L068
$$ -2471 9485 -58 -11531 1769 10271 -2964 -5984 4159 143 -5311 5355 6117 -8865 -5797
564e797J5413n757j1680P452M964q469K697Q676r004p676J2306M990j2065o42
$$ -5797 9616 3859 -7821 -369 4595 -3874 -1177 7499 -1505 -9181 3125 8115 -3950 -4592
578d592R009m711m471R644oj2605L423J2461n534q928O505K967o726L692O298
$$ -4592 4417 -294 -4765 4879 4873 -7732 -4309 8152 2618 -6310 195 3162 -3564 128 6426
593F426r036n150J1642L015j1042J85P895m090l408P634r54r646M145R269n882
$$ 6426 -2610 -7760 3882 6897 -4145 -3960 3935 -155 -3563 4071 3117 -6529 -2384 6885 1003
608A003o259O335J365n985M083N032q306l719J0177J823r216O54O067l596j748
$$ 1003 -5256 1079 2444 -3541 542 5574 -2732 -6451 3726 5549 -3667 -3013 3054 -542 -2290
623b290O206k343p621N121P246o356m775O206Q06n173L568L696o937k086Q282
$$ -2290 3916 1573 -6048 -927 6319 -37 -4812 1394 2200 -2973 595 4291 -2646 -4732 3550
638C550L58p299J578M428l690o00N488k910o353N138N823n808l755N191M67l755
$$ 3550 3908 -3391 -1813 2615 -1075 -1675 3813 903 -5450 -312 5511 -297 -4052 1139 1606 -2149
654b149L147K022n951m01P037j002o174K342L637l612l09M617k726m924M606M225
$$ -2149 998 3020 -2931 -3332 3705 2703 -3471 -1129 2508 -1104 -1413 3204 478 -4446 160 4385
670D385n043k416M286l50k719L313R87n523M83O299j558n424K391L054l001j5
$$ 4385 -658 -3074 1212 862 -1857 1456 2443 -3080 -2597 3702 2144 -3280 -889 2165 -836 -851
686h51L397k745l363M431K666m770j177L883r25k300L113O32m734P23N213j634
$$ -851 2546 -199 -3562 869 3535 -1235 -2412 1471 546 -1754 1359 1991 -2743 -2020 3193 1559
702A559m242K123K109k396N53K516k947k352M348J803m516p02L569q65j930K509
$$ 1559 -2683 -560 1549 -847 -294 2222 -725 -3077 1271 3074 -1442 -2144 1425 560 -1370 1139
718A139K03l701J156L984j951l149K278J360k308Q63K187k841j888L937J322l903
$$ 1139 1342 -2359 -1203 2781 830 -2319 -41 1319 -989 -126 2061 -780 -2668 1269 2591 -1312
734a312m32K887p96j289K076l69l006J608L231k235k561K342J124k134P29J736
$$ -1312 -1744 1143 347 -942 1134 765 -2241 -633 2598 363 -2198 144 1268 -866 -137 1599
750A599k335j268L201P18l153L6K237r70q28J932n97k605J629K724k076k149K009
$$ 1599 -736 -2004 1197 1915 -1238 -1202 1035 65 -763 1169 572 -2033 -404 2320 244 -1905 104
767A04R39j662O52J100j990o22K792J04k735M26J951j065p32J698n32k086J424
$$ 104 1043 -619 33 1133 -857 -1479 1313 1417 -1318 -892 1059 -6 -738 960 428 -1658 -234
784b34K094j799j556J682N02j240P69P24j901k58K528j48k422M90J720q69n78
$$ -234 1860 61 -1495 187 689 -551 218 942 -959 -1217 1311 1163 -1259 -769 951 82 -496
801d96J224n67j452J383J408j700r95J558K01j112P72N70j619j10K035j91j942
$$ -496 728 161 -1291 92 1500 -200 -1195 363 564 -548 224 794 -825 -935 1100 909 -1033
818a033M68J271p06k85R34p33j069J436J015j650p51J484J39r72N90M10j241J02
$$ -1033 -565 706 0 -285 649 -84 -1153 283 1298 -352 -1103 381 520 -452 138 548 -693 -591
836e91J556m28j432N98R20p44p5Q18p33q64J277Q10j438n60J180J20p07M73J25
$$ -591 965 537 -895 -297 623 -121 -196 622 -111 -975 302 1112 -326 -886 294 414 -293 180 305
855C05r75L15J275n91j204O94P70o99j02O62n70o15J024N31j164l03R28k0n25
$$ 305 -670 -355 920 329 -875 -181 589 -110 -212 450 -120 -735 289 820 -344 -647 281 261 -264
874b64M92K3q93L74J105n70j051O20O60n35q0M38m88l74R10K62j030j17Q76j36
$$ -264 228 251 -642 -268 837 267 -784 -164 496 -39 -119 319 -169 -543 367 629 -401 -518 358 222
894B22m73M12N6p18K92Q73m77p87N01M62m26PK99m76k22Q20J75r40p4P78r5m07
$$ 222 -251 161 217 -501 -209 664 187 -600 -99 363 -63 -56 243 -233 -455 365 540 -400 -474 304 209 -198
916a98K89J9m95L13O05m72n66N13L17m00L4K90m24j92O80J34p54o8O12p2k88K19
$$ -198 91 110 -385 -72 533 61 -505 8 325 -75 -41 249 -175 -367 313 447 -307 -375 237 165 -123 96
938I6q1l57L60M66m83m73M73L01l69j9K19k84r8M98M4n73L5M52r8k07K01r0l11
$$ 96 15 -342 18 484 1 -472 1 302 -67 -86 133 -151 -249 249 293 -280 -245 207 109 -98 103 13 -298
961b98L30L74m08l68L75K46k56m5J32k23J3M08p2m75J01L80j27j88J52l7k13K31
$$ -298 32 406 -2 -370 5 251 -5 -50 82 -141 -128 280 208 -267 -166 214 87 -101 51 14 -199 32
983C2K50l14k69L09J72k14K3O3k10L5L65r3m01R2L39p3j77Q0k4j19K15J44k97
$$ 32 282 -32 -301 8 180 -34 -11 52 -158 -123 242 149 -252 -160 179 106 -71 9 -15 -134 81 225 -72
1006g2j32K70P6j72L2N7j69L1L00j14k93P6K50o8j16N6p0p0K22Q8k88r0K65O0
$$ -72 -204 66 142 -30 2 59 -110 -79 221 107 -186 -110 140 72 -44 12 -58 -128 94 182 -106 -196 69 129
1030A29j64LM1q7N6J65j20j93J28J56q6o6R2r0p2K02O7k39p9K02P4j25J0%q3Q7
$$ 129 -35 -32 9 -78 -22 143 23 -170 -42 114 28 -38 54 -36 -108 94 161 -78 -157 45 119 -6 4 4 -79 8
1056HJ47j44j76J36J51q1r6O6n2j9J23M3j89k6J55K8r7J2jn8N5J48j29j40J13
$$ 8 155 11 -165 -29 122 41 -55 11 -41 -60 63 106 -83 -109 46 74 -23 -11 -12 -70 -15 133 4 -136 -23
1081b3J23o3p3K0j6J7J18j7j78J9J56lj03K4J5p2N6J16j09j18R2R4n3m5K3m4J3
$$ -23 100 37 -36 -16 -32 -15 103 86 -92 -73 83 80 -23 1 16 -56 0 116 7 -111 -19 75 22 -23 0 -44 -31
1108c1J16k4j51OJ40Nq3J1Ql2M5N9p4r0R5P5p1k3K9k1j4Q4Qj22kJ25qq2L2lm4
$$ -31 85 61 -90 -84 56 61 -22 -11 -3 -35 10 69 -5 -95 0 75 4 -19 10 -11 -25 59 67 -55 -57 68 60 -22 10 7 -37
1139c7O6N0j01o5R3P2q5l6M2j8NN8jj21K6R2kn9RPk1L0N8q7m4O9N6n4j3MqJ5N3
$$ -37 29 79 -22 -87 6 78 -7 -43 -1 -19 -14 44 43 -78 -52 40 38 -21 -12 -5 -26 4 62 -25 -69 0 56 2 -11 -7 -15 0 53
1172E3l5o9K5Q5k7n8K4LpK3L5o1l7N8L5l5l9L0j5qN5j5o5RP7j3m6lJ6%K3K4o5
$$ 53 18 -51 -26 59 32 -26 -2 1 -6 17 52 -9 -46 12 47 12 -27 3 -12 -20 35 20 -45 -36 41 28 -18 -21 -5 -5 18 42 -23
1205b3l0P9J7l9j8J3kOM0j1n9J5O0k2l5j1J9mK2jm1l1O2L1m0j9J5PrK6l0k0jO7
$$ -23 -53 26 43 4 -14 -1 -3 3 43 32 -27 -12 48 26 -9 -20 -1 -5 17 16 -25 -56 6 37 -3 -22 -7 0 -9 17 -13 -33 -34 33
1239C3j6l0J2Mk4M5Lm7k6N6K7m1j1J6KkK9j2n1J6O7m5j4PJ4nRLn1pO1%l4nJ4q
$$ 33 17 -13 -1 3 -21 24 27 -20 -46 10 37 -4 -15 1 3 1 30 18 -33 -17 50 5 -9 -2 12 7 16 19 -32 -39 22 22 -12 -17 -3 -11
1275a1NK9j7m2J5M2rl3PK2j0J3Kk5j9M4J6l6pK9mj1J4%m5K7L3rl1NJ0qOOk7nL5
$$ -11 -6 23 6 -36 -21 21 12 -21 -14 8 -2 11 13 -12 -31 13 29 -7 -14 15 11 0 14 14 -31 -4 29 20 -11 -6 4 -4 2 8 -19 -24 11
1312A1K1m4l7N1j0JK2k4j2J1L0j9k3K0mQkL1l0j8L7%j0k5K5Oj6K3j9j2K1J2k1
$$ 11 32 -12 -49 2 -8 -7 15 -9 -21 -10 20 1 -22 -2 -6 2 0 31 1 -17 20 20 10 -15 10 16 0 23 4 -8 13 25 4
1345Dk6J7mJ1Npkj9J8Nj3pK3k0K4Kok8J9K7k9j7K0KkjQj5qL2Jj5qK3jj4QMj1M
$$ 4 -22 -5 -9 2 7 0 -2 -21 -3 2 -11 -18 5 -15 9 11 5 -23 -4 23 -6 -23 -3 -1 -3 -4 4 -11 -19 13 14 -1 -9 14 13 -1 7 11 0 4
1385DJ4k2rJ6J1k2J9nk2mK4jk8QK8mj0Kk8MK3J6k9lJ3K0lpPomK4ok0MK2j4j2J2
$$ 4 18 -4 -13 3 14 -8 11 6 -16 -20 4 3 -25 -17 11 7 -3 -1 -29 -25 -2 14 -15 -18 -5 15 12 5 12 6 2 26 20 0 4 26 12 0 12
1424A2j9%JJ4Kk6J3J7nj7Mk1K1LNk5mJ7pJj%jMK0j6nK1j1OKlj2NJ4Lnj5K7lk4
$$ 12 -7 -7 -6 8 10 -16 -3 14 9 -8 -4 -25 -4 -1 4 -21 -25 -8 -15 -14 -15 -15 -16 -12 8 -8 -13 8 -3 3 5 2 -10 -5 9 12 7 -8 19 16 -8
1465hQkJ5Kj6OqqN%nJ5j7qJ5pQqJ0Lk4J9%qNQkkPK2rj5J8k5RK3j9KM%Lj1J0k3
$$ -8 0 -2 13 15 -1 5 -3 -11 -6 -6 -11 4 -13 -21 -6 -13 -5 -13 -3 0 -24 -5 -5 -13 -8 0 -2 -4 3 25 16 1 19 -6 3 26 7 9 13 13 16 5 15 -8
1509hLK2%k1oK6j8LLJj0J2moPj0Nj3J0Pk2QJ1RqoJ6Mj2LojOJ5j3%J1kojmj9K7
$$ -8 -5 17 17 -4 -10 16 -2 1 4 5 -5 7 3 -3 4 -6 -1 -14 -4 3 -19 -11 0 9 1 -5 11 15 3 6 0 -1 5 20 7 7 18 16 10 9 5 -14 13
1552A3llj7K0j3kJKmJOJjj0lQj7J1Q%QNkrLOj2KjmJ9j3L1l9J6Lrj3J9mj2%J7o
$$ 13 10 7 -10 10 -3 -5 -4 -2 -6 -5 1 2 1 -9 -12 -4 -21 -10 -2 -2 6 11 9 0 3 9 -3 -1 -2 -6 13 0 31 -8 8 11 2 -11 8 4 -8 -8 9 3
1596Cj0KOl%lmj5K4pRk3NK2k3QJ0llK3j5JPkJ6j9JLljNj3MJ7j1Jj4J3Mj7J6k0
$$ 3 -7 -5 1 -2 -2 -5 -9 -24 0 -7 2 -21 -16 6 -17 -9 1 -2 -5 18 3 4 11 9 25 6 7 10 7 6 11 -2 2 19 8 9 -5 8 12 -5 11 -9
1638inJ4jjrJ0j4%J1MLllmnJQj2J1j2K7j2J5Rj7pJ7j5Qkj0OKloNJ2j2rJ7j3JJ
$$ -9 -14 0 -1 -2 -11 -1 -15 -15 -4 0 3 0 -3 -7 -12 -11 -3 -15 -4 -16 11 -1 14 23 6 -1 16 1 9 7 -3 3 5 2 -4 1 13 1 -8 9 -4 -3 -2
1681bQjonjkkMKJqJ0moJ1KJJ%MKj5J2LJKlqJOJ3k3RqKJ4j1J8k0kMPj0%J0j9LJ
$$ -2 6 5 -1 -6 -7 -9 -11 -7 -5 -4 -12 -2 -6 -12 -1 1 2 3 3 7 9 -6 6 9 10 12 9 1 2 8 21 -2 7 -1 1 15 4 22 2 0 4 11 1 1 11 -8 -5 -4
1729dl%PoJLnJ0rJ4q%qQNJ8j7kOj%J2rNKk3J8j3oJJ9j1QnrmjmJ1pOqJ1j1NqKJ7
$$ -4 -7 -7 0 -6 -5 -2 -7 3 -6 8 0 0 -8 0 5 23 6 4 10 9 9 21 12 17 19 -4 14 1 -5 -4 15 4 12 7 -2 -6 -7 -11 0 -7 -1 -9 2 -9 -4 -12 -10 7
1777Gk0J8j6J7NpNLJ%qNJoj2K5j9QKnKj1OoLQNj5rJ4J0pnqMoK5k3J5j9J7%j%k
$$ 7 -13 5 -11 6 11 4 9 12 13 13 5 10 11 5 -7 18 -1 7 9 4 6 -5 1 -5 -2 6 11 -4 -13 1 11 4 -1 -9 -5 -11 14 -9 6 -13 4 4 3 3 1
1822AkJQnL0l0QLppLj0RMnMJ2qj3jJ1MkLj1nkMlJLjqQNllOJ2j0Oj1PJ1j5J4rK0
$$ 1 -1 0 8 3 33 3 11 14 7 0 3 -7 2 6 1 5 17 9 -4 -5 6 10 8 11 0 -5 -7 -3 -6 -5 -2 -3 -11 -3 2 -1 -4 2 14 4 10 -1 6 17 2 16 7 27
1870B7lj2Mj4LRj7RoPJ3j9j1K4j0rJ3lj3JqJ8k7J9JNMj4J5kpOOk4K2mpNJPK%J1
$$ 27 24 12 16 2 5 14 -3 6 0 7 20 1 -10 14 4 -5 8 5 -8 -7 -15 3 -24 -5 -4 1 5 -9 6 4 -3 3 9 -15 7 3 -4 1 2 9 11 11 22
1913B2j0mJ6Jk7jRJj6PPj3J5j6J6rk%pLjnJ9j0oKLJ0oQk3J5%J1j3MLjNJ1j1J9
$$ 22 12 8 24 25 -2 -3 6 7 -9 -2 5 -8 7 -9 7 -2 -4 -4 -11 -8 -9 -14 5 -5 -11 -9 -6 4 -2 6 -17 -2 -2 9 -4 0 3 2 7 18 7 26
1955B6jk2LKlmoJ0Lk2RLMj3NJ4k1J7Nj0rPkNooJ4jQm%j6K2j0Oj1J5J3j4L%mj1
$$ 26 25 3 6 8 5 1 -5 5 8 -14 -5 -2 2 -11 -6 8 -13 4 9 -1 -10 -3 -5 0 -6 -12 2 1 9 5 5 -11 11 1 7 -4 11 24 10 13 13 9 -2
1998bK5j1J1j5kJpQj1J3j2%OLj0qNNNjj4NpQKMKqmJ0RkKmnMJ2pj3PMLpJ0kJ2k2
$$ -2 23 12 23 8 6 7 0 8 -3 10 -2 -2 4 7 -3 -11 -6 -1 4 3 -11 -6 -13 -5 -3 1 3 -5 -9 1 10 8 10 6 1 5 17 10 -3 4 8 11 4 14 12 24 2
2045BQrJKk1J5J2j5Nj6J5lLJMj6QlQPj8QoJ5k6PPRJ0qMo%Nr%RlKnkJ3nNLqj4n
$$ 2 10 1 2 4 -17 -2 10 -5 0 -16 -1 -4 -1 0 4 -12 -4 -7 1 8 -10 -2 -8 7 -19 -12 -5 4 14 6 10 4 4 9 0 0 9 6 8 3 1 14 9 14 17 9 -5 -10
2093a0KRLlk2J9mOroJ5J1j4J5j1j7K2j1JJ6j1ONj7J5kJ5rlkMmj2Rj0%J1Oj3j1
$$ -10 -8 1 4 1 -21 -2 -6 0 -9 -15 0 11 -3 12 1 -16 6 -5 -4 12 1 7 12 -5 10 8 23 14 11 9 13 9 -3 6 -4 -4 7 13 0 -11
2133a1J3mj0oJ2jMqNrJ1mJ5Onk0POJ0j1J7j5J3%j3J4KMqj2kK6j5mLj1oOK0j3j9
$$ -11 2 -2 -12 -18 -6 -7 -3 -11 -6 -15 -4 -8 7 13 8 -12 -5 1 11 0 17 2 15 15 2 16 18 22 14 2 0 26 11 7 10 -1 -7 -1 19 6 -13
2174a3PJ0j9jQJ2j7OpJ1J4j3OMj2Rk%Jj4J3MlJ%jnJ1njLlRj0jqRMMoj8NRj6J3
$$ -13 -6 4 -15 -16 -8 4 -13 -7 -14 -3 11 -2 4 8 -4 5 3 3 4 -10 3 7 4 5 5 4 -1 10 5 4 7 4 13 3 2 -6 3 7 11 5 -13 -8 1 -15 -2
2219bjk3K6j2n%K0j0OnLLJ0nMnOj5J2nonK9Jj8J0lRj1pJ1mpoOqJ2ppK0k2oJ5o
$$ -2 -3 -26 0 -12 -17 -17 3 -7 -1 -6 -3 0 10 5 9 4 10 -5 7 2 -4 -9 20 21 3 13 10 19 8 1 12 8 1 -5 1 -7 5 -2 -9 11 -11 -17 -2 -8
2263hnkJ1KnMmjj0K4oJ1j8J7%mnrJ6qLJ1npjJ4Lj4j2MMj3J7j1ljqK0j5J6k2J0
$$ -8 -13 -15 -4 -2 -7 -3 -7 -8 -18 6 0 11 -7 10 10 6 1 -8 8 0 3 14 9 2 1 15 18 4 -8 -4 0 -13 4 -7 -10 -11 -19 1 -14 2 -20 -10
2305a0K%jmQrMJlkJ5kjlJ9j8LMmQrONmL%j0J%Jj2OrJ7Kj0pK2rj0jNRj9lJ2qOM
$$ -10 -8 -8 -9 -13 -5 -14 -10 -9 -12 -14 1 -1 -2 -5 14 -4 -1 3 -1 7 -2 4 9 5 8 8 -2 -1 -1 0 -12 -6 -15 2 4 -6 -13 9 0 -10 -11 -6 3 -16 -19 -7 -15 -9 -5
2354eRoJ2Rj4mj2L5k2LkqLOKmPj7J0J1k0%JmJ1KmqRj7J7j6PJ9pj9QRQk0KJ0on
$$ -5 4 -2 10 19 5 1 -11 24 2 5 3 -5 -2 4 6 2 9 -8 2 13 -7 -7 -6 -10 1 3 -1 -9 0 -17 0 -16 -9 10 3 -16 -8 1 9 -11 -9 1 -5 -10
2398a0LJ7Lj2kL%PlMJjrQj6J1llkQrpJ8j3qK2j3mMj1P%Jj%kJMj1J2J5j1MkN%Q
$$ -10 -7 10 13 1 -1 2 2 9 6 10 11 10 1 9 -7 4 1 -2 -4 4 -5 -12 6 -7 -15 7 -6 -10 -6 -17 -10 -10 -9 -10 -10 -12 -11 -7 -18 -6 9 -2 2 0 5 5 13
2445A3k1N%kJ6Kmj5jJ4ojj%J0Pk3mJ0lNpMj2jJj1J4J2nKPMkpNmNMj3jJ3Kjkp%
$$ 13 -8 -3 -3 -5 11 13 9 -6 -7 7 1 0 -1 -1 9 16 -7 -11 -1 -4 1 -6 -2 -14 -15 -14 -25 -11 1 -4 -2 5 9 7 0 5 1 6 10 -3 -4 9 11 10 8 1 1
2492AnK5j6omnK5k0OJj8J3jOLj1jnkJmJJ3Mj0LqOjJ%J6jPqpMjPJmj2J7lj6PNJ
$$ 1 -4 21 5 -1 -5 -10 15 -5 1 2 -16 -3 -4 2 5 -6 -7 -12 -14 -13 -17 -16 -3 1 -9 -6 -14 -8 -9 -8 -8 8 7 14 6 -1 3 2 9 10 6 -6 11 8 -8 -1 4 5
2540EMmjk1J3Jmj0K9k4lPJj1J5JKj6J2mJ1j0%K4j7j8L7j4pJ5qJ3pOnj0L%KrKL
$$ 5 9 5 4 -17 -4 -3 -7 -17 12 -12 -15 -8 -7 -18 -3 -2 0 -16 -4 -8 3 -7 -7 17 0 -18 19 5 -2 13 5 18 11 17 12 2 5 5 7 -2 0 3
2582Cj2kKJ5l0J7Rj4oK1%pmJ0k8K5qNkJ7JoppJ7j7J8pLmJ0nrLOMj4K%%%qJ4j7
$$ 3 -9 -11 -9 6 -24 -7 2 -12 -18 3 3 -4 -8 2 -26 -1 -9 -4 -6 11 12 6 -1 -8 9 -8 10 3 6 2 12 7 -2 1 7 11 -3 -1 -1 -1 -1 -9 5 -12
2626a2PJ5k3jJ0KLnJ0j5nQOmmmJ2qJ3mLMj7J3RNj9MnJ1mNj4JJ4j0KklqJ6j9j1
$$ -12 -5 10 -13 -14 -4 -2 1 -4 6 -9 -14 -6 0 -4 -8 -12 0 -8 5 1 4 8 -9 4 13 18 -1 3 -2 9 5 10 -4 -3 11 1 3 1 -2 -10 6 -13 -24
2669b4L5j8pLmQmJjJ2j7J9pjLKNqj0J3J1Nmj0JJRj9J0mKnL1j9j7jQj0jJ2j8J1
$$ -24 11 -7 -14 -11 -15 -7 -11 -10 -11 1 -16 3 -4 -5 -2 0 5 -3 -13 0 11 16 12 2 3 4 13 -6 4 0 2 -3 28 9 -8 -9 -1 -11 -12 0 -18 -7
2711g%jqJ9j6Ok%Nj9L5j6ljjjNJ5kk2J1kK5j0qJ2rQjj0nJ1pj1J1j1LQOpokj2R
$$ -7 -7 -8 -16 3 -13 -7 -9 -9 -4 -23 12 -4 -7 -8 -9 -10 -5 10 8 -14 -3 -5 20 10 2 14 5 13 12 2 -3 8 1 -10 1 -10 -7 1 7 0 -6 -8 -20 -11
2755a1mPj4NJ7mMLomJ1Nj3jLNOqJ1oj2%klJ4J7j8kNnj6K0j6kkJ2j2LoRPj5%J6
$$ -11 -15 -8 -22 -17 0 -4 0 3 -3 -7 4 9 -4 -5 -2 3 9 1 12 6 -6 -6 -8 -11 3 20 2 0 5 0 -16 4 -12 -14 -16 -4 -16 -13 -19 -10 -3 -18 -18 -2
2799bqMmpJ2J4j0KmOj1jpK9%k6MJJ7KLj4oJ1j%JnOpm%kj2K6Pj9jJ7k3QrMJ7rm
$$ -2 -10 -6 -10 -17 -5 9 -1 1 -3 3 -8 -9 -16 13 13 -13 -9 -8 9 11 14 0 -6 5 4 4 5 0 6 -1 -5 -5 -7 -19 7 14 -5 -6 11 -12 -4 -13 -9 8 -1 -5
2845ej2J6OJnQKjj3QOknJ4pmjJ0j6J2KopJmm%nJ4j8QQoj7PJNJ4nj0J2j8J5qmJ3
$$ -5 -17 -1 5 6 1 9 11 10 -3 5 11 9 4 18 11 7 6 16 0 12 14 8 1 2 -2 -6 -6 -11 3 -15 -7 1 -5 -22 -15 -14 -9 5 0 -10 2 -16 -1 -9 -13 0
2891@lMllK3pqNj0K0Krj2O%PoNj1kNmjOrlqJ1j6KJ7oJj1QK3j9NJ2%j1j0kJ9qJ
$$ 0 -3 1 -2 -5 18 11 3 8 -2 18 20 11 -1 5 5 12 6 11 0 -2 3 -1 -2 4 -5 -8 -16 -5 -21 -19 -2 -8 -7 -18 -10 13 -6 -1 11 11 0 -10 -12 7 -1 0
2937@MmK2k9J4Ooj7J6KrK2k5J0qPNpj4PjKoJjNrJ0pJ3rJ7k1QJ8j8KJ2j2%J5j4
$$ 0 4 0 22 -7 7 13 7 -10 6 8 -1 21 -4 6 -2 5 10 3 -11 -4 -5 -3 -9 -8 -9 -4 -13 -3 -10 3 -6 11 -10 -2 16 -2 0 12 0 0 15 1
2979AK0j1kpmJ6Lk8J9jokMjMrn%NLj4J5j9J2j6J7%jJ6ploJ6k7J0KMlJRQk0J0j
$$ 1 21 10 8 1 -3 13 16 -12 7 6 0 -2 2 1 5 -4 -9 -9 -4 -1 -15 0 -19 -7 -23 -6 -6 -7 9 2 -1 -7 9 -18 -8 -6 -2 -5 -4 5 13 -7 3 2
3023BRk4J3KNJj1PplkJ4j3K0k8J2J7k4JokjLJ2j3NLjJ1PrJKj3K4j1%J6j4JOk3
$$ 2 11 -13 0 2 7 8 -3 4 -3 -6 -8 6 -7 13 -15 -3 14 -10 -9 -15 -17 -18 -15 -3 -16 -11 -8 -9 2 9 0 1 3 -10 14 3 3 19 5 6 12 -11
3065a1J6j3J4olK0l6J4MJLpmo%J1k2J0RmKnkJ0j1OOoOkJ9j6ORlmpOqOJ0rNKJn
$$ -11 5 -8 6 0 -3 17 -19 -5 -1 0 3 -4 -8 -14 -14 -3 -25 -15 -6 -10 -8 -13 -15 -5 -16 -10 -4 -10 -4 -6 13 -3 3 12 9 5 -2 4 -4 2 12 3 8 10 11 6
3111FJ2j9jNOJpj5J5Lj2MNnkkj6K4j8RmJ1oJ1llJ1j9K3j1K0j1%j1%jKPLJqJ5j5
$$ 6 18 -1 -2 3 9 10 3 -12 3 6 -6 -2 3 -2 -4 -6 -22 2 -16 -7 -11 0 -6 5 2 -1 10 -9 14 3 23 12 12 1 1 0 2 9 12 13 5 20 5
3154Epl%K3j8J%pkNj3PnqMOJ0lJ1j0oK4j7OpRN%j5J1JLkoLNj0PmJPj9J1J1k5J6
$$ 5 -2 -5 -5 18 0 1 1 -6 -8 -3 -16 -9 -14 -22 -18 -12 -2 -5 6 -4 -10 14 -3 3 -4 5 10 10 -5 6 7 10 8 2 5 10 0 7 3 4 11 -8 3 14 -11 5
3200EJj7QonM%J1j9J2lJ2j5K2j5jJ1lk1K9j3J2koJkj1J4J2nJ3j1k8K7j0J2npJ2
$$ 5 6 -11 -3 -9 -14 -10 -10 1 -18 -6 -9 3 -12 10 -5 -6 5 2 -19 10 -3 9 7 1 2 0 -11 3 15 10 23 12 -16 11 1 13 8 1 13
3239A3k0NMojLmRLk1NoJ2lnoJ0NNj0Oj0PmK1rMqJQjk0K1j5jPpJ4Plqkj5J1j3R
$$ 13 -7 -2 2 -4 -5 -2 -6 3 6 -15 -10 -16 -4 -7 -12 -18 -8 -3 2 -8 -2 -12 -5 -9 12 3 7 -1 0 8 7 -13 8 -7 -8 -1 -8 6 13 10 2 0 -15 -4 -17 -8
3285hJRmk1KmjL1k0j0QJ0kJ3rMjrJ4J0oj3K5lmk0J6LNmnkRj5jRlkLrQPkrnLnl
$$ -8 -7 2 -2 -23 -21 -25 -26 5 -15 -25 -17 -7 -9 4 -5 -1 -2 -11 3 13 7 -6 19 16 12 -8 8 11 16 12 7 5 14 -1 -2 7 4 2 5 -4 4 11 9 0 -5 -2 -7 -10
3333a0J4Lj0j2J2QqLj%rRj0J8oLJQJooJ7k5J3J6k9J0MOqk2NJ1lj1OLKlkKRLj6
$$ -10 4 7 -3 -15 -3 5 -3 0 -1 -1 -10 -1 -11 7 1 4 5 13 14 8 2 19 -6 7 23 -6 4 8 14 6 -16 -11 0 -3 -14 -8 -5 -3 -6 -8 -6 3 6 -10
3377a0J4mlJ%J6j0K1m1OJ1NppJ4nLJ4rNMnrJ6k3Qjlqj2K9k4RoJJ3kJ%qKjJ3k2
$$ -10 4 0 -3 -2 -2 14 4 25 -16 -10 1 6 -1 -8 6 1 4 18 9 14 18 13 4 20 -3 5 4 1 -7 -19 10 -14 -5 -11 -10 3 1 2 2 -6 -4 -5 8 -14
3421a4%K6k0J7jj7KKK1k1MN%pJ0Rj1PmlKopLOj3J3j6mJ9j7RlNmMNmmLLJmJ2lk
$$ -14 -14 12 -8 9 8 -9 -7 -5 16 -5 -1 4 4 -3 7 16 5 12 8 5 7 1 -6 -3 3 -10 3 -13 -17 2 -15 -6 -9 -4 -8 -4 1 -3 -7 -4 -1 0 -4 8 5 3
3467CQ%JlJ9j7Pjk1LQlJ8k9OJ1lJ0j9jKRlqooK0J%qpJ9j3j2J3KQJj2kJ3nRpK5
$$ 3 11 11 12 9 28 11 18 17 -4 -1 7 4 22 -7 -1 10 7 17 -2 -3 -1 8 5 -3 -9 -15 5 6 6 -2 -9 10 -3 -15 -2 0 8 9 -3 -5 8 3 12 5 30
3512C0j5j1J2pJQkj6J3ok%%Nj5J5j7JPKjnj3OKQj2JpNJ0JkKNpMrJ3pJ1Mlj0J0
$$ 30 15 4 16 9 10 18 16 0 13 7 5 5 5 10 -5 10 -7 -6 1 3 2 -3 -16 -10 -8 0 -12 -11 -18 -13 -3 -2 -4 -2 3 -4 0 -9 4 -3 8 12 9 -1 9
3557IKLj4J7j0pJ9j1nj0RmoQkJ2nj7kOJ3j2mjrJ1KJ5mQqpRj4J6Qj2KKlLnQ%j1
$$ 9 11 14 0 17 7 0 19 8 3 -7 2 -2 -8 0 -2 10 5 -12 -14 -8 5 -7 -11 -12 -21 -10 -8 7 3 11 3 -4 5 -9 7 15 3 5 7 4 7 2 10 10 -1
3602aMJ0Lj1Rj1%mokONpMmkJ3Kqj3PlMLk5QJ9%J3Mj1kJ4lj2J7j1MmqMMj1J5j4
$$ -1 3 13 16 5 14 3 3 -1 -7 -9 -3 2 -5 -1 -5 -7 6 8 0 -13 -6 -9 -5 -2 -27 -19 0 0 13 17 6 4 18 15 3 20 9 13 9 1 5 9 -2 13 -1
3647aJo%MmJlPojnJ2%j2KMKOLnkJj1J4oJ5j4mJ5Mj2LK0oOrLj2%LlPLj1qJ3j3p
$$ -1 0 -6 -6 -2 -6 -5 -8 -1 -7 -8 -13 -1 -1 -13 -11 -7 -5 1 4 -1 -3 -2 -13 1 -5 10 -4 -8 7 11 -1 2 22 16 22 13 16 4 4 7 4 11 14 3 -5 8 -5 -12
3695a2NQk0O%jpJ7k%j1K2j2MQmpK%J0J1j2l%J8j3J2%j4mJ7Jj0MRpj1j9J8J1rp
$$ -12 -7 1 -19 -13 -13 -14 -21 -4 -6 -6 -17 5 -7 -3 5 1 -6 -4 -4 6 17 5 2 2 20 7 19 19 5 1 18 19 9 13 22 15 4 -15 3 14 5 -2
3737bj8K0qLLJj8J7J4j6mJ0j2J2pLkl%L4j3k2QJ1J3j7JqRJ6k4RJj2jlJ7nk1J7
$$ -2 -20 0 -8 -5 -2 -1 -19 -2 12 -4 -8 2 -10 2 -5 -2 -4 -7 -7 27 14 -8 0 11 24 7 8 0 9 25 1 10 11 -1 -2 -5 12 7 -14 3
3777Cj2J1j%%nPkKj3PjnmJ5MPjj0qPJ%NpoJ7J2j7Oj2QJ1j7J3j9K0jj2Qk1pK0o
$$ 3 -9 2 1 1 1 -4 3 1 3 -10 -3 -4 -9 -13 2 6 13 12 2 -6 1 2 2 7 0 -6 11 23 6 12 0 8 19 2 15 -4 16 15 3 11 -10 -17 3 -3
3821c%LkPj2o%PkLJ3Nj9MK0j0j3J1qMPmmLJ1oKj1j0%J8%nr%MmnNjLojmmJ8Ooj7
$$ -3 -3 0 -2 5 -7 -13 -13 -6 -8 -5 8 13 -6 -2 18 8 -5 6 -2 2 9 5 1 4 15 9 11 0 -10 -10 8 8 3 -6 -6 -2 -6 -11 -6 -7 -4 -10 -11 -15 -19 -1 5 -1 -18
3870a8J7J1k0J9j2j8L1qJ7k2J9nj0K7j5joQMj4KpRj6j2K3j4MrJ9j5%Qkj0NK0k
$$ -18 -1 10 -10 9 -3 -21 10 2 19 -3 16 11 1 28 13 12 6 14 18 4 6 -1 8 -8 -20 3 -11 -7 -16 3 -12 -12 -4 -6 -16 -11 9 7
3908Gj8KPJ4j2%NqpJ4oJ0okkLLKnMNJNmj7J6KnNj6K%LkpRj4%LLJ1nnmK4j4j4J1
$$ 7 -11 -9 -2 12 0 0 5 -3 -10 4 -2 8 2 0 -2 1 4 6 1 5 10 11 16 12 -5 11 13 8 13 -3 -1 -1 2 0 -7 2 -12 -12 -9 -6 5 0 -5 -9 15 1 -13 -2
3956bmRKJj0KJ3%j2NJ%%J5rkj1Lj1J6lpRQk9K2oJ0j5jMj9J2rK5j1j0J3%MkLpM
$$ -2 -6 3 5 6 -4 -2 11 11 -1 4 5 5 5 20 11 9 -2 1 -10 6 3 -4 5 13 -16 6 0 10 -5 -6 -2 -21 -9 -18 7 -4 -14 -1 -1 3 1 4 -3 1
4000AJNjoK2rOpj4OMLJ6k0j2J2j2J4rnJ6k3J9j1nj2J0mJ1mJ2k3K5j7PrJ0j0jJ9
$$ 1 2 7 6 0 22 13 19 12 -2 4 8 11 27 7 -5 7 -5 9 0 -5 11 -12 7 -4 -9 -21 -11 -15 -4 -8 4 -19 6 -11 -4 -13 -3 -13 -14 5
4040Ej2PnK2j8J6lnj1NmRMQk3%KJMj4QNjqNJpj0J0j1J6n%K%qJ1OmkKqJ1ljMJ0
$$ 5 -7 0 -5 17 -1 15 12 7 -4 1 -3 6 10 18 -5 -5 -3 -2 2 -12 -4 1 0 -8 -3 -2 -9 -19 -9 -20 -4 -9 -9 -7 -7 -15 -4 2 -2 -4 -2 -10 1 -2 -3 1 11
4087A1k0J4J1j8pORMnJLPk0jJ0Knj0J9j1j8QNJqJjrJ3Qj9LJ5ljNMrJ0j%kKnPJ
$$ 11 -9 5 16 -2 -9 -3 6 10 5 6 9 16 -4 -5 5 7 2 -8 11 0 -18 -10 -5 -4 -12 -11 -12 -21 -8 0 -19 -16 -1 -4 -5 0 4 -5 5 4 4 2 4 -1 6 7
4133GrJ6j0PqQklj3J0j3K2j5j7LJ7ok3J8lJ4mjkj0PmNJJ6j5NpjJ2Mj8J5lmQMj1
$$ 7 -2 14 4 11 3 11 9 6 -7 3 -10 12 -3 -20 -17 0 -6 -29 -11 -14 0 -4 -5 -7 -17 -10 -14 -9 -8 8 -7 -2 -9 -10 2 6 -12 3 0 -4 4 8 -3
4176ckmJ2MpkOpmJ5k5K2j2jKLnPrKkpMJ6qrrJ8Qj7RONLpOmJNoMj0J3lj1R%j2J1
$$ -3 -5 -9 3 7 0 -2 4 -3 -7 8 -17 5 -7 -8 -6 -3 -8 -1 -10 -8 -10 -17 -13 3 -5 -14 -23 -5 3 -14 -5 1 6 9 2 8 4 5 10 4 8 -2 11 8 -3 6 6 -6 5
4225EMj1qJ3lmoMkj3PJ3mjj0%OkkL1j5J0j7LQj5J2kJ2Kj7J2JRrj1Qj2PPj0kNl
$$ 5 9 -2 -10 3 0 -4 -10 -6 -8 -21 -14 -1 -5 -6 -16 -16 -10 -12 -14 17 2 12 -5 -2 6 -9 3 1 13 15 -2 10 11 20 11 0 8 -4 3 10 0 -2 3 0
4269@plpK6l0K9qj2jJ5rj2K2kJj1J4mmJ1qjJ3j3J2l%j1K1oj5J7j0qRj0J2j1Oo
$$ 0 -7 -10 -17 9 -21 8 0 -12 -13 2 -7 -19 3 1 2 -9 5 1 -3 8 0 -1 12 -1 11 8 8 -3 18 12 -3 14 4 -4 5 -5 7 -4 2 -4
4309dOkLLrmqK0Mk0OoJ2%nj2J6O%%KJJnnJJ1rkJ7j1jRmrjqJ3Loj8J3lj4OJ8j0
$$ -4 2 0 3 6 -3 -7 -15 5 9 -11 -5 -11 1 1 -4 -16 0 6 6 6 8 9 10 5 0 1 12 3 1 18 7 6 15 11 2 1 -7 6 9 3 -15 -2 -5 -19 -13 5 -5
4356eJ7j6j3QRJk0K6k1%RrJ0QJ0j3jMmjPmOnJRj7J1MqJ6j1nj2J0Qj9KJ5j3KLl
$$ -5 12 -4 -17 -9 0 1 -19 7 -14 -14 -5 -14 -4 4 14 1 0 4 0 -1 6 2 8 3 4 13 -4 7 11 3 19 8 3 -9 1 9 -10 -8 7 -6 -4 -1 -4
4399dOj8NJ4Mj5%PRj1KJ1k0MMQqJ6qjNlJMpoPRj4j1K2Qj0nMj8RlNnoMJ4Lj7Pj2
$$ -4 2 -16 -11 3 7 -8 -8 -1 8 -3 -1 10 -10 -6 -2 6 -2 14 6 5 10 7 8 12 5 -1 6 15 1 -10 12 20 10 5 9 -9 0 -3 2 -3 -9 -5 9 12 -5 2 -10
4446a0J3JrLRpmJ7j2MJ3p%pl%NrJJLL%LLj9j0L0k2J1k7K4lk1J6J0j6RLrP%NoK3
$$ -10 3 4 -5 -2 7 0 -4 13 1 5 18 11 11 4 1 1 6 -3 -2 -1 2 5 5 8 11 -8 -18 12 -10 1 -26 -2 -5 -26 -10 0 -16 -7 -4 -13 -6 -6 -1 -7 16
4491A6k3nRJPJOMkmqmQLJpR%j0%Mmj0PO%j6mJ0j3J1oPK2ojk1OJ2j0JRj2RJ2k1
$$ 16 -7 -12 -3 -2 5 6 12 16 14 10 2 -2 6 9 10 3 12 12 2 2 6 2 -8 -1 5 5 -11 -15 -5 -18 -7 -13 -6 16 10 9 -12 -6 6 -4 -3 6 -6 3 15 -6
4537fOOqJ1LOk4PJJ6Oj2j6J6jjj5J2omPrjj2J4mklQONqjollkJ7KJqPLQj9Q%j0
$$ -6 0 6 -2 9 12 18 -6 1 2 18 24 12 -4 12 11 10 -5 7 1 -3 4 -5 -6 -18 -4 -8 -10 -13 -5 1 6 -2 -3 -9 -12 -15 -17 0 2 3 -5 2 5 13 -6 2 2 -8
4585hK6j0nJ1j2RMj5Nj6K0nnJ2j3J3rj3J2Kj5ORj9J8%j1pK4mj6J%lK4%lLQk5J4
$$ -8 18 8 3 14 2 11 15 0 5 -11 9 4 -1 11 -2 11 2 -11 1 3 -12 -6 3 -16 2 2 -9 -16 8 4 -12 -11 -11 -14 10 10 7 10 18 -7 7
4626GJ0%j1KnRj6J3mj7J0JR%j5RqljQlj1K2j1Rk8K5qqJ3KoRJk2K1Oqj0QJ5nPk5
$$ 7 17 17 6 8 3 12 -4 9 5 -12 -2 -1 8 8 -7 2 -6 -9 -10 -2 -5 -16 6 -5 4 -24 1 -7 -15 -2 0 -6 3 4 -18 3 9 1 -9 -1 14 9 16 -9
4670iOJ3j2J2oMk4MjK6j9J0j4J6j8KmPnlNlJ1J1oKNj1j%jJJ4j0pNj1J5qoJ2J1
$$ -9 -3 10 -2 10 4 8 -16 -12 -13 13 -6 4 -10 6 -12 -10 -14 -7 -12 -15 -10 -13 -2 9 3 5 10 -1 -2 -2 -3 -2 12 2 -5 0 -11 4 -4 -10 2 13
4712A3rMj4K%Rj3J4rJ0j8J4j4J0Mk8J1OQPj4J1pj9J4lJ5oMnlJ8j2J0%k1J5oJ7
$$ 13 4 8 -6 -4 -4 5 -8 6 -3 7 -11 3 -11 -1 3 -25 -14 -8 0 7 -7 4 -3 -22 -8 -11 4 -2 2 -3 -6 12 0 10 10 -11 4 -2 15
4751A5Jj5J1qJmLQk5J3ppNLNMj3J3j4K%jmmNJ4nJPKj2J5jOllJ4k7J5njPnpQMj7
$$ 15 16 1 12 4 5 1 4 12 -13 0 -7 -14 -9 -6 -1 3 -10 3 -11 -9 -9 -10 -14 -18 -13 1 -4 -3 4 6 -6 9 8 14 11 8 22 -5 10 5 4 11 6 -1 7 11 -6
4798fMLkj6J7Kj2K1j9j1J9rpKLPqQnNKLrmOMlJQj5J0NnR%lPrj0J5j4J2kk%j1J9
$$ -6 -2 1 -1 -17 0 2 -10 11 -8 -19 0 -9 -16 -14 -11 -4 -12 -4 -9 -4 -2 1 -8 -12 -6 -2 -5 -4 4 -11 -1 4 -1 8 8 5 12 3 -7 8 -6 6 4 2 2 -9 10
4845A0lJmk0QLqJ4j1%qJ8Rj1Qj6J7nmJ2pJ8j2oPjNlKoLRKoJonJ4j7Opj5J5LQj1
$$ 10 7 8 4 -16 -8 -5 -13 1 -10 -10 -18 0 9 -2 6 -10 7 2 -2 10 3 21 9 3 10 9 14 11 13 7 10 19 21 15 16 10 5 19 2 8 1 -14 1 4 12 1
4891Aj1J0j9K2j0%J2j1PnKlPqj2K6RkLJ2k7Lj0KJ3JOlj9NNj4J3Rk2J6mj2J4j2
$$ 1 -10 0 -19 3 -7 -7 5 -6 1 -4 -2 -5 2 -6 -18 8 17 15 18 30 3 6 -4 -2 11 12 18 15 -4 1 6 -8 5 14 -8 8 4 -8 6 -6
4931fkRkrJ5k1J1j5OLNmK0j0Lj6J1PoJ4Lj7NLJ3lqolkJ8nJ1k9J6Krom%Pj4PLo
$$ -6 -8 1 -1 -10 5 -16 -5 -20 -14 -11 -6 -10 10 0 3 -13 -2 5 -1 13 16 -1 4 7 20 17 9 3 0 -2 16 11 22 -7 9 11 2 -4 -8 -8 -1 -15 -8 -5 -11
4976a1PKj2MJjOMLj3J7j2J5j3J0j3J7lPMj5J2j8QonK3nj3jLj2J0oLrORnlKj1J2
$$ -11 -4 -2 -14 -10 -9 -10 -4 0 3 -10 7 -5 10 -3 7 -6 11 8 15 19 4 16 -2 6 0 -5 18 13 0 -1 2 -10 0 -6 -3 -12 -6 3 -2 -5 -3 -14 -2
5019bj1j8K2mKMrJ3kMMj2J6Pj6J1kOj6KJ4k1K8j2Mj4KJ0lrNknoPJoNoJj2J3jK
$$ -2 -13 -31 -9 -13 -11 -7 -16 -3 -5 -1 3 -9 7 14 -2 9 7 13 -3 -1 13 -8 20 8 12 -2 0 10 7 -2 3 1 -4 -10 -3 -2 -8 -3 -9 -8 -20 -7 -8 -6
5063fqJ7j2PKjJ4j8jJ1Pj1oK1nj8J6qJ2jj4jJ3k2QJ2j2nMoRpmJ3k0K2Qj6njOJ
$$ -6 -14 3 -9 -2 0 -1 13 -5 -6 5 12 1 -5 16 11 -7 9 1 13 12 -2 -3 10 -12 -4 8 -4 -9 -5 -11 -2 -9 -13 0 -20 2 10 -6 -11 -12 -6 -5
5105eKjJ4l%Nj1J8j9mKQk5K8jOj6KNljjMj7jJ4j0k3L8j2JJpJ3olJ2k1J2J3oNr
$$ -5 -3 -4 10 7 7 12 1 19 0 -4 -2 6 -19 9 8 14 -2 0 5 2 1 0 4 -13 -14 0 -10 -33 5 -7 -6 -5 -12 1 -5 -8 4 -17 -5 8 2 7 -2
5148bpJ8k1%J6%J1rpjJ2Pk1MmRmoJ6qjlkpJ1k0K0j1Rj7%J1JjLmolJ6JmrLOJ4j3
$$ -2 -9 9 -12 -12 4 4 15 6 -1 -2 10 17 -4 0 -4 5 1 -5 11 3 2 -1 -3 -10 1 -19 1 -10 -1 -18 -18 -7 -6 -7 -4 -8 -14 -17 -1 0 -4 -13 -10 -4 10 -3
5194cnkJ7j3PK4k7J3kJjpjjOjrMKqnJ5j8pJ3JPj2qJ1rJ5j1rJ3jmLJ1pJj0NMQM
$$ -3 -8 -10 7 -6 1 25 -2 11 9 10 9 2 1 0 6 5 -4 0 2 -6 -11 4 -14 -21 -8 -7 0 -12 -20 -9 -18 -3 -14 -23 -10 -11 -15 -12 -1 -8 -7 -17 -12 -8 0 4
5240DLkjMj0jJ8j7%JoJ4j8J7j3QqlpJ4Jj0j4K0j0OlK%KJ1k%pK0l4K0KkJ0OPk3
$$ 4 7 5 4 8 -2 -3 15 -2 -2 -1 -7 7 -11 6 -7 1 -7 -10 -17 -3 -2 -12 -26 -6 -16 -10 -13 -11 -11 -9 2 0 0 -7 13 -21 -1 1 -1 9 15 22 -1
5283ak%OOj2M%QJ%Ol5J0J3Jj4J1pj9QNJ5j7jqjK5krj0J8kqR%OKkj2J4loJ8oLj2
$$ -1 -3 -3 3 9 -3 1 1 9 10 10 16 -19 -9 4 5 -9 2 -5 -24 -16 -11 4 -13 -14 -22 -23 2 0 -9 -19 -1 -3 -11 -2 -2 4 6 4 -8 6 3 -3 15 9 12 0
5329@J9j3kLjlj0kNrNJ5j9qPNqQnqOJ0%NmkrJ3jRj6QRrJ2jmKpj4NJ4j6J6nJ1k0
$$ 0 19 6 4 7 6 3 -7 -9 -4 -13 -8 7 -12 -20 -13 -8 -16 -8 -13 -21 -15 -5 -5 0 -4 -6 -15 -2 -3 6 -10 -2 7 -2 10 9 5 7 0 -14 -9 5 -11 5 0 11 -9
5376iJ8mpKrLJ1j1Jj0mOkJ6j1j7K8pqLJ3nmJ4j1j2J4Rj2J1j1J0%mJ9k2JjQj6J4
$$ -9 9 5 -2 0 -9 -6 5 -6 -5 -15 -19 -13 -15 1 -10 -27 1 -6 -14 -11 2 -3 -7 7 -4 -16 -2 7 -5 6 -5 5 5 1 20 -2 -1 -2 6 -10 4
5417Dlj7J4j8J0Rj3J6j6J3Lk2JJ8Mj8RKmoQmPlKK0k5J1l%MMJ0j1k6K3mJ4nj1r
$$ 4 1 -16 -2 -20 -10 -1 -14 2 -14 -1 2 -20 -19 -1 3 -15 -6 -4 -8 -14 -6 -10 -3 -6 -4 16 -9 2 -1 -1 3 7 17 6 -20 3 -1 13 8 -3 -12
5458a2KJ2j3RjLj9J7j9J2jJ3j2Lj8RJnJ2LJqPjOoJ2LnK6l3J1pPLkkjnoMKkkJ7
$$ -12 -10 2 -11 -2 -3 0 -19 -2 -21 -9 -10 3 -9 -6 -24 -15 -14 -19 -7 -4 -3 -11 -4 -5 1 -5 7 10 5 31 -2 9 2 9 12 10 8 7 2 -4 0 2 0 -2 15
5503A5roj1j0LNlK3k2OKOpMOj5QMKOnQrRoJ2k0J6j2Mk%J3rRj8jjJ6pOnj3J0pP
$$ 15 6 0 -11 -21 -18 -13 -16 7 -15 -9 -7 -1 -8 -4 2 -13 -5 -1 1 7 2 10 1 10 4 16 -4 12 0 4 2 2 15 6 15 -3 -4 -5 11 4 10 5 -8 2 -5 2
5549BJmkRJ1rj1KJ2k2J2M%OlpQnJMj4OKjJ0loQonPkOj4LoMQq%j6J4Nmj1J3r%K5
$$ 2 3 -1 -3 6 17 8 -3 -1 11 -11 1 5 5 11 8 1 9 4 5 9 -5 1 3 2 12 9 3 11 5 0 7 5 11 -3 0 -6 -2 6 -2 -2 -18 -4 1 -3 -14 -1 -10 -10 15
5598A5j0oKRj2J6j1LKNj2OJKPkj0jRk6J5KLkOorN%Op%J2j9pPJ4j2%nK8j9jkRj
$$ 15 5 -1 1 10 -2 14 3 6 8 13 1 7 8 10 17 15 5 4 13 -13 2 4 7 5 11 5 -4 1 1 7 0 0 12 -7 -14 -7 7 -5 -5 -10 18 -1 -2 -4 5 4
5644Dj4K0kMQj1j7QKK7j3j2LOjmjNjnjMjqKj2J2JlMj0Kj4J0lJ4moJ3k1kJ4J7j1
$$ 4 -10 10 8 12 20 9 -8 0 2 29 16 4 7 13 12 8 7 12 11 6 5 9 8 0 2 -10 2 3 0 4 -6 -4 -18 -8 -11 3 -1 -7 6 -15 -17 -3 14 3
5688COj2KJ5rQj0JmJ0J8j3njljmLj0kLJ1o%MrKnlK1j0mJ8j6QmM%Oj8KQKQqMKN
$$ 3 9 -3 -1 14 5 13 3 4 0 10 28 15 10 9 6 5 1 4 -6 -8 -5 6 0 0 4 -5 -3 -8 -11 10 0 -4 14 -2 6 2 6 6 12 -6 -4 4 6 14 6 10 12 17
5736A7l%kLj0Nj0JLj%j6J9J0k4J0j6J4QrrNlKKLNKj0MK%QKj7J7Kj1lJ3rJKJPj3
$$ 17 14 14 12 15 5 10 0 1 4 3 3 -13 6 16 -8 2 -14 0 8 -1 -10 -5 -8 -6 -4 -1 4 6 -4 0 2 2 10 12 -5 12 14 3 0 13 4 5 7 8 15 2
5782BoJ1PolkkNQj1j1km%nJ0oJ3nj6K1Qj1J0Nj8J9j2J7jlJ0j6Rj5Q%mR%q%jJ1
$$ 2 -4 7 14 8 5 3 1 6 14 3 -8 -10 -14 -14 -19 -9 -15 -2 -7 -23 -2 6 -5 5 10 -8 11 -1 16 15 12 22 6 15 0 8 8 4 13 13 5 5 4 15
5826A5nj8jJ6mJoLpOnJ0rlNqmRJ4jj1rJ1PjoQjnK3Jj3j3J0qOJ0pOoj4QK%qQJ%
$$ 15 10 -8 -9 7 3 4 -2 1 -6 0 -5 5 -4 -7 -2 -10 -14 -5 9 8 -3 -12 -1 6 5 -1 7 6 1 24 25 12 -1 9 1 7 17 10 16 10 -4 4 6 6 -2 6 7 7
5874GrK%J6j6nmRj4Q%J0rQnJ2plJ0nLoJ6nqQPnj0QJ1pj7PmrK4j2rPj6J0KRk3J5
$$ 7 -2 0 0 16 0 -5 -9 0 -14 -6 -6 4 -5 3 -2 10 3 0 10 5 8 2 18 13 5 13 20 15 5 13 24 17 0 7 3 -6 18 6 -3 4 -12 -2 0 9 -14 1
5920Aj5J8Mk0QkJ4j1NJ1j3NLpJ1Mmj3J4RrOk4K3pkjPqnjMnJ1rOKj0lj3QKnRoK
$$ 1 -14 4 8 -12 -4 -6 8 -3 2 13 0 5 8 1 12 16 12 -1 13 22 13 19 -5 18 11 9 8 15 7 2 1 5 0 11 2 8 10 0 -3 -16 -8 -6 -11 -2 -8 -6
5966fJ2Prj1mPPJ3mnj2J8pkJ9j0KqloRKnJ6j9kJ5j1kJ2jj2jJ2k0J4j3J6j4J7j6
$$ -6 6 13 4 -7 -11 -4 3 16 12 7 -5 13 6 4 23 13 15 7 4 -2 7 9 4 20 1 -1 14 3 1 13 12 0 -1 11 -9 5 -8 8 -6 11 -5
6007eLK0j7oPpK6k1K8k7jJ2j8J0NJ6%k1QJ4j2qRlj4%K0jk5Nj2K5oQprPoqJ4Pj1
$$ -5 -2 18 1 -5 2 -5 21 0 28 1 0 12 -6 4 9 25 25 4 12 26 14 6 15 12 -2 -2 18 17 -8 -3 -15 10 4 12 5 -4 3 -3 -11 3 10 -1
6049aJMjrJ0J3k2OqNKMlLJ4j2LLrLJ6qj3MJ0k4QRlqjMj5L2j9Lj%Pj1J4k7J7Rj5
$$ -1 0 4 3 -6 4 17 -5 1 -7 -2 0 4 1 4 18 6 9 12 3 6 22 14 1 5 15 -9 -1 8 5 -3 -4 0 -15 17 -2 1 0 0 7 -4 10 -17 0 9 -6
6094fJ4qJ2rJnROkkQkoJ0J7j8qQj3jqNRJ0%j2qMj9J4%j7RJQKKlloJ4lJ3Ol0J6
$$ -6 8 0 12 3 4 -1 8 14 12 10 18 16 10 20 37 19 11 19 6 5 -3 2 11 21 21 9 1 5 -14 0 0 -17 -8 -7 1 3 5 2 -1 -7 7 4 17 23 -7 9
6140IqJLKJ5j6J2Lj2Qk0J6oJ0j0pkOkj2J3jnMNj5MQnrPNj1QNj4K0%j0kPmrJ6J8
$$ 9 1 2 5 7 22 6 18 21 9 17 -3 13 7 17 7 0 -2 4 2 -10 3 2 -3 1 6 -9 -5 3 -2 -11 -4 1 -10 -2 3 -11 9 9 -1 -3 4 0 -9 7 25
6185B5k7J2oJ4nLj1J2k1KJ5lrrJ4j2pQRrjpJ6qQnk%m%j3J8qJ5jj5L1j1J3k2K1
$$ 25 -2 10 4 18 13 16 5 17 -4 -2 13 10 1 -8 6 -6 -13 -5 4 -5 -6 -13 3 -5 3 -2 -4 -4 -8 -8 -21 -3 -11 4 3 -12 19 8 21 -1 20
6226B0Ok0MJ8j8MrPmlPj3MmJ5j0pOk1K2j0Kj6PJ4nN%j5KQLMj8J3Pkj0J6Onk%J3
$$ 20 26 6 10 28 10 14 5 12 8 5 12 -1 3 -1 14 4 -3 3 -18 4 -6 -4 -20 -13 1 -4 1 1 -14 -12 -4 -1 3 -15 -2 5 3 -7 9 15 10 8 8 21
6270B1j3Rj1kJ0ppJJ4j1nJ3rMq%PLrj0J1JplmONpPj7J8KNJlOjJ0rK%mPpKKj3J7
$$ 21 8 17 6 4 14 7 0 1 15 4 -1 12 3 7 -1 -1 6 9 0 -10 1 2 -5 -8 -12 -6 -1 -8 -1 -18 0 2 7 8 5 11 10 20 11 13 13 9 16 9 11 13 0 17
6318A7noKJOLj8NqKrPOpmJ4jO%%j5OJ2j9J2mJ7k0nJ1mPNmJ0k9K0J0j2JRl0J5M
$$ 17 12 6 8 9 15 18 0 5 -3 -1 -10 -3 3 -4 -8 6 5 11 11 11 -4 2 14 -5 7 3 20 0 -5 6 2 9 14 10 20 -9 11 21 9 10 19 -11 4 8
6362Hj3J3rl%JmKJ0j1j7J6Q%Mk1K7pj1J4j6lJ1QpRQrJ6Nj7Ok0J6jNrlJ0oj0K1
$$ 8 -5 8 -1 -4 -4 -3 -7 -5 5 -6 -23 -7 1 1 5 -16 11 4 -7 7 -9 -12 -1 7 0 9 17 8 24 29 12 18 -2 14 13 18 9 6 16 10 0 21
6404B1j1NrpPoJ1j7Qj2lJ9Oj0Qj7nRmJ3j1Pj3J4nK0j4J3kMk2J5J1j7KloJ4rnN
$$ 21 10 15 6 -1 6 0 11 -6 2 -10 -13 6 12 2 10 -7 -12 -3 -7 6 -5 2 -11 3 -2 18 4 17 15 19 -3 12 23 6 8 5 -1 13 4 -1 4
6445DnjKJ2k4J7j2mJ9k1J0onJ1%Oj4Qj8K0nqK0Pk7K7oj1J0kJ0j0LJ2j3klQmJ0
$$ 4 -1 -2 0 12 -12 5 -7 -11 8 -13 -3 -9 -14 -3 -3 3 -11 -3 -21 -1 -6 -14 6 13 -14 13 7 -4 6 4 14 4 7 19 6 4 1 9 5 15
6485A5j9J0j4J9j8mmQJ6Kk0jljJ1j4%NLnK8j3J4j7%RJOJoJKnJjqRlj1NOj0j2l
$$ 15 -4 6 -8 11 -7 -11 -15 -7 9 11 -9 -10 -13 -14 -3 -17 -17 -12 -9 -14 14 1 15 -2 -2 7 8 14 15 9 10 12 7 8 7 -1 8 5 -6 -1 5 -5 -17 -20
6529b0L6k9J8pj0OmJ0pqkK8k2MJ0kk3J8pL3k1JmJ9j1P%Jqj0OKjQoKPj7OolJ7o
$$ -20 16 -13 5 -2 -12 -6 -10 0 -7 -15 -17 11 -11 -7 3 1 -22 -4 -11 22 1 2 -2 17 6 13 13 14 6 -4 2 4 3 11 5 7 14 -3 3 -3 -6 11 5
6572EJ0j0j2jJ4j8PLJoJ9j4pQlQlmqQQLpNqRNj5QLqK3k7QJ3j4J1k0pJ5j7J6oJ0
$$ 5 15 5 -7 -8 6 -12 -5 -2 -1 -7 12 -2 -9 -1 -4 4 1 -3 -11 -3 5 8 1 6 -2 7 12 -3 5 8 0 23 -4 4 17 3 14 -6 -13 2 -15 1 -5 5
6616Ej0jLlj%mRLPj1pNNJ8qj5JJ1kmK2kqmrJ2JKKrKLPj1j2J2Kj5j2PlK2j7jjJ
$$ 5 -5 -6 -3 -6 -7 -7 -11 -2 1 8 -3 -10 -5 0 18 10 -5 -4 7 5 1 23 21 13 9 0 12 13 15 17 8 10 13 20 9 -3 9 11 -4 -16 -9 -12 10 -7 -8 -9 -8
6663hQJ1j0mJ0j0OJoMjJ2qmJJ4nLj1JqJ8Jk1J3njJ0Rqj5OlMrKoj0J1Rj1LNj2M
$$ -8 0 11 1 -3 7 -3 3 4 -2 2 1 13 5 1 2 16 11 14 3 4 -4 14 15 -6 7 2 1 11 20 12 -3 3 0 4 -5 -3 -9 -19 -8 1 -10 -7 -2 -14 -10
6708a0NKqkLK0mPk4RkJ4J%J7j5Kq%J1oKjrOqkoJ3j1nMLlpJ4nOrJj3J9k5L5j6%
$$ -10 -5 -3 -11 -13 -10 10 6 13 -11 -2 -4 10 11 11 28 13 15 7 7 18 12 14 13 4 10 2 0 -6 7 -4 -9 -5 -2 -5 -12 2 -3 3 -6 -5 -18 1 -24 11 -5 -5
6754eJ1j5J1mJ3j6J5J4j2m%JJ0krPJmj7LO%kNj2mJ%pKJ7lj%jjRj8qK5onJJ8Jn
$$ -5 6 -9 2 -2 11 -5 10 24 12 8 8 9 19 17 8 15 16 12 -5 -2 4 4 2 7 -5 -9 -8 -8 -15 -13 4 1 0 0 -1 -2 7 -11 -19 6 0 -5 -4 14 15 10
6800A0k3K3Mj2RmkOKpnOQp%nPjMj2%mJ0j2j1J3lkJ6pj2J8Qj5J2j2JJ8oJ1k5J3
$$ 10 -13 10 14 2 11 7 5 11 13 6 1 7 15 8 8 3 10 9 13 1 1 -3 7 -5 -16 -3 -6 -8 8 1 -11 7 15 0 12 0 1 19 13 24 -1 12
6842A2j3kNJ4j0J3j1pK1Pj1J2k4rJ8j9kMkLj2LOnNj2PJ2%j4J8rQj7J2OkNjNj1
$$ 12 -1 -3 2 16 6 19 8 1 22 29 18 30 6 -3 15 -4 -6 -2 -4 -1 -13 -10 -4 -9 -4 -16 -9 3 3 -11 7 -2 6 -11 1 7 5 10 9 14 3
6883CJ5j4OoMJ4oJ6k6J7pj3J1pj1J0kj4J6l0J5kljNPLjlqJ6J3k5J5pMNNj5MJ7
$$ 3 18 4 10 4 8 22 16 32 6 23 16 3 14 7 -4 6 4 -10 6 -24 -9 -11 -14 -15 -10 -3 0 -1 -4 -12 4 17 -8 7 0 4 9 14 -1 3 20
6924B0k6J9Rj7J2Rl0J7MrKomKQk2J2NlKj1JK2j7%MpNNj5J8j6J0Rj0J0j4J5Qlp
$$ 20 -6 13 22 5 17 26 -4 13 17 8 10 4 0 2 10 -12 0 5 2 4 -7 -6 16 -1 -1 3 -4 1 6 -9 9 -7 3 12 2 12 -2 13 21 18 11
6965A1J0k0RPLojMj7J4jopklNNokMmjJ1j4MnLQ%KLj4J0%Nj8J2J0Kj0rJ6lLlJ4
$$ 11 21 1 10 17 20 14 13 17 0 14 13 7 0 -2 -5 0 5 -1 -3 1 -3 -4 7 -7 -3 -8 -5 3 3 5 8 -6 4 4 9 -9 3 13 15 5 -4 12 9 12 9 23
7011B3j4J5Pj5qPNjj2NJ0rj0MMLjk0MoklK4j9J2j1J5j1MNNoQJmj1J0MRj4QPrM
$$ 23 9 24 31 16 8 15 20 19 7 12 22 13 3 7 11 14 13 -7 -3 -9 -11 -14 10 -9 3 -8 7 -4 0 5 10 4 12 13 9 -2 8 12 21 7 15 22 13 17
7055A7%Rj3NLoj4QmKjj0kOj0K1onoRoqJ6RomlLJ0pMPj4J6j5J2nRlrJJ0ojOmj0
$$ 17 17 26 13 18 21 15 1 9 5 7 6 -4 -6 0 -10 11 5 0 -6 3 -3 -11 5 14 8 4 1 4 14 7 11 18 4 20 5 17 12 21 18 9 10 20 14 13 19 15 5
7102EJkMJNnLnqRKj5Pj8J6J7j2j1J0QKj0J8k0RolrJ2LjJ3J4j7jJ1j5Pk0J9j4M
$$ 5 6 4 8 9 14 9 12 7 -1 8 10 -5 2 -16 0 17 5 -6 4 12 14 4 22 2 11 5 2 -7 5 8 7 20 34 17 16 27 12 19 -1 18 4 8
7144Hj6K3j2joJ1jk7J2nJ4pJ1M%o%KKLj9J7K%rPJQMpknJ4j1KOqMomkn%LOjMpj
$$ 8 -8 15 3 2 -4 7 6 -21 -9 -14 0 -7 4 8 8 2 2 4 6 9 -10 7 9 9 0 7 8 16 20 13 11 6 20 9 11 17 9 13 7 3 1 -4 -4 -1 5 4 8 1 0
7193@j3MJJ3oLNrqJ6lj0J5j5J0kJ6k8QNRnlOJ0kjqRj3mLJmMqOj0J1llqoK1j1J3
$$ 0 -13 -9 -8 5 -1 2 7 -2 -10 6 3 -7 8 -7 3 1 17 -11 -3 2 11 6 3 9 19 17 16 8 17 4 0 3 4 0 4 -4 2 -8 3 0 -3 -11 -17 4 -7 6
7239Fk0K4k0J4oN%PJ0k0mJ0Q%j0J4onJ0kj3JJ1Ok5j0J1J7pnjqJ3nj4J5LkpplP
$$ 6 -14 10 -10 4 -2 3 3 10 20 0 -4 6 14 14 4 18 12 7 17 15 2 3 14 20 -5 -15 -4 13 6 1 0 -8 5 0 -14 1 4 2 -5 -12 -15 -8
7281hMjJLoOQk3J9KnlRJ3rrJ4j7J7lj1Mj0J3j9J0JQj0JoJ2j2NjlRj0KN%MpMkr
$$ -8 -4 -5 -4 -1 -7 -1 7 -16 3 5 0 -3 6 19 10 1 15 -2 15 12 1 5 -5 8 -11 -1 0 8 -2 -1 -7 5 -7 -2 -3 -6 3 -7 -5 0 0 4 -3 1 -1 -10
7327a0J7KJj1J5rLRKpLqmJ8nmjLOj3J2Lj8Lj0%lMkJnj5K1%rJ8Mj9K0j1k%kRPr
$$ -10 7 9 10 -1 14 5 8 17 19 12 15 7 3 21 16 12 11 14 20 7 19 22 4 7 -3 -3 -6 -2 -4 -3 -8 -23 -2 -2 -11 7 11 -8 12 1 -1 -1 -3 6 13 4
7373DjOnQKJ0j2J5k9J2Nj0MPj9K7j7NJrnJ0Jklj7J3pPlNkPkp%kJkKJ2K3j8Jjm
$$ 4 3 9 4 12 14 24 12 27 -2 10 15 5 9 16 -3 24 7 12 13 4 -1 9 10 8 5 -12 1 -6 1 -2 3 1 8 6 -1 -1 -3 -2 -4 -2 10 33 15 16 15 11
7419A1%L%Rj5J0Mj5J3k0J5J0j6mpJ1qNj1LJ5mJj0j2K0ojJ0j1pRJ9j3j0QoQJ4j5
$$ 11 11 14 14 23 8 18 22 7 20 0 15 25 9 5 -2 9 1 6 -5 -2 13 9 10 0 -12 8 2 1 11 0 -7 2 21 8 -2 6 0 8 22 7
7459GJ0j5J4kKjmpoOJ1jj1J4ljrqJ4qqPJpqJ6k0J8Jj1J3Rk9J8qMjJQlJ7j3PqJ6
$$ 7 17 2 16 14 16 15 11 4 -2 4 15 14 3 17 14 13 4 -4 10 2 -6 1 2 -5 -13 3 -17 1 2 -9 4 13 -16 2 -6 -2 -3 -2 6 3 20 7 14 6 22
7504B2jj1J7j6lmRj3QrKPJ5rj5KLj0NOj1NNlj9K3kJ3j0Lj2QNj%j6RJ8j2j0J4l
$$ 22 21 10 27 11 8 4 13 0 8 -1 1 8 23 14 -1 1 4 -6 -1 5 -6 -1 4 1 -18 5 3 16 6 9 -3 5 10 9 9 -7 2 20 8 -2 12 9
7546Ij0QPj7J7Pj4j2PQpJ9k3Rrj2OOJ4j5jnkJ0pK5nj0ONLj2OLopQkJ2mqRmLj3
$$ 9 -1 7 14 -3 14 21 7 -5 2 10 3 22 -1 8 -1 -13 -7 -1 13 -2 -3 -8 -10 0 -7 18 13 3 9 14 17 5 11 14 8 1 9 7 19 15 7 16 12 15 2
7591BJ1kpJ1j1KOj1mJ0pqJ5jj4mkMJ6kj9K0NLpllJ0kJ2lLKpj2Qk%%j0J3j0J1K
$$ 2 13 11 4 15 4 6 12 1 -3 7 0 -8 7 6 -8 -12 -14 -10 6 4 -15 5 10 13 6 3 0 10 8 20 17 20 22 15 3 11 9 9 9 -1 12 2 13 15
7635A5Kk0J0lJj1LK%onMoJ4j1K2j9LOj9J2J0lOnj1K0j0J3L%Jj3J4j3PkNj1%On
$$ 15 17 -3 7 4 5 -6 -3 -1 -1 -7 -12 -8 -14 0 -11 11 -8 -5 1 -18 -6 4 1 7 2 -9 11 1 14 17 17 18 5 19 6 13 11 16 5 5 11 6
7677FkJ5pj5RrJ8j6rJ4j6lK3j1o%NJ0oJ1k1QRKj5J3j2NJ4j2NnjPLJj8J1rO%j7
$$ 6 4 19 12 -3 6 -3 15 -1 -10 4 -12 -15 8 -3 -9 -9 -4 6 0 11 -10 -2 7 9 -6 7 -5 0 14 2 7 2 1 8 11 12 -6 5 -4 2 2 -15
7719a5J3J3nrkqJ1%oQj2qK0j2K0j2nKmoJ1M0j5j9PLj0J2lqJ7kkoJNLj0OmJ4j2
$$ -15 -2 11 6 -3 -5 -13 -2 -2 -8 0 -12 -20 0 -12 8 -4 -9 -7 -11 -17 -6 34 19 0 7 10 0 12 9 1 18 16 14 8 9 14 17 7 13 9 23 11
7761A1j8kKJLJ2j8QjlkJJ5j4J0j0j1J0lPkJ3Pj4mK8j1oRrJ1j3oJ3KJ1k0OKj5O
$$ 11 -7 -9 -7 -6 -3 9 -9 -1 -2 -5 -7 -6 9 -5 5 -5 -16 -6 -9 -2 -4 9 16 2 -2 26 15 9 18 9 20 7 1 14 16 27 7 13 15 0 6
7802Fnkj2RKNj7J0jPojmJ5j4%J0L%Rp%nJ4Lrj2J3j0JPJ6orj0J4j7nJ4NJ1nj2J
$$ 6 1 -1 -13 -4 -2 3 -14 -4 -5 2 -4 -5 -9 6 -8 -8 2 5 5 14 7 7 2 16 19 10 -2 11 1 2 9 25 19 10 0 14 -3 -8 6 11 22 17 5 6
7846Fj0JLmj2J5rR%mMLJ0rjj0J8JmqMJ0KJKjj3J2Qj3Pj6QlJ4Nk5J3Nj4nJ1k8J8
$$ 6 -4 -3 0 -4 -16 -1 -10 -1 -1 -5 -1 2 12 3 2 -8 10 11 7 -1 3 13 15 16 18 17 4 16 24 11 18 2 10 7 21 26 1 14 19 5 0 11 -17 1
7890Ajj1J3qmJKRkpJ5mmk%rK0qRrJ5j0Ql%k2K1KnJJk4K7%KJj4jpJ8j8PpJ2pqK4
$$ 1 0 -11 2 -6 -10 -9 -7 2 0 -7 8 4 0 -2 -2 -11 9 1 10 1 16 6 14 11 11 -11 10 12 7 8 9 -15 12 12 14 15 1 0 -7 11 -7 0 -7 5 -2 -10 14
7937A4qprM%QjOnMpj7K3RnoLJ6j4NpJ1j3%J3j8QOk6K9j8Qk1K2j8KLJ0j9j9L2j9
$$ 14 6 -1 -10 -6 -6 2 1 7 2 6 -1 -18 5 14 9 3 6 22 8 13 6 17 4 4 17 -1 7 13 -13 16 -2 6 -15 7 -11 -9 -6 4 -15 -34 -2 -21
7979b1K6p%RLoomLk%J4mKPj1MJ8k3J9Nj9QnMj1OpJ0omLj2lJ9k2J0kJ8j4j4K1j4
$$ -21 5 -2 -2 7 10 4 -2 -6 -3 -5 -5 9 5 7 14 3 7 25 2 21 26 7 15 10 14 3 9 2 12 6 2 5 -7 -10 9 -13 -3 -5 13 -1 -15 6 -8
8022hJ9j7RPpj0N%j2K6nJ7j5MJ3kkj3JlmoJ6KOj9JKKlJj2QLqj4K4j2j0J5Rj5M
$$ -8 11 -6 3 10 3 -7 -2 -2 -14 12 7 24 9 13 26 24 22 9 10 7 3 -3 13 15 21 2 3 5 7 4 5 -7 1 4 -4 -18 6 -6 -16 -1 8 -7 -3
8065cOj5MJ1pNLKkOOj9J0MqJ0%lkj3J6rpJ0Qj5klLJ0%j1mJQnMoN%%Nq%%mJ7j2
$$ -3 3 -12 -8 3 -4 1 4 6 4 10 16 -3 7 11 3 13 13 10 8 -5 11 2 -5 5 13 -2 -4 -7 -4 6 6 -5 -9 -8 0 -5 -1 -7 -2 -2 -2 3 -5 -5 -5 -9 8 -4
8113dOKrJ8nJ0mlLQj3Jj2J4qrRnj8PQooJJNJjJoNJ3npJ3klOkOnP%j0ROkj1J2j7
$$ -4 2 4 -5 13 8 18 14 11 14 22 9 10 -2 12 4 -5 4 -1 -19 -12 -4 -10 -16 -15 -14 -9 -8 -9 -8 -14 -9 4 -1 -8 5 3 0 6 4 10 5 12 12 2 11 17 15 4 16 -1
8163aNJJ9j0k3JkK8j9jkj1J6j2RknNp%P%OlPmnJ5
$$ -1 4 5 24 14 -9 -8 -10 18 -1 -2 -4 -15 1 -11 -2 -4 -9 -4 -11 -11 -4 -4 2 -1 6 2 -3 12
8191A2
##END NTUPLES=NMR FID
##END=
