##TITLE=1H_ES-aq-EG-c2
 
 8 sc, 
 14.1.2022
##JCAMPDX= 6.0         $$ Bruker NMR JCAMP-DX V2.0
##DATA TYPE= NMR FID
##DATA CLASS= NTUPLES
##ORIGIN= UXNMR, Bruker Analytische Messtechnik GmbH
##OWNER= root
$$ XWIN-NMR		Version 3.5
$$ Fri Jan 14 10:55:19 2022 Russian Standard Time (UT+4h)  she@DPX200
##.OBSERVE FREQUENCY= 200.131346
##.OBSERVE NUCLEUS= ^1H
##.DELAY= (6, 6)
##.ACQUISITION MODE= SIMULTANEOUS
##.ACQUISITION SCHEME= undefined
##.AVERAGES= 8
##.DIGITISER RES= 18
##SPECTROMETER/DATA SYSTEM= spect
##.PULSE SEQUENCE= zg30
##.SOLVENT NAME= D2O
##.SHIFT REFERENCE= (INTERNAL, D2O, 0, 15.7039)
##AUDIT TRAIL= $$ (NUMBER, WHEN, WHO, WHERE, WHAT)
$$ ##TITLE= Audit trail, XWIN-NMR		Version 3.5
$$ ##JCAMPDX= 5.01
$$ ##ORIGIN= Bruker BioSpin GmbH
$$ ##OWNER= she
$$ F:/spectra/data/she/nmr/H-F/1/audita.txt
$$ ##AUDIT TRAIL=  $$ (NUMBER, WHEN, WHO, WHERE, WHAT)
(   1,<2022-01-14 10:54:26.42 +0400>,<she>,<DPX200>,
      <created by zg, POWCHK disabled, PULCHK disabled
       configuration hash MD5:
       00 E9 B6 7A A2 85 ED C7 34 08 36 98 17 FE 4E 26
       data hash MD5: 16K
       0A DF A5 4E 21 13 AD 59 FC EF C1 6B A7 DB E5 AB>)
$$ ##END=
$$ 
$$ hash MD5
$$ 16 BB 9F 80 0D A7 73 C4 2C 55 39 E4 27 43 0C 3B
##$RELAX= 
##$RELAX= 
##$RELAX= 
##$RELAX= 
##$RELAX= 
##$RELAX= 
$$ Bruker specific parameters
$$ --------------------------
##$DU= <F:/spectra>
##$EXPNO= 1
##$NAME= <H-F>
##$PROCNO= 1
##$TYPE= <nmr>
##$USER= <she>
##$AMP= (0..31)
100 100 100 100 100 100 100 100 100 100 100 100 100 100 100 100 100 100 
100 100 100 100 100 100 100 100 100 100 100 100 100 100 
##$AQSEQ= 0
##$AQ_mod= 1
##$AUNM= <au_zg>
##$AUTOPOS= <>
##$BF1= 200.13
##$BF2= 200.13
##$BF3= 200.13
##$BF4= 200.13
##$BF5= 200.13
##$BF6= 200.13
##$BF7= 200.13
##$BF8= 200.13
##$BYTORDA= 1
##$CFDGTYP= 0
##$CFRGTYP= 5
##$CHEMSTR= <none>
##$CNST= (0..31)
1 1 145 1 1 1 1 1 1 1 1 1 1 1 1 1 1 1 1 1 1 1 1 1 1 1 1 1 1 1 1 1 
##$CPDPRG= <>
##$CPDPRG1= <>
##$CPDPRG2= <>
##$CPDPRG3= <>
##$CPDPRG4= <mlev>
##$CPDPRG5= <mlev>
##$CPDPRG6= <mlev>
##$CPDPRG7= <mlev>
##$CPDPRG8= <mlev>
##$CPDPRGB= <>
##$CPDPRGT= <>
##$D= (0..31)
0 1.2 0 0 0 0 0 0 0 0.06 0 0.03 0 0 0 0 0.0002 0 0 0 0 0 0 0 0 0 0 0 0 
0 0 0 
##$DATE= 1642143265
##$DBL= (0..7)
120 120 120 120 120 120 120 120 
##$DBP= (0..7)
150 150 150 150 150 150 150 150 
##$DBP07= 0
##$DBPNAM0= <>
##$DBPNAM1= <>
##$DBPNAM2= <>
##$DBPNAM3= <>
##$DBPNAM4= <>
##$DBPNAM5= <>
##$DBPNAM6= <>
##$DBPNAM7= <>
##$DBPOAL= (0..7)
0.5 0.5 0.5 0.5 0.5 0.5 0.5 0.5 
##$DBPOFFS= (0..7)
0 0 0 0 0 0 0 0 
##$DE= 6
##$DECBNUC= <off>
##$DECIM= 32
##$DECNUC= <off>
##$DECSTAT= 4
##$DIGMOD= 1
##$DIGTYP= 9
##$DL= (0..7)
0 120 120 120 120 120 120 120 
##$DP= (0..7)
150 150 150 150 150 150 150 150 
##$DP07= 0
##$DPNAME0= <>
##$DPNAME1= <>
##$DPNAME2= <>
##$DPNAME3= <>
##$DPNAME4= <>
##$DPNAME5= <>
##$DPNAME6= <>
##$DPNAME7= <>
##$DPOAL= (0..7)
0.5 0.5 0.5 0.5 0.5 0.5 0.5 0.5 
##$DPOFFS= (0..7)
0 0 0 0 0 0 0 0 
##$DQDMODE= 0
##$DR= 18
##$DS= 0
##$DSLIST= <SSSSSSSSSSSSSSS>
##$DSPFIRM= 0
$$ [...]
##$SUBNAM2= <"">
##$SUBNAM3= <"">
##$SUBNAM4= <"">
##$SUBNAM5= <"">
##$SUBNAM6= <"">
##$SUBNAM7= <"">
##$SUBNAM8= <"">
##$SUBNAM9= <"">
##$SW= 18.0517287032376
##$SWIBOX= (0..15)
0 0 2 0 0 0 0 0 0 0 0 0 0 0 0 0 
##$SW_h= 3612.71676300578
##$TD= 16384
##$TD0= 1
##$TE= 0
##$TE2= 300
##$TE3= 300
##$TEG= 300
##$TL= (0..7)
0 120 120 120 120 120 120 120 
##$TP= (0..7)
150 150 150 150 150 150 150 150 
##$TP07= 0
##$TPNAME0= <>
##$TPNAME1= <>
##$TPNAME2= <>
##$TPNAME3= <>
##$TPNAME4= <>
##$TPNAME5= <>
##$TPNAME6= <>
##$TPNAME7= <>
##$TPOAL= (0..7)
0.5 0.5 0.5 0.5 0.5 0.5 0.5 0.5 
##$TPOFFS= (0..7)
0 0 0 0 0 0 0 0 
##$TUNHIN= 0
##$TUNHOUT= 0
##$TUNXOUT= 0
##$USERA1= <user>
##$USERA2= <user>
##$USERA3= <user>
##$USERA4= <user>
##$USERA5= <user>
##$V9= 5
##$VALIST= <valist>
##$VCLIST= <CCCCCCCCCCCCCCC>
##$VD= 0
##$VDLIST= <DDDDDDDDDDDDDDD>
##$VPLIST= <PPPPPPPPPPPPPPP>
##$VTLIST= <TTTTTTTTTTTTTTT>
##$WBST= 1024
##$WBSW= 4
##$XGAIN= (0..3)
0 0 0 0 
##$XL= 0
##$YL= 0
##$YMAX_a= 329642
##$YMIN_a= -346170
##$ZGOPTNS= <>
##$ZL1= 120
##$ZL2= 120
##$ZL3= 120
##$ZL4= 120
##$ABSF1= 10
##$ABSF2= 0
##$ABSG= 5
##$ABSL= 3
##$ALPHA= 0
##$AQORDER= 0
##$ASSFAC= 0
##$ASSFACI= 0
##$ASSFACX= 0
##$ASSWID= 0
##$AUNMP= <proc_1d>
##$AZFE= 0.1
##$AZFW= 0.1
##$BCFW= 1
##$BC_mod= 2
##$BYTORDP= 1
##$COROFFS= 0
##$CY= 11.3945322036743
##$DATMOD= 1
##$DC= 2
##$DFILT= <>
##$DTYPP= 0
##$F1P= 2.36226072786647
##$F2P= -0.459571619588291
##$FCOR= 0.5
##$FTSIZE= 0
##$FT_mod= 4
##$GAMMA= 1
##$GB= 0.15
##$INTBC= 1
##$INTSCL= 1
##$ISEN= 128
##$LB= 0.24
##$LEV0= 0
##$LPBIN= 0
##$MAXI= 10000
##$MC2= 0
##$MEAN= 0
##$ME_mod= 0
##$MI= 1.114404
##$NCOEF= 0
##$NC_proc= 0
##$NLEV= 6
##$NOISF1= 3.799351
##$NOISF2= 2.8
##$NSP= 1
##$NTH_PI= 0
##$NZP= 0
##$OFFSET= 15.70392
##$PC= 1
##$PHC0= -15947.12
##$PHC1= 7.80079
##$PH_mod= 1
##$PKNL= yes
##$PPARMOD= 0
##$PSCAL= 0
##$PSIGN= 0
##$REVERSE= no
##$SF= 200.130013532006
##$SI= 16384
##$SIGF1= 3
##$SIGF2= 2
##$SINO= 400
##$SIOLD= 16384
##$SREGLST= <1H.CDCl3>
##$SSB= 0
##$STSI= 0
##$STSR= 0
##$SW_p= 3612.71676300578
##$SYMM= 0
##$S_DEV= 0
##$TDeff= 0
##$TDoff= 0
##$TI= <>
##$TILT= no
##$TM1= 0
##$TM2= 0
##$TOPLEV= 0
##$USERP1= <user>
##$USERP2= <user>
##$USERP3= <user>
##$USERP4= <user>
##$USERP5= <user>
##$WDW= 1
##$XDIM= 8192
##$YMAX_p= 0
##$YMIN_p= 0
$$ End of Bruker specific parameters
$$ ---------------------------------
##NTUPLES= NMR FID
##VAR_NAME=  TIME,          FID/REAL,        FID/IMAG
##SYMBOL=    X,             R,               I
##VAR_TYPE=  INDEPENDENT,   DEPENDENT,       DEPENDENT
##VAR_FORM=  AFFN,          ASDF,            ASDF
##VAR_DIM=   8192,          8192,            8192
##UNITS=     SECONDS,       ARBITRARY UNITS, ARBITRARY UNITS
##FACTOR=    0.0002768,     1,               1
##FIRST=     0,             0,               0
##LAST=      2.2672688,     0,               0
##MIN=       0,             -346170,         0
##MAX=       2.2672688,     329642,          0
$$ Real data points
##PAGE= N=1
##DATA TABLE= (X++(R..R)), XYDATA
0@%%%%%%%%%%%%%%%mMnJ3j6J6j6J6k4L2l2L6m4N0n7O5p4Q4r4J03j13J28j44J60
$$ 0 0 0 0 0 0 0 0 0 0 0 0 0 0 0 0 -4 0 -5 8 -8 8 -8 8 -16 16 -16 20 -24 26 -31 34 -40 44 -50 53 -60 68 -76 84
39H4j78J99k22K45k71K99l28L60l95M37m84N33n85O46p14P91q79R78j096J237
$$ 84 -94 105 -117 128 -143 156 -172 188 -207 230 -254 279 -306 340 -374 417 -462 516 -580 657
59F57j407J616j882K229k700L375m420O219r838J9670r2331k67358L23491K66885
$$ 657 -750 866 -1016 1213 -1487 1888 -2532 3687 -6151 13519 -78812 -346170 -22679 244206
73B44206k29067j16252J88150p4838k29474K02187L03246k30257l16043J97112
$$ 244206 15139 -101113 87037 12199 -217275 -15088 288158 57901 -258142 -61030
83f1030K33807j89580r4793K45939j3058l34222M3199L72776k0308l15019K2183
$$ -61030 172777 -16803 -111596 134343 121285 -212937 -169738 203038 182730 -132289 -110106
94a10106J86290r9825o9061K34379K6858l46812n5431L68976Q6689k97369n3248
$$ -110106 76184 -23641 -92702 141677 168535 -178277 -233708 135268 221957 -75412 -128660
105a28660J95220n4582j34074J80505J35165k54001j55846K49568J34027k04546
$$ -128660 66560 11978 -122096 58409 193574 -60427 -216273 33295 167322 -37224
115c7224m6566J80419o9121k05638J49193K50103j59569k54291J24839J84390
$$ -37224 -83790 96629 27508 -178130 -28937 221166 61597 -192694 -67855 116535
125A16535j04415o4258J38566m3536k12601Q9817K70231p7951k62692N6694J89783
$$ 116535 12120 -52138 86428 42892 -169709 -79892 190339 112388 -150304 -93610 96173
136I6173p4525r8025J37229L9091k04991k6515K29540K8513j97033j177J38687
$$ 96173 21648 -76377 60852 99943 -105048 -131563 97977 126490 -70543 -71720 66967
147F6967o9227j01200J52706J04436k01597j24695J92308J17436j45553n7870
$$ 66967 -2260 -103460 49246 153682 -47915 -172610 19698 137134 -8419 -66289
157f6289J07091l5692j08047J16948J38853j50047j59751J37747J36771j15199
$$ -66289 40802 5110 -102937 14011 152864 2817 -156934 -19187 117584 2385
167B385p1354J16938k192j46392M7320J74632n5899j68392N2521J20705o9438
$$ 2385 -68969 47969 45777 -100615 -53295 121337 65438 -102954 -50433 70272 834
178H34n7448J15664J4575j67848p088J90611J7096j67325j1133J14352k9276o6885
$$ 834 -56614 59050 73625 -94223 -101311 89300 106396 -60929 -72062 42290 13014 -53871
190e3871R1261M8957j41516n4696J54713N6150j33798k9856J05171k2012r4021
$$ -53871 37390 86347 -55169 -109865 44848 100998 -32800 -62656 42515 20503 -73518
201g3518P3991J02293j00072j08581R6077Q9031q1981m0079Q2773j7348j05459
$$ -73518 473 102766 2694 -105887 -9810 79221 -2760 -42839 39934 22586 -82873
212h2873N5462J32510o2780j37531N2857J08350n1015n7688P1598J2146j05633
$$ -82873 -27411 105099 42319 -95212 -42355 65995 14980 -42708 28890 41036 -64597
223f4597J0150J29260j3210j24909J7183R6106l8649o3321P5005M5460j06918
$$ -64597 -54447 74813 61603 -63306 -46123 49983 11334 -51987 23018 68478 -38440
234c8440m3513J15518M1054r9016k0391P4127k0557o0933O5292O5492r2463p5023
$$ -38440 -81953 33565 74619 -24397 -44788 29339 8782 -52151 13141 78633 -13830 -88853
246h8853R3384O9944p8580m1444O7593p20p1681L6723Q4613n3278q9331N3866
$$ -88853 4531 74475 -4105 -45549 22044 21324 -50357 -13634 70979 17701 -71630 -17764
258a7764P3788n3893m1842O5604R820q6664P946J02133j1146r8009J2780P3921
$$ -17764 56024 2131 -39711 25893 35713 -50951 -43005 59128 47982 -50027 -37247 36674
270C6674k6672m3589N4444K3237q3595j7973R7837J8644r0958j0685P1313j2284
$$ 36674 10002 -33587 20857 44094 -39501 -57474 40363 59007 -31951 -42636 28677 16393
282A6393n4004M2724M7800o5927m8166P2480M2656o5903k3076N8556o620o0025
$$ 16393 -37611 5113 52913 -13014 -61180 11300 53956 -11947 -35023 23533 16913 -43112
294d3112L3434O8351m6351p2125M5602O0951m1727l5110M5865N671n9625J4611
$$ -43112 -9678 58673 12322 -59803 -14201 46750 5023 -30087 15778 21449 -38176 -23565
306b3565P3814k1651p6535K2408O3549k7702m1793M2234K2898o0240j3338P0868
$$ -23565 50249 28598 -47937 -25529 38020 10318 -31475 10759 33657 -26583 -39921 30947
318C0947R465o7714j950N4456j5070m1198L8014L5535n6660l5961O2637L3762
$$ 30947 40412 -27302 -29252 25204 10134 -31064 6950 42485 -14175 -50136 12501 46263
330D6263n6538k1206M6966j258m2760K4925M5579m0173m8782M4064M3847m1960
$$ 46263 -10275 -31481 15485 14227 -28533 -3608 41971 1798 -46984 -2920 40927 -1033
342a033k8274M2224P665m8262Q981N5750j7005n6687J9503M6899k3842k9941L4482
$$ -1033 -29307 12917 20582 -27680 -18699 37051 20046 -36641 -17138 29761 5919 -24022 10460
355A0460J4102m8629n387N8398K767n7638M51M7142j0141l3833K5897K4817m1356
$$ 10460 24562 -24067 -29454 28944 31711 -25927 -25476 21666 11525 -22308 3589 28406 -12950
368a2950k1435M9332J8939m7941j1251M1654l129l7004J9631L6653l1450l7207
$$ -12950 -34385 14947 33886 -14055 -25306 16348 13219 -23785 -4154 32499 1049 -36158
380c6158L5204L2806l3710k0578L2898L727l6500J1107M2487j9142m4956K1119
$$ -36158 -954 31852 -1858 -22436 10462 14189 -22311 -11204 31283 12141 -32815 -11696
392a1696L9470k2222k6890K7075J2759l5516k606M2823k470m3877O042L7668j2605
$$ -11696 27774 5552 -21338 5737 18496 -17020 -19626 23197 20727 -23150 -17108 20560 7955
405G955k8067K3159K0306l4067j6441M0081J3918l8960q178L3196k796k7831J6426
$$ 7955 -20112 3047 23353 -10714 -27155 12926 26844 -12116 -20294 12902 10106 -17725 -1299
418a299K5953k7466k6183L2229K4184l1446j6732K9278M717k9377P491L1741j5713
$$ -1299 24654 -2812 -28995 3234 27418 -4028 -20760 8518 13235 -16142 -8651 23090 7377
431G377l2865J9183K9139k0811k0222K4146R440k9922r94L5268l500l6218O099
$$ 7377 -25488 -6305 22834 2023 -18199 5947 15387 -14535 -15529 19739 16239 -19979 -13880
444a3880L1272j0351k2737J7888J4771k6738r969L2889P373l3634l754K9743l208
$$ -13880 17392 7041 -15696 2192 16963 -9775 -19744 13145 20518 -13116 -16870 12873 9665
457I665k4624J2696K1259k1340j9665K5982J7239k6290j1424K4778K200k4351
$$ 9665 -14959 -2263 18996 -2344 -22009 3973 21212 -5078 -16502 8276 10476 -13875
469a3875P619K5680j4657k6558J7661K4053j8379j7151J9729P867k3058L77K6991
$$ -13875 -6256 19424 4767 -21791 -4130 19923 1544 -15607 4122 11989 -11069 -10692 16299
482A6299n559k8512Q340K5768j1196j9617J5874J2879k1760p894K6239M734k7029
$$ 16299 10740 -17772 -9432 16336 5140 -14477 1397 14276 -7484 -15378 10861 15595 -11434
495a1434j414K4124m024j9752J1466J6394j8629j4660K2873J2923k3339q948K1515
$$ -11434 -12848 11276 7252 -12500 -1034 15360 -3269 -17929 4944 17867 -5472 -14420 7095
508G095K119j9858N935J9532j2528j9591J6117J7867j7271j3134J7995O259j9733
$$ 7095 9214 -10644 -4709 14823 2295 -17296 -1179 16688 -583 -13717 4278 10537 -9196
521i196M75K1973n161k2788P850K0533j0096j5485J3478R572j7939m860K1720
$$ -9196 -8721 13252 8091 -14697 -6847 13686 3590 -11895 1583 11155 -6784 -11644 10076
534A0076J909k2854M99K0803m054j6876R192J3133j4699j0569J8518Q521j9545
$$ 10076 11985 -10869 -10370 10433 6379 -10497 -1305 11828 -2871 -13440 5078 13599 -5946
547e946n446J8428N24j6853N502J5955j0743j5451J3784J3906j4744j0148J4949
$$ -5946 -11392 7036 7560 -9293 -3791 12164 1421 -14030 -246 13660 -1084 -11232 3717
560C717M547j5758J297J7190n716j7952Q248J6622r836j2909J1777Q029j4528
$$ 3717 8264 -7494 -6197 10993 5277 -12675 -4427 12195 2359 -10550 1227 9256 -5272
573e272l569J7135L62j8120K045J6775m835j3735Q602J0455j2694p974J5708O037
$$ -5272 -8841 8294 8656 -9464 -7419 9356 4521 -9214 -612 9843 -2851 -10825 4883 10920
587A0920j6574l611J5500j37j3672M891J2260r376j1381J2304J0132j3335p523
$$ 10920 -5654 -9265 6235 6098 -7574 -2683 9577 201 -11180 1124 11256 -2079 -9602
600i602J3301L416j3302J235J3683n078j3846P527J2729r006r832J0386N908j2281
$$ -9602 3699 7115 -6187 -4952 8731 3653 -10193 -2666 10063 1057 -8775 1611 7519 -4762
614d762k106J4157p32j4932K733J3900m743j1297P379Q197j0467n563J2998L581
$$ -4762 -6868 7289 6557 -8375 -5642 8258 3515 -7782 -403 7794 -2673 -8236 4762 8343
628H343j4032j579J3367j136j1746M598J0134q049q888J0509P509j1472n324J1411
$$ 8343 -5689 -7268 6099 4963 -6783 -2185 7949 -100 -8988 1521 9030 -2442 -7766 3645
642C645K046j1115J736J1079m994j1033P115J0154q226p946R002M734j0025j393
$$ 3645 5691 -5424 -3688 7391 2397 -8636 -1521 8633 407 -7539 1463 6197 -3828 -5221
656e221J1205j326j1800L233J1141m826r209O681O670q842m293J0699K386j1496
$$ -5221 5984 4658 -7142 -3909 7232 2406 -6803 -122 6548 -2294 -6587 4112 6498 -4998
670d998o52J1006j519r604M256Q027p054o736R180N515j0121l817J0012J342r472
$$ -4998 -5650 5356 3837 -5767 -1511 6516 -538 -7274 1906 7421 -2700 -6517 3495 4837 -4635
685d635J652R014m477q593O469P740p538o016Q110L507q686p56R316j589r553
$$ -4635 -2983 6031 1554 -7039 -570 7170 -368 -6384 1726 5233 -3453 -4209 5107 3518 -6035
700f035L217Q976m502p365N818N146p333k984Q731J233r428K12R121j793p956
$$ -6035 -2818 6158 1656 -5709 109 5255 -2078 -5062 3669 4902 -4526 -4314 4807 3014 -4942
715d942L735O474n837n094P533L862q398k431Q408M91p904J846P322m094o798
$$ -4942 -1207 5267 -570 -5664 1869 5731 -2667 -5098 3310 3801 -4103 -2257 5065 971 -5827
730e827N801N973o689m565P048K535p297j85P553j910p599L389P123m435n879
$$ -5827 -26 5947 -742 -5307 1741 4276 -3021 -3206 4347 2437 -5162 -1773 5350 915 -4964
745d964N323M065o275k161P160N25p594P82P313k037o337L459N037n004l765O288
$$ -4964 359 4424 -1851 -4012 3148 3673 -3921 -3139 4174 2137 -4200 -741 4296 -708 -4473 1815
761A815K652o955j496O896P3o406J731N732l548n074M977M333n789l239O087J675
$$ 1815 4467 -2488 -3984 2912 2985 -3421 -1690 4042 494 -4580 397 4730 -1059 -4298 1789 3464
777C464o156J67O172j922o012L235N501m122m485M809K986n445j333O016j18o274
$$ 3464 -2692 -2525 3647 1725 -4287 -1052 4449 327 -4158 651 3637 -1808 -3141 2875 2757 -3517
793c517J252O003k234n170L256L973m345k746N283J668n804o66N772m62n267J778
$$ -3517 -2265 3738 1504 -3666 -410 3563 -782 -3528 1755 3423 -2381 -3047 2725 2263 -3004 -1226
809a226M581l136l875M221L186m881k261N073J023n021M49M886j869m684K992
$$ -1226 3355 219 -3656 565 3751 -1130 -3391 1682 2705 -2316 -1867 3019 1150 -3534 -542
824e42M253l733l427M208K219m587q46M921m57n050J482M808k318m115L094L105
$$ -542 3711 -22 -3449 759 2978 -1609 -2455 2466 2009 -3041 -1559 3249 931 -3184 -90 3015
840C015l878j988M524J015m887j29M809p90m320J790L635k820k942L703K260m221
$$ 3015 -863 -2851 1673 2688 -2199 -2328 2481 1691 -2629 -839 2796 -24 -2966 737 2997 -1224
856a224j496M345N49m192N72L933j705l647K651L193l246k531L620J569l844m60
$$ -1224 -2720 1625 2174 -2018 -1446 2487 782 -2865 -214 2979 -267 -2798 822 2391 -1453 -1913
872a913M005o03m062J493L827k169l249K755K380l307j411L779N31m053K56L992
$$ -1913 2092 1489 -2573 -1080 2747 578 -2671 84 2464 -843 -2254 1525 2056 -1997 -1741 2251
888B251j001l587J780K951k559k271L226J599l615r17L704J27l531P69L223j669
$$ 2251 1250 -2337 -557 2394 -165 -2436 790 2389 -1226 -2143 1561 1688 -1843 -1074 2149 480
904D80k863K391K460k883j887L156J087l231j91L258o98l217J453K981k000k519
$$ 480 -2383 8 2468 -415 -2302 854 1941 -1290 -1481 1777 1079 -2138 -685 2296 296 -2223
920b223K441J805k810j005L135K28l311M55L233j081k858J666K331k279j708K793
$$ -2223 218 2023 -787 -1792 1343 1571 -1740 -1285 1948 867 -1991 -325 2006 -273 -1981 812
936H12J103l094n05L139j34k974Q56K640j565k262K176J836k592j307K747P00
$$ 812 1915 -1179 -1684 1455 1321 -1653 -797 1843 278 -1984 192 2028 -564 -1871 876 1576
952A576k799N5K723p86k593J411K357j876j932K186J347k444o46K630l2k702O11
$$ 1576 -1223 -1168 1555 769 -1824 -413 1944 68 -1864 322 1669 -775 -1421 1209 1177 -1525 -914
969i14K617j111k302J557J819j988j256K353P14k590j79K610l58k418Q90K125
$$ -914 1703 592 -1710 -153 1666 -322 -1578 775 1489 -1101 -1280 1330 972 -1446 -556 1569
985A569j446j758J931J340k242q97K385L59k361K36K255q52k076J364J821j733
$$ 1569 123 -1635 296 1636 -606 -1503 882 1241 -1120 -884 1371 519 -1557 -193 1628 -105
1001a05j458J975R77k142l84K229k07k223P05K099j122j824J473J411j774r21
$$ -105 -1563 412 1389 -753 -1137 1092 885 -1338 -633 1466 344 -1480 -7 1404 -370 -1291
1017a291K047M05k177K0K193m80k006R30J699j349j354J720R68j952n75K035J51
$$ -1291 756 1161 -1016 -996 1197 717 -1289 -359 1340 -9 -1363 357 1325 -627 -1202 833 984
1034I84j997L37J870q43j659J265J392j560j081J764O58j865j60J869l21j824
$$ 984 -1013 -676 1194 351 -1308 -43 1349 -211 -1292 472 1130 -735 -895 974 653 -1171
1050a171P48J701j107j446J382J072j582o46J763J95j852K11J830n95j650R34
$$ -1171 -423 1278 171 -1275 107 1179 -403 -1049 714 909 -943 -732 1098 503 -1147 -213
1066b13J382j261j038J540O77j723l10J751l9j705M60J535q54j319J182J070j432
$$ -213 1169 -92 -1130 410 1087 -636 -946 805 766 -939 -479 1056 202 -1117 65 1135 -297
1083b97p80J561M28j593j4J566l85j497P34J372j052j114J251Q04j404m29J506
$$ -297 -1077 484 912 -681 -695 871 486 -1011 -277 1095 43 -1071 180 984 -420 -849 657
1100F57O1j554K96J505o15j348Q91J093j140p89J347M71j484j41J502j73j423
$$ 657 718 -836 -540 965 350 -998 -107 986 -154 -943 404 875 -609 -750 752 579 -844
1117h44M97J280q23j055J091Q11j294n37J379K43j393J00J337m52j227P41J086
$$ -844 -347 933 110 -945 146 957 -337 -874 505 748 -645 -545 792 340 -887 -146 940
1134I40r81q74J149N90j247k64J297o1j296L61J238o28j083Q62Q36j031n74J176
$$ 940 -41 -915 234 824 -423 -687 610 549 -747 -386 852 224 -859 3 839 -192 -766 410
1152D10K88j269qJ284k74j204N40J046p97q28R99O08j164l50J238P6j230K12J160
$$ 410 698 -571 -579 705 431 -773 -233 813 16 -812 187 795 -369 -719 519 595 -635 -423 737
1171G37n17j014P52Q61r57o43J080M02j142j19J152j74j103M31J025o69q52Q21
$$ 737 220 -794 -42 819 -138 -781 299 701 -441 -560 592 418 -685 -254 771 102 -750 71
1189G1O60r61m09J054J44j106J12J091l40j002N46Q49p43o50R14M28j030j98J074
$$ 71 731 -230 -639 415 559 -547 -435 656 316 -686 -140 709 -34 -684 230 658 -372 -570 504
1208E04m8j045K93R60n20q41P40O63q94m78R95K45j010jR99k53r39M82Q46o73
$$ 504 456 -589 -296 664 144 -697 43 706 -188 -666 329 574 -436 -437 562 309 -630 -148 698 25
1228B5o85P87N06q99k72R55L1r66K03R27l96q34N77O73p22m95Q32L01r12r8R48
$$ 25 -660 127 633 -266 -538 417 448 -518 -315 612 216 -618 -41 632 -90 -585 247 548 -364 -462 486
1249D86j19r03L22Q03n15o78O83N14q02l44Q77J39q84O9Q60k76q03M85O91o39
$$ 486 367 -536 -214 589 74 -604 79 593 -209 -553 324 463 -421 -352 508 232 -571 -86 605 -34
1269c4n45P48L66q06j72Q45m7q44K49P91m15o90N62N35o68l83P69J93q16kQ13
$$ -34 -579 169 535 -271 -443 402 355 -489 -240 551 136 -554 8 543 -125 -508 261 454 -362 -364 449
1290D49j74p59L32O73m95n41O23L87p08k42P73O4p71J21P20l03o45M49N53n74
$$ 449 275 -484 -152 521 26 -515 108 495 -213 -455 318 382 -389 -268 452 149 -496 -47 506 -68
1310f8m21O69K67p18q3P27r8p00K63O37l93n69N33M25o18k68O77J05p14O5O97
$$ -68 -489 180 447 -271 -354 373 275 -425 -162 475 82 -487 46 471 -147 -415 262 367 -347 -282 415
1331D15k17o44L62N47m87m25N76K92o47j34O73j2o64J64O27l26n22M24M32n29
$$ 415 198 -446 -84 463 -24 -449 127 419 -228 -362 311 299 -365 -201 426 100 -422 2 434 -95
1351i5l20O03J83o32l6O30j20n91K66N32l87m47M87L42n69j90O03L3o08R7N91
$$ -95 -415 188 371 -261 -297 333 213 -378 -112 420 33 -414 73 415 -154 -344 259 292 -316 -219 372
1372C72k30n43L49M60m57l24N14K12n79p7N96n3n85J97N27l12m48M16L57n00k21
$$ 372 142 -401 -52 408 -49 -373 141 353 -226 -303 293 240 -345 -148 379 67 -381 35 392 -108 -329
1393c29N32J06n62L1N54j72n15K90M34l69l69M69K50n21j13N34nn36J25N05k41
$$ -329 203 309 -253 -222 332 160 -355 -65 369 0 -369 100 350 -171 -284 250 245 -291 -166 339 98
1414I8m45L36L70m30k61M86J41n09k7N18r7m85J99M37l05l59L96K68m64j64M94
$$ 98 -347 -11 359 -71 -332 154 295 -214 -241 277 180 -305 -106 331 26 -333 63 331 -133 -297 197
1435A97N3m99P2M80j85m28K73L76l69k83M27J79m64o0M62l2m69J47M35k57l68
$$ 197 250 -249 -177 303 118 -310 -37 339 -30 -313 114 293 -171 -231 231 199 -270 -123 312 55 -313
1456c13L27L01l89k05M33Q8m52K5M48j16m21K02L75k99k92L67K06m20j08M38J3
$$ -313 14 315 -74 -279 154 242 -210 -185 263 147 -274 -72 303 4 -288 79 285 -135 -243 195 208
1477B08m28Q2M06j74l64K52L10l29k35L94J35m05n0M15n9l91J38L65k38l01K97
$$ 208 -220 -138 268 94 -270 -18 292 -37 -272 122 257 -148 -198 217 158 -233 -95 270 32 -269 28
1498B8K35l44j50L78N2l93L7L87j11l62J97L11k79k28L20J60l60o9L66pl74R7
$$ 28 263 -81 -231 147 199 -194 -157 230 119 -243 -46 265 -14 -242 78 238 -122 -191 175 168 -206 -109
1520a09L39j62l04K45K46l06j73L34J03l50j3L45p1l34J59K97k15k62K68J97l17
$$ -109 230 68 -236 9 255 -51 -224 110 213 -137 -150 195 124 -210 -51 246 31 -231 37 234 -83
1541h3j04L31K6l35M8L28j39k89J98K52k54j91K97J21l21m3L24l4l12J08K81j62
$$ -83 -187 144 170 -165 -117 211 72 -217 -19 233 -21 -212 85 206 -115 -158 166 132 -180 -72 209 47
1563D7k42K11J88k64j27K98P2l26J6L04q6k73J43K39k11j85K56J34k83p3K90Q
$$ 47 -195 16 204 -60 -187 111 183 -143 -127 177 91 -182 -39 200 -11 -196 60 194 -89 -162 128 136
1585A36k92N6K78j25k45J91K04k35j43K51Q9k93%K84n2k66J09K35j66k09K26J53
$$ 136 -156 -100 178 53 -192 -1 203 -32 -175 76 165 -128 -128 156 104 -162 -53 182 16 -193 33 186
1607A86k50r0K69K5k68K0K73q9k36J43K03k06j44K21J11k52m4K59k6k41O9K24
$$ 186 -64 -154 115 140 -128 -108 165 76 -160 -17 186 -20 -164 57 168 -84 -128 131 105 -136 -67 157
1629A57j16k05J68J64k11j06K38N3k49%K54p6k10R6K02j52j58K04J04k24o0K38
$$ 157 41 -164 4 168 -43 -149 89 142 -107 -107 147 71 -139 -43 159 7 -151 53 157 -67 -127 111
1651A11J3k38M1K24q6k17J42J75j86j16J98P6k27j1K18k6k21Q9J95j35j67J73
$$ 111 124 -114 -73 151 65 -152 -10 165 -21 -137 61 137 -90 -101 117 91 -130 -41 154 19 -148 25
1673B5J12j89p8K19K7k17K1K21p8k01J20J69j54j24J76Q7k03m1K14qj97M9J87
$$ 25 137 -52 -130 89 116 -101 -80 141 63 -138 -18 151 -3 -127 49 136 -67 -108 106 98 -99 -50 137
1696A37j07j56J26J39j75p9J86M1k05LK07n6j81Q9J54j10j34J44R8j81n0J87J7
$$ 137 30 -126 0 139 -36 -115 71 112 -93 -90 117 61 -120 -31 123 13 -121 23 121 -60 -110 77 94
1719I4j92L4J70o8j57J10J42j49r6J71N2j83j7J81j7j80P1J53r7j42J37J01j62
$$ 94 -98 -64 106 38 -119 -9 133 -16 -112 59 111 -72 -89 92 75 -105 -34 119 22 -120 17 118 -44
1742d4o6J75K4j74J6J70o1j44Q7J32j21j02J46O6j64l9J78j1j61L7J64q1j38J22
$$ -44 -110 65 89 -85 -69 101 40 -104 -17 115 -6 -108 38 104 -60 -99 79 68 -93 -56 108 27 -111 11
1766A1J12j42r6J69M1j69JJ67m0j48O8J38j05j09J33O4j33n4J54J3j66K9J58o6
$$ 11 123 -19 -115 54 95 -74 -73 94 54 -94 -26 112 7 -102 31 95 -38 -92 62 75 -91 -62 96 30
1790C0j32J02J00j18r3J44O5j57mJ45k5j46N1J47j01j07J11R1j29o0J38K9j55
$$ 30 -102 0 100 -18 -111 33 98 -59 -63 82 57 -89 -38 109 8 -99 12 103 -26 -86 52 81 -74
1813g4J6J48m4j24N9J24r3r9J16O3j40k9J45Lj45K8J36n9j20J01R3j31n2J16L6
$$ -74 -58 90 46 -78 -19 105 12 -87 29 92 -48 -77 68 71 -74 -46 90 31 -89 12 105 -26 -78 38 74
1838G4j32nJ41l6j38P6J08q3r9J15P4j22m1J33Mj34K4J15m2j08Q4Q3r7q2J11N4
$$ 74 -58 -63 78 42 -96 -20 88 5 -94 21 95 -27 -68 65 69 -65 -41 74 32 -76 8 91 -6 -88 23 77
1864G7j19j3J21j7j19L6J21o4q9Q3N6j02n1J38J0j29J2J18l8j13O6J00q1q9J10
$$ 77 -42 -55 66 49 -70 -34 87 23 -66 17 73 -29 -80 58 68 -61 -49 69 31 -82 -16 84 3 -86 24
1889B4N1r8l5J14kj13K8J09m5j09Q3P4r2m2J00J3j01rJ14j6j12M3R2o0q0R0M6
$$ 24 75 -23 -58 56 54 -59 -31 78 33 -76 7 81 -11 -53 47 60 -41 -50 64 48 -64 -21 71 11 -69 21 67
1916F7r3l6J03Rj02J4R9m5q9O8P6q3n0R0L6r8j7R8rr2M2Q4o3p2O8O8q3l7R3K2
$$ 67 -26 -62 41 50 -52 -38 61 16 -73 -5 71 -12 -62 28 64 -34 -51 47 38 -54 -12 72 9 -63 5 73 -10 -47 46 68
1946F8j07LQ6k6q4M6Q7o5o8P3M3q6k2R2Mr5K4Q3l7p0M7P0p6m6Q2L0r1rR3k6q1
$$ 68 -39 -36 50 24 -60 -14 73 8 -60 13 56 -30 -52 40 44 -51 -27 56 19 -51 -4 66 -10 -56 26 56 -35 -44 49 23 -58
1977e8M7Q7n6p4O6M6o8l6R0Mq2kR4m5p6O7N7n9n3P6L4q0j6P7op8L0O4m9o3P0N5
$$ -58 -11 76 20 -54 12 58 -10 -46 44 48 -34 -36 58 13 -63 4 61 2 -51 25 59 -21 -37 40 34 -44 -14 50 1 -62 8 63
2009F3p0l9O3K4p3lQ8k0q0M0O3n5n0O8L1o8k3Q0jp4J8P7m3o6M9O4o5l7N9L0p8
$$ 63 -7 -46 17 41 -32 -35 53 33 -47 -7 56 1 -49 19 50 -18 -41 39 38 -36 -18 59 16 -50 -1 63 -2 -39 20 50 -28
2040b8jP2j0p0J5O2l0o7O7L8p0k2P0Op8K0O6k6o2M9M9n2l6M7L2n6j5N9J5q3K5
$$ -28 -29 43 33 -37 -22 40 10 -57 10 48 -22 -44 26 32 -46 -26 40 14 -48 1 50 -2 -38 9 41 -15 -30 29 44 -39 -14
2071a4O7l5o6N5M6p3j6N4K0n2k2P6j5o7L9M5l5n1N6L2o6j5P3j6n2K0M5k1n1M0
$$ -14 53 18 -48 7 53 -20 -36 18 38 -14 -36 40 25 -42 -3 42 7 -44 12 44 -22 -37 36 20 -32 -12 33 12 -39 1
2101AM7n2l8P0Jm8LM7lo0L0M2k9m2M9K7m3k7N4Oo0ON1j3n8L2M4l5l9M8K7n6k2
$$ 1 48 -4 -42 28 29 -19 -16 31 28 -32 -2 40 11 -31 18 45 2 -25 29 35 -25 -19 32 19 -39 -7 37 2 -37 11 38 -18 -40
2134d0O1Ro0K2N2k3m9L6L9o3k1N7J0m2nM1jo0L1N0l7l9L7M2m9k4M3J6o1MN2k0
$$ -40 21 30 -30 -8 44 21 -28 8 47 -16 -37 20 30 -12 -17 24 23 -37 -6 44 7 -32 5 47 -2 -26 17 33 -28 -24 28 8
2166Hm8L7L9m0k7M2K1m5j2M7qm3J6M3k3l0L3J2l6mN0om3lM8k4k8J3N0l5l1M5J0
$$ 8 -40 -3 36 -4 -31 11 32 -13 -25 22 14 -29 -13 30 7 -23 10 22 -14 -18 32 26 -17 -20 28 4 -24 -11 39 4 -27 18 28
2199B8m2rM6J0m3PM4l7l7L4L0m0rK9J3m4NN1j4m5J9M1l6l8N1J3l5j0M6%m4J3L5
$$ 28 -14 -23 23 33 -10 -3 41 4 -33 1 31 -9 -18 11 24 -20 -15 36 22 -23 -4 37 1 -37 14 27 -8 -18 28 28 -16 -3 32
2232C2qm6L3K5m1j6L4Rk9k3N2Jm3KM7j8l9L5K0m1rL5Nl9MM4mm5K3L1k9k4L6J0
$$ 32 24 -22 11 36 -5 -21 13 22 -7 -30 22 23 -20 -18 29 11 -28 7 27 -14 -23 12 17 -22 -18 26 22 -23 0 31 2 -22 14 24
2266B4l6KK6jl4J1L5j4l9K0K5k0k3K8K0l9j0N2j0l6OL6k5k6K5L1m2j0K8Mk6JL1
$$ 24 -12 -10 16 15 -19 -8 27 13 -26 -6 19 -1 -24 4 24 -15 -25 27 17 -19 -13 23 -2 -28 -3 28 -14 -24 4 8 -18 -17 14
2299A4km1J6L7k1k5L3J5l7kL3j2k4RL9k5j7J7K4l7j0L7lj9j0M6k4k9J0L2k3j9
$$ 14 12 -29 -13 24 3 -22 11 26 -11 -13 20 8 -16 -7 32 7 -10 7 31 -6 -16 21 18 -1 -11 35 11 -18 -8 24 1 -18
2331a8L0Ql3mL1Ml8jM3k4j2J7J4k1j5L0J4l3lK8jl8J8L2k9j7L7Pl0jK2Kl5J4K0
$$ -18 12 20 -13 -17 14 18 -20 -21 22 -2 -14 3 17 -4 -19 11 25 -8 -11 17 16 -22 -4 28 -1 -18 19 26 -4 -5 17 19 -16 -2 18
2366A8pl4J5L0k3j7K2Kj8MJ7kl2J7K2j3j7J9K3k9j6K0J2l6PK7Jk4J3J2qj6J7J4
$$ 18 11 -23 -8 22 -1 -18 4 6 -12 -8 9 7 -25 -8 14 1 -16 3 26 -3 -19 1 13 -23 -16 11 12 -12 1 13 5 -11 6 20
2400B0l1lJ9Qk6NK2qk6K4J1k6rK8Nk6lM2j5k8J5J4j4j6K1J0k8jL1Ol1JL0j6j5
$$ 20 -11 -14 5 13 -13 -8 14 6 -20 4 15 -11 -20 8 13 -13 -16 26 11 -17 -2 12 -2 -18 3 13 -15 -16 15 21 -10 -9 21 5 -10
2435a0J4Jjk0K6jj9oK1Nk5LK5lk1K3Ok9nJ9Nk5kL0jl4J8Rrj7J4K6k0j4K8lk0P
$$ -10 4 5 4 -16 10 9 -10 -16 5 10 -15 -12 13 10 -11 12 18 -11 -16 3 8 -17 -19 11 10 -24 -6 3 -6 -23 -9 17 -3 -17 11 8 -12 -5
2473eJ3jj5ROj3j9K5J7l1J0J9mk6J6K7j0l0K6lk0%J9Ol2KL4j9j6J1Nj3JK3nj2
$$ -5 8 7 -8 1 7 -6 -25 0 17 -14 -4 15 11 -15 1 28 18 -12 14 11 -9 -9 10 16 -16 -14 20 1 -15 -4 1 -12 -11 12 7 -5
2509ej0J9%k5K0J5j4j1J2J2k7J3J8kj5qJ4onMJ1j0j5J6%nj6J9Mk3J1J8ok0K6J
$$ -5 -15 4 4 -21 -1 14 0 -11 1 13 -14 -1 17 15 0 -8 6 0 -5 -1 10 0 -15 1 1 -4 -20 -1 3 -20 -9 9 3 -17 9 10
2545A0rk0K2J1j5qRknjK5k6lJ9Kk4QJ4Jk1J1J7mqkPoj2J1J6j2oJ0%j3JOrpRJ2
$$ 10 1 -19 3 14 -1 -9 0 -2 -7 -8 17 -9 -12 7 9 -15 -7 7 8 -13 -2 15 11 3 1 8 2 -10 1 17 5 -1 9 9 -4 -3 3 -6 -13 -4 8
2586Hj3KJ3j4lKJ1Pj5kJ1pqNJ0oqJ5j3j0%K7rj5LJ3krQQj9kK7nj2QojrMJ4qj2
$$ 8 -5 -3 10 -4 -7 -5 6 13 -2 -4 7 0 -8 -3 7 1 -7 8 -5 -15 -15 12 3 -12 -9 4 2 -7 1 9 -10 -12 15 10 -2 6 0 -1 -10 -6 8 0 -12
2629a2O%nJ0J5j4j3J3Mmj0ONpjJ4Nj3NKJj3PJ1j2j1K1%k2J0J6Ll0J3kJmKRnj0
$$ -12 -6 -6 -11 -1 14 0 -13 0 4 0 -10 -4 1 -6 -7 7 12 -1 4 6 7 -6 1 12 0 -11 10 10 -12 -2 14 17 -13 0 -2 -1 -5 -3 6 1 -9
2670iJ2pMqRKj1JJ7j8JJ1Nj6MQJ0qnJ6j7%%J1nqJQj0%J4j5nRk%kQMj0j1J8oj8
$$ -9 3 -4 0 -8 1 3 -8 -7 10 -8 -7 4 9 -7 -3 5 15 7 2 18 1 1 1 12 7 -1 0 8 -2 -2 12 -3 -8 1 -1 -1 -3 5 9 -1 -12 6 0 -18
2714a8MJ9kj1kJ8j2kJ2Kj2KPj0KnK7j3j1J0njj8J7JlQOrj1RRnj4QJ3j0mJQj8N
$$ -18 -14 5 3 -8 -10 8 -4 -6 6 8 -4 -2 5 -5 -3 -8 19 6 -5 5 0 -1 -19 -2 -1 -4 4 10 1 -10 -1 8 3 -11 -3 10 0 -4 -3 5 -13 -8
2756hNnlJ4J0j7lJ8Kj5pJ5noPJ3qk1K0j1L%QKrJQjk7K1J6j9j1J2RqKOlj1%J1o
$$ -8 -3 -8 -11 3 13 -4 -7 11 13 -2 -9 6 1 -5 2 15 7 -14 6 -5 -2 -2 6 8 -1 0 8 7 -20 1 17 -2 -13 -1 8 0 2 8 5 -6 -6 5 -1
2799aj0%J1nnJ2kmJQqkMJ4pj2MNopJ0Kj4J2Oj0rJ2Rj8LJ3Mj5kMJnJNnjJ1%j5Q
$$ -1 -11 -11 0 -5 -10 2 0 -4 -3 5 -3 -5 -1 13 6 -6 -2 3 -3 -10 0 2 -12 0 6 -4 -13 -1 8 -10 -7 6 10 -5 -7 -3 -2 -7 -6 -1 -6 -7 4 4 -11 -3
2845cLkoKKJ0j0K%jrONj1J3%Nj1mJ7j0%Rj1NkjJj4OMNj0kJ1kj1NJ0oJ5j5Pj4p
$$ -3 0 -2 -8 -6 -4 6 -4 -2 -2 -3 -12 -6 -1 -12 1 1 6 -5 -9 8 -2 -2 7 -4 1 -1 -2 -1 -15 -9 -5 0 -10 -12 -1 -3 -14 -9 1 -5 10 -5 2 -12 -19
2890a9K8j5PjLjOqj1PoJ3jqJj%nJ3Lj5OJ5j2rPJ0jj4KJ0nj2J1OqkJ9j9mKJ0jK
$$ -19 9 -6 1 0 3 2 8 0 -11 -4 -10 3 2 -6 -5 -6 -6 -11 2 5 -10 -4 11 -1 -10 -3 7 6 -8 -6 4 -1 -13 -2 4 -4 -6 13 -6 -10 -8 2 1 3
2934CkJm%Q%j3J3oJolJ2rJ3j0J0j4KRNj6J2Lj0oJ0mjlJ1mnN%%jpQkj7J1QkjNJ1
$$ 3 1 2 -2 -2 6 6 -7 6 0 1 -5 -8 4 -5 8 -2 8 -6 -4 5 10 -6 6 9 -1 -7 3 -1 -2 -5 6 2 -3 2 2 2 1 -6 2 0 -17 -6 2 0 -1 4 15
2981A5qj4J2lpJ6Lj7lLJLj2QjmJ4lJ%pLMj3J4Kj0oJ3roKJ3%k3J8qLmJ7jj2kJ4
$$ 15 7 -7 5 2 -5 11 14 -3 -6 -3 -2 1 -11 -3 -4 -8 6 3 4 4 -3 0 4 -9 5 7 -3 -9 4 -5 -11 -9 4 4 -19 -1 -9 -6 -10 7 6 -6 -8 6
3025Frk%J2Kj4Nk%kOPj4j0J6Qk1RlKkMjnnMNj1OJ8j3kKKmJ2%j3NMqJ4j4%Qj7K
$$ 6 -3 -5 -5 7 9 -5 0 -2 -2 -4 2 9 -5 -15 1 9 -12 -3 -6 -4 -6 -2 -3 -8 -13 -9 -4 -15 -9 9 -4 -6 -4 -2 -6 6 6 -7 -2 2 -6 8 -6 -6 2 -15 -13
3072a3K1qpkRLj2RlKLnKJj3K2j4jJ2j7J6PrlMo%PjkNnj0lRNMmjKrK0k0PnPKqK
$$ -13 8 0 -7 -9 0 3 -9 0 -3 -1 2 -3 -1 0 -13 9 -5 -6 6 -11 5 12 3 0 4 -2 -2 5 4 2 7 2 -8 -11 -2 3 7 3 2 4 -5 15 -5 2 -3 4 6 -2 0
3121@kMj0Lj0NQ%oJ2pJ0j1LjL%njPnKJ4j2Kj6J0jkOJpJ1mMj4lJ0Opj1K0j3JJ5
$$ 0 -2 2 -8 -5 -15 -10 -2 -2 -8 4 -3 7 -4 -1 -2 1 1 -4 -5 2 -3 -1 13 1 3 -13 -3 -4 -6 0 1 -6 5 1 5 -9 -12 -2 4 -3 -14 6 -7 -6 9
3166IrrNOoQj1NQqQmklRjLJ%omLRnj2J4j1NoJ4j3J0j1J1%qkQoqJLPj1RMoL%j4
$$ 9 0 -9 -4 2 -4 4 -7 -2 6 -2 6 2 0 -3 6 5 8 9 9 3 -1 2 11 6 -6 8 -3 2 -4 10 -3 7 -4 7 7 -1 -3 5 -1 -9 -8 -5 2 -9 0 4 -2 1 1 -13
3216a3J1jJ0lpORj0kjL%OoLj1RJ1k5PKJ1qmNpLJ1Jj2jlPj2ORMqlLqOJQj2Pj2Q
$$ -13 -2 -3 7 4 -3 3 12 2 0 -1 2 2 8 2 5 -6 3 14 -11 -4 -2 9 1 -3 2 -5 -2 9 10 -2 -3 -6 1 -11 -5 4 8 0 -3 0 -8 -2 -1 7 -5 2 -10 -2
3264bNk%rRPpRooqKJ6KrnQmNpQj1RpOJ0rm%mNNqKqRJOlj1J8j3PnLLnKnKOnKJ1
$$ -2 3 1 1 -8 1 8 1 10 4 -2 -10 -8 8 10 1 -4 4 0 5 -2 6 -5 4 -3 3 13 4 0 0 -4 1 6 -2 0 -8 1 2 8 5 -6 12 -1 6 1 4 7 2 4 -1 1 7 2 4 15
3318A5oNj8J2p%mJ4j4OmKOkJJmmOj1JlOJ0j0Nj3J7Mj5J2j2PqK2k1LNKj1LlJ0Q
$$ 15 9 14 -4 8 1 1 -3 11 -3 3 -1 1 7 5 6 7 3 -1 5 -6 -5 -8 -2 8 -2 3 -10 7 11 -4 8 -4 3 -5 17 -4 -1 4 6 -5 -2 -5 5 13
3362A3j5KO%oQJmrJ3rlpJ1j2QLnoJ3j2JMJ0Kj3LPoMj0J5k5J6J0koJ3j0J0j4Lj
$$ 13 -2 0 6 6 0 8 9 5 -4 9 0 -3 -10 1 -11 -3 0 -5 -11 2 -10 -9 -5 5 7 -6 -3 4 -2 2 -8 7 -18 -2 8 6 0 13 3 13 -1 2 1
3405Aj2QP%qQjj1%K1pjj5KOOj1M%MlLJmM%KmmnJ1kMnkqRoLJ2lnQJj2lRqJ4j4O
$$ 1 -11 -3 4 4 -4 4 3 -8 -8 13 6 5 -10 -8 -2 4 -7 -3 -3 1 -2 1 2 -2 2 2 4 0 -4 -9 2 0 4 -1 -3 -11 -2 -8 -5 7 4 -1 7 8 -4 -7 2 -6 8 -6 0
3456@j%l%pMNrjKNJl%OQoNJpnJ1klJqLN%Oj2JLmJ5k3J1MmKjPjj5MJ2j5RLqjNj2
$$ 0 -1 -1 -4 -4 -11 -7 -2 -11 -12 -10 -5 -4 -7 -7 -1 7 1 6 7 0 -5 6 4 1 2 -6 -3 2 2 8 -4 -3 0 -4 11 -12 -1 3 -1 1 0 7 6 -9 -5 7 -8 1 4 -4 -5 0 -12
3509a2J4rMP%oLJ0qpQq%Pl%nJ0LNj5PoJ3oNlllJ3rlQj4J0p%J0j6QknJ0j2PjMj
$$ -12 2 -7 -3 4 4 -2 1 11 3 -4 4 -4 -4 3 0 0 -5 5 8 13 -2 5 -1 12 6 11 8 5 2 15 6 3 11 -3 7 0 0 10 -6 2 0 -5 5 -7 0 -1 3 2
3557BmQlKnpJ3j3OOJj0K%LJ0jqPqj1J3j1PJoJ7j0j1J9j5PlJ0rKlPlj2OoQLj3J4
$$ 2 -2 6 3 5 0 -7 6 -7 -1 5 6 -4 -2 -2 1 11 10 2 9 1 -10 3 -8 -1 0 -6 11 1 -10 9 -6 1 -2 8 -1 1 -2 5 2 -10 -4 -10 -2 1 -12 2
3603BLnRj7PLKoQ%%jqKOojJ4j5MpKPLpo%OJQKj1jP%j1J7j6%J1nJkjKo%jLLMLr
$$ 2 5 0 9 -8 -1 2 4 -2 6 6 6 5 -3 -1 5 -1 -2 12 -3 1 -6 -4 3 6 -1 -7 -7 -1 0 8 10 -1 -2 5 5 -6 11 -5 -5 6 1 2 0 -1 1 -5 -5 -6 -3 0 4 7 -2
3656bJjOLlPj2MJlKj2PkkRnQoPrRmqJ6j5%MkOoJ5mnjjJ2j0JqMnQOj1jJ3omRj1
$$ -2 -1 -2 4 7 4 11 -1 3 4 1 3 -9 -2 -4 -6 3 -2 6 0 7 -2 7 3 -5 11 -4 -4 0 -2 4 -2 13 9 4 3 2 14 4 5 -3 1 -4 4 10 -1 -2 11 5 1 10 -1
3707aKLnJ%L%MkqKJjKLQpJmKJrOM%jj3J2%Mj6OOrMPKlqLqJ1mRj1J2j7%QNn%Mm
$$ -1 1 4 -1 0 0 3 3 7 5 -3 -1 0 -1 1 4 12 5 6 2 4 5 -4 2 6 6 5 -8 4 4 8 -8 -2 4 -5 -1 6 8 5 -3 0 -8 3 -1 8 -3 9 -8 -8 0 5 0 0 4 0
3761@KmkRK%Lp%qJ1NKnpJ9nnlj2J0qRk%mNj2J4olMKqjQOrqJ6j0kLRp%pQlMmMk
$$ 0 2 -2 -4 5 7 7 10 3 3 -5 6 11 13 8 1 20 15 10 7 -5 5 -3 6 4 4 0 5 -7 7 1 -2 2 4 -4 -5 3 9 0 -8 8 -2 -4 -1 8 1 1 -6 2 -1 3 -1 3 1
3814ALOKmplRMj3JRj9J3mJ5r%njnQ%jOorkQQmlJLQkPj9PQqPnkjPrKjRojqnJ4p
$$ 1 4 10 12 8 1 -2 7 11 -2 -1 8 -11 2 -2 13 4 4 -1 -2 -7 1 1 0 6 0 -9 -11 -3 5 1 -2 -1 2 10 8 15 -4 3 11 3 10 5 3 2 9 0 2 1 10 4 3 -5 -10 4 -3
3869cJ5j1Qj1OKmLrPkjQmqP%n%J4rMomNOqOMj3J0j5J1Oj5J3mmJ3prLkMkjPLj1
$$ -3 12 1 9 -2 4 6 2 5 -4 3 1 0 8 4 -4 3 3 -2 -2 12 3 7 1 -3 2 8 0 6 10 -3 7 -8 3 9 -6 7 3 -1 12 5 -4 -1 -3 1 -1 -2 5 8 -3
3918clLJ3knMlRmnojNlkQ%mNmkJJKMnlQk%KkMrKqNj0OJ0JpqJ6j0lmJ1oJJ3opp
$$ -3 -6 -3 10 8 3 7 4 13 9 4 -2 -3 2 -1 -3 5 5 1 6 2 0 1 2 4 8 3 0 8 6 6 8 6 10 1 3 -5 0 -10 -4 6 7 0 -8 8 -2 -5 -9 2 -4 -3 10 4 -3 -10
3972a0J3K%knQLj1JNjnlNRrLkoOJ1omoKMjOMj6LOj1kMJ1Lj3MRj1LkMooJ5llmJ6
$$ -10 3 5 5 3 -2 6 9 -2 -1 4 3 -2 -5 0 9 0 3 1 -5 1 12 6 2 -4 -2 2 1 7 11 -5 -2 4 -7 -9 -5 6 9 -4 0 9 -2 1 -1 3 -3 -9 6 3 0 -4 12
4023A2oJMmnoljK%LqJ1n%J3mj3RJMj5NlJ2Rk0LNqMJ0qjkJPOj2Rj1Q%LjnkKlJJ2
$$ 12 6 7 11 7 2 -4 -7 -8 -6 -6 -3 -11 0 -5 -5 8 4 -9 0 1 5 -10 -5 -8 4 13 -7 -4 1 -7 -3 7 -1 -2 -4 -3 4 10 -2 7 -4 4 4 7 6 1 -1 1 -2 -1 11
4074A1j2Qj5K0omKJkrJ3oJ2j4MKj0J0oLQj3qK0Mk0M%oJ0JPmnJ1mqLKJ3j3qJ1r
$$ 11 -1 7 -8 12 6 2 4 5 3 -6 7 1 13 -1 3 5 -5 5 -1 2 10 -3 -11 9 13 -7 -3 -3 -9 1 2 9 5 0 11 7 -1 2 4 17 4 -4 7 -2
4118bjK%nPKj0QJJJp%JrJ1%pJOJ1j1kJ0oMjrjMmKQmJ0j1MrKRmMOj2LkJ1rJ0rM
$$ -2 -3 -1 -1 -6 1 3 -7 1 2 3 4 -3 -3 -2 -11 0 0 -7 -6 0 11 0 -2 8 2 6 5 -4 -5 -1 -5 -3 5 1 11 0 4 -5 -3 6 2 6 12 0 3 1 12 3 13 4 8
4169H%j3MJ7k4NlJ2j1QkQqkPJrKLkNLj5J2qJ2rOj0OjN%pLoJJJLJ4j4OJnk%KKK
$$ 8 8 -5 -1 16 -8 -3 -6 6 -5 3 1 9 1 -1 6 7 -2 0 3 1 6 9 -6 6 -2 10 1 7 -3 3 2 7 7 0 3 -3 -2 -1 0 3 17 3 9 10 5 3 3 5 7 9
4219Ij2LpNMMrK%nJ1nPpKPJLj8kJ0oMJ2j2LpkKJ0%lJoLjpJ4nkjMkJnOj0%K1po
$$ 9 -3 0 -7 -2 2 6 -3 -1 -1 -6 5 0 7 0 2 9 10 13 -5 -7 3 -3 1 13 1 4 -3 -5 -3 7 7 4 5 -1 2 1 -6 8 3 1 0 4 2 3 -2 4 -6 -6 15 8 2
4270BLlQj2QJllKjnJ5nMj2lKlJ2nLmoJL%Kj1KOQrJJ2okRj4N%jNj8J2jJjOj1N%
$$ 2 5 2 10 -2 6 7 4 1 3 2 -3 12 7 11 -1 -4 -2 -5 7 2 5 1 -5 -4 -1 -1 1 -10 -8 -2 6 -3 -2 10 4 2 11 -3 2 2 1 6 -12 0 -1 0 -1 5 -6 -1 -1
4321a%LpJ7jLj1PloMkkLPj1LJKqRj0lQmMpN%lmRMjl%LlMpJ0qJ%rJ1pMK%NnpPN
$$ -1 -1 2 -5 12 11 14 3 10 7 1 5 3 1 4 11 0 3 4 6 -2 7 -3 -6 2 -2 2 -5 0 0 -3 -7 2 6 5 2 2 5 2 6 -1 9 1 2 2 -7 4 -3 1 3 3 8 3 -4 3 8
4376HOpkkJNj0Mj3J6J0mrOj2OJj%LmQoNn%q%Rj1OkkNj2J3Nj1J8j4PqOjkmqNmK1
$$ 8 14 7 5 3 4 9 -1 3 -10 6 16 12 3 9 -3 3 4 3 3 6 2 10 4 9 4 4 -4 -4 5 -6 0 -2 -4 1 -11 2 7 -4 14 0 7 -1 5 4 2 -2 -10 -5 -9 12
4426A2j6J6kj1jOj3J1%Lp%NrJ0KOj2%JjMOnqjmJ1qMmJQrJ1j1%JLjjPj0J1lNj0
$$ 12 -4 12 10 -1 -2 4 -9 2 2 5 -2 -2 3 -6 4 6 12 0 0 1 0 4 10 5 -3 -4 -8 3 -5 -1 -5 -4 4 -5 6 -5 -5 -4 -1 -2 -3 4 -6 5 2 7 -3
4473cOjKLqNoMLOj2J2j1LjkpJ0Lpk%LjJ1j0OnkKQqNj2JoNKjJ%MJkmJ0q%KJ1Mj
$$ -3 3 2 4 7 -1 4 -2 2 5 11 -1 11 0 3 2 0 -7 3 6 -1 -3 -3 0 -1 10 0 6 1 -1 1 9 1 6 -6 -5 -11 -6 -4 -5 -4 -4 0 1 -1 -5 5 -3 -3 -1 10 14 13
4525A3j0klLjPmOr%o%JMlNmnK2j2jPj0qPMqmMLKlQJ3j5Jj5RQJ%qQj1PoJ0Konn
$$ 13 3 1 -2 1 0 7 3 9 0 0 -6 -6 -5 -1 -4 1 -3 -8 14 2 1 8 -2 -10 -3 1 -7 -11 -7 -4 -2 -5 3 16 1 2 -13 -4 4 5 5 -3 5 -6 1 -5 5 7 1 -4 -9
4576iOQrqLRqJ0rJOjNlj3QRkpmJ2oKoJ1j4mJ3Pj3J2kpLPKj0NnLJ0j5J2Kj4JoN
$$ -9 -3 5 -4 -12 -9 0 -8 2 -7 -6 0 -1 4 1 -12 -4 5 3 -4 -8 4 -2 0 -6 5 -9 -13 0 7 -6 6 4 -3 0 7 9 -1 4 -1 2 12 -3 9 11 -3 -2 -8 -3
4624cMmKLmQnMkLrJPNlnoRJJnLnLpJ0MoLrJ0LmjjJ0ojjJkNpmMJ1nKqjmNkkKom
$$ -3 1 -3 -1 2 -2 6 1 5 3 6 -3 -2 5 10 7 2 -4 5 6 7 2 5 0 3 -4 6 10 4 7 -2 8 11 7 6 5 15 9 8 7 8 6 11 4 0 4 15 10 12 4 3 -1 4 2 0 2 -4 -8
4681hJ7rkOMj0mJ1M%Lj1J%nKJ0jrQlKj2PpNOj5JQJ0rJRnOlpkJM%oJ3pjMqJ1ln
$$ -8 9 0 -2 4 8 -2 -6 5 9 9 12 1 2 2 -3 -1 9 8 -1 7 4 6 -6 1 -6 -1 5 -10 -9 -1 9 0 1 10 5 11 8 1 -1 0 4 4 -2 11 4 3 7 -1 10 7 2
4732BJ2j4%LPj9K0j0NpRokJ1ln%Mlj0KrRPj3J0JLpJ2qKJ2oprJ5j5NJ1j5J1Mj6
$$ 2 14 0 0 3 10 -9 11 1 6 -1 8 2 0 11 8 3 3 7 4 -6 -4 -13 -4 3 -10 0 1 4 -3 9 1 3 15 9 2 -7 8 -7 -2 9 -6 5 9 -7
4776gJ4kj4PNrQKmJlJ2j0J1nrlJ0%ojMlOkQrNj2NJpPjLkRmrNJKJ3j6NLj3KKpR
$$ -7 7 5 -9 -2 3 -6 2 4 0 1 -2 10 0 11 6 -3 -6 4 4 -2 -3 1 -2 4 2 10 1 6 -6 -1 0 -7 0 -1 2 0 9 5 -4 1 2 4 17 1 6 9 -4 -2 0 -7 2
4827BpMNl%j3OP%Ojj4lNJPoPnQoj6PPRoPqOj3JJ2j0QmNj3KNKkoJ1j2J3J%mlQj6
$$ 2 -5 -1 4 1 1 -12 -6 1 1 7 6 -8 -11 -6 -5 2 -4 3 -2 6 0 -16 -9 -2 7 1 8 0 6 -7 -6 6 -4 4 0 5 -8 -6 -1 1 -1 -7 4 -8 5 6 6 2 -1 7 -9
4878iPkOpJLkNkoJ2lpRmkLrjJ1pOJ4j4qNMkj2J0M%qKPno%PmMLNJloKmjJ0m%%P
$$ -9 -2 -4 2 -5 -4 -1 -3 2 0 -6 6 3 -4 5 1 -1 2 -7 -8 3 -4 2 16 2 -6 -1 3 1 -11 -1 3 3 -5 -3 4 -1 -7 -7 0 -4 0 3 8 9 6 0 2 -2 -3 7 3 3 3 10
4932A0pNqJRmnMNqNqj2J3kM%PjqlJ1qKNqQkNj3pRKnJ2j1jLpJ0nJlPJqJ6j3MPj
$$ 10 3 8 0 1 10 6 1 5 10 2 7 -1 -13 0 -2 2 2 9 8 0 -3 8 0 2 7 -1 7 5 10 -3 -10 -1 1 -4 8 -3 -4 -1 -8 2 -3 -2 -5 2 3 -5 11 -2 2 9 8
4983HoNk0L0j2%o%LM%ql%jQMrJ0npmRMn%Mr%jMmjJ6kKj4J2kmOpJMLj6J5j4OJP
$$ 8 2 7 -13 17 5 5 -1 -1 2 6 6 -2 -5 -5 -6 2 6 -3 7 2 -5 -9 0 4 -1 -1 3 -6 -6 -7 -3 -7 -8 8 6 8 -6 6 4 0 6 -1 0 4 7 -9 6 -8 -2 -1 6
5034Fj3J5qNoJj%%%J1j3NKmO%qKOlqJ0joLljkNjOJnM%mJ1k0kJ6qJ1qKkOn%JjL
$$ 6 -7 8 0 5 -1 0 -1 -1 -1 -1 10 -3 2 4 0 6 6 -2 0 6 3 -5 5 4 -2 1 -2 -3 -5 0 -1 5 6 1 5 5 1 12 -8 -10 6 -2 9 1 3 1 7 2 2 3 2 5
5086EqJ5j3nQlMmnkPjJpPJ5qnMpkJ1kLnMkj4NRqQ%%Jj5J8qJmmMJnJ2rPk%jJ4p
$$ 5 -3 12 -1 -6 2 -1 3 -1 -6 -8 -1 -2 -1 -8 -1 14 6 1 5 -2 -4 7 5 8 3 7 5 -9 -4 5 -3 5 5 5 6 -9 9 1 2 -2 -6 -2 -1 -6 6 -3 4 2 2 1 15 8
5138HjrRkLlj%lJ9j3lQQk5JOPj0MmLMlpJ2jNj1qJ7pMLlrJ3omKmRrjMjJLnMPj2
$$ 8 7 -2 7 5 8 5 4 4 1 20 7 4 12 20 -5 -4 2 9 -1 3 -1 2 6 3 -4 8 7 12 1 -7 10 3 7 10 7 -2 11 5 1 3 -1 8 -1 -2 2 1 2 5 0 4 11 -1
5190aNJRj0jkM%kmlJ4oklPJrOmRj2J8j6mQkJj2J3jKmjNNnKj0MK%mJ2j0QNj5KJ
$$ -1 4 5 14 4 3 1 5 5 3 -1 -4 10 4 2 -1 6 7 -2 4 0 9 -3 15 -1 -5 3 1 2 -10 3 2 4 0 -1 4 9 4 6 -4 0 2 2 -2 10 0 8 13 -2 0 1
5240ApMJ3j3J7nnJOj1j3J6j%LlqJ4qK%kRqLj0OJ0ql%pJ6j9J0JlROj5Q%oQmMqR
$$ 1 -6 -2 11 -2 15 10 5 6 12 1 -12 4 3 3 6 3 -5 9 1 3 3 1 10 2 5 -5 1 11 3 0 0 -7 9 -10 0 1 -2 7 13 -2 6 6 0 8 4 8 0 9
5288IJknmPLKj0J5k6jJ6mOkJkpQQmn%j0MJ0j3J9oLloMjjjklPkKj0RRj0mMMj2M
$$ 9 10 8 3 -1 6 9 11 1 16 -10 -11 5 1 7 5 6 4 -3 5 13 9 4 4 -6 -2 8 -5 14 8 11 8 2 6 5 4 3 1 -2 5 3 5 -5 4 13 3 -1 3 7 -5 -1
5338aJ0j1LmRkOj7J0KrQJ5k3OjMpLlqJ2MNrmmNKj2J6j2J4mjMkrlNJJjOlKjJQp
$$ -1 9 -2 1 -3 6 4 10 -7 3 5 -4 4 19 -4 2 1 5 -2 1 -2 -10 2 6 11 2 -2 -6 -1 1 -11 5 -7 7 3 2 6 4 -5 -8 -3 -2 -1 -2 4 1 3 2 3 11 4
5388D%lKQkj6OLoNLj3QoLNj0OnNNQj2PnmjNJ1pkOlpKQ%nMk3J5NpJ2Jj1klLKQq
$$ 4 4 1 3 11 9 -7 -1 2 -4 1 4 -9 -1 -7 -4 1 -9 -3 -8 -3 2 10 -2 5 0 -4 -5 0 11 4 2 8 5 -2 0 8 8 3 7 -16 -1 4 -3 9 10 -1 -3 -6 -3 -1 7 -1
5440aKLmmJ0Lj3%mO%NnQklPj5OQo%kJ4j1JnkQRj3MJj0LpJ4plKKQpMOnJ%j6K1j4
$$ -1 1 4 0 -4 6 9 -4 -4 -8 -2 -2 3 -2 6 4 1 8 -7 -1 7 1 1 -1 13 2 3 -2 -4 4 13 0 4 5 -5 -2 -9 5 -2 -5 -3 -1 7 0 4 10 5 6 6 -10 11 -3
5491c%KJqJ7j0L%mNk%MnNrjJ5nKoJ2j1nKNNj2J2mKkoLmJ1pmQjoMj0J0lKk%J0j
$$ -3 -3 -1 0 -8 9 -1 2 2 -2 3 1 1 5 0 5 -4 -5 10 5 7 1 13 2 -3 -1 4 9 -3 9 5 7 5 -1 2 -2 9 2 -2 6 5 -1 3 -7 3 0 2 0 0 10 9
5541Ij7K2mmj0kONoKjMnPoOkMKj2J%kK3j8JK%MjkPj1JLJ0nkjpMrJ2llJKkJnMM
$$ 9 -8 14 10 6 -4 -6 0 5 -1 1 0 4 -1 6 0 6 4 8 10 -2 -1 -1 -3 20 2 3 5 5 9 8 6 13 2 3 6 16 11 9 8 1 5 -4 8 5 2 3 5 3 4 -1 3 7
5593Gj1J2kOOrj7RMJ0mnrJ4ojJ1j1kMnRkMlpRmkQj1Mmlk%RmLJmNqK%KkJ1j3L%
$$ 7 -4 8 6 12 18 9 -8 1 5 15 11 6 -3 11 5 4 15 4 2 6 1 10 8 12 9 2 11 7 5 13 2 6 2 -1 -3 -3 6 2 5 6 2 7 -1 1 1 3 1 12 -1 2 2
5644BlPJj2PlJ2kqMoJ4j5NmJ1%mJm%Oj1kMNJ1j6%MqMnJJJ5JJj1KJnOj0J0Mj1l
$$ 2 -1 6 7 -5 2 -1 11 9 1 5 -1 13 -2 3 -1 10 10 6 7 3 3 9 -2 -4 0 5 16 0 0 4 -4 0 -5 -4 -3 12 13 14 3 5 6 1 7 -3 7 11 0 -3
5692cojKK0rjML%nLPopQj0NJ6j7Pj8J2J6j8%OokJRjm%pO%JJljPkMj5J3KqL%kj
$$ -3 -9 -10 -8 12 3 2 6 9 9 4 7 14 8 1 9 -1 4 20 3 10 -8 4 20 2 2 8 2 0 1 10 9 5 5 -2 4 4 5 6 3 2 9 7 11 -4 9 11 3 6 6 4 3
5743CQrMqLj1J4nlORrjKMKQj6RqmPlQopJ3mnOkRqJ%Kj3OjJ2j5OJ%KoJ2kqN%rR
$$ 3 11 2 6 -2 1 -10 4 -1 -4 2 11 2 1 3 7 9 17 1 10 2 -2 5 2 10 4 -3 10 6 1 7 5 14 6 7 7 9 -4 2 1 13 -2 4 5 5 7 1 13 11 3 8 8 -1 8
5796HrJ1lMPrnJ1j8LJ1j4kJNkPjRplNmJ3j4Nq%RNOk3J3qQrJ3j1JjlJlJ3jo%lP
$$ 8 -1 10 7 11 18 9 4 15 -3 0 11 -3 -5 -4 1 -1 6 5 14 7 4 9 5 18 4 9 1 1 10 15 21 -2 11 3 11 2 15 4 5 4 1 2 -1 12 11 5 5 2 9
5845IqRpRj0LLRj0KNj2%MllOjKkNKooLN%j1J7j1nRj0kJ4Lkj6J3J%oRj0NrQ%Kj3
$$ 9 1 10 3 12 2 5 8 17 7 9 14 2 2 6 3 0 6 5 7 5 10 12 6 0 3 8 8 -3 14 3 -2 7 -3 -5 9 12 10 -6 7 8 8 2 11 1 6 -3 5 5 7 -6
5895fJ0ljRq%M%jKKojrJ3Noj%NnMoMO%j2J0lMj6RpLJ4Jj2%pJ6j1NLJj2J1q%J0
$$ -6 4 1 0 9 1 1 5 5 4 6 8 2 1 -8 5 10 4 3 3 8 3 7 1 5 11 11 -1 9 6 10 -6 3 -4 -1 13 14 2 2 -5 11 0 5 8 9 -3 8 0 0 10
5944A0jJ%j1KlQjpKJOKnjMkoNPj3QqRPk0J2lNlj0K4k3NOrjPJ1j0JLrjMkOrJ1n
$$ 10 9 10 10 -1 1 -2 6 5 -2 0 1 7 9 4 3 7 5 -1 4 11 -2 6 -2 7 14 -6 6 3 8 5 -5 19 -4 1 7 -2 -3 4 15 5 6 9 0 -1 3 1 7 -2 9 4
5994DmNLj0J1nlmkJ4p%JlRlNj0MmrOJ1rKMnOpjKRJj2Q%j4J0KrljRnKoJ0JnQnM
$$ 4 0 5 8 -2 9 4 1 -3 -5 9 2 2 3 0 9 6 11 1 5 1 -8 -2 9 0 2 6 1 7 0 -1 1 10 11 -1 7 7 -7 3 5 -4 -7 -8 1 -4 -2 -8 2 3 -2 6 1 5
6046Ej3KnMJ7qj0kLJ2olRj2Qj%kOqkNLl%Nj4J0Nj0Qml%jJ5%j5NJ0nlN%ljjPmk
$$ 5 -8 -6 -11 -7 10 2 -8 -10 -7 5 -1 -4 5 -7 1 0 0 -2 4 -4 -6 -1 2 -1 -1 4 -10 0 5 -5 3 -1 -4 -4 -5 10 10 -5 0 10 5 2 7 7 4 3 2 9 5 3
6096CJj0OJ2q%kLpJ1j6RkkJ1jqmNJqJ0LJpK%nMoLOkjJ0nJ1j5QrjjJKmlRmnMlJ
$$ 3 4 -6 0 12 4 4 2 5 -2 9 -7 2 0 -2 9 8 0 -4 1 2 -6 4 7 8 1 3 3 -2 2 -4 -1 5 3 2 12 7 18 3 11 2 1 0 1 3 -1 -4 5 1 -4 0 -3 -2
6148blJ2kjoLrJ6j0pMOJQMplLKnNNolL%%Lo%pK6k5OMj5J2mm%MmLJ%qPLLpPmJj
$$ -2 -5 7 5 4 -2 1 -8 8 -2 -9 -5 1 2 10 14 7 4 7 9 4 9 14 8 5 8 8 8 11 5 5 -2 24 -1 5 9 -6 6 2 -2 -2 2 -2 1 2 2 -6 1 4 7 0 7 3 4 3
6202CkLMpNkLpMj3QlQNj2QJj2MjOmkNrLmJ7j7KJ0qK%Pmj0LPkJKmQmOj5J2jKmP
$$ 3 1 4 8 1 6 4 7 0 4 -9 -1 -4 4 9 -3 5 6 -6 -2 -3 3 -1 -3 2 -7 -4 -8 9 -8 -6 4 -4 -2 -2 5 1 -9 -6 1 -1 0 2 -2 6 2 8 -7 5 4 6 2 9
6254InmPj5J3nmJJ2plMl%Jj7J4Rj0%JNoM%J5qljnnOnJJ8k0J6oOjj5RnNoQmJ0j1
$$ 9 4 0 7 -8 5 0 -4 -3 9 2 -1 3 0 0 1 -16 -2 7 -3 -3 -2 3 -3 1 1 16 8 5 4 -1 -6 0 -5 -4 14 -6 10 4 10 9 -6 3 -2 3 -3 5 1 11 0
6303@qOLll%%LpPkmJ2pKL%lqOpJ0lroRJ2lJn%%mOKNkmpM%J1%j1NnLnKKmOj2Oj
$$ 0 -8 -2 1 -2 -5 -5 -5 -2 -9 -2 -4 -8 4 -3 -1 2 2 -1 -9 -3 -10 0 -3 -12 -18 -9 3 0 1 -4 -4 -4 -8 -2 0 5 3 -1 -8 -4 -4 7 7 -4 1 -4 -1 -6 -4 -2 -6 0 -12 -6 -7
6358gj0J0Oj0J0KmRpLMopLqoJ5nMJ2qlJ0k1PNjOoKN%nKjj1QpKKNlknj%%OR%j0
$$ -7 -17 -7 -1 -11 -1 1 -3 6 -1 2 6 0 -7 -4 -12 -18 -3 -8 -4 8 0 -3 7 -14 -7 -2 -3 3 -3 -1 4 4 -1 1 0 -11 -3 -10 -8 -6 -1 -4 -6 -11 -12 -12 -12 -6 3 3 -7
6409gM%jJK%kjMLjJKpmLPllJJmjMmPMmjj0m%J7Mj2JKn%QQmKJj5OpJ1pnMqKJ2%
$$ -7 -3 -3 -4 -3 -1 -1 -3 -4 0 3 2 3 5 -2 -6 -3 4 1 -2 -1 0 -4 -5 -1 -5 2 6 2 1 -9 -13 -13 4 8 -4 -3 -1 -6 -6 2 10 6 8 9 -6 0 -7 4 -3 -8 -4 -12 -10 2 2
6464BmQj2J1rJ2qJ0j7MQkj1RLpoRnJ0lmkqOqJ7qJ1j7J7plQjpklPJPrPkLLj2Qr
$$ 2 -2 6 -6 5 -4 8 0 10 -7 -3 5 3 -8 1 4 -3 -9 0 -5 5 2 -2 -4 -12 -6 -14 3 -5 6 -11 6 -1 -4 4 3 -4 -6 -9 -2 -1 6 -3 4 2 5 8 -4 4 -5
6513eJ1%j3PlLkOkrJ5mrLkJNnkK%J1mJ3j4j%OllMOj2PkjJmjQqJ%qJ1konjJ5Jm
$$ -5 6 6 -7 0 -3 0 -2 4 2 -7 8 4 -5 -2 -4 -3 2 -3 -5 -3 -3 8 4 17 3 2 2 8 5 2 6 12 0 7 5 4 5 1 0 8 0 1 1 -7 4 2 -4 -9 -10 5 6 2
6565BLnJ%%oO%jmmJ1mRj4J3j4J6j3NkRj0J0KokJoKkOjJJ1roLmmM%jKNqJ2nlJq
$$ 2 5 0 1 1 1 -5 1 1 0 -4 -8 3 -1 8 -6 7 -7 9 -4 1 -1 8 -2 8 10 4 2 3 -3 -1 -3 3 2 3 14 5 -1 2 -2 -6 -2 -2 -3 -1 4 -4 8 3 0 1 -7
6616gJ1rJ1Kj0O%p%J1j1lJ4pJonMJ0MrNmLnjJ8j1oJ1qoMkOj1J3j0%%pJ9pLj2Q
$$ -7 4 -5 6 8 -2 4 4 -3 -3 8 -3 -6 8 1 2 -4 -9 -5 5 9 0 5 1 4 -1 -2 16 5 -1 10 2 -4 0 -2 4 -7 6 -4 -4 -4 -11 8 1 4 -8 0
6662@OpMj3PKjK%OoJ2roJMmjMJkJjjkmLQj1%jJ7j7LnONklN%kJLmOj0J1j2POLj0
$$ 0 6 -1 3 -10 -3 -1 -2 0 0 6 0 12 3 -3 -2 2 -2 -3 1 2 0 1 0 -1 -3 -7 -4 4 -7 -7 -8 9 -8 -5 -10 -4 1 -1 -4 1 1 -1 0 3 -1 5 -5 6 -6 1 7 10 0
6715@lNj1J4rJ2mJmNLLj1jj1PLpKJ4lmj0PJ2rJ%rJ3j6J0%pJ5rk%%Qj1OQj7OKj
$$ 0 -3 2 -9 5 -4 8 4 5 1 6 9 12 1 0 -11 -4 -1 -8 -6 8 5 1 -9 -2 10 1 2 2 -7 6 -10 0 0 -7 8 -1 -3 -3 -3 5 -6 0 8 -9 -3 -1 -2
6762blmJ5pjOloJ5j1LpMPlKjLj7J0nJ6j5jJ2j1LQj1JKJ1koOlmOj0Rj5J1j2J3r
$$ -2 -5 -9 6 -1 -2 4 1 -5 10 -1 2 -5 -1 6 3 5 4 7 -10 0 -5 11 -4 -5 7 -4 -1 7 -4 -3 -1 10 8 2 8 5 1 7 -3 6 -9 2 -10 3 -6
6807fmQrJKNJjMrJlQm%LKj0NKkJnJ0oLRrpOLLLj1J2rOmkpJNJljPoJjRj3QnljJ2
$$ -6 -10 -2 -11 -10 -8 -3 -2 -3 1 -8 -7 -10 -2 -6 -6 -3 -1 -11 -6 -4 -6 -5 -10 0 -6 -3 6 -3 -10 -4 -1 2 5 -6 6 -3 3 -1 -3 -10 -9 -4 -3 -6 -7 0 -6 -5 -6 3 -10 -2 -7 -10 -11 1
6863Aj1KJ1JrLOKj3PN%Jq%%KjJqJ5nLMrjJjoON%jj6J5oJ2j1jjOLrJ4j3jKJ6rK
$$ 1 -10 -8 3 4 -5 -2 4 6 -7 0 5 5 6 -2 -2 -2 0 -1 0 -8 7 2 5 9 0 -1 0 -1 -7 -1 4 4 3 -13 2 -4 8 -3 -4 -5 1 4 -5 9 -4 -5 -3 13 4 6
6913FoKjJRrj0Nn%POnMlJlJ2j7J0JpkJ%JJPqPj5QklJ0j4J1ONj9J0PJj6JJ3qKR
$$ 6 0 2 1 2 11 2 -8 -3 -8 -8 -1 5 0 4 1 2 -1 11 -6 4 5 -2 -4 -3 -3 -2 -1 6 -2 5 -10 -2 -4 -7 3 -11 0 6 11 -8 2 9 10 -6 -5 8 0 2 11
6962A1j2Rj1JKOllJ3lqjJm%%Nj2J3nkj2ONmJ3pKNn%n%%J5Jj3kRkPpjQpmkLjkP
$$ 11 -1 8 -3 -2 0 6 3 0 13 10 2 1 2 -2 -2 -2 3 -9 4 -1 -3 -15 -9 -4 -8 5 -2 0 5 0 0 -5 -5 -5 10 11 -2 -4 5 3 10 3 2 10 3 -1 -3 0 -1 -3 4
7013Dj6O%lJ1jj2RjQjloLkJ0Mnqj2J6JoQnpR%qMJ1%nKpJ5poJJJ3popJ6j5Nq%O
$$ 4 -12 -6 -6 -9 2 1 -11 -2 -3 5 4 1 -5 -2 -4 6 10 5 -3 -15 1 2 -4 4 -1 -8 1 1 -7 -3 8 8 3 5 -2 13 6 0 1 2 15 8 2 -5 11 -4 1 -7 -7 -1
7063ak0J2PMmnJmkK2qj5J3j%NoKkJ5lj1%NkPJnLJplJJjQj1Qj7J0ljMLrPkJ0j5
$$ -1 -21 -9 -2 2 -2 -7 -6 -10 -12 10 2 -13 0 -1 -1 4 -2 0 -2 13 10 -1 -1 4 2 9 10 5 8 9 2 -1 0 1 0 8 -3 5 -12 -2 -5 -6 -2 1 -8 -1 -3 7 -8
7112hnQQOmPplNj1ORj1LNoKmPm%Pnj2Rj1J4jNplKLrLJ%kMlk%NjkoLLkKnRjK%j
$$ -8 -13 -5 3 9 5 12 5 2 7 -4 2 11 0 3 8 2 4 0 7 3 3 10 5 -7 2 -9 5 4 9 2 -1 1 4 -5 -2 -1 -1 -3 1 -2 -4 -4 1 0 -2 -8 -5 -2 -4 -2 -7 2 1 3 3 2
7168BPj3OJmJ1qmNnLRq%lnPj3%KRkNMnJj2OmJ1lmlkQmJ1j0KLmKJmQKj2K3j3j%
$$ 2 9 -4 2 3 -1 10 2 -2 3 -2 1 10 2 2 -1 -6 1 -12 -12 -10 -1 -3 2 6 1 2 -10 -4 -8 3 0 -4 -7 -9 -1 -5 6 -4 -2 1 -3 -1 0 -4 4 6 -6 17 4 3 3
7219CPrJ0%j4jM%JKrQnLlOJmpJQQpj0J6jqPpOkJmRNmoKkjJ1m%koPj4MNqJPnRl
$$ 3 10 1 11 11 -3 -4 0 0 1 3 -6 2 -3 0 -3 3 4 0 -7 -6 2 10 3 -7 9 8 0 7 0 6 4 5 1 10 15 11 5 7 5 4 15 11 11 9 3 10 -4 0 5 -3 -2 5 0 9 6
7274FnJJlKJ1j3kOjRmllK%LQj2lQrOmPKoLjOj8KNLrQkknJ1PmKmrQlQMq%KpJPn
$$ 6 1 2 3 0 2 13 0 -2 4 3 12 8 5 2 4 4 7 15 3 0 8 -1 5 1 8 10 4 7 6 12 -6 -4 1 4 -5 3 1 -1 -6 5 12 8 10 6 -3 5 2 10 14 6 6 8 1 2 9 4
7330DrJK2j7LJkoNlQjoJRqKqP%OJppJ%jPpmNOMonQqmPmJ0mKl%jrJ2kk%PKPj5M
$$ 4 -5 -4 18 1 4 5 3 -3 2 -1 7 6 0 1 10 2 4 -4 3 3 9 10 3 -4 -3 -3 -4 3 -4 -8 -3 3 7 1 -4 4 -4 -8 -1 -5 5 1 3 0 0 -1 -10 2 0 -2 -2 5 7 14 -1 3
7386CPj1OPonJMj0j1J3nJ0mkMoLOLj7J5j1J2oOlkn%LlLOKJJj1NNk%kQJrlol%j
$$ 3 10 -1 5 12 6 1 2 6 -4 -15 -2 -7 3 -1 -3 1 -5 -2 4 7 -10 5 -6 6 0 6 3 1 -4 -4 -1 -4 -1 5 7 8 9 -2 3 8 6 6 4 12 13 4 1 -5 -8 -8 -9
7437iQJ1k3J9l%k%mLlMlK0j7RpkMj0J1jj0lQNJNqmRlkpMKrQL%lRkrqJ0jKpNK%
$$ -9 -1 10 -13 6 3 3 1 1 -3 0 -3 1 -2 18 1 10 3 1 5 -5 6 5 -5 -8 0 5 6 11 3 -1 8 5 3 -4 0 2 -7 1 4 4 1 10 8 -1 -9 1 0 2 -5 0 2 2
7489B%NrjRqJ0ok%LPj3LkLjkPnjJJ2mqQNj6lRjj2J6j4MQrPKklJnLkNNMj3J3jn
$$ 2 2 7 -2 -3 6 -2 8 2 0 0 3 10 -3 0 -2 1 0 -2 5 0 -1 0 12 8 0 8 13 -3 -6 3 2 -10 6 -8 -4 4 -5 2 4 2 -1 0 -5 -2 -4 1 6 10 -3 10 9 4
7541DrqK0mn%pMJ3klKmjQMj0Rj0mPjpR%j0LkNqrMJ7j0J5nLj3QnJoJ2nM%JL%lk
$$ 4 -5 -13 7 3 -2 -2 -9 -5 8 6 3 5 1 0 8 12 2 11 1 -3 4 3 -4 5 5 -5 -2 -4 1 -7 -16 -12 5 -5 10 5 8 -5 3 -2 -1 -7 5 0 4 4 5 8 8 5 3
7592ClNrJ3rOj1lJ5jpmJ1PKqjLj7J5qjklJ2mjkJ7nKlmJ1j2%JJmKJ3pKmr%kQKm
$$ 3 0 5 -4 9 0 6 -5 -8 7 6 -1 -5 6 13 15 7 6 9 -8 7 -1 -2 -4 -7 5 1 0 -2 15 10 12 9 5 16 4 4 5 6 2 4 17 10 12 8 -1 -1 -3 5 7 3
7642Ck%JpJ0Rj5LOmj5J6rOMnJMmPjmQpmJjQqMmjMNmlRJolOokJ0k4J9j1nJ1kkj
$$ 3 1 1 2 -5 5 14 -1 2 8 4 -11 5 -4 2 6 1 2 6 2 9 8 4 12 5 1 2 1 9 1 5 1 0 4 9 5 2 11 12 6 3 9 3 1 11 -13 6 -5 -10 1 -1 -3 -4
7694dJjK%nJ1joOrJ1lPplJ0qO%kljkPNnJ1j2Rkj0J0rMpKrJ4mmOJJMoJPj4%Oml
$$ -4 -3 -4 -2 -2 -7 4 3 -3 3 -6 5 2 9 2 -1 9 1 7 7 5 2 1 -1 6 11 6 17 5 14 12 2 12 3 7 0 2 -7 7 3 -1 5 6 7 11 5 6 13 -1 -1 5 1 -2
7746bLkQj1J5j0OMrJQ%jnrlK3k1%lJ1LjLJj0NRj3mjkJ7qPk0J7qN%Jj0PjnJ9nq
$$ -2 1 -1 7 -4 11 1 7 11 2 3 11 11 10 5 -4 -7 16 -5 -5 -8 3 6 5 8 9 -1 4 13 0 -4 -5 -7 10 2 9 -11 6 -2 3 3 4 -6 1 0 -5 14 9 1
7794AKNOJj1j0J3oOoOj4JJ7j5MmKKknJpONoPnOQqNmNNJj7J3oNqLOnlLmJpROqj
$$ 1 3 8 14 15 4 -6 7 1 7 1 7 -7 -6 11 -4 0 -4 -2 0 -2 -7 -6 -13 -7 -2 -8 -1 -6 0 8 0 5 1 6 11 12 -5 8 2 7 -1 2 8 3 0 3 -1 0 -7 2 8 0 -1
7847akNJoOpJ%kJ8nj4pJ1KnPrQKMnqLJ2j3oJ3NJ%j4NjONqOrPj8K2j5QjpmRPnk
$$ -1 -3 2 3 -3 3 -4 -3 -3 -5 13 8 -6 -13 -2 0 -5 2 -7 1 3 7 2 -6 -3 9 -4 -10 3 8 9 9 -5 0 -1 5 10 2 8 -1 6 -12 10 -5 3 2 -5 -9 0 7 2 0
7898@rOlNrNLKj6J5kNKjNmMpNpQjQrKpOljKK%rPm%kJ9k1J1j1J0j2RKNqJMj1LL
$$ 0 -9 -3 -6 -1 -10 -5 -2 0 -16 -1 -3 2 4 3 8 4 8 1 6 -1 7 6 14 5 7 0 6 3 2 4 6 6 -3 4 0 0 -2 17 -4 7 -4 6 -6 3 5 10 2 3 7 -4 -1 2
7950BPj3JL%KJKPj8POOj0OjpKknRrOMJmnlNMlkOqjKJnRKjlnQjqQKmLJ4j3Pk1J5
$$ 2 9 -4 -3 0 0 2 3 5 12 -6 1 7 13 3 9 8 1 3 1 -4 5 -4 2 6 7 3 -2 -5 0 4 1 -1 5 -3 -4 -2 -1 -6 3 5 4 1 -4 4 3 -5 3 5 1 4 18 5 12 -9 6
8005Fj6J1lOM%j1J2lkMJqPrlpQOOk0NJ0lqQKnJJ0lj2QPkJrQ%LmmKL%oJ0j2KRl
$$ 6 -10 1 -2 4 8 8 -3 9 6 4 8 9 1 8 -1 -4 -11 -3 3 9 -11 -6 4 1 -7 1 3 -2 -1 9 6 -6 2 9 7 8 -1 7 7 10 6 2 4 7 7 1 11 -1 1 10 7
8056GlRrLjrOoJ1Lj1LolLmRNj0J3j6NpJ4oNlJOj6J4j5J1J0noJ0j4QJ5qrrJ1jL
$$ 7 4 13 4 7 6 -3 3 -3 8 11 0 3 -3 -6 -3 -7 2 7 -3 10 -6 -1 -8 6 0 5 2 3 9 -7 7 -8 3 13 8 2 12 -2 6 21 13 4 -5 6 5 8
8102HjpPlpmnJ0pJ3JJ0j2lkmJ0KpLKklJKlkJPmjPjknRLm%qQ%lj3NOlJnPmj0RK
$$ 8 7 0 7 4 -3 -7 -12 -2 -9 4 5 15 3 0 -2 -6 4 6 -1 2 4 2 -1 0 2 -1 -3 -2 5 1 0 7 6 4 -1 8 11 7 7 -1 7 7 4 -9 -4 2 -1 0 -5 2 -2 -12 -3 -1
8156aNlJ2j7PllJ3j0OplJOmQpPpnjkR%J1pKj4J1oMkLkm
$$ -1 4 1 13 -4 3 0 -3 10 0 6 -1 -4 -3 3 -1 7 0 7 0 -5 -6 -8 1 1 12 5 7 -7 4 -2 2 0 3 1 -3
8191c
$$ Imaginary data points
##PAGE= N=2
##DATA TABLE= (X++(I..I)), XYDATA
0@%%%%%%%%%%Qj6J6j6J6k4L2m0M8n6P2q8J04j20J44j68J92k24K62l02L44l92M47
$$ 0 0 0 0 0 0 0 0 0 0 0 8 -8 8 -8 8 -16 16 -24 24 -32 40 -48 56 -64 80 -88 104 -120 142 -160 184 -208 239
33B39n10N75o46P26q16R13j017J134j263J403j554J718j900K100k317K551k808
$$ 239 -271 304 -342 384 -432 481 -536 598 -665 738 -816 902 -998 1102 -1215 1336 -1472
50a472L096l413L761m146M579n066N615o243O968p818Q829j0056J1582j3540J6157
$$ -1472 1624 -1789 1972 -2174 2405 -2661 2954 -3289 3679 -4139 4690 -5366 6216 -7324 8833
65H833j9849K5492l5272N6855j86271J19136L60718l13402j75801J77148L5316
$$ 8833 -11016 14476 -20796 36059 -150212 -31076 329642 16240 -159561 17587 52903
76E2903k13683J62468K58290k19187l29106K22825K79950j80425j71038K14581
$$ 52903 -160780 1688 259978 40791 -288315 -65490 214460 34035 -137003 77578
86G7578K8301k87263L4714L67259l6684l53686J1240K57040n2730j19322J62678
$$ 77578 105879 -181384 -146670 220589 183905 -169781 -158541 98499 45769 -73553 89125
97H9125L8345k99954l4537L70290P6677l42800p9727K44383O812j57039J20585
$$ 89125 127470 -172484 -207021 163269 239946 -102854 -182581 61802 68614 -88425 32160
108C2160J27932k26616j47553K60704J52925k27971r7573J86897j1912j87346
$$ 32160 160092 -66524 -214077 46627 199552 -28419 -125992 60905 48993 -138353
118a38353J16915K29193j62945k60488J44305K28514j09269j27007J14157M813
$$ -138353 -21438 207755 44810 -215678 -71373 157141 47872 -79135 35022 39835
128C9835j73633P5549K47323q8730k75990O4819K32239n9077j42544J01987O2395
$$ 39835 -133798 -58249 189074 100344 -175646 -110827 121412 62335 -80209 21778 84173
139H4173j73870k8172K24679K8698k19323k0455J67997k9618j15068J12394R8289
$$ 84173 -89697 -117869 106810 135508 -83815 -104270 63727 34109 -80959 31435 129724
150A29724j83936j15215K03903J26971j70889r4058J22537J2682j02212Q0800
$$ 129724 -54212 -169427 34476 161447 -9442 -103500 19037 31719 -70493 10307
160A0307J21868j40367j53265J47820J54636j25113j07724J11890L2935j29475
$$ 10307 132175 -8192 -161457 -13637 140999 15886 -91838 20052 52987 -76488
170g6488K9699J63082n5245j77115N3474J48720n7076q8608Q9707L1734j43322
$$ -76488 -46789 116293 61048 -116067 -62593 86127 29051 -59557 30150 61884 -81438
181h1438o831J84701J1992j84442j7945J42442m826q7812N9474N3856j19980n0373
$$ -81438 -88269 96432 108424 -76018 -93963 48479 43653 -44159 15315 69171 -50809 -101182
193a01182J53314N7872j47189m7040J18509N877r6609M9919R6699r1209j07425
$$ -101182 52132 110004 -37185 -84225 34284 40161 -56448 -6529 90170 -1039 -108464
204a08464J01028J02889q8557o7368P9479J0548r1996M0129J20163o2645j39092
$$ -108464 -7436 95453 6896 -60472 19007 29555 -62441 -22312 97851 35206 -103886
215a03886N8400J26968m9535q4125N8511L2704q8294K205J20244j2995j30922
$$ -103886 -45486 81482 31947 -52178 6333 39037 -49257 -47052 73192 60197 -70725
226g0725J3721J12493k5357p8742N5919N1970r2964m3260J14761M3675j09688
$$ -70725 -57004 55489 30132 -48610 7309 59279 -33685 -76945 37816 81491 -28197
237b8197l3628Q6222J753o5202M3895O1432q2090p0915R5951P5286q6731n8428
$$ -28197 -61825 24397 26150 -39052 4843 66275 -15815 -86730 9221 84507 -2224 -60652
249f0652P1531K0867o7720K0660P8036m7629q9062N4738Q4247n2921n8984N8041
$$ -60652 10879 31746 -35974 -15314 62722 15093 -73969 -19231 65016 12095 -46889 11152
261A1152K4708p5729J251R6179j0761j02938J1125Q7856j7730n8398L9339L1506
$$ 11152 35860 -39869 -38618 57561 46800 -56138 -45013 42843 25113 -33285 6054 37560
273C7560o9961j9025R3326J8535r6833j6456Q1787R04o1533K7475M9486n6071
$$ 37560 -32401 -51426 41900 60435 -36398 -52854 28933 29837 -31696 -4221 45265 -10806
285a0806m7888P1373M6888p0127l4695O1524Q783n8012K1262O3930m1930p1628
$$ -10806 -58694 12679 59567 -10560 -45255 16269 25052 -32960 -11698 52232 10302 -61326
297f1326M7188O8687m3240m9325M2394J9930n1909O149O7485j9567p7149K2101
$$ -61326 -14138 54549 11309 -38016 4378 24308 -27601 -21452 46033 26466 -50683 -28582
309b8582P1808k3956n3040L3939L1374n1485j6935O7086J1233p1004o735O1781
$$ -28582 43226 19270 -33770 169 31543 -19942 -36877 30209 41442 -29562 -36297 25484
321B5484n372m7165K6368L7270m8547l5432O1424L5801o0675k8981N1524J0814
$$ 25484 20112 -27053 -685 36585 -11962 -47394 14030 49831 -10844 -39825 11699 22513
333B2513m3860J3607M3577l4017m7738M3378M7705m3212l7208M1407J8016m4623
$$ 22513 -21347 -7740 35837 1820 -45918 -2540 45165 1953 -35255 6152 24168 -20455
345b0455J607N2325j4042n7460J8491N3102k1018l8849K8382K1366m1568q735
$$ -20455 -18848 33477 19435 -38025 -19534 33568 12550 -26299 2083 23449 -18119 -26854
357b6854N4585L625n9442j698N3255m321m0324J7571K8531l4187k2614M6567K0514
$$ -26854 27731 31356 -28086 -29784 23471 19150 -21174 -3603 24928 -9259 -31873 14694 35208
370C5208m9653j6007M4989M740l8822J1559L6386k6485l7175L4293L5917l4742
$$ 35208 -14445 -30452 14537 19277 -19545 -7986 28400 1915 -35260 -967 34950 208
382B08k7605L2865J2336l4133M343L9530j6075m4524K0607M3288k1412l3781K4051
$$ 208 -27397 5468 17804 -16329 -11986 27544 11469 -33055 -12448 30840 9428 -24353 -302
395c02J9613l1065o994L9690m34m4310M114M1529q752l2950J7521K3708k8907
$$ -302 19311 -11754 -18748 20942 20508 -23802 -19688 21841 13089 -19861 -2340 21368 -7539
408g539j7950L7939J5304m0365j1679L6356L293l0179R575K6440k2574k6057L0701
$$ -7539 -25489 12450 27754 -12611 -24290 12066 15359 -14820 -5245 21195 -1379 -27436 3265
421C265K5754l2330k1193L0251J1073k8943J680L0436j2247l2738J7921L1737
$$ 3265 29019 -3311 -24504 5747 16820 -12123 -10443 19993 7746 -24992 -7071 24666
433B4666j9978k5190K2130J4768k6846m712L2903j696l6472M813L4412p823k7203
$$ 24666 4688 -20502 1628 16396 -10450 -15162 17741 16045 -20427 -15614 18798 10975 -16228
446a6228J3749J8445k2384j1961L0399Q584l3981n896L2080P35k7109P812K2641
$$ -16228 -2479 15966 -6418 -18379 12020 20604 -13377 -19273 12807 13542 -13567 -5755 16886
459A6886j7364k0363K4266J8757k6571j4839K5559P091k4312K889K4886j1641
$$ 16886 -478 -20841 3425 22182 -4389 -19228 6331 13422 -10890 -8001 16885 5244
471E244k6378J6604K5860j8119k1079J8823J2601k1174l434K5136l375k8239P122
$$ 5244 -21134 -4530 21330 3211 -17868 955 13556 -7618 -11052 14084 10709 -17530 -10408
484a0408K7684r597k2957J3283J6122j8812j0088K4352O187k7160l235K5927j002
$$ -10408 17276 7679 -15278 -1995 14127 -4685 -14773 9579 15766 -11394 -14629 11298 10296
497A0296k1936P605J7860j5264j5397K1232J3936k3536j1305K2564N832k0531
$$ 10296 -11640 -4035 13825 -1439 -16836 4396 18332 -5204 -16509 6055 11887 -8644
509h644J897J9545r554j9651J4725J9070j6889j5869J7561R830j8720k723K0888
$$ -8644 -6747 12798 3244 -16407 -1682 17388 499 -15370 2191 12021 -6699 -9422 11466
522A1466l123k2684O690K2060q905j8257J1604J2484j5661o973K0045L214k2706
$$ 11466 8343 -14341 -7651 14409 5504 -12753 -1149 11335 -4326 -11299 8746 11960 -10746
535a0746p40K2177k066j8942O470J4882j2026j1725J6944R570j9386p200J9168
$$ -10746 -11486 10691 8625 -10317 -3847 11035 -991 -12716 4228 13798 -5588 -12788 6380
548F380L205j7593K471J6289q331j5735J2550J4918j4459j2326J4845P490j5239
$$ 6380 9585 -8008 -5537 10752 2421 -13314 -764 14154 -305 -12631 2214 9704 -5535
561e535j531J6456l753j7752P179J7613r078j5020J0695J0521j3102n646J5953
$$ -5535 -7066 9390 5637 -12115 -4936 12677 3599 -11421 -726 9795 -3307 -8953 7000
574G000J809j7909Q52J7747l327j5380O596J2044j0681r100J4421O996j6438m952
$$ 7000 8809 -9100 -8248 9499 6172 -9208 -2612 9432 -1249 -10349 4072 11068 -5370 -10322
588a0322J6215J915j4578K449J2865p269j1776J1084J0874j3027r034J3388N595
$$ -10322 5893 7808 -6770 -4321 8544 1275 -10501 583 11457 -1570 -10604 2784 8379
601H379j3242j061J3452l335j3855O487J3493q335j1477R646P938j1277l916J3257
$$ 8379 -4863 -5924 7528 4193 -9662 -3175 10318 1983 -9494 152 8090 -3187 -7103 6154
615F154N63j4740J811J4647l696j2733N969R736q913o790J1862M520j3722k631
$$ 6154 6717 -8023 -6212 8435 4739 -7994 -2025 7711 -1202 -7992 3870 8390 -5332 -7963
629g963J3876L34j2610K793J0905o381r496R461Q269j1178o559J1512L812j1240
$$ -7963 5913 6247 -6363 -3570 7335 954 -8542 919 9188 -1990 -8549 2963 6775 -4465
643d465j70J1076l486j1119O228J0739p774r218Q604O436r480l013J0642q1j1625
$$ -4465 -4635 6441 2955 -8164 -1936 8803 1029 -8189 415 6851 -2629 -5642 5000 4919 -6706
658f706K346J1655m021j0311N702P978p740n441R856L292j1266j538J1402l47
$$ -6706 -4360 7295 3274 -7037 -1335 6643 -1097 -6538 3318 6610 -4656 -6194 5208 4861
672D861j0377K815Q808n688p341Q241O160r812m772J0171K676r766J41R225l149
$$ 4861 -5516 -2701 6107 419 -6922 1319 7479 -2333 -7105 3066 5742 -4024 -3883 5342 2193
687B193q819N606Q248p096o999P844M847q396k099R006n01r514K466R413l893
$$ 2193 -6626 -1020 7228 132 -6867 977 5824 -2572 -4671 4335 3834 -5680 -3214 6199 2306
702B306q256N116O295o552m034Q090K054r215m93R406r58q620K714P220m790n750
$$ 2306 -5950 -834 5461 -1091 -5125 2965 5019 -4196 -4689 4717 3759 -4861 -2147 5073 283 -5467
718e467O766M477q108l180Q481J548q188O52P609l034p065N050O437o327n370
$$ -5467 1299 5776 -2332 -5512 2969 4517 -3671 -3019 4590 1556 -5509 -459 5978 -349 -5719
733e719O918L620p178j346P408r15p627K732P450l959o592M882N008n791l078
$$ -5719 1199 4819 -2359 -3705 3703 2788 -4839 -2107 5343 1384 -5208 -326 4682 -1109 -4187
748d187O734J298p448J49P559j397o892K722N688m224m391N710L201o720k111
$$ -4187 2547 3845 -3603 -3454 4105 2708 -4184 -1462 4226 2 -4389 1321 4522 -2198 -4309
763d309P019Q25o679P97O079k670n400M328M717n451l845N997K497o129p80O183
$$ -4309 2710 3535 -3144 -2347 3732 1062 -4338 -10 4707 -744 -4589 1408 3905 -2224 -3004 3179
779C179j081o116K635N825l731n057M473L775n115k159N760N61o196P25O200j742
$$ 3179 2098 -4018 -1383 4442 711 -4346 127 3902 -1213 -3372 2388 2949 -3247 -2522 3678 1936
795A936n650K725M600l799l346M850K184n620j154N839J32n562J100M932k462
$$ 1936 -3714 -989 3611 -188 -3534 1316 3500 -2120 -3274 2565 2697 -2865 -1765 3167 705
810G05m235L742L537m623k757N032J680n073l03M959j179m796K466M523l420l895
$$ 705 -3530 212 3749 -874 -3631 1401 3081 -1992 -2295 2664 1485 -3311 -845 3678 258 -3637
826c637M004K859m404j524M768J58n017J012M985j921m511K702L635l481k560
$$ -3637 367 3226 -1178 -2702 2066 2224 -2793 -1781 3204 1283 -3228 -526 3109 -372 -2932
841b932M231J489m766n64M894l14m592J270L998k319l295L313K599m010j896M318
$$ -2932 1299 2788 -1978 -2542 2352 2038 -2554 -1284 2714 395 -2900 413 3012 -998 -2894 1424
857A424J045m288jM073j154l785K198L453k988k910L462K083l734j020L936r5
$$ 1424 2469 -1819 -1820 2253 1099 -2686 -488 2965 -23 -2933 529 2612 -1122 -2142 1794 1699
873A699m043J053L989j846l571K462K838l029j901L550R61l956j20M074o37l818
$$ 1699 -2344 -1291 2698 852 -2719 -257 2581 -448 -2349 1201 2162 -1794 -1914 2160 1523 -2295
889b295J380L284k177k605K916J929l469j258L707N22l637L07L387j218l047K049
$$ -2295 -915 2369 192 -2413 503 2432 -1037 -2295 1412 1934 -1703 -1396 1991 773 -2274 -225
905b25K683k682k189L035J521l197o57L260k85l238J099L128j750k782K238K189
$$ -225 2458 -224 -2413 622 2143 -1054 -1711 1549 1264 -1974 -875 2253 503 -2279 -41 2148
921B148k641j414K990O01l238J30L296p72l085J363K627j978k022K548J404k975
$$ 2148 -493 -1907 1083 1684 -1554 -1424 1872 1100 -1985 -622 2005 27 -1995 553 1957 -1018
937a018q01L146K01l080M80K809j212k446J885K055k407j587K698J017k783l28
$$ -1018 -1819 1327 1528 -1552 -1072 1737 525 -1921 -36 2019 -388 -1975 723 1740 -1043 -1371
953a371K761m26k664J111K489j643k179K044J662k328r97K537L11k683L25K682
$$ -1371 1390 964 -1700 -589 1900 257 -1922 122 1784 -544 -1541 996 1307 -1376 -1051 1631
969A631q65k487J332K090j775j554K182R93k511m45K635q2k540O12K291j176j936
$$ 1631 766 -1721 -389 1701 -74 -1628 554 1547 -964 -1409 1226 1144 -1396 -784 1507 331 -1605
986a605J701J545k114j119K335O44k388o2K308n50k157J123J961j588j648J876
$$ -1605 96 1641 -473 -1592 743 1387 -1001 -1063 1245 695 -1462 -339 1622 34 -1614 262
1002B62J238k084o72K184Q4k228M66K175r25j983J312J620j634j161J929O54k131
$$ 262 1500 -584 -1256 928 1012 -1216 -750 1425 500 -1483 -171 1449 -185 -1346 583 1237 -894
1019h94j89K202k66k100O96J854j120j537J542J153j856p48K008L64k049J17J920
$$ -894 -1083 1119 853 -1247 -551 1303 183 -1354 188 1341 -515 -1263 745 1109 -940 -823 1097
1036A097n95j762J077J524j424j247J670Q90j825m18J867p1j874N51J775r35j587
$$ 1097 502 -1260 -183 1341 -83 -1330 340 1230 -595 -1013 854 783 -1091 -540 1235 300 -1287
1053a287J253J275j495q62J681M18j823J6J845l95j757P58J526j091j218J401
$$ -1287 -34 1241 -254 -1116 565 983 -840 -824 1021 626 -1131 -373 1153 62 -1156 245
1069B45Q69j644m95J751J29j737K50J620o29j444J020J212j317r38J503O13j581
$$ 245 1114 -530 -1025 726 855 -882 -632 988 359 -1085 -65 1147 -170 -1108 395 1008 -573
1086e73k48J600j88j542N82J428r01j240J143R74j336o23J464K42j544J28J543
$$ -573 -821 779 591 -951 -369 1059 158 -1082 61 1035 -301 -924 540 782 -762 -634 909
1103I09m64j437P51J230j027r39J264O32j440l03J524k9j479L41J365o69j171
$$ 909 445 -992 -241 989 -38 -977 287 919 -521 -824 700 671 -808 -467 898 229 -942
1120i42R58R45j196o87J348L97j411n2J367k72j302O09J175q79r93J085P33j210
$$ -942 16 961 -235 -922 426 823 -588 -640 727 455 -847 -238 937 58 -935 150 883 -327
1138c27m34J289R8j314K31J269n00j180P52R75r56p20J118M40j241j47J292j41
$$ -327 -761 528 626 -688 -457 812 312 -868 -116 859 -97 -817 301 741 -500 -647 645 504
1156E04j252M09J141o72r54R28P21j113m78J216K32j250O1J196l59j080O33R39
$$ 504 -748 -339 802 130 -824 104 825 -288 -766 450 682 -568 -507 689 330 -750 -117 822
1174H22q65p55J023N22j113k58J147k6j137K94J081n47r54P35P76q97n46J018
$$ 822 -43 -798 225 747 -366 -624 523 497 -640 -346 735 188 -766 -31 745 -152 -698 320
1192C20K86j097j6J113k30j057M58R31o59p56Q42N37r79l16J062J01j081J64J005
$$ 320 606 -491 -507 606 376 -681 -223 708 49 -707 135 672 -307 -623 439 540 -541 -377 628
1211F28l96r06O45P37q19n78R51L73j025j18J017j45r73L77R06n93p60P39O01
$$ 628 232 -674 -29 708 -111 -689 262 635 -390 -508 509 364 -609 -232 674 81 -679 60 661
1230F61q64l85R29J50r61P8R52k93q93M91P58o39n96P86L88q71j97R43k1r26K30
$$ 661 -203 -588 341 491 -470 -392 560 267 -626 -135 623 -16 -612 174 562 -309 -506 437 416 -510 -280
1251b80Q44m10p42N84O12p54m16Q50K29q92m7Q91j78q35L81P41n63o15P01M52
$$ -280 564 154 -588 -4 608 -146 -562 288 517 -375 -422 469 291 -544 -163 578 15 -600 101 553
1271E53p86k68Q42N8q49J45Q05l28p24M93O11o18m73P39K77p88r5Q15q6p89K53
$$ 553 -233 -501 341 399 -450 -305 500 172 -552 -59 552 -66 -539 200 477 -311 -406 409 323 -466 -213
1292b13P24m21o04N54M71o73l04P48J39p81M3P43k07p05L90O02n25m91O40L28
$$ -213 511 90 -514 40 511 -162 -466 282 421 -360 -317 426 219 -486 -96 506 -19 -510 130 458
1312D58o95j75P32lp31J84O82l26o17M62N09n84l57O63J87p04j5P11j27o89K87
$$ 458 -237 -412 320 317 -414 -230 452 126 -491 -29 480 -104 -461 202 389 -315 -330 381 254 -435 -148
1333a48O12m30m94N35L61o20k16O78O0o80Q5O55k42n79L66M94m99l72N87K37o25
$$ -148 464 34 -460 75 436 -184 -400 278 338 -342 -257 398 156 -423 -57 437 -62 -434 153 390 -235
1354b35j07O37m6o23K01N78l42m93M37L91n19k64N73J35o15L1O16j72n76K95N05
$$ -235 -342 295 249 -374 -173 405 63 -430 7 398 -121 -385 188 323 -292 -261 355 183 -393 -98 407
1375D07m11l99N02K70n56j37N90J7o10J29N68k62m98L87L84m62k88N38J54n54
$$ 407 -4 -403 99 369 -187 -324 266 283 -327 -198 370 108 -390 -3 381 -81 -369 169 323 -231
1395b31m3N57r5n29K25M83l34m00M14L11m83k05N25O9n34O0N30j89m76K91M16
$$ -231 -274 283 188 -341 -116 367 33 -367 47 358 -125 -330 195 264 -270 -210 320 131 -345 -54 362
1416C62l85l06M44K06n08p6N23l3n22J55M73k57m11L53L16m27k19M78J23n14P
$$ 362 -23 -329 115 321 -187 -263 260 227 -295 -140 333 76 -335 18 334 -93 -312 166 289 -225 -218
1437b18M86j12m64K28M07l26l23L86K46m44j32M66L7m83R4M43k00m03K89L37l59
$$ -218 268 156 -308 -80 327 1 -322 64 310 -134 -266 200 237 -246 -152 291 91 -312 -23 314 -45
1458d5k38M13J51m52l9M56o2m57J65L98k43l43L34K51l98j41M13P7m47L0M24j40
$$ -45 -283 130 281 -171 -210 246 184 -273 -108 290 47 -296 38 289 -109 -250 163 240 -207 -177 247 107
1480A07l75K10L29k88k57L53J81m04r4M25nm14J13L74j89l31K66K62l17j96L83
$$ 107 -268 -58 271 -17 -274 79 260 -144 -238 187 182 -232 -119 255 66 -265 1 263 -54 -250 133
1501A33R6l95rL90p2l79J66L26k25k84L06J92l30j37L75K6l60M1L57j31l29K07
$$ 133 229 -166 -175 215 143 -236 -70 256 31 -253 53 245 -85 -222 153 179 -181 -140 217 86 -243 -36
1523c6K76k78j96L21J27l46n1L49k7l44J18L16j92k58K33K22k87j52L28O9l45
$$ -36 240 -38 -234 87 214 -132 -183 166 139 -205 -87 229 37 -221 12 234 -53 -205 123 192 -153
1544a53J6L28r0l05J60K82k38k18K81J45l07q1L11K2l25N3L11j29k67J95K14k45
$$ -153 -137 191 101 -204 -44 238 0 -218 63 208 -99 -180 131 153 -172 -119 192 63 -204 -9 205 -40
1566d0j71L04Q3k98l4L08m6l00J24K76j87k13K27J70k61j24K85N1k89K6K93j04
$$ -40 -211 93 176 -122 -156 152 106 -194 -70 206 19 -194 33 203 -58 -182 103 154 -135 -109 184 80
1588H0k49J48K18k10j69K47J15k82m1K81j3k94R2K49j36k26J86J89k33j13K40
$$ 80 -169 -21 197 -13 -182 65 180 -102 -143 138 125 -169 -77 172 36 -190 -4 185 -48 -161 79
1609G9O8k71nK68m7k67J26K27j66j78K12J21k40p3K59J5k50L9K48j06k11J45J76
$$ 79 147 -124 -129 139 92 -175 -49 178 12 -166 46 167 -73 -146 113 128 -122 -83 165 59 -152 -7 169
1632A69j92j34K34Q4k49l1K50l5k40R3K14j39j88J83J40k20q0K33K9k43K3K28
$$ 169 -23 -157 77 161 -88 -119 131 96 -144 -51 163 24 -164 19 159 -61 -141 92 121 -122 -99 129
1654A29o9k10J13J96j50j60K05R4k22m0K26lk28N7K10j11j80J47J53j92j08K08
$$ 129 60 -150 -37 159 9 -151 54 148 -74 -114 112 109 -119 -62 148 37 -143 4 157 -35 -143 65
1676F5O7k24jK22n2j95Q5J71j32j41J62J01j77o6K08Kk09M2J98p8j90J30J38j45
$$ 65 132 -92 -93 129 77 -118 -33 138 6 -135 27 128 -49 -115 93 95 -114 -72 126 48 -142 -12 126 -19
1700a9j15J90O1j83l1K03j5j92N9J91j19j57J48J21j68r4J95L2j84MJ97o9j82
$$ -19 -134 56 117 -66 -97 106 91 -101 -42 149 30 -127 21 142 -26 -120 75 107 -77 -73 124 55 -127
1723a27J10J54j42j22J76N7j79l1J87nj82M3J81r4j58J27J21j43r2J71M3j76n
$$ -127 -17 137 -5 -127 49 106 -73 -104 83 78 -104 -61 120 26 -132 -5 116 -27 -119 52 95 -81 -86
1746h6J88l9j65P7J46j09j23J29R8j59n3J69J3j65K3J67p1j41R2J23j26r7J48
$$ -86 102 63 -102 -25 121 12 -111 18 116 -43 -96 73 86 -79 -56 111 40 -101 -9 114 -12 -109 39
1769C9N7j62j6J63j3j67O0J46r4j25J22J02j42o6J58K3j61K2J54n1j42P5J24j09
$$ 39 96 -66 -82 81 68 -99 -39 107 13 -112 10 112 -30 -96 62 85 -76 -54 100 49 -93 -18 106 -3
1793cr5J38O5j37n6J77qj63M0J44o1j28R2R4j21p1J40M2j48qJ44l2j40O2J37r5
$$ -3 -98 40 105 -32 -88 89 81 -82 -42 102 41 -87 5 99 -22 -93 47 89 -59 -67 77 45 -95 -33 104 9
1819Ir6J09P6j36l4J38nj34K6J35n1j26Q4R3r5q0J23N4j36qJ32j7j37N7J16p6
$$ 9 -87 22 98 -38 -72 66 61 -73 -47 88 37 -89 -5 88 -7 -87 36 90 -46 -54 78 61 -76 -19 97 21
1845B1j09J05P9j24o3J43K8j41OJ25l4j04M4J06q6r3J10O3j22j8J30Kj42L0J29
$$ 21 -88 17 96 -28 -91 52 80 -61 -55 70 36 -68 -24 82 -4 -97 13 76 -46 -64 66 68 -74 -44 85
1870H5n8j13Q9R2q8p7J14K8j12nJ17j9j08M4J07p9j03J05O6j09n4J30J1j27K2
$$ 85 27 -86 3 95 7 -70 44 72 -40 -45 72 53 -55 -11 96 17 -86 19 85 -24 -78 52 63 -64 -42
1895d2J09l2j11N7R6q4p1R6N2j18j5J19mj08K1J11o1q3P7O4q7m8J07J9j06OJ03
$$ -42 67 35 -76 -19 77 -7 -78 18 70 -48 -63 56 52 -56 -35 76 15 -68 9 73 -14 -62 45 64 -42 -36 67
1922F7l3r0N2P1n8o6P6N0r9l1R7K0j19K6J04m7r3Q1O2q2n6Q6M3j03OQ4or5M1Q2
$$ 67 34 -56 -4 67 9 -57 19 69 -30 -61 36 56 -63 -37 67 20 -73 8 70 -12 -68 18 61 -42 -36 48 42 -53 -12 70
1952G0o0o7O5O0p1m8R0K3j04QR6k9r0N6O9o3o1P4M9r8pQ2kr1K7R1p2o0O4O1q3
$$ 70 10 -57 8 68 -3 -51 39 62 -42 -34 62 33 -57 -1 68 5 -56 18 67 -31 -38 44 42 -49 -22 69 -3 -63 1 62 -21
1983b1k9Q2Rp5rQ3j3q9N5O7o0n0O5M6p5k8R2j5o4PP4l1o9O5M2o2l5O2L7q9nO8
$$ -21 -50 32 41 -34 -43 40 27 -62 -7 60 0 -50 15 61 -14 -42 50 35 -29 -22 52 21 -48 17 59 -3 -38 24 61 -28 -33 35
2015C5j2p6L7P2n1n3N3L7p2k5P3J6o8NO7k9q3O8N3m1n8O8L5p9j1P3qn5J5O8l8
$$ 35 23 -53 -16 56 5 -48 5 42 -30 -55 18 34 -34 -29 38 9 -74 -6 47 6 -52 16 51 -28 -39 34 26 -29 -14 54 16
2046A6o2M7N5p3k9P3J5p4LO7j7o5K8P0o0l5M0L8n4j9N6K5p9J3O6l6n0M6M3n4l7
$$ 16 -46 1 56 -17 -46 27 42 -32 -29 38 21 -44 -16 54 -6 -41 -1 37 -17 -36 20 45 -34 -21 45 9 -41 5 48 -6 -43
2077d3O4K6o2jN4%o6K4N8m8m8N0M0o0j8O7on5oO0j8m7K5M4m0l6M9K5n4j0N4om8
$$ -43 21 47 -15 -16 38 38 -28 -4 54 6 -42 8 48 -12 -30 37 31 -24 -30 30 12 -35 -10 34 -6 -42 7 32 -22 -32 22 16 -32
2110c2J5N4l3m3L6L6m4k6N5K1n8lN7j6m7K0M4k7l9L8L3m6k6N4J6o8NN4j1n5L1
$$ -32 -17 37 4 -39 -3 33 -11 -37 18 39 -19 -22 35 19 -28 -8 36 9 -30 8 41 -5 -31 23 39 -29 -24 30 19 -36 -5
2141eN1n4l0N4J0n0lM6ln4K6M7k6l9L5L2m0l2O0Rn4J8L8j5l8J9L4l4k4L4L4l7
$$ -5 46 -8 -38 16 26 -24 -27 19 16 -38 -12 35 9 -30 5 37 -3 -35 25 34 -20 -2 36 21 -17 2 36 2 -22 12 46 9
2173Ik2M4om4MN4k7l9L5K9m1k8M2J5m4j7O0qm3J4L3k3l0M4J8m0k0N1km2PN0j9
$$ 9 -13 31 25 -19 -15 39 12 -27 8 37 -4 -32 10 25 -19 -36 24 16 -27 -13 20 -3 -33 11 29 -11 -31 20 18 -24 -17 33 14
2206A4m0M1J5l7j1L7Pl5jL6qm9K0L5j5l7L2K5m4jL3Mm9QL5j2m2L8J8j3l8L9K2
$$ 14 -26 15 30 -7 -18 19 26 -9 -10 26 18 -31 -11 24 9 -28 4 29 -15 -16 17 21 -28 -20 15 3 -39 -1 17 4 -34 5 27
2239B7m5j4N1nl8K1L6j0m3K1K8l0l2M9J0k9j1M1j8k3PL2k0l6L9J1l6mL5Kl1qN0
$$ 27 -18 -32 19 14 -24 -3 33 23 -20 1 29 -1 -33 16 26 -3 -14 27 9 -14 -7 25 5 -31 8 19 -17 -21 14 16 -15 -23 27
2272B7k0l7L0L1l8j6K4K5l5rL2Kk9J6K8k7k2K0K1k2k0M0Qm2NL7pm2K7K4k3l0K5
$$ 27 7 -30 0 31 -7 -23 1 26 -9 -18 14 16 -13 3 31 4 -18 2 23 1 -19 21 29 -13 -8 29 22 -20 7 31 8 -22 3
2305CQk3qL8Jm1J1L3j4l4K4J7j3k4K6J9m7KL6ok4K5J8j9k7J9L3l7j1L1%k3J1J5
$$ 3 11 -12 -20 18 19 -22 -11 22 8 -26 -2 15 2 -22 4 23 -24 -22 14 8 -16 9 27 8 -19 0 33 -4 -15 16 16 -7 4 19
2339A9nk4J8J8k8j6K1J5k5j2L5Om6K8Rj5k2L1J8l5oK7Kl3J4J8jk5J5J7k1j8L2
$$ 19 14 -10 8 26 -2 -18 3 18 -7 -19 16 22 -24 4 13 -2 -24 7 25 -10 -16 11 13 -20 -6 12 11 -14 1 18 -3 -21 11
2372A1J1l1kL6j0l1QK7nk8J8J8k0j4K2Ok2jJ8ml7L2J5j5k3J5K3l3pL3Pk1pL1n
$$ 11 22 -9 -11 25 15 -16 -8 19 14 -14 4 22 2 -12 10 16 -6 -7 11 7 -30 2 17 2 -21 -6 17 -16 -23 10 17 -4 -11 20 15
2407A5l4K9J9k7rJ4J6k1j3L6j6k3PL4j7j8K1J4l5KJ7Qk8kK5ok1J0K1j5j5QJ6j7
$$ 15 -19 10 29 2 -7 7 23 2 -11 25 9 -14 -7 27 10 -8 13 27 -8 -6 11 19 -9 -11 14 8 -13 -3 18 3 -12 -4 12 -5
2441ej0K4J6l4LK8j3k1J6J8k4pK6lj7NK2lk1mL3j6k3K3Rk8NPJ4k2mJ8%k2J3K0
$$ -5 -15 9 25 -9 -6 22 9 -12 4 22 -2 -9 17 14 -3 2 24 21 0 -4 29 13 -10 13 22 -6 -1 6 20 -2 -6 12 12 -10 3 23
2477B3k5j6K2J0j8kJ9mk4OL2j9j6J2K5l1oK6Pj5nJ7Pl0J3J0pj8K3Pk0j1J5Jk1
$$ 23 -2 -18 4 14 -4 -6 13 9 -15 -9 23 4 -12 0 25 -6 -12 14 21 6 1 18 25 -5 8 18 11 -7 16 23 3 -8 7 8 -13
2512a3J5K4j6k3J4Ojj5J1J3k8nK2Nj8%K5j1k0K4J5k5mJ6Ok5LK3kj9J7KrqQNj6
$$ -13 2 26 10 -13 1 7 6 -9 2 15 -13 -18 4 9 -9 -9 16 5 -15 9 24 -1 -5 11 17 -8 -5 18 16 -3 14 16 7 -1 7 12 -4
2549dJK6Jk5oK3j2jJJ8k8%J3kroJ7oj6MJ9j2j3J4J8k3lK5Jj5MJ3k0mJ6K3j8lJ0
$$ -4 -3 23 24 -1 -7 16 4 3 4 22 -6 -6 7 5 -4 -10 7 1 -15 -11 8 -4 -17 -3 15 -8 -11 14 15 0 4 17 -3 -7 9 32 14 11 21
2588B1Qk2j0K3rk0NJ8Nk4J2J1k5NRQk5jK3jj7QQj2j2J6J4k3jK0Nqj3J8nrNJ6q
$$ 21 29 7 -3 20 11 -9 -4 14 19 -5 7 18 -7 -2 7 15 -10 -11 12 11 -6 2 10 -2 -14 2 16 -7 -8 12 17 9 -4 14 9 0 5 21 13
2627A3j5K9lk0lK6j2j3mK1j0j1PMj2qJ0J0j2LOMk1K1jj2LNPj4KJ5prJ0QmqRLj6
$$ 13 -2 27 24 4 1 27 15 2 -2 19 9 -2 5 9 -3 -11 -1 9 -3 0 6 10 -11 10 9 -3 0 5 12 -2 0 15 8 -1 9 17 13 5 14 17 1
2668AmJ6Rj9MJ4j1j3QPLj2KOqj0J8Ok5QOj0jOklpJ5Mj4KJ6mqMJ5j1kNKpj2J0J6
$$ 1 -3 13 22 3 7 21 10 -3 5 12 15 3 5 11 3 -7 11 17 -8 0 6 -4 -5 1 -1 -4 -11 4 8 -6 -4 12 8 0 4 19 8 6 11 13 6 -6 4 20
2712B0rjJ7k2Mj2K1rp%%Oj4J0Mj5J1J7rj0MJ1j3nMJ2k1OJ1%pJ4%j3QlJ3j5nQR
$$ 20 11 10 27 5 9 -3 18 9 2 2 2 8 -6 4 8 -7 4 21 12 2 6 17 4 -1 3 15 -6 0 11 11 4 18 18 5 13 10 23 8 3 11 20
2753B0k0nJ1J4j3OjjrJ2%j7J2Mj1lOjooJ0KJj0J0mjJJ2mmKQrnQJ5j7mRjj2J0N
$$ 20 0 -5 6 20 7 13 12 11 2 14 14 -3 9 13 2 -1 5 4 -2 -8 2 4 5 -5 5 1 0 1 13 9 5 7 15 6 1 9 24 7 3 12 11 -1 9 14
2797A4j2jnK1j1j7K0Rj2j0J7kk0MJ9rk0J8KJnOjrJ2mlpJ1Qj8%J4mnJ2J0j4pJ4
$$ 14 2 1 -4 17 6 -11 9 18 6 -4 13 11 -9 -5 14 5 -15 3 5 6 1 7 6 -3 9 5 2 -5 6 14 -4 -4 10 6 1 13 23 9 2 16
2837A6m%j3J4%j1J1j2OPj1Kjj1jJ5j5rJ8Kj7J7oKjjK0j3nPJJj0J7kn%MKmkOqm
$$ 16 12 12 -1 13 13 2 13 1 7 14 3 5 4 -7 -8 7 -8 -17 1 3 -14 3 -3 -1 -2 -3 17 4 -1 6 7 8 -2 15 13 8 8 12 14 10 8 14 6 2
2881BOJ2k0%J2kkj0J1mrLKj3J1%J0n%Roj2MPQj5J3lMj9J1QnOJnk%J5kqmJ0rlQ
$$ 2 8 20 0 0 12 10 8 -2 9 5 -4 -1 1 -12 -1 -1 9 4 4 13 7 -5 -1 6 14 -1 12 9 13 -6 5 13 8 14 15 10 8 8 23 21 13 9 19 10 7 15
2927A5jj1rJ7lmjrJ3mMj1K%OLj4J3JjlOpL%J1Jj8PPLmOJj7nJ4QqqJ3%j2rJ1mp
$$ 15 14 3 -6 11 8 4 3 -6 7 3 7 -4 -2 -2 4 7 -7 6 7 6 3 9 2 5 5 16 17 -1 6 13 16 12 18 19 2 -3 11 19 11 3 16 16 4 -5 6 2 -5
2974eJ3ooLjNoLkklmOO%KQjmmQrQJMrJ1krmJ0nJ4j1LKj4O%PqjKjj0J7%j2j1J4
$$ -5 8 2 -4 -1 -2 3 -3 0 -2 -4 -7 -11 -5 1 1 3 11 10 6 2 10 1 9 10 14 5 16 14 5 1 11 6 20 9 12 14 0 6 6 13 5 4 6 5 -5 12 12 0 -11 3
3024CjjJOj6NJ0JoJJ6j3pJ1Oo%%km%J6njj6NLmRpNj7J0J1pkR%pj3K8j3q%jlRk
$$ 3 2 1 2 8 -8 -3 7 8 2 3 19 6 -1 10 16 10 10 10 8 4 4 20 15 14 -2 3 6 2 11 4 9 -8 2 13 6 4 13 13 6 -7 21 8 0 0 -1 -4 5 3
3072CJ%lJ2krPLojPnNkPLj0j0J3KqNnQn%kkrNjRqkNj1ORjmMPj3j0KPJN%Qj2JJ3
$$ 3 4 4 1 13 11 2 9 12 6 5 12 7 12 10 17 20 10 0 13 15 7 12 7 15 10 10 8 6 -3 2 1 10 2 0 5 -6 0 9 8 4 8 15 2 -8 -6 1 2 7 7 15 3 4 17
3125A7oLrJ8j4kLpkJ1qNj1Qk%M%njRnLj4J0Jlj8J4OJkjPpLNkOnqJ2mQqqqK2j0
$$ 17 11 14 5 23 9 7 10 3 1 12 4 9 -2 6 4 4 8 8 3 2 11 6 9 -5 5 6 3 -15 -1 5 6 4 3 10 3 6 11 9 15 10 2 14 10 18 10 2 -6 16 6
3174FJKmNkl%lqQrJ4pPLj3mJ3oOLj0%jQJmRojNOqnNKkmjoONLLrpQj0O%Qljp%R
$$ 6 7 9 5 10 8 5 5 2 -6 2 -7 7 0 7 10 -3 -7 6 0 6 9 -1 -1 -2 6 7 3 12 6 5 10 16 8 3 8 10 8 4 3 -3 3 8 11 14 5 -2 6 -4 2 2 10 7 6 -1 -1 8
3230Hj0QpMjLLj3PJ1mj4J3jrQkjlN%OoK%krQOj1JNkj0LProK0j3J9j6kOpoJ5Lk
$$ 8 -2 6 -1 3 2 5 8 -5 2 13 9 -5 8 7 -2 6 4 3 0 5 5 11 5 7 7 5 -4 4 10 -1 0 5 3 -7 -4 3 -6 -12 8 -5 14 -2 -4 2 -5 -11 4 7 5
3279EpJ1kmpJ0qPKnMlkjOLjoJlJ1j1NrLn%oJ8j2KLjQqJoJ1qkMMKqkJ1KmOkPjn
$$ 5 -2 9 7 3 -4 6 -2 5 7 2 6 3 1 0 6 9 8 2 3 0 11 0 5 -4 -1 -6 -6 -12 6 -6 -4 -1 -2 6 -2 -1 -7 4 -4 -6 -2 2 4 -4 -6 5 7 3 9 7 14 13 8
3332HNj4J2%Nj1kJ1okkQj%Jj4NnMMjj6PlNrMLONLj1OoJ8j7ORok0J7QrLKNjoqR
$$ 8 13 -1 11 11 16 5 3 14 8 6 4 12 11 11 12 -2 3 -2 2 6 5 -11 -4 -7 -2 -11 -7 -4 2 7 10 -1 5 -1 17 0 6 15 9 -11 6 14 5 8 10 15 14 8 0 9
3382IoOJJqRj4JOjNj3JN%Mj3R%NjKKj1kJJ0NlNj7J9jj2J0mJqMmRrNjoJkJ0opJ0
$$ 9 3 9 10 11 3 12 -2 -1 5 4 9 -4 -3 2 2 6 -7 2 2 7 6 8 10 -1 -3 -2 8 13 10 15 -2 17 16 4 14 10 11 3 7 3 12 3 8 7 1 2 0 10 4 -3 7
3433Gklj0J1LnpPj2J0%%Llp%MKPOj2J2MoJj0J5LKj5MrJ1%rMj4J0J0j1mNmNJNp
$$ 7 5 2 -8 3 6 1 -6 1 -11 -1 -1 -1 2 -1 -8 -8 -4 -2 5 11 -1 11 15 9 10 0 15 18 20 5 9 0 11 11 2 6 -8 2 12 1 -3 2 -2 3 4 9 2
3480BnkOPrjlJJ1lnJ0o%jQkkRqokJ4Pr%mOnkkkLlolkR%j3J1%JnOKoRlqJ6nmJL
$$ 2 -3 -5 1 8 -1 -2 -5 -4 7 4 -1 9 3 3 2 10 8 6 15 7 1 -1 13 20 11 11 7 13 8 6 4 2 5 2 -4 -7 -9 0 0 -13 -2 -2 -1 -6 0 2 -4 5 2 -6 10 5 1 2 5
3535EK%kJRnkNpM%j3J6lKqKLkpRp%LkK%oOjOmMj6NnJ6j3MRnMJKMj1OJLMj1NqM
$$ 5 7 7 5 6 15 10 8 13 6 10 10 -3 13 10 12 4 6 9 7 0 9 2 2 5 3 5 5 -1 5 4 10 6 10 -6 -1 -6 10 -3 1 10 5 9 10 12 16 5 11 12 15 19 8 13 5 9
3589IpPj5RJ4k4J3r%KRpPl%qjJNkjmLLnJ6pnLMPnoOllMQ%qMMqrJ5pJj3J2lkjk
$$ 9 2 9 -6 3 17 -7 6 -3 -3 -1 8 1 8 5 5 -3 -4 -3 2 0 -1 -5 -2 1 -4 12 5 0 3 7 14 9 3 9 6 3 7 15 15 7 11 15 7 -2 13 6 7 -6 6 3 1 0 -2
3642bJ1%Jr%mkkJ5j0O%nJLRNrLj3J9j0Pj2LJlKrJ4OonJnrOj%J2%lpKJ%LpNolj
$$ -2 9 9 10 1 1 -3 -5 -7 8 -2 4 4 -1 0 3 12 17 8 11 -2 17 7 14 2 5 6 3 5 -4 10 16 10 5 6 1 -8 -2 -3 -3 9 9 6 -1 1 2 2 5 -2 3 -3 -6 -7
3694gj1J7%JJ2o%nOJ1mMr%jmjJ1pJ7j2%rJJ0j1MlKKkjNnnJ3mj1NpnRPkJJMqJ7
$$ -7 -18 -1 -1 0 12 6 6 1 7 18 14 18 9 9 8 4 3 14 7 24 12 12 3 4 14 3 7 4 6 8 6 5 10 5 0 13 9 -2 3 -4 -9 0 7 5 6 7 11 3 20
3743B0qJkmMj%oNMQrj3OjjNJmkpJ0oKNjj3NkpN%J1j3LpJ0JJ2oRj3PlJ2j2Qj3J6
$$ 20 12 13 11 7 11 10 10 4 9 13 21 12 -1 5 4 3 8 9 5 3 -4 6 0 2 7 6 -7 -2 -4 -11 -6 -6 5 -8 -5 -12 -2 -1 11 5 14 1 8 5 17 5 13 0 16
3792A6oPjj2MkJ%Mlrj2RJ0jj6J5KrMpmJ5j0PkoPkljOo%J1NLj5OJ4nLLj0JJj1L
$$ 16 10 17 16 4 8 6 7 7 11 8 -1 -13 -4 6 5 -11 4 6 -3 1 -6 -10 5 -5 2 0 -6 1 -1 -4 -5 1 -5 -5 6 11 14 -1 5 19 14 17 20 10 11 12 1 4
3840DjLmlLMKJj3Q%mqQPj9Qj0J6nJQkj8K0j1nJ8Ljj0OMrRpJ0lpMqPj0LJPoQMk3
$$ 4 3 6 2 -1 2 6 8 9 -4 4 4 0 -8 0 7 -12 -4 -14 2 -3 -2 6 4 -14 6 -5 -10 8 11 10 0 6 10 1 10 3 13 10 3 7 -1 6 -4 -1 0 7 1 9 13 -10
3890a0QOlnJjlPK%lKMJlpRkoLQJqO%KlKjjNkmJ2j7jJ1olNkKkk%jJmNj1P%RrNj5
$$ -10 -2 4 1 -4 -3 -4 -7 0 2 2 -1 1 5 6 3 -4 5 3 -3 0 8 9 1 7 7 9 6 8 7 6 11 9 5 17 0 -1 10 4 1 6 4 6 4 2 2 1 2 -2 3 -8 -1 -1 8 -1 4 -11
3946a1J2J4k0J4mpJ4p%lQ%pKJ4Kj5KJjrJ4j1rRj3J2JjoJ0jj1MJ1lpMm%Nj0QMJ
$$ -11 1 15 -5 9 5 -2 12 5 5 2 10 10 3 5 19 21 6 8 9 8 -1 13 2 -7 2 -11 1 2 1 -5 5 4 -7 -3 8 5 -2 2 -2 -2 3 -7 1 5 6
3991F%JKj0LKMkkMmJ2pmOJq%LMp%Oj3mJMLmLknJ1rOj1Rj1QLjjJ2jKmLpjQqJ2o
$$ 6 6 7 9 -1 2 4 8 6 4 8 4 16 9 5 11 12 4 4 7 11 4 4 10 -3 -7 -6 -2 1 -3 0 -2 -7 4 -5 1 -10 -1 -12 -4 -1 -2 -3 9 8 10 6 9 2 1 9 1 13 7
4044GqJ1Kkj4RPj0KJj4Rj%j1J0Nj4MRloPLL%j1POnkLK%J1p%jmjpJ4qmJJlKmJ0
$$ 7 -1 10 12 10 -4 5 12 2 4 5 -9 0 -1 -1 -12 -2 3 -11 -7 2 -1 -7 0 3 6 6 -5 2 8 3 1 4 6 6 17 10 10 9 5 4 -3 11 3 -1 0 1 -2 0 -4 6
4094F%pjJ3j7L%%kQj5J6oOlpJLNmMNMnmQrjMNpP%pRrJ0m%Jj3J1jj6J5oLqNj4J
$$ 6 6 -1 -2 11 -6 -3 -3 -3 -5 3 -12 4 -2 4 1 -6 -5 -2 3 -1 3 8 12 7 3 11 2 1 5 10 3 10 10 3 12 3 13 9 9 10 -3 8 7 -9 6 0 3 -5 0 -14 -13
4145a3QORj5J3m%qqPKNkLNpQPrRkrp%N%qOKRlLooJ1j2lqJ3Qj2%OkNrKj0OQKlQ
$$ -13 -5 1 10 -5 8 4 4 -4 -12 -5 -3 2 0 3 8 1 9 16 7 16 14 5 -2 -2 3 3 -5 1 3 12 9 12 6 0 11 -1 -4 -12 1 9 -3 -3 3 1 6 -3 -1 -11 -5 3 5 2 10
4198A0qJMp%PjKkMP%%jj7JOpOKLlKjpQonMnNj1J6j1KO%nkJ8j2KJNl%nlJ0Lj%L
$$ 10 2 3 7 0 0 7 6 8 6 10 17 17 17 16 -1 0 6 -1 5 7 10 7 9 8 1 9 3 -2 2 -3 2 -9 7 -4 -2 4 4 -1 -3 15 3 5 6 11 8 8 3 0 10 13 12 12 15
4251A5mknQrQj8J2Nj7KOKj0NkL%lLkoOnPjKOlqJ2LqPpkjKjJ2mpRjppNJ2LrKo%
$$ 15 11 9 4 12 3 11 -7 5 10 -7 -5 1 3 -7 -2 -4 -1 -1 -4 -1 -3 -9 -3 -8 -1 -2 0 6 3 -5 7 10 2 9 2 0 -1 1 0 12 8 1 10 9 2 -5 0 12 15 6 8 2 2
4304B%KJj1J4j9J3mkMqkNLjlKK%rJ6Rj3Oj1PjPk%JnLqmRQj0jLnJk%QoKKj0Rjk
$$ 2 2 4 5 -6 8 -11 2 -2 -4 0 -8 -10 -5 -2 -3 -6 -4 -2 -2 -11 5 14 1 7 -4 3 2 9 7 7 8 3 6 -2 -6 3 11 1 0 3 -2 -1 -3 -3 5 -1 1 3 -7 2 1 -1
4356aJmJ2rll%%J4jjQkj0J1qkOLj1PJ%OmKpOrPj1Rj5QnMlNj7J6mJLj6qJ5jRjK
$$ -1 0 -4 8 -1 -4 -7 -7 -7 7 6 5 13 11 1 12 4 2 8 11 0 7 8 8 14 10 12 5 11 2 9 -2 7 -8 0 -5 -1 -4 1 -16 0 -4 -3 0 -16 -24 -9 -10 -1 -2 0
4406@JQojQkLjoKPnmJmPOqkJ0qpmk%NOomMj4K1mknPpmJ6%Pk1J6rJ1jj4J4mKpM
$$ 0 1 9 3 2 10 8 11 10 4 6 13 8 4 5 1 8 14 6 4 14 6 -1 -5 -7 -7 -2 4 -2 -6 -2 -16 5 1 -1 -6 1 -6 -10 6 6 13 -8 8 -1 10 9 -5 9 5 7 0 4
4458DJ0rj%M%pRp%n%nOm%NrRp%KjjpJ5QpnKONjn%Kko%PKkkKkOroQOqPlJo%kqM
$$ 4 14 5 4 4 8 8 1 10 3 3 -2 -2 -7 -1 -5 -5 0 -9 0 -7 -7 -5 -6 -7 -14 1 9 2 -3 -1 5 10 9 4 4 6 4 -2 -2 5 7 5 3 5 3 9 0 -6 2 8 0 7 4 5 -1 -1 -3 -11 -7
4517gKMJrNoLKJPL%j5LJ2Lj2J0pjOpRnK%Rpkj3KJ6j4OMj1oJ6j1OlnLoQlPj1LJ2
$$ -7 -5 -1 0 -9 -4 -10 -7 -5 -4 3 6 6 -9 -6 6 9 -3 7 0 -1 5 -2 7 2 4 4 13 6 4 -9 -7 9 -5 1 5 -6 -12 4 -7 -1 -4 -9 -6 -12 -4 -7 0 -11 -8 4
4567DpJkJ5j3lMMKNnQjJ0j6OqOqQmOoJJ0j7J%nKKkJ1k3J0jp%NMpLPLMNpjnjJ2
$$ 4 -3 -2 -4 11 -2 -5 -1 3 5 10 5 13 12 22 6 12 4 10 2 10 6 12 6 7 17 0 1 1 -4 -2 0 -2 9 -14 -4 -5 -12 -12 -7 -3 -10 -7 0 3 7 12 5 4 -1 -2 10
4618A0oKKLlMlj5J8r%%kNMrQj5J1nQj0MQk2J5Kj0jLPrKjJMRnPkpROqLnPMrjmM
$$ 10 4 6 8 11 8 12 9 -6 12 3 3 3 1 6 10 1 9 -6 5 0 8 -2 2 10 -12 3 5 -5 -6 -3 4 -5 -3 -4 -3 1 10 5 12 10 3 12 18 10 13 8 15 19 10 9 5 9
4670I%%jJknLmNQj0%oPqK%oMjnMQOj1Nj2QMlJ3PqmoPpLQ%Jj0OJ%JqmPopNmNjM
$$ 9 9 9 8 9 7 2 5 1 6 14 4 4 -2 5 -3 -1 -1 -7 -3 -4 -9 -5 3 9 -2 3 -9 -1 3 0 13 20 12 8 2 9 2 5 13 13 14 4 10 11 11 12 4 0 7 1 -6 -1 -5 0 -1 3
4726CnJ1ljj0KOjkKkMqPjOm%nKK3j8oJ9jpmJ%p%JjJ2j6KNqOlJrKPNqkm%Lo%%J2
$$ 3 -2 9 6 5 -5 -3 3 2 0 2 0 4 -4 3 2 8 4 4 -1 1 24 6 0 19 18 11 7 8 8 1 1 2 1 13 -3 -1 4 -4 2 -1 0 -9 -7 0 5 -3 -5 -9 -9 -6 -12 -12 -12 0
4780@nQJMoJRpjOj4MmJ0j1KNjkJMrRj7MJ3oj3J3j1K0pjj6J9j5NLLoQ%pJ0pNJ1
$$ 0 -5 3 4 8 2 3 12 5 4 10 -4 0 -4 6 -5 -3 2 1 -1 0 4 -5 4 -13 -9 4 -2 -15 -2 -13 7 0 -1 -17 2 -13 -8 -5 -2 -8 0 0 -7 3 -4 1 12
4827A2mnLKNo%l%%kPj0J5nj1Qj6OOnkmMNLqJnQPk0J1nRqMMoNLOPj0MLpoMJMrM
$$ 12 8 3 6 8 13 7 7 4 4 4 2 9 -1 14 9 -2 6 -10 -4 2 -3 -5 -9 -5 0 3 -5 -4 -9 -1 6 -14 -3 -8 1 -7 -3 1 -5 0 3 9 16 6 10 13 6 0 4 5 9 0 4
4880DLmQnkmnkJ5j1jJoMoJ6k0J8Nj5OqJ9lj0JOOj1QkKKnQ%lPkj4Qnj%qNjLmJK
$$ 4 7 3 11 6 4 0 -5 -7 8 -3 -4 -3 -9 -5 -11 5 -15 3 8 -7 -1 -9 10 7 -3 -2 4 10 -1 7 5 7 9 4 12 12 9 16 14 0 8 3 2 2 -6 -1 -2 1 -3 -2 0
4931@NrNj1OkjqOKKM%nKMMJlJ0lqJ1Nj2lJ2kj0JqJ2Oj3jKoK0j1p%%N%qQnjJjm
$$ 0 5 -4 1 -10 -4 -6 -7 -15 -9 -7 -5 -1 -1 -6 -4 0 4 5 2 12 9 1 12 17 5 2 14 12 2 3 -5 7 13 0 -1 1 -5 15 4 -3 -3 -3 2 2 -6 2 -3 -4 -3 -4 -8
4982hJ3ml%nJ2mjl%J5p%lLKjlPnNqPnMqJMKpjLqJ0LmplLQmlQrKJ1mnNqOMj5J5
$$ -8 5 1 -2 -2 -7 5 1 0 -3 -3 12 5 5 2 5 7 6 3 10 5 10 2 9 4 8 0 1 5 7 0 -1 2 -6 4 7 3 -4 -7 -4 4 0 -3 5 -4 -2 9 5 0 5 -3 3 7 -8 7
5036GmjLMpLLkKJmJn%oLj3J9nj1KKjLPqKJOj0njQlLMkKJQqQnJ3LqnrJ4%pLJ%j3
$$ 7 3 2 5 9 2 5 8 6 8 9 5 6 1 1 -5 -2 -15 4 -1 -12 -10 -8 -9 -6 1 -7 -5 -4 2 -8 -13 -14 -6 -9 -6 -2 -4 -2 -1 7 -1 7 2 15 18 10 5 -4 10 10 3 6 7 7 -6
5091fNQqJJkpNnPj2QmjJ0j4RNnMrQmJ0N%l%NnJmKMrMJ0j2NlnqJQjLj0J0nj0Ok
$$ -6 -1 7 -1 0 1 -1 -8 -3 -8 -1 -13 -5 -9 -10 0 -14 -5 0 -5 -1 -10 -2 -6 4 9 9 6 6 11 6 7 3 5 9 0 4 14 2 7 4 -1 -9 -8 0 -1 2 -8 2 -3 -13 -7 -9
5143i%Mj0RMlnoJ6p%Nj1PLNlQKmJkpMKpQjQj2Mj5K4j1kk%nmNOojmMJjPJmnKmJ0
$$ -9 -9 -5 -15 -6 -2 -5 -10 -16 0 -7 -7 -2 -13 -6 -3 2 -1 7 9 5 6 4 -3 1 3 -4 4 3 11 -1 3 -12 12 1 -1 -3 -3 -8 -12 -7 -1 -7 -8 -12 -8 -7 -8 -1 0 -4 -9 -7 -11 -1
5197aJj5RPoJ1oQnKKnNjlMj1OmnOL%rjj%mKlMrJ9j1lOQkJnJ3j3OOmrJ4lkK%M%
$$ -1 0 -15 -6 1 -5 6 0 8 3 5 7 2 7 6 3 7 -4 2 -2 -7 -1 2 2 -7 -8 -9 -9 -13 -11 -14 -10 -19 0 -11 -14 -8 0 -2 -1 -6 7 -6 0 6 2 -7 7 4 2 4 4 8 8
5250HJlkJPopNlkrJ0j1J1Kmm%j%knKMjLjJLlJ4%noJRoQj1LlOJPj3QrkQm%KkMj
$$ 8 9 6 4 5 12 6 -1 4 1 -1 -10 0 -11 0 2 -2 -6 -6 -7 -7 -9 -14 -12 -8 -9 -6 -7 -6 -3 -6 8 8 3 -3 -2 7 1 9 -2 1 -2 4 5 12 -1 7 -2 -4 4 0 0 2 0 4 3
5305CjomJ4pnlPj2jRmMnQQnjJ3qpJLJ0lkjkOknNj3K3j4q%pK1j7%mK%LjKJJnMJ
$$ 3 2 -4 -8 6 -1 -6 -9 -2 -14 -15 -6 -10 -6 -11 -3 5 0 -1 12 4 -3 -2 1 11 8 6 5 3 9 7 2 7 -6 17 3 -5 -5 -12 9 -8 -8 -12 -10 -10 -7 -8 -6 -5 -4 -9 -5 -4
5357dnjKLlN%Pj1J0j6J8mkjjJ1j3J2k%%kPjj2N%Kj1%NjqKRmmJ3j1l%LQj0%J4m
$$ -4 -9 -10 -8 -5 -8 -3 -3 4 -7 3 -13 5 1 -1 -2 -3 8 -5 7 5 5 5 3 10 9 -3 2 2 4 -7 -7 -2 -3 -11 -9 0 -4 -8 5 -6 -9 -9 -6 2 -8 -8 6 2
5405BlJ0Kj3oJ3mj1J7nOnPonJ3moJ4j7Qqj0QlJ2j0Lj2P%Kjj2MKJ%PqLJ3rOJrN
$$ 2 -1 9 11 -2 -8 5 1 -10 7 2 8 3 10 4 -1 12 8 2 16 -1 7 -1 -11 -3 -6 6 -4 -1 -13 -6 -6 -4 -5 -17 -13 -11 -10 -10 -3 -11 -8 5 -4 2 3 -6 -1
5452aL%nJ2nqJRpnJ2q%nJ0rkJ2j0Rj3KpMMj0J5mkNpoQmQNKj2J8l%j%LlkLoNlM
$$ -1 2 2 -3 9 4 -4 -3 6 -1 -6 6 -2 -2 -7 3 -6 -8 4 -6 3 -10 -8 -15 -11 -7 -17 -2 -6 -8 -3 -10 -16 -8 -12 -4 1 3 -9 9 6 6 5 5 8 5 3 6 0 5 2 6
5503FNj8J2pj1QJ1rrKNkpJ0jn%LO%Jmo%KNRoOmjMmlJ5llNlmqJ3j9OKNnLKmQj1
$$ 6 11 -7 5 -2 -13 -5 6 -3 -12 -10 -5 -7 -14 -4 -5 -10 -10 -7 -1 -1 0 -4 -10 -10 -8 -3 6 0 6 2 1 5 1 -2 13 10 7 12 9 5 -3 10 -9 -3 -1 4 -1 2 4 0 8 -3
5555cjlKnlJ0nMlPm%Mr%J3J%mnJ0JJJMj1jJ6rrmJ1mPj2mJ8rqPqkjmP%Nk1J4J1
$$ -3 -4 -7 -5 -10 -13 -3 -8 -4 -7 0 -4 -4 0 -9 -9 4 5 5 1 -4 6 7 8 9 13 2 1 17 8 -1 -5 6 2 9 -3 -7 11 2 -6 1 -7 -9 -10 -14 -7 -7 -2 -23 -9 2
5605Bj4J3mj3J3jjQLnj1JJ4Lk%%lN%rJ1j4OjqLJmJjjJ0j4KOLomMlPnNN%oJKKr
$$ 2 -12 1 -3 -16 -3 -4 -5 3 6 1 -10 -9 5 8 6 6 6 3 8 8 -1 10 -4 2 1 -7 -4 -3 -7 -6 -7 -8 2 -12 -10 -4 -1 -7 -11 -7 -10 -3 -8 -3 2 2 -4 -3 -1 1 -8
5656hlQoOJ3j4NJJ0j5%J1oNj6QMpPj5JkJ3j2J4qKkj1KJ0n%Pj3QLJ2j3MklJ1Jl
$$ -8 -11 -3 -9 -3 10 -4 1 2 12 -3 -3 8 2 7 -9 -1 3 -4 3 -12 -11 -13 0 -12 2 -6 -4 -6 -17 -15 -5 -10 -10 -3 -16 -8 -5 7 -6 -2 -4 -7 4 5 2
5701Bj1J1j0PKJ2moNkMj1kMLjNj3LL%j4%OQqoOokJ6j2PKnNJ1nlNJmpJ3jrLJ3j6
$$ 2 -9 2 -8 -1 1 13 9 3 8 6 10 -1 -3 1 4 3 8 -5 -2 1 1 -13 -13 -7 1 -7 -13 -7 -13 -15 1 -11 -4 -2 -7 -2 9 4 1 6 7 3 -4 9 8 -1 2 15 -1
5750aJ4lnO%j3J6k0QlJkMj0oR%RkLjppJ3oNj3JJ2mkOJk%lRnlRj0QQj3joJ3pjn
$$ -1 13 10 5 11 11 -2 14 -6 2 -1 0 -2 2 -8 -14 -5 -5 4 2 5 4 -3 -10 3 -3 2 -11 -10 2 -2 -4 2 3 1 1 -2 7 2 -1 8 -2 6 14 1 0 -6 7 0 -1 -6
5800fRmjJpLNJppQJ6j9MJ%kRj3OpJ1nKOmLkRqJ3j1K%nMJ3mpJoK%nqK1j9JLKLj
$$ -6 3 -1 -2 -1 -8 -5 0 1 -6 -13 -5 11 -8 -4 -3 -3 -5 4 -9 -3 -10 1 -4 -2 4 0 3 1 10 2 15 4 6 6 1 5 18 14 7 8 2 4 4 -1 -9 12 -7 -6 -3 -1 2 1
5852Aj0QpkK%J1mlJ3j0jJ0mlPjJOjj4QLoNjl%%Oj1OKrLkjjj%ljQrJ0qjJ0kj5J3
$$ 1 -9 -1 -8 -10 -8 -8 3 -1 -4 9 -1 -2 8 4 1 8 7 8 14 13 -1 7 10 4 9 8 5 5 5 11 0 6 8 -1 2 0 -1 -2 -3 -3 -6 -7 1 -8 2 -6 -7 3 1 -14 -1
5903amkKJ1oOpLQpJLJrPj0RkLmMj4J0jrJ5j3KOj1kOQrlJ1mJ0k3J6o%K%kJ0lNo
$$ -1 -5 -7 -5 6 0 6 -1 2 10 3 4 7 8 -1 6 -4 5 3 6 2 6 -8 2 1 -8 7 -6 -4 2 -9 -11 -5 3 -6 -9 2 -2 8 -15 1 -5 -5 -3 -3 -5 5 2 7 1
5952AjJ%J4qJmlMMplPJqJ0rOmmpJ5j6mPNNj5J4r%JK0j4jPkRo%j2RJ0j1LOo%J2
$$ 1 0 1 1 15 7 8 4 1 5 9 2 -1 6 7 -1 9 0 6 2 -2 -9 6 -10 -14 -7 -2 3 -12 2 -7 -7 -6 14 0 -1 6 4 13 7 7 -5 4 14 3 6 12 6 6 18
6001A8j2kjQnqQMoj2RpmJ6j0%qNJ2jj7NLqJ2KMLLmmjJ1mjoKML%Mj2PkJ0j1knO
$$ 18 6 4 3 11 6 -2 6 10 4 -8 1 -6 -10 6 -4 -4 -12 -7 5 4 -13 -8 -5 -13 -1 1 5 8 11 7 3 2 13 9 8 2 4 8 11 11 15 3 10 8 18 7 5 0 6
6050FqkKPmn%J1rPrQoj3JPJRo%MLrNQj6J5KlOkn%QpKpQnmRoj0NkKJjLkMj0kkR
$$ 6 -2 -4 -2 5 1 -4 -4 7 -2 5 -4 4 -2 -15 -14 -7 -6 3 -3 -3 1 4 -5 0 8 -8 7 9 6 12 10 5 5 13 6 8 1 9 4 0 9 3 -7 -2 -4 -2 -1 -2 1 -1 3 -7 -9 -11 -2
6105bKnjKNqkJ1%Rj1kMJ0lmj0J9jnLLoj1J7%lmJom%PnJmoJ4knkJ2qmPj3J0%KQ
$$ -2 0 -5 -6 -4 1 -7 -9 2 2 11 0 -2 2 12 9 5 -5 14 13 8 11 14 8 -3 14 14 11 7 8 2 -2 -2 5 0 1 -3 -9 5 3 -2 -4 8 0 -4 3 -10 0 0 2 10
6155A0pMJPj3J0pjPPmjj5J8Jj1OKj0jjJKj4J1krnJ2lOrMoLmONnQ%j7OnJ1%LJn
$$ 10 3 7 8 15 2 12 5 4 11 18 14 13 -2 16 17 6 12 14 4 3 2 3 5 -9 2 0 -9 -14 -2 -5 1 -8 -4 -10 -7 -11 -5 0 -5 3 3 -14 -8 -13 -2 -2 1 2 -3
6204cPLn%J2j1KPj4QMknJmlOmpkNkJMqNOj0jOjjPrjLKRoQj7K1%pkLOj7J6Nk0M
$$ -3 4 7 2 2 14 3 5 12 -2 6 10 8 3 4 0 -3 3 -1 -8 -10 -5 -7 -6 -2 -10 -5 1 -9 -10 -4 -5 -6 1 -8 -9 -6 -4 5 -1 7 -10 11 11 4 2 5 11 -6 10 15 -5 -1
6256aOj2J3pOnLlqOkmKMlljNQj4KKPOkj5QlJ1njPJLJnl%M%nQnmLlpJ0j3J0Jnp
$$ -1 5 -7 6 -1 5 0 3 0 -8 -2 -4 -8 -6 -2 -5 -8 -9 -4 4 -10 -8 -6 1 7 5 -10 -2 -5 6 1 0 7 8 11 12 7 4 4 8 8 3 11 6 2 5 2 -5 5 -8 2 3 -2 -9
6309iOmKLjQj4J2qQmJNknJ0kjMKnJmMLKrJmQnqLJ0llmLmOMnj1LkOjjMjjpJ4j1
$$ -9 -3 -7 -5 -2 -3 5 -9 3 -5 3 -1 0 5 3 -2 8 6 5 9 11 6 7 3 7 10 12 3 4 0 8 3 -5 -2 8 5 2 -2 1 -3 3 7 2 -9 -6 -8 -2 -3 -4 0 -1 -2 -9 5 -6
6363fNPjRlp%KPj0J1mQlmlLLqNjmoQOj3ljJ3oojNoJRrKRj3K0j1nJQJkjkKNjnM
$$ -6 -1 6 5 14 11 4 4 6 13 3 14 10 18 15 11 8 11 14 6 11 10 6 0 8 14 1 -2 -3 10 4 -2 -3 2 -4 -3 6 -3 -1 8 -5 15 4 -1 0 8 9 7 6 4 6 11 10 5 9
6417IjJMjMj3Qkj4kJJ6pj1NNnjkJ0j3QoONnjMnNRokNRnmNPj6J4j4Mj%OrjNjMj8
$$ 9 8 9 13 12 16 3 11 9 -5 -7 -6 10 3 -8 -3 2 -3 -4 -6 4 -9 -1 -7 -1 4 -1 -2 2 -3 2 11 5 3 8 17 12 8 13 20 4 18 4 8 7 7 13 4 3 8 7 11 -7
6469gQpQ%rLoQ%Mj1J0rJ4Mj4jJ2nJJ1j0%J2j0Lj%MlmPj0Q%m%oJ4nq%%j%MLj2M
$$ -7 1 -6 2 2 -7 -4 -10 -2 -2 2 -9 1 -8 6 10 -4 -5 7 2 3 14 4 4 16 6 9 8 8 12 9 5 12 2 10 10 6 6 0 14 9 1 1 1 0 0 4 7 -5 -1
6518aKmQJj1%JnKQkkKKQJrJ3onKJ1j0oQK%noJ0qLKlKnNj4OpJ3qjOj5MQ%Lj0%Q
$$ -1 1 -3 5 6 -5 -5 -4 -9 -7 1 -1 -3 -1 1 9 10 1 14 8 3 5 16 6 0 8 10 10 5 -1 9 1 4 6 3 5 0 5 -9 -3 -10 3 -5 -6 0 -15 -11 -3 -3 0 -10 -10 -2
6570bK%MMnPOj2MRqNmlkLMJMj0Mj4J6rlOj7J0koLKOj9JRJRj2J1pOnMRlKlkRnn
$$ -2 0 0 4 8 3 10 16 4 8 17 9 14 10 7 5 8 12 13 17 7 11 -3 13 4 1 7 -10 0 -2 -8 -5 -3 3 -16 -15 -6 -5 4 -8 3 -4 2 -3 1 10 7 9 6 4 13 8 3
6622CJ4ooK%PrlJ2j3KnJ3oJj4PLj7RrRkMoJ0oPjM%j4Rj1K4j3Ojj1J4NPmnjjln
$$ 3 17 11 5 7 7 14 5 2 14 1 3 -2 11 5 6 -8 -1 2 -15 -6 -15 -6 -8 -4 -10 0 -6 1 0 4 4 -10 -1 -12 12 -1 5 4 -7 7 12 19 15 10 9 8 5 0
6670@%pJ7Lk0J2qMlOnj1mJ4qKmJ5j5lJ6j0lkJ3O%rLJ0lOonKMLLrJ0%j3%KNj5O
$$ 0 0 -7 10 13 -7 5 -3 1 -2 4 -1 -12 -16 -2 -10 -8 -12 3 -12 -15 1 -9 -12 -14 -1 5 5 -4 -1 9 6 12 6 1 3 7 10 13 4 14 14 1 1 3 8 -7 -1
6717aNjo%oKJj7J6qJ0pKNj2J6JJJmLJqJ5oljPjJLrLQrPkMrkOnknJJLlKjo%%j1
$$ -1 4 3 -3 -3 -9 -7 -6 -23 -7 -15 -5 -12 -10 -5 -17 -1 0 1 2 -2 1 2 -6 9 3 0 -1 6 5 6 9 0 3 11 2 9 7 11 2 0 6 1 -1 -6 -5 -4 -1 -4 -2 -3 -9 -9 -9 -20
6771b0QKMj6RJ8j2J0jj1KJ0nrJ1MmN%LlPkr%KjQnj4nJ2%pkMkqJ5qNjmlP%Nj5N
$$ -20 -12 -10 -6 -22 -13 5 -7 3 2 -9 -7 3 -2 -11 0 4 0 5 5 8 5 12 10 1 1 3 2 10 5 -9 -14 -2 -2 -9 -11 -7 -9 -17 -2 -10 -5 -6 -10 -13 -6 -6 -1 -16 -11
6820a1JLPQj0J2j0jL%RPj1mmJ9j3pJ1p%oOoNqMmjklMllNMjjJj5J4JMnPkJ7rqo
$$ -11 -10 -7 0 8 -2 10 0 -1 2 2 11 18 7 3 -1 18 5 -2 9 2 2 -4 2 -4 1 -7 -3 -7 -8 -10 -13 -9 -12 -15 -10 -6 -7 -8 -7 -22 -8 -7 -3 -8 -1 -3 14 5 -3 -9
6870iJ6%mJ1opLmNJoPrLnQo%PrKj7J3lJ1j1%kNmLlQnlORljMOLpkKMmkJ3nJj2o
$$ -9 7 7 3 14 8 1 4 0 5 6 0 7 -2 1 -4 4 -2 -2 5 -4 -2 -19 -6 -9 2 -9 -9 -11 -6 -10 -7 -10 -2 -7 -10 -4 5 2 1 5 11 14 7 5 7 11 7 5 18 13 14 2 -4
6923dJ0jrRnRj6l%qLNKkJ4j2mMpPNmJ0joKRoQllQOj5QnlJ0mj0KLknnK1qj4Rj1
$$ -4 6 5 -4 5 0 9 -7 -10 -10 -18 -15 -10 -8 -10 4 -8 -12 -8 -15 -8 -3 -7 3 2 -4 -2 7 1 9 6 3 11 17 2 10 5 2 12 8 -2 0 3 1 -4 -9 12 4 -10 -1 -12
6973a2LP%pmjP%J0j5J0LJKj0OLmN%KLRj0L%Mjj0j0lJ2KlJ4j3nmm%Rj2J0j2J0k
$$ -12 -9 -2 -2 -9 -13 -14 -7 -7 3 -12 -2 1 2 4 -6 0 3 -1 4 4 6 9 18 8 11 11 15 14 4 -6 -9 3 5 2 16 3 -2 -6 -10 -10 -1 -13 -3 -15 -5 -7
7019gnMkJ1ljpRnmJ1oQNoNj1J7j8MJ0mJ2nrkRj8J1j1jKJJ5j1Nj8jRmoPRj1JKj2
$$ -7 -12 -8 -10 1 -2 -3 -10 -1 -6 -10 1 -5 3 8 2 7 -4 13 -5 -1 9 5 17 12 3 1 10 -8 3 -8 -9 -7 -6 9 -2 3 -15 -16 -7 -11 -17 -10 -1 -12 -11 -9 -21
7066b1J2JJ2j2lJ0kpPLnJ0jJ6j3lJ1Mrlkm%Qj6NJ%jlljOQj7QpkJ0j6J0nOMK%j
$$ -21 -9 -8 4 -8 -11 -1 -3 -10 -3 0 -5 5 4 20 7 4 15 19 10 7 5 1 1 9 -7 -2 -1 -1 -2 -5 -8 -9 -3 5 -12 -4 -11 -13 -3 -19 -9 -14 -8 -4 -2 -2 -3
7113cMlMjLrJ2j3QJ1qMKrPomKlMkrQklNoQkjllJ2j0j1J0MkPnjJMPrJ5j6J4jMj1
$$ -3 1 -2 2 1 4 -5 7 -6 2 13 5 9 11 2 9 3 -1 1 -2 2 0 -9 -1 -3 -6 -1 -7 1 -1 -2 -5 -8 4 -6 -17 -7 -3 -5 2 -3 -4 -3 1 8 -1 14 -2 12 11 15 4
7164DJOLqMlOOj8mQjJj9J3mKjqJ3oLjkpJ2noJlPjJ3mLNolQqOonK2j1Nj7PqJ2q
$$ 4 5 11 14 6 10 7 13 19 1 -3 5 4 5 -14 -1 -5 -3 -4 -12 1 -5 -2 -3 -5 -12 0 -5 -11 -10 -13 -6 -7 6 2 5 10 4 1 9 1 7 1 -4 18 7 12 -5 2 -6 6 -2
7215bJNrpJ9j6lJ6pjmlPJnQj1kQKjQmKNomPj0J2pQ%kKj0RPq%LpNnMmrMNllmlR
$$ -2 -1 4 -5 -12 7 -9 -12 4 -3 -4 -8 -11 -4 -3 -8 0 -11 -13 -5 -3 -4 4 0 2 7 1 -3 4 -6 6 -1 7 7 5 7 -3 6 13 5 5 8 1 6 1 5 1 -8 -4 1 -2 -5 -9 -12 -3
7269cnPoJ%nQjKj2O%MQQj8J3Qj5RrMolOKLjJj2J6j0mRrkPlQj4LLoK%LJjj1OQr
$$ -3 -8 -1 -7 -6 -6 -11 -3 -4 -2 -14 -8 -8 -4 4 12 -6 7 15 0 9 0 4 -2 -5 1 3 6 5 6 -6 10 0 -4 5 -4 -6 1 -2 6 -8 -5 -2 -8 -6 -6 -3 -2 -3 -14 -8 0 -9
7321iJ7j2jOl%J9j6MLj4K0j0KkjJP%omKJ%kljnnRqPj4J5rJ3pQj0MNlOrRkNKnL
$$ -9 8 -4 -5 1 -2 -2 17 1 5 8 -6 14 4 6 4 3 4 11 11 5 1 3 4 4 2 -1 -2 -7 -12 -3 -11 -4 -18 -3 -12 1 -6 2 -8 -4 1 -2 4 -5 4 2 7 9 4 7
7371GmJ7j6NJ3j9JLJqJ0j0%LqjLnLJ0j8oNLJ1j0oK0lj0RJKnMkJPKj2jJ3mmQJ%
$$ 7 3 20 4 9 22 3 4 7 8 0 10 0 0 3 -5 -6 -3 -8 -5 5 -13 -19 -14 -11 0 -10 -16 4 1 -9 0 1 3 -2 2 0 1 8 10 -2 -3 10 6 2 10 11 11
7418A1NrmKnMQj5Qj1KknMJ1j3Qjlo%LOnLQjn%J7j4mMPkPKmkJ0j6O%OMj8J2nj0
$$ 11 16 7 3 5 0 4 12 -3 5 -6 -4 -6 -11 -7 4 -9 -1 -2 -5 -11 -11 -8 -2 -7 -4 4 3 -2 -2 15 1 -3 1 8 6 13 15 11 9 19 3 9 9 15 19 1 13 8 -2
7467bJ3j7KmLJKLpLrNJ0j5LnPnR%%oRLjNKKoMLk%kKlNJ4j9LnmoNlJKrMMjJpJ0
$$ -2 11 -6 -4 -8 -5 -4 -2 1 -6 -3 -12 -7 3 -12 -9 -14 -7 -12 -3 -3 -3 -9 0 3 2 7 9 11 5 9 12 10 10 8 10 7 12 26 7 10 5 1 -5 0 -3 -2 0 -9 -5 -1 -2 -1 -8 2
7521BpOpNn%OKNj3JJ4lRj1LlkJ5j4kJ4kLroJjJ2rpMmjjoLJ4rJoKNj0KLPk%JLr
$$ 2 -5 1 -6 -1 -6 -6 0 2 7 -6 -5 9 6 15 4 7 4 2 17 3 1 15 13 16 7 1 2 1 13 4 -3 1 -3 -4 -5 -11 -8 6 -3 -2 -8 -6 -1 -11 -9 -6 1 -1 -1 0 3 -6
7573fJ5oRqNjLN%j4PPj1J1Nj4kKp%KNojKnN%oJNpjLJJlMnLKRomJ4j2NMnKMkLJ
$$ -6 9 3 12 4 9 8 11 16 16 2 9 16 5 16 21 7 5 7 0 0 2 7 1 0 2 -3 2 2 -4 -3 2 -5 -6 -3 -2 -1 -4 0 -5 -2 0 9 3 -1 13 1 6 10 5 7 11 9 12 13
7627A3jKqj0OQrNloLQkqpLj0P%Lj1jJ2LjkMLj1K0%mKjJ0j0MOj7PRlrlQLj0NqK
$$ 13 12 14 6 -4 2 10 1 6 3 -3 0 8 6 -2 -9 -6 -16 -9 -9 -6 -17 -18 -6 -3 -4 -6 -2 1 -10 10 10 6 8 7 17 7 11 17 0 7 16 13 4 1 9 12 2 7 -1 1
7677AqOkNj1LQj9J1%jMoJ2qLNj6J5o%RLnmOJ0j1JLMLmnJ0noklpJ4rlJ0j0jmOj4
$$ 1 -7 -1 -3 2 -9 -6 2 -17 -6 -6 -7 -3 -9 3 -5 -2 3 -13 2 -4 -4 5 8 3 -1 5 15 4 5 8 12 15 11 6 16 11 5 3 0 -7 7 -2 -5 5 -5 -6 -10 -4 -18
7726a8LLKlJ2j1PLj3J2%N%OrJ3oQqMrJ4Nj5LNLopPj6J3lkKmjQnrjlQjj2J6j0K
$$ -18 -15 -12 -10 -13 -1 -12 -5 -2 -15 -3 -3 2 2 8 -1 12 6 14 6 10 1 15 20 5 8 13 16 10 3 10 -6 7 4 2 4 0 -1 7 2 -7 -8 -11 -3 -4 -16 0 -10 -8
7774h%oPPJJNj3J1j6PJ1j3J2mmJ0OpknJO%kj7J5j1J0knKnlJoRpJ5jj0lOJkKOj
$$ -8 -8 -14 -7 0 1 2 7 -6 5 -11 -4 7 -6 6 2 -2 8 14 7 5 0 1 7 7 5 -12 3 -8 2 0 -5 -3 -8 -11 -10 -16 -7 -14 1 0 -10 -13 -7 -6 -8 -6 0 -1
7822aLLoJ7r%nNLrPJ4j9KL%%%nj0J2J3k3KJkNJj0Nj0MOMrMKokPLP%nKPpkQp%K
$$ -1 2 5 -1 16 7 7 2 7 10 1 8 22 3 5 8 8 8 8 3 -7 5 18 -5 -3 -2 -4 1 2 -8 -3 -13 -9 -3 1 -8 -4 -2 -8 -10 -3 0 7 7 2 4 11 4 2 10 3 3 5
7874EPplKJ4j2kKmLpRk3LNMjp%Oj3RPqJ1oJPNqOqNPLmOKlKkpJ1qn%J5j2JkqO%
$$ 5 12 5 2 4 18 6 4 6 2 5 -2 7 -16 -13 -8 -4 -5 -12 -12 -6 -19 -10 -3 -11 0 -6 -5 2 7 -1 5 -3 2 9 12 8 14 16 13 15 13 6 17 9 4 4 19 7 8 6 -2 4 4
7927Djn%Ll%qKMlJ1Mj1%n%%MRJmKMKKjpJ1j1JRj6NKOoqKpKJ0Qkj5KmjMqLkNlJ
$$ 4 3 -2 -2 1 -2 -2 -10 -8 -4 -7 4 8 -3 -3 -8 -8 -8 -4 5 6 2 4 8 10 12 11 4 15 4 5 14 -2 3 5 11 5 -3 -1 -8 -6 4 12 10 -5 -3 -7 -8 -4 -12 -9 -11 -6 -9 -8
7981hPqKOj0PNqJJ0j1QQnmLMJ2ppL%jK%KmmonJ1lpLj1PQoOqmQllJ2Kj3QR%rLJ4
$$ -8 -1 -9 -7 -1 -11 -4 1 -7 -6 4 -7 1 9 4 0 3 7 19 12 5 8 8 7 9 9 11 7 3 -3 -8 3 0 -7 -4 -15 -8 0 -6 0 -8 -12 -4 -7 -10 2 4 -9 -1 8 8 -1 2 16
8034A6qoJ1qJNpPOj3%j0MMqJ2kJMq%j2KPqMkklmKRoLONj0JoJ0kJ0%KlK%QkpOK
$$ 16 8 2 13 5 6 11 4 11 17 4 4 -6 -2 2 -6 6 4 5 9 1 1 -11 -9 -2 -10 -6 -8 -10 -13 -17 -15 -6 -12 -9 -3 2 -8 -7 -13 -3 -5 5 5 7 4 6 6 14 12 5 11 13
8086A3j4MQlRj2Oj7MmqPkNLrJJ1lnkKONpOoJlKlNPMrPpRMpqRKJrKjoQnlMnNPk4
$$ 13 -1 3 11 8 17 5 11 -6 -2 -6 -14 -7 -9 -4 -1 -10 -9 2 -1 -6 -8 -6 0 5 -2 4 -2 -1 -4 -2 -5 0 7 11 2 9 2 11 15 8 0 9 11 12 3 5 4 -2 6 1 -2 2 -3 2 9 -15
8142a5N%LPpNrJ0pPrNKmLJ5omPkkOlMpLnRjklmnLj4QQrJ1oojMj1LJK%K
$$ -15 -10 -10 -7 0 -7 -2 -11 -1 -8 -1 -10 -5 -3 -7 -4 11 5 1 8 6 4 10 7 11 4 7 2 11 10 8 5 1 -4 -1 -15 -7 1 -8 3 -3 -9 -10 -6 -17 -14 -13 -11 -11 -9
8191i
##END NTUPLES=NMR FID
##END=
