##TITLE=1H_ES-amide[2]-2
 aceton-d6
 8 sc, 
 9.8.2023
##JCAMPDX= 6.0         $$ Bruker NMR JCAMP-DX V2.0
##DATA TYPE= NMR FID
##DATA CLASS= NTUPLES
##ORIGIN= UXNMR, Bruker Analytische Messtechnik GmbH
##OWNER= root
$$ XWIN-NMR		Version 3.5
$$ Wed Aug  9 15:13:52 2023 Russian Standard Time (UT+4h)  she@DPX200
##.OBSERVE FREQUENCY= 200.13135
##.OBSERVE NUCLEUS= ^1H
##.DELAY= (6, 6)
##.ACQUISITION MODE= SIMULTANEOUS
##.ACQUISITION SCHEME= undefined
##.AVERAGES= 8
##.DIGITISER RES= 18
##SPECTROMETER/DATA SYSTEM= spect
##.PULSE SEQUENCE= zg30
##.SOLVENT NAME= Acetone
##.SHIFT REFERENCE= (INTERNAL, Acetone, 0, 15.7039)
##AUDIT TRAIL= $$ (NUMBER, WHEN, WHO, WHERE, WHAT)
$$ ##TITLE= Audit trail, XWIN-NMR		Version 3.5
$$ ##JCAMPDX= 5.01
$$ ##ORIGIN= Bruker BioSpin GmbH
$$ ##OWNER= she
$$ F:/spectra/data/she/nmr/H-F/1/audita.txt
$$ ##AUDIT TRAIL=  $$ (NUMBER, WHEN, WHO, WHERE, WHAT)
(   1,<2023-08-09 15:12:27.29 +0400>,<she>,<DPX200>,
      <created by zg, POWCHK disabled, PULCHK disabled
       configuration hash MD5:
       00 E9 B6 7A A2 85 ED C7 34 08 36 98 17 FE 4E 26
       data hash MD5: 16K
       37 AD F1 A5 90 0D 25 1E FA 6C 1E 90 23 24 FD 31>)
$$ ##END=
$$ 
$$ hash MD5
$$ 08 67 AF BA D0 69 CA FE 25 B9 76 FC 49 78 26 23
##$RELAX= 
##$RELAX= 
##$RELAX= 
##$RELAX= 
##$RELAX= 
##$RELAX= 
$$ Bruker specific parameters
$$ --------------------------
##$DU= <F:/spectra>
##$EXPNO= 1
##$NAME= <H-F>
##$PROCNO= 1
##$TYPE= <nmr>
##$USER= <she>
##$AMP= (0..31)
100 100 100 100 100 100 100 100 100 100 100 100 100 100 100 100 100 100 
100 100 100 100 100 100 100 100 100 100 100 100 100 100 
##$AQSEQ= 0
##$AQ_mod= 1
##$AUNM= <au_zg>
##$AUTOPOS= <>
##$BF1= 200.13
##$BF2= 200.13
##$BF3= 200.13
##$BF4= 200.13
##$BF5= 200.13
##$BF6= 200.13
##$BF7= 200.13
##$BF8= 200.13
##$BYTORDA= 1
##$CFDGTYP= 0
##$CFRGTYP= 5
##$CHEMSTR= <none>
##$CNST= (0..31)
1 1 145 1 1 1 1 1 1 1 1 1 1 1 1 1 1 1 1 1 1 1 1 1 1 1 1 1 1 1 1 1 
##$CPDPRG= <>
##$CPDPRG1= <>
##$CPDPRG2= <>
##$CPDPRG3= <>
##$CPDPRG4= <mlev>
##$CPDPRG5= <mlev>
##$CPDPRG6= <mlev>
##$CPDPRG7= <mlev>
##$CPDPRG8= <mlev>
##$CPDPRGB= <>
##$CPDPRGT= <>
##$D= (0..31)
0 1.2 0 0 0 0 0 0 0 0.06 0 0.03 0 0 0 0 0.0002 0 0 0 0 0 0 0 0 0 0 0 0 
0 0 0 
##$DATE= 1691579546
##$DBL= (0..7)
120 120 120 120 120 120 120 120 
##$DBP= (0..7)
150 150 150 150 150 150 150 150 
##$DBP07= 0
##$DBPNAM0= <>
##$DBPNAM1= <>
##$DBPNAM2= <>
##$DBPNAM3= <>
##$DBPNAM4= <>
##$DBPNAM5= <>
##$DBPNAM6= <>
##$DBPNAM7= <>
##$DBPOAL= (0..7)
0.5 0.5 0.5 0.5 0.5 0.5 0.5 0.5 
##$DBPOFFS= (0..7)
0 0 0 0 0 0 0 0 
##$DE= 6
##$DECBNUC= <off>
##$DECIM= 32
##$DECNUC= <off>
##$DECSTAT= 4
##$DIGMOD= 1
##$DIGTYP= 9
##$DL= (0..7)
0 120 120 120 120 120 120 120 
##$DP= (0..7)
150 150 150 150 150 150 150 150 
##$DP07= 0
##$DPNAME0= <>
##$DPNAME1= <>
##$DPNAME2= <>
##$DPNAME3= <>
##$DPNAME4= <>
##$DPNAME5= <>
##$DPNAME6= <>
##$DPNAME7= <>
##$DPOAL= (0..7)
0.5 0.5 0.5 0.5 0.5 0.5 0.5 0.5 
##$DPOFFS= (0..7)
0 0 0 0 0 0 0 0 
##$DQDMODE= 0
##$DR= 18
##$DS= 0
$$ [...]
##$SUBNAM2= <"">
##$SUBNAM3= <"">
##$SUBNAM4= <"">
##$SUBNAM5= <"">
##$SUBNAM6= <"">
##$SUBNAM7= <"">
##$SUBNAM8= <"">
##$SUBNAM9= <"">
##$SW= 18.05172834244
##$SWIBOX= (0..15)
0 0 2 0 0 0 0 0 0 0 0 0 0 0 0 0 
##$SW_h= 3612.71676300578
##$TD= 16384
##$TD0= 1
##$TE= 0
##$TE2= 300
##$TE3= 300
##$TEG= 300
##$TL= (0..7)
0 120 120 120 120 120 120 120 
##$TP= (0..7)
150 150 150 150 150 150 150 150 
##$TP07= 0
##$TPNAME0= <>
##$TPNAME1= <>
##$TPNAME2= <>
##$TPNAME3= <>
##$TPNAME4= <>
##$TPNAME5= <>
##$TPNAME6= <>
##$TPNAME7= <>
##$TPOAL= (0..7)
0.5 0.5 0.5 0.5 0.5 0.5 0.5 0.5 
##$TPOFFS= (0..7)
0 0 0 0 0 0 0 0 
##$TUNHIN= 0
##$TUNHOUT= 0
##$TUNXOUT= 0
##$USERA1= <user>
##$USERA2= <user>
##$USERA3= <user>
##$USERA4= <user>
##$USERA5= <user>
##$V9= 5
##$VALIST= <valist>
##$VCLIST= <CCCCCCCCCCCCCCC>
##$VD= 0
##$VDLIST= <DDDDDDDDDDDDDDD>
##$VPLIST= <PPPPPPPPPPPPPPP>
##$VTLIST= <TTTTTTTTTTTTTTT>
##$WBST= 1024
##$WBSW= 4
##$XGAIN= (0..3)
0 0 0 0 
##$XL= 0
##$YL= 0
##$YMAX_a= 90344
##$YMIN_a= -55214
##$ZGOPTNS= <>
##$ZL1= 120
##$ZL2= 120
##$ZL3= 120
##$ZL4= 120
##$ABSF1= 10
##$ABSF2= 0
##$ABSG= 5
##$ABSL= 3
##$ALPHA= 0
##$AQORDER= 0
##$ASSFAC= 0
##$ASSFACI= 0
##$ASSFACX= 0
##$ASSWID= 0
##$AUNMP= <proc_1d>
##$AZFE= 0.1
##$AZFW= 0.1
##$BCFW= 1
##$BC_mod= 2
##$BYTORDP= 1
##$COROFFS= 0
##$CY= 11.3945322036743
##$DATMOD= 1
##$DC= 2
##$DFILT= <>
##$DTYPP= 0
##$F1P= 15.7292609196834
##$F2P= 12.9074282941183
##$FCOR= 0.5
##$FTSIZE= 0
##$FT_mod= 4
##$GAMMA= 1
##$GB= 0.15
##$INTBC= 1
##$INTSCL= 1
##$ISEN= 128
##$LB= 0.24
##$LEV0= 0
##$LPBIN= 0
##$MAXI= 10000
##$MC2= 0
##$MEAN= 0
##$ME_mod= 0
##$MI= 1.114404
##$NCOEF= 0
##$NC_proc= 0
##$NLEV= 6
##$NOISF1= 3.799351
##$NOISF2= 2.8
##$NSP= 1
##$NTH_PI= 0
##$NZP= 0
##$OFFSET= 15.70392
##$PC= 1
##$PHC0= -21202.44
##$PHC1= 8.252722
##$PH_mod= 1
##$PKNL= yes
##$PPARMOD= 0
##$PSCAL= 0
##$PSIGN= 0
##$REVERSE= no
##$SF= 200.130013532006
##$SI= 16384
##$SIGF1= 3
##$SIGF2= 2
##$SINO= 400
##$SIOLD= 16384
##$SREGLST= <1H.CDCl3>
##$SSB= 0
##$STSI= 0
##$STSR= 0
##$SW_p= 3612.71676300578
##$SYMM= 0
##$S_DEV= 0
##$TDeff= 0
##$TDoff= 0
##$TI= <>
##$TILT= no
##$TM1= 0
##$TM2= 0
##$TOPLEV= 0
##$USERP1= <user>
##$USERP2= <user>
##$USERP3= <user>
##$USERP4= <user>
##$USERP5= <user>
##$WDW= 1
##$XDIM= 8192
##$YMAX_p= 0
##$YMIN_p= 0
$$ End of Bruker specific parameters
$$ ---------------------------------
##NTUPLES= NMR FID
##VAR_NAME=  TIME,          FID/REAL,        FID/IMAG
##SYMBOL=    X,             R,               I
##VAR_TYPE=  INDEPENDENT,   DEPENDENT,       DEPENDENT
##VAR_FORM=  AFFN,          ASDF,            ASDF
##VAR_DIM=   8192,          8192,            8192
##UNITS=     SECONDS,       ARBITRARY UNITS, ARBITRARY UNITS
##FACTOR=    0.0002768,     1,               1
##FIRST=     0,             0,               0
##LAST=      2.2672688,     0,               0
##MIN=       0,             -55214,          0
##MAX=       2.2672688,     90344,           0
$$ Real data points
##PAGE= N=1
##DATA TABLE= (X++(R..R)), XYDATA
$$ plain form
0 0 0 0 0 0 0 0 0 0 0 0 0 0 0 0 0 1 -8 8 -8 8 -8 10 -16 16 -17 24 -25 32 -33 40 -47 50 -58 66 -74 83 -96 106
38 106 -118 131 -147 163 -180 200 -220 244 -269 297 -326 358 -396 436 -481 532 -588 653 -725
57 -725 809 -906 1021 -1163 1335 -1557 1850 -2257 2859 -3849 5749 -10675 50028 90344 -55214
72 -55214 -44387 20309 -6773 -29607 11545 669 -31554 -32628 -5340 24633 17133 -29725 -9781
85 -9781 49641 23393 -38561 -6154 46067 15975 -25472 61 14957 -25888 -26052 39205 35456
98 35456 -42850 -46186 21353 31150 -2360 -9017 -4579 -7499 -9076 -4312 18582 18227 -31998 -32228
112 -32228 38205 31705 -37177 -10874 49241 12442 -29031 3450 19077 -7654 -6914 13838 2641
125 2641 -32559 -36445 10173 38701 -5000 -45445 -11218 28841 12595 -2217 18088 14446 -20081
$$ packed form
0@%%%%%%%%%%%%%%%JrJ6j6J6j6J8k6L2l3M1m9N7o5P3q7R7j08J24j40J57j79K02
38A06k24K49k78L10l43L80m20M64n13N66o23O84p54Q32r17J013j120J241j378
57g25J534j715J927k184K498k892L407m107N116o708R598j6424O0703M0316j45558
72e5214J0827O4696k7082k2834M1152j0876l2223j074K7288K9973p500m6858J9944
85i781N9422k6248o1954L2407N2221l0092m1447K5533J4896m0845j64O5257l749
98C5456p8306l336O7539R797l3510o657M438k920j577M764K2894l55n0225k30
112c2228P0433o500o8882K6303O0115l6799m1473L2481J5627k6731P40K0752j1197
125B641l5200l886M6618K8528m3701m0445L4227M0059j6246j4812K0305l642l4527
$$ plain form
138 -20081 -9308 38243 23943 -33296 -21884 25841 5198 -34503 -11865 16089 380 -13235
150 -13235 -4993 1365 -1308 -3898 11257 28531 -1936 -39451 -1493 46133 11259 -27332 -2371
163 -2371 8510 -14879 -1315 27471 5701 -29361 -16145 18403 17005 -12716 -17707 7615 12139
176 12139 -12110 -14944 8658 10399 -7786 -638 16212 -4227 -24574 10835 41993 2711 -35285
189 -35285 -7191 20388 4803 -3852 3009 -8294 -19981 -5654 14720 12756 -11736 -22361 5247
202 5247 23230 -3895 -16007 14196 18480 -11006 -8131 13265 1173 -12104 8381 17081 -11320
215 -11320 -27150 -2045 22361 10356 -14182 -15213 -779 3756 2832 9617 7776 -13606 -18731
228 -18731 12005 26809 -3714 -20390 5476 14701 -7806 -8357 9596 3287 -8759 492 5209
$$ packed form
138b0081J0773M7551j4300n7239J1412M7725k0643l9701K2638K7954j5709j3615
150a3235Q242O358k673k590J5155J7274l0467l7515L7958M7626l4874l8591K4961
163b371J0881k3389J3564K8786k1770l5062J3216L4548j398k9721m991K5322M524
176A2139k4249k834K3602J741j8185P148J6850k0439k0347L5409L1158l9282l7996
189c5285K8094K7579j5585q655O861j1303j1687J4327K0374j964k4492j0625K7608
202E247J7983k7125j2112L0203M284k9486K875K1396j2092j3277K0485Q700k8401
215a1320j5830K5105K4406j2005k4538j031J4434M535r24O785j841k1382n125
228a8731L0736J4804l0523j6676K5866R225k2507n51J7953o309j2046R251M717
$$ plain form
241 5209 -7668 -11751 3259 16779 5680 -19651 -17521 13258 20213 -1990 -6903 1444 -6910
254 -6910 -6471 17247 17690 -13338 -20626 4935 14639 -1078 -8378 35 3168 -2738 -4303 1162 2828
269 2828 -1997 -837 7271 1735 -14905 -7385 19243 16054 -12422 -15126 3300 5576 2454 9165
283 9165 2524 -15975 -11818 10043 15068 -528 -13051 -7796 5610 5947 -4033 -2117 5462 -925
297 -925 -5404 4767 4586 -8085 -1293 15432 5150 -16214 -10601 9050 11546 1418 -5793 -8717
311 -8717 -6317 2861 10665 7393 -6061 -14934 -3608 14365 10231 -7462 -6850 4212 1245 -3358
325 -3358 3639 3605 -5411 -1756 6553 -915 -9926 -2097 9403 7698 -3764 -11437 -5363 7591 9766
340 9766 1826 -3463 -7143 -7978 4655 16363 3544 -14810 -8522 6408 5858 157 -38 -2109 -3956
$$ packed form
241E209j2877m083J5010J3520j1099k5331K130L0779O955k2203m913Q347q354
254f910M39K3718M43l1028p288K5561R704j5717p300Q413L133n906j565N465J666
269B828m825J160Q108n536j6640P520K6628l189k8476k704J8426K276l122O711
283I165o641j8499M157K1861N025j5596j2523N255J3406L37r980J916P579o387
297i25m479J0171j81j2671O792J6725j0282k1364N613J9651K496j0128p211k924
311h717K400R178P804l272j3454q873J1326J7973m134j7693O12J1062k967m603
325c358O997l4r016L655Q309p468r011P829J1500j705j1462p673O074J2954K175
340I766p940n289l680q35J2633J1708j2819j8354O288J4930n50n701j95k071j847
$$ plain form
355 -3956 813 3757 -224 -2687 399 4201 3059 -4811 -8958 1669 12584 4442 -8889 -8073 -1250
370 -1250 2803 8491 7360 -7244 -14233 -327 12205 7345 -2852 -6954 -4589 2212 5534 1092
384 1092 -2505 -1459 -959 352 2488 -1643 -4358 4341 8681 -2543 -9912 -2117 5801 6032 3004
399 3004 -4293 -10785 -4457 7952 9701 494 -8342 -8649 1234 10598 6600 -3855 -5123 -318 1516
414 1516 2633 2588 -2686 -4550 1770 2829 -4894 -5878 2087 5765 2907 -2281 -6868 -3518 7448 10628
430 10628 1641 -6463 -7430 -1961 7965 9832 -2530 -11528 -5219 3462 4571 2612 -1664 -5643 -1860
445 -1860 4410 2739 -1926 -878 2120 2059 67 -3277 -4186 2122 7898 2525 -6472 -6899 -637 5823
461 5823 8636 2031 -9238 -9000 2665 8562 3988 -2870 -7639 -5870 3222 6904 268 -3885 -948
$$ packed form
355c956M769K944l981k463L086L802j142p870m147J0627J0915q142j3331Q16O823
370a250M053N688j131j4604o989J3906J2532m860j0197m102K365O801L322m442
384A092l597J046N00J311K136m131k715Q699M340j1224p369P795P918K31l028
399C004p297o492O328J2409J749r207q836l07R883R364l998j0455j268M805J834
414A516J117m5n274j864O320J059p723r84P965L678k858n188m587L350J0966L180
430A0628q987q104r67N469R926J867j2362q998O309Q681J109j959m276l979L783
445a860O270j671m665J048K998o1j992l344r09O308N776n373q997m27O262O460
461E823K813o605j1269K38J1665N897m574o858m769J769R092L682o636m153K937
$$ plain form
476 -948 1257 2011 2348 -652 -1132 4135 4575 -3055 -6517 -2027 3208 5120 1129 -7664 -9773 -78
492 -78 8671 6186 -1754 -6776 -5174 3161 10064 5469 -4346 -5715 -33 3226 2854 415 -3355 -2883
508 -2883 1533 945 -3545 -2423 1960 3121 1963 -2042 -6532 -2108 7751 7538 -1712 -6871 -5292 767
524 767 8132 7014 -3531 -8911 -2947 4551 6180 2279 -4028 -5662 1 3926 765 -2531 -1254
539 -1254 463 659 -123 -2334 -2732 2674 6949 1722 -5746 -4844 1692 6731 6344 -1234 -8860 -5680
555 -5680 3753 6740 2515 -3679 -7939 -3922 5239 5949 -1199 -3661 -830 735 1934 1950 -763 -844
571 -844 2788 2341 -2458 -4075 -682 3608 4701 -312 -7289 -6248 2560 7481 3440 -3406 -6604 -3921
587 -3921 3804 8371 2657 -5765 -5259 1098 4132 3078 -277 -3233 -1371 2182 738 -2178 -788
$$ packed form
476i48K205P54L37l000m80N267M40p630l462M490N235J912l991q793k109R695
492g8Q749k485p940n022J602Q335O903m595r815j369N682L259l72k439l770M72
508b883M416n88m490J122M383J161j158m005m490M424R859k13r250n159J579O059
524G67P365j118j0545n380N964P498J629l901o307j634N663L925l161l296J277
539a254J717J96p82k211l98N406M275n227p468R02O536N039l87p578p626L180
555e680R433K987m225o194m260M017R161P10p148k462K831J565J199J6k713q1
571h44L632m47m799j617L393M290J093n013o977J041Q808M921m041o846l198K683
587c921P725M567n714q422N06O357L034j054l355k956J862L553j444k916J390
$$ plain form
602 -788 1166 1641 1276 -2577 -5888 -304 7235 4569 -3355 -6175 -3134 2831 7368 4069 -4372 -7163
618 -7163 -1635 4971 5958 584 -5369 -4559 1485 3709 341 -1727 -764 -72 356 637 -1269 -2017 2468
635 2468 5163 -118 -5689 -3410 2605 5988 3613 -3518 -7495 -2578 4445 5795 1835 -4476 -7280
650 -7280 -881 6969 4602 -2494 -3666 -691 1092 1956 1279 -1134 -1125 1266 1222 -1694 -3041 -409 3670
667 3670 3777 -1881 -6667 -3021 4412 5938 1134 -3587 -5272 -2354 4725 7532 329 -6738 -3838
682 -3838 2563 4243 1892 -1360 -2783 -753 1380 499 -889 -1005 -273 1477 1322 -3311 -4700 2008
698 2008 6837 2188 -3971 -4245 -680 3843 6222 2307 -5143 -6500 -166 5735 4336 -2322 -6144
713 -6144 -3024 2136 2677 110 -953 -830 -542 1285 1986 -958 -1522 3030 4053 -1624 -5116 -1516
$$ packed form
602g88J954M75l65l853l311N584P539k666p924k820L041N965M537l299q441k791
618g163N528O606R87n374n953Q10O044K224l368k068R63O92M28K81j906p48M485
635B468K695n281n571K279O015L383k375p131l977M917P023J350l960o311k804
650g280O399P850k367p096j172K975J783Q64o77k413RK391m4k916j347K632M079
667C670J07n658m786L646P433J526m804m721j685K918P079K807p203p067K900
682c838O401J680k351l252j423K030K133q81j388j16P32J750j55m633j389O708
698B008M829m649o159k74L565M523K379l915p450j357O334N901j399o658l822
713f144L120N160N41k567j063J23K88J827P01k944n64M552J023n677l492L600
$$ plain form
729 -1516 3303 4160 870 -4157 -5531 -1073 4332 5178 473 -5819 -5766 2037 6734 2012 -3358 -2815
745 -2815 -554 816 2289 1649 -1431 -1483 1746 2038 -1270 -2385 927 3927 1708 -3562 -5251 -966
761 -966 3496 3216 -305 -3974 -5271 -915 6355 6181 -1856 -5687 -903 3935 4004 1743 -1118 -2858
777 -2858 -1200 1255 964 -1267 -2362 -804 1380 -8 -3735 -2471 3445 4805 149 -3063 -2329 131
793 131 3937 5447 483 -6081 -4999 2232 5814 2206 -3508 -4787 -1349 2395 2606 494 -1550 -2347
809 -2347 -555 2135 1049 -2291 -1091 3051 1965 -2632 -3023 773 3333 3357 801 -3142 -3894 561
825 561 5101 4004 -2128 -6570 -3730 2925 4357 -135 -3418 -2905 -923 1685 3329 1015 -2088 -393
841 -393 2822 1728 -1384 -1046 1816 2575 0 -3263 -3561 -224 2907 2507 -1036 -4701 -4358 1478 6294
$$ packed form
729a516M819Q57l290n027j374M458N405Q46m705o292N3P803M697m722n370N43
745b815K261J370J473o40l080n2L229K92l308j115L312L000k219n270j689M285
761i66M462k80l521l669j297M356P270j74q037l831M784M838O9k261k861j740
777b858J658K455k91k231j095J558K184j388l727J264N916J360m656l212P34K460
793A31L806J510m964o564J082P231L582l608n714j279L438L744K11k112k044p97
809b347J792K690j086l340J200M142j086m597l91L796K560K4k556l943p52M455
825E61M540j097o132m442K840O655J432m492l283N13J982K608J644k314l103J695
841c93L215j094l112L38K862P59k575l263k98L337L131m00l543l665L43N836M816
$$ plain form
858 6294 3099 -3669 -4491 19 3336 3489 1385 -1997 -3042 14 2764 1357 -1334 -1576 293 1190
874 1190 -783 -2769 -915 2439 2109 -1029 -2882 -2497 215 4114 4080 -1538 -5437 -1928 3975 5043
890 5043 1193 -2914 -3605 -454 2958 2648 -454 -2825 -2387 250 1805 -246 -2106 -288 2044 404
906 404 -2058 -1492 916 2623 2729 -11 -3487 -2652 2250 5002 2250 -2914 -5010 -1569 3411 3567
922 3567 -518 -3479 -3137 -568 2285 2389 -897 -2620 -228 2017 909 -730 -35 1607 1897 345
938 345 -1978 -2061 836 3185 1801 -2096 -4595 -2715 2391 4620 676 -4196 -3873 319 3412 3269
954 3269 268 -2909 -2131 1518 2938 919 -1172 -1081 388 999 -358 -1789 -362 1882 1363 -1245
970 -1245 -2862 -1904 1128 3707 1873 -2947 -4536 -608 3801 3916 274 -3271 -2978 942 3848 2429
$$ packed form
858F294l195o768q22M510L317J53k104l382j045L056K750j407k691k42J869Q97
874A190j973j986J854L354l30l138j853L85K712L899l4n618l899L509N903J068
890E043l850m107o91L151L412l10l102k371M38K637J555k051j860J818K332j640
906D04k462N66K408J707J06k740l476Q35M902K752k752n164k096L441M980J56
922C567m085k961L42K569K853J04l286j723K392K245j108j639O95J642K90j552
938C45k323q3K897K349j384l897k499J880N106K229l944m872L23M192L093j43
954C269l001l177P78L649J420k019k091R1J469O11j357j431J427K244n19k608
970a245j617R58L032K579j834m820j589L928M409J15l642l545K93L920K906j419
$$ plain form
986 2429 -952 -2465 -1263 1033 1694 -293 -1910 -550 905 -224 -1859 -1421 573 2228 1791 -1178
1002 -1178 -3212 -891 3225 4193 1082 -3002 -3728 175 4049 3021 -1413 -3874 -2425 590 2405
1017 2405 1227 -1784 -2534 -220 1435 600 -582 -221 1009 1433 158 -1572 -984 1814 3008 958
1033 958 -2194 -3266 -987 2875 3564 -675 -4517 -3313 827 3233 2077 -1304 -3310 -1327 1987
1048 1987 2694 804 -975 -919 611 1360 50 -1221 36 1687 671 -1573 -2420 -975 1608 2798
1064 2798 461 -3374 -3524 334 3721 2823 -1019 -3713 -2201 1900 3637 1507 -1387 -2140 -497 1847
1080 1847 2195 -69 -1502 -322 873 -188 -1556 -1249 230 1234 275 -2203 -2866 -243 2943 3154
1096 3154 297 -2807 -2358 1776 4698 2526 -1785 -3291 -1343 1424 2271 232 -2583 -2739 -385 1144
$$ packed form
986B429l381j513J202K296O61j987j617J360J455j129j635M38J994J655m37k969
1002a178k034K321M116R68l111m084p26L903L874j028m434k461J449L015J815
1017B405j178l011p50K314J655q35j182L61J230M24j275j730N88K798J194k050
1033I58l152j072K279L862O89m239l842J204M140K406j156l381k006J983L314
1048A987P07j890j779N6J530P49j310j271J257J651j016k244q47J445K583J190
1064B798k337l835j50L858L387q98l842k694J512M101J737k130k894p53J643K344
1080A847L48k264j433J180J195j061j368L07J479J004r59k478o63K623L186K11
1096C154k857l104M49M134K922k172m311j506J948K767Q47k039k815j56K354J529
$$ plain form
1112 1144 410 -844 -525 794 1326 23 -1248 -100 2129 2296 88 -2217 -2511 -61 3110 2649
1128 2649 -1523 -4093 -1909 1916 3373 1296 -2042 -3023 -692 1981 1984 -134 -1842 -1502 409 1332
1144 1332 50 -911 524 1891 775 -959 -1093 462 2100 2171 -548 -3407 -2878 613 2863 1221
1160 1221 -2527 -4073 -1294 2571 3170 705 -1357 -1408 446 2554 2389 -103 -1553 -158 842 -305
1176 -305 -1539 -1029 302 761 -475 -2096 -1759 474 2551 2244 -485 -2992 -1713 2428 3950 1001
1192 1001 -2585 -2700 -245 1971 2311 244 -2213 -2091 507 1884 647 -1025 -858 458 517 -899
1208 -899 -1507 -44 1422 960 -589 -1687 -1465 907 3517 2440 -1678 -3294 -344 2894 2832 28
1224 28 -2546 -2700 -479 1630 1485 -694 -2566 -1520 1022 1527 -274 -733 874 1446 122 -673 -234
$$ packed form
1112A144p34j254L19J319N32j303j271J148K229J67k208k305k94K450L171m61
1128B649m172k570K184L825J457k077l338r81K331K673Lk118j708L40J911R23
1144A332j282r61J435J367j116j734j34J555J638P1k719k859N29L491K250j642
1160A221l748j546K779L865N99k465k062n1J854K108j65k492j450J395J000j147
1176c05j234N10J331M59j236j621L37K233K077l07k729k507J279M141J522k949
1192A001l586j15K455K216L40k067k457J22K598J377j237j672J67J316N9j416
1208h99o08J463J466m62j549j098K22K372K610j077m118j616K950L238o2k804
1224B8k574j54K221K109j45k179j872J046K542N05j801m59J607N72j324p95M39
$$ plain form
1241 -234 647 1566 1486 -622 -2890 -1916 1648 3078 392 -3059 -3147 -4 2399 1931 -174 -2050 -2061 296
1259 296 2663 1848 -1178 -1599 560 1403 -46 -691 270 840 450 -394 -1262 -1267 208 1934 1279 -1790
1277 -1790 -3539 -1020 2826 2809 -439 -2403 -1656 359 2237 2541 187 -2458 -1606 1521 2189 20
1293 20 -1348 -462 405 -102 -858 -555 204 448 371 -350 -1701 -1603 1323 3359 941 -2764 -2360 1020 2807
1312 2807 1982 2 -1927 -2072 244 2676 1596 -1525 -2749 -619 1364 420 -976 -529 383 84
1328 84 -268 -47 -64 176 1540 1811 -790 -2614 -405 2861 2445 -758 -2652 -1804 264 1759 1617 -570
1346 -570 -2881 -2200 1162 2729 443 -1866 -877 791 551 39 404 395 77 368 403 -900 -1197 897
1364 897 2412 444 -2677 -2574 472 2344 1202 -927 -2081 -1918 190 2663 2207 -1288 -2879 -213
$$ packed form
1241b34Q81R19q0k108k268R74L564J430k686l451q8L143K403m68k105j876j1K357
1259B96K367q15l026m21K159Q43j449o45R61N70l90q44q68nJ475J726o55l069
1277a790j749K519L846j7l248j964P47K015J878L04k354k645Q52L127O68k169
1293B0j368Q86Q67n07p56L03P59K44p7p21j351R8K926K036k418l705M04L380J787
1312B807q25j980j929j45K316K432j080l121j224K130J983r44j396M47R12k99
1328H4l52K21j7K40J364K71k601j824K209L266m16l203j894Q48K068J495j42k187
1346e70k311O81L362J567k286k309R89J668k40n12L65rl18K91L5j303k97K094
1364H97J515j968l121J03L046J872j142k129j154J63K108K473m56l495j591K666
$$ plain form
1380 -213 2347 1523 -304 -480 -44 -89 126 384 -200 -620 270 826 -691 -2259 -875 2064 2050 -944
1398 -944 -2507 -1090 891 1978 1925 -8 -2379 -1755 1829 3278 648 -2032 -1525 416 826 159 -199
1415 -199 -520 -883 -357 365 -277 -1124 123 2025 833 -1881 -1713 1140 2567 1209 -561 -1610 -1578
1432 -1578 353 2547 1682 -1817 -3349 -823 2038 1657 -531 -1202 -588 -40 424 1064 300 -897 -151
1449 -151 1150 124 -1536 -592 1860 1576 -811 -1937 -765 852 1655 1343 -482 -2461 -1869 1404
1465 1404 2866 282 -2654 -1992 497 1245 652 320 -403 -927 209 1559 739 -860 -127 1377 502
1482 502 -1596 -1575 468 1406 286 -1136 -1576 -1196 420 2403 1970 -1341 -2850 -76 2789 1983 -476
1499 -476 -1339 -983 -382 686 1092 -261 -1667 -762 924 603 -889 -503 1350 1331 -587 -1438 -321 767
$$ packed form
1380b13K560q24j827j76M36m5K15K58n84m20Q90N56j517j568J384K939j4k994
1398i44j563J417J981J087n3j933k371O24L584J449k630k680N07J941M10o67l58
1415a99l21l63N26P22o42q47J247J902j192k714J68K853J427j358j770j049L2
1432a578J931K194q65l499j532K526K861l81k188o71O14N48M64O40p64j197P46
1449a51J301j026j660R44K452k84k387j126J172J617Q03l12j825j979N92L273
1465A404J462k584k936O62K489P48n93l32p23n24J136J350q20j599P33J504q75
1482E02k098K1K043R38j120j422m40L80J616J983m33l311j509K774K865q06k459
1499d76q63L56O01J068M06j353j406R05J686l21j492L86J853j9j918q51J117J088
$$ plain form
1517 767 974 782 -558 -2519 -1818 1587 2933 252 -2433 -1585 828 1798 1262 323 -980 -1356 44
1534 44 1429 684 -1343 -1192 515 574 -1029 -972 809 1326 322 -365 -584 -703 483 2152 1398 -1773
1552 -1773 -2991 -409 2228 1537 -842 -1694 -1074 13 1323 1763 205 -1736 -919 1353 1226 -767
1568 -767 -942 534 496 -945 -1064 -85 339 642 859 -96 -1672 -1035 1878 2941 248 -2421 -1637 785
1586 785 1522 772 -281 -1501 -2000 -91 2010 1075 -1388 -1284 756 1109 -192 -297 710 713 -109 -394
1604 -394 -416 -675 -65 1510 1152 -1601 -2675 -39 2539 1514 -894 -1502 -884 114 1383 1774 -212
1621 -212 -2325 -1121 1466 1550 -485 -979 218 526 -273 -282 415 313 40 415 94 -1429 -1342 1248 2263
1640 2263 -270 -2533 -1409 938 1520 935 11 -1333 -1574 473 2522 1362 -1479 -1743 369 1163
$$ packed form
1517G67K07j92j340j961P01L405J346k681k685Q48K413R70n36r39j303l76J400
1534D4J385p45k027J51J707N9j603N7J781N17j004o87k19j19J186J669p54l171
1552a773j218K582K637o91k379q52O20J087J310M40j558j941Q17K272j27j993
1568g67j75J476l8j441j19R79M24L03K17r55j576O37K913J063k693k669P84K422
1586G85P37p50j053j220m99J909K101r35k463J04K040L53j301j05J007Lq22k85
1604c94k2k59O10J575l58k753j074K636K578j025k408o08O18R98J269L91j986
1621b12k113J204K587Q4k035m94J197L08p99rO97j02k73L75l21j523Q7K590J015
1640B263k533k263J124K347N82n85r24j344k41K047K049j160k841k64K112P94
$$ plain form
1656 1163 -59 -500 129 5 -645 -180 208 -473 -341 1188 1184 -1231 -2108 300 2385 1266 -892 -1377
1674 -1377 -700 250 1377 1626 -310 -2467 -1326 1610 1858 -509 -1504 -309 249 -175 144 553 -95
1691 -95 -441 472 622 -792 -886 1137 1998 -137 -2169 -1129 992 1393 532 -393 -1381 -1615 363 2472
1709 2472 1279 -1774 -2000 438 1565 437 -260 -140 -347 -499 292 640 -327 -685 610 1032 -747
1726 -747 -1746 230 2019 921 -1142 -1366 -490 219 1204 1434 -523 -2501 -1131 1842 2120 -305 -1514
1743 -1514 -487 439 351 511 502 -405 -933 104 781 -510 -1100 468 1447 -223 -1771 -697 1150 1271
1761 1271 439 -211 -1069 -1242 557 2322 1020 -1879 -2240 221 1588 586 -502 -514 -584 -472 664
1778 664 1158 -156 -962 319 1126 -248 -1289 186 1561 475 -1104 -1094 -358 339 971 1099 -538
$$ packed form
1656A163j222m41O29j24o50M65L88o81J32J529mk415q77K408K085j119k158m85
1674a377O77R50J127K49j936k157J141K936K48k367r95J195N58m24L19M09o48
1691i5l46R13J50j414r4K023Q61k135k032J040K121M01q61r25r88k34J978K109
1709B472j193l053k26K438J127j128o97J20k07j52P91L48r67l58J295M22j779
1726g47r99J976J789j098k063k24Q76P09R85K30j957j978J370K973K78k425j209
1743a514J027R26q8J60rr07n28J037O77j291n90J568R79j670j548J074J847J21
1761A271q32o50q58j73J799J765j302k899l61K461J367j002j088j2p0J12J136
1778F64M94j314q06J281Q07j374j041J475J375j086j579J0P36O97O32J28j637
$$ plain form
1795 -538 -2190 -966 1873 2169 -292 -1719 -686 471 582 695 449 -819 -1189 266 1200 -76 -963
1812 -963 107 1030 -100 -1298 -479 910 872 94 -375 -855 -998 506 2097 911 -1805 -2030 521
1829 521 1890 840 -417 -679 -760 -250 938 1177 -418 -1391 -204 928 72 -1036 -158 973 328
1846 328 -821 -601 33 376 835 1018 -341 -1846 -672 1873 1989 -491 -1907 -917 362 767 691 16
1864 16 -1216 -1345 331 1476 340 -987 -274 888 331 -641 -48 844 555 -55 -262 -628 -789 377
1882 377 1639 504 -1837 -1918 446 1761 751 -638 -1008 -723 -31 1209 1293 -420 -1574 -267 1198
1899 1198 596 -629 -205 569 95 -517 -349 88 38 320 531 -458 -1657 -711 1442 1627 -495 -1770
1917 -1770 -661 774 1132 888 113 -1003 -1100 652 1793 418 -1190 -834 366 243 -506 -247 210
$$ packed form
1795e38j652J224K839K96k461j427J033J157J11J13k46j268l70J455R34j276q87
1812i63J070R23j130j198Q19J389l8p78m69m80j43J504J591j186k716k25K551
1829E21J369j050j257k62q1N10J188K39j595r73J187J132q56j108Q78J131o45
1846C28j149K20O34L43M59J83j359j505J174K545J16k480j416R90J279M05p6o75
1864A6j232j29J676J145j136j327P13J162n57r72N93Q92k89o10k07l66j61J166
1882C77J262j135k341q1K364J315j010j389l70K85O92J240Q4j713j154J307J465
1899A198o02j225M24P74m74o12J68M37n0K82K11r89j199R46K153J85k122j275
1917a770J109J435L58k44p75j116r7J752J141j375j608L56J200j23p49K59M57
$$ plain form
1934 210 -38 -377 -222 -255 -454 353 1436 644 -1329 -1387 708 1901 811 -599 -959 -723 56 1249
1952 1249 1034 -769 -1911 -569 1055 729 -582 -644 75 27 -222 117 426 188 230 725 124 -938 -357
1971 -357 1380 1443 -551 -1734 -789 532 852 434 -498 -1496 -1240 599 1701 510 -1276 -930 573
1988 573 917 228 10 209 -73 -255 195 90 -391 -39 825 375 -1237 -1365 324 1385 473 -852 -1205
2007 -1205 -671 290 1278 1030 -634 -1605 -330 1565 1353 -129 -646 -27 231 173 316 103 -462 -508 84
2026 84 -245 -975 -679 656 928 -497 -1289 -412 1022 1335 704 -99 -835 -587 877 1825 426 -1523
2044 -1523 -1373 133 683 72 -443 -532 -486 -252 342 416 -130 -133 645 631 -505 -809 439 1321 439 -759
2064 -759 -968 -416 438 1057 748 -802 -1681 -395 1244 1128 -445 -1247 -644 88 346 338 62 -499 -320
$$ packed form
1934B10k48l39J55l3j99Q07J083p92j973n8K095J193j090j410l60K36P79J193
1952A249k15j803j142J342J624l26j311o2P19m8k49L39L09k38M2M95o01j062N81
1971c57J737O3j994j183R45J321L20m18r32r98K56J839J102j191j786L46J503
1988E73L44o89k18J99k82j82M50j05m81L52Q64m50j612j28J689J061r12j325l53
2007a205N34R61R88k48j664r71J275J895k12j482n17O19K58n8J43k13n65m6N92
2026H4l29p30K96J335K72j425p92Q77J434L13o31q03p36K48J464R48j399j949
2044a523J50J506N50o11n15q9M6K34N94P4n46lP78j4j136l04J248Q82q82j198
2064g59k09N52Q54O19l09j550q79J286J639j16j573q02O03P32K58qk76n61J79
$$ plain form
2083 -320 417 666 -22 -169 725 1013 -112 -992 -377 591 674 10 -840 -1337 -864 497 1348 236 -1331
2102 -1331 -1258 512 1431 919 35 -343 -223 158 715 522 -333 -755 -52 194 -433 -821 -69 650 239 -681
2122 -681 -797 -116 670 994 531 -551 -1271 -160 1382 1319 -276 -1224 -629 444 829 515 -131 -623 -558
2141 -558 243 517 -138 -606 -112 327 -146 -745 -400 555 755 200 -437 -667 -139 919 1415 448 -1165
2160 -1165 -1186 256 1215 610 -622 -1150 -726 63 671 442 -344 -739 -37 645 431 -170 85 656 458
2179 458 -285 -557 -105 416 576 70 -747 -1185 -283 1044 1037 -312 -1333 -770 525 1072 579 -307 -800
2198 -800 -415 390 777 246 -442 -346 224 247 -268 -264 247 488 72 -528 -603 -260 585 821 58 -1044 -1070 197
2220 197 1261 777 -465 -1075 -428 562 913 513 -416 -816 -233 522 454 -198 -427 -45 139 -161 -461 -219
$$ packed form
2083c20P37K49o88j47Q94K88j125q80O15R68Q3o64q50m97M73J361Q51j112j567
2102a331P3J770R19n12q84l78J20L81N57j93q55m22P03K46o27l88P52P19m11r20
2122f81j16O81P86L24m63j082p20J111J542o3j595r48N95J073L85l14o46m92O5
2141e58Q01K74o55m68M94M39m73n99L45R55K00n55o37k30N28J058M96r67j613
2160a165k1J442R59o05j232n28M24P89O08k29p86l95P02O82k14o01K55N71j98
2179D58p43k72M52N21J60n06q17m38R02J327pj349j021N63J295N47m93q86m93
2198h00L85Q05L87n31o88R6N70K3n15MN11K41m16o00p5L43Q45K36p63j102k6J267
2220A97J064m84j242o10O47R90L51m00r29m00N83P55o8o52k29L82J84l00l00K42
$$ plain form
2240 -219 386 497 77 -473 -630 -6 957 994 -168 -1152 -681 574 1061 485 -625 -1022 -472 443 843
2259 843 203 -636 -643 71 437 175 -198 -92 304 113 -245 -390 -20 514 517 -42 -835 -822 217 1106 724
2280 724 -491 -1142 -504 626 971 341 -600 -898 -243 635 685 -54 -582 -232 215 203 -52 -132 196 298
2300 298 86 -357 -464 100 692 673 -255 -1000 -624 503 1113 422 -719 -1056 -239 670 874 165 -707 -756
2320 -756 43 637 310 -284 -314 -63 187 -28 -244 -64 295 403 -27 -552 -482 240 870 579 -482 -1061
2340 -1061 -404 697 944 244 -774 -861 -135 728 741 -28 -678 -418 200 489 142 -195 -181 161 63 -226
2360 -226 -335 76 468 341 -218 -778 -470 483 917 342 -645 -1018 -203 772 877 26 -776 -763 52 755
2380 755 535 -252 -556 -216 151 228 -45 -144 51 245 -21 -371 -382 257 653 365 -407 -850 -328 661 965
$$ packed form
2240b19O05J11m20n50j57O24R63L7j162r84M71J255M87n76j110l97N50R15M00
2259H43o40q39pP14L66k62l73J06L96j91l58j45L70N34Ln59p93J3J039Q89l82
2280G24j215o51O38J130L45o30r41k98O55Q78N0p39n28L50M47j2k55q0L28J02
2300B98k12m43j07N64N92j9r28p45L76J127O10o91j141l37Q17R09K04p09q72m9
2320g56P99N94l27n94l0K51K50k15k16J80L59J08m30n25P0P22O30k91j061n79
2340a061O57J101K47p00j018q7P26Q63J3p69o50K60O18K89l47l37J4L42r8k89
2360b26j09M11L92j27n59n60L08R53M34n75r87l73Q15R75J05q51q02J3Q15P03
2380G55k20p87l04L40L67P7k73r9J95J94k66l50j1O39L96k88p72m43N22R89L04
$$ plain form
2401 965 135 -776 -856 -19 857 669 -130 -813 -582 214 607 237 -261 -410 -24 188 96 -139 -17 275 263
2422 263 -136 -456 -246 404 702 253 -652 -850 -165 719 807 -74 -885 -742 156 828 586 -276 -674 -299
2442 -299 266 559 133 -272 -209 121 73 -228 -252 58 370 208 -351 -626 -169 549 790 106 -735 -756 64
2463 64 889 679 -274 -828 -539 269 700 316 -375 -588 -184 367 316 -47 -249 49 207 -80 -323 -153 309
2484 309 472 133 -471 -643 -52 692 827 -63 -871 -655 293 839 448 -427 -743 -398 336 622 191 -298
2504 -298 -460 59 351 81 -140 28 259 142 -198 -355 -71 344 455 -18 -703 -770 84 767 554 -398
2524 -398 -873 -388 416 827 434 -297 -635 -241 423 583 -1 -431 -206 157 52 -160 -129 193 233 14 -365
2545 -365 -412 -50 504 573 -136 -828 -570 424 876 364 -368 -678 -210 447 707 318 -386 -550 -46 428 186
$$ packed form
2401I65q30r11q0Q37Q76j88p99o83K31P96L93l70m98j49L86K12r2k35J22K92j2
2422B63l99l20K10O50K98m49r05j98O85Q84Q8q81q11J43Q98O72k42q62l98L75
2442b99N65K93m26m05O3L30m8l01k4L10L12j62n59k75M57P18K41o84q41k1Q20
2463F4Q25k10r53n54K89Q08M31l84o91k13M04N51n1l63k02K98J58k87k43J70M62
2484C09J63l39o04j72N91P44J35q90q08K16R48N46l91q75l16L45P34K86m31m89
2504b98j62N19K92k70k21J68K31j17l40j57K84M15J11m73o85o7Q54O83k13r52
2524c98m75M85Q04M11l93p31l38L94O64J60n84m30K25L63j05k12L1L22M0k19l79
2545c65m7L62N54O9p09o92K58R94M52n12p32l10M68O57K60l89p04j64N04M74k42
$$ plain form
2566 186 -259 -298 -47 -20 -154 -235 -15 251 342 118 -309 -379 233 824 593 -340 -844 -372 415 651 169 -505
2588 -505 -758 -264 436 578 48 -510 -368 154 329 71 -60 48 123 6 -86 -139 70 332 434 -94 -627
2609 -627 -476 363 754 210 -587 -716 -301 416 600 122 -560 -666 -3 620 520 -77 -294 -10 217 148
2629 148 37 60 81 90 -42 -270 -437 -15 478 326 -412 -811 -269 523 734 190 -377 -547 -54 645 767
2650 767 93 -545 -446 194 410 103 -240 -262 -55 -22 -67 -148 -114 79 202 -69 -478 -318 348 691 285 -452
2672 -452 -528 -15 592 652 158 -567 -674 -52 581 442 -249 -607 -316 115 172 8 -32 -79 52 104 -3 -110
2694 -110 51 395 344 -197 -631 -222 428 545 17 -583 -623 -137 477 505 -27 -672 -538 215 568 310 -269
2715 -269 -331 -47 183 219 119 22 56 155 76 -209 -222 201 436 145 -488 -643 -142 392 422 -58 -599 -568 132
$$ packed form
2566A86m45l9K51K7j34q1K20K66R1k24m27p0O12N91k31r33n04M72P87K36m82o74
2588e05k53M94P00J42n30n58J42N22J75k58j31J08P5j17r2n3K09K62J02n28n33
2609f27J51Q39L91n44p97j29M15P17J84m78o82j06O63O23j00n97k17K84K27o9
2629A48j11K3K1Rj32k28j67M22M93j52p38l99N42P92K11n44n67j70M93O99J22
2650G67o74o38R9O40K16l07l43k2K07L3m5q1L4J93J23k71m09J60O66L43m06p37
2672d52p6N13O07O0m94p25j07O22O33j39o91l58K91M31N7j64m0m7J31N2j07j07
2694a10J61L44n1n41m34M09O50J17n28o00m0M86O14K8n32o45J34P53L53k58n79
2715b69o2K84K30L6j00r7L4R9p9k85j3M23K35k91o33j55N01N34L0m80n41L1P00
$$ plain form
2738 132 690 608 -120 -471 -141 358 471 161 -129 -214 -146 39 -82 -208 -218 25 72 -162 -351 -195 389 560
2760 560 98 -471 -331 155 586 522 -73 -664 -482 231 587 254 -385 -461 -152 277 254 24 -185 -150 -9
2781 -9 84 -34 -158 23 261 191 -261 -378 81 594 539 -10 -450 -403 127 611 385 -319 -724 -390 222 398
2803 398 49 -401 -371 -49 241 312 74 -38 87 211 108 -164 -106 234 322 -43 -505 -499 -21 374 289 -228
2825 -228 -634 -397 227 647 347 -351 -452 -145 417 382 36 -214 -215 -56 148 53 -107 -54 155 71 -151 -281
2847 -281 -47 307 307 -143 -503 -325 94 494 348 -246 -570 -249 444 580 160 -376 -364 -28 320 227 -51
2868 -51 -285 -240 13 30 -63 -184 47 187 11 -235 -270 155 468 371 -57 -439 -274 352 601 273 -437 -614
2890 -614 -167 365 410 34 -385 -386 70 275 169 -57 -193 -5 117 51 -95 -10 207 221 -68 -305 -249 173
$$ packed form
2738A32N58q2p28l51L30M99J13l10k90q5O8J85j21j26j0K43M7k34j89J56N84J71
2760E60m62n69J40M86M31o4n95n91J82P13L56l33o39p6L09M29k3k30k09L5J41
2781iR3j18j24J81K38p0m52j17M59N13n5n49m40M7N30M84k26p04m05L34O12J76
2803C98l49m50L0L22K90P1k38j12J25J24j03k72N8L40Q8l65m62OM78L95q5n17
2825b28m06K37O24M20l00o98j01L07N62l5l46k50jJ59K04r5j60N3K09q4k22j30
2847b81K34L54%m50l60J78M19M00j46n94l24L21O93J36m20n36J2L36L48r3k78
2868e1k34M5K53J7r3j21K31J40j76k46l5M25L13r7m28l82J65O26K49l28p10j77
2890f14M47N32M5l76m19jM56K05j06k26j36J88J22o6j46Q5K17J4k89k37N6M22
$$ plain form
2912 173 437 247 -275 -577 -216 311 552 98 -409 -468 -6 403 332 -31 -310 -302 84 211 73 -98 -8 20
2934 20 1 -121 -174 105 273 204 -144 -377 -244 262 462 149 -382 -506 -96 454 422 -51 -471 -378 59 441
2956 441 288 -91 -233 -40 128 107 -72 -93 2 42 -98 -235 -160 132 341 239 -244 -465 -122 405 576 16
2978 16 -408 -447 -52 406 356 -121 -422 -262 154 353 107 -114 -139 56 83 58 -28 -52 139 81 -111 -287 -180
3001 -180 161 399 121 -393 -427 54 458 385 16 -364 -337 92 429 320 -186 -370 -145 228 208 -46 -138 -34
3023 -34 50 43 -18 -18 66 216 182 -178 -413 -58 353 417 -32 -428 -316 34 434 330 -88 -464 -295 221 471
3046 471 80 -269 -208 -26 81 55 -7 -46 -80 2 23 -101 -123 186 369 97 -368 -360 102 419 290 -142 -392
3069 -392 -408 62 493 363 -202 -546 -73 332 266 -16 -124 -74 -27 28 129 -1 -148 37 115 -125 -347 -99
$$ packed form
2912A73K64j90n22l02L61N27K41m54n07n9M62M09p1l63k79QL86J27j38j71R0K8
2934B0j9j22n3K79J68o9l48k33J33N06K00l13n31j24M10N50l2m73m20R3M37L82
2956D41j53l79j42J93J68k1j79k1R5M0j40j37P5K92K09j02m83k21L43N27J71n60
2978A6m24l9L95M58n0m77l01J60M16J99k46k21k5J95K7k5q6k4J91n8j92j76J07
3001a80L41K38k78n14l4M81M04p3l69l80K7M29L37j09n06j84K25L73k0k54r2J04
3023c4Q4po1%Q4J50l4l60k35L55M11O4m49l96J12L50M00j04m18l76J69N16K50
3046D71l91l49O1J82J07k6o2l9l4Q2K1j24k2L09J83k72m65QM62L17j29m32k50
3069c92j6M70M31j30n65l44M73M05o6k82j08N0M7N5J01j30j47J85P8k40k22K48
$$ plain form
3091 -99 400 341 -116 -383 -188 136 320 289 -57 -469 -328 251 538 91 -327 -257 15 197 78 89 -23 -172
3113 -172 -79 154 -10 -151 -35 287 122 -313 -357 137 381 188 -105 -262 -212 -41 398 345 -244 -630 -120
3134 -120 417 318 -92 -254 -70 -35 87 209 109 -174 -116 97 74 -151 -147 326 299 -189 -346 -18 163 234 177
3157 177 -46 -341 -359 241 613 168 -480 -373 88 200 132 30 -60 -211 -110 254 195 -184 -133 154 177 -213
3179 -213 -287 105 248 -11 -302 -181 -46 13 310 359 -132 -634 -106 589 427 -193 -356 -103 -39 44 214 87
3201 87 -309 -358 115 320 -103 -266 150 325 -150 -315 -10 223 91 36 -25 -228 -354 179 565 169 -541
3222 -541 -451 136 342 87 -47 6 -226 -145 210 312 -186 -328 101 274 -99 -261 156 369 58 -241 -53
3243 -53 16 55 138 292 -134 -553 -215 469 324 -209 -454 -62 97 98 245 175 -195 -336 144 409 -16 -335
$$ packed form
3091i9M99n9m57k67J95L24J84l1l46m12J41N79K87m47m18P0K72J82j19J1j12j49
3113a72R3K33j64j41J16L22j65m35m4M94K44j93k93j57N0J71M39n3n89l86N10
3134a20N37r9m10j62J84L5J22J22j00k83N8K13k3k25MM73k7m88j57L28J81P1n7
3157A77k23k95j8O00L72m45o48J07M61J12o8j02r0j51J01L64n9l79N1K87K3l90
3179b13p4L92J43k59k91J21J35N9K97M9m91n02N28O95j62o20j63K53O4Q3J70j27
3201H7l96m9M73K05m23j63M16J75m75j65L05K33j32n5o1k03j26N33L86l96p10
3222e41R0N87K06k55j34N3k32Q1L55J02m98j42M29J73l73j62M17K13l11k99J88
3243e3O9L9Q3J54m26m19L38O84j45n33k45L92J59JJ47p0l70j41M80K65m25l19
$$ plain form
3265 -335 -36 185 -112 -313 -14 187 26 -150 1 -123 -218 54 537 301 -497 -439 214 433 52 -109 -113
3286 -113 -233 -174 233 432 -70 -429 3 357 88 -249 15 249 -16 -292 -76 158 -54 -22 247 -47 -437
3307 -437 -187 452 553 -171 -447 14 239 107 115 98 -273 -441 39 394 -5 -389 -122 249 98 -188 66
3328 66 280 52 -161 69 61 -174 -42 378 222 -457 -513 157 411 27 -254 -161 -119 -18 227 382 -9 -489
3350 -489 -173 361 226 -239 -34 152 38 -239 -3 158 13 -97 65 119 -292 -219 351 411 -211 -486 -144
3371 -144 250 148 39 44 -109 -338 77 532 231 -366 -272 234 164 -171 -54 171 -40 -296 -53 55 -84
3392 -84 -145 238 211 -224 -385 159 547 143 -259 -169 14 -55 124 233 -11 -497 -227 373 322 -269 -233 71
3414 71 45 -162 -28 161 27 -124 65 133 -128 -211 211 337 -60 -431 -91 331 134 -75 -94 -177 -268 42
$$ packed form
3265c35K99K21k97k01K99K01j61j76J51j24r5K72M83k36p98N8O53K19l81j61m
3286a13j20N9M07J99n02l59M32L54k69l37K64K34k65k76K16K34k12L2K69k94l90
3307d37K50O39J01p24k76M61K25j32Qj7l71j68M80L55l99l84K67L71j51k86K54
3328F6K14k28k13K30qk35J32M20j56o79n6O70K54l84k81R3M2J01K45J55l91m80
3350d89L16N34j35m65K05J86j14k77K36J61j45j10J62N4m11P3N70O0o22k75L42
3371a44L94j02j09Nj53k29M15M55l01n97R4N06p0l35J17K25k11k56K43J08j39
3392h4o1L83k7m35j61N44L88m04m02R0J83o9J79J09k44m86K70O00n1n91L6L04
3414G1k6k07J34J89j34j51J89O8k61q3M22J26l97l71L40M22j97k09j9q3r1L10
$$ plain form
3436 42 409 142 -416 -359 119 292 16 -112 150 121 -121 84 187 66 -81 109 191 -190 -428 34 341
3457 341 104 -397 -217 52 108 132 211 -6 -323 -171 369 414 -92 -267 -54 129 -23 -18 137 -34 -179 -78
3479 -78 124 -54 -185 41 223 -77 -354 -161 273 244 -38 -102 -75 -88 55 360 216 -294 -343 91 321 63
3501 63 -170 -52 -48 -88 -34 124 29 -198 -79 139 -13 -166 13 383 147 -266 -269 101 150 114 75 -83 -391 -181
3525 -181 287 289 -113 -351 -126 152 100 39 35 -30 -115 30 223 64 -156 -42 213 26 -201 -123 181 267 -72
3548 -72 -147 -111 -44 104 205 46 -228 -334 45 348 104 -142 -175 -7 36 32 108 48 -142 -96 170 41 -107 -106
3572 -106 89 100 -184 -219 8 160 70 39 -124 -187 -48 276 353 -31 -322 -151 202 155 36 -64 -54 -167 -59
3595 -59 153 57 -124 -125 87 25 -138 -87 151 175 -41 -190 -165 2 107 160 126 -235 -276 -6 310 202 -170 -152
$$ packed form
3436D2L67k67n58N7M78J73k76j28K62k9k42K05J03j21j47J90Q2l81k38M62L07
3457C41k37n01J80K69N6K4P9k17l17J52N40M5n06j75K13J83j52NJ55j71j45J01
3479g8K02j78j31K26J82l00k77J93M34k9k82o4K7j3J43L05j44n10m9M34K30k58
3501F3k33J18Mm0N4J58r5k27J19K18j52j53J79L70k36m13lL70M9l6l9j58l08K10
3525a81M68Km02k38K25K78n2o1mo5q5J45J93j59k20J14K55j87k27P8L04Q6l39
3548g2p5L6O7J48J01j59k74j06L79L03k44k46l3J68M3mP6o0j90M6K66j29j48J
3572a06J95J1k84l5K27J52r0l1j63o3J39L24P7l84k91J71L53m7j19j00J0j13J08
3595e9K12r6j81jK12o2j63N1K38K4k16j49K5J67J05N3l4l61m1K70L16j08l72J8
$$ plain form
3619 -152 -52 115 138 124 -46 -196 -90 77 127 -39 -60 70 75 -123 -103 79 119 97 -38 -116 -123 -57 168 258 -53
3644 -53 -275 -261 156 236 81 -103 -125 -67 43 176 101 -77 -149 75 116 53 -53 32 159 -59 -129 -94 17 144
3668 144 152 23 -117 -195 -6 304 222 -125 -327 -84 177 147 53 -77 -161 -109 110 176 9 -109 -8 53 -3 -75
3692 -75 -29 41 60 -30 -107 -75 5 160 197 -5 -231 -109 151 290 108 -151 -145 -103 183 182 50 -144 -194 -37 89
3717 89 102 -27 -76 10 27 -55 -70 -36 150 132 -17 -140 -143 60 187 76 -125 -245 -129 163 196 10 -122 -192
3741 -192 -68 203 181 12 -147 -65 67 54 -16 -15 50 67 -13 -78 -70 -3 53 78 -89 -170 -82 87 238 68 -204 -201
3767 -201 -72 145 214 82 -131 -185 41 144 93 -15 -106 14 -18 -12 -1 0 44 -28 -73 -77 -95 56 123 78 -59 -133
3793 -133 -10 156 212 82 -171 -176 -21 173 126 -56 -126 -86 14 169 46 -72 -46 13 69 -7 -69 32 57 38
$$ packed form
3619a52J00J67K3j4j70j50J06J67N0j66k1J30Nj98K0J82M0k2j35p8pO6K25R0l11
3644e3k22J4M17Q0j55j84k2N8J10J33p5j78p2K24M1o3j06Q5J27k18p0L5J11J27
3668A44Qj29j40p8J89L10q2l47k02K43K61l0r4j30q4N2K19O6j67j18J01O1n6p2
3692g5M6P0J9r0p7L2Q0J55L7k02k26J22K60J39j82k59OM2K86jj32j94n0J57J26
3717H9J3j29m9Q6J7q2j5L4J86j8j49j23lK03J27j11k01j20J16K92L3j86j32p0
3741a92J24K71k2j69j59Q2J32j3p0JO5J7q0o5QO7N6K5j67q1Q8J69J51j70k72L
3767b01J29K17O9j32k13n4K26J03n1j08r1J20l2OJ1JM4p2m5mj8J51O7m5j37p4
3793a33J23J66N6j30k53nJ55J94m7j82p0M0J00J55j23j18K6N9N6p6o2J01K5j9
$$ plain form
3817 38 -59 -166 -27 127 166 88 -155 -190 -34 133 170 32 -209 -122 15 134 147 -93 -159 -55 49 74 27 -38
3841 -38 21 -3 24 -6 -41 58 89 6 -95 -123 -12 130 137 10 -205 -230 -68 131 111 -13 -151 -127 129 151 132 -51
3867 -51 -92 -65 36 29 -25 -25 -7 49 -62 -85 -76 52 114 35 -206 -176 54 187 160 16 -222 -144 85 158 163 -95 -149
3894 -149 -68 59 112 -5 -65 -132 -20 80 11 -4 19 30 2 -44 -73 9 107 150 -49 -124 -91 19 175 137 1 -163
3920 -163 -106 76 106 81 -91 -143 -37 76 47 18 -87 -38 -14 9 -27 40 58 58 36 -68 -50 34 176 120 -77 -167
3946 -167 -180 30 196 154 -128 -123 -79 79 160 42 -129 -107 30 79 24 -26 -34 37 42 8 -29 -19 77 64 12 -131 -70
3973 -70 69 152 112 -99 -150 -101 62 152 37 -94 -94 -65 100 111 21 -48 -66 6 65 -25 15 14 11 -45 -36 -47 6 69 102
4002 102 -23 -87 -80 92 214 109 -119 -129 -44 76 153 63 -29 -118 -76 74 110 20 -129 -24 66 28 -15 -7 -47 9
$$ packed form
3817C8r7j07J39J54L9p8k43l5J56J67L7j38k41Q7J37J19J3k40o6J04J04K5m7o5
3841c8N9k4K7l0l5R9L1q3j01k8J11J42Pj27k15k5J62J99k0j24j38K4K56K2j9j83
3867e1m1K7J01pn4%J8N6j11k3RJ28O2p9k41L0K30J33k7j44k38P8K29P3Nk58n4
3894a49Q1J27N3j17o0o7J12J00o9j5K3J1k8m6k9Q2R8M3j99p5L3J10J56l8j36j64
3920a63N7J82L0k5j72n2J06J13k9k9j05M9K4K3l6O7J8%k2j04J8Q4J42n6j97r0
3946a67j3K10J66m2k82NM4J58Q1j18j71K2J37M9n5n0qP1Nl4l7J0R6j3n2j43O1
3973g0J39Q3m0k11n1M9J63R0j15j31%K9J65J1r0o9j8P2N9r0M0jln6Rj1N3O3L3
4002A02j25o4PJ72J22j05k28j0Q5J20P7r0r2q9M2J50L6r0j49J05R0l8m3Qm0N6
$$ plain form
4028 9 -51 -71 -82 35 125 38 -62 -188 -42 147 166 4 -85 -142 -22 32 79 18 -163 -113 -41 69 10 -30 -24 37 -33
4055 -33 -17 55 -15 102 72 25 -143 -38 77 121 53 -207 -170 -33 130 45 -68 -93 -73 -15 121 155 6 -70 -38
4080 -38 89 46 -52 -33 12 34 43 3 -4 55 62 17 -88 -98 -118 60 190 55 -137 -111 6 146 119 1 -113 -102 13
4107 13 126 54 -74 -32 9 3 36 16 20 -20 6 -32 -22 -15 32 69 96 -111 -73 -54 140 170 -63 -142 -130 21 112 75 -9
4136 -9 -129 -50 121 58 49 -99 -22 4 -36 16 -6 17 35 41 -41 -117 -48 110 123 10 -131 -114 57 158 35 34 -121
4163 -121 -105 -26 95 99 -40 -153 -77 49 19 76 -34 33 -6 52 -1 -32 29 76 81 -65 -98 2 165 136 -38 -89
4189 -89 -143 38 120 127 -57 -173 -52 35 127 1 -97 -103 -23 19 24 -21 -2 16 -11 -41 -94 -18 35 81 -23 -151 -111 26
4217 26 70 90 -68 -148 -51 -18 125 24 -74 -124 -12 160 73 40 -34 -73 17 5 -44 -46 -17 -62 -29 -50 -69 15 139 73
$$ packed form
4028Io0k0j1J17R0q7j00j26J46J89J9j62q9n7J20N4M7o1j81N0P2J10n9m0OO1p0
4055c3J6P2p0J17l0m7j68J05J15M4o8k60L7J37J63q5j13k5K0N8J36L4j49p6L2
4080c8J27m3r8J9M5K2Rm0pN9Pm5j05j0k0J78J30j35j92K6J17J40k7j18j14J1J15
4107A3J13p2j28M2M1oL3k0Mm0K6l8J0PM7L7K7k07L8J9J94L0k33p9J2J51R1l7q4
4136ij20P9J71o3rj48P7K6m0N2k2K3J8Oq2p6O9J58J3j13j41J7J71J01j23jj55
4163a21J6P9J21Mj39j13P6J26l0N7j10O7l9N8n3l1O1M7Nj46l3J00J63k9j74n1
4189h9n4J81Q2Pj84j16J21Q7R2j26r8oQ0M2Nm5J9J8k7l0n3P6N3M6j04j28M0J37
4217B6M4K0j58q0R7L3J43j01r8n0J12J72q7l3p4l9R0j2m9kK9m5L3k1j9Q4J24o6
$$ plain form
4245 73 -36 -82 -38 65 166 62 -33 -94 -70 70 157 11 -82 -72 -46 118 40 -52 -8 -12 30 19 -37 14 4 77 46
4272 46 -81 -25 -5 139 25 5 -120 -57 79 136 28 -83 -159 -56 124 131 13 -103 -1 86 49 51 -12 -63 -8
4297 -8 50 -25 2 -19 45 95 24 -60 -22 71 99 91 -40 -121 -57 77 115 -47 -63 -104 -45 84 99 -40 -105 -90 3 12 50
4326 50 -15 22 1 6 -45 -42 -16 74 97 -22 -93 -29 45 95 43 -89 -66 8 77 68 22 -66 -98 22 103 68 -22 -32 -56 51
4356 51 12 20 -35 0 55 -5 -97 -66 106 69 57 -59 -76 16 88 56 3 -112 -115 -65 76 97 0 -81 -74 -9 73 -21 -27 31
4386 31 -42 -31 26 6 -2 42 69 -21 -59 -7 103 40 -13 -93 -80 10 49 92 7 -101 -106 4 107 39 -75 -92 18 0
4414 0 31 43 24 -35 17 -81 -15 20 3 60 1 -11 -52 -11 59 117 11 -114 -117 -19 103 136 -68 -132 -18 78 67 11 -66
4443 -66 8 -8 10 -35 4 -12 -4 22 -21 -61 35 48 43 -73 -61 -82 -3 138 55 -20 -125 -60 41 90 80 -65 -115 -23 0
$$ packed form
4245G3j09m6M4J03J01j04r5o1K4J40Q7j46r3J0K6J64p8r2M4mM2j1n6N1j0P3l1
4272D6j27N6K0J44j14k0j25O3J36N7j08j11p6J03J80Pj18j16J02Q7l7Ko3n1N5
4297hN8p5K7k1O4N0p1q4L8R3K8qj31q1O4J34L8j62j6m1N9J29J5j39o5J5R3RL8
4326E0o5L7k1Nn1LK6R0K3j19p1O4P4N0n2j32K3P4O9rm6q8l2J20Q1l5r0j0k4J07
4356E1l9Qn5L5N5o0r2L1J72l7j2j16j7R2P2l2n3j15lN0J41K1r7q1PO5Q2r4oN8
4386C1p3J1N7k0qM4K7r0l8N2J10o3n3q0J3R0L9M3q5j08nJ10J03o8j14j7J10j8
4414@L1J2j9n9N2r8O6L5j7N7n9j2m1M1P0N8j06j25lR8J22L3k04o4J14R6j1n6p7
4443f6P4j6J8m5L9j6QK6m3m0R6J3nj16J2k1P9J41q3p5j05O5J01M9j0j45n0R2K3
$$ plain form
4472 0 71 22 23 -23 41 -55 15 2 -8 -15 2 16 -62 28 75 30 -2 -142 2 -3 106 69 8 -77 -32 66 125 47 -73 -45
4502 -45 -33 -7 76 39 -5 -42 35 -20 -88 -19 40 27 -46 -66 -36 40 92 72 12 -74 -41 69 115 69 -50 -136 -16 95
4530 95 42 -5 -21 -94 -46 -44 28 -7 -23 -17 -10 30 -21 -24 81 80 2 -53 -19 36 67 20 -57 -125 -50 19 76 54 -94 -60 -55 55
4562 55 45 -43 -65 -72 -53 88 33 -23 -3 10 42 -8 -9 -16 -12 32 4 -64 7 40 96 72 -35 -108 -19 88 59 -8 -89 -45 64
4593 64 86 96 8 -3 35 32 29 9 -24 -12 33 -60 -88 -61 -23 -2 45 -76 -83 5 17 96 34 -97 -40 46 122 73 6 -36 -15
4624 -15 -35 30 -30 -28 -73 3 44 -52 20 -18 11 41 -83 -67 -1 30 92 37 1 -42 -12 90 142 -8 -90 -66 2 75 92
4653 92 28 -63 -42 -22 6 42 -16 52 76 10 -3 62 56 45 28 -42 -58 -2 70 121 5 -111 -123 -15 62 -25 2 -60 -59 20
4683 20 37 33 28 -68 17 30 -18 -9 17 68 -30 -11 -26 35 18 38 11 -94 -98 16 70 73 -68 -73 -40 44 61 22 37 -69 -13
$$ packed form
4472@P1m9Jm6O4r6P0j3j0pJ7J4p8R0M7m5l2j40J44nJ09l7o1q5M5R8N9p8j20K8
4502d5J2K6Q3l7m4l7P7n5o8O9N9j3p3k0L0P6N2k0o0q6L3J10M6m6j19q6J20J11
4530I5n3m7j6p3M8KP2l5j6OPM0n1lJ05jp8n5L4N5L1m7p7o8P5O9N7k2j48L4NJ10
4562E5j0q8k2pJ9J41n5n6K0J3L2n0jpMM4k8o8P1L3N6k4j07p3Q9J07k9o7q1M4J09
4593F4K2J0q8j1L8llk0l3J2M5r3k8K7L8K1M7j21pQ8J2P9o2j31N7Q6P6m9o7m2K1
4624a5k0O5o0Km5P6M1r6P2l8K9L0j24J6O6L1O2n5l6m3L0J02N2j50q2K4O8P3J7
4653I2o4r1K1K0K8L6n8O8K4o6j3O5oj1j7p0j6N6P2N1j16j16j2J08P7q7K7o2JP9
4683B0J7mnr6Q5J3m8RK6N1r8J9j5O1j7K0k7j05mJ14N4Lj41nL3Q4J7l9J5j06N6
$$ plain form
4714 -13 -1 63 18 11 -43 45 45 -60 9 32 -1 2 -25 -45 48 36 56 80 -118 -63 8 99 38 -23 3 -35 -33 91 7 -114
4744 -114 -55 -20 24 1 -33 -17 -64 -11 -44 41 -8 -18 -9 20 -23 -78 -27 44 118 -57 -68 -22 -15 25 48 -16 -59 -38 30 75
4774 75 20 30 -70 42 64 -17 22 16 -4 -64 -17 -38 -4 -17 35 -13 -113 -68 -18 47 99 -50 -78 -74 42 105 102 -9 -81
4803 -81 -28 38 65 -8 -66 -34 -11 -32 2 32 -23 23 11 -2 -13 -35 19 47 -1 -81 -1 77 61 11 -12 -80 -22 37 110 16
4833 16 -22 -61 7 45 24 -5 -76 -60 -50 73 -2 28 40 30 20 -35 -64 89 85 56 -4 -37 5 11 83 27 -53 -22 -18 -3 7
4864 7 -35 -49 -58 -66 -27 62 49 -24 -31 42 19 6 -2 65 12 -22 -70 -40 7 47 -3 -34 -41 -63 43 35 54 -67 -73 -13 50 34 -3
4897 -3 -37 -31 39 4 26 8 -32 15 -9 12 -51 -6 39 -17 -63 -75 -51 -40 41 37 -81 -85 -6 24 43 -7 3 -4 -18 -30 22 8
4929 8 -49 -45 19 -15 -12 42 6 -1 -7 -60 26 68 45 -27 -6 -85 33 65 78 58 -82 -73 -4 53 40 -36 -56 -26 -28 52 36 -23 -59
$$ packed form
4714a3J2O4m5pn4Q8%j05O9K3l3Lk7k0R3j2K0K4j98N5P1R1o1o1K6l8KJ24q4j21
4744a14N9L5M4k3l4J6m7N3l3Q5m9j0RK9m3n5N1P1P4j75j1M6PM0K3o4m3K1O8M5
4774G5n5J0j00J12K2q1L9ok0o0M7k1L4j3N2m8j00M5N0O5N2j49k8MJ16O3lj11p2
4803h1N3O6K7p3n8L2K3k1L4L0n5M6j2j3j1k2N4K8m8q0Q0P8j6n0k3o8N8N9P3r4
4833A6l8l9O8L8k1k9p1J6J0J23p5L0J2j0j0n5k9J53mk9o0l3M2OP2n6q0L1MJ5J0
4864Gm2j4rqL9Q9j3p3pP3k3j3qO7n3l4m8L0M7M0n0l1pk2J06qJ9j21oO0O3j6l7
4897cl4OP0l5K2j8m0M7k4K1o3M5M5n6m6j2K4J1Q1mj18mP9L0J9n0J0pj4j2N2j4
4929Hn7MO4l4LN4l6pon3Q6M2k3p2K1p9J18L2J3k0j40RO9N7j3p6k0L0kQ0j6n9l6
$$ plain form
4962 -59 7 -16 -3 18 18 19 15 -58 0 -17 69 14 -4 -28 -67 26 92 106 -10 -89 -43 0 6 22 -40 -30 -76 11 21 -2 -28 -7
4994 -7 13 19 -20 -15 10 24 -33 12 -73 -32 37 91 10 -35 -54 7 21 1 8 -61 -1 11 41 53 -29 -26 -16 37 8 -65 35 26 32
5027 32 -22 -7 20 19 58 59 -12 -39 -21 43 47 -26 -85 -75 -43 25 14 -35 -34 -98 20 68 39 -24 4 34 -11 15 -22 -26 49 -15
5059 -15 25 -44 -6 65 51 21 -22 -67 29 49 36 32 -18 -95 38 52 25 -37 -8 -1 37 45 -81 -27 0 -17 -9 -38 -7 0 0 -41
5091 -41 -46 -48 -20 -10 45 47 -58 -38 57 46 -17 19 -21 16 35 -1 54 -46 -32 20 95 31 32 -8 17 -47 -54 24 -25 45 78 30
5123 30 -59 -39 37 82 64 -46 -75 -19 38 29 -68 -6 -10 27 12 -1 -33 -11 -14 3 -23 -5 29 -12 44 56 -8 -19 13 21 14 8 -29
5156 -29 -66 34 22 12 20 -54 -37 49 35 8 -5 -74 -33 11 52 2 4 -8 -3 -3 -16 -23 -25 -10 -11 -23 -4 12 44 17 15 -26 -13 39
5190 39 88 -21 -19 -82 28 22 -28 17 -4 19 -3 18 8 -1 5 32 34 -44 -40 37 62 80 -10 -48 -10 5 71 -11 -11 -99 -22 63 56
$$ packed form
4962e9O6k3J3K1%Jmp3N8j7Q6n5j8k4l9R3O6J4j16p9M6M3OJ6o2J0m6Q7J0k3k6K1
4994gK0Ol9NK5J4n7M5q5M1O9N4q1m5j9O1J4k0Po9O0J2L0J2q2LJ0N3k9p3J00rO
5027C2n4J5K7jL9Jp1k7J8O4Mp3n9J0L2O8j1m9Jo4J18M8k9o3K8L0m5K6l7mP5o4
5059a5M0o9L8P1j4l0m3m5R6K0j3mn0p7J33J4k7o2K9PL8Qj26N4K7j7Qk9L1P%m1
5091d1nkK8J0N5Kj05K0R5j1o3L6m0L7J9l6N5j00J4N2P5o4Jm0K5o4pP8m9P0L3m8
5123C0q9K0P6M5j8j10k9N6N7rr7O2mL7j5j3l2K2lJ7k6J8L4m1N6J2o4j1L2Qpol7
5156b9l7J00j2j0Qp4J7Q6j4k7j3o9M1M4M1n0Kj2N%j3pkJ5jj2J9J6L2k7km1J3N2
5190C9M9j09Ko3J10on0M5k1K3k2K1j0rOK7Kp8MP7K5J8r0l8L8J5O6q2%q8P7Q5p
$$ plain form
5223 56 27 -6 -86 17 28 9 10 2 -2 11 51 60 22 42 0 11 6 50 -7 -28 -32 -42 -52 -52 45 61 41 -85 -52 -30 37 49 -22
5256 -22 -3 -10 -63 55 -8 16 -20 15 -7 2 12 -26 19 0 9 34 -1 11 16 47 -14 -39 3 15 46 -1 -73 -55 41 77 34 -2
5288 -2 -77 7 20 3 24 -34 14 -2 29 -36 8 17 57 -28 3 -13 -21 27 64 9 -82 -15 57 25 23 45 -88 -43 -44 67 17 28
5320 28 -29 15 13 37 14 19 -10 21 -19 -6 35 23 38 -3 -34 -52 9 28 54 -28 3 -48 -12 4 15 23 -44 -2 -13 40 51 -14
5352 -14 -69 37 24 27 -7 17 26 -6 20 -8 -39 57 39 27 -1 -6 41 -20 -8 -3 -60 53 60 48 97 -31 -22 -15 9 -2 10 -48
5384 -48 -12 -45 29 -98 -52 22 -10 -30 9 -35 22 2 75 -22 -27 -32 0 21 1 -64 -66 -25 25 36 26 -1 -28 -19 41 36 -4 27
5416 27 -6 17 -33 31 -74 -8 42 -24 6 -40 -34 7 5 -32 -36 -48 30 49 13 3 -5 -3 61 -20 -15 16 -17 -14 -1 19 8 15 0 -23
5450 -23 -6 68 52 78 23 -14 -49 4 3 66 -34 -23 -15 -48 17 39 34 -5 -22 -23 9 -16 -7 -32 -70 29 -84 -34 6 9 38 -10
$$ packed form
5223E6k9l3q0J03J1j9JqmJ3M0Rl8K0m2J1nM4n7k1mj0j0%R7J6k0j26L3K2O7J2p1
5256b2J9pn3J18o3K4l6L5k2RJ0l8M5j9RK5l5J2NL1o1k5M2J2L1m7p2J8R6L6m3l6
5288bp5Q4J3j7K1n8M8j6L1o5M4RM0q5L1j6qM8L7n5r1O7P2l2kK2j33M5jJ11n0J1
5320B8n7M4kK4k3Nk9L1m0J3M1j2J5m1l1j8O1J9K6q2L1n1L6J6J1Qo7M2j1N3J1o5
5352a4n5J06j3Ll4K4Rl2K6k8l1R6j8j2k8nM7o1J2Nn7J13Pj2M9j28RPK4j1J2n8
5384d8L6l3P4j27M6P4l2k0L9m4N7k0P3r7nnL2K1k0o5kM1N0J1j0k7k7RO0nm0L1
5416B7l3K3n0O4j05O6N0o6L0m6OM1kl7mj2P8J9l6j0qKO4q1NL1l3LJ3K0j1Pj5k3
5450b3J7P4j6K6n5l7l5N3jO3j00J1Ql3O5K2nl9j7jL2k5Rk5l8R9j13N0M0LK9m8
$$ plain form
5482 -10 -5 -2 34 23 48 -45 -25 -60 3 50 2 -8 -22 75 -7 95 34 -56 13 -10 34 36 38 -20 -19 28 -15 17 1 -6 48 -34 -40
5515 -40 -21 20 12 35 -43 -59 3 16 -6 24 -42 -73 -20 52 26 20 52 -30 -9 4 79 39 -40 -57 -37 -10 -39 -24 -6 -8 6 11
5547 11 -33 18 35 -36 -65 -10 11 40 39 -34 -67 18 56 34 -1 -18 -51 -42 -31 16 -1 -35 -7 -13 -33 -37 -28 -5 12 15 6 -51 -1 31
5581 31 37 11 -41 -50 -78 -16 56 24 -51 -70 5 26 -34 7 -48 -15 45 -22 28 18 -26 22 25 -64 -20 47 93 35 -3 7 28 9
5613 9 39 13 -45 -55 57 -22 40 9 3 -5 42 6 2 -35 8 -42 16 -1 -18 -8 8 36 -86 -13 -32 16 77 -23 9 -41 -39
5644 -39 63 18 -17 -35 -9 34 88 10 -50 -9 20 -12 7 -7 2 -2 -25 19 -27 -27 0 20 24 32 -40 12 10 50 1 0 -21 -22 26 65
5678 65 -81 -33 36 -29 73 -11 -20 -4 -31 -7 -21 8 -13 -2 57 -1 -38 -9 -21 4 25 -13 -39 -37 28 35 -71 -19 12 5 72
5709 72 89 -51 -19 24 30 22 -26 34 6 -4 10 70 3 36 50 -45 -25 -11 -12 33 10 9 -80 6 -17 34 -13 -28 -50 33 45 37
$$ packed form
5482a0NLL6j1K5r3K0l5O3M7m8j0j4R7q2J02o1r0O9k3M4KKn8JM7m3L2j6pN4q2o
5515d0J9M1qK3p8j6O2J3k2L0o6l1N3P2k6oL2q2K1J3P5m0p9j7K0K7k9J5J8kJ4N
5547A1m4N1J7p1k9N5K1K9jp3l3Q5L8k2l5j7l3RJ1M7j7l4K8ok0mRK3J7Lrn7N0L2
5581C1Ok6n2rk8O2P2l2p5j9P5K1o0M1n5L3O0o7N0j0m4M8Lq9M4O7M6n8l8J0K1j9
5613IL0k6n8j0J12p9O2l1oqM7l6ml7M3n0N8j7j7J0J6K8j22P3j9M8O1j00L2n0K
5644c9J02m5l5j8K6M3N4p8o0M1K9l2J9j4Rmk3M4m6%K7K0MQp2N2kM0m9jk1jM8L9
5678F5j46M8O9o5J02q4rJ6k7K4j4K9k1J1N9n8l7K9j2K5K1l8k6KO5Pj06N2L1pO7
5709G2J7j40L2M3Oqm8O0k8j0J4O0o7L3J4r5K0J4jM5k3jq9Q6k3N1m7j5k2Q3J2q
$$ plain form
5741 37 47 -11 -18 9 34 17 61 2 -47 5 28 -20 -16 11 -4 -7 -26 8 12 4 12 8 -31 -8 53 40 19 -16 -29 26 -9 -10 -15 -23 -1
5776 -1 53 25 38 -12 -28 92 -21 6 -5 13 -31 37 27 -53 -8 28 40 34 -16 -18 61 55 109 -41 10 -21 37 61 35 30 -32
5807 -32 -38 -10 25 -19 -2 7 46 -20 0 -31 22 21 19 43 -27 -40 8 -24 -11 -28 -26 -14 23 34 -14 -58 1 -32 -29 29 6 5 -24 7
5841 7 -2 -27 -41 53 11 -37 -33 62 -10 -2 68 24 -38 43 32 41 -29 -19 1 -51 10 17 -3 -35 -26 21 22 -10 -28 -24 -36 -43 38 -56 -1
5876 -1 -19 15 -4 -14 -15 37 17 -41 -60 43 -16 63 28 -5 23 25 42 35 80 -36 -75 -14 -19 -47 -11 -7 7 -31 -1 -9 -23 13 35
5909 35 -15 -27 -32 -26 35 62 4 -71 -22 22 56 19 10 8 4 -48 -20 46 -58 10 -59 36 33 42 -23 -32 46 27 32 0 0 -73 28 -34
5943 -34 -49 -3 6 3 -20 8 13 -2 28 -21 -13 10 -8 35 7 37 -1 27 -32 -31 -52 -16 20 6 42 -62 12 -9 -20 36 13 -32
5975 -32 -39 -13 28 55 13 3 -60 -13 -46 38 -44 -71 10 29 8 -11 -21 -34 -22 -22 -26 29 -7 -36 71 -28 -14 4 -12 82 49
$$ packed form
5741C7J0n8pK7K5j7M4n9m9N2K3m8MK7j5lj9L4MqQml9K3O1j3k1l5j3N5l5jnqK2
5776aN4k8J3n0j6J20j13K7j1J8m4O8j0q0M5L6J2on0kP9oN4j50N1l1N8K4k6no2
5807c2oK8L5m4J7RL9o6K0l1N3jkK4p0j3M8l2J3j7KJ2L7J1m8m4N9l3LN8k3jk9L1
5841Grk5j4R4m2m8MR5p2QP0m4o2Q1j1Rp0J0K0n2O1Pk0l2RM7Jl2j8Mj2pQ1r4N5
5876aj8L4j9j0jN2k0n8j9J03n9P9l5l3K8KJ7pM5j16l9O1nk8L6MJ4l8L0qj4L6K2
5909C5n0j2nOO1K7n8p5M9M4L4l7rkmn2K8O6j04O8o9R5lRo5rP8j9Nl2%p3J01o2
5943c4j5M6Rlk3K8Nj5L0m9QK3j8M3k8L0l8K8n9Jk1L6L6j4L6j04P4k1j1N6k3m5
5975c2pK6M1K7m2j0o3M7l3Q4q2k7Q1J9k1j9j0j3J2%mN5l6k9J07r9J4J8j6R4l3
$$ plain form
6006 49 -36 -47 39 63 -46 4 -13 -22 -9 48 24 -71 2 -18 -17 -27 -14 -36 16 -8 -19 -14 -25 14 36 14 -11 -39 -1 -5 -23 14
6038 14 -28 -9 -11 32 -24 24 -13 -31 31 1 49 -28 35 14 -20 -31 13 -12 -15 -23 -39 -23 2 -39 20 50 25 -38 -12 -12 45 -91
6070 -91 -46 -28 -18 69 -11 -25 -3 -18 -5 -36 9 26 -8 -2 21 7 -24 41 21 -10 9 20 27 20 72 -72 -8 -29 -21 97 68
6101 68 -18 6 13 21 20 16 13 -42 11 3 -46 6 -4 4 16 61 -4 28 23 -10 -4 -20 -24 47 23 70 -43 -27 -30 25 39 28 -31 -35 20 5
6137 5 7 26 -34 -24 -6 3 -78 -25 4 23 25 -33 8 33 -11 11 27 -28 -1 32 -1 -18 -21 -34 -21 41 45 -15 2 -28 9 5 18 18
6171 18 12 -50 52 -43 27 22 12 -9 28 -42 -10 34 26 18 -40 10 -24 16 16 -30 -39 -42 -23 50 -5 16 -31 6 44 -39 6 19 36
6204 36 -9 -14 -33 -31 66 -3 35 -29 17 52 67 27 27 -39 -20 4 22 67 35 -8 -28 -4 -23 46 -28 57 18 -6 -20 -17 42 -22
6236 -22 -3 -20 -38 -6 -27 -38 -44 -9 -38 19 -12 37 16 16 -5 13 8 20 23 4 -21 30 42 -9 3 17 24 28 -2 10 3 24 -32 -36
$$ packed form
6006D9q5j1Q6K4j09N0j7rJ3N7k4r5P3k0Jj0J3k2N2k4j1Nj1L9K2k2k5k8L8mj8L7
6038A4m2J9kM3n6M8l7j8O2l0M8p7O3k1l4j1M4k5lqj6J6K5m1N9L0k5o3K6%N7j36
6070i1M5J8J0Q7q0j4K2j5J3l1M5J7l4OK3j4l1O5k0l1J9J1PpN2j44O4k1QJ18k9
6101F8q6K4PQjmln5N3qm9N2j0QJ2M5o5L2nl3Oj6mP1k4M7j13J6lN5J4j1n9mN5j5
6137EKJ9o0J0J8Rq1N3K9J9Kn8M1K5m4K2J6n5K7L3l3j7lj3J3O2Mo0J7l0L7mJ3%
6171A8oo2J02r5P0nj0k1L7p0L2M4qqn8N0l4M0%m6rlJ9P3n5K1m7L7L8q3M5J3J7
6204C6m5nj9KR7o9L8o4M6L5J5m0%o6J9K4J8M5l2m3k0K4j9O9p4Q5l9k4j4LN9o4
6236b2J9j7j8L2k1j1oL5k9N7l1M9k1%k1J8nJ2Lj9k5N1J2n1J2J4PMl0J2pK1n6m
$$ plain form
6270 -36 9 43 29 67 17 -66 -33 10 25 10 -11 -63 -64 64 24 98 -37 -49 -16 25 -6 60 20 3 -20 30 44 -1 -36 -10
6300 -10 -30 4 -24 45 47 17 -29 7 4 15 29 -16 -29 -41 -38 27 26 91 -5 -37 -18 -16 33 -8 -21 24 -42 -10 18 -43 25 -24 -7
6333 -7 -14 3 14 44 -3 6 -8 -23 -11 24 44 -23 4 9 -11 49 6 -55 -15 -12 -4 -35 -2 -11 -11 -14 -10 -6 18 -61 -40 -18 -36 6 -25 -16
6369 -16 1 21 -37 -40 -8 15 -12 -5 -58 -4 9 32 -6 -62 23 25 -10 -13 -4 83 -3 -12 -64 1 1 7 58 21 -69 -12 15 -16 -19 -50 -62
6404 -62 -33 -63 -5 31 -14 -39 -51 -13 4 -63 -109 20 -32 -36 24 -18 39 35 -36 22 -33 25 3 20 -16 -86 -32 23 -17 30 -23
6435 -23 -5 31 10 1 -38 -6 13 34 65 62 48 3 -39 -60 9 -10 33 19 31 44 -45 -60 -3 7 -60 -85 -97 -15 -9 7 19 -9
6467 -9 -8 -29 -16 80 -3 -35 33 8 41 -27 20 -2 -14 47 -17 34 -5 41 55 4 -84 -39 -1 -13 -15 4 37 -53 -61 -5 -62 -29
6499 -29 -50 16 -20 -37 5 -7 -46 -30 33 1 59 3 7 5 24 14 -26 6 14 -7 37 38 36 23 4 1 -48 22 36 -36 12 -35 -3
$$ packed form
6270c6M5L4j4L8n0q3L3M3J5j5k1n2jJ28m0P4j35j2L3M1l1O6m0j7k3N0J4m5l5K6
6300a0k0L4k8O9Kl0m6L6lJ1J4m5j3j2LO5jO5r6l2J9KM9m1j3M5o6L2K8o1O8m9J7
6333gpJ7J1L0m7Rj4j5J2L5K0o7K7Nk0O0m3o1M0LQl1L3r%lMMK4p9K1K2j8M2l1R
6369a6J7K0n8lL2K3k7Pn3N4J3K3l8n6Q5Kl5lRQ7q6rn2O5%ON1l7r0N7K7l1ll1j2
6404f2K9l0N8L6m5k5j2L8J7o7m6J29n2mO0m2N7mp1N8n5N8k2J7l6p0N4N5m0M7n3
6435b3J8L6k1rl9L2J9K1L1lj4m5m2k1O9j9M3j4J2J3q9j5N7J0o7k5j2Q2OJ6J2k8
6467iJk1J3R6q3l2O8k5L3o8M7k2j2O1o4N1l9M6J4n1q8M5L8j2kJ9L3r0qN6n7L3
6499b9k1O6l6j7M2j2l9J6O3l2N8n6MkJ9j0m0L2Qk1M4Jkj3j9lm9P0J4p2M8m7L2
$$ plain form
6532 -3 12 -6 -15 -28 -31 -43 -78 -50 43 0 21 76 17 -24 41 38 24 -29 -6 -7 -13 -5 -13 8 6 -16 -10 48 29 -35 -29 -17 18 31 18 26
6568 26 -10 -18 35 12 -17 13 32 0 -31 -6 14 -20 9 -31 -33 -12 -38 -6 -28 -71 -81 -10 -10 48 47 5 -8 -51 26 38 -13 -30
6600 -30 10 -6 9 8 -40 31 20 -43 -63 51 35 46 25 6 -24 -15 10 96 -35 -74 -67 -15 -43 -10 -59 -11 -32 -34 61 -24 28
6631 28 12 48 29 -26 -30 19 24 39 -12 -12 -42 21 38 44 5 -46 -19 55 -42 7 11 41 40 23 9 14 9 1 -16 68 39 -39 25 34 41 -22
6667 -22 -13 69 21 -40 -6 -58 -76 -16 42 -21 -58 0 -16 29 10 25 33 -24 -47 35 34 5 -46 14 43 25 -6 1 39 -7 -18 -45
6699 -45 -13 -11 42 11 53 -21 -46 2 31 1 -54 -13 -14 27 1 31 6 -63 31 -31 6 36 -20 3 -24 15 -12 60 20 -1 17
6730 17 22 26 -10 62 2 -22 -16 34 11 -57 -5 -14 27 -17 33 -12 -16 18 3 -3 40 28 -57 -10 86 -53 -32 54 20 7 19 40 -20
6763 -20 -13 53 19 -21 -67 -34 -38 -1 -21 -16 -34 0 14 -9 21 -30 -79 41 5 -36 13 -49 2 -23 -54 26 -6 24 33 -8 -43 -12
$$ packed form
6532cJ5j8rj3lj2l5K8R3m3K1N5n9m1O5lj4n3K3joQqK1kk2ON8j9o4OJ2L5J3j3Q
6568B6l6qN3k3k9L0J9l2l1K5K0l4K9m0kK1k6L2k2m3j0P1%N8jm2j3m3P7J2n1j7
6600c0M0j6J5jm8P1j1o3k0J14j6J1k1j9l0RK5Q6j31l9PN2k8L3m9M8k1kR5q5N2
6631B8j6L6j9n5mM9NJ5n1%l0O3J7Ol9n1K7P4r7M9ML0jj7j4Nnqj7Q4k9p8O4RPo3
6667b2RQ2m8o1L4n2j8O0N8o3l7N8j6M5j9J5Qn7k3Q2jk9n1O0K9j8l1PL8m6j1k7
6699d5L2KN3l1M2p4k5M8K9l0n5M1jM1k6L0k5o9R4o2L7L0n6K3k7L9k7P2m0k1J8
6730A7NMl6P2o0k4ON0k3o8N2rM1m4N0m5mL4j5oM3j2q5M7R6j39K1Q6l4j3J2K1o0
6763b0PO6l4m0m6L3mL7k0Nj8L4J4k3L0n1m9J20l6m1M9o2N1k5l1Q0l2L0Rm1l5L1
$$ plain form
6795 -12 17 23 -1 0 -8 27 -47 10 48 22 7 -25 7 -26 -17 25 -20 -1 -3 -21 44 -16 6 7 8 -21 -25 29 0 4 -9 -28 92 36
6829 36 -27 -4 -60 -49 -10 10 -51 27 -58 4 24 0 -35 6 33 -41 -27 -8 20 37 17 -52 -23 -23 32 54 31 38 -60 -2 29
6860 29 -34 55 1 -33 34 8 10 28 -11 5 -23 9 2 1 11 8 -53 2 -4 39 -1 -15 -6 -13 -5 15 -10 23 -11 -13 -42 14 -8 36 11
6895 11 -47 -23 11 41 1 -17 -10 26 27 65 14 -40 21 14 -12 -5 -15 14 30 -44 9 -15 14 27 -9 -63 -31 -71 -5 33 -3 -49
6927 -49 -5 -15 -2 10 -39 -45 -57 -27 -2 -11 8 53 49 22 -3 -35 4 46 11 -42 -87 -26 20 -44 -13 56 -20 -16 -5 -40 -18 18
6959 18 -47 -9 -39 -39 -14 -52 -29 47 -16 24 -39 -19 2 -13 -25 -22 27 0 -28 -34 -22 14 14 -2 -24 -24 -21 -68 -27 -21 -43 -30 31 28
6993 28 -27 -11 2 40 41 38 -19 34 -11 42 1 3 -45 45 -10 9 -27 -44 20 -8 -31 60 -14 -12 -15 -12 63 -33 -14 29 27 -5 -31 4
7027 4 39 7 -22 -2 -23 -15 25 19 3 7 12 -21 30 86 -11 15 0 -26 34 23 9 -66 -32 1 -16 8 -32 -26 -30 -37 11 -47 -21 12
$$ packed form
6795a2K9Ok4JqL5p4N7L8k6j5l2L2l3RM2m5J9kj8O5o0K2JJk9mN4k9Mj3j9J20n6
6829C6o3K3n6J1L9K0o1P8q5O2K0k4l5M1K7p4J4J9K8J7k0o9K9%N5K2k3Pr8N8L1
6860B9o3Q9n4l4O7k6KJ8l9J6k8L2pjJ0lo1N5oM3m0j4RpQK0k5L3l4kk9N6k2M4k5
6895A1n8K4L4L0m0j8PL6JL8n1n4O1pk6Pj0K9J6p4N3k4K9J3l6n4L2m0O6L8l6m6
6927d9M4j0J3J2m9oj2L0K5rJ9M5mk7k5l2L9M2l5n3m5O1M6o4L1O9p6MJ1l5K2L6
6959A8o5L8l0%K5l8K3P6o3M0o3K0K1j5j2LM9k7k8oJ2L6%j6k2%Lm7M1Ok2J3O1l
6993B8n5J6J3L8Jln7N3m5N3m1Km8R0n5J9l6j7O4k8k3R1p4KlLP5r6J9M3kl2k6L5
7027DL5l2k9K0k1QM0oj6MNl3N1N6r7K6j5k6O0j1j4p5L4L3j7K4m0OmpM8n8K6L3
$$ plain form
7061 12 75 -27 5 -1 45 27 3 4 -33 -10 29 33 -51 7 -29 18 29 5 15 3 -5 5 39 27 66 -19 2 6 8 -18 3 30 -13
7094 -13 -15 -10 46 7 35 2 20 -4 23 17 44 24 -19 5 -13 2 -2 45 -16 23 8 24 -36 -5 9 -10 -45 -41 -60 -34 28 -11 13
7127 13 6 2 64 -1 11 -18 -35 8 35 11 -30 4 -10 -51 -9 -5 2 -6 -15 -12 -11 28 11 4 -33 -38 33 -21 8 5 -13 7 -22 -23 -21 33 -31
7164 -31 36 10 -10 28 -12 5 37 24 12 26 -4 -15 6 4 -10 -17 14 26 30 -32 -79 -22 47 22 -34 13 2 -40 7 22 47 12
7196 12 8 -30 8 25 13 -28 6 13 -26 28 50 -24 -26 34 10 -16 65 -25 -1 7 -22 -23 2 40 34 -14 -13 2 3 14 -36 -9 -53 -5
7230 -5 2 -17 7 62 19 5 45 -50 -52 8 47 23 -50 -8 -11 -26 7 -1 -19 13 15 26 -10 -3 -8 -54 16 -10 36 -11 -46 -34 -27 -33 -1
7265 -1 -13 -24 -15 -23 15 3 -25 34 -12 -22 -2 17 -4 28 -54 -20 -24 24 28 34 -13 -46 3 11 54 28 -2 -39 -6 5 13 61 42 33 -13
7300 -13 13 -37 24 -3 -11 -18 12 -24 30 16 61 -9 -7 3 8 15 -15 17 -22 -2 56 -14 3 -16 48 -19 -20 20 38 -33 13 13 -45 -18
$$ packed form
7061A2O3j02L2oM6j8k4Jl7K3L9Mq4N8l6M7J1k4J0j2qJ0L4j2L9q5K1MKk6K1K7m3
7094a3kNN6l9K8l3J8k4K7oK7k0m3K4j8J5mM7o1L9j5J6o0L1J4j9l5Mj9K6O2l9K4
7127A3pmO2o5J2k9j7M3K7k4m1L4j4m1M2MPqrLJL9j7pl7nP1n4K9lj8K0k9jKN4o4
7164c1O7k6k0L8m0J7L2j3j2J4l0j1K1kj4pL1J2Mo2m7N7O9k5n6M7j1m2M7J5K5l5
7196A2ml8L8J7j2m1L4Pl9N4K2p4kO0k4k6Q1r0K4Qk9jK5L8om8JJ5JJ1n0K7m4M8
7230ePj9K4N5m3j4M0r5kO0L9k4p3M2lj5L3qj8L2KJ1l6Pnm6P0k6M6m7l5J2PoL2
7265aj2j1RqL8j2k8N9m6j0K0J9k1L2q2L4mM8MOm7l3M9QM3k6l0l7L3J1QM8j9rm6
7300a3K6n0O1k7qpL0l6N4j4M5p0KJ0NPl0L2l9K0N8p0J7j9O4o7jM0J8p1M6%n8K7
$$ plain form
7334 -18 -15 37 -13 12 -43 -37 -20 58 -41 -23 -9 -22 25 -20 30 -3 -13 21 25 -20 -26 -41 -1 1 35 5 58 -42 23 -46 -17 -11 9
7367 9 66 -5 16 -28 2 37 -22 19 -28 -11 -35 -16 54 10 -32 -10 -25 38 -11 -46 -30 -12 22 -2 -14 -7 8 10 -25 -14 -7 -9 37
7400 37 -16 32 3 6 -10 25 -24 -18 -42 24 43 42 2 -15 -45 9 40 -34 11 -18 -24 0 -39 -47 -19 35 43 -74 -8 -13 9 -26 95
7433 95 -7 -9 25 36 8 -5 -55 -62 -26 20 0 -14 32 33 23 3 11 38 50 18 -14 0 -3 6 -3 48 -34 4 -17 -10 58 -51 26
7466 26 -42 18 31 -20 -29 -40 8 -10 18 -13 29 28 -7 4 -3 -18 32 15 -35 -62 -11 4 23 48 -18 11 -22 21 17 10 21 -26 -12
7499 -12 28 4 21 -6 16 -6 25 -9 -20 -12 11 4 -53 -11 -17 -24 24 -12 24 -13 -62 0 -22 19 -18 -36 3 30 -1 -36 -3 -54
7531 -54 -35 -7 33 7 -4 39 -25 54 6 -5 -7 24 -36 -3 29 31 5 17 -3 53 -10 44 50 -3 -35 -33 24 2 -7 -29 -37 -51 -24
7564 -24 20 -2 11 10 11 -5 -25 37 12 53 32 -47 30 56 23 1 -19 -10 43 -7 77 2 2 -23 3 6 6 -67 -21 -12 7 80 18 22
$$ packed form
7334a8LN2n0K5n5OJ7P8r9J8J4j3M7m5N0l3j0L4Mm5oj5M0KL4l0N3j00O5o9K9OK0
7367IN7p1K1m4L0L5n9M1m7J7k4J9P0m4m2K2j5O3m9l5J6J8L4k4j2PJ5Kl5J1PkM6
7400C7n3M8k9Lj6L5m9Ok4O6J9jm0j7l0N4L1p4M5k9oK4l9qK8N4Qj17O6nK2l5J21
7433I5j02kL4J1k8j3n0pL6M6k0j4M6Jj0k0QK7J2l2l2J4lRrN1q2L8k1PO8j09P7
7466B6o8O0J3n1rj1M8j8K8l1M2jl5J1pj5N0j7n0k7N1J5J9K5o6K9l3M3mpJ1m7J4
7499a2M0k4J7k7K2k2L1l4j1QK3pn7M2opM8l6L6l7m9O2k2M1l7j8L9K7l1l5L3n1
7531e4J9K8M0k6j1M3o4P9m8j1kL1o0L3L2Kk6J2k0N6o3N4On3l2KN7k2rk2qj4K7
7564b4M4k2J3jJj6k0O2k5M1k1p9P7K6l3k2k0RN3n0Q4p5%k5K6L%p3M6RJ9P3o2M
$$ plain form
7598 22 -11 -6 53 -40 -8 -27 -9 4 -35 9 -19 9 8 -23 -41 22 -8 25 51 23 -23 2 -14 17 -47 36 -17 -16 -19 60 4 13 15
7631 15 -22 -18 -6 1 17 16 -70 -51 -12 -6 1 57 12 24 -42 -6 0 63 2 11 -3 -26 -24 -3 -14 10 -10 50 -8 15 49 15 18 -53 21
7666 21 8 25 -55 28 14 23 -26 40 54 2 -18 33 22 3 -2 2 12 -45 -19 -19 -38 0 7 3 4 10 -9 25 20 16 5 -15 25 -46 32
7701 32 -23 -35 -22 -5 26 37 -19 -7 -86 -29 41 18 21 16 6 -25 12 19 -24 -24 -11 27 -9 -18 -20 7 -34 23 -40 50 -17 -29 -25 -43
7735 -43 -34 -29 40 -14 -30 13 26 -43 3 0 -27 42 -40 7 -7 2 -4 -21 -3 -55 17 -22 5 53 1 -18 -27 -4 23 -33 4 -20 -13 -2
7769 -2 -58 2 13 -36 -24 36 21 8 3 37 14 2 14 19 15 -22 49 -19 32 39 21 9 58 3 3 -7 13 81 -18 -44 -38 27 71 -10
7803 -10 1 12 -35 2 -12 23 -14 -39 56 -12 38 28 35 15 5 -13 -24 12 22 -4 -62 -41 34 33 -25 13 -8 -19 44 11 72
7834 72 33 25 -12 -18 -17 -4 -58 36 -4 17 -5 -54 36 41 -6 -60 -66 -1 20 5 -12 43 9 -39 -4 5 -43 -11 -16 2 7 -5 -29 8
$$ packed form
7598B2l3NN9r3L2j9J8J3l9M4k8K8jl1j8O3l0L3K6k8m6K5j6L1o4Q3n3JlP9n6RK
7631A5l7MJ2PJ6jq6J9L9OPN6m5J2o6L6OO3o1Rj4k3KK1j1K4k0O0n8K3L4l4Lp1P4
7666B1j3J7q0Q3j4Rm9O6J4n2k0N1j1j9nMJ0n7K6%j9L8PmJOj9L4nmj1k0M0p1P8
7701C2n5j2J3J7L1J1n6J2p9N7P0k3Lnj0l1L7Pm3%J3L8l6rkK7m1N7o3R0o7j2Mj8
7735d3RNO9n4j6M3J3o9M6lk7O9q2M7j4Roj7J8n2P2l9K7M8n2j9rK3K7n6L7k4PJ1
7769bn6O0J1m9J2O0j5j3nL4k3j2J2Nml7P1o8N1Pj8j2M9n5%j0K0O8r9k6OO5M4q1
7803a0J1J1m7L7j4L5l7k5R5o8N0j0Pk0j0j8j1L6J0k6n8K1P5jn8L8k1j1O3l3O1
7834G2l9ql7oJJ3n4R4m0K1k2m9R0Nm7n4oO5K1j5j7N5l4m8L5Rm8L2nJ8Nj2k4L7
$$ plain form
7868 8 -27 -31 47 -9 -1 25 56 18 1 17 -30 22 1 20 -48 3 37 -15 -41 103 -48 2 -60 6 15 -53 -31 -5 -28 22 28 7
7900 7 -14 -19 -11 28 -42 -17 15 -30 -14 -38 2 36 43 -26 11 27 36 40 16 24 -42 -25 34 23 2 -38 -48 -1 -24 10 11 -73 55 36
7934 36 -42 -20 -19 -41 9 3 -31 -68 37 43 44 6 -49 -48 3 3 22 -12 25 3 43 41 -21 -31 -33 6 12 51 14 40 -9 -44 2 5 12
7969 12 -36 28 35 -19 11 -5 41 16 -10 6 30 36 -22 20 -30 -36 -38 20 4 3 -69 -25 -9 8 -27 -10 37 35 -27 -14 -25 14 21 28
8003 28 -21 -51 6 14 32 25 -30 -39 44 12 24 -18 -51 -26 31 -25 10 3 20 -24 26 11 -26 5 -2 28 9 -13 -55 46 55 -23 -37
8036 -37 -20 -17 41 2 1 -30 -23 32 -2 30 -29 -27 32 7 32 43 -18 -22 30 -4 -20 -27 22 -22 41 24 -15 21 8 -31 1 -24 -10
8069 -10 -7 51 19 51 6 0 18 0 14 21 33 8 19 -51 -14 40 -10 -17 52 4 22 -22 35 -24 23 58 -5 0 24 72 39 -31 1
8102 1 -2 27 -18 1 -33 43 27 -32 -26 -14 37 27 -43 14 -39 2 -28 -45 13 -10 28 -24 -8 -9 -14 -4 7 -8 -18 7 -2 -3 3 2 13
$$ packed form
7868Hl5mP8n6QK6L1l8j7J6m7N2k1J9o8N1L4n2k6J44j51N0o2O6Ro8K2K6k3N0Ok1
7900Gk1nQL9p0K5L2m5J6k4M0L4Po9L7J6RMk4Qo6J7N9j1k1m0j0M7k3L4Jq4J28j9
7934C6p8K2Jk2N0ol4l7J05OJl8n5JN1%J9l4L7k2M0ko2j0kL9OL9l7K6m9l5M6LP
7969A2m8O4Pn4L0j6M6k5k6J6K4On8M2n0okN8j6jp2M4J6J7l5J7M7ko2J3j1L9PP
8003B8m9l0N7QJ8pn5rQ3l2J2m2l3K5N7n6L5pJ7m4N0j5l7L1pL0j9k2m2J01Rp8j4
8036c7J7LN8l9jl1PN5l4L2n9KN9k5K5J1o1mN2l4j6pM9m4O3j7l9L6j3l9L2k5J4
8069a0LN8l2L2m5oJ8j8J4PJ2k5J1p0L7N4n0pO9m8J8m4N7n9M7L5o3NK4M8l3p0L2
8102AlK9m5J9l4P6j6n9OJ2N1j0p0N7n3M1l0j7N8k3L8n2J6jnJ0J1j5j0K5rjOjJ1
$$ plain form
8137 13 41 26 56 -10 -13 -37 6 -42 2 46 -21 44 7 -8 20 12 -8 3 -6 -28 -22 -58 53 37 1 -15 -17 -30 65 -8 54 3
8169 3 3 36 36 -15 30 51 1 45 35 5 -25 -26 13 12 -21 -7 -9 15 -72 -40 -16 44
$$ packed form
8137A3K8j5L0o6lk4M3m8M4M4o7O5l7j5K8qk0J1rk2Ol6J11j6l6j6kj3R5p3O2n1
8169C%L3%n1M5K1n0M4j0l0l0jL9jl3J4kK4q7L2K4O0
8191D4
$$ Imaginary data points
##PAGE= N=2
##DATA TABLE= (X++(I..I)), XYDATA
$$ plain form
0 0 0 0 0 0 0 0 0 0 0 0 0 0 0 0 0 0 -8 8 -8 8 -8 9 -16 16 -17 24 -25 32 -33 40 -46 51 -58 66 -74 86 -97 108
38 108 -122 136 -150 167 -185 205 -226 251 -277 306 -336 371 -408 450 -496 547 -605 670 -742
57 -742 824 -922 1035 -1169 1334 -1537 1800 -2151 2649 -3411 4744 -7723 29075 -38356 -54749
72 -54749 60830 33711 -6840 19903 18400 -28911 -23140 795 15192 -3342 -40971 -28275
84 -28275 30561 10119 -46562 -13102 48922 18321 -28018 -2176 26081 -6942 -14341 36258
96 36258 31446 -44490 -43952 32198 40287 -11110 -19639 -2631 -409 -153 4349 13130 8785 -29834
110 -29834 -31947 29434 27665 -43496 -25937 41555 10804 -38093 810 31843 3849 -1873 19911
123 19911 10309 -18724 -15722 22769 35426 -14740 -53705 -15194 27465 4164 -22442 -3673
$$ packed form
0@%%%%%%%%%%%%%%%%qJ6j6J6j6J7k5L2l3M1m9N7o5P3q6R7j09J24j40J60j83K05
38A08k30K58k86L17l52L90m31M77n28N83o42P07p79Q58r46J043j152J275j412
57g42J566j746J957k204K503k871L337l951M800o060Q155j2467L6798o7431j6393
72e4749J15579k7119m0551K6743j503m7311N771K3935J4397j8534l7629J2696
84b8275N8836k0442n6681L3460O2024l0601m6339K5842K8257l3023p399N0599
96C6258m812p5936N38P6150Q089n1397q529J7008K222K56M502Q781m345l8619
110b9834k113O1381j769p1161J7559O7492l0751m8897L8903L1033k7994n722K1784
123A9911r602k9033L002L8491J2657n0166l8965L8511M2659k3301k6606J8769
$$ plain form
135 -3673 3842 -19195 -7258 37202 26133 -26834 -14554 38018 20476 -25687 -5799 25443
147 25443 2835 -19783 -9285 -515 -4177 -6387 2364 11965 -9527 -35432 1641 47359 10127
160 10127 -35561 -5947 19572 -3735 -1343 23828 3436 -29134 -10266 25393 18447 -14093
172 -14093 -17124 9649 14304 -10910 -15189 8415 10414 -11079 -9428 7730 -4893 -21615 8047
185 8047 34789 -3187 -38062 -2159 33333 11947 -7232 1974 -1593 -10878 2867 17591 7003
198 7003 -17075 -22544 3609 19511 -7180 -22440 7281 16689 -12824 -12488 14628 7876 -8973
211 -8973 7268 16775 -9010 -20842 6758 26585 6529 -20036 -15690 4415 8796 1586 1502 -439
225 -439 -14472 -14833 12841 23690 -7485 -24127 4615 18729 -5073 -9680 10927 7424 -8066
$$ packed form
135c673P515k3037J1937M4460j1069n2967J2280N2572j7542m6163J9888L1242
147B5443k2608k2618J0498Q770l662k210Q751R601k1492k5905L7073M5718l7232
160A0127m5688K9614K5519k3307K392K5171k0392l2570J8868L5659o946l2540
172a4093l031K6773M655k5214m279K3604J999k1493J651J7158j2623j6722K9662
185H047K6742l7976l4875L5903L5492k1386j9179R206l567r285J3745J4724j0588
198G003k4078n469K6153J5902k6691j5260K9721R408k9513L36K7116o752j6849
211h973J6241R507k5785j1832K7600J9827k0056k6565M346K0105M381p210q4j941
225d39j4033l61K7674J0849l1175j6642K8742J4114k3802m607K0607l503j5490
$$ plain form
238 -8066 -338 7297 -4155 -7830 6056 13474 -911 -20732 -13708 15819 19123 -8462 -15635 23
252 23 -199 -2498 14356 13440 -15366 -19147 10340 19536 -1387 -10709 420 5164 -1810 -4006 1544
267 1544 3244 -1802 -2569 3213 -59 -11714 -4414 17708 11821 -17061 -16948 8130 11889 1264
281 1264 2755 -227 -13215 -6417 15064 15130 -4873 -14610 -4704 8777 7057 -4976 -5028 3500 -615
296 -615 -6674 2023 4854 -6205 -2439 12377 3263 -15839 -6904 14580 12896 -3113 -9239 -6120
310 -6120 -494 6754 9194 1438 -10363 -12877 509 15081 7535 -11299 -9424 5490 4467 -3049
324 -3049 2234 4336 -4199 -2474 6134 357 -8240 49 10127 4409 -7677 -10716 -1270 10179
338 10179 8483 -3186 -7895 -5409 -1970 7098 13417 -460 -16526 -6543 11091 8169 -2557 -3052
$$ packed form
238h066P728P635j1452l675J3886P418j4385j9821P024K9527L304k7585p173J5658
252B3k22k299J6854r16k8806l781K9487R196k0923r322J1129M744o974k196N550
267A544J700n046p67N782l272j1655P300K2122n887k8882J13K5078L759j0625
281A264J491k982j2988O798K1481O6k0003r737R906J3481j720j2033n2Q528m115
296f15o059Q697K831j1059L766J4816r114j9102Q935K1484j684j6009o126L119
310f120N626P248K440p756j1801k514J3386J4572p546j8834J875J4914j023p516
324c049N283K102q535J725Q608n777q597Q289J0078n718j2086l039R446J1449
338A0179j696j1669m709K486L439R068O319j3877j6066R983J7634k922j0726m95
$$ plain form
352 -3052 -1910 -2738 1280 3958 -504 -3273 369 3222 944 -4625 -5668 4156 11741 1569 -11588
367 -11588 -7074 4087 6362 5454 1850 -9289 -12035 3658 14341 4472 -7793 -7838 -1261 5100
381 5100 6116 27 -4218 -1658 377 507 1470 -1160 -3478 2928 6285 -3944 -9681 908 9276
396 9276 5201 -1061 -5627 -7374 298 10416 7345 -4905 -10908 -6043 4325 9971 2877 -7779
410 -7779 -6518 1990 4390 3022 2048 -1520 -2878 2676 3941 -3547 -4665 3196 5024 -1244 -6021
425 -6021 -6515 -1344 7461 7536 -3156 -9060 -4160 3822 9908 7724 -4676 -11057 -1339 8078 5438
440 5438 -611 -4215 -5569 -1214 4558 2060 -3379 -1847 2065 1379 -1032 -2444 -1594 3519 6549 -128
456 -128 -8170 -5278 3292 7221 5128 -2115 -9577 -5536 7190 10482 1572 -5804 -6537 -2153 5331
$$ packed form
352c052J142q28M018K678m462k769L642K853k278n569j043R824P585j0172j3157
367a1588M514J1161K275r08l604j1139k746J5693J0683r869j2265m5O577O361
381E100J016o089m245K560K035J30R63k630k318O406L357j0229n737J0589Q368
396I276m075o262m566j747P672J0118l071j2250o003M865J0368N646p094j0656
410g779J261Q508K400j368r74l568j358N554J265p488j118P861J828o268m777
425f021m94N171Q805P5j0692n904M900P982O086k184j2400o381R718R417k640
440E438o049l604j354M355N772k498n439J532L912o86k411j412Q50N113L030o677
456a28q042K892Q570L929k093p243p462M041J2726L292q910p376p33M384P484
$$ plain form
471 5331 6341 -2361 -7007 -2239 1270 668 319 -1134 -1258 3260 3898 -2615 -4207 2436 6746 4825
487 4825 -913 -7167 -6441 3434 8986 2040 -7392 -8846 -3219 4685 8088 1435 -7410 -5595 3029
502 3029 6078 3125 -107 -2363 -1360 2649 2011 -2780 -1910 2495 2100 -1106 -3641 -4938 -97 7718
518 7718 5007 -5357 -8005 -1903 4510 7724 3554 -6443 -8806 215 7508 5490 -637 -5242 -4232
533 -4232 2351 5611 1080 -2988 -1109 1177 301 -1080 -2148 -1873 2074 4302 -1418 -7278 -3495 4597
549 4597 6997 3205 -3661 -7516 -1493 7896 7638 -170 -5724 -6097 -641 6522 4804 -4075 -6152 -973
565 -973 1452 1158 692 -1142 -1223 2087 1891 -2353 -2527 1943 4903 3272 -2116 -6460 -3143 5350 7359
582 7359 63 -6675 -6280 -752 5497 6517 -854 -7927 -4586 3572 5359 1555 -2000 -3179 -595
$$ packed form
471E331J010q702m646M768L509o02l49j453j24M518O38o513j592O643M310j921
487D825n738o254P26R875N552o946r432j454N627P904L403o653q845J815Q624
502C029L049k953l232k256J003M009o38m791Q70M405l95l206k535j297M841P815
518G718k711j0364k648O102O413L214m170r997k363R021P293k018o127m605J010
533d232O583L260m531m068J879K286q76j381j068K75L947K228n720n860L783Q092
549D597K400l792o866l855O023R389k58p808n554l73N456P163j718q879k077N179
565i73K425k94m66j834q1L310j96m244j74M470K960j631n388m344L317Q493K009
582G359p296o738L95N528O249J020p371p073L341Q158J787l804l555j179K584
$$ plain form
597 -595 2996 1465 -1891 -417 1951 1174 -314 -2495 -3792 1340 6864 2192 -6251 -6288 -125 4984
613 4984 5814 632 -6581 -6140 1656 7084 4698 -1913 -5959 -2796 3730 4657 -196 -2793 -942 416
629 416 107 38 -978 -1359 1857 3472 -1757 -5854 -1462 4889 5528 797 -5065 -5990 792 6933 4808
646 4808 -1642 -5969 -5318 1620 7466 2912 -5202 -4887 471 2375 1705 528 -1324 -1063 1359 1336 -1357
663 -1357 -1807 1188 3682 2031 -3301 -5775 -715 6025 4848 -2051 -5609 -3878 587 5522 5414 -2460
679 -2460 -7880 -2475 4975 4761 168 -2714 -2461 429 2529 1178 -779 -502 366 977 278 -2923 -3404
696 -3404 2431 5491 -677 -6429 -3906 1738 4703 4229 -530 -5766 -4099 3535 7619 3267 -3901
711 -3901 -5632 -730 4132 2868 -1506 -2789 -1570 -768 446 972 -1162 -1615 2237 3078 -2154 -4282
$$ packed form
597e95L591j531l356J474K368p77j488k181j297N132N524m672q443l7O163N109
613D984Q30n182p213M41P796N428k386o611m046L163O526R27m853k597J851J358
629D16l09o9j016l81L216J615n229m097M392O351O39m731n862r25O782O141k125
646D808o450m327O51O938N846m554q114L15N358J904o70j177j852K61K422k3k693
663a357m50K995K494j651n332k474N060O740j177o899l558J731M465M935j08p874
679b460n420N405P450k14m593k882K53K890K100j351j957K77Q68O11o99l201m81
696c404N835L060o168n752K523N644K965m74m759n236J667P634M084m352p168
711c901j731M902M862j264m374j283J219Q02J214N26k134m53L852Q41n232k128
$$ plain form
727 -4282 904 5258 3631 -1081 -4610 -3530 1825 5417 3173 -2526 -6389 -3694 4069 6741 58
742 58 -5481 -2983 1095 1840 1512 349 -2215 -1940 1359 1840 -1292 -1697 1891 3891 958 -3418 -3149
759 -3149 2001 5164 2298 -2575 -4789 -3619 928 5409 2787 -5354 -7268 -71 5110 3322 -213
774 -213 -1881 -1619 1030 3375 2260 -446 -1265 127 1416 -305 -3473 -2064 2886 2803 -2777 -4926
790 -4926 -1808 1922 3922 3347 -1488 -5728 -2165 5177 6484 459 -4855 -3959 955 3896 2219 -1043
806 -1043 -2561 -1772 296 2203 814 -2300 -1266 2398 1066 -3453 -2978 1611 3275 1301 -1545 -3613
822 -3613 -2097 2872 5764 2597 -3261 -5095 -413 5426 4642 -1693 -4774 -2430 309 1572 1465 -1185
838 -1185 -3637 -1391 2255 1287 -1634 -584 2598 2728 -156 -2460 -1085 2349 3846 1383 -2640 -4523
$$ packed form
727d282N186M354j627m712l529J080N355L592k244n699l863K695P763K672o683
742E8n539K498M078P45l28j163k564K75L299M81l132m05L588K000k933m376K69
759c149N150L163k866m873k214J170M547M481k622q141j914P197N181j788l535
774b13j668K62K649K345j115k706q19J392J289j721l168J409M950q3n580k149
790d926L118L730K000n75m835m240L563P342J307o025n314Q96M914K941j677l262
806a043j518P89K068J907j389l114J034L664j332m519M75M589J664j974k846k068
822c613J516M969K892l167n858j834M682N839p84o335l081K344K739J263j07k650
838a185k452K246L646r68k921J050L182J30k884k304J375L434J497k463m023j883
$$ plain form
854 -4523 -2392 2813 5079 125 -6129 -4804 1542 4164 2074 -812 -2780 -2203 1422 3633 1273
869 1273 -1588 -1151 1070 1607 -362 -1905 118 2785 1358 -2326 -3154 -1121 1508 3230 1511 -3600
885 -3600 -5548 -398 5065 3953 -1226 -4183 -2416 1794 4144 2415 -1224 -2638 -983 1688 2254
900 2254 -198 -2244 -504 1572 -269 -2731 -1401 1312 1953 655 -1797 -3430 -1207 3610 4627
915 4627 338 -4004 -3479 1316 5157 3234 -1802 -3887 -1650 1420 2744 1282 -2208 -3355 -499
930 -499 1777 113 -1624 -526 1148 1009 -491 -1647 -628 2356 3511 938 -2548 -3138 -29 3919
946 3919 3815 -1334 -5376 -3086 1917 3594 1280 -2133 -3775 -1540 2440 2968 125 -1822 -786 1064
962 1064 1372 5 -964 355 2098 879 -1769 -2316 -319 2209 2860 41 -4019 -3807 1033 4323
$$ packed form
854d523K131N205K266m954o254J325O346K622k090k886j968N77L625K211k360
869A273k861M37K221N37j969j543K023K667j427l684q28K033K629J722j719n111
885c600j948N150N463j112n179k957J767M210K350j729l639j414J655K671N66
900B254k452k046J740K076j841k462J330K713O41j298k452j633K223M817J017
915D627m289m342N25M795L841j923n036k085K237L070J324j462l490j147K856
930d99K276j664j737J098J674j39j500j156J019K984J155k573l486n90L109L948
946C919j04n149m042K290N003J677k314l413j642K235L980N28k843j947J036J850
962A064L08j367r69J319J743j219k648n47J997K528O51k819m060K12M840L290
$$ plain form
978 4323 2186 -2246 -4246 -2047 2236 3976 1141 -2260 -2351 230 2345 2207 -81 -1505 -26 1360
994 1360 -47 -1659 -887 896 1381 -118 -2509 -3124 -69 3431 2739 -1199 -3778 -2192 2303 4930
1010 4930 2221 -2482 -3398 -424 2575 2933 475 -2495 -2525 188 1664 41 -1409 -882 335 425 -740
1027 -740 -1631 -399 2166 2422 -192 -2507 -1755 1244 3947 2893 -1793 -4343 -1488 2769 3370 389
1043 389 -3024 -3569 -690 2408 1939 -764 -2157 -1060 797 1505 201 -747 572 1897 572 -1560
1059 -1560 -1408 609 2343 1970 -957 -3660 -2331 1877 3800 1090 -2921 -3974 -1011 2808 3068 -270
1075 -270 -2937 -2219 402 2309 1832 -531 -1489 343 1765 608 -658 -19 1217 1232 -363 -2341 -2282
1092 -2282 448 2383 938 -2340 -3866 -1674 2546 4135 869 -2903 -2477 1110 3444 2859 54
$$ packed form
978D323k137m432k000K199M283J740k835l401r1K581K115j38k288j424J479J386
994A360j407j612P72J783M85j499k391o15L055L500o92l938k579J586M495K627
1010D930k709m703r16K974K999L58k458k970l0K713J476j623j450N27J217R0j165
1027g40q91J232K565K56k614k315P52K999K703j054m686k550K855M257O01k981
1043C89l413n45K879L098m69k703j393J097J857P08j304r48J319J325j325k132
1059a560J52K017J734l73k927k703J329M208J923k710m011j053K963L819K60l338
1075b70k667P18K621J907m77k363r58J832J422j157j266O39J236J5j595j978N9
1092b282K730J935j445l278j526K192M220J589l266l772M26L587K334n85k805
$$ plain form
1107 54 -2251 -1746 872 1675 -91 -1699 -1299 -38 160 -906 -1580 9 2077 1555 -849 -1988 -891
1124 -891 1776 3435 1572 -2519 -3738 -337 3233 2915 -341 -3070 -2489 730 2857 1715 -966 -2155
1140 -2155 -1022 841 1155 -492 -1547 -191 975 -252 -1472 -701 1251 2353 1623 -759 -2334 -493
1156 -493 2824 3469 323 -3391 -3535 -178 2741 1522 -1921 -3377 -1867 629 2282 1537 -815 -1333
1172 -1333 774 2113 843 -410 123 1180 803 -791 -2033 -1222 886 1784 281 -2256 -3157 -748
1188 -748 3014 3263 -565 -3367 -1864 1449 2815 1689 -813 -2490 -1291 1403 2195 315 -1348 -642
1204 -642 810 829 -621 -962 503 1331 143 -1622 -1983 -854 1185 2398 436 -3038 -2936 1051 3839
1221 3839 2431 -856 -2364 -1043 1583 2766 1335 -1305 -2526 -1023 1252 1027 -1202 -1735 6
$$ packed form
1107E4k305N05K618Q03j766j608M00J261J98j066o74J589K068n22k404j139J097
1124h91K667J659j863m091j219L401L570l18l256k729N81L219K127j142k681j189
1140b155J133J863L14j647j055J356J166j227j220P71J952J102p30k382j575J841
1156d93L317O45l146l714j44L357K919j219l443j456J510K496J653p45k352n18
1172a333K107J339j270j253N33J057l77j594j242Q11K108Q98j503k537r01K409
1188g48L762K49l828k802J503L313J366j126k502j677J199K694P92j880j663P06
1204f42J452J9j450l41J465Q28j188j765l61J129K039J213j962l474J02L987K788
1221C839j408l287j508J321K626J183j431k640j221J503K275k25k229n33J741
$$ plain form
1236 6 629 -624 -1123 -12 1123 1422 826 -766 -1883 -187 2895 3018 -563 -3437 -2089 1449 2858
1253 2858 939 -1759 -2663 -1428 975 2377 651 -2104 -1942 767 1591 -56 -757 445 978 364
1269 364 -409 -687 -64 1210 1932 502 -2191 -2738 271 3207 1769 -2103 -3326 -1124 1262 2064 1114
1286 1114 -1264 -2720 -883 2339 2420 -267 -1548 -93 1136 474 -394 -44 696 481 -148 -752 -1350
1303 -1350 -832 1404 2293 -664 -3658 -2027 1920 2864 724 -1441 -2033 -862 1660 3018 1185 -1888
1319 -1888 -2148 571 2203 608 -1223 -857 202 -242 -812 -414 -175 -84 677 625 -1298 -2145 542 3302
1337 3302 1922 -1605 -2465 -293 1910 2316 874 -1366 -2624 -1150 2023 2430 -593 -2750 -1169 1085
1353 1085 680 -492 -145 148 -173 8 319 -468 -477 1265 2111 -33 -2486 -1427 1861 2816 456 -1944
$$ packed form
1236FO23j253m99J111J135K99n96j592j117J696L082J23l581k874J348L538J409
1253B858j919k698r04J235K403J402j726k755J62K709Q24j647p01J202N33o14
1269C64p73k78O23J274P22j430k693n47L009K936j438l872j223K202K386Q02r50
1286A114k378j456J837L222Q1k687j281J455J229o62q68L50P40k15o29o04n98
1303a350N18K236Q89k957k994J631L947R44k140k165n92J171K522J358j833l073
1319a888k60K719J632j595j831L66J059m44n70L98K39R1P61n2j923q47K687K760
1337C302j380l527q60K172K203M06j442k240j258J474L173M07l023k157J581K254
1353A085m05j172L47K93l21J81L11p87rJ742Q46k144k453J059L288R55k360k400
$$ plain form
1371 -1944 -2082 -809 1028 2203 811 -2560 -3058 324 2668 1030 -1253 -970 178 373 464 680 315
1388 315 -186 401 832 -504 -1613 -30 2221 1283 -1943 -2839 -460 1657 1542 289 -1395 -2584 -994
1405 -994 2496 2946 -398 -2595 -909 1554 1648 354 -256 -273 -356 -66 475 -133 -1025 -120 1179 -148
1423 -148 -2406 -1571 1572 2338 88 -1544 -1347 -160 1546 2659 1047 -2228 -2612 580 2884 1258
1439 1258 -1497 -1829 -379 377 437 517 -92 -1069 -344 995 184 -1300 -191 1836 1087 -1522 -2017 38
1457 38 1621 1439 332 -1143 -2017 -455 2427 2727 -503 -3015 -1455 1406 1559 -35 -898 -1050 -1054 70
1475 70 1227 399 -983 -148 1462 622 -1097 -600 1497 1787 -68 -1558 -1374 -386 784 1528 320
1492 320 -2466 -2848 633 3124 1382 -1445 -1531 -62 899 1300 1094 -370 -1572 -556 1108 443 -1112
$$ packed form
1371a944j38J273J837J175j392l371m98L382K344j638k283K83J148J95R1K16l65
1388C15n01N87M31j336j109J583K251r38l226q96K379K117j15j253j684j189J590
1405i94L490M50l344k197J686K463R4j294o10j7q3K90N41o08q92R05J299j327
1423a48k258Q35L143P66k250j632J97J187J706J113j612l275l84L192K304j626
1439A258k755l32J450P56O0Q0o09r77P25J339q11j484J109K027p49k609m95K055
1457C8J583j82j107j475q74J562K882L00l230k512J560K861J53j594q63j52mJ124
1475G0J157q28j382Q35J610q40j719M97K097K90j855j490J84R88J170P44j208
1492C20k786l82L481K491j742k827q6J469R61M01k06j464j202J016J664o65j555
$$ plain form
1509 -1112 -669 1064 790 -1112 -1291 397 1538 1059 232 -847 -1754 -594 2143 2312 -1086 -3267 -1311
1526 -1311 1417 1787 356 -703 -1102 -669 923 2020 717 -1261 -945 852 779 -1025 -1031 691 792
1543 792 -658 -1237 -653 -114 846 1817 778 -1885 -2081 1061 3031 1111 -1678 -2067 -541 723 1123
1560 1123 762 -797 -1942 -578 1773 1451 -743 -864 893 858 -716 -791 368 581 73 -134 -823 -1689
1578 -1689 -579 1870 2143 -777 -2757 -780 2119 2238 349 -777 -1299 -952 714 1919 362 -2129
1594 -2129 -1631 715 1026 -575 -661 551 609 -220 -442 48 175 494 1276 494 -1729 -2069 764 2698
1612 2698 785 -2000 -1821 -116 928 1373 986 -929 -2228 -542 1983 1425 -1009 -1431 141 640
1628 640 -265 -312 469 437 -89 119 62 -803 -494 1604 1862 -908 -2735 -762 1702 1482 -92 -1091 -1431
$$ packed form
1509a112M43J733k74j902j79J688J141m79q27j079r07J160K737J69l398k181J956
1526a311K728L70j431j059l99M33J592J097j303j978L16J797p3j804oJ722J01
1543G92j450n79N84N39R60R71j039k663j96L142J970j920k789l89J526J264M00
1560A123l61j559j145J364K351l22k194j21J757l5j574p5J159K13n08k07o89q66
1578a689J110K449K73k920j980J977K899J19j889j126n22L47J666J205j557k491
1594b129M98K346L11j601q6J212N8q29k22M90J27L19P82p82k223l40K833J934
1612B698j913k785J79J705J044M45l87j915j299J686K525n58k434m22J572M99
1628F40r05m7P81l2n26K08n7q65L09K098K58k770j827J973K464k20j574r99l40
$$ plain form
1647 -1431 -926 983 2234 562 -1975 -1591 990 1795 106 -675 132 210 -434 -165 372 -181 -358 658
1665 658 507 -1425 -1770 760 2405 477 -1831 -1588 135 1094 1314 823 -953 -2164 -453 2314 1911
1682 1911 -971 -1802 -96 818 57 -125 274 -290 -709 84 393 -611 -654 1077 1537 -670 -2080 -325
1700 -325 1865 1553 -192 -1055 -1152 -672 911 2132 400 -2328 -1924 986 1865 160 -847 -373 -56
1717 -56 -152 381 625 -284 -731 407 735 -749 -1390 572 2040 415 -1694 -1131 434 1058 989 594 -991
1736 -991 -2189 -341 2249 1690 -1232 -2092 -292 942 625 204 119 -446 -655 341 987 -182 -841 476
1754 476 1249 -455 -1931 -400 1491 965 -490 -936 -902 -439 1129 2148 339 -2107 -1640 1148 2128
1771 2128 354 -1105 -863 -284 -70 576 754 -459 -1127 129 1058 -227 -1057 429 1601 209 -1361
$$ packed form
1647a431N05J909J251j672k537L84K581Q05j689p81Q07P8o44K69N37n53j77J016
1665F58j51j932l45K530J645j928k308K43J723R59K20m91j776j211J711K767m03
1682A911k882q31J706R14p61j82L99n64m19P93L09j004m3J731M60k207j410J755
1700c25K190l12j745q63r7M80J583J221j732k728M04K910Q79j705j007M74L17
1717e6r6N33K44r09m47J138L28j484o41J962J468j625k109N63J565O24o9l95j585
1736i91j198J848K590n59k922q60J800J234l17m21q5n65k09R96O46j169o59J317
1754D76P73j704j476J531J891n26j455m46L4M63J568J019j809k446M67K788R80
1771B128j774j459K42N79K14O46J78j213o68J256R29j285q30J486J172j392j570
$$ plain form
1788 -1361 -833 480 877 729 281 -1044 -1870 -281 2148 1668 -1165 -2225 -343 1179 874 270 -106
1805 -106 -816 -844 577 1277 -111 -1094 14 1015 -116 -1184 -119 1180 742 -462 -769 -609 -257
1822 -257 821 1648 147 -2164 -1615 1176 2101 234 -1280 -935 -241 344 1060 883 -650 -1359 141
1839 141 1223 153 -909 -119 891 136 -1135 -643 430 555 315 168 -765 -1510 22 2153 1595
1856 1595 -1067 -1977 -129 1347 1140 270 -442 -1156 -888 713 1348 -204 -1431 -573 794 208 -763
1873 -763 -124 855 447 -395 -313 -130 -98 757 1452 -29 -1881 -1302 1136 1912 200 -1415 -1204 -302 538
1892 538 1053 594 -932 -1576 -13 1433 527 -820 -365 640 234 -529 -88 444 367 170 220 -505 -1116
1911 -1116 -72 1649 1092 -1303 -2116 -325 1223 931 6 -724 -1154 -686 1095 1757 83 -1414 -507
$$ packed form
1788a361N28J313L97j48m48j325q26J589K429m80k833j060J882J522l05o04l76
1805a06p10k8J421P00j388r83J108J001j131j068J065J299m38j204l07J60L52
1822b57J078Q27j501k311N49K791R25j867j514L45O94N85P16j77j533p09J500
1839A41J082j070j062P90J010p55j271M92J073J25k40j47r33p45J532K131n58
1856A595k662r10J848J476k07q70p12p14K68J601O35j552j227Q58J367n86r71
1873g63O39R79m08q42Q2J83L2Q55O95j481j852N79K438P76j712j615K11R02Q40
1892E38N15m59j526o44J563J446r06j347M55J005m06p63M41N32p7j97N0p25o11
1911a116J044J721n57k395q13J791J548k92r25p30m30M68J781O62j674j497R07
$$ plain form
1928 -507 975 624 -263 -152 338 8 -425 -280 -170 -245 225 794 -89 -1599 -1146 1145 1806 192 -1187
1947 -1187 -909 99 908 1340 721 -989 -1561 143 1588 695 -846 -884 53 106 -302 -158 47 -171 -229
1966 -229 125 -124 -760 36 1472 1152 -852 -1425 123 1454 1135 3 -802 -1227 -516 975 1360 -302
1984 -302 -1856 -1042 714 843 -140 -382 68 -5 -95 319 365 -135 130 733 222 -1081 -793 976 1427 2
2004 2 -1321 -992 -9 807 870 186 -1288 -1745 -33 1628 816 -928 -1061 78 645 391 428 294 -59
2023 -59 -49 479 297 -483 -280 728 474 -1019 -1646 -354 965 675 -345 -861 -850 -31 1314 1691 127
2042 127 -1405 -667 1153 1333 182 -563 -568 -354 -111 181 41 -511 -519 193 162 -617 -645 651 1208 157
2062 157 -1014 -645 355 935 931 229 -989 -1227 335 1692 950 -843 -1238 -236 669 492 15 -385
$$ packed form
1928e07J482l51q87J11M90l30m33J45J10p5M70N69q83j510M53K291O61j614j379
1947a187K78J008Q09M32o19j710n72J704J445q93j541l8R37N3m08J44K05k18n8
1966b29L54k49o36P96J436l20k004n73J548J331l19j132q05m25P11J491L85j662
1984c02j554Q14J756J29r83k42M50p3r0M14M6n00K65O03n11j303K88J769M51j425
2004Bj323L29R83Q16O3o84j474m57J712J661q12j744j33J139N67k54L7j34l53
2023e9J0N28j82p80K03J008k54j493o27J292J319k90j020n16J1Q19J345L77j564
2042A27j532P38J820J80j151p45nK14K43K92j40n52qP12l1p79k8J296N57j051
2062A57j171L69J000N80mp02j218k38J562J357p42j793l95J002R05j77m77m00
$$ plain form
2080 -385 -717 -536 115 281 -290 -431 380 712 -280 -745 298 1287 946 9 -713 -691 -12 921 937 -555
2100 -555 -1871 -1232 574 1127 23 -953 -722 -23 531 878 567 -140 -286 368 628 -62 -481 278 624
2119 624 -20 -997 -806 83 642 480 -166 -1011 -1108 294 1498 899 -803 -1388 -195 906 894 175 -416
2138 -416 -578 -187 584 699 -64 -530 -3 409 -105 -606 -200 533 406 -421 -920 -672 121 929 842 -188
2158 -188 -1189 -603 1094 1590 448 -790 -841 -58 631 621 -15 -792 -893 -152 411 11 -536 -182 411
2177 411 178 -411 -363 396 731 584 -89 -665 -601 363 1164 570 -870 -1401 -411 901 948 -45 -789 -768 -41
2198 -41 696 693 -59 -645 -303 383 334 -169 -110 288 446 -99 -482 -318 259 711 462 -346 -1117 -663 612
2219 612 1257 234 -1011 -1113 -76 775 767 3 -735 -739 125 789 512 -238 -390 121 302 -49 -343 2
$$ packed form
2080c85l32J81O51J66n71j41Q11L32r92m65J043R89l41r37p22K2O79R33J6j492
2100e55j316O39J806N53j104r76K31O99N54L47l11p07j46O54K60o90m19P59L46
2119F24o44r77J91Q89N59j62o46q45r7J402J204n99j702n85J193J101j2p19n91
2138d16j62L91P71J15p63m66N27M12n14n01M06P33j27q27m99K48P93Q08q7j030
2158a88j001N86J697M96j142j238n1P83O89j0o36p77j01P41N63m00n47L54N93
2177D11k33n89M8P59L35j47o73n76O4R64Q01n94j440n31R90J312M7r93p44K1P27
2198d1P37lp52n86L42O86m9n03N9L98J58n45l83J64N77M52k49q08p71M54J275
2219F12O45j023j245j02J037Q51qp64p38mQ64O64k77p50j52N11J81l51k94L45
$$ plain form
2239 2 301 228 -330 -681 -406 290 927 516 -660 -1111 -182 1031 1110 100 -933 -785 63 791 690 -173
2259 -173 -801 -506 272 516 33 -401 -136 183 40 -274 -213 163 464 300 -245 -749 -395 652 1033 244
2279 244 -897 -1001 3 1040 879 -121 -920 -671 180 855 530 -328 -678 -177 362 226 -143 -195 178
2298 178 189 -116 -437 -203 259 677 317 -557 -900 -229 834 902 -74 -1056 -877 265 893 630 -287 -869
2318 -869 -483 379 798 276 -357 -348 77 271 -4 -153 49 313 174 -266 -529 -251 482 781 141 -766 -915
2339 -915 101 1003 754 -253 -1014 -683 287 922 446 -467 -811 -268 398 511 13 -292 -124 123 66 -97
2359 -97 -173 123 425 164 -395 -622 -99 664 768 -127 -869 -724 306 969 561 -341 -942 -443 533 839
2379 839 275 -539 -660 -48 438 232 -130 -228 -22 129 -130 -325 -146 320 489 93 -633 -658 99 799 686
$$ packed form
2239BK99p3n58l51K75O96O37m11j176m51R29J213P9j010j033J48Q48P28j01q63
2259a73o28K95P78K44m83m34K65L19j43l14O1L76L01j64n45n04L54J047L81p89
2279B44j141j04J004J037j61j000p99K49Q51O75l25q58l50N01N39j36l69n2L73
2298A78J1l05l21K34M62M18l60q74l43O71J063O8r76r82J79J142O28k63r17n82
2318h69L86Q62M19n22o33RM25J94k75j49K02K64j39m40k63K78P33K99o40r07j49
2339i15J016R02k49j007p61L31R70O35m76r13l44N43O66J13m98l05J68K47n7j63
2359i7p6K96L02k61n59k27N23P63J04q95p42J45J030O63m08r02o01M99R76L06
2379H39n64q14j21O12M86k06l62r8K06J51k59j95J79M66J69l96p26k5P57P00j13
$$ plain form
2400 686 -245 -971 -542 439 984 470 -504 -828 -256 502 708 39 -475 -387 98 282 79 -166 19 182
2420 182 116 -217 -401 -14 522 520 -115 -746 -638 250 943 528 -499 -997 -443 518 814 236 -620 -708 -125
2441 -125 508 504 -68 -393 -181 161 159 -73 -109 156 282 -19 -387 -431 85 670 440 -346 -838 -492 512 935
2463 935 359 -570 -796 -124 607 697 28 -609 -567 22 513 251 -170 -307 48 148 -92 -280 31 283 322
2484 322 -139 -541 -404 197 749 423 -401 -871 -282 629 919 154 -584 -669 15 610 593 -55 -566 -445 124
2505 124 352 -5 -171 -58 163 16 -196 -158 146 477 331 -241 -602 -404 439 828 189 -701 -891 -106
2525 -106 663 647 -100 -639 -579 64 618 541 -158 -472 -62 289 223 -119 -52 145 154 -62 -265 -191 202 481 281
2548 281 -444 -812 -277 595 751 -11 -780 -662 50 631 541 -106 -596 -392 314 631 264 -260 -256 135 137 -126
$$ packed form
2400F86r31p26M29R81N45n14r74l24N72P58K06o69n14Q8M85J84k03k45J85J63
2420A82o6l33j84L87N36ko35o31J08Q88O93m15j027m98N54R61K96n78q56q8N83
2441a25O33mn72l25K12L42kk32l6K65J26l01l68m4N16N85k30p86m92L46J004M23
2463I35n76r29k26O72P31R0o69o37M2N89M91k62m21j37L55J00k40j88L11K52L9
2484C22m61m02J37O01N52l26q24m70N89R11K90p65p38q5O84N95j7o48n11J21N69
2505A24K28l57j66J13K21j47k12L8L04L31j46n72l61J98Q43L89o39q90j90P85
2525a06P69j6p47n39O0O43N54p7o99l14M10L51o6l42O7J97Rk16k03P4L93K79k00
2548B81p25l68N35Q72J56p62p69J18P12N81r0o47m90K04P06L17l67n24ML91Kk63
$$ plain form
2570 -126 -132 0 105 127 -195 -486 -294 236 719 239 -518 -661 129 854 722 -40 -603 -530 159 663 487
2591 487 -298 -746 -340 258 382 -104 -198 -32 76 15 -111 -64 139 287 203 -238 -587 -163 613 737 -41
2612 -41 -751 -511 188 646 554 -166 -697 -539 215 628 228 -483 -498 30 331 207 -47 59 115 116 137 -98
2634 -98 -121 245 509 144 -569 -739 -6 617 397 -288 -740 -526 155 650 480 -204 -636 -236 503 626 61
2655 61 -284 -158 99 85 4 -18 -59 29 70 -168 -410 -211 364 490 -97 -716 -468 216 658 428 -137 -588
2677 -588 -311 454 836 391 -402 -567 -38 409 161 -116 -238 -219 -139 -124 -127 -124 -38 157 164 -298 -404 113 652
2700 652 494 -192 -580 -315 298 685 355 -375 -778 -364 451 526 13 -519 -404 -16 207 131 -53 -140 -94
2721 -94 118 79 -90 -57 285 453 31 -442 -343 250 576 267 -324 -682 -421 154 590 160 -514 -645 -37
$$ packed form
2570a26oJ32J05K2l22k91J92N30M83m80p57j43P90P25j32p62n63P3O89N04j76
2591D87p85m48M06N98J24m86r4J66J08o1j26M7K03J48q4m41l49M24P76J24p78
2612d1p10K40O99M58r2p20n31J58P54M13m00p11j5N28L01j24k54J06N6JK1k35
2634i8k3L66K64l65p13j70P33O23k20o85m52K14O81M95j70o84m32M00P39J23n65
2655F1l45J26K57j4q1k2m1Q8M1k38k42J99N75J26n87o19K48O84M42k30n65m51
2677e88K77P65L82m45p93j65N29M47k48k77j22J9Q0J5lLQ6J95Pm62j06N17N39
2700F52j58o86l88K65O13L87l30p30m03M14Q15P5n13n32J15L88K23p6j84q7M6
2721i4K12l9j69L3L42J68m22m73R9N93L26l09n91l58K61N75M36m30o74j31O08
$$ plain form
2742 -37 488 458 -2 -219 -77 229 328 233 2 -33 76 41 -240 -402 -93 276 267 -303 -620 -293 343 601 346
2765 346 -259 -566 -160 579 672 45 -571 -485 83 415 241 -104 -229 -171 93 63 -8 -126 16 160 -45 -391
2787 -391 -306 130 475 201 -348 -527 -172 418 714 296 -341 -540 15 590 530 -130 -544 -404 45 137 30
2808 30 -233 -305 -38 77 45 -52 88 375 294 -25 -404 -156 323 572 151 -457 -642 -233 402 468 -110 -568
2830 -568 -470 91 530 355 -120 -337 -167 192 319 94 -91 -9 29 96 -109 -214 124 321 185 -303 -440
2851 -440 -152 363 475 45 -526 -619 -66 477 419 -112 -514 -320 220 404 237 -144 -226 -78 164 189 -45
2872 -45 -126 -2 108 -132 -357 -193 185 319 73 -347 -420 -41 433 574 42 -501 -456 161 604 328 -265
2893 -265 -504 -225 175 296 21 -292 -285 -44 129 -31 -109 29 171 176 -165 -304 -103 335 434 40 -410 -447
$$ packed form
2742c7N25l0m60k17J42L06R9r5k31l5J09l5k81j62L09L69rn70l17L27O36K58k55
2765C46o05l07M06P39R3o27o16Q6N68L32j74l45j25N8K64l0p1j18J42J44k05l46
2787c91Q5M36L45k74n49j79L55N90K96m18o37j99N55N75o0o60m14J40M49R2j07
2808C0k63p2K67J15l2r7J40K87q1l19l79K48M79K49m21o08j85M09O35O6n78m58
2830e68R8N61M39j75m75k17J70L59J27k25j85Q2L8O7k05j05L38J97j36m88j37
2851d40K88N15J12m30n71r3N53N43n8n31m02J94N40J84j67l81q2J48K42K5k34
2872d5q1J24J10k40k25J64L78J34k46m20p3L79M74J41n32n43M5O17M43k76n93
2893b65k39K79M00J21k75l13PK41J73j60p8J38J42Nl41j39K01M38R9l94m50l7
$$ plain form
2915 -447 96 528 404 -166 -523 -335 252 460 210 -221 -362 -102 220 246 0 -95 -62 54 -23 -52 -90 81
2937 81 216 56 -297 -304 -19 365 419 -69 -464 -381 216 465 303 -301 -540 -291 221 389 96 -285 -337 -26
2959 -26 265 159 -62 -100 44 63 -89 -154 -89 175 245 -14 -343 -319 101 481 356 -133 -541 -234 230 500
2981 500 173 -316 -489 -155 267 271 -54 -288 -161 39 103 44 -38 34 124 66 -81 -174 -59 293 304 -159 -518
3004 -518 -333 217 458 128 -232 -472 -200 309 515 192 -277 -351 39 338 193 -40 -156 -55 -33 5 -55
3025 -55 -55 41 162 41 -226 -292 54 437 244 -257 -452 -137 251 421 161 -258 -466 -190 356 478 -82 -387
3047 -387 -165 145 208 91 -26 -99 -85 -11 18 -45 -118 128 287 -50 -376 -207 318 465 88 -251 -351 -168
3069 -168 189 405 128 -419 -525 41 402 193 -170 -216 -2 32 101 133 -26 -140 60 165 -3 -232 -5
$$ packed form
2915d47N43M32j24n70l57J88N87K08k50m31j41K60L22K6k46r5L3J16p7k9l8J71
2937H1J35j60l53pK85L84N4m88l95Q3N97K49j62o04k39K49N12J68k93l81n2L11
2959b6K91j06k21l8J44J9j52o5O5K64P0k59l29K4M20L80j25m89m08L07M64K70
2981E00l27m89j73L34M22Ml25k34J27K00O4n9q2P2R0n8j47r3J15L52J1m63l59
3004e18J85N50K41l30l60k40K72N09K06l23m69p4L90K99j45k33j16J01K2L8o0
3025e5%R6J21j21k67o6L46L83j93n01j95L15L88J70k60m19k08K76N46J22n60l05
3047c87K22L10O3j17j17p3J4P4K9o3p3K46J59l37l26J69N25J47l77l39j00J83
3069a68L57K16k77n47j06N66L61k09l63m6K14L4O9L2j59j14K00J05j68k29K27
$$ plain form
3090 -5 276 175 -303 -400 -53 345 259 97 -255 -402 -162 412 484 -101 -478 -253 222 255 34 -70 -111 -132 0
3113 0 95 68 -172 -32 148 28 -344 -200 293 353 -15 -279 -187 8 200 380 148 -364 -548 5 521 264
3135 264 -225 -340 -17 64 109 216 51 -240 -144 161 137 -258 -163 261 220 -288 -369 44 301 149 -6 -196
3157 -196 -296 -214 361 462 -24 -625 -275 348 339 57 -134 -123 -142 -53 267 141 -178 -180 228 225 -197 -128 197 352
3181 352 -67 -247 -157 50 39 162 151 -325 -441 40 645 358 -330 -361 53 184 149 164 43 -319 -286 193
3203 193 233 -168 -301 167 220 -164 -306 135 354 106 -69 -123 -207 -152 263 463 32 -596 -319 411 433 31
3225 31 -215 -66 -92 -24 250 230 -156 -347 114 268 -159 -299 108 287 -128 -404 -27 164 55 167 188 -171
3247 -171 -472 17 495 307 -412 -495 52 220 73 26 23 -253 -301 218 469 17 -326 60 341 -8 -256 22
$$ packed form
3090eK81j01m78r7L47L98q6j62l52j47K40N74P2n85l77K25M75L3k21j04m1k1J32
3113@R5k7k40J40J80j20l72J44M93O0l68k64R2J95J92J80k32n12j84N53N16k57
3135B64m89j15L23Q1M5J07j65k91R6L05k4l95R5M24m1n08q1M13K57j52j55j90
3157a96j00Q2N75J01m86o01L50O23rk82j91J1j9Q9L20j26l19kM08lm22O9L25J55
3181C52m19j80R0K07j1J23j1m76j16M81O05k87o88l1M14J31l5J5j21l62L3M79
3203A93M0m01j33M68N3l84j42M41K19k48j75n4q4N5M15K00m31o28K77P30K2m02
3225C1k46J49k6O8K74k0l86j91M61J54m27j40M07J79m15k76L77J91j09J12K1l59
3247a71l01M89M78j88p19q3N47J68j47m7lk76m8N19K51m52l43L86K81l49k48K78
$$ plain form
3269 22 290 23 -269 -101 -65 -211 84 398 84 -552 -358 419 481 -88 -259 -136 -14 8 206 254 -206 -436
3291 -436 -33 431 93 -279 17 233 6 -319 -15 267 12 -96 78 -6 -343 -90 476 328 -368 -500
3311 -500 83 456 188 6 0 -135 -203 181 423 -36 -511 -251 260 35 -318 -45 198 -18 -213 -47 161
3332 161 6 59 302 117 -395 -343 315 518 -87 -376 -137 59 32 120 232 -174 -419 -18 429 212 -314
3353 -314 -183 180 8 -194 -52 229 42 -120 75 27 -196 -132 343 369 -324 -523 10 390 90 -186 -117
3374 -117 -191 -261 152 431 72 -465 -209 334 266 -126 -48 268 114 -206 -72 144 -47 -167 102 128 -317 -338
3396 -338 271 428 -30 -420 -155 162 177 128 197 -137 -368 -24 429 225 -274 -280 64 170 -156 -84 90 6
3418 6 -192 -13 167 -77 -154 197 309 -210 -395 24 481 236 -140 -118 -28 -87 198 376 68 -424 -344 232
$$ packed form
3269B2K68k67k92J68L6j46K95L14l14o36J94P77O2n69j71J23J22K2J98M8m60k30
3291d36M03M64l38l72K96K16k27l25L04K82k55j08J74q4l37K53N66j48o96j32
3311e00N83L73k68j82oj35o8L84K42m59m75K60N11k25l53K73K43k16j95J66K08
3332A61j55N3K43j85n12N2O58K03o05k89K39J96k7Q8J12m06k45M01M47k17n26
3353c14J31L63j72k02J42K81j87j62J95m8k23O4M75K6o93j99N33L80l00k76O9
3374a17p4p0M13K79l59n37K56N43o8l92P8L16j54l20J34K16j91j20K69K6m45k1
3396c38O09J57m58l90K65L17J5m9O9l34k31L44M53k04m99oL44J06l26P2J74q4
3418Fj98J79J80k44p7L51J12n19j85M19M57k45l76K2R0n9K85J78l08m92Q0N76
$$ plain form
3440 232 314 -99 -228 -9 -8 -156 4 191 27 -94 54 212 -100 -229 159 384 -17 -412 -226 179 160
3461 160 33 42 -103 -339 -85 361 360 -208 -322 52 318 133 -9 98 79 -167 25 196 12 -188 40 259
3483 259 -93 -394 -47 349 163 -245 -218 -31 -9 101 254 80 -369 -271 248 389 32 -222 -41 52 7 30
3505 30 164 19 -233 -24 116 -23 -213 -17 280 89 -294 -192 205 252 67 -16 -118 -171 17 355 246
3526 246 -200 -414 8 233 154 -86 -38 -45 -109 -32 154 50 -207 -33 187 -20 -215 -34 253 215 -141 -213 -37
3549 -37 56 74 169 -8 -259 -230 127 355 56 -328 -194 45 82 62 67 35 -135 -65 213 130 -67 -1 151 59 -160
3574 -160 -193 113 232 12 -152 -188 -189 -40 197 194 -87 -405 -37 362 237 9 -87 -81 -29 73 131 55 -138 -120
3598 -120 60 85 -63 -114 150 160 -109 -140 -20 102 168 59 -33 -249 -194 176 346 70 -293 -248 79 170 126
$$ packed form
3440B32Q2m13j29K19Jj48J60J87j64j21J48J58l12j29L88K25m01l95J86M05j9
3461A60j27Rj45k36K54M46jn68j14L74K66j85j42J07j9k46J92J71j84k00K28K19
3483B59l52l01L47L96j86m08K7J87K2J10J53j74m49R8N19J41l57k54J81R3m5K3
3505C0J34j45k52K09J40j39j90J96K97j91l83J02L97M7j85q3j02n3J88L38j09
3526B46m46k14M22K25p9k40M8po4P7J86j04k57J74K20k07j95J81K87l8l56p2J76
3549c7R3J8R5j77k51K9L57K28k99l84J34K39L7k0Nl2j70P0K78q3j97O6J52r2k19
3574a60l3L06J19k20j64l6jJ49K37lk81l18L68L99j25k28r6ON2J02N8p6j93J8
3598a20J80K5j48n1K64J0k69l1J20J22O6j09r2k16N5L70J70k76l63M5L27R1m4
$$ plain form
3621 126 21 -108 -128 -99 101 125 -60 -119 -13 48 -89 -130 46 114 64 -112 -120 -61 148 191 176 -88 -276 -96
3645 -96 197 194 -3 -225 -122 57 90 149 -6 -155 -160 95 186 65 -100 35 76 -32 -101 -53 108 135 1 -78
3669 -78 -197 -139 97 170 70 -258 -302 55 201 179 -17 -154 -124 -32 169 81 -20 -138 -98 142 -10 -80 -12 111
3693 111 7 -92 -102 -65 102 140 79 -141 -255 -78 228 212 -65 -266 -175 99 206 143 -10 -208 -178 30 190
3716 190 -12 -162 -31 11 -27 -24 -59 19 54 -14 -74 -79 -21 98 226 27 -131 -159 30 252 142 -21 -195 -98 -13
3741 -13 168 104 -122 -167 -107 98 85 -55 -61 58 61 -7 -38 -17 112 127 47 -124 -155 -30 122 152 -44 -225 -168 83
3767 83 165 102 -147 -197 -149 92 202 87 -89 -108 19 104 94 4 15 5 23 -51 -64 37 63 81 35 -165 -214 19
3793 19 189 146 -29 -176 -82 82 164 131 -86 -185 -41 113 105 52 -62 -87 -8 3 -52 45 -3 49 7 -73 -36 -58 151
$$ packed form
3621A26j05j29k0K9K00K4j85n9J06O1j37m1J76O8n0j76qN9K09M3j5k64j88J80
3645i6K93lj97k22J03J79L3N9j55j49nK55R1j21j65J35M1j08o9M8J61K7j34p9
3669g8j19N8K36P3j00l28m4L57J46k2j96j37L0R2K01q8j01j18M0K40j52p0O8J23
3693A11j04r9j0L7J67L8o1k20j14J77L06j6k77k01R1K74J07o3j53j98L0K08J60
3716A90k02j50J31M2l8Ll5P8L5o8o0nN8J19J28j99j58k8J89K22j10j63j74R7Q5
3741a3J81o4k26m5O0K05j3j40oJ19Lo8l1K1J29J5q0j71l1J25J52L0j96j81N7K51
3767H3Q2o3k49n0M8K41J10j15j76j9J27Q5j0r0J1j0J8p4j3J01K6J8m6k00m9K33
3793A9J70m3j75j47R4J64Q2l3k17r9J44J54qn3j14k5P9J1n5R7m8N2m2q0L7k2K09
$$ plain form
3820 151 188 32 -176 -119 100 199 184 -83 -155 -73 77 158 35 -113 -149 -19 80 89 -53 -62 -62 -1 -6 -22 2 72 28
3847 28 24 -96 -74 103 214 77 -58 -167 -128 81 170 21 -75 -201 -52 172 115 29 -55 -120 21 66 94 16 -41
3872 -41 7 6 -41 -36 -2 35 64 -53 -105 -97 51 147 55 -62 -229 -106 130 221 70 -138 -152 9 121 143 1 -3 -55
3899 -55 4 84 18 -11 -6 85 22 -72 -137 0 126 40 -12 -144 -66 55 161 67 -157 -181 -62 177 147 43 -78 -122
$$ packed form
3820A51L7j56k08N7K19R9j5k67p2Q2J50Q1j23j48l6J30R9Rj42r%O1nj6K4P0m4
3847B8mj20K2J77J11j37j35j09L9K09Q9j49r6j26J49K24n7q6q4o5J41M5K8p8n7
3872d1M8jm7NL4L7K9j17n2QJ48R6r2j17j67J23K36R1j51k08j4J61J12K2j42mn2
3899e5N9Q0o6k9NR1o3r4o5J37J26q6n2j32P8J21J06r4k24k4J19K39l0j04j21m4
$$ [...]
8191B
##END NTUPLES=NMR FID
##END=
