##TITLE=1H_ES-ZN-tBuOH
 
 8 sc, 
 24.11.2022
##JCAMPDX= 6.0         $$ Bruker NMR JCAMP-DX V2.0
##DATA TYPE= NMR FID
##DATA CLASS= NTUPLES
##ORIGIN= UXNMR, Bruker Analytische Messtechnik GmbH
##OWNER= root
$$ XWIN-NMR		Version 3.5
$$ Thu Nov 24 16:27:41 2022 Russian Standard Time (UT+4h)  she@DPX200
##.OBSERVE FREQUENCY= 200.1313499994
##.OBSERVE NUCLEUS= ^1H
##.DELAY= (6, 6)
##.ACQUISITION MODE= SIMULTANEOUS
##.ACQUISITION SCHEME= undefined
##.AVERAGES= 8
##.DIGITISER RES= 18
##SPECTROMETER/DATA SYSTEM= spect
##.PULSE SEQUENCE= zg30
##.SOLVENT NAME= CDCl3
##.SHIFT REFERENCE= (INTERNAL, CDCl3, 0, 15.7039)
##AUDIT TRAIL= $$ (NUMBER, WHEN, WHO, WHERE, WHAT)
$$ ##TITLE= Audit trail, XWIN-NMR		Version 3.5
$$ ##JCAMPDX= 5.01
$$ ##ORIGIN= Bruker BioSpin GmbH
$$ ##OWNER= she
$$ F:/spectra/data/she/nmr/H-F/1/audita.txt
$$ ##AUDIT TRAIL=  $$ (NUMBER, WHEN, WHO, WHERE, WHAT)
(   1,<2022-11-24 16:26:03.10 +0400>,<she>,<DPX200>,
      <created by zg, POWCHK disabled, PULCHK disabled
       configuration hash MD5:
       00 E9 B6 7A A2 85 ED C7 34 08 36 98 17 FE 4E 26
       data hash MD5: 16K
       C1 EB AD 1B E5 36 ED 93 5E F6 D4 67 EE B2 CC 38>)
$$ ##END=
$$ 
$$ hash MD5
$$ 40 CA 68 77 C7 44 57 B6 C7 EB B5 AC F7 57 28 BA
##$RELAX= 
##$RELAX= 
##$RELAX= 
##$RELAX= 
##$RELAX= 
##$RELAX= 
$$ Bruker specific parameters
$$ --------------------------
##$DU= <F:/spectra>
##$EXPNO= 1
##$NAME= <H-F>
##$PROCNO= 1
##$TYPE= <nmr>
##$USER= <she>
##$AMP= (0..31)
100 100 100 100 100 100 100 100 100 100 100 100 100 100 100 100 100 100 
100 100 100 100 100 100 100 100 100 100 100 100 100 100 
##$AQSEQ= 0
##$AQ_mod= 1
##$AUNM= <au_zg>
##$AUTOPOS= <>
##$BF1= 200.13
##$BF2= 200.13
##$BF3= 200.13
##$BF4= 200.13
##$BF5= 200.13
##$BF6= 200.13
##$BF7= 200.13
##$BF8= 200.13
##$BYTORDA= 1
##$CFDGTYP= 0
##$CFRGTYP= 5
##$CHEMSTR= <none>
##$CNST= (0..31)
1 1 145 1 1 1 1 1 1 1 1 1 1 1 1 1 1 1 1 1 1 1 1 1 1 1 1 1 1 1 1 1 
##$CPDPRG= <>
##$CPDPRG1= <>
##$CPDPRG2= <>
##$CPDPRG3= <>
##$CPDPRG4= <mlev>
##$CPDPRG5= <mlev>
##$CPDPRG6= <mlev>
##$CPDPRG7= <mlev>
##$CPDPRG8= <mlev>
##$CPDPRGB= <>
##$CPDPRGT= <>
##$D= (0..31)
0 1.2 0 0 0 0 0 0 0 0.06 0 0.03 0 0 0 0 0.0002 0 0 0 0 0 0 0 0 0 0 0 0 
0 0 0 
##$DATE= 1669292762
##$DBL= (0..7)
120 120 120 120 120 120 120 120 
##$DBP= (0..7)
150 150 150 150 150 150 150 150 
##$DBP07= 0
##$DBPNAM0= <>
##$DBPNAM1= <>
##$DBPNAM2= <>
##$DBPNAM3= <>
##$DBPNAM4= <>
##$DBPNAM5= <>
##$DBPNAM6= <>
##$DBPNAM7= <>
##$DBPOAL= (0..7)
0.5 0.5 0.5 0.5 0.5 0.5 0.5 0.5 
##$DBPOFFS= (0..7)
0 0 0 0 0 0 0 0 
##$DE= 6
##$DECBNUC= <off>
##$DECIM= 32
##$DECNUC= <off>
##$DECSTAT= 4
##$DIGMOD= 1
##$DIGTYP= 9
##$DL= (0..7)
0 120 120 120 120 120 120 120 
##$DP= (0..7)
150 150 150 150 150 150 150 150 
##$DP07= 0
##$DPNAME0= <>
##$DPNAME1= <>
##$DPNAME2= <>
##$DPNAME3= <>
##$DPNAME4= <>
##$DPNAME5= <>
##$DPNAME6= <>
##$DPNAME7= <>
##$DPOAL= (0..7)
0.5 0.5 0.5 0.5 0.5 0.5 0.5 0.5 
##$DPOFFS= (0..7)
0 0 0 0 0 0 0 0 
##$DQDMODE= 0
##$DR= 18
##$DS= 0
##$DSLIST= <SSSSSSSSSSSSSSS>
$$ [...]
##$SUBNAM2= <"">
##$SUBNAM3= <"">
##$SUBNAM4= <"">
##$SUBNAM5= <"">
##$SUBNAM6= <"">
##$SUBNAM7= <"">
##$SUBNAM8= <"">
##$SUBNAM9= <"">
##$SW= 18.0517283424941
##$SWIBOX= (0..15)
0 0 2 0 0 0 0 0 0 0 0 0 0 0 0 0 
##$SW_h= 3612.71676300578
##$TD= 16384
##$TD0= 1
##$TE= 0
##$TE2= 300
##$TE3= 300
##$TEG= 300
##$TL= (0..7)
0 120 120 120 120 120 120 120 
##$TP= (0..7)
150 150 150 150 150 150 150 150 
##$TP07= 0
##$TPNAME0= <>
##$TPNAME1= <>
##$TPNAME2= <>
##$TPNAME3= <>
##$TPNAME4= <>
##$TPNAME5= <>
##$TPNAME6= <>
##$TPNAME7= <>
##$TPOAL= (0..7)
0.5 0.5 0.5 0.5 0.5 0.5 0.5 0.5 
##$TPOFFS= (0..7)
0 0 0 0 0 0 0 0 
##$TUNHIN= 0
##$TUNHOUT= 0
##$TUNXOUT= 0
##$USERA1= <user>
##$USERA2= <user>
##$USERA3= <user>
##$USERA4= <user>
##$USERA5= <user>
##$V9= 5
##$VALIST= <valist>
##$VCLIST= <CCCCCCCCCCCCCCC>
##$VD= 0
##$VDLIST= <DDDDDDDDDDDDDDD>
##$VPLIST= <PPPPPPPPPPPPPPP>
##$VTLIST= <TTTTTTTTTTTTTTT>
##$WBST= 1024
##$WBSW= 4
##$XGAIN= (0..3)
0 0 0 0 
##$XL= 0
##$YL= 0
##$YMAX_a= 548343
##$YMIN_a= -548897
##$ZGOPTNS= <>
##$ZL1= 120
##$ZL2= 120
##$ZL3= 120
##$ZL4= 120
##$ABSF1= 10
##$ABSF2= 0
##$ABSG= 5
##$ABSL= 3
##$ALPHA= 0
##$AQORDER= 0
##$ASSFAC= 0
##$ASSFACI= 0
##$ASSFACX= 0
##$ASSWID= 0
##$AUNMP= <proc_1d>
##$AZFE= 0.1
##$AZFW= 0.1
##$BCFW= 1
##$BC_mod= 2
##$BYTORDP= 1
##$COROFFS= 0
##$CY= 11.3945322036743
##$DATMOD= 1
##$DC= 2
##$DFILT= <>
##$DTYPP= 0
##$F1P= 2.36226072786647
##$F2P= -0.459571619588291
##$FCOR= 0.5
##$FTSIZE= 0
##$FT_mod= 4
##$GAMMA= 1
##$GB= 0.15
##$INTBC= 1
##$INTSCL= 1
##$ISEN= 128
##$LB= 0.24
##$LEV0= 0
##$LPBIN= 0
##$MAXI= 10000
##$MC2= 0
##$MEAN= 0
##$ME_mod= 0
##$MI= 1.114404
##$NCOEF= 0
##$NC_proc= 0
##$NLEV= 6
##$NOISF1= 3.799351
##$NOISF2= 2.8
##$NSP= 1
##$NTH_PI= 0
##$NZP= 0
##$OFFSET= 15.70392
##$PC= 1
##$PHC0= -18304.59
##$PHC1= 11.00072
##$PH_mod= 1
##$PKNL= yes
##$PPARMOD= 0
##$PSCAL= 0
##$PSIGN= 0
##$REVERSE= no
##$SF= 200.130013532006
##$SI= 16384
##$SIGF1= 3
##$SIGF2= 2
##$SINO= 400
##$SIOLD= 16384
##$SREGLST= <1H.CDCl3>
##$SSB= 0
##$STSI= 0
##$STSR= 0
##$SW_p= 3612.71676300578
##$SYMM= 0
##$S_DEV= 0
##$TDeff= 0
##$TDoff= 0
##$TI= <>
##$TILT= no
##$TM1= 0
##$TM2= 0
##$TOPLEV= 0
##$USERP1= <user>
##$USERP2= <user>
##$USERP3= <user>
##$USERP4= <user>
##$USERP5= <user>
##$WDW= 1
##$XDIM= 8192
##$YMAX_p= 0
##$YMIN_p= 0
$$ End of Bruker specific parameters
$$ ---------------------------------
##NTUPLES= NMR FID
##VAR_NAME=  TIME,          FID/REAL,        FID/IMAG
##SYMBOL=    X,             R,               I
##VAR_TYPE=  INDEPENDENT,   DEPENDENT,       DEPENDENT
##VAR_FORM=  AFFN,          ASDF,            ASDF
##VAR_DIM=   8192,          8192,            8192
##UNITS=     SECONDS,       ARBITRARY UNITS, ARBITRARY UNITS
##FACTOR=    0.0002768,     1,               1
##FIRST=     0,             0,               0
##LAST=      2.2672688,     0,               0
##MIN=       0,             -548897,         0
##MAX=       2.2672688,     548343,          0
$$ Real data points
##PAGE= N=1
##DATA TABLE= (X++(R..R)), XYDATA
$$ [...]
$$ plain form
1023 -12548 15663 -13084 13871 -337 -5112 -4850 -6746 22153 -10640 2797 -5514 -803 1013
1036 1013 -1950 18714 -17317 -592 -4292 10549 3387 -11368 15529 -20541 7553 515 8866
1049 8866 2905 -25286 21377 -12139 8843 2022 -5040 6816 -25014 24913 -953 -3847 -730
1062 -730 -8552 12790 -13939 15890 330 -10884 -3379 2886 14209 -12678 5652 -4693 -939
1075 -939 -2778 6766 13054 -23205 6845 -2571 8349 -1017 -6505 15380 -25338 11329 5584 2585
1089 2585 -1854 -17193 20866 -13871 6557 6453 -5771 -2145 -12904 23747 -6565 -3767 124
1102 124 -2114 2812 -8382 20469 -10096 -7824 -277 6077 8299 -15459 14098 -9578 -4223 5193
1116 5193 5254 7153 -22670 10975 1154 -1332 3294 -1240 4456 -18703 12337 7521 -3259 -5852
$$ packed form
1023a2548K8211k8747K6955j4208m775K62j896K8899l2793J3437q311M711J816
1036A013k963K0664l6031J6725l700J4841p162j4755K6897l6070K8094p038Q351
1049H866n961k8191M6663l3516K0982o821p062J1856l1830M9927k5866k894L117
1062g30p822K1342k6729K9829j5560j1214P505O265J1323k6887J8330j0345L754
1075i39j839R544O288l6259L0050r416J0920r366n488K1885m0718L6667n745k999
1089B585m439j5339L8059l4737K0428j04j2224L626j0759L6651l0312K798L891
1102A24k238M926j1194K8851l0565K272P547O354K222k3758K9557k3676N355R416
1116E193O1J899k9823L3645r821k486M626m534N696k3159L1040m816j0780k593
$$ plain form
1130 -5852 -2836 9916 -12459 11281 2580 -5589 -7435 -317 18828 -14405 3803 -557 -3429
1143 -3429 668 -2211 18982 -17916 -3408 6208 1052 4120 -9292 12535 -12355 -3933 11996
1156 11996 1823 -1596 -13197 11147 -1746 -2698 6712 -399 -4479 -10265 14864 2117 -5948
1169 -5948 -2012 907 1971 -7636 13617 -1469 -8934 -2717 5434 8704 -11732 6633 -1893 -5719
1183 -5719 2004 4961 8178 -16881 2656 5157 -1417 1958 -1894 5775 -13689 3236 11016 -2881
1197 -2881 -3592 -5424 8268 -5209 1105 8167 -5495 -5785 -1807 11940 -2244 -5235 2563 -1765
1211 -1765 -1753 399 10075 -5269 -8288 2795 4930 1135 -4688 5257 -4665 -4765 5529 5572 -1056
1226 -1056 -10246 4836 1841 -1673 3064 687 -1946 -8665 7591 5877 -4413 -2383 -1113 2940
$$ packed form
1130e852L016J2752k2375K3740q701q169j846P118J9145l3233J8208m360k872
1143c429M097k879K1193l6898J4508R616n156L068j3412K1827k4890Q422J5929
1156A1996j0173l419j1601K4344j2893r52R410p111m080n786K5129j2747q065
1169e948L936K919J064r607K1253j5086p465O217Q151L270k0436J8365q526l826
1183e719P723K957L217k5059J9537K501o574L375l852P669j9464J6925P780j3897
1197b881p11j832J3692j3477O314P062j3662k90L978J3747j4184k991P798m328
1211a765J2K152R676j5344l019J1083K135l795n823R945r922j00J0294M3o628
1226a056r190J5082k995l514M737k377k633o719J6256j714j0290K030J270M053
$$ plain form
1240 2940 -4080 5572 3806 -7912 -2694 2465 6989 -3848 -1565 2301 -5009 643 4376 4211 -6215
1255 -6215 -5002 5120 1306 -258 723 313 -4904 -1494 6744 2604 -4769 -3400 2759 -290 786
1270 786 3216 -880 -4930 -2442 7156 1444 -3187 -770 -1218 140 34 5348 -604 -6696 287 2972
1286 2972 2784 -1630 -323 -807 -3818 2944 4429 -317 -4800 -1487 2904 621 1201 801 -2589 -3558
1302 -3558 1913 4876 -228 -3229 -1470 524 387 2432 1814 -3107 -3584 1131 4091 480 -1529 -1372
1318 -1372 -1520 228 2818 2651 -2844 -3377 379 2437 1793 -435 -843 -2864 -478 3324 2266 -1107
1334 -1107 -3488 -406 1158 1842 1615 -1227 -2793 -1421 2764 2521 -214 -2350 -1697 209 1619 2777
1350 2777 -982 -2405 -2032 1349 3115 -7 -368 -3159 -498 1748 1879 1535 -3486 -1193 -344 2202
$$ packed form
1240B940p020R652j766j1718N218N159M524j0837K283L866p310N652L733j65j0426
1255f215J213J0122l814j564R81m10n217L410Q238m140p373J369O159l049J076
1270G86K430m096m050K488R598n712m631K417m48J358j06N314n952o092O983K685
1286B972j88m414J307m84l011O762J485m746m483L313M391k283N80m00l390r69
1302c558N471K963n104l001J759J994j37K045o18m921m77M715K960l611k009J57
1318a372j48J748K590j67n495n33L756K058o44k228m08k021K386L802j058l373
1334a107k381L082J564O84k27k842j566J372M185k43k735k136O53J906J410J158
1350B777l759j423L73L381J766l122l61k791K661K246J31l44n021K293Q49K546
$$ plain form
1366 2202 2511 -1589 -1145 -2669 1535 2305 965 -559 -3407 -21 1000 2893 55 -1970 -1598 -824
1382 -824 2950 980 784 -3186 -1571 1627 1118 2714 -2810 -686 -1788 868 3926 -1442 140 -3994
1398 -3994 1237 1996 278 2117 -4286 70 -753 2886 2108 -3132 51 -2662 2604 1087 1019 -694
1414 -694 -3973 1663 456 3228 -1567 -1418 -703 -1431 4119 -465 1013 -3838 -609 2706 -495 3284
1430 3284 -3807 136 -1673 1241 4221 -3318 956 -3907 2134 1402 27 2231 -5349 1575 -827
1445 -827 3271 686 -3114 1106 -3527 4007 7 1156 -1591 -3580 3518 -1340 3957 -2536 -915
1460 -915 -550 -1516 5569 -2745 1468 -3610 75 2707 -1349 4117 -5171 793 -960 1625 3273 -4035
1476 -4035 2197 -4380 2747 1193 211 1102 -5508 3490 -1713 3295 -116 -2498 1012 -3892 5822
$$ packed form
1366B202L09m100M44j524M204P70j340j524k848L386J021J893k838k025L72P74
1382h24L774j970j96l970J615L198n09J596n524K124j102K656L058n368J582m134
1398c994N231P59j718J839o403M356q23L639p78n240L183k713N266j517o8j713
1414f94l279N636j207K772m795J49P15p28N550m584J478m851L229L315l201L779
1430C284p091L943j809K914K980p539M274m863O041p32j375K204p580O924k402
1445h27M098k585l800M220m633P534m000J149k747j989P098m858N297o493J621
1460i15L65r66P085q314M213n078L685K632m056N466r288N964j753K585J648p308
1476d035O232o577P127j554r82Q91o610Q998n203N008l411k382L510m904R714
$$ plain form
1491 5822 -1503 714 -1591 -2589 3808 -2587 5000 -3427 -1151 64 -587 5083 -4265 2520 -3487
1506 -3487 164 2476 -653 3373 -6398 2619 -907 1514 2005 -3310 2618 -5671 4641 661 -415
1521 -415 311 -4615 4852 -3550 4020 -110 -3099 951 -2907 6475 -3287 571 -495 -2378 2862
1536 2862 -1582 4806 -4665 -788 1021 316 2707 -3468 3305 -4651 1131 2413 22 1309 -6103
1551 -6103 4978 -2475 1447 2115 -3013 1875 -5736 6677 -496 -1959 1360 -3576 3934 -3631 4693
1566 4693 -420 -4363 1613 -648 4269 -3790 1662 -690 -2301 2060 613 3137 -6206 1849 693
1581 693 -36 1652 -2313 3473 -6498 3149 2984 -1907 822 -4450 5193 -3434 1302 3450 -4145 372
1597 372 -2439 5640 -1617 -2072 2012 -2231 805 -825 4710 -3107 -2699 1783 773 1661 -3588 4133
$$ packed form
1491E822p325K217k305r98O397o395P587q427K276J215o51N670r348O785o007
1506c487L651K312l129M026r771R017l526K421M91n315N928q289J0312l980j076
1521d15P26m926R467q402P570m130k989M050l858R382r762L858j066j883N240
1536B862m444O388r471L877J809p05K391o175O773p956N782J282k391J287p412
1551f103J1081p453L922O68n128M888p611J2413p173j463L319m936P510p565Q324
1566D693n113l943N976k261M917q059N452k352j611M361j447K524r343Q055j156
1581F93p29J688l965N786r971R647j65m891K729n272R643q627M736K148p595M517
1597C72k811Q079p257m55M084m243L036j630N535p817M08M482j010Q88n249P721
$$ plain form
1613 4133 -3401 -1624 3564 -32 1780 -6391 4079 296 -2332 3778 -2165 1113 -4756 3585 3273
1628 3273 -4086 955 -1032 1590 -2340 2557 1927 -3940 -806 1211 3607 -3803 1195 647 -2435
1643 -2435 850 395 4371 -5754 -434 3258 -1649 1629 -1880 2972 -3784 -1323 5487 -1515 -976
1658 -976 -2199 2762 -743 -1352 3501 -1157 -2252 -1545 4783 -603 -2402 1247 -652 354 -2132 4870
1674 4870 -1007 -4540 2409 313 2049 -3110 1663 969 -4614 3194 1649 -23 -3258 74 3041
1689 3041 -2146 482 1679 -912 -3303 2002 2792 -1259 -1903 51 2258 -3284 2191 2257 -3133 -780
1705 -780 -496 4468 -2457 -1536 3157 -3231 559 634 2530 -1486 -3999 3842 -14 -860 484 608 -1031
1722 -1031 -2330 3067 1780 -2437 -1625 2033 -134 -1006 1721 344 -1588 -2403 3468 1301 -2858 764
$$ packed form
1613D133p534J777N188l596J812q171J0470l783k628O110n943L278n869Q341l12
1628C273p359N041j987K622l930M897o30n867L134K017K396p410M998n48l082
1643b435L285m55L976j0125N320L692m907L278l509M852o756K461O810p002N39
1658i76j223M961l505o09M853m658j095P07O328n386j799L649j899J006k486P002
1674D870n877l533O949k096J736n159M773o94n583P808j545j672l235L332K967
1689C041n187K628J197k591k391N305P90m051o44J954K207n542N475O6n390K353
1705g80K84M964o925R21M693o388L790P5J896m016k513P841l856q46J344J24j639
1722a031j299N397j287m217Q12L658k167q72K727j377j932q15N871k167m159L622
$$ plain form
1738 764 -204 166 -1154 1994 1617 -4106 223 1823 739 -1210 -54 1148 -2339 185 2489 490
1754 490 -2894 -296 2012 -646 37 490 548 -2647 30 3496 -1181 -1070 -573 1071 -296 -796 2901
1771 2901 -1565 -2078 718 1723 439 -1992 887 -26 -1411 1128 1762 -917 -2175 613 1487 -158
1787 -158 -778 1079 -911 -1562 1775 1148 -360 -2109 602 1180 -1229 1338 162 -1057 -1189 881
1803 881 2250 -1535 -578 324 -272 -56 779 1079 -1741 -1110 1205 1095 -605 -292 269 -982 31 1146
1821 1146 1007 -1595 -1062 1199 59 352 -64 56 -1036 -628 2061 112 -800 -755 210 432 -185 1104
1839 1104 -420 -1291 -158 1217 642 -726 -321 -204 -109 265 1224 -376 -1261 -69 507 976 -596 166
1857 166 -530 -862 1122 391 484 -1368 -360 799 -222 993 -456 -437 -657 153 1421 -330 -362 -625
$$ packed form
1738G64r68L70j320L148l77n723M329J600j084j949J156J202l487K524K304j999
1754D90l384K598K308k658O83M53N8l195K677L466m677J11M97J644j367n00L697
1771B901m466n13K796J005j284k431K879r13j385K539O34k679j258K788Q74j645
1787a58o20J857j990o51L337o27j508j749K711N78k409K567j176j219j32K070
1803H81J369l785R57R02n96K16Q35L00k820O31K315j10j700L13N61j251J013J115
1821A146j39k602N33K261j140K93m16J20j092M08K689j949r12M5R65K22o17J289
1839A104j524q71J133J375n75j368M05J17R5L74R59j600q85J192N76M69j572P62
1857A66o96l32J984p31R3j852J008J159j021J215j449J9k20Q10J268j751l2k63
$$ plain form
1875 -625 4 343 554 301 -767 -618 -15 1139 -16 -40 -573 -598 727 31 1080 -927 -679 305 -156
1894 -156 1414 -723 -81 -558 -382 1301 -221 416 -1036 -330 513 292 695 -798 -264 -485 645 501
1912 501 73 -338 -1081 715 -61 962 -433 -737 203 -763 1695 -425 -50 -524 -796 1502 -615 927
1930 927 -753 -733 499 -170 1458 -957 -264 -283 -32 875 -94 313 -1159 20 334 745 7 -789 216
1949 216 -844 1125 34 205 -502 -1186 1474 -599 1025 -608 -662 412 -958 2079 -906 -129 -347
1966 -347 -594 1512 -921 1140 -1056 -576 644 -74 1248 -1309 209 -402 96 836 -167 198 -1363
1983 -1363 584 213 525 -81 -652 242 -905 1451 -214 60 -586 -749 1424 -929 1302 -916 -513
2000 -513 395 -620 1990 -1490 312 -401 -478 1451 -909 1132 -1478 -99 764 -271 1031 -1227
$$ packed form
1875f25O29L39K11k53j068J49O03J154j155k4n33k5J325o96J049k007K48R84m61
1894a56J570k137O42m77J76J683j522O37j452P06Q43k21M03j493N34k21J130j44
1912E01m28m11p43J796p76J023j395l04R40r66K458k120L75m74k72K298k117J542
1930I27j680K0J232o69J628k415O93j9K51R07r69M07j472J179L14M11p38p96J005
1949B16j060J969j091J71p07o84K660k073J624j633n4J074j370L037k985P77k18
1966c47k47K106k433K061k196M80J220p18J322k557J518o11M98P40j003L65j561
1983a363J947l71L12o06n71Q94j147K356j665K74o46j63K173k353K231k218M03
2000e13R08j015K610l480J802p13p7J929k360K041k610J379Q63j035J302k258
$$ plain form
2016 -1227 345 -620 403 853 -464 19 -1041 875 -200 620 -96 -794 237 -640 1649 -768 28
2033 28 -239 -739 1283 -772 1283 -1213 -447 741 -476 1346 -1263 509 -693 -174 1308 -639
2049 -639 530 -1419 708 118 -80 912 -1201 381 -902 1187 341 -881 509 -1055 884 -312
2065 -312 714 31 -1341 665 -151 927 -622 73 -140 -729 1003 -25 566 -1439 333 434 -405
2082 -405 983 -972 631 -1322 633 1263 -1246 682 -1187 910 -272 -71 1339 -1747 319 -110
2098 -110 854 22 -852 724 -832 219 358 694 -818 -720 779 -22 407 -627 755 -909 -475 1557
2116 1557 -491 261 -1269 772 335 -954 1559 -906 -217 -527 735 951 -1467 580 -248 -68 -86
2133 -86 678 365 -1485 318 397 615 -834 288 372 -1326 956 232 562 -1243 -327 1493 -1130 701
$$ packed form
2016a227J572r65J023M50j317M83j060J916j075Q20p16o98J031q77K289k417P96
2033B8k67n00K022k055K055k496P66J188j217J822k609J772j202N19J482j947
2049f39J169j949K127n90j98R92k113J582j283K089q46j222J390j564J939j196
2065c12J026o83j372K006q16J078j549O95k13n89J732j028N91k005J772J01q39
2082d05J388j955J603j953J955O30k509J928j869K097j182K01J410l086K066m29
2098a10R64q32q74J576j556J051J39L36j512R8J499q01M29j034J382j664M34K032
2116A557k048P52j530K041m37j289K513k465O89l10J262K16k418K047q28J80j8
2133h6P64l13j850J803P9K18j449J122Q4j698K282p24L30j805R16J820k623J831
$$ plain form
2151 701 19 -77 -615 -362 1858 -825 -544 145 216 -211 -95 1071 -688 -809 164 1267 -553 -607 807
2170 807 -703 87 -118 1211 -509 -1584 1504 -274 163 -271 212 222 -1610 1580 408 -748 -408
2187 -408 114 804 -964 666 493 -862 -592 822 896 -1085 -2 246 62 -574 633 892 -1621 38
2205 38 579 508 -530 -357 1045 -1231 46 926 185 -827 -689 1264 -354 -285 450 180 -841 -394
2223 -394 1513 -265 -688 -191 626 -159 -633 1396 -561 -796 61 833 409 -1362 838 -33 -675 400
2241 400 557 221 -1484 442 852 -452 -164 314 89 -989 516 926 -356 -925 283 728 -776
2258 -776 362 379 -314 -790 277 1284 -999 -243 297 3 -217 5 1102 -1003 -603 720 407 -228
2276 -228 -520 719 -521 -402 734 452 -560 -826 924 62 -323 166 206 -355 -746 1139 198 -701
$$ packed form
2151G01o82r6n38K53K220k683K81O89P1m27J16J166j759j21R73J103j820n4J414
2170H07j510P90k05J329j720j075L088j778M37m34M83J0j832L190j172j156L40
2187d08N22O90j768J630j73j355K70J414P4j981J083K48j84o36J207K59k513J659
2205C8N41p1j038J73J402k276J277Q80p41j012J38J953j618O9P35k70j021M47
2223c94J907j778m23M97Q17p85m74K029j957k35Q57P72m24j771K200q71o42J075
2241D00J57l36j705J926M10j304K88M78k25j078J505M10j282n69J208M45j504
2258g76J138J7o93m76J067J007k283P56N40k94k20K22J097k105M00J323l13o35
2276b28k92J239j240J19J136k82j012k66J750q62l85M89M0n61l91J885r41q99
$$ plain form
2294 -701 -210 235 290 -654 726 141 -862 -88 536 527 -813 66 290 -409 6 536 255 -980 -29 595
2314 595 117 -381 113 258 -765 320 548 85 -662 -247 822 -504 213 242 -195 -320 -265 1147 -410
2333 -410 -425 200 -129 157 -196 635 -294 -740 404 381 14 -355 139 -74 -271 238 520 -323 -607 380
2353 380 118 133 -161 137 -64 -626 763 138 -161 -325 -132 517 -405 435 52 -445 -60 117 614 -388
2373 -388 -119 29 -99 84 190 270 -562 -102 157 302 -57 -205 176 -469 263 228 130 -218 -474 451 -102
2394 -102 188 39 -209 -93 -211 573 -20 -151 -183 -41 190 -21 350 -283 -159 -101 244 293 -316 121 -349
2415 -349 149 162 83 135 -564 183 -56 262 93 -291 33 -339 415 60 58 -168 -314 294 -75 373 -242 -139
2437 -139 -51 -83 492 -214 141 -348 -27 333 -48 282 -427 23 -63 137 325 -258 3 -304 300 87 41
$$ packed form
2294g01M91M45N5r44J380n85j003P74O24rj340Q79K24o99M15N30k81j235R51O24
2314E95m78m98M94J45j023J085K28m63p47M15J069j326P17K9m37j25N5J412j557
2333d10j5O25l29K86l53Q31r29m46J144k3l67l69M94k13j97N09K82q43k84R87
2353C80k62J5k94K98k01n62J389o25k99j64J93O49r22Q40l83m97L85J77M97j002
2373c88K69J48j28J83J06Q0q32M60K59J45l59j48L81o45P32l5r8l48k56R25n53
2394a02K90j49k48J16j18P84n93j31l2J42K31k11L71o33J24N8L45M9o09M37m70
2415c49M98J3p9N2o99P47k39L18j69l84L24l72P54l55kk26j46O08l69M48o15J03
2437a39Q8l2N75p06L55m89L21L60l81L30p09M50q6K00J88n83K61l07O04k13m6
$$ plain form
2458 41 31 -350 134 -93 467 -130 -210 7 -207 450 -185 234 -268 -283 373 -120 418 -455 7 23 -159 518
2480 518 -280 112 -400 83 376 -174 228 -365 74 -108 223 263 -333 -18 -191 353 -60 117 -55 -345
2500 -345 188 -68 501 -346 -102 73 -219 488 -268 272 -412 -176 444 -227 342 -462 83 -35 -103 521
2520 521 -340 22 -305 181 212 -138 205 -361 74 -78 359 28 -307 76 -245 408 -161 211 -121 -382
2540 -382 417 -159 437 -350 -72 110 -300 587 -271 113 -296 -87 420 -255 316 -370 1 -21 58 337 -369
2561 -369 76 -248 217 71 17 69 -449 240 -77 347 -139 -180 113 -353 511 -149 126 -217 -238 475 -330
2582 -330 422 -297 -88 80 -180 607 -452 98 -152 -76 301 -202 335 -485 -4 125 92 139 -322 170 -319
2603 -319 195 136 39 -112 -358 421 -204 240 -93 -113 14 -314 665 -271 -2 -115 -91 341 -346 515 -316
$$ packed form
2458D1j0l81M84k27N60n97q0K17k14O57o35M19n02j5O56m93N38q73M62J6j82O77
2480E18p98L92n12M83K93n50M02n93M39j82L31M0n96L15j73N44m13J77j72k90
2500c45N33k56N69q47K44J75k92P07p56N40o84K36O20o71N69q04N45j18o8O24
2520E21q61L62l27M86L1l50L43n66M35j52M37l31l35L83l21O53n69L72l32k61
2540c82P99n76N96p87K78J82m10Q87q58L84m09K09N07o75N71o86L71k2P9K79p06
2561c69M45l24M65j46n4N2n18O89l17M24m86m1K93m66Q64o60K75l43k1P13q05
2582c30P52p19K09J68k60P87j059N50k50P6L77n03N37q20M81J29l3M7m61M92m89
2603c19N14n9r7j51k46P79o25M44l33k0J27l28R79r36K69j13K4M32o87Q61q31
$$ plain form
2624 -316 -157 108 30 386 -505 277 -189 -88 254 -44 205 -640 293 118 -85 135 -229 206 -472 314
2644 314 269 -248 -81 -175 349 -251 164 91 -234 -151 36 501 -416 62 -55 12 37 -113 607 -678 30 187
2666 187 23 223 -517 556 -431 -89 511 -173 99 -533 448 61 -296 332 -157 -105 -242 448 102 -349
2686 -349 -82 136 59 -303 491 -152 -268 -40 196 401 -672 341 -9 -273 244 -16 399 -721 121
2705 121 425 -258 107 -129 250 -439 82 481 -208 -218 -121 448 -339 70 255 -210 -154 -170 696 -351 -243
2726 -243 266 -181 98 -210 530 -246 -521 431 72 -5 -282 246 -66 -320 258 264 -187 -453 423 24 -111
2747 -111 47 62 77 -624 642 125 -371 64 -138 452 -523 298 345 -624 135 22 389 -342 -188 455 -388
2768 -388 10 211 184 -380 -213 379 9 -208 -6 277 -410 18 353 11 -229 -280 556 -230 -112 295 -135
$$ packed form
2624c16J59K65p8L56q91P82m66J01L42k98K49q45R33j75k03K20l64M35o78P86
2644C14m5n17J67r4N24o00M15p3l25Q3J87M65r17M78j17O7K5j50P20j285P08J57
2666A87j64K00p40J073r87L42O00o84K72o32R81l87l57O28m89N2j37O90l46m51
2686c49K67K18p7l62P94o43j16K28K36K05j073J013l50k64N17k60M15j120Q42
2705A21L04o83L65k36L79o89N21L99o89j0R7N69p87M09J85m65N6j6Q66j047J08
2726b43N09m47K79l08P40p76k75R52l59p7k77N28l12k54N78Om51k66Q76l99j35
2747a11J58J5J5p01J266n17m96M35k02N90r75Q21M7r69P59j13L67p31J54O43q43
2768c88L98K01k7n64J67N92l70k17K02K83o87M28L35l42k40n1Q36p86J18M07m30
$$ plain form
2789 -135 -73 -282 610 -71 -377 217 -64 71 -253 425 -23 -458 217 127 159 -390 225 88 -379 249 120
2810 120 88 -483 111 343 -323 81 16 25 -316 86 424 -271 -182 66 186 -192 54 206 -174 -202 96 418
2832 418 -329 -36 136 -83 14 -112 460 -393 -198 342 -90 143 -314 304 -141 -296 482 -122 -5 -298
2852 -298 172 195 -331 273 -42 -148 -87 177 200 -266 -58 115 -2 -127 225 -10 -207 -62 134 232 -371
2873 -371 179 3 -150 161 -35 303 -441 35 263 -197 193 -215 184 -194 -85 422 -228 11 -134 121
2893 121 33 -131 211 -160 -120 5 193 -9 -145 40 -24 45 -69 221 -161 -138 95 28 172 -255 145 -82
2915 -82 -117 230 -88 145 -296 119 132 -126 207 -183 84 -151 95 199 -205 61 -159 123 4 23 93 -198
2937 -198 37 -26 166 -85 -61 0 -94 137 -58 147 -185 -45 88 -44 201 -224 107 -133 3 207 -158
$$ packed form
2789a35O2k09Q92o81l06N94k81J35l24O78m48m35O75r0L2n49O15j37m67O28j29
2810A20l2n71N94K32o66M04o5Rl41M02L38o95Q9K48J20l78K46J52l80k8K98L22
2832D18p47K93J72k19R7j26N72q53J95N40m32K33m57O18m45j55P78o04J17k93
2852b98M70K3n26O04l15j06O1K64K3m66K08J73j17j25L52k35j97J45J96R8o03
2873c71N50j76j53L11j96L38p44M76K28m60L90m08L99l78J09N07o50K39j45K55
2893A21q8j64L42l71M0J25J88k02j36J85o4O9j14K90l82K3K33o7J44m27M00k27
2915h2l5L47l18K33m41M15J3k58L33l90K67k35K46J04m04K66k20K82j19J9P0k91
2937a98K35o3J92k51K4O1r4K31j95K05l32J40J33j32K45m25L31k40J36K04l65
$$ plain form
2958 -158 177 -247 114 68 -24 178 -250 128 -105 99 121 -129 58 -168 136 3 43 4 -113 61 -83 194
2980 194 -105 -5 -65 -49 174 -147 149 -183 -13 56 -52 208 -262 103 -72 39 128 -135 160 -268 128
3001 128 30 20 53 -199 181 -167 169 27 -71 47 -194 244 -102 51 -21 -128 107 -97 230 -114 -67 -8
3023 -8 -27 113 -100 119 -154 2 -2 68 76 -223 155 -147 132 13 -68 117 -301 277 -73 61 37 -204 237
3046 237 -241 240 0 -119 72 -173 282 -138 73 9 -139 116 -58 190 -167 -15 -22 4 78 -84 126 -224
3068 -224 84 2 41 39 -211 173 -191 155 -9 -76 64 -261 276 -127 63 -6 -152 171 -187 255 -106 -46
3090 -46 32 -99 219 -163 155 -133 -25 109 -46 200 -227 120 -89 -2 140 -148 130 -243 117 8 -38
3111 -38 106 -199 113 -123 132 7 -101 26 -107 147 -107 130 -122 -58 56 -89 227 -246 120 -92 -55
$$ packed form
2958a58L35m24L61m6r2K02m28L78k33K04K2k50J87k26L04j33M0l9j17J74j44K77
2980A94k99J00o0J6K23l21K96l32J70O9j08K60m70L65j75J11Q9k63K95m28L96
3001A28r8j0L3k52L80l48L36j42r8J18k41M38l46J53p2j07K35k04L27l44M7N9
3023hj9J40k13K19k73J56mP0Qk99L78l02K79j19q1J85m18N78l50J34k4k41M41
3046B37m78M81k40j19J91k45M55m20K11o4j48K55j74K48l57J52pK6P4j62K10l50
3068b24L08q2L9kk50L84l64L46j64o7J40l25N37m03J90o9j46L23l58M42l61O0
3090d6P8j31L18l82L18k88J08J34j55K46m27L47k09Q7J42k88K78l73L60j09m6
3111c8J44l05L12k36K55j25j08J27j33K54k54K37k52O4J14j45L16m73L66k12L7
$$ plain form
3132 -55 228 -197 230 -277 79 114 -176 260 -258 142 -90 4 220 -219 104 -110 65 6 -16 53 -124 10
3154 10 -5 150 -134 21 -38 -79 122 -133 225 -259 -10 158 -167 230 -249 159 -74 -115 306 -213 99 -142
3176 -142 66 83 -121 193 -128 12 -35 147 16 -121 75 -90 105 -105 191 -63 -199 179 -97 189 -190
3197 -190 46 54 -247 238 -93 48 -136 -48 172 -169 95 -21 -15 -123 75 127 -102 10 -77 169 -171 86
3219 86 118 -234 130 -126 267 -132 -138 257 -280 168 -49 95 -15 -265 298 -96 -21 4 -13 -11 -130 168 26
3242 26 -104 -109 126 -44 -79 109 -72 18 -216 243 28 -231 167 -126 120 -129 99 149 -333 169 -2 71
3264 71 -80 -32 171 -215 121 61 23 -157 -21 191 -140 55 -20 78 -155 -36 255 -187 -8 -38 91 -45
3286 -45 -133 240 -165 -68 28 99 -10 -159 144 -31 -75 -17 157 -101 -161 141 5 54 -162 161 -35 -187 255
$$ packed form
3132e5K83m25M27n07L56L5k90M36n18M00k32R4K16m39L23k14J75n9k2O9j77J34
3154A0j5J55k84J55n9m1K01k55L58m84K49J68l25L97m79M08k33m1M21n19L12k41
3176a42K08J7k04L14l21J40m7J82j31j37J96j65J95k10K96k54j36L78k76K86l79
3197a90K36Ql01M85l31J41j84Q8K20l41K64j16Oj08J98N2k29J12q7K46l40K57
3219H6L2l52L64k56L93l99oL95n37M48k17J44j10k50N63l94P5K5j7Kj19K98j42
3242B6j30nK35j70l5J88j81R0k34M59k15k59L98k93K46k49K28N0m82N02j71P3
3264G1j51M8K03l86L36o0l8j80J36K12l31J95p5R8k33J19K91m42J79l0J29j36
3286d5q8L73m05R7R6P1j09j49L03j75m4N8J74k58o0L02j36M9k16L23j96j52M42
$$ plain form
3309 255 -69 76 -189 73 211 -300 234 -54 -61 -32 -27 259 -254 12 88 -85 0 3 100 -141 -73 121 68 -143
3333 -143 16 69 -116 45 -23 176 -215 -61 239 -158 119 -108 94 -33 -164 339 -140 -11 -24 24 105 -194
3355 -194 188 -33 -110 45 65 62 -160 79 18 -28 -26 104 12 -183 104 -6 55 -131 23 76 -214 127 1 28
3379 28 -98 -30 168 -169 89 -8 -11 -32 -23 221 -146 -2 -7 36 -10 -63 177 -155 10 18 83 10 -148 160 -119 38
3405 38 46 36 -1 -143 134 -20 23 -32 10 -14 -119 142 -47 4 -107 55 62 -141 170 -110 32 -59 11 155 -199
3430 -199 112 -65 39 42 -60 125 -176 43 48 6 14 -77 59 -67 43 12 30 -75 -28 95 -88 84 -89 59
3454 59 -53 -73 173 -153 77 -114 24 78 -136 172 -158 33 -7 -17 105 -144 92 -88 38 24 -23 59 -105
3477 -105 77 -30 50 -26 -37 47 -81 115 -55 58 -48 -13 80 -95 106 -109 34 -30 -47 113 -106 67 -106
$$ packed form
3309B55l24J45k65K62J38n11N34k88pK9NK86n13K66P6j73Q5LR7k41O8J94n3k11
3333a43J59N3j85J61o8J99l91J54L00l97K77k27K02j27j31N03m79J29j3M8Q1k99
3355a94L82k21p7J55K0lk22K39o1m6KJ30r2j95K87j10O1j86J54N3k90L41j26K7
3379B8j26O8J98l37K58r7lk1RK44l67J44nM3m6n3K40l32J65QO5p3j58L08k79J57
3405C8Qj0l7j42K77j54M3n5M2k4j05K61j89N1j11J62Pk03L11k80J42r1P0J44l54
3430a99L11j77J04Lj02J85l01K19Nm2Qr1J36j26J10l1J8j05M7J23j83J72j73J48
3454E9j12k0K46l26K30j91J38N4k14L08l30J91m0j0J22k49K36j80J26j4m7Q2j64
3477a05J82j07Q0p6j1Q4j28J96j70J13j06L5R3j75K01k15J43o4j7J60k19J73j73
$$ plain form
3500 -106 52 27 -53 87 -157 96 -47 29 67 -115 90 -105 104 -31 -14 61 -124 86 -68 88 -21 -29 55
3523 55 -46 101 -60 80 -53 3 69 -40 101 -137 90 -48 -15 95 -109 98 -152 76 23 -72 69 -124
3545 -124 87 -74 71 30 -76 53 -84 115 -66 34 18 -63 77 -64 115 -95 28 15 -48 92 -110 116
3567 116 -135 35 75 -74 112 -147 117 -51 -8 89 -112 78 -111 82 -2 -35 63 -96 81 -69 93 -47
3589 -47 -80 37 -53 106 -80 76 -54 -32 72 -55 103 -141 79 -31 -26 113 -98 112 -129 83 50 -52
3611 -52 88 -139 97 -77 32 61 -102 69 -96 107 -56 -2 26 -91 76 -58 91 -64 -6 23 -59 80
3633 80 -91 71 -78 -15 59 -55 88 -121 79 -28 10 81 -87 72 -106 92 -1 -28 71 -119 108 -83 66
3656 66 -7 -55 76 -120 125 -66 40 2 -70 102 -79 63 -75 -5 26 -66 98 -65 26 -61 1 17 -46 72
$$ packed form
3500a06J58k5q0J40k44K53j43P6L8j82K05j95K09j35J7P5j85K10j54J56j09qQ4
3523E5j01J47j61J40j33N6O6j09J41k38K27j38L3J10k04K07k50K28n3r5J41j93
3545a24K11j61J45m1j06J29j37J99j81J00j6q1J40j41J79k10J23j3o3J40k02K26
3567A16k51J70M0j49J86k59K64j68M3R7k01J90j89J93q4l3R8j59J77j50J62j40
3589d7l3J17r0J59j86J56j30K2J04j27J58k44K20j10NJ39k11K10k41K12l3j02
3611e2J40k27K36j74J09K9j63J71j65K03j63N4K8j17J67j34J49j55N8K9q2J39
3633H0j71J62j49O3P4j14J43k09K00j07L8P1j68J59j78J98r3k7R9j90K27j91J49
3656F6p3m8J31j96K45j91J06l8p2J72j81J42j38P0L1r2J64j63R1q7O2J6o3J18
$$ plain form
3680 72 -108 45 -30 51 24 -69 77 -90 83 -36 29 42 -122 119 -70 67 -14 -51 57 -102 133 -43 20
3703 20 -11 -36 79 -84 81 -46 -14 -6 2 75 -108 68 -61 19 -1 -24 81 -126 70 -36 27 10 -62 74 -108
3728 -108 73 5 1 -4 -78 106 -66 38 -6 -25 24 -61 124 -60 25 -12 -13 60 -87 123 -85 0 5 6 60 -117 64
3755 64 -51 9 18 -12 37 -148 86 -10 -17 4 -18 58 -104 84 11 -11 -3 -16 104 -84 58 4 -21 13 -31 113 -108
3782 -108 30 2 -4 25 -43 102 -98 -6 33 3 14 -84 82 -80 -14 37 -10 0 -100 113 -52 -33 24 -27 33 -96
3808 -96 103 -31 -38 26 -2 62 -80 87 -9 -56 23 21 56 -98 68 -6 -21 19 -14 82 -138 60 13 -8 -3 -53 93
3835 93 -116 54 51 -32 -18 -59 100 -85 0 60 -55 -2 -59 110 -61 -38 23 -25 20 -57 90 -63 -21 42 19 36
3861 36 -82 104 -23 -9 44 14 49 -114 112 12 -14 10 -15 57 -109 93 4 -59 4 -34 68 -112 48 4 -47
$$ packed form
3680G2j80J53p5Q1k7r3J46j67J73j19O5J3j64K41j89J37q1l7J08j59K35j76O3
3703B0l1k5J15j63J65j27L2QQP3j83J76j29Q0k0k3J05k07J96j06O3j7p2J36j82
3728a08J81o8mnp4J84j72J04m4j9M9q5J85j84Q5l7jP3j47K10k08Q5NJN4j77J81
3755F4j15O0Rl0M9j85K34r6pK1k2P6j62J88p3k2Qj3J20j88J42n4k5L4m4J44k21
3782a08J38k8oK9o8J45k00R2L9l0J1r8J66j62O6N1m7J0j00K13j65J9N7n1O0j29
3808i6J99j34pO4k8O4j42J67r6m7P9kL5j54J66p4j5M0l3R6k20J98m7k1Nn0J46
3835I3k09J70lq3J4m1J59j85Q5O0j15N3n7J69j71K3O1m8M5p7J47j53M2O3k3J7
3861C6j18J86j27J4N3l0L5j63K26j00k6K4k5P2j66K02q9o3O3l8J02j80J60m4n1
$$ plain form
3886 -47 1 -33 97 -117 24 20 -56 12 -43 80 -92 -3 38 1 8 -57 92 -70 4 57 -8 -5 -60 104 -45 14 32
3913 32 -23 22 -51 111 -59 -24 11 -34 49 -99 73 -47 -43 34 -19 66 -111 61 -8 -37 31 -29 45 -108 41 -15
3939 -15 -7 14 -34 78 -64 69 17 -5 2 -50 78 -70 38 3 -25 23 -44 93 -56 2 15 -19 39 -43 69 -78
3965 -78 13 23 -27 46 -90 65 -54 -13 13 -35 38 -88 61 -18 -20 6 -42 35 -68 65 -25 21 10 -6 64 -74 73
3992 73 -33 10 19 -28 99 -76 51 -30 8 40 -54 80 -77 47 10 -19 36 -70 37 -59 29 -9 -37 29 -60 69
4018 69 -61 51 -33 -15 36 -70 79 -71 34 -20 -20 70 -68 80 -74 25 12 -26 97 -80 68 -28 15 28 -50
4043 -50 62 -72 53 -28 16 31 -51 39 -54 53 -25 -7 11 -64 51 -53 53 -44 1 17 -45 63 -77 58 -51
4068 -51 17 29 -64 57 -57 56 -32 5 54 -78 73 -54 56 10 -28 62 -71 67 -27 16 -6 -71 64 -69 41
$$ packed form
3886d7M8l4J30k14J41mp6O8n5J23j72Q9M1l7Po5J49j62P4N3o5Ln5J64j49N9J8
3913C2n5M5p3J62j70L5L5m5Q3j48J72j20MP7n3Q5j77J72o9k9O8o0P4j53J49n6
3939a5QK1m8J12j42J33n2k2Pn2J28j48J08l5k8M8o7J37j49N8J3l4N8q2J12j47
3965g8R1J0n0P3j36J55j19M1K6m8P3j26J49p9kK6m8P7j03J33r0M6j1j6P0j38J47
3992G3j06M3Rm7J27j75J27q1L8L2r4J34j57J24l7k9N5j06J07r6Q8l8k8O6q9J29
4018F9j30J12q4J8N1j06J49j50J05n4%R0j38J48j54R9j3l8J23j77J48r6M3J3p8
4043e0J12j34J25q1M4J5q2R0r3J07p8J8J8p5J15j04J06r7M5J6o2J08j40J35j09
4068e1O8J2r3J21j14J13q8L7M9j32J51j27J10m6l8R0j33J38r4M3k2o5J35j33J10
$$ plain form
4093 41 -10 -4 -16 -40 50 -43 46 -42 19 -23 -31 54 -55 43 -53 46 13 -33 66 -65 38 -46 12 51 -81 78 -45 54
4121 54 -17 -23 45 -65 75 -37 43 -14 -25 56 -42 46 -25 20 -4 -34 42 -45 16 -55 30 -2 -23 31 -65 38 -56 39 -5
4150 -5 -35 67 -53 58 -45 35 28 -67 66 -56 47 -18 10 26 -46 64 -27 34 -32 -11 30 -34 73 -32 23 -6
4176 -6 -2 33 -37 34 -50 7 -18 -24 37 -59 28 -49 14 -11 -24 26 -55 30 -23 19 -2 -30 30 -45 50 -14 9 14 -19 68 -34 51
4208 51 -25 -16 30 -41 57 -36 28 -8 -1 53 -31 35 -45 -8 10 -7 14 -41 16 -38 5 -5 -16 21 -30 43 -35 32 2 -30 21
4239 21 -61 58 -35 -8 15 -27 50 -34 55 -21 -14 24 -22 30 -31 30 -4 -8 29 -25 30 -37 48 -9 -23 24 -34 26 -57 34 3
4270 3 -22 33 -30 36 -40 9 12 -49 29 -28 38 -27 16 14 -15 36 -21 38 -30 13 26 -21 36 -28 47 -15 18 23 -31 46 -37 49
4302 49 -13 -16 34 -30 47 -44 27 8 -42 32 -23 5 -32 20 -3 -48 25 -24 22 -35 34 -4 -47 34 -27 42 -61 22 22 -17 36
$$ packed form
4093D1n1Oj2k4R0r3Q9q8O1m2qQ5j09R8r6R9l3m6R9j31J03q4N8L9j32J59j23R9
4121E4p1oO8j10J40j12Q0n7j1Q1r8Q8p1M5k4l0P6q7O1p1Q5l2k1N4r6J03r4R5m4
4150el0J02j20J11j03Q0pr5J33j22J03o5K8J6p2J10r1O1o6K1M1o4J07j05N5k9
4176fML5p0P1q4N7k5oO1r6Q7p7O3k5j3N0q1Q5n3M2k1k8O0p5R5o4K3Nl3Q7j02Q5
4208E1p6RM6p1R8r3O4l6PN4q4O6q0L7J8j7K1n5N7n4M3j0j1L7n1P3p8O7l0l2N1
4239B1q2J19r3K7K3m2P7q4Q9p6PL8m6N2o1O1l4mL7n4N5o7Q5n7j4M7n8O0q3R1l1
4270Ck5N5o3O6p6M9Lo1P8n7O6o5M3kk9N1n7N9o8M3J3m7N7o4P5o2L3Nn4P7q3Q6
4302D9o2lN0o4P7r1P1j9n0P4n5K8l7N2k3m5P3m9M6n7O9l8m3Q1o1O9j03Q3%l9N3
$$ plain form
4333 36 -37 40 -29 16 55 -33 49 -15 44 -20 -6 26 -46 23 -15 43 -20 -14 15 -33 20 -37 44 -50 -27 37 -40 8 -45 22 -29
4364 -29 -29 48 -30 26 -43 35 -9 -17 50 -34 20 -29 23 3 -24 34 -22 42 -28 22 8 -20 28 -16 43 -48 19 8 -39 23 -3
4395 -3 33 -48 5 13 -38 23 -50 49 -57 13 15 -36 0 -51 50 -36 -12 26 -37 26 -34 40 -24 -24 45 -37 40 -25 38 -8 -13 29
4427 29 -25 5 -29 21 -15 -22 26 -28 30 -37 40 -7 -36 17 -36 17 -66 16 -21 -42 11 -31 33 -34 5 2 -38 36 -22 36 -37
4458 -37 3 13 -14 32 -14 33 -39 15 13 8 16 -46 34 -25 5 34 -28 17 -49 34 -21 -15 6 -43 14 -37 28 -29 -27 1 -37 22 -44
4491 -44 27 -17 -1 26 -33 36 -49 25 -1 -8 33 -25 26 -32 26 6 2 26 -34 45 -47 25 13 -2 17 -34 44 -43 23 0 -23
4522 -23 12 -30 40 -34 3 -6 -33 40 -43 24 -32 6 -9 -21 20 -40 42 -27 -4 -16 -12 33 -17 47 -10 8 17 -31 48 -35 37 -18
4554 -18 12 12 -23 45 -37 28 -9 6 33 -28 31 -45 12 -4 -7 23 -36 21 -27 8 4 -12 30 -46 22 -21 30 1 -12 31 -51 45
$$ packed form
4333C6p3P7o9M5L9q8Q2o4N9o4J4L2p2O9l8N8o3OK9m8N3n7Q1r4K3O4p7M8n3O7n1
4364b9%P7p8N6o9P8m4qO7q4N4m9N2k0k7N8n6O4p0N0j4k8M8m4N9r1O7j1m7O2k6
4395cL6q1N3Qn1O1p3R9j06P0Kn1L6n1J01q6K4L8o3O3o0P4o4%O9q2P7o5O3m6nM2
4427B9n4L0l4N0l6pM8n4N8o7P7m7k9N3n3N3q3Q2l7k1N3m2O4o7L9lm0P4n8N8p3
4458c7M0J0k7M6m6M7p2N4knQo2Q0n9L0K9o2M5o6Q3n5OK1m9N7n1O5n7KK8l8N9o6
4491d4P1m4J6K7n9O9q5P4k6pM1n8N1n8N8k0mK4o0P9r2P2j2j5J9n1P8q7O6k3k3
4522b3L5m2P0p4L7rk7P3q3O7n6L8j5j2M1o0Q2o9K3j2MM5n0O4n7J8Rm8P9q3P2n5
4554a8L0%l5O8q2O5l7J5K7o1N9p6N7j6lL0n9N7m8L5mj6M2p6O8m3N1k9j3M3q2R6
$$ plain form
4586 45 -27 12 6 -13 41 -28 31 -34 13 19 -37 47 -27 33 -28 0 14 -12 34 -19 8 -17 1 21 -20 14 -9 20 -24 2 -14
4617 -14 -41 30 -38 12 -15 4 18 -39 32 -23 16 -15 -20 52 -15 50 -28 6 8 -22 36 -24 23 1 11 7 -27 31 -33 29 -42 10
4649 10 3 -16 21 -23 32 -27 2 13 -28 21 -25 11 -9 1 -3 -35 41 -26 19 -16 2 24 -32 33 -30 4 -19 8 33 -23 18
4680 18 -21 21 9 -2 21 -34 19 6 8 8 -12 29 -35 24 3 21 -5 -29 21 -28 23 -8 5 -4 -45 23 -27 26 -11 1 21 -16
4712 -16 30 -10 4 0 -5 20 -8 19 -16 -2 12 7 18 -28 26 4 26 11 -13 9 -12 36 -3 13 -4 -21 20 -33 33 -19 -3 -9
4744 -9 -26 11 -45 6 -6 -25 9 -22 15 -29 16 -1 -8 22 -13 19 -13 23 -12 -13 32 -5 33 0 21 -1 0 24 -15 31 -11 17
4776 17 -11 -12 36 -34 27 -19 0 -3 -21 14 -31 3 -9 3 15 -25 12 -31 22 9 8 10 -21 29 -18 29 2 -2 19 -5 47 -12 23
4809 23 5 -16 28 -23 31 -9 17 9 -9 18 3 12 -17 14 -7 -8 16 -30 19 -34 8 8 -28 24 -44 22 -14 -5 3 -37 17 -13 20
$$ packed form
4586D5p2L9oj9N4o9N9o5M7On6Q4p4O0o1K8J4k6M6n3K7k5J8K0m1L4k3K9m4K6j6
4617a4k7P1o8N0k7J9J4n7P1n5L9l1nP2o7O5p8L4Kl0N8o0M7k2J0ml4N8o4O2p1N2
4649A0pj9L7m4N5n9K9J1m1M9m6L6k0J0ml2P6o7M5l5J8K2n6O5o3L4k3K7K5n6M1
4680A8l9M2j2j1K3n5N3j3K%k0M1o4N9k1J8k6k4N0m9N1l1J3rm1O8n0N3l7J2K0l7
4712a6M6m0J4mnK5k8K7l5J4J4nJ1m6N4k2K2j5k4K2k1M8l9J6j7j7M1n3O6n2J6o
4744ij7L7n6N1j2j9L4l1L7m4M5j7pL0l5L2l2L6l5jM5l7L8l3K1k2JK4l9M6m2K8
4776A7k8jM8p0O1m6J9lj8L5m5L4j2J2J2m0L7m3N3j3jKl1N0m7M7k7mK1k4N2n9L5
4809B3j8k1M4n1N4m0K6qj8K7j5Rk9L1k1jK4m6M9n3M2%l6N2o8O6l6RQm0N4l0L3
$$ plain form
4842 20 6 -10 8 -32 22 1 26 0 14 12 -7 31 -5 22 -10 17 12 -23 33 -33 36 -10 0 15 -48 14 -22 18 -20 -20 24 -19
4874 -19 12 -18 -4 -2 -13 18 -20 11 -5 0 -6 -13 8 -13 10 -9 24 5 -6 44 -15 24 -18 6 26 -1 41 -29 16 -14 -8 8 -11
4907 -11 5 -32 5 -17 9 7 -30 8 -23 21 -14 3 12 -30 30 -16 20 1 -5 21 -19 17 -14 35 4 -1 44 4 27 -6 40 14
4939 14 3 17 4 30 -27 34 -2 -9 13 -31 17 -24 21 -3 -25 34 -21 35 -14 -9 5 -32 1 -23 12 -22 4 -10 -9 13 -7 28
4971 28 -13 27 -1 -15 20 -21 43 -15 25 20 -22 40 -9 36 -16 -6 12 -21 37 -29 11 -1 -8 20 -11 22 -10 16 -20 -13 10 -18
5003 -18 -4 -48 24 -17 -5 14 -22 40 -25 50 -5 -15 32 -21 31 -17 32 10 -5 19 -40 51 -19 21 6 -27 19 -28 27 -4
5033 -4 37 38 -6 28 -21 20 -15 29 7 -15 13 -13 21 -27 3 13 -17 21 -33 32 -24 9 6 -5 34 -28 32 -9 -5 33 -17 33
5065 33 -10 31 0 -3 45 -20 36 -15 14 -2 -12 21 -8 27 -16 23 -11 -5 -2 -14 9 -17 25 -4 -2 7 -29 35 -25 8 1 -17 35
$$ packed form
4842B0j4j6J8m0N4k1K5k6J4kj9L8l6K7l2K7nl5N6o6O9m6J0J5o3O2l6M0l8%M4m3
4874a9L1l0J4Kj1L1l8L1j6NopK1k1K3j9L3j9j1N0n9L9m2K4K0k7M2p0M5l0OJ6j9
4907a1J6l7L7k2K6kl7L8l1M4l5J7Rm2O0m6L6j9oK6m0L6l1M9l1nM5m0K3l3M6k6
4939A4j1J4j3K6n7O1l6pK2m4M8m1M5k4k2N9n5N6m9NJ4l7L3k4L5l4K6j4JK2k0L5
4971B8m1M0k8j4L5m1O4n8M0nm2O2m9M5n2J0J8l3N8o6M0j2pK8l1L3l2K6l6PK3k8
5003a8J4m4P2m1J2J9l6O2o5P5n5j0M7n3N2m8M9k2j5K4n9R1p0M0j5l3M6m7N5l1
5033dM1Jm4L4m9M1l5M4k2k2K8k6L4m8L0J0l0L8n4O5n6L3lj1L9o2O0m1ML8n0N0
5065C3m3M1l1lM8o5N6n1K9j6j0L3k9L5m3L9l4OLj2K3k6M2k9KRl6O4o0L3pj8N2
$$ plain form
5098 35 -31 47 -25 13 33 -35 28 -25 27 -3 -5 15 -20 38 -12 9 13 13 10 -2 24 -42 10 -4 6 -12 -26 42 -23 24 -7 -17
5130 -17 3 -23 34 -33 -1 -8 -11 25 -35 27 -40 -1 -5 -8 11 -27 30 -16 19 7 -9 32 -10 19 6 0 8 -11 33 -11 21 1 2 -6
5164 -6 -10 16 -37 16 -17 -5 10 -39 19 -42 -1 -10 4 -6 -29 15 -30 -4 15 3 9 -19 33 -11 14 8 -23 10 -3 37 -1 8 16 -14
5198 -14 17 -11 18 -5 9 15 -5 18 -16 11 3 -7 10 -14 29 -14 10 5 -2 30 -6 7 -28 -10 -7 -6 -1 -40 11 -17 4 13 -19 7
5232 7 -8 9 -15 11 -1 7 21 -10 34 -20 12 10 -7 24 -4 16 1 -7 -3 -21 13 -36 0 2 -13 3 -6 30 2 -13 -3 -11 -3 -29 13
5267 13 -20 8 3 -6 -7 -9 26 -4 6 20 0 38 6 20 -11 20 20 0 15 -11 16 -7 1 5 -8 3 -8 13 5 -32 -11 -43 13 -24
5301 -24 3 -16 -19 6 -14 0 -26 -1 -12 -13 16 -18 3 -7 -13 17 -8 12 -7 8 -8 17 16 -2 20 -18 32 -14 15 12 -11 26 -9
5334 -9 21 -19 -4 -1 -26 3 -16 -14 -12 -10 4 -37 -12 -25 9 -24 -1 -8 -10 15 -25 10 -16 4 10 -2 34 -20 15 2 6 20 -18 12 -22
$$ packed form
5098C5o6P8p2L8K0o8O3n3N2l0kK0l5N8n0K1M%lj2K6o6N2j4J0j8j4O8o5M7l1j0
5130a7K0k6N7o7L2plL6o0O2o7L9mlJ9l8N7m6L5j2j6M1m2K9j3oQj9M4m4L2k0Jq
5164fmK6n3N3l3J2J5m9N8o1M1rJ4j0k3M4m5K6J9j2Ok8N2m4K5ol1L3j3M0l8RQl0
5198a4L1k8K9k3J4Ok0K3l4K7qj0J7k4M3m3K4npL2l6J3l5J8LJNl9N1k8K1Rl2K6
5232Gj5J7k4K6j2QJ4l1M4n4L2kj7L1k8K0j5qMj8L4m9L6Kj5J6rL6k8j5J0qQk6M2
5267A3l3K8nrjkL5l0J0J4k0L8l2J4l1L1%k0J5k6K7k3QMj3J1j1K1ql7K1l2N6l7
5301b4K7j9lK5k0J4k6K5j1jK9l4K1j0oL0k5K0j9J5j6K5jj8K2l8N0m6K9lk3L7l5
5334iL0m0J5Lk5K9j9KKKJ4m1K5j3L4l3K3pkK5m0L5k6K0Oj2L6n4L5j3MJ4l8L0l4
$$ plain form
5369 -22 17 18 -11 16 -10 18 -16 1 -7 -2 3 -24 0 -18 5 -24 -18 3 -25 15 -25 -7 -14 -11 2 -27 11 -14 4 3 -12 15 -8 19
5403 19 2 -3 -1 -5 29 -12 21 -4 21 8 -12 19 -14 27 -28 21 11 -15 22 -26 14 -23 -13 13 -27 12 -30 -2 -17 -7 7 -13
5435 -13 9 -25 6 -18 -15 2 -25 15 -9 33 5 -8 15 -11 26 -15 24 -6 -9 48 -6 23 -25 11 -10 -20 20 -16 15 -14 7
5466 7 0 -25 14 -32 -1 -23 5 -4 -26 18 -32 15 -26 -2 -22 -13 28 -17 5 -21 11 5 -5 29 -25 29 -4 4 11 -16 33 -14 20 -21
5500 -21 -1 8 -19 33 -26 28 -2 -14 5 -36 14 -46 3 -15 -20 11 -43 1 -19 22 -12 -14 20 -28 25 -16 1 -8 -13 7 -32 23 -7
5533 -7 11 24 -8 29 -7 32 3 -10 20 -8 12 -8 24 -21 1 12 -3 22 -12 25 -18 -10 -2 -21 14 -23 26 -19 5 9 -29 5
5565 5 -35 14 -15 -24 23 -47 27 -7 -4 14 -11 25 -3 23 5 13 2 9 23 -17 29 -25 0 10 -13 23 -25 16 -14 -1 -4 -21 10
5598 10 -21 24 -27 1 13 -8 25 -30 28 -7 5 8 -26 27 -24 13 -15 -12 16 -24 24 -12 27 4 7 24 -7 19 -23 10 27 -2
$$ packed form
5369b2L9Jk9K7k6K8l4J7qNNk7K4j8K3k9OK1k8M0m0J8pLJ3k9L8k5J8jj5K7k3K7
5403A9j7nKmL4m1L3k5K5j3k0L1l3M1n5M9j0k6L7m8M0l7J0K6m0L9m2K8j5J0J4k0
5435a3K2l4L1k4LJ7k7M0k4M2k8j3K3k6L7m1L9l0lN7n4K9m8L6k1j0M0l6L1k9K1
5466Gpk5L9m6L1k2K8rk2M4n0M7m1K4k0RM1m5K2k6L2oj0L4n4N4l3QPk7M9m7L4m1
5500b1K0Rk7N2n9N4l0j2J9m1N0o0M9j8nL1n4M4k0M1l4kL4m8N3m1J7rnK0l9N5l0
5533gJ8J3l2L7l6L9k9j3L0k8K0k0L2m5K2J1j5K5l4L7m3QQj9L5l7M9m5K4Ml8L4
5565Em0M9k9rM7p0P4l4LJ8k5L6k8K6j8Qj1PJ4m0M6n4K5J0k3L6m8M1l0J3lj7L1
5598A0l1M5n1K8J2k1L3n5N8l5J2Ll4N3n1L7k8LK8m0M8l6L9k3LJ7l1K6m2L3J7k9
$$ plain form
5630 -2 21 -14 26 -14 4 -11 -15 13 -9 2 -8 -6 -15 -21 9 -14 -8 -2 -4 10 -9 8 -27 12 -21 -5 10 -15 4 -15 31 7 18 17 -1
5665 -1 25 -11 28 3 -8 18 -7 19 -7 5 15 -4 15 -12 20 0 8 24 -22 16 -28 9 -8 -6 -4 -21 23 -7 15 -16 -12 0 -15
5698 -15 4 -23 3 21 8 2 2 23 -6 12 4 -7 13 10 30 -11 8 0 -8 19 6 16 -6 23 12 -10 0 -10 8 -2 2 8 -15 14
5732 14 -19 7 -5 6 10 -11 15 -10 18 2 2 10 1 11 0 17 6 1 29 -9 17 7 0 -2 -4 20 -7 23 4 15 5 -6 5 -17
5766 -17 14 -21 4 9 -5 5 -29 3 -27 -3 2 -14 19 -1 11 -13 -16 7 -15 -6 -27 -8 1 3 17 -2 13 6 13 6 4 10 -7 10 -7 10
5802 10 -9 13 6 -6 16 -14 13 1 -1 3 -7 5 -7 -1 -15 -9 12 -29 6 -14 3 11 -10 21 -20 -8 -11 -10 -9 -2 27 13 24 23 15 16 7
5839 7 14 -6 30 11 10 -6 -7 15 -14 10 -12 13 6 -16 -4 -30 11 -9 -27 3 -28 -6 -21 13 1 -4 2 -16 27 -17 25 14 -5 0
5873 0 -13 10 -14 31 12 12 8 -8 34 -6 4 3 -10 26 1 35 11 10 5 -17 21 -12 2 -17 6 -3 -2 12 -34 20 -19 -17 8 -21 6
$$ packed form
5630bK3l5M0m0J8j5mK8k2J1j0KroL0k3OOkJ4j9J7l5L9l3J6J5k5J9j9M6k4J1jj8
5665aK6l6L9k5j1K6k5K6k6J2J0j9J9k7L2k0QJ6m6L8m4L7j7KKj7M4l0K2l1MJ2j5
5698a5J9k7K6J8j3o%K1k9J8qj1K0lK0m1J9qqK7j3J0k2K9j1k2J0j0J8j0MOk3K9
5732A4l3K6j2J1Mk1K6k5K8j6%QrJ0j1J7j1nK8l8K6j0pkkK4k7L0j9J1j0j1J1k2
5766a7L1l5K5Nj4J0l4L2l0K4Nj6L3k0J2k4lK3k2Rk1J9RKJ4j9J5pPpkOj7J7j7J7
5802A0j9K2pj2K2l0K7j2kMj0J2j2Oj4OK1m1L5k0J7Qk1L1m1J2lJJPK9j4J1jqJr
5839GPk0L6j9jj6jK2k9K4k2K5pk2J2k6M1k0j8L0l1K2j5L4j2nOj8M3m4M2j1j9N
5873@j3K3k4M5j9%mj6M2m0J0jj3L6k5L4k4jnk2L8l3J4j9K3rJJ4m6N4l9KK5k9K7
$$ plain form
5908 6 -5 5 -20 -13 19 -8 7 -18 15 -6 6 5 -4 21 0 20 -12 20 12 -3 21 -21 6 -1 2 7 -12 30 -14 7 -11 3 6 -23 15
5943 15 -20 1 -1 -5 7 -15 5 -4 19 -3 -5 -5 -16 13 -8 20 -8 -12 16 -12 22 -12 22 3 -14 17 -8 18 6 17 10 -16 22 -14
5977 -14 4 3 -4 7 -27 1 -19 9 -17 -11 -3 -40 25 -19 -6 -11 -18 12 -23 22 -7 19 7 -4 13 -15 15 -5 24 14 17 28 -14 40
6011 40 8 29 -1 4 19 -11 3 -10 16 -6 7 12 -14 23 1 7 4 -8 33 -27 -16 9 1 -8 -9 19 -17 3 -15 2 -2 -15 2 -17
6045 -17 1 -2 12 20 -7 30 10 15 6 10 29 1 17 6 8 -7 -4 17 3 23 -18 6 -2 -14 7 -7 3 -14 -5 4 -20 6 -15 22 -19
6080 -19 15 24 -1 19 -20 27 -4 19 4 -13 18 -14 24 -3 10 23 -4 12 -13 11 10 -5 19 -13 20 -15 14 5 -9 18 -12 9
6112 9 -8 -3 0 -9 0 -2 1 -28 -7 -22 4 9 -17 -4 -6 6 6 -20 22 -2 23 5 -2 19 -11 21 -6 18 0 16 28 -10 21 -13 10 0
6148 0 7 20 2 6 -14 12 -6 -17 -8 -18 -5 -21 -6 -19 -25 -4 2 14 -5 3 2 -3 1 -16 8 -5 8 6 -9 18 -15 25 -6 8 33 3
$$ packed form
5908Fj1J0k5PL2k7J5k5L3k1J2jrK5k1K0l2L2qj5K4m2K7pLNj9M2m4K1j8J4Lk9L8
5943A5l5K1kmJ2k2K0rK3k2k%j1K9k1K8k8mK8k8L4l4L4j9j7L1k5K6j2J1pk6L8l6
5977a4J8jpJ1l4K8k0K8k6OQl7O5m4J3npL0l5M5k9K6j2j1J7k8L0k0K9j0LJ1m2N4
6011D0l2K1l0NJ5l0J4j3K6k2J3Nk6L7k2Olj2M1o0J1K5qrjK8l6K0j8J7mj3J7j9
6045a7J8lJ4Qk7L7k0NrMJ9k8J6j1Kj5LK1j4K0m1K4qj2K1j4J0j7RRk4K6k1L7m1
6080a9L4Rk5K0l9M7l1K3j5j7L1l2L8k7J3J3k7J6k5K4jj5K4l2L3l5K9rj4K7l0K1
6112Ij7NLrRkLk9K1j5K6Nk6J3kJ2%k6M2k4K5j8pK1l0L2k7K4j8J6J2l8L1l4K3j0
6148@PJ3j8Mk0K6j8j1Rj0J3j6J5j3oK1OJ2j9QjnMj7K4j3J3kj5K7l3M0l1J4K5l0
$$ plain form
6184 3 22 2 23 5 3 -7 -2 21 -13 6 25 7 25 6 18 2 -9 -10 -5 6 -21 -5 -9 0 2 1 -5 -8 -11 -10 7 6 0 5 -9 4 11 13 3
6223 3 -8 18 -10 16 -2 1 8 -14 23 -5 3 -5 -10 -7 -17 -12 -4 -8 -9 -23 2 -9 -11 -19 3 -6 -9 12 -4 21 2 3 -7 -9 13 -1 2 11 9 -5
6263 -5 2 12 5 15 -2 4 11 14 21 18 30 -4 8 10 -6 37 -23 3 -2 6 5 -10 6 6 -4 12 -14 13 -14 8 -18 -12 11 -11 14 -21 17
6300 17 -6 1 14 5 5 -18 -8 6 11 0 0 13 -1 27 -4 -5 2 -9 23 3 5 7 6 5 6 21 -6 -6 -4 -2 -5 -8 -1 -13 5 -10 25 -8 -18
6339 -18 4 -3 17 -1 -6 7 -10 23 -4 17 -7 -11 -1 -1 15 15 11 1 9 11 6 11 -3 10 -1 -8 -1 -38 -2 -8 6 2 -21 2 -13 1 -24
6376 -24 -5 10 -12 2 -24 10 -18 -6 -8 -23 3 -1 -10 1 6 8 -5 14 2 9 -3 19 -7 6 30 -11 13 -7 -3 4 -5 10 -18 -2 -4
6411 -4 -11 -2 -26 5 -24 -3 -12 -14 -1 -12 -8 -4 -12 -12 0 -10 -10 24 -2 -6 0 -18 22 -24 14 4 16 21 0 15 -4 19 -1 12 12 19 16 -4
6449 -4 10 0 1 2 -20 11 0 -3 -2 1 -11 3 -3 -16 7 -16 -12 10 -14 17 -6 2 27 5 13 -6 15 -14 18 -10 14 19 8 32 0 15
$$ packed form
6184CJ9k0K1j8kj0NK3l4J9J9j8J8j9J2j6j1jNJ1k7J6mRKjollJJ7joNj4J3PKj0
6223Cj1K6k8K6j8LPk2L7k8QqnLj0NQmjj4K5j1kqK2rlK1j6K5j9Jj0kK2j4LRkj4
6263ePJ0pJ0j7OPLPlJ2l4J2Kj6M3o0K6nQjj5J6%j0J6k6K7k7K2k6OK3k2K5l5L8
6300A7k3PJ3r%k3J0J4Nj1%J3j4K8l1jPj1L2k0KKjjJJ5k7%KKllPj2J8j5L5l3j0
6339a8K2pK0j8nJ3j7L3k7K1k4mJ0%J6%mj0QKnNj4J3j1pPl7L6oJ4mk3K3j5J4k5
6376b4J9J5k2J4k6L4k8J2kj5K6mrJ1NKj3J9j2Pj2K2k6J3K4m1K4k0MPrJ5k8J6k
6411dpRk4L1k9K1rkJ3j1MMq%J2j0%L4k6mOj8M0m6L8j0J2Nk1J5j9K3k0J3%Plk0
6449dJ4j0JJk2L1j1lJLj2J4oj3K3k3MK2k4L1k3QK5k2Qj9K1k9L2k8K4Nj1K4l2J5
$$ plain form
6485 15 13 33 12 -5 29 3 10 -7 -17 15 -21 21 7 0 7 -10 4 -21 -1 -17 7 -8 -20 5 -18 15 -18 9 21 -15 15 -21
6517 -21 26 -7 4 18 -5 0 -3 18 6 -13 12 -12 6 -1 17 7 4 -1 -4 20 -19 9 -3 -8 19 -18 10 -6 4 -4 -10 13 -21 5 -20
6552 -20 2 -13 -11 6 -15 -1 -16 8 10 -6 11 -6 11 15 2 9 5 25 -3 14 -2 12 10 1 5 -7 14 -3 -8 5 3 23 -20 3 -18
6587 -18 -10 6 -34 15 -16 -1 -5 -3 1 -26 0 -14 -1 14 5 15 1 23 -6 28 13 15 35 -2 19 12 8 28 0 16 -8 10 11 1 3
6622 3 -7 2 -8 -4 -20 -15 5 5 16 -1 -5 0 -10 -2 -18 -1 -14 -8 12 -17 12 -13 1 0 -4 -5 7 14 11 28 4 25 18 -2 13 6 10 11 13 2
6662 2 5 8 -14 -10 1 -6 2 -13 0 -19 -4 -2 -31 -16 -35 4 -19 -16 0 -7 4 -1 7 -15 4 5 18 7 -3 2 4 16 9 -17 8 1 21 8
6700 8 17 3 -7 20 1 16 -10 2 -13 1 -11 -11 -1 -12 -15 16 -17 -6 -6 -6 -14 -14 -15 -8 0 5 -11 9 -1 10 3 5 11 3 13 5 11 6 31 -5
6740 -5 22 12 9 21 5 22 -1 9 21 -8 9 -5 14 5 -9 7 -6 1 -6 6 -24 -13 6 -17 -12 -25 14 4 -5 -1 2 14 -26 1 1
$$ packed form
6485A5kK0k1j7L4k6Pj7j0L2l6M2j4pPj7J4k5K0j6K4j5j2K5k3L3l3K7J2l6L0l6
6517b1M7l3J1J4k3NlK1j2j9K5k4J8pJ8j0lnlK4l9K8j2nK7l7K8j6J0qoK3l4K6k5
6552b0K2j5KJ7k1J4j5K4Kj6J7j7J7Mj3PmK0k8J7j6J4krMj2K1j7nJ3kK0m3K3k1
6587a8QJ6m0M9l1J5mKMk7K6j4J3J5rJ0j4K2k9L4j5KK0l7K1pmK0k8J6k4J8Jj0K
6622Cj0Rj0Mj6NK0%J1j7mNj0Qj6J7j3OK0k9K9k5J4jmjJ2PlJ7k4K1pk0J5pMJKj1
6662BLLk2MJ1pQj5J3j9J5Kk9J5j9L9k3LJ6pJ1nQk2J9JJ3j1j0NKJ2pk6K5pK0j3
6700HRj4j0K7j9J5k6J2j5J4j2%J0j1lL1l3J1%%q%jPQNj6K0j0J1pKOqJ0qOnK5l6
6740eK7j0lJ2j6J7k3J0J2k9J7j4J9rj4J6j3PpJ2l0J1J9k3Nj3L9j0rMLJ2m0K7%
$$ plain form
6775 1 -2 17 5 8 21 18 16 10 22 0 10 -1 14 1 10 21 6 10 11 -8 7 2 6 -12 9 4 5 -18 -3 12 -11 14 1 -12 6 -6 0
6812 0 -16 15 18 -7 18 -1 19 -1 21 7 3 6 15 4 19 21 4 14 8 0 11 -1 7 -12 -13 -8 1 16 -9 -11 0 -4 -1 -21 -3 6 -2 16 -20
6851 -20 10 -10 19 -2 -1 6 -1 -10 6 9 3 9 -3 -8 4 -14 20 -2 3 10 8 8 0 0 2 20 -7 -3 26 -4 2 -4 -6 7 -18 8 -17 -1 2 -22
6891 -22 -11 -6 4 -1 13 7 -5 5 -13 -10 -11 9 14 15 0 8 21 4 16 13 7 16 -2 19 -4 14 4 4 19 1 6 1 9 17 2 1 -16 -15 -9 -8
6931 -8 -5 -3 6 -10 -5 -10 17 0 4 10 -28 7 -5 9 16 0 -6 16 10 3 7 6 0 19 5 11 5 5 8 2 14 -16 24 11 3 12 -6 11 -13 -12 1 -1
6973 -1 -12 -11 0 -16 0 -8 -7 -1 -8 -17 -12 -17 -14 -18 5 -8 6 5 6 -2 -14 13 -11 7 7 13 5 -8 6 2 2 0 4 19 3 10 2 1 6 -18 -6 -7 2 -27
7017 -27 -1 -3 -11 12 -15 -4 1 -3 2 -8 -1 -8 10 -14 -5 13 -20 23 17 13 15 10 10 -10 26 -16 -3 13 14 6 -6 19 3 0 -7 -2 -2 -22 -17 -11 1
7058 1 -19 -17 2 -20 -8 -5 4 -10 -18 -4 -1 -9 -14 -2 -4 -8 9 2 3 -2 0 -1 4 25 -4 13 -4 1 10 -9 20 11 -17 2 6 5 -12 -2 -12 -12 3
$$ packed form
6775AlJ9j2LJ3lkoJ2k2J0j1J5j3RJ1j5MJj9J5nMj8K1nJk3J5J5k3K5j3j3J8j2O
6812@j6L1Lk5K5j9K0k0K2j4mLRj1J5Kj7J0oqJ1j2Qj9jNRJ5k5kJ1mLk0J8RqJ8l6
6851b0L0k0K9k1JPprJ6LoOj2nJ2j8L4k2NPk%q%KJ8k7MK9l0OokJ3k5K6k5J6Lk4
6891b2J1NJ0nJ4oj2J0j8LjK0NJj5QJ3j7J2loRj8K1k3J8j0%J5j8NnQQj5jj7JOJ
6931hLKRj6NnK7j7MOl8L5j2J4Pj6oK2opMjoJ9j4Oo%LoJ2l0M0j3qRj8J7k4JJ3k
6973aj1JJ1j6J6qJOprNnLmK3j3J4jJqj2K7k4J8%Oqj3J4m%kMJ5j6PqjNk4J2jRk9
7017b7K6kqK3k7J1NmNj0PpJ8k4RJ8l3M3omKn%k0L6m2J3J6Jqj2K5j6lpN%k0NOJ2
7058Ak0KJ9k2J2LRj4qJ4LqnJ2kmJ7pJnKjNK1k9J7j7NRj9K9rk8J9Mjj7J0j0%J5
$$ plain form
7099 3 -16 -2 -5 3 -14 0 -8 -9 -9 -12 -8 -4 -5 -11 -3 3 -18 15 16 6 14 11 5 4 15 33 -6 12 15 16 3 4 12 -8 23 -4 11 5 -1 -1 0 -1 0 -9 -19
7144 -19 -7 -16 -6 -13 -12 -6 -12 1 -1 -7 3 -14 2 -13 0 -1 5 18 -3 -3 -4 21 14 -7 5 16 -5 5 -1 -4 -9 8 -9 -4 -5 -10 -4 0 10 -5
7184 -5 -5 5 -14 -11 -13 -6 6 -10 -7 -10 -17 -8 -10 -2 5 -13 0 -1 -13 6 -3 10 13 15 20 -7 19 5 4 -3 8 13 0 8 -3 4 -2 1 3 14 6 10 -19 -3
7228 -3 -20 -13 -11 -6 -13 -2 -13 -15 16 -20 9 -9 -11 2 -7 -5 3 -6 -7 -12 -12 4 11 5 -3 10 1 8 -3 24 12 18 8 21 7 3 23 9 6 2 0 -2 -15
7271 -15 -6 -1 -27 -8 -7 3 -7 6 -19 2 -4 4 -4 5 6 -4 -12 8 19 17 13 11 6 7 11 0 3 4 5 5 -1 -3 -17 18 12 -7 0 -2 4 20 18 -9 16
7314 16 -10 -15 -1 -6 -14 -17 -5 -4 -15 -7 -8 -21 -2 -8 -22 -39 9 -3 21 7 -6 26 4 26 14 18 -6 -8 14 8 8 1 14 -5 5 16 -10
7351 -10 11 -7 2 -3 -11 0 -6 -10 -4 -23 -13 7 5 -9 -4 -6 -9 -6 1 15 -1 5 -16 10 0 5 4 -2 12 -1 17 -6 -1 20 3 5 -6 10 16 0
7391 0 12 -1 4 7 7 1 -4 8 -3 -18 -10 -9 3 -14 -7 3 1 -2 2 -2 -10 -4 -8 4 -6 -13 3 -1 0 12 3 15 2 19 11 21 9 10 13 2 1 11
$$ packed form
7099Cj9J4lQj7J4qj%lMMjoQOk1L3Jj0QlojJ1J8l9J8LJj3JQk0L1k7J5oo%JjJrj0
7144a9J2rJ0pJOoJ3koJ0j7J6j5J3jOJ3k1%jK5pk1J2J1k1J0olnJ7j7NjnOMJ0j5
7184e%J0j9LkPJ2j6LlpRkQPj8J3jj2J9rJ3LKNk7K6j4jpJ1Nj3Qj1PoLKJ1qMk9J6
7228cj7PKNpJ1j1kL1l6K9j8kJ3rKQrjn%J6PoqJ3rPj1K7j2Oj0J3j4mK0j4lmkkj3
7271a5RNk6J9JJ0j0J3k5K1oQqRJj0qK0J1kmknJMj1LJJ%okj4L5oj9PkOJ6kk7K5
7314A6k6nJ4nqlJ2Jj1Qjj3J9oj4j7M8j2K4j4j3L2k2K2j2Mk4kK2o%pJ3j9J0J1k6
7351a0K1j8RnqJ1omOj9J0K0kj4NklLPJ4j6Ok1K6j0NjoJ4j3J8k3NK1j7Kj1J6Oj6
7391@J2j3NL%onJ2j1j5QJJ2j7PJ0klMmqOmJ2j0pJ6mJJ2rJ2j3J7qJ0j2JLj1jJ0
$$ plain form
7433 11 13 -9 -1 3 -4 2 3 -7 7 -11 0 -15 9 8 -7 6 -6 -6 -12 12 0 6 -7 -2 -1 -11 -2 2 6 10 1 -2 -3 15 -2 9 3 4 14 10 0
7474 0 8 9 -2 -10 18 -1 20 1 5 3 -6 -4 -9 9 -6 -6 -7 -17 -16 2 0 -19 -4 6 -20 -8 17 -4 -9 -4 6 7 9 11 -1 7 -16 -2 -5 2 9
7515 9 14 9 14 6 -3 -6 -4 1 -6 10 -15 -3 10 -13 2 -15 -4 -3 -19 -14 -8 -7 -9 -5 -3 -16 0 -6 7 8 -11 8 13 2 3 12 14 6 7 14 2 10 8 20
7559 20 3 8 -1 22 -14 -4 6 3 -5 -3 0 -19 9 7 -3 2 -2 -2 -12 -4 -11 -4 4 -5 -3 -3 0 15 -16 -4 2 2 0 9 12 -4 10 16 12 -3 5 7 15 -2
7603 -2 4 3 -4 -21 14 -18 9 8 -13 -5 0 -9 1 -9 -11 -6 -13 -9 0 -1 -6 -1 -7 3 -7 -7 -10 13 -3 0 1 -15 22 10 -14 7 11 -2 -4 10 4 0 8
7646 8 2 -9 3 11 2 0 10 -9 -4 -4 -15 -3 -9 0 -19 12 -15 -5 -13 -17 8 -4 2 8 11 -3 -3 -2 10 1 -11 5 -7 16 20 -14 10 11 13 11 1
7687 1 11 -4 11 11 8 18 5 10 3 -9 4 -1 -19 -6 -1 -22 -10 7 -5 9 -10 -13 -4 -6 -6 -3 4 0 -8 0 7 2 -6 8 11 -10 4 32 5 27
7727 27 14 -2 5 -12 -4 -9 5 5 -2 -1 -1 -23 -9 -14 5 -1 -13 -5 -11 -8 -10 -3 -2 -16 -17 5 -4 -3 -2 -15 -11 -9 6 -9 -9 7 10 18 10 12 -1 -1 12 -1
$$ packed form
7433A1Kk2QMpOJj0J4j8J1j5K4jj5J3j2%oK4j2Oj3NJj0RMMMrljJ8j7J1oJJ0mj0
7474@QJj1qK8j9K1j9MkrKnJ8j5%jj0JJ8kj9J5J0k6J2K5k1nNJ0JKKj2Qk3J4lPP
7515INnNqrlKNpJ6k5J2J3k3J5j7J1Jj6NOJkMKj3J6oJ3Jj9J9Nj1JRKqJPj2QkJ2
7559B0j7NrK3l6J0J0lqKLj9K8kj0Nm%j0QpPQrK%LJ5l1J2O%kRLj6J4Omj5QKQj7
7603bOjpj7L5l2K7jk1QNrJ0j0kNpMRjnNoJ0j0%lK3j6LJj6L7j2k4K1Mj3kJ4omQ
7646Hoj1J2QrkJ0j9N%j1J2oRj9L1k7J0qmK5j2OOLj4%JJ2rj2J6j2K3Ml4K4JKkj0
7687AJ0j5J5%lJ0j3Npj2J3nj8J3Nk1J2J7j2J4j9lRk%LPmqQPnqJ4Lk1J4K8k7K2
7727B7j3j6Pj7QnJ4%pJ%k2J4nJ9oj2QoLkPJj4jK2rJJj3MKJ5j5%J6LQqKj3%J3j3
$$ plain form
7771 -1 4 -2 5 3 15 5 -3 -11 -7 4 7 4 10 -2 13 -3 0 -10 -7 1 -13 -9 -7 -20 1 -12 -6 9 -9 23 -9 9 7 7 -11 14 -3 2 -7 10 9
7812 9 4 1 9 -1 18 2 7 10 0 -5 0 7 -17 3 -12 -19 -1 6 0 -13 -14 5 -14 12 -6 21 -6 0 11 -5 -12 -11 -6 4 24 6 -14 -6 10
7851 10 4 7 -7 11 12 18 -1 12 -15 11 -5 6 5 12 6 6 14 -15 -3 -13 -3 11 -6 -6 -11 5 2 -11 -1 8 -17 1 -9 -2 1 -7 1 6 5 9
7891 9 2 -10 9 -20 8 12 -8 5 7 13 -1 -9 1 -8 -5 -1 11 6 -9 -1 0 -2 6 -4 -7 -6 2 0 -15 8 -11 -1 2 -15 -4 12 -10 2 1 3 24
7932 24 15 -6 -10 5 19 16 12 0 7 11 -4 12 0 3 10 -7 -2 5 -11 -4 5 -3 7 -1 -7 14 4 1 -15 -1 -10 -7 -19 -7 -5 -3 -8 -9 9 0 -8 4
7974 4 11 1 4 -12 3 -20 16 22 5 6 2 4 19 6 1 -1 -12 -1 -3 -2 -3 0 -3 -8 12 -2 -10 5 -15 -10 -3 -16 -9 -3 3 3 -8 -19 -22 7 -2 15
8016 15 -1 -4 -1 2 0 13 10 7 15 8 10 6 2 -4 3 -2 5 -11 6 13 8 -5 -1 28 -6 -3 0 2 6 -16 -12 -14 -6 -7 -13 -15 -9 11 -29 -3 -13 8 -18 -6 -7
8061 -7 15 -14 14 -1 18 16 5 9 13 15 -3 17 3 18 -1 19 -10 -9 5 -14 1 8 -1 0 -1 -11 -6 -18 3 -13 -8 -12 -4 -13 3 -9 -5 -3 4
$$ packed form
7771aNoPkJ2j0qqMJ1LlOj2J5j6Lj0LQj4MKj3K1j3OJ5j8L2l2J8k%j8K5j7NrJ7j
7812InlQj0J9j6NLj0nNPk4K0j5pJ8Poj3jJ9j9K6j8K7k7OJ1j6pJNJ0K0j8k0QJ6
7851A0oLj4J8JOj9J3k7K6j6J1jPo%Qk9J2j0J0J4j7%nJ6lj3J0Rk5J8j0PLqQNjM
7891Ipj2J9k9K8Mk0J3KOj4qJ0rLMJ2nj5QJkQj0lJQkj5K3j9J0Lj7J1J6k2J2jKK1
7932B4rk1mJ5J4lmj2PMj5J6j2LPj7NPj6PRqJ0qoK1j0lj6J4rLj2J2KKnjJ8rqJ2
7974DPj0Lj6J5k3L6Oj7JmKJ5j3nkj1J1kJjLlnK0j4qJ5k0NPj3POO%j1j1lK9rJ7
8016A5j6lLLkJ3llQpKmmoPnPj6J7Pnj3MK9l4LLKMk2MkQjokOK0m0K6j0K1k6J2j
8061gK2k9K8j5J9kj1MMKj8K0j4J5j9K0k9JJ4j9J5PrJjj0Nj2K1j6NmQrJ6j2MKP
$$ plain form
8100 4 10 3 -3 -6 -2 7 9 3 -5 -5 6 6 23 -6 1 11 -8 -1 -2 25 1 -6 -7 -4 10 -7 3 0 7 3 16 -13 -15 -20 -18 -16 -8 -2 -26 -19 8 0 14 -3 -14
8145 -14 0 0 22 -12 -3 9 10 1 16 7 -8 18 1 6 -5 3 4 10 7 -2 10 -4 0 -8 -7 -2 -8 6 -3 9 -3 -13 10 -10 2 0 24 -18 -5
8184 -5 -12 1 3 1 -2 -8 11
$$ packed form
8100DOpolMRKoq%J1%J7k9PJ0j9PjK7k4pjLJ4j7J0lPmJ3k9knKKQOk4PK7qJ4j7j1
8145a4J4%K2l4RJ2JrJ5rj5K6j7Nj1QJOlrJ2j4MqJNoJ4rJ2j2j0K3k0J2kK4m2J3
8184epJ3KkloJ9
8191A1
$$ Imaginary data points
##PAGE= N=2
##DATA TABLE= (X++(I..I)), XYDATA
$$ plain form
0 0 0 0 0 0 0 0 0 0 -8 8 -16 16 -24 32 -40 52 -64 80 -102 124 -152 182 -216 256 -302 356 -414 483 -560 644
30 644 -740 849 -964 1095 -1241 1401 -1577 1772 -1985 2220 -2476 2754 -3060 3393 -3755 4151
46 4151 -4586 5060 -5576 6142 -6762 7445 -8200 9033 -9962 10997 -12166 13489 -15005
59 -15005 16762 -18824 21288 -24289 28039 -32884 39423 -48824 63803 -93266 274947 -509846
71 -509846 58072 -46157 -148233 437877 -426829 539454 -395580 -255413 343747 6631
81 6631 155691 -266804 2869 47900 -121794 189787 199418 -272159 -194888 184465 28076
92 28076 200656 -277538 150502 -104069 -266919 526354 -170314 66334 -277006 -16297
102 -16297 362423 -349029 370368 -180453 -149444 15577 11062 397758 -363060 16481 -9924
$$ packed form
0@%%%%%%%%qJ6k4L2m0N6p2R2j16J44j82K26k76L34l98M72n58O58p70Q97j043J204
30F44j384J589j813K059k336K642k978L349l757M205m696N230n814O453p148P906
46D151q737R646j0636J1718j2904J4207j5645J7233j8995K0959k3163K5655k8494
59a5005L1767l5586M0112m5577N2328o0923P2307q8247J12627j57069L68213p84793
71e09846N67918j04229j02076N86110q64706R66283r35034J40167N99160l37116
81F631J49060m22495K69673M5031j69694L11581R631m71577P7271L79353j56389
92B8076J72580m78194M28040k54571j62850P93273o96668K36648l43340K60709
102a6297L78720p11452P19397n50821L1009J65021m515L86696p60818L79541k6405
$$ plain form
113 -9924 -24707 98477 14570 166646 -361045 23199 116710 138820 -43048 -166008 157310
124 157310 -248994 161389 120743 10839 -114540 -236759 304370 -60857 46110 13068
134 13068 -94242 -46604 -73879 299058 -46538 -118774 -96034 74878 56080 -42068 182579
145 182579 -190714 -48463 -51220 189660 111413 -265047 142430 -159574 75233 71746 15294
156 15294 98808 -357129 164034 71871 10846 46767 -149271 81254 -153835 131792 147900
167 147900 -109827 -89561 -53409 128323 -4143 39681 -12556 -69502 -92295 78952 179075
178 179075 -116111 -24231 -86999 61914 36772 -4881 138017 -218927 -9610 44764 86132
189 86132 61931 -164348 72470 -96699 33662 118433 -7363 -32253 -159144 97504 58183
$$ packed form
113i924j4783J23184q3907J52076n27691L84244R3511K2110j81868j22960L23318
124A57310m06304M10383m0646j09904j25379j22219N41129l65227J06967l3042
134A3068j07310M7638k7275L72937l45596p2236K2740J70912j8798r8148K24647
145A82579l73293J42251k757K40880p8247l76460M07477l02004K34807l487n6452
156A5294Q3514m55937N21163r2163o1025L5921j96038K30525k35089K85627J6108
167A47900k57727K0266L6152J81732j32466M3824n2237n6946k2793J71247J00123
178A79075k95186R1880o2768J48913k5142m1653J42898l56944K09317N4374M1368
189H6132k4201k26279K36818j69169J30361Q4771j25796k4890j26891K56648l9321
$$ plain form
200 58183 12266 5383 -61738 -33406 -39159 140508 31993 -65204 -82415 -386 78217 -10437
212 -10437 74703 -64822 -76472 -9275 68367 107947 -97113 -23121 -36254 6748 67682 25048
224 25048 19744 -132545 -9018 69917 49807 9547 -66216 -13566 -44516 59194 76312 -13471
236 -13471 -71792 -61620 63433 34105 32892 -17329 -60427 -32748 18252 102288 -5050 -54938
248 -54938 -49107 -475 55023 26552 27067 -67655 -57341 24436 62685 43709 -50738 -38817 -26643
261 -26643 20958 64259 20970 -36027 -73766 2435 56247 39970 -3171 -47686 -40031 547
273 547 59513 44401 -26301 -62112 -23984 36017 46305 21654 -33584 -53593 -15321 44879
285 44879 56503 -6323 -49181 -40109 9069 49074 35957 -13143 -54570 -33442 29723 53849
$$ packed form
200E8183m5917o883o7121K8332n753J79667j08515r7197j7211Q2029P8603q8654
212a0437Q5140j39525j1650O7197P7642L9580k05060P3992j3133M3002O0934m2634
224B5048n304j52289J23527P8935k0110m0260p5763N2650l0950J03710J7118q9783
236a3471n8321J0172J25053k9328j213n0221m3098K7679N1000Q4036j07338m9888
248e4938N831M8632N5498k8471N15r4722J0314Q1777L8249j8976r4447J1921J2174
261b6643M7601M3301m3289n6997l7739P6201N3812j6277m3141m4515P655M0578
273E47N8966j5112p0702l5811L8128O0001J0288k4651n5238k0009L8272O0200
285D4879J1624o2826m2858R072M9178M0005j3117m9100m1427K1128O3165K4126
$$ plain form
297 53849 18605 -33103 -50934 -9622 35912 47884 7109 -48620 -40520 3506 50436 36670
309 36670 -18130 -44179 -33836 24595 47930 22915 -26822 -53778 -9826 33711 47298 3966
321 3966 -41235 -37778 -1641 46648 35320 -9313 -48077 -31621 23804 42522 25029 -27601
333 -27601 -43509 -16425 28618 50251 2649 -35073 -41856 2256 42166 29462 -881 -47355
345 -47355 -29428 16174 43129 27976 -30781 -36405 -18823 26873 44675 5792 -27469 -47320
357 -47320 4243 37395 30930 -1363 -44755 -22963 4982 45788 25913 -25521 -35043 -23744
369 -23744 33200 32005 14026 -26221 -46374 5098 26289 42895 -11302 -35591 -21987 -2154
381 -2154 49859 15282 -7761 -45465 -20454 34664 22005 24711 -36001 -28566 -9405 24957 50219
$$ packed form
297E3849l5244n1708j7831M1312M5534J1972m0775n5729Q100M4026M6930j3766
309C6670n4800k6049J0343N8431K3335k5015m9737k6956M3952M3537J3587m3332
321C966m5201L457L6137M8289j1328m4633l8764J6456N5425J8718j7493n2630
333b7601j5908K7084M5043K1633m7602l7722o783M4112L9910j2704l0343m6474
345d7355J7927M5602K6955j5153n8757n624J7582M5696J7802l8883l3261j9851
357d7320N1563L3152o465l2293m3392K1792K7945M0806j9875n1434r522J1299
369b3744N6944j195j7979m0247k0153N1472K1191J6606n4197k4289J3604J9833
381b154N2013l4577k3043l7704K5011N5118j2659K706o0712P435J9161L4362K5262
$$ plain form
394 50219 -19977 -21731 -36777 14346 34176 14149 6989 -56901 -7275 12474 42883 13200
406 13200 -39592 -8981 -28952 40195 25130 6179 -26790 -51650 37368 10700 33873 -16266
418 -16266 -32794 -7393 -13483 68445 -4758 -18107 -34524 -9298 42556 -2245 33136 -41719
430 -41719 -27156 779 31378 43460 -45837 -1935 -31563 19106 25592 12224 9045 -77226
442 -77226 24804 11335 34650 177 -41295 16068 -50188 59135 20135 -10580 -24948 -46169
454 -46169 63780 -16556 31912 -10623 -37274 -2250 -8713 80054 -34586 -17224 -19055 -1086
466 -1086 33862 -11672 48981 -65640 -15573 16184 29701 29452 -62671 29999 -41798 16486
478 16486 35628 3863 -644 -80521 54046 5671 15609 -622 -26230 6614 -50784 81445
$$ packed form
394E0219p0196j754j5046N1123J9830k0027p160o3890M9626J9749L0409k9683
406A3200n2792L0611j9971O9147j5065j8951l2969k4860Q9018k6668K3173n0139
418a6266j6528K5401o090Q1928p3203j3349j6417K5226N1854m4801L5381p4855
430d1719J4563K7935L0599J2082q9297M3902k9628N0669O486j3368l179q6271
442g7226J02030j3469K3315l4473m1472N7363o6256J09323l9000l0715j4368k1221
454d6169J09949q0336M8468m2535k6651L5024o463Q8767j14640J7362j831J7969
466a086L4948m5534O0653j14621N0067L1757J3517k49r2123R2670p1797N8284
478A6486J9142l1765m507p9877J34567m8375R938j6231k5608L2844n7398J32229
$$ plain form
490 81445 -983 -15729 -31845 -16023 62115 -49124 65155 -34301 -33191 5778 -5365 93605
502 93605 -85119 15149 -6798 -23256 51999 -24819 56397 -82603 -10655 53757 -4331
513 -4331 18508 -40787 20369 -35743 13375 43431 4468 -40994 -36930 61777 -25531 34304
525 34304 -18921 -4536 -12945 -46367 121730 -60187 -684 -16637 -18746 68308 -75019 97046
537 97046 -55097 -50058 48416 -15050 73662 -86047 25151 4522 -42165 58608 -2862
548 -2862 13279 -71346 18345 38905 -4851 -3034 -10177 10681 -58038 60153 17800 -11075
560 -11075 -32929 -25389 74888 -58989 48553 -3242 -38992 4421 -23350 101196 -67257
571 -67257 -9356 13915 -24317 36046 -26734 66516 -67701 -25308 43378 6749 21389 -58767
$$ packed form
490H1445q2428j4746j6116J5822P8138j11239J14279r9456J110L8969j1143R8970
502I3605j78724J00268k1947j6458P5255p6818Q1216j39000P1948O4412n8088
513d331K2839n9295O1156n6112M9118L0056l8963m5462M064R8707q7308N9835
525C4304n3225J4385q409l3422J68097j81917N9503j5953k109Q7054j43327J72065
537I7046j52143N039R8474o3466Q8712j59709J11198k0629m6687J00773o1470
548b862J6141q4625Q9691K0560m3756J817p143K0858o8719J18191m2353k8875
560a1075k1854P540J00277j33877J07542n1795l5750M3413k7771J24546j68453
571f7257N7901K3271l8232O0363o2780R3250j34217M2393O8686l6629J4640q0156
$$ plain form
583 -58767 48471 -42770 -2644 49315 -6918 2645 -78506 68597 -839 -14069 27997 -33115
595 -33115 13394 -52028 70169 15659 -49951 2572 -9962 35603 -31752 39735 -4846 -44514
607 -44514 1250 23115 46688 -63368 19736 -8040 -10172 19552 -341 45705 -90371 21691
619 21691 31896 -8546 19438 -44630 44973 -56532 16310 57269 -34338 -4362 -40955 54225
631 54225 -11259 -8751 31995 -34067 -9718 -10674 61539 -15946 -31911 7212 -2716 14310 -17097
644 -17097 49115 -35936 -32582 23398 15007 24868 -52195 29071 -14462 -18879 38789 460 8241
657 8241 -60446 27960 25059 -16557 14866 -16438 5990 -35506 35175 29668 -31177 -12143 -8754
670 -8754 32139 -20654 18890 9381 -35463 -3296 7453 45949 -33789 -10748 10249 -15031
$$ packed form
583e8767J07238r1241M0126N1959n6233R563q1151J47103o9436j3230M2066o1112
595c3115M6509o5422J22197n4510o5610N2523j2534M5565o7355P1487m4581l9668
607d4514M5764K1865K3573j10056Q3104k7776k132K9724j9893M6046j36076J12062
619B1691J0205m0442K7984o4068Q9603j01505P2842M0959r1607K9976l6593R5180
631E4225o5484K508M0746o6062K4349r56P2213p7485j5965L9123r928J7026l1407
644a7097O6212q5051L354N5980q391R861p7063Q1266m3533m417N7668l8329P781
657H241o8687Q8406k901m1616L1423l1304K2428m1496P0681n507o0845J9034L389
670h754M0893n2793L9544r509m4844L2167J0749L8496p9738K3041K0997k5280
$$ plain form
682 -15031 16281 51 28839 -42000 -17747 34385 1935 8246 -24166 14534 -18579 -6607
694 -6607 40694 -5825 -14142 -27603 24604 10338 -9470 14651 -13227 -13157 -8510 35133 7337
707 7337 -25397 -6687 2078 10757 -6384 23276 -11274 -26945 5159 15909 21963 -28749 2907
720 2907 -1531 -13018 22369 4674 6805 -34562 -1953 28456 -6462 7535 -10003 -4614 -9874
733 -9874 5653 30643 -12276 -19341 -3196 10029 5927 3209 3816 -13301 -15140 9628 25670
746 25670 -7534 -12574 -4700 -1314 8703 3739 13667 -18193 -18728 14803 9917 8089 -12138 -5307
760 -5307 -2523 -5644 21156 6271 -13236 -14102 1040 15288 2989 -246 -4082 -13484 -1802 16912
774 16912 9774 -8328 -14048 -2048 8519 4298 8397 -4330 -17007 -1507 10385 13819 -4226
$$ packed form
682a5031L1312j6230K8788p0839K4253N2132l2450O311l2412L8700l3113J1972
694f607M7301m6519q317j3461N2207j4266j9808K4121k7878P0M647M3643k7796
707G337l2734J8710Q765Q679j7141K9660l4550j5671L2104J0750O054n0712L1656
720B907m438j1487L5387j7695K131m1367L2609L0409l4918J3997j7538N389n260
733i874J5527K4990m2919p065J6145J3225m102k718O07j7117j839K4768J6042
746B5670l3204n040P874L386J0017m964R928l1860n35L3531m886j828k0227O831
760e307K784l121K6800j4885j9507q66J5142J4248j2299l235l836r402J1682J8714
774A6912p138j8102n720J2000J0567m221M099j2727j2677J5500J1892L434j8045
$$ plain form
787 -4226 -12245 -2120 -3244 10021 11207 -4291 -11538 -10183 10647 11616 -750 -2846 -11426 -3625
801 -3625 7964 10741 3752 -14354 -8176 4137 7742 8464 -3303 -9434 -7635 3495 13885 3764
815 3764 -7996 -9424 -2685 7582 9383 1601 -8073 -10762 1047 11201 6544 -2172 -10487 -6203
829 -6203 4701 8892 6790 -6932 -10418 -2440 6125 11254 -103 -7702 -8423 -729 10574 6179
843 6179 -754 -10038 -7295 5024 8629 6435 -6796 -8987 -2753 5047 10651 790 -6329 -10051 127
858 127 9925 5841 -416 -10038 -4926 1712 9118 7094 -6659 -7980 -5220 8166 7464 1317 -4337
873 -4337 -11064 1544 5496 10176 -2028 -10597 -2612 -1002 11611 2528 -1958 -8351 -7677 10385
887 10385 4506 5329 -8772 -7192 1229 2194 13040 -4687 -5344 -8075 1851 11822 -599 2260 -12216
$$ packed form
787d226q019J0125j124J3265J186j5498p247J355K0830R69j2366k096q580P801
801c625J1589K777o989j8106O178J2313L605P22j1767o131J799J1130J0390j0121
815C764j1760j428O739J0267J801p782r674k689J1809J0154m657q716q315M284
829f203J0904M191k102j3722l486P978Q565N129j1357p599p21P694J1303m395
843F179o933r284K743J2319L605k194j3231k191O234P800N604r861p119l722J0178
858A27R798m084o257r622N112O638P406k024j3753j321K760J3386p02o147n654
873d337o727J2608L952M680j2204q569P985J610J2613r083m486o393O74J8062
887A0385n879Q23j4101J580Q421R65J0846j7727o57k731R926R971j2421K859j4476
$$ plain form
902 -12216 -1973 3953 6899 7149 -12197 -2286 -4646 8420 7027 -2337 -2442 -12893 7299 4257
916 4257 7160 -3141 -10560 1569 -3287 14716 -1620 -3289 -7056 -5670 14178 -2705 8310
929 8310 -11392 -5819 4465 152 15943 -13505 -252 -6015 788 13806 -5836 5831 -16634
942 -16634 2509 7154 2022 6655 -14021 2619 -6541 9819 6932 -5542 -2913 -11063 12720
955 12720 -1606 7609 -4014 -9990 3391 -4597 19895 -10296 -1884 -3530 -5892 16152 -8523
968 -8523 13190 -15763 -5282 10551 -3089 14932 -17523 5069 -5946 -1078 16338 -8028
980 -8028 3869 -17148 9094 5064 -1119 6387 -12571 3636 -9298 16332 2005 -8715 -252
993 -252 -8930 15325 -8779 12191 -5405 -12873 7900 -3827 19839 -17382 2346 -451 -8342
$$ packed form
902a2216J0243N926K946K50j9346R911k360J3066j393r364j05j0451K0192l042
916D257K903j0301p419J2129m856J8003j6336j669l767J386J9848j6883J1015
929H310j9702N573J0284m313J5791k9448J3253n763O803J3018j9642J1667k2465
942a6634J9143M645n132M633k0676J6640r160J6360k887j2474K629q150K3783
955A2720j4326R215j1623n976J3381p988K4492l0191Q412j646k362K2044k4675
968h523K1713k8953J0481J5833j3640J8021l2455K2592j1015M868J7416k4366
980h028J1897k1017K6242m030o183P506j8958J6207j2934K5630j4327j0720Q463
993b52q678K4255k4104K0970j7596p468K0773j1727K3666l7221J9728k797p891
$$ plain form
1006 -8342 16313 -7722 12594 -20779 1016 12397 -5987 11578 -16067 9504 -12042 4259
1018 4259 16645 -12687 3409 -15555 15771 -2137 -1576 10305 -16356 4340 -6683 18513
1030 18513 -3370 -11560 5941 -7457 10028 -5952 13258 -10244 -11089 10381 236 11407
1042 11407 -18302 10851 -7071 -5454 16577 -7237 9780 -25488 13695 7131 -10513 15188
1054 15188 -16931 10505 -15495 10823 15783 -21344 7696 -10269 12578 -4563 796 10528
1066 10528 -19316 3691 2215 13220 -10012 -4622 5480 -6916 6444 -1410 13136 -19337
1078 -19337 -2429 12841 -3837 8062 -15296 13852 -12568 -2745 20914 -11767 3957 -17297
1090 -17297 15520 1943 -10433 16352 -13951 2023 -8070 15416 4616 -18004 8395 -5266
$$ packed form
1006h342K4655k4035K0316l3373K1795J1381j8384J7565k7645K5571k1546J6301
1018D259J2386k9332J6096j8964L1326j7908N61J1881k6661K0696j1023K5196
1030A8513k1883q190J7501j3398J7485j5980J9210k3502q45K1470j0145J1171
1042A1407k9709K9153j7922J617K2031k3814J7017l5268L9183o564j7644K5701
1054A5188l2119K7436k6000K6318M960l7127K9040j7965K2847j7141N359R732
1066A0528k9844K3007j476J1005k3232N390J0102j2396J3360p854J4546l2473
1078a9337J6908J5270j6678J1899k3358K9148k6420R823K3659l2681J5724k1254
1090a7297L2817j3577j2376K6785l0303J5974j0093K3486j0800k2620K6399j3661
$$ plain form
1102 -5266 7014 -6527 10502 -155 -18232 10150 1614 10034 -14737 3709 4341 -13255 13630
1115 13630 -932 5667 -17359 1810 15015 -10417 6572 -5365 3926 -10529 3746 16300
1127 16300 -12048 -2525 -4445 11456 -6062 429 9916 -13086 -338 -1768 17202 -8449 -9103
1140 -9103 10171 -8782 6432 -3681 11797 -8244 -14387 17015 -2731 3975 -8567 4672
1152 4672 -130 -11584 17174 -1301 -3892 -9611 6262 7961 -9624 7650 -2395 -3496 -6221
1165 -6221 10203 7788 -13037 449 327 4759 -5544 6254 4050 -14235 2474 4343 8760
1178 8760 -10144 -1586 6473 -9162 5804 2417 5200 -12112 -4004 13883 -5050 1859 -3082
1191 -3082 2839 -5675 -2863 15677 -6163 -5150 -3107 6277 1517 -5382 9089 -5953 -5642 1323
$$ packed form
1102e266J2280j3541J7029j0657j8077K8382q536Q420k4771J8446O32j7596K6885
1115A3630j4562O599k3026J9169J3205k5432J6989j1937R291j4455J4275J2554
1127A6300k8348R523j920J5901j7518O491R487k3002J2748j430J8970k5651o54
1140i103J9274j8953J5214j0113J5478k0041o143L1402j9746O706j2542J3239
1152D672m802j1454K8758j8475k591n719J5873J699j7585J7274j0045j101k725
1165f221J6424k415k0825J3486j22M432j0303J1798k204j8285J6709J869M417
1178H760j8904Q558Q059j5635J4966l387K783j7312Q108J7887j8933O909m941
1191c082N921q514K812J8540k1840J013K043R384m760o899J4471j5042L11O965
$$ plain form
1205 1323 9152 939 -10506 3889 49 -731 818 5932 -2454 -10849 5658 5498 619 -5690 1785
1220 1785 507 -6218 7130 3787 -2362 -8913 2725 7312 -4499 2342 -577 -1876 -4932 4581
1234 4581 8830 -7748 -2938 345 3360 -956 574 5196 -8632 -2160 4813 5186 -2488 -5690 4104
1249 4104 -2802 88 4931 1333 -4927 -5707 6616 3015 -2445 -340 -322 -2601 -1109 6579 1825
1264 1825 -5855 -3437 3844 1943 -1060 2203 -1688 -3850 -1006 6417 2456 -5991 -677 243 1047
1279 1047 915 2359 124 -7123 1080 4817 1476 -2038 -2378 800 -2151 2431 4358 -2034 -4604
1294 -4604 -1045 4359 1160 -749 -36 -2305 -2085 2365 4640 -1243 -4271 -844 1947 1254 1031 761
1310 761 -3245 -2771 2224 4161 -244 -3168 -1035 -212 1183 2324 1253 -3076 -3386 1914 2982 1075
$$ packed form
1205A323P829q213j1445J4395l840p80J549N114q386q395J6507j60m879o309P475
1220A785j278o725J3348l343o149o551J1638M587j1811O841k919j299l056R513
1234D581M249j6578M810L283L015m316J530M622j3828O472O973L73p674l202R794
1249D104o906K890M843l598o260p80J2323l601n460K105J8k279J492P688m754
1264A825p680K418P281j901l003L263l891k162K844P423l961q447N314R20Q04
1279A047j32J444k235p247Q203L737l341l514l40L178k951M582J927o392k570
1294d604L559N404l199j909P13k269K20M450K275n883l028L427K791o93k23k70
1310G61m006M74M995J937m405k924K133Q23J395J141j071m329l10N300J068j907
$$ plain form
1326 1075 -1673 -1572 -1278 123 3653 1229 -2239 -3225 274 2702 1143 447 -1966 -2304 -120 3039
1342 3039 2213 -1700 -2552 -1086 1630 1732 1533 -1495 -2994 -304 1692 3229 -1021 -1838 -1721 -414
1358 -414 3234 788 284 -3224 -1570 2069 1386 2192 -2611 -1766 -656 1278 3222 -849 -1111 -2827
1374 -2827 511 2446 1430 -141 -3213 -454 191 2874 896 -1395 -1909 -1944 3359 835 1075 -2292
1390 -2292 -2233 1296 -28 4106 -2072 -1775 -1252 -105 4347 -1628 992 -3127 -1074 2495 635 2714
1406 2714 -4335 -412 -93 1296 2748 -1827 -16 -3687 1971 2204 710 -480 -3525 1488 -972
1421 -972 3453 188 -1976 -1132 -2053 4883 -1046 1108 -2066 -2250 2303 -774 4693 -3657 -1229 -243
1437 -243 -211 4344 -2761 1792 -3948 -45 2944 -129 2369 -5082 1483 -1014 1777 2551 -2795 641
$$ packed form
1326A075k748J01K94J401L530k424l468r86L499K428j559o96k413l38K184L159
1342C039q26l913q52J466K716J02j99l028j499K690J996J537m250q17J17J307
1358d14L648k446n04l508J654L639o83Q06m803Q45J110J934J944m071k62j716
1374b827L338J935j016j571l072K759O45K683j978k291n14l5N303k524K40l367
1390b292N9L529j324M134o178K97N23J147M452n975K620m119K053L569j860K079
1406B714p049L923L19J389J452m575J811l671N658K33j494j190l045N013k460
1421i72M425l265k164Q44r21O936n929K154l174j84M553l077N467q350K428R86
1437b43L2M555p105M553n740L903K989l073K498p451O565k497K791P74n346L436
$$ plain form
1453 641 -4176 4084 531 297 50 -4063 2804 -1918 4631 -1283 -2455 476 -2383 5351 -2426 1892
1469 1892 -2489 -2341 3622 -1291 4219 -4673 281 -293 -433 4553 -3272 1729 -4553 1971 2270 -1061
1485 -1061 2488 -5143 2388 -2000 3136 1734 -4015 1703 -3851 4714 -1037 879 168 -4829 3884
1500 3884 -1663 4413 -2889 -1483 1293 -2874 5319 -2458 1969 -3821 -650 4111 -2336 3760 -4701
1515 -4701 1687 -1750 634 4853 -4766 2020 -4233 3588 520 -1315 3487 -6067 2707 -1457 3691
1530 3691 120 -4372 3179 -3609 3728 -767 1419 -1267 -4177 4687 -1237 2695 -3220 610 -216
1545 -216 -2277 5608 -2664 1238 -4523 2186 2742 -3426 4632 -4790 1642 -2229 2262 4187 -6671
1560 -6671 3260 -2971 2636 -91 -479 3205 -6802 3005 527 2224 -1552 -2266 2873 -3672 3205
$$ packed form
1453F41m817Q260l553k34k47m113O867m722O549n914j172K931k859P734p777M318
1469A892m381J48N963m913N510q892M954n74j40M986p825N001o282O524K99l331
1485a061L549p631P531m388N136j402n749N718n554Q565n751J916p11m997Q713
1500C884n547O076p302J406K776m167Q193p777M427n790L171M761o447O096q461
1515d701O388l437K384M219r619O786o253P821l068j835M802r554Q774m164N148
1530C691l571m492P551o788P337m495K186k686k910Q864n924L932n915L830q26
1545b16k061P885q272L902n761O709N56o168Q058r422O432l871M491J925j0858
1560f671R931o231N607k727l88L684j0007R807k478J697l776p14N139o545O877
$$ plain form
1575 3205 159 1337 -3736 -1339 4931 -2658 2482 -2894 1748 -2098 -1111 6791 -4810 847 -2780
1590 -2780 2587 1401 -3535 5539 -4887 -164 322 2520 1528 -5571 3367 -1522 454 434 1769 -477
1606 -477 -5074 3949 447 1189 -2895 1025 913 -4389 5499 -906 191 -3668 468 4999 -5091
1621 -5091 3679 -1376 -936 -880 167 5759 -5553 -58 823 434 -53 -357 3200 -4491 -449 2040
1637 2040 2674 -2377 -1963 3230 -3138 1473 604 2092 -2832 -3599 6134 -2074 391 -691 267 -37
1653 -37 -3466 6207 -1183 -2822 -392 1316 1719 -3020 3051 -703 -2625 -172 3359 1152 -4602 1820
1669 1820 -41 228 -751 1863 1453 -6135 2950 1707 143 -1318 -1278 3226 -4297 1964 3037 -2033
1685 -2033 -1884 -831 3959 -1527 -1068 1852 -946 -2312 1270 3546 -2156 -1934 118 2415 -1551 -466
$$ packed form
1575C205l046J178n073K397O270p589N140n376M642l846R87P902j1601N657l627
1590b780N367j186m936R074j0426M723M86K198r92p099Q938m889J976k0J335k246
1606d77m597R023l502P42m084L920j12n302R888o405J097l859M136M531j0090
1621e091Q770n055M40N6J047N592j1312N495Q81l89m87l04L557p691M042K489
1637B040O34n051M14N193o368M611q69J488m924p67R733q208K465j082R58l04
1653c7l429R673p390j639K430J708M03m739O071l754j922K453L531k207n754O422
1669A820j861K69r79K614m10p588R085j243j564j461M0M504p523O261J073n070
1685b033J49J053M790n486M59K920k798j366L582K276n702K22K052K297l966J085
$$ plain form
1701 -466 3619 -3816 -707 946 2624 -243 -4238 3927 -1722 -924 2329 192 -133 -4317 3301 2001
1717 2001 -2656 764 20 -306 -1725 2258 2166 -2980 -1695 2095 1041 -1765 1281 264 -1570 -1336
1733 -1336 2341 2427 -3876 158 1038 -347 2 343 1949 -3658 -532 3176 -19 -1116 -905 1442
1749 1442 -1335 -374 2603 -46 -2611 -696 2834 -386 -775 466 12 -1278 -645 3666 -952 -2299
1765 -2299 442 673 754 -1370 1885 -494 -2786 1591 1573 234 -2098 109 1123 -1330 847 1463
1781 1463 -1048 -2110 818 1896 -323 -1163 466 62 -1566 1695 1234 -1156 -1573 130 2122 -1167
1797 -1167 262 677 -1528 -317 685 2074 -1360 -1553 1093 -67 122 406 623 -1351 -1199 1632
1813 1632 1089 -825 -880 476 -463 25 1135 383 -1318 -1306 1654 476 -349 -25 -423 -266 -544 1811
$$ packed form
1701d66M085p435L109J653J678k867l995Q165n649P98L253k137l25m184P618j300
1717B001m657L420p44l26j419L983r2n146J285L790j054k806L046j017j834K34
1733a336L677Q6o303M034Q80j385L49L41J606n607L126L708l195j097K11K347
1749A442k777R61K977k649k565J915L530l220l89J241m54j290O33M311m618j347
1765b299K741K31Q1k124L255k379k292M377j8j339k332K207J014k453K177O16
1781A463k511j062K928J078k219q40J629m04j628L261m61k390m17J703J992l289
1797a167J429M15k205J211J002J389l434j93K646j160J89K84K17j974J52K831
1813A632n43j914n5J356r39M88J110p52j701J2K960j178q25L24l98J57k78K355
$$ plain form
1831 1811 329 -1578 -366 288 882 -298 390 -153 -1352 260 1203 576 -1102 -493 191 170 312 646
1849 646 -265 -1489 345 807 674 -566 -615 228 -818 1145 489 -357 -794 -756 1479 -156 264 -195
1867 -195 -943 136 72 1317 -401 -946 -137 85 701 191 69 -852 -400 335 970 76 -805 -117 -566
1886 -566 942 236 158 -339 -1263 1043 5 805 -306 -1027 406 -526 1390 -115 -476 -347 -664 1149
1904 1149 71 324 -748 -526 230 346 748 -580 -220 -876 710 567 -13 78 -1349 739 -314 935
1922 935 309 -1282 408 -917 1515 -63 -374 193 -1383 1180 -57 754 -433 -1105 653 -220 985
1939 985 -293 -188 -615 -243 1007 114 156 -1153 321 -157 482 686 -889 153 -1224 1397 224
1956 224 -358 373 -1510 1149 -606 1106 117 -1566 857 -861 1554 -439 -216 175 -1400 1500
$$ packed form
1831A811j482j907J212O54N94j180O88n43j199J612R43o27j678O09O84k1J42L34
1849F46r11j224J834M62j33j240m9Q43j046J963o56q46m37L8K235j635M20m59
1867a95p48J079o4J245j718n45Q09K22O16n10j22r21M52P35O35q94q81O88m49
1886e66J508p06p8m97r24K306j038Q00j111p21J433r32J916j505l61J29l17J813
1904A149j078K53j072K22P56J16M02j328L60o56J586j43n80R1j427K088j053J249
1922I35o26j591J690j325K432j578l11N67j576K563j237Q11j187o72J758q73J205
1939I85j278J05m27L72J250q93M2j309J474m78O39K04j575J042j377K621j173
1956B24n82P31j883K659j755J712r89j683K423j718K415j993K23L91j575K900
$$ plain form
1972 1500 -226 689 -793 -681 769 -422 1113 -538 -107 -759 168 1021 -316 184 -1084 519 -318
1989 -318 712 520 -1137 284 -980 1527 -312 -117 297 -1560 1375 -627 1220 -509 -1201 1100
2005 1100 -1101 1657 -639 -85 -130 -1103 1786 -664 582 -745 -416 590 -324 1242 -906 -131 -509
2022 -509 509 607 -409 445 -1242 585 -183 879 86 -1262 780 -988 1328 -278 -45 33 -1471
2039 -1471 1640 -561 713 -560 -673 708 -886 1656 -732 -187 -426 -168 1278 -923 916 -1009
2055 -1009 -116 258 130 1126 -1605 534 -398 303 584 -454 610 -1558 724 455 153 -61 -787 624
2073 624 -804 974 140 -187 -616 -468 1451 -863 706 -596 -218 100 -473 1966 -1554 69 -88
2090 -88 -95 991 -1088 1360 -1287 -416 1004 -23 533 -1346 688 -182 -186 759 30 -376 -1045 1130 137
$$ packed form
1972A500j726R15j482J12J450j191J535j651M31o52R27Q53j337N00j268J603q37
1989c18J030j92j657J421j264K507j839J95M14j857K935k002J847j729o92K301
2005A100k201K758k296N54m5r73K889k450J246j327L29J006r14J566k148P75l78
2022e09J018R8j016Q54j687J827p68J062p93j348K042j768K316j606K33P8j504
2039a471L111k201J274j273j13J381j594K542k388N45k39K58J446k201J839j925
2055a009Q93L74j28R96k731K139r32P01K81j038J064k168K282k69l02k14p26J411
2073F24j428J778q34l27m29J48J919k314J569j302L78L18n73K439l520J623j57
2090h8pJ086k079K448k647Q71J420j027N56j879K034q70mR45p29m06o69K175r93
$$ plain form
2109 137 15 -355 -21 161 -1043 1729 -331 -561 -304 -121 1362 -1381 1017 -185 -1030 535 53
2126 53 1246 -1494 -77 624 -502 395 65 516 -1392 131 959 90 -411 -526 967 -1171 574
2143 574 769 -381 -426 -940 1872 -674 -320 698 -766 115 -524 1552 -307 -1349 697 138 99 -352
2161 -352 774 -422 -960 505 953 -134 -1251 935 -259 -243 410 302 170 -1879 1331 602 -788
2178 -788 293 -446 661 -1209 798 1170 -1493 -91 98 855 -605 -121 859 -996 -340 711 928
2195 928 -1088 -429 695 -76 -164 68 973 -1353 -389 1226 54 -267 -764 979 -510 -546 1320 -189
2213 -189 -675 -655 1195 218 -872 547 31 -451 -431 1349 16 -1202 168 441 300 -838 903 39
2231 39 -1260 582 561 463 -1275 215 814 -984 522 407 24 -1090 41 1370 -609 -361 225 174
$$ packed form
2109A37j22l70L34J82j204K772k060k30K57J83J483k743K398j202q45J565m82
2126E3J193k740J417P01j126Q97l30M51j908J523Q28q69n01j15J493k138J745
2143E74J95j150m5n14K812k546L54J018j464Q81o39K076j859j042K046n59l9m51
2161c52J126j196n38J465M48j087j117K186j194J6O53j08j32k049L210p29j390
2178g88J081p39J107j870K007L72k663J402J89P57j460M84R80j855O56J051K17
2195I28k016O59J124p71q8K32R05k326R64J615j172l21m97J743j489l6J866j509
2213a89m86K0J850r77j090J419n16m82K0J780j333j218J370K73j41j138J741q64
2231C9j299J842k1r8j738J490N99j798J506j15l83j114J131J329j979K48N86n1
$$ plain form
2249 174 -652 194 1064 -568 -826 175 972 -595 -162 642 -512 -395 131 1239 -710 -873 792 -88
2267 -88 -6 -157 765 -493 -993 1083 359 -289 -612 498 70 -660 816 261 -547 -749 778 508 -728
2286 -728 194 76 -141 -543 794 560 -1097 -70 298 385 -490 177 467 -989 57 615 382 -720
2304 -720 -326 668 -354 -4 403 141 -783 -163 881 19 -376 -106 414 -491 66 749 -235 -471 -343
2323 -343 922 -158 -354 486 -447 -85 -152 833 -21 -950 492 -19 102 -84 200 14 -872 482 508
2342 508 -160 -378 -1 178 -229 223 348 -236 -690 420 360 -118 -68 -180 213 -502 510 442 -592 -61
2362 -61 -171 596 -182 -61 334 -636 95 189 430 -257 -453 295 -92 126 96 129 -457 -210 415 130 16
2383 16 -404 195 -201 32 469 -195 -113 -455 421 206 -194 172 -350 54 -75 401 113 -437 -12 -53 330
$$ packed form
2249A74q26Q46Q70j632k58J001P97j567M33Q04j154J17N26J108j949j63J665q80
2267h8Q2j51R22j258n00K076p24o48l23J110m28p30J476n55q08k02J527k70j236
2286g28R22j18k17m02J337k34j657J027L68Q7q75O67K90j456J046N58k33j102
2304g20L94R94j022L50M07k62r24O20J044q62l95K70N20r05N57O83r84k36J28
2323c43J265j080j96Q40r33L62o7R85q54r29J442n11J21j86K84j86q86J354K6
2342E08o68k18L77J79m07M52J25n84m54J110o0m78N0j12L93p15J012o8j034N31
2362f1j10P67p78J21L95r70P31R4K41o87j96P48l87K18l0L3n86K47O25k85j14
2383A6m20N99l96K33M37o64Q2l42Q76k15m00L66n22M04j29M76k88n50M25m1L83
$$ plain form
2404 330 -55 142 -154 -302 212 121 337 -412 -72 -12 -49 398 -174 117 -459 62 325 -57 198 -456 92
2425 92 -106 212 252 -301 7 -333 342 74 50 -30 -400 258 -99 406 -132 -220 21 -216 519 -146 84 -223
2447 -223 -172 310 -59 343 -335 -100 -27 127 321 -243 69 -328 144 114 136 56 -513 205 -119 326 -23 -190
2469 -190 77 -456 506 -29 67 -140 -345 427 -281 431 -148 -233 29 -136 581 -288 23 -149 -120 246 -42
2490 -42 345 -407 -57 26 197 149 -233 141 -383 247 95 156 -77 -482 384 -226 360 -69 -150 48 -449 659
2512 659 -187 -1 -111 -284 395 -270 464 -224 -250 66 -45 439 -310 107 -202 -35 211 50 184 -498
2532 -498 159 -32 199 120 -227 173 -494 451 24 12 -8 -461 443 -311 381 -44 -319 127 -290 588 -243
2553 -243 24 -59 -257 323 -121 335 -373 -95 56 -2 293 -228 141 -378 167 195 -22 112 -430 300 -212
$$ packed form
2404C30l85J97k96j48N14r1K16p49L40O0l7M47n72K91n76N21K63l82K55o54N48
2425I2j98L18M0n53L08l40O75k68k4q0l70O58l57N05n38q8K41k37P35o65K30l07
2447b23N1M82l69M02o78K35P3J54J94n64L12l97M72l0K2q0n69P18l24M45l49j67
2469a90K67n33R62n35R6k07k05P72p08P12n79q5K62j65P17q69L11j72K9L66k88
2490d2L87p52L50Q3J71m8l82L74n24O30j52O1k33m05Q66o10N86m29q1J98m97J108
2512F59q46J86j10j73O79o65P34o88k6L16j11M84p49M17l09J67K46j61J34o82
2532d98O57j91K31p9l47M00o67R45m27j2k0m53R04p54O92m25k75M46m17Q78q31
2553b43K67q3j98N80m44M56p08K78J51n8K95n21L69n19N45K8k17J34n42P30n12
$$ plain form
2574 -212 281 132 -313 129 -413 565 -151 -5 91 -462 407 -221 420 -183 -356 282 -295 424 -202 77
2594 77 -139 -279 435 -115 146 -313 61 16 -34 324 -219 15 -342 363 84 -146 170 -356 236 -232 431
2615 431 26 -437 251 -223 425 -230 134 39 -499 423 -72 292 -347 -77 267 -335 421 -154 104 -361
2635 -361 -29 524 -339 175 -246 91 -107 -10 488 -468 -59 -66 279 -24 -157 277 -348 5 45 418 -265
2656 -265 -288 269 -160 227 -203 384 -293 -402 630 -206 217 -423 195 147 -502 696 -238 -104 -224 104
2676 104 457 -538 264 -44 -186 -49 226 256 -494 -9 136 156 -248 211 110 -487 203 95 340 -473 -56
2697 -56 460 -479 337 3 153 -320 -254 750 -359 -18 -4 66 -111 -188 592 -267 -272 -33 361 -70 -294 419
2719 419 -296 -86 -53 433 -23 -640 492 -115 20 -32 137 100 -665 469 212 -195 -185 60 187 -366 255
$$ packed form
2574b12M93j49m45M42n42R78p16J46R6n53Q69o28O41o03j73O38n77P19o26K79
2594G7k16j40P14n50K61m59L74m5n0L58n43K34l57P05k79k30L16n26N92m68O63
2615D31m05m63O88m74O48o55L64r5n38R22m95L64o39K70L44o02P56n75K58m65
2635c61L32N53q63N14m21L37j98R7M98r56M09pL45l03j33M34o25L53M0L73o83
2656b65k3N57m29L87m30N87o77j09J032q36M23o40O18m8o49J198r34J34j20L28
2676A04L53r95Q02l08j42J37K75L0p50M85J45K0m04M59j01n97O90j08K45q13M17
2697e6N16r39Q16l34J50m73O6J004j109L41J4P0j77p7P80q59nK39L94m31k24P13
2719D19p15K10L3M86m56o17J132o07J35n2J69l7p65J134k57m07J0K45J27n53O21
$$ plain form
2740 255 236 -172 -407 316 299 -339 122 -46 138 -401 257 507 -680 127 -34 251 -136 -220 612 -662
2760 -662 41 280 83 -69 -454 518 -171 -191 314 20 -239 -261 448 68 -276 -56 244 -171 -178 486 -94
2781 -94 -210 -229 409 85 -416 381 -159 -107 -96 321 214 -633 284 85 -19 -81 109 213 -589 244 233 -18
2803 -18 -243 -53 349 -412 198 200 -85 -265 -81 538 -302 -70 140 -68 -111 -48 450 -249 -266 153 187 -74
2825 -74 -101 248 -190 -161 101 352 -201 -290 317 -126 60 -71 233 -85 -449 525 -71 0 -128 -5 217 -449
2847 -449 441 13 -263 -45 -1 362 -332 84 117 -261 29 102 214 -263 -119 197 32 -116 104 66 -265
2868 -265 58 119 205 -271 -59 258 -258 187 -26 105 -147 -233 496 -239 63 -37 -58 114 -245 428 -153
2889 -153 -194 53 -12 197 -230 137 -55 -196 93 109 30 -229 61 20 25 -27 86 -14 -255 215 20 105 -145
$$ packed form
2740B55j9m08k35P23j7o38M61j68J84n39O58K50j187Q07j61K85l87q4Q32j274
2760f62P03K39j97j52l85R72o89k0N05k94k59k2P09l80l44K20L00m15pO64n80
2781i4j16j9O38l24n01P97n40N2J1M17j07q47R17j99j04o2J90J04q02Q33j1k51
2803a8k25J90M02p61O10Kk85j80J84O19q40K32K10k08m3O3M98o99j7M19L4k61
2825g4k7L49m38K9K62K51n53q9O07m43J86j31L04l18l64R74n96P1j28J23K22o66
2847d49Q90m28k76K18M4L63o94M16L3l78K90P3J12m77J44L16j65j48K20l8l31
2868b65L23O1Q6m76K12L17n16M45k13J31k52q6P29p35L02j00k1J72l59O73n81
2889a53m1K47o5K09m27L67j92j41K89J6p9k59K90m1Nn2J13j00k41M70j95Q5k50
$$ plain form
2912 -145 -44 155 -228 276 -47 -21 -80 -75 334 -207 123 -79 -77 64 -71 282 -236 -28 22 5 133 -123 127
2935 127 -168 -1 89 45 15 -173 78 -85 115 -4 4 -28 -157 233 -82 142 -105 -68 107 -154 302 -178
2957 -178 35 -52 -80 279 -178 150 -160 -7 106 -93 195 -190 22 -45 53 129 -104 47 -156 109 -23 79
2979 79 10 -156 86 -91 186 -109 -11 9 -155 207 -101 159 -140 -80 139 -108 211 -180 83 -88 -22 234
3001 234 -137 115 -213 112 25 -39 184 -230 98 -121 150 78 -166 125 -185 142 -52 65 15 -216 109
3022 109 -41 141 -94 0 -13 -112 147 -40 99 -218 75 41 -65 169 -215 152 -215 102 182 -209 157 -246
3044 -246 187 -32 -16 213 -299 144 -111 152 35 -170 166 -211 130 -2 78 -44 -147 147 -79 113 -110
3065 -110 50 -82 -62 185 -104 102 -230 107 8 -59 182 -233 131 -177 147 89 -175 172 -217 173 -66
$$ packed form
2912a45J01J99l83N04l23K6n9NM09n41L30k02KJ41j35L53n18K08N0j7J28k56K50
2935A27k95J67R0m4l0j88K51j63K00j19Ql2j29L90l15K24k47L7J75k61M56m80
2957a78K13q7k8L59m57L28l10J53J13j99K88l85K12o7R8P6k33J51k03K65j32J02
2979G9o9j66K42j77K77k95R8K0j64L62l08K60k99O0K19k47L19l91K63j71O6K56
3001B34l71K52l28L25q7o4K23m14L28k19K71p2k44K91l10L27j94J17n0k31L25
3022A09j50J82k35R4j3r9K59j87J39l17K93l4j06K34l84L67l67L17Q0l91L66m03
3044b46M33k19J6K29n12M43k55K63j17k05L36l77L41j32Q0j22j03K94k26J92k23
3065a10J60j32K0K47k89K06l32L37r9o7K41m15L64l08L24n8k64L47l89L90k39
$$ plain form
3086 -66 61 88 -238 175 -132 188 -70 -26 68 -192 243 -98 131 -94 -61 158 -154 225 -146 46 -46 -36
3108 -36 212 -178 115 -153 39 42 -28 130 -200 67 -79 89 -1 -44 55 -192 206 -71 134 -86 -101 171 -197
3131 -197 287 -172 30 -8 -172 329 -244 161 -100 -108 177 -166 251 -201 -24 54 -51 134 -114 70 -105
3152 -105 6 43 58 -40 -117 100 -133 148 -78 46 -6 -224 320 -185 113 -47 -109 189 -257 329 -124 -81
3174 -81 69 -102 219 -194 102 -43 -112 75 23 110 -198 91 -17 45 -7 -23 89 -291 203 -21 -6 -14 -169
3197 -169 230 -253 144 70 -142 28 -116 238 -126 -32 65 -77 -6 -2 176 -161 -22 -20 95 -5 -105 248 -260
3220 -260 66 35 31 93 -325 302 -137 -29 162 -121 108 -280 215 68 -179 107 -94 37 -115 92 74 -139
3242 -139 -55 100 57 -177 119 -63 -43 -65 51 210 -335 134 18 -13 78 -94 239 -333 49 175 -97 18
$$ packed form
3086f6J27K7l26M13l07L20k58M4R4k60M35l41K29k25L3K19l12L79l71J92r2J0
3108c6K48l90K93k68J92Lp0J58l30K67j46J68r0m3R9k47L98k77K05k20j5K72l68
3131a97M84m59K02l8j64N01n73M05k61qK85l43M17m52J77P8j05J85k48J84j75
3152a05J11L7J5r8p7K17k33K81k26J24n2k18N44n05K98j60o2K98m46N86m53M3
3174h1J50j71L21m13K96j45o9J87n2Q7l08K89j08O2n2j6J12l80M94k24J5qj55
3197a69L99m83L97p4k12J70j44L54l64R4R7j42P1MJ78l37J39KJ15j00j00L53n08
3220b60L26l1mO2m18O27m39J08J91k83K29l88M95j47k47K86k01J31j52K07j8k13
3242a39Q4J55m3k34K96j82K0k2J16J59n45M69j16l1R1j72L33n72L82J26k72J15
$$ plain form
3264 18 -165 191 -144 -36 164 -73 -67 -96 227 -93 -59 65 -44 -12 -125 269 -130 -125 81 -20 68 -190 172
3287 172 -56 -201 151 27 27 -183 76 47 -97 49 80 -16 -203 165 52 -10 -63 15 141 -263 231 23 -111
3310 -111 24 -96 308 -245 51 133 -212 90 -97 208 -141 -171 232 -113 3 -6 53 -81 -132 129 65 -130
3332 -130 -47 134 -112 17 31 49 -38 -197 298 -117 -30 59 -86 129 -231 244 -7 -211 141 -62 127 -136
3354 -136 69 83 -220 90 56 41 -155 7 89 -84 3 43 29 -201 60 82 -49 -47 -86 157 -170 65 92 -109
3378 -109 -30 -84 201 -115 -51 112 -106 31 -58 172 -94 -99 92 -39 63 -110 147 -62 -89 131 -14 59 -155
3401 -155 97 1 -98 105 -57 21 -139 85 50 -92 22 -60 43 -111 89 20 -89 -1 -55 157 -138 85 1
3424 1 -98 87 -83 175 -153 2 102 -90 121 -92 88 -82 -50 151 -45 59 -76 47 -16 -6 72 -35
$$ packed form
3264A8j83L56l35J08K00k37Ok9L23l20L4J24j09L2j13L94l99NK06j01Q8k58L62
3287A72k28j45L52j24%k10K59k9j44J46L1r6j87L68j13o2n3P8J26m04M94k08j34
3310a11J35j20M04n53K96Q2l45L02j87L05l49l0M03l45J16rN9j34n1K61o4j95
3332a30Q3J81k46J29J4J8q7j59M95m15Q7Q9j45K15l60M75k51k04L52k03J89k63
3354a36K05J4l03L10l4j5j96J62Q2j73Q7M0j4k30K61K2j31Kl9K43l27K35K7k01
3378a09P9n4K85l16O4J63k18J37q9K30k66nJ91j31J02j73K57k09k7K20j45P3k14
3401a55K52r6r9K03j62P8j60K24l5j42J14q2J03j54K00o9j09Q8n4K12k95K23q4
3424Ar9J85j70K58l28J55J00j92K11k13J80j70L2K01j96J04j35J23o3J0P8j07
$$ plain form
3446 -35 -30 -84 100 -59 10 10 -68 75 -119 156 -78 -44 56 -102 160 -143 90 -25 -94 130 -109 106 -125
3469 -125 11 36 -51 121 -73 63 -89 32 60 -20 50 -93 69 -71 79 -3 -43 36 -99 114 -57 26 -24
3492 -24 -89 76 -97 127 -92 -9 12 -94 129 -124 90 -58 -6 87 -81 119 -144 46 -15 -6 88 -102 96
3515 96 -103 69 28 -9 56 -105 93 -44 75 -35 -20 21 -92 139 -76 50 -63 -31 93 -107 139 -120
3537 -120 32 -19 -36 141 -156 89 -96 3 48 -68 98 -131 62 -12 22 30 -64 87 -101 79 -10 47 -22 -62
3561 -62 129 -83 103 -47 18 6 -91 179 -129 59 -48 -15 79 -112 135 -119 20 -22 -19 96 -135 77 -88
3584 -88 23 14 -20 38 -122 81 -45 57 -7 -39 46 -97 135 -51 51 -48 -40 111 -115 134 -84 21 -3 -44
3608 -44 146 -115 92 -66 23 48 -66 132 -147 49 -12 20 65 -118 74 -97 50 -17 -26 21 -98 96 -72
$$ packed form
3446c5Nn4J84j59O9%p8J43j94K75k34L4J00j58K62l03K33j15o9K24k39K15k31
3469a25J36K5q7J72j94J36j52J21K8q0P0j43J62j40J50q2m0P9j35K13j71Q3n0
3492b4o5J65j73K24k19Q3K1j06K23k53K14j48N2R3j68K00k63J90o1RR4j90J98
3515I6j99J72m1l7O5j61J98j37J19j10J5M1j13K31k15J26j13L2J24k00K46k59
3537a20J52n1j7J77k97K45j85R9M5j16J66k29J93p4L4Qr4J51j88J80q9N7o9m0
3561f2J91k12J86j50O5j2r7K70l08J88j07L3R4j91K47k54J39m2LJ15k31K12j65
3584h8J11rl4N8j60K03j26J02o4l2Q5j43K32j86J02r9QJ51k26K49k18J05k4m1
3608d4J90k61K07j58Q9K5j14J98k79J96o1L2M5j83J92j71J47o7rM7j19J94j68
$$ plain form
3631 -72 57 -43 -37 16 -85 127 -86 58 -48 -22 84 -80 126 -100 28 -14 -12 95 -121 79 -89 35 40
3654 40 -56 89 -126 92 -68 33 42 -78 88 -121 94 -41 -41 27 -101 79 -86 69 -17 -41 31 -73 78
3677 78 -72 61 -57 -16 50 -37 84 -109 61 -20 -13 68 -78 94 -110 73 21 -64 80 -127 95 -80 27
3700 27 33 -89 63 -96 81 -39 -4 22 -92 44 -42 74 -77 -15 34 -49 50 -71 68 -71 -13 60 -54 42
3724 42 -99 55 -41 -21 104 -75 38 -89 90 3 -49 62 -77 38 -52 74 -14 -87 59 -47 66 -87 26
3747 26 -2 -103 89 -42 61 -97 22 39 -94 71 -67 38 -92 4 85 -75 34 -43 55 -46 0 80 -87
3770 -87 19 -45 82 -32 -33 67 -73 43 -21 80 -38 -61 89 -61 44 -45 45 -25 -66 116 -53 34 -86 47
3794 47 -10 -92 71 -55 -8 -88 54 48 -105 70 -51 31 -44 55 72 -119 59 -15 46 -56 -1 47 -106 39 13
$$ packed form
3631g2J29j00ON3j01K12k13J44j06K6J06j64K06k26J28m2KJ07k16K00j68J24N
3654D0r6J45k15K18j60J01Rj20J66k09K15j35%O8j28J80j65J55q6k4P2j04J51
3677G8j50J33j18M1O6q7J21j93J70q1PQ1j46J72k04J83n2q5J44k07K22j75J07
3700B7Oj22J52j59J77j20L5K6j14J36q6J16j51O2M9q3R9j21J39j39N8P3j14R6
3724D2j41J54r6K0J25j79J13j27J79q7n2J11j39J15r0J26q8p3J46j06J13j53J13
3747B6k8j01J92j31J03j58J19J7j33J65j38J05j30R6Q1j60J09p7R8j01M6Q0j67
3770h7J06o4J27j14jJ00j40J16o4J01j18k3J50j50J05q9R0p0m1J82j69Q7j20J33
3794D7n7q2J63j26M7q0J42oj53J75j21Q2p5R9J7j91J78p4O1j02N5M8j53J45k6
$$ plain form
3819 13 49 -55 -1 72 -71 36 -23 47 -67 -19 96 -86 32 -54 52 -46 -57 104 -100 21 -57 59 -2 -92
3843 -92 88 -81 -2 -31 41 10 -92 71 -23 12 -39 41 15 -88 81 -5 27 -76 42 33 -79 81 -33 25 -68
3868 -68 42 76 -100 55 -43 28 -33 0 85 -107 34 -26 45 -32 -34 68 -99 33 -31 38 -44 -63 94 -63 23 -26
3894 -26 46 -29 -67 98 -52 10 -56 35 14 -52 80 -32 20 -40 57 19 -76 72 -56 31 -43 57 12 -114 67 -42
3920 -42 49 -33 5 23 -122 80 -43 41 -56 -42 62 -83 55 -27 23 -38 5 78 -55 44 -48 34 -10 -5 80 -77 40
3947 40 -41 75 -3 -37 82 -67 51 -43 46 -3 -70 69 -71 62 -56 32 -17 -56 75 -50 55 -65 -2 24
3971 24 -71 55 -64 24 -58 13 37 -56 46 -47 43 -34 15 43 -59 58 -51 68 -29 2 28 -59 79 -52 70
3996 70 -38 -24 56 -68 76 -75 23 -11 -31 56 -70 47 -58 24 3 -50 48 -73 32 -35 19 14 -14 14 -66 71
$$ packed form
3819A3L6j04N4P3j43J07n9P0j14M8J15j82J18q6J06r8j1J61k04J21p8J16o1r0
3843i2J80j69P9k9P2l1j02J63r4L5n1Q0k6j03J69q6L2j03J18rj12J60j14N8r3
3868f8J10L4j76J55r8P1o1L3Q5j92J41o0P1p7kJ02j67J32o4O9q2j9J57j57Q6m9
3894b6P2p5l8J65j50O2o6R1k1o6J32j12N2o0R7l8r5J48j28Q7p4J00m5j26J81j09
3920d2R1q2L8J8j45K02j23Q4r7J4J04j45J38q2N0o1M3P3j33R9r2Q2m4NQ5j57J17
3947D0q1J16p8l4J19j49J18r4Q9m9o7J39j40J33j18Q8m9l9J31j25J05j20O3K6
3971B4r5J26j19Q8q2P1K4r3J02r3R0p7M9K8j02J17j09J19r7L1K6q7J38j31J22
3996G0j08J4Q0j24J44j51R8l4k0Q7j26J17j05Q2k1n3R8j21J05o7N4nk8K8q0J37
$$ plain form
4022 71 -45 53 -6 -53 47 -64 102 -59 20 17 -57 89 -60 81 -45 -1 28 -47 61 -71 42 -26 -11 35 -43
4047 -43 53 -74 31 -23 -10 22 -54 29 -68 48 -14 -17 6 -49 58 -67 76 -15 -31 32 -43 80 -66 35 -12 -24
4073 -24 43 -72 86 -71 24 8 -31 84 -81 82 -32 -6 42 -44 46 -68 39 -13 -36 18 -40 25 -59 28 -26 -17
4099 -17 -10 -47 34 -74 46 -46 -6 -9 -54 73 -71 74 -30 9 52 -52 95 -94 51 2 -1 40 -55 81 -64 15
4125 15 25 -57 30 -73 59 -36 1 20 -21 28 -48 42 -30 -6 -9 -19 10 -59 37 -48 -1 -11 -31 51 -55 47 -25 14 38
4154 38 -44 61 -81 50 -14 -15 39 -44 62 -48 42 16 -29 34 -40 49 -25 16 7 -29 21 -55 49 -56 3 7 -24 28
4182 28 -45 46 -44 0 3 -25 26 -53 32 -26 1 25 -34 34 -45 56 -18 1 28 -31 48 -44 49 -19 -5 22 -53 57 -49
4211 -49 35 -13 -36 38 -38 41 -33 -18 -3 -33 34 -34 15 -47 7 -3 -14 29 -42 34 -42 -2 10 -33 39 -38 34 -21 17 29
$$ packed form
4022G1j16R8n9m7J00j11J66j61P9lp4J46j49J41j26M4K9p5J08j32J13o8J5M6p8
4047d3R6j27J05n4J3L2p6Q3r7J16o2lK3n5J07j25J43r1j6O3p5J23j46J01m7j2
4073b4O7j15J58j57R5j6l9J15j65J63j14K6M8q6R0j14J07n2k3N4n8O5q4Q7n4R
4099a7Pl7Q1j08J20r2M0lm5J27j44J45j04L9M3j04J47j89J45m9lM1r5J36j45P9
4125A5J0q2Q7j03J32r5L7J9m1M9p6R0p2K4lj0K9o9R6q5M7j0k0Q2j06J02p2L9K4
4154C8q2J05j42J31o4jN4q3J06j10R0k6m5O3p4Q9p4M1rl6N0p6J04j05N9Ml1N2
4182B8p3R1r0M4Lk8N1p9Q5n8K7K4n9O8p9J01p4J9K7n9P9r2R3o8J4K7p5J10j06
4211d9Q4m8k3P4p6P9p4J5J5l0O7o8M9o2N4j0j1M3p1P6p6M0J2m3P2p7P2n5L8J2
$$ plain form
4241 29 -49 49 -57 53 -13 -21 24 -38 56 -26 25 -15 -14 34 -29 27 -22 14 -20 4 41 -52 36 -35 1 -14 -3 53 -60 32
4271 32 -29 6 7 -42 44 -55 35 4 4 6 -27 45 -23 27 -16 9 14 -26 56 -13 15 -3 -2 14 -19 66 -35 5 -13 9 19 -74
4303 -74 39 -50 -3 10 -21 22 -51 19 -28 -13 7 -26 -11 -47 29 -17 -14 -16 -22 32 -51 24 -18 12 -8 -7 54 -57 45 -11 12
4334 12 15 -38 71 -50 14 9 3 23 -60 33 -32 -8 7 -1 0 -47 32 -29 -2 1 -11 13 -48 60 -39 8 -24 -15 5 -68 56 -19
4366 -19 -14 -1 -6 29 -53 38 -15 1 11 -4 47 -52 33 0 3 -9 -12 47 -49 32 -16 3 -18 -24 38 -41 29 -8 -28 -14 -40 66
4398 66 -47 16 -18 -7 0 -32 44 -54 15 -5 31 27 -33 47 -41 22 -4 12 33 -47 52 -35 -1 10 -19 31 -51 45 -7 4 -23
4429 -23 -15 38 -39 34 -33 10 -32 -18 32 -40 13 -37 4 -3 -20 38 -79 22 -31 4 13 -31 58 -51 38 -10 22 1 -18 50
4459 50 -31 33 -3 11 9 -24 47 -28 14 -14 4 6 -36 48 -35 21 -10 7 4 -41 31 -42 7 -24 -4 21 -51 44 -30 31 -15 -9
$$ packed form
4241B9p8R8j06J10o6qM5o2R4q2N1m0JM8o3N6m9L6l4K4L7r3Q8p1L6j5J1N6j13R2
4271C2o1L5Jm9Q6r9R0l1%Kl3P2o8N0m3K5Nm0Q2o9K8j8JJ6l3Q5j01M0j8K2J0r3
4303g4J13q9M7J3l1M3p3P0m7J5K0l3J5l6P6m6LkoN4q3P5m2L0k0JO1j11J02n6K3
4334A2Ln3J09j21O4noK0q3R3o5K4J5qJm7P9o1K7Lj2K4o1J08r9M7l2RK0p3J24p5
4366a9NJ3nL5q2R1n3J6J0j5N1r9Q5l3Lj2lN9r6Q1m8J9k1oO2p9P0l7k0J4k6J06
4398F6j13O3l4J1Pl2P6r8O9k0L6mo0Q0q8O3k6J6K1q0R9q7L4J1k9N0q2R6n2J1k7
4429b3QN3p7P3o7M3m2J4N0p2N3n0M1pj7N8j17J01n3L5Rm4Q9j09Q9m8L2k1j9O8
4459E0q1O4l6J4kl3P1p5M2k8J8Km2Q4q3N6l1J7lm5P2p3M9l1K0K5p2R5p4O1m6O
$$ plain form
4491 -9 14 -54 29 -39 11 -3 -12 32 -29 52 -22 24 13 -1 34 -21 32 -17 22 -8 3 35 -39 34 -38 12 3 -32 16 -47 24 -31
4523 -31 10 21 -40 23 -49 29 -21 0 -5 -34 28 -36 16 7 3 4 -26 50 -33 20 -13 14 27 -37 42 -33 42 -18 12 33 -39 46
4555 46 -27 21 -7 -6 51 -51 29 -30 8 -20 -24 19 -29 25 -25 -6 -10 -24 23 -40 13 -37 -4 -5 9 21 -38 30 -17 30 24 -34
4587 -34 30 -25 41 -37 13 13 -30 55 -46 21 -7 -9 32 -36 23 -23 28 -15 -19 4 -30 21 -40 8 -10 -21 10 -24 31 -37 7
4618 7 -7 -10 11 -17 27 -46 21 0 -17 22 -27 31 -26 19 12 -29 19 -28 29 -30 12 3 -30 29 -24 33 -7 -3 22 -13 19 -23 9
4651 9 -22 -22 -11 -25 24 -40 11 -14 -9 -8 -22 17 -19 22 14 9 8 -9 24 -12 25 21 -9 29 -35 45 -19 8 -4 -14 26 -23 36 -26
4685 -26 15 13 -5 13 -10 16 -16 -11 7 -37 -1 -50 17 -8 -7 17 -15 21 -33 14 -10 -8 -2 -24 19 -18 14 -8 -20 17 -22 11 -13
4718 -13 18 16 -5 31 -1 22 -11 -7 8 -25 18 -24 11 -21 0 2 -16 -11 -34 -2 -27 -14 1 -28 17 -26 2 -16 -6 0 -26 19 -29
$$ packed form
4491iK3o8Q3o8N0j4rM4o1Q1p4M6j1j4L5n5N3m9L9l0J1L2p4P3p2N0rl5M8o3P1n5
4523c1M1J1o1O3p2P8n0K1nk9O2o4N2rmJl0P6q3N3l3K7J3o4P9p5P5o0L0K1p2Q5
4555D6p3M8k8JN7j02Q0n9L8k8mM3m8N4n0J9mj4M7o3N3n0L3jJ4J2n9O8m7M7on8
4587c4O4n5O6p8N0%m3Q5j01O7k8kM1o8N9m6N1m3mK3l4N1o1M8j8j1L1l4N5o8M4
4618Gj4lK1k8M4p3O7k1j7L9m9N8n7M5pm1M8m7N7n9M2rl3N9n3N7m0MK5l5L2m2L2
4651Il1%J1j4M9o4N1k5NJj4L9l6M1qnjj7L3l6L7ml0L8o4Q0o4K7j2j0M0m9N9o2
4685b6M1kj8J8k3K6l2NJ8m4L6m9O7k5JK4l2L6n4M7k4KOk2M3l7L2k2j2L7l9L3k4
4718a3L1kk1L6l2K3l3MJ5l3M3m2L5l2K1Kj8Nk3L2k5J3J5k9M5m3K8j8J0Ok6M5m8
$$ plain form
4751 -29 6 -15 -19 34 -33 22 -15 2 -3 -6 16 3 15 -23 -6 -2 -11 9 -28 21 -7 8 -2 -27 13 -30 19 -22 3 7 -44 31 -34
4784 -34 -1 -14 -26 12 -33 23 -32 6 -8 -4 8 -24 12 -25 16 14 2 36 -7 14 -5 -5 8 -9 23 -17 23 -32 3 0 -2 15 -35
4817 -35 33 1 4 -13 -22 15 -24 23 -15 -14 12 -30 16 -49 2 -20 -9 6 -29 43 -29 7 -1 -16 25 -13 39 -6 -7 22 -2 14 3
4850 3 32 -21 5 -1 -9 -5 -10 29 -16 21 -16 2 12 -25 29 -29 6 -13 -31 20 -48 24 -1 -7 15 -35 13 -22 14 -10 9 -1 -12
4883 -12 5 -17 46 5 6 -2 -4 28 -15 28 -14 -6 5 -1 41 -24 3 8 0 24 -12 25 -28 0 -6 -12 -12 -30 -2 -33 16 -11 17 8 -19 31
4919 31 -44 15 -15 -10 8 -21 35 -12 9 -17 4 24 -1 24 3 9 6 -4 16 4 29 -18 11 -10 8 29 -21 23 -23 3 0 -25
4951 -25 42 -48 7 -14 1 -4 -18 54 -28 13 -13 0 -11 -11 9 -19 6 -12 20 -3 -8 23 -32 39 -24 15 14 -24 39 -40 23 -6
4983 -6 1 9 -35 25 -16 18 -15 -17 4 -30 9 -26 14 -10 -11 7 -34 22 -30 -4 -13 -9 8 -31 17 -35 30 9 -6 16 -16 21 -34 13
$$ packed form
4751b9L5k1mN3o7N5l7J7nlK2j3J2l8J7MrK0l7M9k8J5j0k5M0m3M9m1K5Mn1P5o5
4784c4L3j3j2L8m5N6n5L8j4MJ2l2L6l7M1kj2L4m3K1j9%J3j7L2m0M0n5L5lkJ7n0
4817c5O8l2Lj7rL7l9M7l8JK6m2M6o5N1k2J1J5l5P2p2L6qj5M1l8N2m5jK9k4J6j1
4850CK9n3K6oqMnL9m5L7l7J8J0l7N4n8L5j9j8N1o8P2k5oK2n0M8l5L6k4J9j0j1
4883a2J7k2O3m1JqkL2m3M3m2QJ1oM2o5K7NqK4l6L7n3K8oo%j8K8l1M9k7K8rk7N0
4919C1p5N9l0NJ8k9N6m7K1k6K1K0k5K5k1Olj0K0j2K5m7K9k1J8K1n0M4m6K6lk5
4951b5O7r0N5k1J5nj4P2q2M1k6J3j1%K0k8K5j8L2k3nL1n5P1o3L9jl8O3p9O3k9
4983fPQm4O0m1L4l3kK1l4L9l5M0k4jJ8m1N6n2K6rMJ7l9M8n2O5k1j5K2l2L7n5M7
$$ plain form
5017 13 13 -16 41 -27 20 -21 -4 13 -11 40 -23 13 -11 -12 -9 -18 16 -37 12 -29 -8 -1 -19 15 -26 16 -10 -1 3 -25 -5 -20 19 -6
5051 -6 2 21 -26 33 -31 28 -11 9 15 -27 39 -34 18 5 -13 56 -36 32 -25 13 -10 -30 19 -10 18 -3 4 -2 -13 5 -30 9 -18
5084 -18 -3 10 -24 10 -34 17 -39 9 0 -22 28 -42 23 -9 17 6 -15 34 -5 32 13 -7 32 -38 26 -22 15 13 -9 1 -15
5115 -15 14 -13 9 -15 -5 22 -31 8 -28 11 -18 -14 18 -33 22 -31 -1 -15 -24 18 -10 8 -17 6 3 -20 19 -16 26 -27 -10 41
5147 41 -6 34 -9 31 0 -1 19 -25 27 -9 11 -7 -6 3 -39 3 -17 19 -23 -17 2 -18 4 5 3 -12 -26 3 -27 21 -19 -1 5 -10
5181 -10 20 -7 28 -24 6 12 -26 21 -21 5 3 17 30 -6 18 -13 16 -5 -8 21 -17 20 -15 2 -11 -10 8 -27 6 -7 1 -2 -21
5214 -21 8 -17 9 -4 -13 -13 -16 14 -26 5 -5 7 27 -15 37 -4 -3 6 -3 0 -1 24 2 15 -8 3 2 -6 23 -24 17 -25 -5 30 -13
5249 -13 23 -23 7 -12 -16 8 -19 13 -14 -10 -4 -25 -12 -8 5 0 18 5 -5 25 -12 35 1 19 2 -1 18 -19 14 -6 23 9 -18
$$ packed form
5017A3%k9N7o8M7m1J7J7k4N1o3L6k4jLrL4n3M9m1K1Pj8L4m1M2k6RMk8K0j5L9k5
5051fQJ9m7N9o4N9l9K0Om2O6p3N2j3j8O9r2O8n7L8k3k0M9k9K8k1Poj1J8l5L9k7
5084a8J5J3l4L4m4N1n6M8rk2N0p0O5l2K6j1k1M9l9L7j9k0L9p0O4m8L7kk2J0j6
5115a5K9k7K2k4J0K7n3L9l6L9k9ML2n1N5n3L0j4rM2k8J8k5K3lk3L9l5M2n3J7N1
5147D1m7M0m3M0l1jK0m4N2l6K0j8JRm2M2k0L6m2OJ9k0K2Jkj5j4K9l0M8m0J8Oj5
5181a0L0k7L5n2L0Ol8M7m2K6kJ4J3l6K4l1K9k1lK9l8L7l5J7j3JJ8l5L3j3Qlj9
5214b1K9k5K6j3r%lL0m0L1j0J2K0m2N2m1JRrLjK5k2J3k3J1jqK9m7M1m2K0L5m3
5249a3L6m6L0j9mK4k7L2k7MOk1J3MJ3nJ8j3j0L0l7M7l4J8j7lJ9l7L3k0K9j4k7
$$ plain form
5282 -18 39 2 21 -6 -17 14 -25 34 -6 -10 0 7 16 2 -2 -21 7 -11 -24 -7 -27 5 -26 1 2 -12 6 -24 10 -11 15 -1 -13
5315 -13 0 -15 22 -3 4 17 -13 18 -22 15 1 13 10 6 -2 -13 6 -18 -5 -11 -29 13 -26 -3 0 -9 5 -15 -4 -28 1 2 -15 4
5349 4 -7 10 -5 -6 2 0 11 -12 41 -23 3 -1 -20 22 -26 33 -25 17 8 -7 26 -12 0 -4 7 -4 -10 0 -18 10 -6 10 -3 -3 -16
5384 -16 -35 18 -20 -4 -18 2 11 -8 23 -10 -5 11 -15 32 -4 12 -4 -3 20 -4 12 -31 22 0 21 15 -14 7 -22 25 -5 7
5416 7 4 -28 -1 -25 15 -11 -35 -3 -26 9 -33 5 -25 -6 -2 -19 16 -23 11 -6 -3 2 -4 15 -11 8 13 7 27 -40 17 -3 23 -6
5450 -6 -17 27 -9 13 1 1 -12 -21 10 -28 12 -17 8 2 4 11 -29 3 -3 -11 4 -12 1 -30 4 0 -21 4 -16 18 -18 12 -3 1 19
5485 19 -4 33 -15 25 7 4 10 -10 25 -34 17 6 -11 28 -25 21 -24 15 -19 -7 13 -26 23 -12 8 -9 -6 4 -34 22 -12 4
5517 4 5 -15 26 -19 26 -20 7 0 2 24 -20 23 -9 5 -1 -16 18 -20 13 -1 1 0 -15 24 -30 13 3 -9 18 -27 2 -39 21 -12
$$ packed form
5282a8N7l7J9k7j1L1l9N9m0mJ0PRj4mj9K8j8j3J7k0L2l1K7Jj4J8l0L4k1K6j6j2
5315a3J3j5L7k5PJ3l0L1m0L7j4J2lmqj1J9k4J3oj8M2l9K3LrJ4k0J1k4K9Jj7J9
5349Dj1J7j5jQkJ1k3N3o4K6mj9M2m8N9n8M2rj5L3l8J2mJ1j1oJ0j8K8j6J6j3%j3
5384a6j9N3l8J6j4K0Rj9L1l3NJ6k6M7l6J6j6JK3k4J6m3N3k2K1ok9K1k9M7l0J2
5416Gll2K7k4M0k6k4L2k3L5m2L8l0J9Mj7L5l9L4j7LNoJ9k6J9NoK0o7N7k0K6k9
5450fj1M4l6K2j2%j3rL1l8M0k9K5oKPm0L2oqJ5j6J3l1L4mk1K5k0L4l6L0j5MJ8
5485A9k3L7m8M0j8lOk0L5n9N1j1j7L9n3M6m5L9l4J2K0l9M9l5K0j7LJ0l8N6l4J6
5517DJk0M1m5M5m6K7pKK2m4M3l2J4oj5L4l8L3j4Kjj5L9n4M3j0j2K7m5K9m1O0l3
$$ plain form
5551 -12 -18 -4 -34 2 -30 1 -15 -14 3 -40 21 -41 13 -12 -15 14 -30 28 -15 -1 12 -20 35 -21 16 8 6 1 -19 41 -27 26 -7
$$ packed form
5551a2oJ4l0L6l2L1j6JJ7m3O1o2N4k5lK9m4N8m3J4J3l2N5n6L7qknk0O0o8N3l3
$$ [...]
8191A6
##END NTUPLES=NMR FID
##END=
