##TITLE=1H_ES-ZN-tBu
 
 8 sc, 
 22.11.2022
##JCAMPDX= 6.0         $$ Bruker NMR JCAMP-DX V2.0
##DATA TYPE= NMR FID
##DATA CLASS= NTUPLES
##ORIGIN= UXNMR, Bruker Analytische Messtechnik GmbH
##OWNER= root
$$ XWIN-NMR		Version 3.5
$$ Tue Nov 22 16:32:36 2022 Russian Standard Time (UT+4h)  she@DPX200
##.OBSERVE FREQUENCY= 200.1313499994
##.OBSERVE NUCLEUS= ^1H
##.DELAY= (6, 6)
##.ACQUISITION MODE= SIMULTANEOUS
##.ACQUISITION SCHEME= undefined
##.AVERAGES= 8
##.DIGITISER RES= 18
##SPECTROMETER/DATA SYSTEM= spect
##.PULSE SEQUENCE= zg30
##.SOLVENT NAME= CDCl3
##.SHIFT REFERENCE= (INTERNAL, CDCl3, 0, 15.7039)
##AUDIT TRAIL= $$ (NUMBER, WHEN, WHO, WHERE, WHAT)
$$ ##TITLE= Audit trail, XWIN-NMR		Version 3.5
$$ ##JCAMPDX= 5.01
$$ ##ORIGIN= Bruker BioSpin GmbH
$$ ##OWNER= she
$$ F:/spectra/data/she/nmr/H-F/1/audita.txt
$$ ##AUDIT TRAIL=  $$ (NUMBER, WHEN, WHO, WHERE, WHAT)
(   1,<2022-11-22 16:31:37.85 +0400>,<she>,<DPX200>,
      <created by zg, POWCHK disabled, PULCHK disabled
       configuration hash MD5:
       00 E9 B6 7A A2 85 ED C7 34 08 36 98 17 FE 4E 26
       data hash MD5: 16K
       A1 0E B0 84 97 B2 68 C8 C3 E8 CD EB 4C 0F 9D 61>)
$$ ##END=
$$ 
$$ hash MD5
$$ A6 6D 48 29 09 70 03 96 19 19 72 2C 4C 21 82 BC
##$RELAX= 
##$RELAX= 
##$RELAX= 
##$RELAX= 
##$RELAX= 
##$RELAX= 
$$ Bruker specific parameters
$$ --------------------------
##$DU= <F:/spectra>
##$EXPNO= 1
##$NAME= <H-F>
##$PROCNO= 1
##$TYPE= <nmr>
##$USER= <she>
##$AMP= (0..31)
100 100 100 100 100 100 100 100 100 100 100 100 100 100 100 100 100 100 
100 100 100 100 100 100 100 100 100 100 100 100 100 100 
##$AQSEQ= 0
##$AQ_mod= 1
##$AUNM= <au_zg>
##$AUTOPOS= <>
##$BF1= 200.13
##$BF2= 200.13
##$BF3= 200.13
##$BF4= 200.13
##$BF5= 200.13
##$BF6= 200.13
##$BF7= 200.13
##$BF8= 200.13
##$BYTORDA= 1
##$CFDGTYP= 0
##$CFRGTYP= 5
##$CHEMSTR= <none>
##$CNST= (0..31)
1 1 145 1 1 1 1 1 1 1 1 1 1 1 1 1 1 1 1 1 1 1 1 1 1 1 1 1 1 1 1 1 
##$CPDPRG= <>
##$CPDPRG1= <>
##$CPDPRG2= <>
##$CPDPRG3= <>
##$CPDPRG4= <mlev>
##$CPDPRG5= <mlev>
##$CPDPRG6= <mlev>
##$CPDPRG7= <mlev>
##$CPDPRG8= <mlev>
##$CPDPRGB= <>
##$CPDPRGT= <>
##$D= (0..31)
0 1.2 0 0 0 0 0 0 0 0.06 0 0.03 0 0 0 0 0.0002 0 0 0 0 0 0 0 0 0 0 0 0 
0 0 0 
##$DATE= 1669120297
##$DBL= (0..7)
120 120 120 120 120 120 120 120 
##$DBP= (0..7)
150 150 150 150 150 150 150 150 
##$DBP07= 0
##$DBPNAM0= <>
##$DBPNAM1= <>
##$DBPNAM2= <>
##$DBPNAM3= <>
##$DBPNAM4= <>
##$DBPNAM5= <>
##$DBPNAM6= <>
##$DBPNAM7= <>
##$DBPOAL= (0..7)
0.5 0.5 0.5 0.5 0.5 0.5 0.5 0.5 
##$DBPOFFS= (0..7)
0 0 0 0 0 0 0 0 
##$DE= 6
##$DECBNUC= <off>
##$DECIM= 32
##$DECNUC= <off>
##$DECSTAT= 4
##$DIGMOD= 1
##$DIGTYP= 9
##$DL= (0..7)
0 120 120 120 120 120 120 120 
##$DP= (0..7)
150 150 150 150 150 150 150 150 
##$DP07= 0
##$DPNAME0= <>
##$DPNAME1= <>
##$DPNAME2= <>
##$DPNAME3= <>
##$DPNAME4= <>
##$DPNAME5= <>
##$DPNAME6= <>
##$DPNAME7= <>
##$DPOAL= (0..7)
0.5 0.5 0.5 0.5 0.5 0.5 0.5 0.5 
##$DPOFFS= (0..7)
0 0 0 0 0 0 0 0 
##$DQDMODE= 0
##$DR= 18
##$DS= 0
##$DSLIST= <SSSSSSSSSSSSSSS>
$$ [...]
##$SUBNAM2= <"">
##$SUBNAM3= <"">
##$SUBNAM4= <"">
##$SUBNAM5= <"">
##$SUBNAM6= <"">
##$SUBNAM7= <"">
##$SUBNAM8= <"">
##$SUBNAM9= <"">
##$SW= 18.0517283424941
##$SWIBOX= (0..15)
0 0 2 0 0 0 0 0 0 0 0 0 0 0 0 0 
##$SW_h= 3612.71676300578
##$TD= 16384
##$TD0= 1
##$TE= 0
##$TE2= 300
##$TE3= 300
##$TEG= 300
##$TL= (0..7)
0 120 120 120 120 120 120 120 
##$TP= (0..7)
150 150 150 150 150 150 150 150 
##$TP07= 0
##$TPNAME0= <>
##$TPNAME1= <>
##$TPNAME2= <>
##$TPNAME3= <>
##$TPNAME4= <>
##$TPNAME5= <>
##$TPNAME6= <>
##$TPNAME7= <>
##$TPOAL= (0..7)
0.5 0.5 0.5 0.5 0.5 0.5 0.5 0.5 
##$TPOFFS= (0..7)
0 0 0 0 0 0 0 0 
##$TUNHIN= 0
##$TUNHOUT= 0
##$TUNXOUT= 0
##$USERA1= <user>
##$USERA2= <user>
##$USERA3= <user>
##$USERA4= <user>
##$USERA5= <user>
##$V9= 5
##$VALIST= <valist>
##$VCLIST= <CCCCCCCCCCCCCCC>
##$VD= 0
##$VDLIST= <DDDDDDDDDDDDDDD>
##$VPLIST= <PPPPPPPPPPPPPPP>
##$VTLIST= <TTTTTTTTTTTTTTT>
##$WBST= 1024
##$WBSW= 4
##$XGAIN= (0..3)
0 0 0 0 
##$XL= 0
##$YL= 0
##$YMAX_a= 855499
##$YMIN_a= -749305
##$ZGOPTNS= <>
##$ZL1= 120
##$ZL2= 120
##$ZL3= 120
##$ZL4= 120
##$ABSF1= 10
##$ABSF2= 0
##$ABSG= 5
##$ABSL= 3
##$ALPHA= 0
##$AQORDER= 0
##$ASSFAC= 0
##$ASSFACI= 0
##$ASSFACX= 0
##$ASSWID= 0
##$AUNMP= <proc_1d>
##$AZFE= 0.1
##$AZFW= 0.1
##$BCFW= 1
##$BC_mod= 2
##$BYTORDP= 1
##$COROFFS= 0
##$CY= 11.3945322036743
##$DATMOD= 1
##$DC= 2
##$DFILT= <>
##$DTYPP= 0
##$F1P= 2.36226072786647
##$F2P= -0.459571619588291
##$FCOR= 0.5
##$FTSIZE= 0
##$FT_mod= 4
##$GAMMA= 1
##$GB= 0.15
##$INTBC= 1
##$INTSCL= 1
##$ISEN= 128
##$LB= 0.24
##$LEV0= 0
##$LPBIN= 0
##$MAXI= 10000
##$MC2= 0
##$MEAN= 0
##$ME_mod= 0
##$MI= 1.114404
##$NCOEF= 0
##$NC_proc= 0
##$NLEV= 6
##$NOISF1= 3.799351
##$NOISF2= 2.8
##$NSP= 1
##$NTH_PI= 0
##$NZP= 0
##$OFFSET= 15.70392
##$PC= 1
##$PHC0= -17943.03
##$PHC1= 9.80072
##$PH_mod= 1
##$PKNL= yes
##$PPARMOD= 0
##$PSCAL= 0
##$PSIGN= 0
##$REVERSE= no
##$SF= 200.130013532006
##$SI= 16384
##$SIGF1= 3
##$SIGF2= 2
##$SINO= 400
##$SIOLD= 16384
##$SREGLST= <1H.CDCl3>
##$SSB= 0
##$STSI= 0
##$STSR= 0
##$SW_p= 3612.71676300578
##$SYMM= 0
##$S_DEV= 0
##$TDeff= 0
##$TDoff= 0
##$TI= <>
##$TILT= no
##$TM1= 0
##$TM2= 0
##$TOPLEV= 0
##$USERP1= <user>
##$USERP2= <user>
##$USERP3= <user>
##$USERP4= <user>
##$USERP5= <user>
##$WDW= 1
##$XDIM= 8192
##$YMAX_p= 0
##$YMIN_p= 0
$$ End of Bruker specific parameters
$$ ---------------------------------
##NTUPLES= NMR FID
##VAR_NAME=  TIME,          FID/REAL,        FID/IMAG
##SYMBOL=    X,             R,               I
##VAR_TYPE=  INDEPENDENT,   DEPENDENT,       DEPENDENT
##VAR_FORM=  AFFN,          ASDF,            ASDF
##VAR_DIM=   8192,          8192,            8192
##UNITS=     SECONDS,       ARBITRARY UNITS, ARBITRARY UNITS
##FACTOR=    0.0002768,     1,               1
##FIRST=     0,             0,               0
##LAST=      2.2672688,     0,               0
##MIN=       0,             -749305,         0
##MAX=       2.2672688,     855499,          0
$$ Real data points
##PAGE= N=1
##DATA TABLE= (X++(R..R)), XYDATA
0 0 0 0 0 0 0 0 -4 8 -8 8 -8 16 -16 24 -29 40 -48 56 -67 80 -92 108 -127 148 -172 203 -236 268 -304 347
30 347 -392 442 -499 563 -635 711 -796 885 -985 1092 -1209 1336 -1477 1632 -1797 1983
46 1983 -2180 2400 -2637 2904 -3194 3520 -3885 4294 -4755 5283 -5891 6600 -7438 8448
60 8448 -9690 11254 -13275 15994 -19818 25553 -34939 52592 -95724 374645 375430 -517311
72 -517311 655140 -649562 -13502 430914 -509552 732366 -406470 -234757 403396
81 403396 -614692 695888 -119469 -284001 418867 -715344 485487 87049 -272885
90 -272885 541729 -702872 223724 144824 -314139 668215 -530998 37506 147191 -454969
100 -454969 684402 -302456 -20188 207096 -604198 552034 -140346 -30634 361832 -648333
110 -648333 359153 -88771 -101597 528139 -551776 221704 -75831 -263943 595111 -392336
120 -392336 179992 -853 -440136 528393 -278504 169024 163189 -524006 398760 -248723
130 -248723 95450 343255 -482058 307951 -243670 -65380 439260 -379789 292420 -176269
140 -176269 -244874 418879 -312513 297355 -23148 -349405 342834 -314206 240697 152149
150 152149 -348188 299776 -332874 99279 261848 -296695 320430 -290519 -68031 276222
160 276222 -276481 354736 -164162 -178893 245570 -315055 328300 -7883 -204242 244485
170 244485 -364211 218228 100576 -189305 297634 -352889 74698 132218 -202521 358952
180 358952 -258803 -28430 127862 -266250 361036 -129122 -62376 150860 -337172 282640
190 282640 -33869 -64396 222227 -351831 167973 -944 -93903 301552 -289659 83089
200 83089 4087 -171066 328900 -191755 54544 37373 -258155 284010 -119854 49829
210 49829 118632 -298207 204316 -98665 15479 212296 -270573 147007 -97074 -67609
220 -67609 263577 -208806 134816 -64213 -165480 251171 -165861 138171 18009 -225033
230 -225033 205127 -162793 108829 117006 -224444 174681 -171704 29734 181496 -191034
240 -191034 179816 -147055 -67847 189523 -171073 194483 -72803 -134456 166259 -183863
250 -183863 175723 21169 -148666 155702 -205147 108217 87698 -134094 176545 -194034
260 -194034 20017 106199 -132591 205817 -135476 -44269 99099 -162075 204246 -55219
270 -55219 -65279 106031 -200333 156253 4920 -63976 143730 -208911 85353 26409 -77704
281 -77704 190268 -171802 30801 28792 -121772 208066 -110393 10477 47008 -174618 180718
292 180718 -61921 6404 95036 -199541 128033 -43773 -14069 151845 -180387 85619
302 85619 -39677 -63883 182133 -135872 70720 -18824 -122992 170285 -100045 68096
312 68096 31194 -157779 134049 -89736 48562 91540 -153176 106000 -90470 -207 130270
323 130270 -125893 101965 -74046 -60654 132797 -106561 107838 -28057 -102392 114477
333 114477 -109815 96002 31149 -111024 103706 -121554 54023 74428 -100406 113842
343 113842 -114755 -2719 87461 -96800 130866 -77304 -46068 82539 -112392 128758
353 128758 -23875 -61706 84183 -133612 95879 18324 -60613 103766 -135737 46394
363 46394 35025 -66031 128573 -107724 6496 36480 -88893 135152 -63122 -9972 44759
374 44759 -117354 113009 -26910 -12720 70612 -129169 74649 -12128 -23042 103009 -113861
385 -113861 43479 -9300 -51530 120438 -82670 31582 2091 -87494 112117 -57277 29754
396 29754 32173 -109881 87962 -48924 18323 70573 -107611 68085 -48662 -12215 96545
407 96545 -89403 63039 -37963 -51660 98832 -74117 64576 -7919 -79763 85311 -72055
418 -72055 55193 31457 -85336 74019 -75612 26535 60633 -75801 75051 -68311
428 -68311 -11818 68769 -68532 81458 -42093 -41241 63011 -73364 77377 -5825 -51474
439 -51474 60072 -83624 54746 22975 -49274 69246 -83810 21550 34506 -50480 83875
450 83875 -65600 -5678 35166 -63772 88578 -36103 -17682 39733 -82289 74768 -10881
461 -10881 -20203 56151 -90810 48868 939 -27022 77463 -80723 25800 4426 -45342
472 -45342 88844 -58067 14623 12438 -68491 81873 -37270 10900 31855 -82128 62409
483 62409 -27330 2439 56266 -78263 44392 -24162 -17469 72146 -62492 36648 -16055 -42927
495 -42927 71764 -48183 35105 3715 -61009 60317 -43600 28265 29738 -64174 50307
506 50307 -44539 9351 49638 -57042 49304 -39608 -16630 55847 -51150 52948 -22085
517 -22085 -37585 52277 -53365 50032 3215 -45862 49594 -59262 34032 24454 -44808 54195
529 54195 -58053 9774 33978 -44479 61801 -43673 -11205 34725 -50874 62308 -20827
540 -20827 -21316 36186 -60201 49913 -707 -23311 44390 -62828 29225 9327 -26391 55815
552 55815 -53247 10829 12066 -36504 61283 -35581 1562 16482 -50336 55124 -19701 -1333
564 -1333 28312 -58820 40941 -11861 -6552 44234 -56140 27817 -9334 -19554 55258 -45198
576 -45198 21580 -3822 -36858 55383 -34532 19585 9709 -49570 47044 -29630 14136 27769
588 27769 -51684 38317 -28230 583 41547 -45416 34707 -23142 -17700 45207 -38564 34204
600 34204 -10002 -32132 40923 -36553 30041 7929 -37205 36223 -37662 17990 22689 -35020
612 -35020 36465 -35247 945 28968 -32857 39821 -24982 -13623 28805 -35618 39672 -9388
624 -9388 -20710 28978 -41341 31570 4566 -22100 34023 -43416 17583 12043 -24079 41700
636 41700 -37260 4403 14518 -30724 45484 -24714 -3155 17681 -39778 40846 -12328 -6296
648 -6296 25348 -44826 29618 -4961 -10236 35346 -41558 18208 -1631 -18592 41573 -31913
660 -31913 11430 2712 -29399 39966 -21995 8428 11496 -36945 32377 -16468 4275 23071
672 23071 -37321 24587 -14402 -4626 31987 -32102 20863 -10881 -16701 34350 -26687 20096
684 20096 -2226 -26705 31410 -24848 17387 10035 -30684 28006 -25326 9182 20704 -29542
696 -29542 27662 -23377 -3020 25776 -27686 29113 -15645 -13995 25886 -28422 27785 -3710
708 -3710 -19734 25213 -30638 20686 7292 -20774 26920 -30122 9354 13408 -21126 30109
720 30109 -23977 -1248 15130 -23962 30823 -13781 -7354 16478 -28507 26205 -4125 -9561
732 -9561 20558 -30846 17635 1555 -11757 26520 -28119 9248 3904 -16903 30516 -21295
744 -21295 4240 6670 -24105 29547 -14209 1923 12594 -29391 24252 -9829 -1137 20622
756 20622 -29708 18204 -7587 -7504 26798 -25551 14367 -4371 -15986 28050 -20392 12315 2163
769 2163 -22756 24870 -17160 9171 10846 -24835 20708 -15621 2766 18033 -22781 18448
781 18448 -13009 -5863 20955 -19930 17848 -7137 -13311 20123 -18982 16204 1114 -16964
793 -16964 18755 -19708 11266 8589 -17326 19338 -19251 3671 12770 -17274 21333 -15305
805 -15305 -3620 14050 -19053 21941 -8373 -8141 14996 -22068 18818 -1335 -10051 17620 -23424
818 -23424 12445 3317 -11671 21262 -20978 5659 5622 -14884 23243 -15169 1046 7692 -19078
831 -19078 21498 -8899 -1404 11372 -21764 16570 -4601 -3708 16131 -20971 11180 -2356 -7709
844 -7709 19693 -17215 7667 -77 -13033 20071 -13046 5936 4072 -17439 17683 -10524 3902
857 3902 9810 -18949 14767 -9465 -250 14869 -17804 13201 -7782 -6216 17243 -15936 12690
870 12690 -3713 -11700 16994 -15033 11259 2345 -14663 15851 -14900 7315 8079 -15044 15527
883 15527 -13729 1336 11450 -14514 15824 -10065 -4460 12359 -14764 15130 -4363 -8059
895 -8059 12463 -15714 12011 1202 -9387 13422 -15799 6926 4791 -10173 15246 -13606
907 -13606 1856 6448 -11946 16291 -9426 -1554 7770 -14659 15133 -4991 -3345 10233 -16638
920 -16638 11848 -1843 -5032 13663 -16308 7998 25 -7980 16315 -13710 5096 1999 -11855
933 -11855 16645 -10328 3212 5234 -14987 14563 -7648 1080 9421 -15794 11588 -5821 -2317
946 -2317 12875 -14262 9263 -3726 -6689 14174 -11902 7709 -376 -10461 13293 -10171 5986
959 5986 4008 -12278 11772 -9255 2913 8004 -12180 10892 -8081 -1313 10297 -11508 10779
972 10779 -5465 -5383 10932 -11496 10235 -1470 -8067 11042 -12083 8073 2592 -9237 11694
985 11694 -12070 4332 5490 -9908 12770 -10260 268 7019 -11034 13092 -6731 -2777 8071
998 8071 -12490 11586 -2781 -4541 9548 -13142 8353 261 -5888 11385 -12052 4687 2149
1011 2149 -7680 12549 -9330 1887 3664 -9932 12062 -6216 120 5772 -11658 10105 -3847
1024 -3847 -1436 8434 -11955 7694 -2392 -3721 10743 -10829 5903 -943 -6706 11696 -9130
1037 -9130 4754 1412 -9457 11201 -7812 3410 4596 -10895 10039 -6895 1018 7677 -10881
1050 -10881 9077 -5631 -2297 9472 -10116 8354 -3230 -5525 9819 -9458 7204 172
1062 172 -7626 9462 -9028 4947 3436 -8335 9187 -8189 1738 5705 -8416 9225 -6318
1075 -6318 -1488 6738 -8707 8940 -3481 -3774 7262 -9344 7606 -538 -5072 8119 -9656
1088 -9656 5293 1710 -5974 9303 -8921 2652 3145 -7237 10189 -7023 516 4332 -8879
1101 -8879 9896 -4658 -1018 5951 -10117 8323 -2566 -2433 7887 -10144 6160 -973 -4276
1114 -4276 9409 -8890 4178 556 -6445 9735 -6989 2617 2509 -8228 8828 -5249 1091
1127 1091 4861 -8921 7336 -3923 -872 6906 -8504 6070 -2613 -3260 7995 -7560 5170
1140 5170 -799 -5477 8096 -6821 4226 1558 -6913 7736 -6408 2627 3885 -7454 7489
1153 7489 -5802 346 5574 -7564 7445 -4411 -2061 6463 -7731 7086 -2229 -3949 6888
1166 6888 -7954 5833 238 -5082 7311 -7780 3711 2252 -5777 7820 -6719 1309 3566
1179 3566 -6483 7915 -4771 -715 4488 -7268 7157 -2542 -2072 5470 -7719 5604 -696
1192 -696 -3135 6586 -7395 3712 610 -4351 7445 -6317 2132 1691 -5754 7594 -4923 974
1206 974 3029 -7006 6981 -3638 -108 4686 -7586 5922 -2622 -1552 6222 -7321 4925
1219 4925 -1542 -3367 7117 -6582 4023 -7 -5110 7177 -5752 2983 1932 -6251 6682
1232 6682 -4968 1435 3846 -6546 6064 -3990 -568 5120 -6341 5493 -2578 -2527 5696 -6049
1246 -6049 4781 -700 -3967 5820 -5850 3611 1197 -4746 5882 -5503 1958 2709 -5183 6112
1260 6112 -4653 215 3654 -5643 6151 -3285 -1289 4356 -6207 5641 -1671 -2365 5130 -6559
1274 -6559 4528 -196 -3270 5950 -6325 3005 975 -4260 6569 -5383 1556 2030 -5322 6524
1288 6524 -3985 307 3187 -6110 5738 -2610 -828 4401 -6325 4547 -1417 -2086 5422 -5822
1302 -5822 3373 -323 -3412 5888 -4930 2383 943 -4620 5760 -4068 1429 2378 -5368 5257
1316 5257 -3356 270 3717 -5550 4734 -2588 -1157 4689 -5422 4294 -1541 -2625 5178 -5208
1330 -5208 3717 -142 -3793 5298 -4996 2749 1407 -4489 5316 -4577 1323 2698 -4843 5294
1344 5294 -3687 -264 3583 -5080 5001 -2306 -1611 4142 -5189 4247 -743 -2587 4568 -5099 3038
1359 3038 614 -3284 4924 -4593 1655 1652 -3899 5081 -3647 375 2413 -4529 4877 -2486 -631 3175
1375 3175 -4999 4233 -1391 -1452 4015 -5110 3317 -492 -2350 4761 -4744 2402 386 -3356 5102
1390 5102 -4042 1578 1361 -4265 4969 -3243 693 2494 -4802 4457 -2457 -351 3552 -4853 3800
1405 3800 -1599 -1583 4260 -4509 3121 -533 -2732 4486 -4046 2315 682 -3596 4357 -3520 1333
1420 1333 1884 -3995 4096 -2929 168 2828 -4105 3833 -2124 -1019 3407 -4108 3491 -1079 -2007
1435 -2007 3742 -4103 2919 72 -2712 4018 -3999 2010 1102 -3214 4260 -3594 950 1892 -3697
1450 -3697 4328 -2823 -108 2529 -4095 4067 -1810 -982 3143 -4359 3417 -780 -1747 3719 -4248
1465 -4248 2452 128 -2490 4102 -3720 1485 951 -3191 4183 -2924 615 1779 -3724 3839 -2077
1480 -2077 -201 2590 -3988 3276 -1303 -1018 3281 -3889 2654 -591 -1882 3752 -3571 2064 195
1495 195 -2701 3863 -3190 1458 1090 -3341 3762 -2764 692 1996 -3669 3532 -2254 -243 2749
1510 2749 -3742 3239 -1545 -1215 3211 -3673 2817 -589 -2044 3461 -3485 2153 440 -2641 3542
1525 3542 -3160 1257 1351 -3000 3506 -2582 254 2030 -3231 3329 -1774 -663 2486 -3389 2927
1540 2927 -895 -1374 2854 -3426 2293 -64 -1922 3161 -3228 1535 645 -2414 3407 -2795 784
1555 784 1233 -2894 3404 -2205 151 1835 -3278 3167 -1531 -481 2436 -3432 2695 -852 -1158 2951
1571 2951 -3302 2097 -214 -1839 3252 -2920 1476 503 -2456 3242 -2424 797 1253 -2898 2977
1586 2977 -1881 85 1940 -3039 2589 -1313 -679 2458 -2926 2178 -651 -1415 2737 -2711 1754
1601 1754 91 -2013 2795 -2465 1231 824 -2374 2778 -2173 559 1462 -2572 2716 -1759 -168
1616 -168 1920 -2706 2565 -1179 -837 2273 -2781 2221 -462 -1380 2519 -2752 1693 227 -1818 2685
1632 2685 -2521 1019 828 -2185 2736 -2063 307 1328 -2467 2608 -1435 -307 1772 -2618 2254
1647 2254 -751 -841 2151 -2579 1730 -151 -1332 2439 -2357 1165 366 -1783 2548 -1992 655 874
1663 874 -2171 2462 -1554 172 1378 -2431 2230 -1147 -344 1835 -2481 1912 -719 -904 2181 -2381
1679 -2381 1563 -210 -1431 2357 -2169 1183 366 -1862 2357 -1884 694 974 -2138 2244 -1527
1694 -1527 111 1490 -2208 2061 -1053 -532 1854 -2184 1764 -480 -1066 2024 -2095 1361 111
1709 111 -1472 2099 -1913 849 672 -1737 2099 -1636 301 1086 -1934 2019 -1248 -228 1405 -2048
1725 -2048 1867 -749 -664 1669 -2119 1569 -260 -1017 1912 -2059 1173 172 -1336 2082 -1812 739
1741 739 574 -1657 2119 -1468 274 978 -1906 1975 -1066 -164 1356 -2022 1674 -629 -619 1675
1757 1675 -1971 1288 -197 -1040 1867 -1750 901 229 -1416 1907 -1486 487 706 -1684 1801 -1164
1773 -1164 94 1103 -1792 1608 -827 -334 1436 -1777 1391 -486 -738 1633 -1720 1153 -74
1788 -74 -1108 1711 -1604 858 356 -1375 1726 -1422 477 757 -1543 1683 -1176 28 1063 -1669
1804 -1669 1578 -813 -389 1307 -1677 1369 -355 -772 1478 -1640 1038 77 -1062 1594 -1500 635
1820 635 469 -1268 1607 -1215 237 789 -1444 1566 -858 -136 1057 -1543 1373 -496 -453 1280
1836 1280 -1573 1105 -185 -760 1441 -1481 798 150 -1034 1546 -1311 489 437 -1294 1530 -1073
1852 -1073 201 751 -1468 1431 -791 -118 1057 -1524 1252 -519 -461 1301 -1474 1015 -185 -801
1868 -801 1432 -1321 755 206 -1074 1452 -1144 451 569 -1251 1394 -917 75 866 -1353 1242
1884 1242 -655 -315 1084 -1346 1066 -346 -628 1217 -1313 868 11 -876 1301 -1232 589 326
1900 326 -1041 1334 -1082 304 599 -1184 1306 -856 -5 845 -1266 1248 -585 -296 1016 -1303
1916 -1303 1060 -253 -572 1158 -1285 814 47 -803 1258 -1178 488 312 -1006 1282 -940 185
1932 185 589 -1190 1200 -675 -109 823 -1261 1023 -391 -379 1027 -1233 809 -114 -635 1145 -1104
1949 -1104 606 136 -847 1203 -959 361 412 -1019 1169 -776 130 647 -1099 1071 -595 -128 857
1966 857 -1125 943 -377 -382 997 -1110 787 -131 -642 1054 -1041 565 151 -846 1077 -918 323
1983 323 434 -951 1039 -727 47 658 -995 956 -489 -229 812 -1013 832 -192 -453 931
1999 931 -976 650 55 -645 972 -875 404 270 -773 986 -734 174 464 -877 953 -570
2015 -570 -51 606 -947 851 -362 -254 747 -950 704 -172 -449 842 -900 534 34 -592 917
2032 917 -796 366 220 -736 913 -637 159 451 -827 841 -445 -53 623 -850 719 -277 -273 718
2050 718 -830 569 -93 -452 795 -741 409 117 -630 812 -635 234 300 -732 763 -519 15
2067 15 471 -758 706 -372 -140 597 -762 609 -206 -315 686 -732 511 -16 -434 718 -672
2084 -672 375 150 -528 739 -576 210 278 -654 710 -476 30 420 -681 660 -315 -159 532 -707
2102 -707 551 -143 -302 612 -671 409 14 -444 660 -608 250 184 -554 690 -491 86 317 -614
2120 -614 634 -347 -79 466 -650 559 -203 -203 551 -651 460 -59 -330 617 -591 340 54 -463 642
2139 642 -538 213 179 -554 615 -444 79 312 -604 561 -338 -72 445 -613 502 -202 -222 542 -570
2158 -570 418 -45 -358 584 -539 288 119 -464 591 -467 160 256 -524 560 -366 10 384 -536 519
2177 519 -243 -143 465 -568 447 -106 -276 514 -533 352 27 -382 532 -512 218 137 -433 537 -434
2196 -434 91 241 -503 538 -318 -23 348 -524 498 -194 -127 443 -530 399 -82 -248 494 -480 292 53
2216 53 -336 531 -430 150 150 -432 502 -342 46 268 -484 443 -242 -90 362 -516 376 -133 -194 435 -482
2237 -482 290 -32 -298 463 -421 211 93 -361 473 -369 114 191 -401 432 -274 24 288 -440 403 -181
2257 -181 -96 365 -410 346 -112 -184 402 -422 268 14 -287 417 -380 186 115 -349 408 -318 74 209 -373
2278 -373 395 -232 -42 280 -403 362 -126 -137 353 -405 290 -32 -221 388 -380 213 72 -271 418 -313
2298 -313 130 170 -331 393 -267 32 234 -361 384 -181 -64 283 -366 315 -108 -151 341 -388 230 -11 -237
2319 -237 341 -356 160 63 -299 378 -309 66 166 -344 350 -212 -6 239 -373 315 -149 -95 313 -381 274
2340 274 -37 -165 373 -341 222 43 -248 388 -312 132 131 -326 372 -273 20 200 -362 325 -206 -54 278
2361 278 -373 288 -131 -144 303 -369 240 -35 -213 348 -353 182 63 -263 372 -304 111 148 -302 364 -230
2382 -230 19 218 -328 349 -155 -52 281 -350 277 -87 -153 320 -360 231 6 -233 342 -311 128 74 -287
2403 -287 335 -272 43 138 -337 340 -206 -23 220 -344 306 -113 -97 278 -344 238 -46 -157 334 -315 196
2424 196 47 -219 336 -289 122 95 -262 340 -221 51 184 -314 318 -171 -30 222 -331 267 -123 -108 263
2445 263 -323 239 -59 -175 295 -303 174 32 -233 298 -265 93 124 -265 309 -223 36 175 -292 299
2465 299 -143 -33 246 -299 274 -81 -109 292 -291 222 2 -160 307 -285 152 51 -221 295 -242 64
2485 64 103 -276 294 -211 39 158 -297 263 -136 -47 193 -284 235 -82 -82 259 -282 200 -10 -155 282 -254
2507 -254 147 52 -202 268 -205 75 125 -239 273 -143 6 177 -277 264 -115 -61 213 -290 209 -65 -125
2528 -125 250 -281 163 -12 -187 242 -249 111 59 -237 271 -226 54 116 -246 260 -173 16 152 -272 231
2549 231 -116 -36 221 -261 218 -74 -112 240 -238 172 28 -154 249 -223 111 68 -203 249 -188 38 123
2570 123 -261 245 -153 -20 144 -262 213 -112 -76 196 -272 179 -58 -130 218 -252 134 27 -193 250 -223
2591 -223 92 85 -201 261 -180 44 120 -222 248 -125 -6 174 -239 226 -79 -70 200 -249 175 -39 -113 212
2613 212 -249 142 19 -166 223 -205 76 67 -218 235 -179 41 123 -224 215 -147 -24 172 -236 207 -60
2634 -60 -75 212 -225 186 -15 -103 223 -223 132 36 -164 250 -193 70 95 -198 238 -152 26 131 -211 218
2656 218 -121 -24 158 -221 183 -95 -82 184 -234 148 -32 -108 211 -215 119 22 -155 223 -181 53 77 -177
2678 -177 221 -147 14 114 -199 213 -102 -13 160 -211 175 -62 -83 190 -216 144 -15 -121 188 -198 103
2699 103 33 -169 199 -189 64 95 -210 190 -144 5 114 -207 178 -115 -38 154 -222 156 -49 -65 174
2720 174 -197 139 -12 -103 194 -184 107 50 -138 202 -159 58 85 -153 189 -105 2 118 -176 181 -79
2741 -79 -45 123 -181 151 -64 -82 153 -184 114 -6 -109 172 -167 83 32 -152 186 -147 48 79 -148 187
2763 187 -99 -2 120 -163 167 -61 -27 133 -161 153 -34 -59 151 -161 110 5 -124 169 -157 73 58
2784 58 -150 168 -131 33 70 -180 145 -123 -24 115 -174 141 -72 -59 138 -178 114 -26 -75 152 -150 106
2806 106 2 -117 163 -141 83 82 -149 171 -128 28 102 -152 138 -76 -14 128 -167 153 -70 -54 138 -172
2828 -172 123 -27 -107 146 -154 49 24 -137 135 -144 18 43 -132 143 -107 7 87 -155 141 -61 -17 126
2850 126 -154 125 -40 -52 149 -140 115 17 -87 171 -136 76 49 -111 157 -110 4 81 -142 147 -92
2871 -92 -17 93 -167 112 -75 -47 113 -168 112 -33 -67 129 -163 85 -3 -111 140 -135 35 44 -129 137
2893 137 -99 26 83 -115 150 -92 6 107 -134 149 -41 -48 135 -145 108 -25 -64 131 -149 62 12 -112
2915 -112 125 -135 40 38 -130 147 -104 -4 70 -148 119 -62 -18 113 -135 111 -33 -36 124 -129 115 -15
2937 -15 -67 124 -115 89 24 -96 158 -109 28 51 -116 151 -87 -3 75 -114 122 -78 -26 99 -130 114
2959 114 -47 -76 105 -130 87 -12 -86 117 -122 67 14 -102 128 -105 32 70 -111 120 -84 9 89 -117
2981 -117 137 -38 -12 128 -127 101 -20 -47 111 -121 81 8 -77 124 -105 51 18 -92 124 -97 9 27
3003 27 -115 98 -80 -11 52 -127 86 -58 -35 85 -123 74 -7 -41 93 -96 74 16 -59 125 -96 52 32
3026 32 -82 127 -70 34 46 -92 124 -54 -18 66 -98 99 -39 -23 95 -117 63 -9 -70 90 -114 41
3048 41 -2 -83 110 -101 44 31 -95 96 -82 34 50 -90 106 -46 22 69 -95 102 -32 -4 104 -95 100
3071 100 2 -40 105 -98 57 1 -60 108 -92 45 20 -83 95 -90 8 41 -89 108 -70 -20 44 -117 86
3094 86 -56 -32 73 -105 83 -16 -41 92 -97 79 8 -46 112 -79 57 33 -61 111 -89 31 51 -95 114
3117 114 -67 8 67 -105 88 -49 -12 76 -96 85 -33 -46 71 -117 50 -12 -70 89 -110 56 8 -81 107
3140 107 -73 17 43 -93 104 -60 12 69 -83 118 -47 -3 84 -96 110 -21 -31 101 -81 83 -4 -45 109
3163 109 -88 73 28 -67 111 -83 28 46 -99 94 -72 -9 47 -98 100 -75 -12 66 -114 88 -17 -25 65
3186 65 -99 78 2 -45 89 -100 67 26 -81 126 -85 41 55 -69 120 -56 8 59 -90 114 -59 -2 88
3209 88 -102 81 -42 -40 88 -113 55 -17 -62 78 -112 46 17 -76 87 -86 33 40 -85 114 -73 10 57 -81
3233 -81 107 -54 -11 84 -93 97 -36 -10 103 -92 73 -7 -38 114 -83 55 19 -78 112 -87 24 20 -76 117
3257 117 -77 15 52 -97 98 -53 -18 63 -112 93 -38 -28 85 -94 79 -6 -34 98 -93 49 19 -73 104
3280 104 -70 28 62 -65 131 -57 24 68 -76 100 -46 -11 70 -89 75 -19 -40 68 -101 70 -15 -67 80
3303 80 -101 53 8 -74 81 -82 32 20 -79 88 -67 6 54 -83 85 -46 -2 70 -84 103 -36 -18 84
3326 84 -83 68 -3 -42 98 -54 56 20 -47 98 -90 42 35 -69 75 -57 16 45 -91 82 -54 -18 66 -80
3350 -80 68 -21 -32 74 -95 72 -1 -31 84 -78 65 9 -55 81 -41 34 55 -49 103 -33 13 61 -64 88
3374 88 -48 14 63 -89 71 -18 -21 75 -71 52 -17 -32 65 -88 44 -13 -79 86 -70 16 6 -78 87 -42 0
3399 0 41 -72 86 -40 5 56 -67 72 -36 -7 77 -72 63 6 -23 87 -83 42 20 -59 73 -82 29 9
3423 9 -67 69 -58 9 38 -84 69 -64 -16 44 -87 60 -45 -10 65 -97 50 -22 -32 74 -95 46 1 -33
3447 -33 74 -72 42 31 -47 98 -47 29 54 -45 62 -29 2 47 -67 83 -24 -16 47 -67 33 -19 -59 36 -71
3472 -71 17 -15 -63 60 -64 20 8 -70 64 -75 6 40 -62 66 -50 -4 23 -43 82 -35 -9 34 -67 47 -22
3497 -22 -14 73 -55 57 0 -46 68 -81 34 29 -53 63 -71 12 12 -60 53 -53 1 44 -55 53 -45 -9 29 -67 44
3524 44 -24 -19 48 -53 43 -2 -13 67 -36 45 25 -38 79 -46 39 40 -59 55 -52 21 50 -67 60 -31 -2 49 -59
3551 -59 39 -11 -34 63 -51 27 -21 -57 51 -81 22 2 -69 50 -61 8 18 -58 68 -40 6 43 -64 67 -20
3576 -20 -24 63 -61 62 -1 -21 77 -51 70 21 -38 62 -64 25 8 -50 60 -43 -2 15 -61 57 -43 -17 45 -75
3602 -75 52 -34 -26 48 -91 21 -21 -28 59 -65 19 4 -42 77 -56 23 18 -40 69 -42 23 33 -64 61 -24 7 41
3629 41 -52 54 -30 -9 42 -65 68 -29 -37 38 -82 45 -19 -57 66 -71 31 5 -52 62 -53 0 12 -65 57
3654 57 -62 2 49 -79 75 -37 -20 61 -60 58 -6 -28 61 -57 31 5 -35 73 -45 33 24 -48 68 -52 11
3679 11 14 -64 63 -39 -13 40 -78 68 -40 -20 53 -83 41 -39 -36 66 -71 42 -4 -38 53 -71 43 15 -67
3704 -67 78 -47 24 23 -69 64 -33 18 36 -53 66 -32 -28 58 -81 62 -17 -34 54 -77 41 -3 -42 61 -74 35
3730 35 16 -73 66 -69 6 15 -70 70 -48 -3 45 -71 68 -22 -6 48 -56 71 -18 -17 73 -75 57 11 -42 65
3756 65 -71 23 21 -64 77 -55 23 41 -69 56 -60 -4 46 -71 51 -48 -34 54 -96 44 -23 -50 65 -103 25
3781 25 -6 -50 74 -75 29 5 -59 89 -59 30 50 -67 82 -26 8 46 -58 86 -22 -7 79 -82 55 -13
3805 -13 -37 60 -80 51 -9 -66 60 -89 15 -6 -60 48 -81 14 22 -80 64 -50 -7 43 -92 58 -46 -32
3829 -32 46 -69 62 -16 -16 59 -72 58 6 -32 82 -72 38 12 -42 79 -61 23 34 -57 89 -42 -9 52 -79
3854 -79 57 -51 -23 62 -75 69 -28 -37 73 -83 49 16 -47 81 -70 25 14 -76 83 -74 16 35 -68 91
3878 91 -42 0 68 -70 74 -25 -29 63 -83 68 -8 -40 75 -66 44 9 -55 72 -92 18 18 -79 70 -81 -15
3903 -15 24 -85 78 -46 -24 53 -87 73 -37 -35 69 -94 59 1 -48 87 -91 52 19 -37 95 -77 37
3926 37 43 -72 98 -67 3 38 -92 83 -41 -10 60 -84 72 -32 -27 66 -101 56 -28 -49 72 -97 31 10
3950 10 -62 87 -81 23 14 -83 85 -63 12 41 -86 92 -61 -6 78 -89 66 -16 -9 73 -89 81 28 -47 94
3975 94 -80 43 11 -56 89 -81 23 38 -91 70 -61 0 34 -95 70 -64 -9 53 -96 77 -43 -26 67
3998 67 -94 46 -7 -53 90 -78 47 23 -55 94 -73 31 48 -77 96 -49 13 44 -90 78 -39 -4 70
4021 70 -99 72 -23 -28 86 -106 35 -15 -61 96 -80 35 6 -86 99 -59 10 51 -100 91 -47 -8 72 -91
4045 -91 80 -32 -12 63 -99 79 20 -24 83 -76 53 11 -61 103 -70 41 28 -64 101 -70 8 39 -83 69
4069 69 -61 -36 60 -122 70 -49 -42 77 -103 80 -27 -50 85 -88 62 3 -69 93 -76 32 29 -77 95
4092 95 -72 21 46 -68 96 -40 -4 74 -108 67 -17 -24 81 -104 65 -32 -71 90 -101 56 3 -60 70 -98
4116 -98 19 26 -90 74 -72 2 45 -93 85 -44 -8 63 -103 81 -20 -34 90 -96 76 -4 -41 89 -84
4139 -84 66 24 -59 93 -92 15 45 -85 92 -67 -8 72 -116 96 -56 -30 66 -109 61 -56 -60 59 -109
4162 -109 57 -17 -81 86 -109 48 8 -79 87 -73 29 36 -82 103 -72 7 82 -91 104 -31 -32 67 -88 75
4186 75 -36 -36 94 -106 61 -2 -68 90 -106 20 14 -91 87 -81 14 32 -115 70 -71 -7 62 -124 92 -31
4210 -31 -23 70 -101 79 -14 -33 105 -83 58 11 -56 100 -74 43 44 -75 96 -66 9 36 -89 85 -64 -17
4234 -17 59 -98 49 -58 -46 64 -97 61 -27 -62 79 -110 19 2 -86 84 -83 27 29 -98 84 -82 3
4257 3 52 -96 89 -50 -16 66 -91 100 -22 -29 88 -92 72 -17 -44 90 -92 51 2 -64 82 -89 29 20
4281 20 -78 83 -77 -10 38 -112 80 -62 -32 55 -110 80 -37 -50 75 -108 66 5 -42 112 -80 35 26 -74
4305 -74 92 -86 30 51 -99 90 -56 9 73 -86 92 -55 -24 68 -79 70 -22 -27 85 -111 59 -4 -71 80
4329 80 -101 30 19 -81 89 -85 -1 36 -98 92 -56 -2 67 -98 96 -42 -23 100 -96 82 -14 -38 96
4352 96 -93 71 -6 -73 97 -87 60 27 -98 101 -72 6 33 -103 100 -64 -8 49 -112 75 -23 -36 66
4375 66 -106 59 -36 -61 91 -91 38 14 -93 98 -94 32 41 -96 113 -56 23 59 -85 84 -55 1 85
4398 85 -88 98 -32 -43 72 -106 60 -20 -61 84 -108 40 5 -84 92 -102 12 25 -103 84 -79 5 56
4421 56 -104 86 -57 -30 89 -104 68 -35 -30 102 -90 77 0 -46 110 -88 53 37 -78 127 -71 34
4443 34 49 -90 131 -72 5 71 -105 80 -44 -19 74 -104 77 -34 -57 79 -115 52 -10 -62 83 -101 29
4466 29 21 -99 104 -74 13 39 -97 107 -68 -6 91 -109 104 -30 -22 86 -110 87 -19 -47 104 -110 70
4489 70 15 -62 120 -104 30 22 -104 99 -90 14 47 -102 82 -82 -12 68 -120 80 -52 -44 72 -119 72
4512 72 -7 -53 100 -110 64 9 -70 114 -95 49 38 -78 109 -73 21 56 -95 106 -49 -32 63 -93 80
4535 80 -37 -37 82 -99 63 -13 -70 80 -107 49 -2 -83 90 -94 23 41 -99 89 -77 22 49 -91 100
4558 100 -40 -5 97 -99 84 -21 -23 101 -105 88 2 -50 109 -80 48 9 -66 92 -94 21 35 -93 107
4581 107 -84 8 55 -105 86 -71 -14 66 -110 88 -25 -48 90 -109 64 -12 -56 93 -103 42 35 -87 108
4604 108 -68 33 47 -93 95 -55 3 61 -97 109 -29 -21 88 -102 92 -25 -40 81 -98 40 3 -91 102
4627 102 -96 35 19 -100 88 -107 30 41 -102 102 -55 -6 57 -109 101 -30 -17 96 -90 87 -22 -48
4649 -48 118 -86 66 14 -49 108 -80 60 43 -72 123 -79 30 52 -94 107 -58 -11 75 -109 82 -39
4671 -39 -30 81 -102 67 -23 -50 71 -101 69 11 -64 95 -76 28 39 -60 120 -54 20 64 -84 92 -66 2
4695 2 61 -103 92 -25 -7 99 -78 75 -28 -62 85 -100 43 -1 -76 93 -83 33 37 -101 94 -64 2
4718 2 49 -101 87 -79 -28 76 -107 77 -31 -35 83 -86 58 16 -40 101 -95 57 20 -57 93 -69 41
4741 41 40 -85 95 -51 21 56 -104 98 -49 -5 74 -97 78 -27 -51 85 -99 77 -7 -52 93 -89 26
4764 26 16 -75 96 -78 44 52 -85 93 -51 17 81 -69 83 -40 0 100 -82 92 -21 -36 89 -71 92
4787 92 -4 -55 91 -91 43 18 -88 114 -87 17 29 -88 92 -52 2 56 -90 64 -48 -30 73 -84 48
4810 48 -9 -38 85 -74 64 8 -46 100 -72 52 28 -70 109 -58 32 29 -82 104 -43 12 65 -79 77 -47
4834 -47 -26 60 -81 70 -27 -60 92 -88 30 4 -63 86 -85 23 14 -97 81 -72 19 50 -89 83 -61 3
4858 3 58 -86 93 -8 -11 78 -82 66 -32 -59 103 -86 49 9 -50 91 -65 36 18 -76 68 -73 8 44 -93
4883 -93 89 -51 10 59 -93 61 -40 -28 71 -78 55 -8 -45 92 -80 60 11 -45 99 -70 45 43 -68 90
4907 90 -51 12 52 -73 78 -37 -4 69 -81 83 -17 -33 80 -82 51 -6 -52 81 -79 34 16 -58 76
4930 76 -76 38 33 -73 85 -47 -11 37 -71 72 -20 -29 71 -63 78 -3 -14 94 -72 79 15 -35 80 -52
4954 -52 66 15 -51 85 -54 33 18 -85 89 -57 -7 49 -73 70 -42 -30 59 -75 46 -16 -40 69 -71 39
4978 39 -10 -48 65 -96 27 21 -68 86 -56 24 52 -62 96 -39 24 72 -61 78 -5 -18 85 -65 53 -2
5002 -2 -40 76 -86 36 -6 -57 85 -64 28 19 -91 82 -50 -1 40 -74 48 -39 3 57 -76 66 -25 -14 56
5027 56 -75 61 4 -29 61 -56 37 16 -41 90 -42 32 34 -62 87 -43 11 32 -41 74 -36 -8 52 -75 58
5052 58 -27 -41 53 -72 37 0 -53 61 -87 33 0 -76 66 -59 11 36 -69 79 -47 -8 61 -51 71 -16
5076 -16 -10 50 -67 54 -19 -32 62 -50 50 10 -40 74 -61 28 29 -44 78 -61 9 34 -65 65 -43 -5 48 -84
5102 -84 47 -41 -42 37 -78 46 -4 -31 66 -87 50 6 -56 85 -49 40 27 -28 91 -21 11 41 -60 82 -30
5127 -30 -3 47 -77 71 -47 -13 51 -65 67 3 -40 86 -59 56 7 -51 68 -66 20 9 -48 68 -43 -2
5151 -2 16 -57 66 -45 -8 38 -55 74 -11 -13 63 -55 74 5 -11 79 -37 55 24 -57 65 -57 16 24 -51 60 -64
5178 -64 2 27 -62 62 -40 -15 29 -81 46 -39 -50 45 -49 36 -16 -49 66 -63 24 24 -50 77 -36 28 23 -55 84
5205 84 -25 31 37 -51 66 -28 2 63 -63 48 -24 -29 38 -70 50 1 -50 64 -79 33 14 -69 65 -79 2 21
5231 21 -50 76 -47 -2 31 -76 34 -27 -14 47 -69 50 -14 -16 69 -53 55 -3 -42 78 -58 46 23 -37 68
5256 68 -44 22 36 -51 50 -35 -9 46 -58 57 -28 -30 40 -77 31 -33 -32 64 -65 38 -26 -57 66 -53 32 3
5282 3 -80 69 -35 18 30 -46 69 -23 25 48 -39 67 -5 -8 58 -67 56 -4 -33 69 -58 40 7 -37 60 -50 20
5309 20 19 -56 55 -39 2 17 -65 45 -35 -15 40 -56 65 -33 -11 46 -64 34 -6 -39 60 -43 27 19 -35 77 -15 39
5337 39 24 -32 58 -40 17 43 -43 62 -31 5 57 -61 46 -20 -25 49 -55 23 -4 -46 55 -59 8 7 -57 59 -51
5364 -51 10 20 -48 51 -16 7 51 -42 51 -15 -12 50 -53 56 12 -22 56 -51 48 6 -37 68 -44 12 9 -26 60 -53
5392 -53 21 11 -64 49 -44 -13 24 -57 44 -28 -19 28 -32 30 -11 -37 62 -42 38 3 -34 64 -51 16 25 -28 62 -33 19
5421 19 38 -44 54 -39 16 55 -37 37 -7 -8 36 -43 31 15 -35 60 -51 38 -3 -37 52 -62 14 9 -48 41 -31 12 21 -41 55
5452 55 -35 -3 37 -54 50 1 -9 44 -42 50 8 -19 66 -44 53 23 -39 63 -37 -2 33 -51 40 -35 -6 15 -36 49
5480 49 -36 -13 36 -54 36 -24 -33 53 -41 45 -23 -30 57 -34 9 13 -41 40 -32 15 36 -44 57 -13 16 28 -25 49 -30 4 38
5511 38 -61 33 10 -22 43 -46 15 0 -26 56 -38 15 7 -46 47 -35 7 26 -55 43 -38 -9 37 -38 54 -27 -4 37 -52 17 -17
5542 -17 -22 59 -45 18 27 -11 51 -23 35 25 -29 65 -31 0 34 -48 27 -29 -12 40 -43 16 -22 -23 20 -26 23 -22 -33 26 -49
5573 -49 16 -1 -21 48 -40 8 18 -24 58 -39 9 47 -39 44 -19 1 43 -27 45 2 -13 55 -26 39 16 -6 61 -28 20 17 -47
5604 -47 46 -33 -2 17 -51 46 -34 -4 8 -43 24 -13 -7 43 -54 27 12 -17 40 -29 26 0 -31 44 -41 23 16 -19 45 -18 30
5635 30 17 -18 44 -22 3 40 -41 47 -5 0 39 -38 28 6 -29 39 -46 15 1 -22 22 -43 -2 7 -45 32 -35 9 18 -37 50 -24
5667 -24 23 38 -23 42 -18 8 39 -35 34 10 -3 34 -19 18 7 -17 47 -23 27 30 -42 51 -21 11 19 -29 44 -34 -9 36 -35
5698 -35 39 0 -25 23 -40 15 -3 -22 49 -37 5 -1 -43 44 -19 18 15 -17 43 -9 30 43 -27 61 -7 4 33 -32 46 0 -23
5729 -23 37 -45 34 -8 -23 35 -34 20 14 -17 33 -25 14 16 -43 33 -38 4 31 -23 17 -24 -20 21 -35 34 -5 -19 32 -19 22 0
5761 0 -28 38 -5 23 28 -26 47 -28 10 22 -22 46 -18 1 23 -33 25 -8 -13 30 -33 14 -17 -35 35 -40 30 2 -25 38 -29 23
5793 23 4 -31 34 -39 13 15 -32 42 -15 4 39 -28 41 15 -16 37 -22 37 4 -32 39 -32 18 13 -13 38 -37 23 9 -26 24
5824 24 -29 -22 25 -24 17 -16 -22 15 -40 19 -14 -6 37 -19 33 -5 -29 39 -18 37 18 -14 42 -14 19 30 -3 40 -7 27 43 -28
5856 -28 35 2 -18 19 -45 24 -8 -11 31 -37 21 -17 -36 7 -32 26 -4 -33 31 -51 4 -2 -25 31 -21 -2 27 -15 48 10 -2
5887 -2 37 -26 27 5 -1 29 -25 18 15 -8 45 -14 10 14 -25 47 -28 12 10 -32 19 -33 8 15 -43 26 -13 -18 29 -31 19 -4 -10 23
5921 23 -37 22 -4 -17 33 -29 8 10 0 32 -10 10 20 -19 47 -9 15 31 -38 30 -9 -3 21 -53 23 -10 -10 25 -40 16 -6 -24
5953 -24 17 -37 3 7 -25 11 -17 1 9 -32 27 -13 4 23 -18 27 -13 -11 20 -18 32 -9 -12 45 -3 25 3 -26 20 -27 16 22 -45
5986 -45 13 -18 9 16 -22 16 -18 -28 23 -41 20 -7 -33 29 -46 24 8 -24 12 -40 8 7 -18 40 -29 5 14 -15 36 -4 7 39
6018 39 -13 40 -1 -2 44 -23 32 15 -1 17 -14 8 -3 -9 40 -30 6 16 -35 17 -16 -3 1 -19 23 9 -3 20 -16 25 -9 -10
6050 -10 18 -25 6 -5 -20 37 -22 30 -3 -7 24 -15 0 7 -10 27 -6 -1 26 -35 14 -4 9 32 -19 21 -9 -8 22 -30 5 5 -15
6083 -15 -2 -31 45 -5 -23 16 -37 4 3 -26 25 -5 5 29 -11 25 -19 1 22 -26 22 -1 4 21 -33 18 -9 -6 18 -15 9 9
6115 9 -18 13 -20 7 19 -24 20 -3 -7 8 -31 13 -13 -10 15 -42 28 -8 -30 32 -30 8 -15 -15 23 -32 4 22 -32 41 -21 7
6147 7 7 -15 34 -5 24 13 -5 17 5 -19 26 -31 4 -21 0 13 -27 6 15 -6 8 -27 9 5 -30 16 -35 -21 13 -29 22 11
6179 11 5 9 -29 14 -18 -9 25 -18 20 4 7 26 -23 20 10 -6 4 -18 16 26 -17 24 -19 -3 21 -8 7 -12 -18 8 -35 31 -20
6212 -20 -24 17 -41 -1 -1 -23 22 -19 20 4 -17 26 -19 12 16 -19 27 -4 5 22 -23 48 -12 5 30 -14 21 8 -10 25 -17 14
6244 14 3 -14 21 -16 -5 2 -18 11 -11 -18 -2 -34 10 -15 7 9 -24 21 -21 2 15 -22 18 -14 -3 6 -6 21 0 -5 24 15 6 19
6278 19 -17 39 0 -18 9 -14 20 -6 9 15 -30 18 -26 -10 -1 -37 -7 -18 -10 16 -39 0 -1 -24 14 -16 11 -4 -13 13 -6 -8 0 -13
6312 -13 19 4 0 13 -9 16 12 16 16 -7 27 19 12 26 -2 11 9 -17 10 -21 3 8 -18 25 -23 0 25 -11 14 -8 -7 2 -11 15 -4
6347 -4 -4 10 -7 -2 -12 -6 8 -1 16 11 -6 20 -7 13 22 4 38 -3 14 29 -14 28 14 10 27 -27 3 -1 -14 23 -15 13 -12 -16 6
6382 6 0 2 1 -5 9 -8 -1 -6 -3 29 2 15 29 -5 49 -4 6 32 -24 15 1 -13 31 -28 -1 25 1 21 -4 1 7 -21 21 -1 1 10
6418 10 -22 10 -14 -7 -1 -22 11 -18 -6 -10 -24 -10 -1 -3 15 -6 4 15 -10 16 -19 9 1 -13 28 1 15 19 -19 28 -11 8 24 2
6452 2 6 -7 11 25 -10 16 4 0 13 -10 11 -9 -15 18 -1 10 -2 -28 29 -21 -12 10 -18 14 -5 0 5 -8 0 0 -3 22 -21 12 21 -7
6488 -7 21 -2 14 16 -10 33 3 3 -10 -11 17 -6 -6 17 -10 13 -9 -1 12 -17 -4 -5 -25 11 -6 -3 0 -20 15 -16 -14 3 -21 33 -31
6523 -31 -6 -1 -23 12 -3 -9 23 -7 19 0 11 15 -2 20 5 11 10 9 6 -3 -13 21 -16 0 2 -21 13 -17 -19 5 -5 13 -7 -8 0 -11
6559 -11 13 -27 -3 6 -7 5 0 -1 -2 -18 24 4 -1 15 -6 11 -9 -1 18 4 12 16 -20 38 -4 -5 20 8 21 8 -4 12 -13 2 -14
6594 -14 -7 -7 -23 -9 1 -18 5 -21 -11 3 -17 15 -20 17 10 -18 15 6 -2 20 4 12 -2 -10 36 -24 14 2 -26 14 -14 13 4 -11
6628 -11 10 -8 11 10 -15 -4 -10 -14 21 1 13 -3 -21 -7 -7 -10 -4 -10 -1 -31 5 -7 -1 17 -4 10 13 -6 9 -9 2 12 4 15 11 -2
6664 -2 14 -5 7 -5 -16 20 1 8 -9 0 14 -14 7 -13 -6 21 -9 -5 -1 -3 15 -12 -12 1 0 -5 -14 1 10 -20 5 9 -11 -1 -9 9 2 -2
6702 -2 17 -5 18 20 -11 30 -7 7 -10 -8 10 12 4 -8 -4 2 1 -6 17 -16 19 -2 -11 16 -3 -1 -7 -13 27 -7 1 0 -1 28 -5 11 2 21 15
6741 15 5 7 12 -14 20 17 -5 21 1 10 3 2 16 -14 8 7 9 6 -11 7 2 -14 2 -11 7 7 -14 0 -5 -6 -8 -3 -9 -8 -9 31 4 11 0 -4
6781 -4 12 -10 7 -5 4 8 -3 7 2 5 11 -2 -3 7 0 24 3 -11 10 -26 15 16 -17 8 -24 -1 -5 -17 -6 1 -16 8 -1 -2 -14 -10 4
6818 4 -13 10 -18 0 2 0 13 1 3 16 16 16 10 11 16 -20 13 5 4 19 -3 10 19 -12 12 11 -18 0 -20 14 -12 3 21 -32 20 -14 10
6855 10 9 -33 2 -6 -15 4 -11 -2 8 -25 19 -7 5 10 -1 30 7 7 8 1 7 9 -11 6 -2 -1 4 -1 8 2 8 1 -22 8 -21 -5 2 6 -19 -4
6895 -4 12 -10 -29 -25 -10 -18 -6 -15 1 -20 -2 5 11 16 14 -7 14 -12 1 18 -14 31 1 11 13 13 3 -3 -1 14 2 32 8 0 -18 -10 14
6932 14 3 -3 4 -9 -4 -2 -10 0 -5 -8 -2 -6 5 -4 1 12 -8 13 -9 4 3 -1 18 -4 3 20 2 1 16 17 6 2 15 25 3 29 9 20 15
6971 15 3 6 -16 5 13 -5 5 -1 -4 8 -3 -5 -20 6 2 -28 -7 -5 -2 18 -5 5 -4 -6 10 -19 -12 13 -14 33 9 1 11 5 16 5 5
7008 5 17 -1 5 -2 -3 8 -2 17 -2 0 10 10 13 -9 -21 -3 -27 -6 5 -6 16 -20 -6 2 -12 18 -7 8 -6 -6 4 15 3 25 -2
7043 -2 6 10 34 28 -1 16 12 15 26 12 12 15 0 19 -3 2 7 1 2 -19 2 11 -20 19 -4 -4 -7 -22 1 -2 -2 10 -11 -4 -3 -4 15 -15 5 -1 -3
7084 -3 15 -6 -11 10 -5 11 3 22 20 -1 11 8 15 5 1 -2 -4 -5 -5 -9 -3 -7 -3 15 -17 1 14 3 4 -18 -11 -9 -22 7 -2 7 -4 1 7 0 -3 18
7126 18 -2 4 20 9 16 -7 10 -6 0 10 5 8 -4 2 21 4 11 14 1 3 -8 -16 2 -4 6 -7 6 -10 -23 0 -14 -7 9 -12 -13 0 -10
7163 -10 6 -11 -17 14 -7 1 0 9 13 -9 12 7 -1 11 5 10 19 -2 13 15 -1 20 -18 0 -12 0 -19 -16 4 -1 -6 9 -5 -4 -4 -5 -11 -27 3
7202 3 4 -4 5 -1 16 -2 -11 -4 -17 7 17 24 12 -7 5 23 3 -13 11 4 1 8 -1 -7 -16 8 -5 0 0 -10 0 -19 7 -3 -20 18 -16 -4
7240 -4 14 -26 11 -3 -8 13 6 11 -23 -15 5 -7 11 11 -9 7 -8 6 2 1 11 -10 11 10 4 8 -1 -7 1 0 6 -12 -15 -21 -18 21 0 -13 -12 -22
7280 -22 -6 -20 -11 13 -6 -8 -10 -4 -7 -1 1 12 -3 11 -12 -6 -8 2 -2 -10 7 5 17 14 5 1 7 -1 7 -1 -14 15 -5 11 7 -12 -1 -10 -8 -2 -17 -11
7322 -11 -8 -4 2 -12 4 1 11 17 1 -6 3 -1 19 -6 9 3 -5 16 -2 7 -4 -4 13 -10 14 13 -5 15 3 -13 -5 -1 1 -6 -4 11 8 16 6 -11
7362 -11 8 5 3 -13 -13 -2 -21 2 -18 -4 -10 -2 -6 0 -9 8 3 2 12 -4 -1 -2 -6 21 5 28 14 2 27 5 11 -6 -2 14 2 -7 -2 2 4 3
7402 3 -7 5 -11 10 -6 -17 5 0 2 -15 -7 16 -19 -2 -11 -1 6 1 7 1 1 10 -8 -2 10 -6 8 6 10 7 5 13 18 13 14 -10 11 -6 -13 7 6
7443 6 -7 4 0 4 -17 -1 -1 -19 2 -22 -1 -4 -10 -15 -8 -13 -4 -5 -6 -16 5 11 -6 23 -3 5 14 9 20 11 17 24 2 0 15 8 3 2 2 -6 2 -7 13 4
7487 4 1 -1 -9 2 -6 -8 -14 -14 -10 -13 4 -4 -10 0 1 3 -3 -4 -7 -3 16 2 0 11 -4 23 9 -3 5 3 21 1 24 5 -5 0 5 2 8 3 18 7 2 0
7531 0 0 6 4 -17 -19 -24 -8 -13 -4 8 -22 2 9 2 7 9 -11 0 5 9 9 -12 18 2 -16 -3 20 26 -10 -6 10 -2 21 11 -2 2 -17 3 -3 4
7571 4 8 -9 8 -16 -8 2 -7 -17 8 -18 -18 -16 -4 2 -16 -10 -2 -8 -15 2 7 2 -4 8 -5 12 17 -5 -1 18 2 5 -5 16 6 -1 7 -1 24 0
7611 0 -11 5 -18 7 -15 2 5 1 -3 -24 -16 -1 5 3 -6 -3 3 2 -11 -4 2 4 -11 -10 -1 -3 23 -15 9 10 -9 17 32 -15 11 -1 17 -2 25
7650 25 14 -5 9 14 -5 7 -10 3 -6 -11 -6 -27 8 -8 4 -11 -1 -15 2 -5 6 -6 2 8 -19 0 -19 -3 18 22 5 9 9 13 -7 15
7686 15 6 -14 1 -14 2 9 2 -5 6 20 7 2 14 -2 -11 -6 -7 -5 -6 -21 -7 -13 -7 13 -12 -3 -11 -6 11 -21 -4 -7 -4 5 -10 9 -8 -3 14 -5
7726 -5 12 -1 -3 -6 0 6 -17 7 27 3 11 10 5 16 -6 15 -3 -7 -2 2 -7 7 7 -9 -2 0 -10 -26 1 1 -2 -16 -9 13 10 6 5 5 16 -11 9
7767 9 12 11 14 17 22 20 4 2 -2 11 18 9 13 14 -11 -3 10 11 9 -10 3 -9 -11 -8 3 -12 -18 11 -14 -37 -11 -3 -14 14 -14 -1 -9 -11 5 11 3 7 -24
7810 -24 -1 -7 -11 9 -10 17 17 0 13 16 1 -6 6 8 -5 12 -10 -8 -9 6 4 -4 10 4 12 2 -5 -35 10 5 -1 -3 -21 3 -3 -17 11 0 11
7849 11 3 0 -17 5 10 12 11 11 -4 17 -3 -6 6 -4 -3 9 1 3 12 24 4 -21 -1 2 0 16 1 -1 -11 -23 -14 -11 -25 4 7 1 5 7 -5 -14 -9
7890 -9 -18 -2 4 7 6 -1 4 17 8 14 17 0 13 3 6 -5 10 16 4 -1 13 10 -5 -14 3 -13 -10 7 2 -10 -5 -3 3 7 -6 -4 -9 3 1 -7 8 -2 -5
7933 -5 24 -2 23 22 -5 24 13 8 9 6 16 9 10 7 -2 5 -3 3 7 4 14 3 0 1 -8 6 -4 8 1 5 3 -6 -1 -3 -1 0 -8 2 -8 12 -1 6 -10 21
7977 21 2 -2 14 -4 1 -3 5 1 9 5 -2 6 -3 8 1 3 15 6 10 19 7 7 10 -9 1 0 -14 9 13 -2 8 -4 -5 -4 5 -7 -15 -11 -4 -14 6 -10 6
8020 6 4 -10 -2 3 29 2 -9 32 4 11 0 4 13 2 20 8 18 8 -2 -10 3 4 6 6 0 2 -12 -4 2 -4 7 -10 5 -11 -16 -6 31 17 8
8059 8 -9 14 2 6 20 -10 3 -2 9 18 -5 9 13 8 0 2 25 3 11 14 0 -3 16 -4 12 3 1 17 -22 -4 5 1 11 -3 -17 7 2 -13
8097 -13 -3 -2 4 -5 8 -9 1 9 4 19 -1 17 2 7 25 7 -5 1 -8 1 -1 -3 10 2 16 -1 10 9 -4 -1 4 6 18 4 6 11 7 -7 -18 -4
8137 -4 12 -15 -26 -6 -5 2 -7 0 -3 2 9 4 0 10 10 27 4 0 -3 -2 17 -7 8 4 12 11 6 -12 2 3 3 -5 0 3 -4 9 -7 4 3 5 19 3 3 2
8181 2 2 -11 -4 8 3 -8 9 -11 3 -9
8191i
$$ Imaginary data points
##PAGE= N=2
##DATA TABLE= (X++(I..I)), XYDATA
0 0 0 0 0 0 0 0 0 0 -8 8 -16 16 -24 32 -40 48 -64 80 -98 120 -145 176 -208 245 -289 338 -396 461 -534 614
30 614 -704 803 -914 1037 -1173 1324 -1491 1675 -1875 2095 -2334 2594 -2880 3194 -3535 3908
46 3908 -4316 4760 -5247 5779 -6361 7004 -7715 8503 -9381 10364 -11471 12733 -14181
59 -14181 15864 -17848 20227 -23140 26806 -31576 38063 -47463 62540 -92201 270022 -529556
71 -529556 178064 5056 -571122 855499 -483167 266261 99494 -699845 638231 -338064
81 -338064 177087 396588 -749305 492091 -354252 25680 581828 -605048 403157
90 403157 -297984 -247847 638503 -481016 421906 -143004 -451867 543011 -432735 388842
100 388842 113781 -523640 451556 -467055 244524 323966 -467296 438359 -456317 5866
110 5866 408969 -407643 491768 -329318 -202016 381678 -422554 501486 -110397 -294891
120 -294891 348226 -493588 394160 88801 -287360 384409 -521175 195888 184308 -274033
130 -274033 470449 -434295 9957 189391 -326560 514596 -258262 -83208 191072 -425938
140 -425938 449433 -89667 -95363 256790 -486779 298258 -3695 -107826 368759 -445055
150 -445055 150528 10794 -183940 446452 -320788 75866 29751 -306632 428201 -196170
160 -196170 63539 112291 -399147 330651 -135467 42462 242037 -401893 228813 -128335
170 -128335 -42294 345548 -328116 182309 -108568 -174734 364864 -246681 181838 -25299
180 -25299 -284670 310655 -213392 165964 105847 -316127 246919 -220520 87331 218235
190 218235 -278062 226421 -210842 -39306 258552 -230426 242487 -139590 -151378 234617
200 234617 -223183 241579 -20227 -198208 202438 -250243 180727 88794 -186644 209100
210 209100 -260604 71328 139720 -168904 248438 -212357 -32182 138175 -188846 271170
220 271170 -114816 -84493 132558 -239767 236166 -18800 -89841 163307 -273862 151042
230 151042 32276 -92847 223304 -251121 63597 41325 -131061 266566 -177794 15606
240 15606 49699 -197313 254279 -99296 5342 92453 -247600 192171 -55957 -5673 162782
251 162782 -244888 123394 -46854 -50769 219080 -194287 86665 -35587 -123840 225877
261 225877 -136720 81201 9921 -185510 187642 -108725 72087 84414 -201774 142499
271 142499 -109089 28099 150481 -175907 124454 -104063 -46111 175082 -143052 131831
281 131831 -63404 -114781 160067 -134718 131929 8735 -145479 137772 -148792 95609
291 95609 77879 -138791 137512 -153925 26863 112242 -124660 157249 -122390 -40924 111449
302 111449 -130850 167226 -58261 -76813 103634 -155554 141217 6583 -80117 115381
312 115381 -170833 82937 42407 -77558 145368 -151552 22702 48416 -94697 166957
322 166957 -100806 -11320 50165 -130326 155742 -46957 -18515 72158 -158863 113828 -16372
333 -16372 -23285 113118 -156123 67445 -9543 -48872 147913 -123104 41279 -3233 -93679
344 -93679 152635 -84070 35824 24312 -133040 127381 -62407 29301 71072 -143439 94824
355 94824 -58832 1347 113182 -124519 77412 -53080 -45859 127787 -97766 76298 -26024
366 -26024 -89359 114383 -84895 72450 20365 -107390 93547 -87305 47591 64315 -99378
377 -99378 86066 -86861 3302 85222 -84901 93284 -65690 -40172 82449 -83554 97545
388 97545 -24629 -63233 74226 -96245 81090 17384 -64853 78801 -105602 44059 41457
399 41457 -61853 96553 -93986 4355 46122 -71131 110324 -61148 -19735 46841 -92649
410 -92649 102982 -24150 -26144 59370 -109854 74068 -896 -29228 83488 -106188 40086
421 40086 6222 -43842 103443 -81308 18467 10589 -69949 103543 -51097 11779 26582
432 26582 -92686 83390 -32254 7097 54444 -97039 57963 -27169 -9587 80098 -82334
443 -82334 43072 -23199 -38728 88880 -62512 40670 -6743 -66840 79715 -52141 38302
454 38302 22916 -79544 65275 -52714 22718 52647 -75093 59050 -52267 -6641 68111
465 68111 -65071 62322 -38006 -36925 67135 -62113 63632 -9546 -54049 60426 -67597
476 -67597 50961 20527 -55531 60168 -70747 24003 38471 -51584 67890 -60189 -5105
487 -5105 41859 -54023 73458 -35572 -23206 40487 -64504 65916 -8336 -27964 45826
498 45826 -73353 44614 9107 -28891 59500 -69638 20133 14597 -37028 71924 -52287
509 -52287 4150 17238 -53645 72152 -31014 -1366 27459 -69174 58639 -16827 -4971
520 -4971 46160 -72674 40385 -11708 -16385 63828 -62310 27917 -7724 -36241 69686 -46583
532 -46583 23451 4188 -55225 61850 -35816 19554 24513 -62907 48585 -32359 7741 44351
544 44351 -57580 39968 -29281 -12522 53778 -47214 38324 -18341 -32907 51201 -41514 36997
556 36997 1281 -44025 44218 -42509 27688 21742 -44209 41851 -43583 9381 34137 -40499
568 -40499 45797 -36441 -10639 36614 -41221 49338 -19773 -23708 35539 -47675 44253 -532
580 -532 -27768 38554 -53139 29162 12736 -28526 46773 -49757 10875 17716 -33099 53701 -36220
593 -36220 -2195 19680 -42598 51833 -19103 -7570 25448 -50931 40124 -6744 -10346 36160
605 36160 -50994 24886 -1538 -17041 46195 -41724 14027 1449 -29005 48636 -29077 9660
617 9660 8787 -40800 42279 -20340 6968 21707 -45741 32568 -17367 -478 34977 -42241 26130
630 26130 -15344 -13922 41947 -35121 24541 -8106 -28166 40716 -30623 23199 5490 -36490
642 -36490 35622 -30152 16307 20216 -36871 32557 -29435 2923 29389 -33369 33093 -23043
654 -23043 -11889 31024 -31662 33207 -10238 -21586 28989 -33436 27865 4150 -24255 28853
666 28853 -34984 16211 13982 -23720 32311 -31306 2771 17443 -25381 35770 -21416 -6747
678 -6747 18284 -30746 34196 -9348 -10685 21554 -36192 26265 -471 -12518 28612 -36566
690 -36566 15666 3634 -16999 35636 -30341 7513 6130 -25202 37486 -20992 3429 11396
702 11396 -33282 32606 -13457 518 20291 -36212 24348 -9546 -5154 29063 -32526 17563
714 17563 -6617 -14451 32956 -25497 14197 -861 -23814 30604 -19932 11701 8523 -28732
726 -28732 25233 -17639 6346 18333 -27944 21394 -16129 -2826 24257 -24498 20652 -11582
738 -11582 -12811 25057 -22506 20381 -2939 -19546 23343 -23288 16805 7028 -21555 22990
750 22990 -24205 8755 14194 -21253 24987 -21455 -1017 17088 -22018 26710 -13983 -8428
762 -8428 17716 -24851 24632 -4505 -11857 19317 -27277 17783 2914 -13178 22881 -25941
774 -25941 8880 6608 -15512 26133 -20021 1817 8383 -19855 25899 -12139 -1776 11325
786 11325 -24136 21333 -5909 -3753 16533 -25321 14882 -2802 -7184 21948 -22412 9815
798 9815 -902 -13045 24479 -17466 7368 2753 -19374 23054 -13526 5655 9060 -22999 19389
811 19389 -11666 1957 15946 -22649 16313 -10167 -4550 20299 -19918 14909 -6458 -11787
823 -11787 20744 -17543 13642 60 -16593 18838 -16642 10171 7402 -17747 17211 -15834
835 -15834 3885 12535 -16687 17097 -12958 -3303 14307 -16052 17162 -7277 -8556 14158 -17014
848 -17014 15218 -590 -10835 14654 -18231 10486 4589 -11533 16737 -17395 4472 7192
860 7192 -12975 19032 -13628 -459 8518 -15982 19188 -8236 -3253 10641 -19102 16191 -3542
873 -3542 -5003 14292 -19926 11299 -673 -7603 17937 -17528 6850 1348 -11669 19305 -13141
886 -13141 4016 4211 -15739 17522 -9117 1980 8555 -17694 13873 -6614 -966 13049 -16714
899 -16714 10592 -4840 -5452 15682 -14051 8764 -2078 -10295 15665 -11779 7565 2369 -13572
912 -13572 14105 -10847 5182 7404 -14446 12894 -10271 905 11179 -13889 12759 -8330
924 -8330 -4231 12754 -13503 12720 -4252 -8345 12889 -13945 11078 906 -10357 13089 -14284
937 -14284 7186 5181 -11032 13966 -12931 2131 7544 -11688 14682 -9307 -2189 8616 -13014
950 -13014 13770 -4539 -4718 9715 -14240 10712 -442 -6036 11600 -14027 6513 2013 -7606
963 -7606 13530 -11789 2890 3508 -10067 14161 -8436 662 5381 -12730 12825 -5412 -816
976 -816 8336 -14150 10260 -3496 -2931 11560 -13592 7816 -2018 -6200 13574 -11609 6130
989 6130 215 -9774 13551 -9570 4686 3684 -12160 12063 -8091 2405 7491 -12598 10369
1002 10369 -6758 -1129 10173 -11538 9187 -4552 -5068 11021 -10351 8158 -1142 -7996 10526
1015 10526 -9719 6325 2744 -9260 10000 -9280 3265 5794 -9415 10102 -8018 -400
1027 -400 7400 -9579 10348 -5426 -3476 8101 -10386 9726 -2083 -5334 8897 -11253 7605
1040 7605 926 -6412 10196 -11096 4522 2962 -7623 11528 -9323 1556 4329 -9339 11712
1053 11712 -6454 -607 5859 -10951 10236 -3578 -2188 7844 -11464 7638 -1412 -3893 9772
1066 9772 -10402 4993 166 -6120 10722 -8270 3092 1963 -8403 10211 -6153 1656 4370
1079 4370 -9817 8750 -4664 -50 6926 -9952 7261 -3565 -2497 8794 -9146 6316 -2024
1092 -2024 -5260 9479 -8264 5533 410 -7459 9224 -7737 4140 3300 -8548 8790 -7203
1105 -7203 1723 5749 -8714 8568 -5919 -1237 7115 -8612 8219 -3550 -3836 7603 -8649
1118 -8649 7117 -594 -5434 7841 -8568 4915 2037 -6209 8219 -7754 2154 3760 -6789
1131 -6789 8560 -5966 -369 4755 -7610 8249 -3565 -2073 5649 -8445 6958 -1342 -3192
1144 -3192 6898 -8687 5025 239 -4352 8172 -7923 3144 1416 -5899 8906 -6436 1657
1157 1657 2764 -7553 8547 -4790 439 4561 -8596 7370 -3381 -1004 6472 -8584 5925
1170 5925 -2131 -3016 7772 -7662 4629 -582 -5099 8050 -6443 3442 1445 -6635 7454 -5406
1184 -5406 1968 3655 -7220 6602 -4486 -17 5371 -7036 5959 -3237 -2212 6259 -6645
1197 -6645 5425 -1457 -4036 6478 -6471 4547 638 -5166 6564 -6332 3022 2525 -5740 6818
1211 6818 -5805 1046 3846 -6203 7054 -4514 -852 4690 -6783 6760 -2641 -2338 5414 -7279
1225 -7279 5625 -698 -3379 6243 -7187 3854 836 -4347 6973 -6263 1989 2034 -5387 7128
1239 7128 -4660 455 3113 -6353 6484 -3005 -724 4355 -6834 5267 -1647 -1893 5585 -6567
1253 -6567 3935 -566 -3256 6414 -5748 2859 569 -4705 6552 -4833 1953 1990 -5845 6163
1267 6163 -4060 885 3602 -6344 5596 -3343 -615 4956 -6280 5043 -2308 -2320 5745 -5962
1281 -5962 4447 -785 -3859 5946 -5599 3474 1015 -4837 5854 -5133 1990 2647 -5244 5702
1295 5702 -4285 179 3780 -5392 5455 -2942 -1475 4398 -5530 4829 -1268 -2699 4797 -5607
1309 -5607 3745 305 -3478 5249 -5331 2339 1522 -4115 5630 -4583 899 2396 -4819 5737
1323 5737 -3452 -242 3231 -5531 5293 -2191 -1181 4167 -5910 4389 -1053 -2162 5098 -5705
1337 -5705 3260 -64 -3263 5716 -4971 2165 1005 -4401 5694 -3975 1144 2243 -5169 5144
1351 5144 -2976 27 3484 -5383 4329 -2028 -1247 4445 -5093 3522 -988 -2575 4884 -4526 2774
1366 2774 272 -3689 4865 -3998 1900 1610 -4337 4635 -3504 762 2805 -4579 4440 -2839 -547
1381 -547 3643 -4634 4192 -1831 -1805 4096 -4694 3711 -570 -2754 4424 -4673 2808 713 -3415 4670
1397 4670 -4336 1586 1775 -3922 4828 -3552 286 2581 -4359 4609 -2367 -831 3202 -4655 3965
1412 3965 -1118 -1700 3802 -4647 2941 -23 -2466 4312 -4194 1852 853 -3209 4532 -3412 877
1427 877 1646 -3884 4360 -2538 61 2485 -4341 3871 -1765 -742 3352 -4450 3226 -1039 -1663 4017
1443 4017 -4221 2587 -252 -2666 4348 -3792 1944 742 -3489 4293 -3264 1179 1820 -3974 4032
1458 4032 -2691 162 2785 -4124 3647 -1953 -989 3422 -3997 3193 -957 -2014 3710 -3784 2534
1473 2534 186 -2771 3789 -3481 1614 1251 -3225 3766 -3019 565 2081 -3498 3698 -2277 -462
1488 -462 2627 -3687 3422 -1363 -1283 3068 -3830 2898 -411 -1932 3464 -3796 2158 427 -2506 3814
1504 3814 -3454 1304 1137 -3074 3962 -2805 456 1815 -3569 3770 -2023 -296 2491 -3867 3249
1519 3249 -1198 -1060 3135 -3786 2510 -435 -1822 3563 -3392 1761 338 -2570 3635 -2821 1023
1534 1023 1146 -3109 3414 -2217 322 1972 -3384 3046 -1633 -487 2663 -3368 2639 -1025 -1305
1549 -1305 3067 -3208 2223 -256 -2067 3239 -2984 1714 558 -2611 3247 -2748 1035 1357 -2933
1564 -2933 3205 -2330 215 2007 -3113 3063 -1708 -639 2459 -3181 2736 -900 -1378 2748 -3157
1579 -3157 2159 -11 -1906 2959 -2927 1390 740 -2322 3071 -2470 566 1354 -2633 2973 -1794
1594 -1794 -159 1840 -2877 2674 -1072 -782 2260 -2972 2174 -424 -1312 2644 -2857 1586 159
1609 159 -1811 2893 -2525 1028 681 -2315 2911 -2083 503 1264 -2698 2744 -1619 -47 1850 -2862
1625 -2862 2419 -1112 -674 2348 -2811 2019 -544 -1328 2638 -2573 1567 128 -1908 2678 -2249
1640 -2249 1019 814 -2304 2565 -1859 367 1455 -2466 2351 -1390 -346 1895 -2471 2064 -816
1655 -816 -979 2172 -2403 1709 -162 -1510 2311 -2265 1258 464 -1834 2393 -2046 691 995 -2072
1671 -2072 2390 -1682 85 1407 -2278 2303 -1186 -473 1756 -2423 2044 -613 -925 2049 -2428
1686 -2428 1581 -56 -1331 2284 -2231 1041 465 -1739 2362 -1867 481 923 -2063 2261 -1366
1701 -1366 -18 1350 -2245 1974 -861 -521 1765 -2241 1597 -358 -988 2055 -2077 1180 93
1716 93 -1430 2153 -1819 788 564 -1781 2117 -1501 351 1034 -2012 1973 -1173 -91 1453 -2082
1732 -2082 1763 -833 -592 1748 -2050 1506 -382 -1074 1918 -1934 1199 146 -1450 1978 -1754
1747 -1754 759 663 -1698 1935 -1477 254 1087 -1824 1844 -1053 -275 1409 -1873 1632 -580 -744
1763 -744 1621 -1844 1326 -50 -1098 1746 -1724 863 394 -1344 1820 -1489 410 747 -1564 1796
1779 1796 -1187 1 1048 -1752 1663 -793 -364 1316 -1805 1423 -401 -712 1573 -1778 1127
1794 1127 -46 -1014 1744 -1612 760 303 -1314 1791 -1341 410 689 -1562 1690 -1042 67 1039
1810 1039 -1672 1494 -707 -364 1353 -1659 1223 -337 -759 1514 -1543 918 48 -1095 1576 -1354
1826 -1354 609 444 -1337 1534 -1141 253 822 -1486 1440 -876 -136 1112 -1529 1298 -580 -493
1842 -493 1295 -1492 1124 -218 -828 1416 -1442 883 151 -1045 1488 -1335 538 514 -1246 1494
1858 1494 -1116 167 782 -1394 1430 -810 -213 1034 -1452 1242 -444 -520 1220 -1487 974 -72
1874 -72 -795 1363 -1348 645 260 -1046 1417 -1123 328 560 -1237 1390 -845 11 821 -1346 1232
1891 1232 -569 -268 1054 -1380 1041 -296 -555 1231 -1292 806 -12 -837 1331 -1184 572 256
1907 256 -1059 1337 -1018 308 573 -1235 1278 -835 11 841 -1292 1146 -587 -303 1054 -1274
1923 -1274 993 -283 -593 1175 -1207 788 57 -861 1227 -1082 488 376 -1014 1209 -904 190
1939 190 672 -1140 1130 -652 -140 867 -1175 1021 -407 -429 1005 -1169 832 -98 -651 1089 -1098
1956 -1098 607 178 -842 1141 -989 348 423 -969 1159 -805 99 603 -1081 1098 -553 -145
1972 -145 791 -1129 950 -304 -378 970 -1103 748 -74 -608 1055 -1009 510 185 -801 1094 -849
1989 -849 262 416 -974 1024 -649 12 632 -1026 896 -427 -226 815 -1004 738 -199 -454 910
2006 910 -961 575 33 -656 968 -819 377 250 -807 948 -719 188 485 -874 914 -570
2022 -570 -20 623 -902 824 -382 -250 750 -901 687 -167 -432 813 -865 524 66 -600 853
2039 853 -784 325 280 -715 859 -634 96 448 -792 811 -452 -121 598 -812 694 -237 -310 693
2057 693 -810 550 -29 -449 774 -729 381 158 -573 798 -632 189 306 -669 781 -489 32
2074 32 451 -740 705 -356 -129 556 -757 593 -202 -277 660 -716 469 -46 -410 715 -659 353
2092 353 133 -542 745 -558 189 300 -650 678 -441 4 457 -678 597 -291 -162 551 -675 492
2110 492 -122 -333 650 -619 386 55 -483 648 -564 236 223 -557 631 -487 71 362 -616 589
2128 589 -358 -87 453 -629 563 -217 -217 527 -608 463 -60 -315 583 -603 345 82 -427 616 -528
2147 -528 209 224 -517 631 -425 56 330 -564 596 -306 -77 444 -620 491 -149 -229 544 -590 386
2166 386 -15 -347 573 -526 251 133 -470 582 -435 93 247 -547 569 -331 -24 365 -561 506
2184 506 -216 -136 475 -559 426 -108 -247 528 -524 339 10 -341 541 -467 226 142 -446 531 -407 107
2204 107 259 -489 507 -319 -23 357 -515 459 -210 -153 423 -516 372 -67 -269 484 -475 265 71 -358
2224 -358 496 -413 152 202 -428 481 -344 21 310 -465 470 -199 -87 375 -467 392 -103 -195 414 -458 304
2245 304 -8 -302 441 -421 186 95 -328 467 -362 89 187 -398 436 -262 4 264 -444 387 -191 -86 352
2266 352 -421 333 -63 -189 398 -410 257 -2 -280 417 -356 157 114 -314 429 -304 77 209 -399 384
2286 384 -230 -45 282 -409 334 -141 -149 357 -396 266 -33 -228 389 -358 191 64 -313 394 -332 100 143
2307 143 -333 374 -248 34 227 -349 336 -184 -73 297 -376 317 -99 -154 346 -365 253 -4 -218 352
2327 352 -333 175 96 -285 365 -282 75 185 -344 366 -222 -24 256 -382 322 -136 -119 319 -381 263 -50
2348 -50 -202 345 -353 193 46 -261 379 -316 124 132 -309 367 -255 33 192 -351 341 -173 -53 276 -350
2369 -350 300 -101 -142 304 -363 237 -36 -204 330 -329 169 68 -269 365 -291 84 119 -325 349 -223 -7
2390 -7 211 -346 315 -153 -76 288 -342 274 -70 -149 330 -331 212 10 -229 349 -300 139 110 -282 350 -256
2412 -256 57 168 -317 339 -197 -33 232 -342 290 -149 -120 274 -343 234 -34 -189 308 -312 190 16
2432 16 -242 319 -289 100 105 -257 316 -236 64 175 -296 312 -173 -38 217 -311 270 -108 -84 268 -307
2453 -307 231 -35 -164 298 -296 168 37 -232 319 -258 80 95 -261 297 -215 9 160 -314 272 -163
2473 -163 -61 224 -290 251 -94 -107 251 -291 206 -7 -159 273 -288 139 54 -213 287 -250 98 107 -232
2494 -232 290 -177 17 162 -274 274 -139 -49 191 -297 235 -85 -116 257 -277 172 -11 -179 265 -277 119
2515 119 50 -208 277 -211 66 114 -252 271 -166 6 178 -258 267 -102 -56 202 -266 193 -50 -118 243
2536 243 -266 170 10 -137 263 -231 105 61 -201 258 -202 65 91 -225 252 -167 -8 136 -260 238 -127
2557 -127 -69 208 -268 195 -57 -107 225 -227 157 3 -168 251 -203 101 68 -210 264 -175 49 117 -234
2578 -234 243 -157 -13 172 -245 235 -101 -75 213 -260 191 -54 -147 217 -254 142 20 -181 247 -216 96
2599 96 67 -208 232 -192 55 125 -237 231 -147 -26 160 -223 218 -97 -64 206 -237 185 -29 -94 228 -208
2621 -208 124 19 -164 230 -206 81 73 -202 236 -167 18 114 -224 221 -124 -31 160 -245 184 -80 -95 194
2643 194 -233 142 -20 -139 211 -232 129 33 -149 213 -177 82 97 -188 233 -160 37 129 -215 227 -106
2664 -106 -30 169 -211 193 -70 -68 190 -225 158 -26 -123 192 -212 127 24 -168 220 -196 55 81 -197 212
2686 212 -140 18 113 -224 192 -101 -33 147 -218 172 -50 -73 182 -180 139 -7 -113 187 -184 99 31
2707 31 -135 202 -170 57 84 -188 196 -124 19 112 -181 182 -92 -16 128 -208 159 -70 -74 180 -197 131
2729 131 -3 -115 193 -184 108 32 -149 185 -158 64 79 -166 195 -111 10 109 -169 181 -90 -18 147
2750 147 -178 150 -38 -71 179 -171 108 -2 -89 176 -171 73 45 -142 176 -152 37 68 -185 180 -115
2771 -115 13 89 -163 165 -89 -39 132 -173 148 -49 -57 149 -172 108 -1 -109 174 -149 83 30 -129 178
2793 178 -117 24 87 -165 154 -91 -11 104 -172 142 -67 -57 124 -179 123 -28 -89 149 -161 83 20 -118
2815 -118 159 -133 59 26 -129 158 -111 15 78 -164 160 -96 -17 127 -137 137 -47 -68 128 -156 110
2836 110 4 -93 158 -151 75 18 -126 167 -135 53 58 -141 162 -106 10 100 -164 126 -86 -49 124 -163
2858 -163 112 -29 -61 138 -157 90 7 -105 146 -145 63 35 -129 155 -130 46 75 -144 154 -95 -19 96
2880 96 -150 134 -63 -41 123 -155 112 -21 -72 132 -149 90 3 -95 131 -131 52 40 -142 147 -125 12
2902 12 74 -160 129 -79 -14 97 -142 123 -52 -38 138 -138 111 -5 -55 143 -119 87 38 -89 147 -119
2924 -119 38 53 -123 127 -86 13 74 -135 144 -63 -16 89 -136 101 -45 -50 115 -145 91 -25 -91 112
2946 112 -123 74 24 -114 139 -115 25 42 -109 138 -69 26 89 -120 148 -50 -19 100 -122 102 -24 -49
2968 -49 108 -129 91 -6 -76 124 -114 47 25 -98 106 -93 22 36 -117 128 -102 6 53 -119 106 -52
2990 -52 -31 79 -122 82 -18 -57 93 -117 66 -13 -63 113 -96 50 31 -95 110 -89 45 61 -120 117
3012 117 -62 6 83 -108 90 -46 -28 83 -118 74 -33 -72 88 -132 68 -5 -85 108 -105 45 8 -82 101
3035 101 -85 25 42 -83 107 -76 -12 83 -106 101 -45 -13 92 -116 90 -12 -48 85 -109 75 10 -59
3057 -59 109 -94 56 19 -83 109 -67 -1 42 -100 81 -69 -17 57 -98 98 -59 -28 75 -100 77 -24
3079 -24 -48 95 -97 64 5 -58 104 -83 56 24 -74 108 -81 12 46 -81 83 -59 9 65 -95 90 -48
3102 -48 -23 69 -110 70 -17 -58 80 -106 66 -8 -66 88 -111 39 17 -66 89 -86 28 39 -107 113 -65
3125 -65 -5 55 -85 86 -40 -13 72 -117 90 -14 -54 86 -108 64 -18 -63 90 -112 57 13 -81 88 -92
3148 -92 30 30 -95 94 -88 -6 46 -109 85 -54 -11 83 -114 69 -49 -38 100 -100 73 -14 -55 84 -97
3171 -97 62 -7 -52 98 -97 35 41 -70 111 -62 7 55 -126 87 -60 -17 74 -105 90 -58 -50 86 -102 66
3195 66 -28 -66 103 -108 30 -31 -96 90 -103 46 32 -102 109 -77 5 46 -96 111 -69 -13 89 -90 83
3218 83 -35 -27 91 -107 80 0 -46 105 -120 57 5 -67 102 -89 26 32 -103 105 -82 5 55 -105 94 -74
3242 -74 -17 59 -110 74 -23 -38 83 -98 68 -3 -57 86 -82 52 14 -69 115 -82 44 40 -74 97 -69 2
3266 2 66 -96 104 -58 -11 66 -78 79 -42 -25 90 -86 65 -10 -62 83 -100 52 6 -88 82 -84 31
3289 31 31 -80 101 -69 -5 58 -88 93 -34 -9 87 -82 71 -34 -28 68 -92 67 -19 -43 81 -99 40 11
3313 11 -60 95 -93 19 30 -95 85 -71 14 43 -86 81 -57 1 45 -98 65 -31 -10 76 -93 55 -13 -40
3337 -40 86 -79 51 24 -55 80 -71 27 30 -67 85 -58 25 69 -78 74 -38 -10 49 -92 69 -37 -34 88
3361 88 -94 59 -19 -44 66 -84 27 10 -66 69 -62 32 19 -63 80 -62 21 51 -62 90 -46 -18 67 -73
3385 -73 83 -9 -29 84 -61 69 -8 -36 86 -60 35 14 -61 66 -76 21 24 -78 69 -69 12 39 -74 85
3409 85 -53 -13 46 -80 71 -34 -17 58 -87 47 -7 -34 58 -77 51 9 -44 79 -62 37 44 -61 83 -72
3433 -72 8 36 -53 87 -32 14 55 -73 59 -40 -19 47 -60 59 -16 -44 72 -78 31 -20 -48 74 -69 29 13
3458 13 -65 72 -53 16 44 -43 69 -36 12 34 -61 74 -10 -1 75 -71 59 -16 -32 69 -68 58 -2 -36 68
3483 68 -59 33 19 -56 60 -58 4 21 -60 47 -58 -1 23 -83 61 -17 -14 37 -75 59 -13 -34 49 -67 43
3508 43 17 -47 50 -67 50 14 -46 64 -58 29 32 -49 71 -53 2 39 -61 55 -53 -11 51 -66 38 -20 -44
3533 -44 49 -74 34 -6 -46 65 -83 28 -1 -54 37 -64 11 26 -65 58 -49 17 37 -57 40 -31 -19 61 -64 49
3559 49 -19 -23 67 -63 52 6 -30 52 -56 15 15 -51 60 -60 0 30 -79 42 -43 -8 30 -71 55 -36 -4 61 -73
3586 -73 40 -8 -48 61 -75 49 -1 -37 75 -65 34 13 -49 69 -63 7 30 -82 62 -45 -1 39 -69 57
3610 57 -29 -14 57 -63 44 -36 -37 64 -65 45 -30 -54 53 -58 24 11 -62 53 -55 4 16 -64 58 -39 -4 48
3636 48 -49 51 -22 -10 44 -63 57 -26 -25 67 -71 47 -3 -37 67 -70 26 8 -56 61 -49 0 9 -66 69 -37
3662 -37 -10 28 -95 50 -50 -22 39 -73 50 -30 -44 69 -84 43 -14 -40 77 -74 29 28 -39 74 -52 29
3686 29 22 -70 92 -44 -1 36 -55 80 -18 -33 62 -84 39 -19 -45 57 -66 43 -9 -47 66 -75 17 2 -60 74
3712 74 -80 31 26 -70 81 -62 10 28 -66 69 -48 3 57 -61 75 -22 -32 59 -82 42 -5 -40 72 -63 50
3737 50 7 -48 75 -54 13 35 -63 78 -65 -7 43 -81 65 -55 -33 48 -98 56 -23 -45 47 -65 63 0 -51
3762 -51 64 -57 48 7 -41 81 -48 26 33 -55 87 -42 -5 58 -64 60 -28 -5 56 -100 60 -2 -32 66 -62
3787 -62 52 -4 -50 60 -65 25 2 -71 80 -65 10 23 -66 94 -40 2 52 -72 51 -32 -23 56 -75 56 -2
3812 -2 -33 76 -79 54 4 -48 82 -39 31 17 -43 80 -51 22 31 -75 65 -35 6 52 -101 56 -34 -27 57 -80
3838 -80 59 -27 -34 82 -92 37 7 -43 85 -72 32 2 -52 97 -55 -2 54 -70 78 -45 -4 58 -75 67
3862 67 -28 -16 78 -71 56 -10 -29 81 -83 42 -6 -54 77 -75 11 12 -69 87 -67 12 39 -79 83 -49 -17
3887 -17 53 -77 85 -22 -22 58 -80 75 -17 -32 101 -79 58 19 -51 85 -70 28 32 -56 78 -70 17 37 -88
3912 -88 74 -50 -6 54 -90 53 -31 -33 48 -90 64 -22 -43 76 -93 27 3 -73 94 -96 19 25 -75 82
3936 82 -51 16 49 -72 75 -37 -7 77 -92 66 -32 -29 82 -104 62 -5 -58 74 -93 54 17 -72 96 -77
3960 -77 25 30 -84 95 -73 -3 65 -86 100 -62 -30 64 -91 69 -25 -53 78 -79 58 -1 -55 93 -78 58
3984 58 14 -52 97 -68 44 40 -74 79 -59 7 52 -95 83 -42 3 44 -89 75 -14 -32 69 -101 50 -3
4008 -3 -57 79 -80 70 12 -57 80 -82 40 49 -74 77 -63 -5 61 -96 79 -46 -23 65 -82 74 -22 -34
4032 -34 91 -80 74 -5 -63 99 -98 28 24 -94 82 -62 17 41 -90 86 -63 -7 54 -111 81 -42 -36 66
4056 66 -86 70 -30 -46 74 -91 57 12 -68 94 -72 38 34 -69 98 -60 19 49 -81 100 -55 -10 69
4079 69 -100 82 -42 -25 79 -92 71 -13 -45 88 -82 40 9 -75 89 -81 38 18 -81 86 -63 21 34
4102 34 -94 87 -65 -15 69 -110 85 -37 -30 76 -85 71 -9 -50 80 -94 44 17 -72 95 -87 22 29 -103
4126 -103 102 -61 -5 55 -116 78 -52 -15 73 -103 83 -36 -52 90 -93 69 -20 -74 82 -107 30 -11 -70
4149 -70 105 -83 18 34 -81 83 -72 20 61 -91 86 -44 -17 71 -105 59 -27 -36 79 -100 50 0 -73 89
4173 89 -101 36 -2 -89 106 -89 3 47 -98 92 -72 -4 62 -79 90 -36 -20 70 -105 64 -14 -50 88 -105
4197 -105 45 10 -68 97 -100 40 39 -80 104 -69 10 48 -100 79 -76 -6 49 -97 77 -39 -35 61 -96 57
4221 57 -27 -65 83 -100 41 -22 -73 87 -84 49 42 -76 87 -49 12 50 -90 94 -37 -13 80 -95 89 -25
4245 -25 -46 86 -82 85 -12 -40 88 -83 44 10 -63 88 -83 37 13 -90 83 -60 -8 49 -105 80 -43
4268 -43 -31 77 -114 73 -33 -27 82 -91 59 -6 -58 85 -102 34 14 -64 107 -79 22 35 -83 97 -77
4291 -77 8 51 -107 86 -49 -8 76 -86 80 -32 -48 88 -111 54 -12 -67 97 -79 32 7 -75 92 -98
4314 -98 24 35 -79 90 -55 -9 54 -87 92 -38 -13 79 -91 68 -30 -33 91 -86 68 -2 -41 91 -97 51
4338 51 24 -100 77 -91 1 45 -105 73 -78 -9 55 -102 81 -37 -31 79 -121 56 -40 -41 87 -96 55 -2
4362 -2 -72 104 -84 31 43 -84 100 -76 10 44 -98 101 -55 -6 72 -102 95 -33 -43 94 -105 46 -30
4385 -30 -54 92 -106 52 11 -87 93 -86 21 38 -80 103 -76 5 51 -107 99 -58 -21 74 -109 80 -21
4408 -21 -41 88 -108 74 -20 -63 104 -103 43 27 -81 104 -84 18 40 -95 86 -89 -16 52 -118 79 -47
4431 -47 -26 51 -112 73 -46 -51 87 -107 50 -13 -75 103 -106 39 13 -80 98 -85 30 42 -85 130 -70
4454 -70 12 68 -88 107 -40 -14 96 -100 99 -17 -39 94 -99 58 -14 -71 85 -91 19 14 -87 100 -89
4477 -89 26 29 -94 88 -71 -4 69 -117 73 -55 -42 79 -91 76 -14 -50 85 -87 69 2 -71 107 -105
4500 -105 43 18 -88 92 -81 19 45 -80 92 -53 -4 58 -128 70 -51 -54 75 -128 53 -38 -78 88 -110
4523 -110 48 -15 -98 91 -109 26 33 -97 109 -66 10 66 -90 100 -54 -7 67 -99 89 -37 -38 104 -114
4546 -114 72 -2 -53 87 -113 46 -1 -71 92 -79 14 28 -92 82 -86 0 48 -109 88 -70 -22 80 -107
4569 -107 78 -50 -42 80 -119 62 -3 -47 111 -98 53 35 -82 102 -95 20 47 -107 111 -69 -4 57 -107
4592 -107 105 -51 6 64 -95 74 -34 -44 80 -102 57 -24 -72 91 -121 42 22 -77 98 -102 10 42 -105
4615 -105 86 -93 -19 65 -100 109 -41 4 78 -115 82 -13 -38 78 -112 70 -5 -79 104 -108 46 21 -83
4638 -83 95 -70 19 51 -91 98 -65 -6 71 -105 84 -52 -25 71 -98 76 -26 -55 96 -106 49 -5 -61
4661 -61 98 -93 39 25 -77 104 -78 22 47 -80 109 -82 13 75 -99 81 -43 -31 77 -97 62 -27
4683 -27 -60 77 -114 30 -14 -88 96 -107 19 4 -82 84 -74 0 30 -105 77 -70 -18 67 -91 71 -37
4706 -37 -48 86 -91 76 -1 -37 88 -94 63 -4 -58 106 -72 34 29 -75 93 -71 1 55 -98 67 -53
4729 -53 -7 62 -107 86 -28 -45 82 -108 54 -15 -44 96 -95 19 -2 -67 80 -89 26 33 -89 99 -70
4752 -70 2 70 -98 97 -47 -22 72 -82 87 -35 -26 93 -90 86 -9 -49 99 -92 50 19 -76 87 -79 31
4776 31 41 -98 96 -66 6 55 -86 81 -52 -19 74 -88 69 -23 -21 87 -77 62 10 -54 89 -62 53 15
4800 15 -63 81 -69 36 48 -61 99 -56 -11 50 -92 85 -25 -16 84 -94 65 -24 -49 87 -112 50 9
4823 9 -71 81 -80 39 24 -75 88 -71 10 41 -76 92 -38 6 64 -99 91 -28 -23 84 -94 72 -9 -54
4847 -54 88 -77 52 14 -61 93 -101 23 1 -101 65 -78 1 33 -78 64 -63 -8 60 -97 67 -32 -27 63
4871 63 -100 53 4 -52 85 -73 47 14 -51 77 -51 60 44 -76 91 -59 11 56 -79 79 -32 -8 51
4894 51 -78 68 -28 -33 74 -91 52 -15 -58 78 -84 28 8 -72 95 -96 21 37 -84 78 -53 12 49 -80
4918 -80 81 -45 -10 49 -78 81 -21 -28 74 -76 51 -15 -51 79 -70 41 19 -70 80 -63 22 31 -76 80
4942 80 -52 8 37 -78 66 -45 -26 52 -91 40 -18 -34 79 -69 49 1 -52 66 -86 30 23 -40 99 -56
4966 -56 41 49 -59 89 -41 1 78 -79 68 -19 -16 73 -82 57 -31 -28 91 -75 39 6 -66 72 -80 47 9
4991 9 -80 73 -66 1 29 -97 79 -51 -8 40 -77 61 -23 -29 68 -82 51 -11 -28 79 -69 49 6 -44 95
5016 95 -65 20 22 -58 84 -42 1 45 -77 65 -51 -12 58 -81 66 -31 -33 57 -84 49 -11 -42 65 -97 40
5041 40 -2 -63 44 -59 23 25 -77 56 -60 -6 45 -60 77 -34 5 59 -68 61 -24 -27 53 -72 52 -10 -36
5066 -36 65 -67 31 14 -75 62 -82 22 25 -66 53 -48 10 37 -80 48 -33 -19 55 -93 59 -4 -30 55 -68
5091 -68 48 10 -53 83 -72 28 30 -64 90 -49 15 34 -55 72 -58 4 35 -55 66 -36 -36 55 -78 40 -16
5116 -16 -34 48 -94 29 -4 -37 43 -69 21 16 -67 55 -59 6 37 -60 59 -37 1 37 -55 53 -33 -24 74 -71 51
5143 51 -21 -27 66 -63 34 3 -50 63 -49 25 16 -57 73 -61 10 39 -80 51 -35 -7 38 -54 41 -23 -20 34 -64 48
5171 48 -10 -38 70 -61 50 5 -51 77 -58 28 20 -49 69 -42 -3 27 -59 55 -34 -6 49 -63 58 -18 -26 44
5197 44 -66 55 -25 -44 59 -69 31 -4 -70 52 -64 19 -2 -67 61 -36 -10 41 -57 62 -25 -17 55 -65 55
5222 55 -10 -22 45 -64 53 7 -39 84 -57 34 13 -64 60 -64 2 10 -65 56 -35 8 31 -78 67 -44 -26 42
5248 42 -69 51 -34 -20 63 -68 31 -21 -58 65 -66 31 5 -63 71 -49 10 19 -61 67 -35 16 29 -56 63 -32
5274 -32 -11 44 -73 36 -9 -43 51 -74 38 -6 -47 39 -63 10 7 -61 62 -68 2 10 -67 65 -44 -3 38 -47 54
5301 54 -19 -30 47 -58 62 -8 -37 69 -53 32 11 -28 69 -42 32 28 -45 72 -36 10 12 -61 51 -38 3 44 -51
5328 -51 61 -20 -15 37 -71 30 -25 -30 51 -60 25 1 -36 59 -38 24 12 -57 74 -34 6 36 -63 65 -18 -4 51 -48
5356 -48 65 -10 -15 44 -54 33 -18 -36 55 -65 30 1 -50 52 -39 -3 28 -56 35 -25 -6 35 -70 42 -29 -3 37 -73
5384 -73 43 -1 -19 66 -41 29 4 -32 47 -44 17 16 -39 63 -19 11 29 -38 66 -31 -8 52 -53 46 -24 -19 25 -67 41
5413 41 -11 -39 46 -49 35 -5 -44 54 -43 13 -3 -52 46 -51 -2 18 -52 59 -37 -8 49 -71 40 -7 -11 55 -63 35 -3
5442 -3 -17 46 -39 28 8 -45 46 -45 25 21 -46 44 -36 2 17 -62 41 -24 -21 22 -60 29 -13 -28 42 -44 30 3 -34 63 -44
5473 -44 24 5 -24 61 -45 18 24 -53 54 -22 -1 30 -43 53 -19 -13 46 -54 33 -17 -28 38 -63 11 -3 -38 35 -39 17
5502 17 10 -46 37 -29 11 17 -56 34 -35 -3 26 -55 31 -27 10 49 -53 35 -19 -19 43 -47 41 3 -28 36 -36 19 17 -41 62
5533 62 -35 -2 30 -42 54 -34 -7 12 -45 32 -39 -23 35 -52 29 -15 -18 33 -42 24 6 -34 26 -40 1 2 -42 52 -38 0 36
5564 36 -32 42 -24 -8 45 -45 53 -5 -18 41 -49 22 -17 -24 38 -38 8 7 -35 45 -50 -3 17 -42 36 -17 -2 3 -54 33 -40 -14
5596 -14 31 -50 19 -19 -15 29 -43 34 9 -22 49 -42 19 -7 -35 49 -38 -4 39 -48 38 -16 9 23 -40 37 -10 -13 14 -54 9
5627 9 -20 -37 45 -52 30 17 -30 31 -46 9 2 -43 35 -51 4 10 -32 52 -14 4 19 -41 29 -13 -8 28 -44 36 -8 -10 50 -52
5659 -52 12 5 -27 39 -37 11 12 -39 36 -29 -2 22 -56 37 -26 -16 40 -41 22 -17 -23 31 -49 12 -12 -11 41 -34 28 13 -37 54
5691 54 -46 15 24 -27 24 -23 14 22 -25 47 -38 -8 48 -35 35 -4 -15 41 -44 26 -13 -39 25 -51 -10 13 -53 50 -55 -11
5721 -11 3 -35 40 -34 -6 13 -41 32 -25 -4 36 -46 34 -14 -9 46 -38 21 12 -13 40 -37 23 14 -16 35 -37 7 20 -44 28 -30
5753 -30 -9 32 -49 40 -24 -13 31 -46 -2 -20 -44 37 -42 15 1 -24 28 -44 0 -3 -32 46 -12 20 41 -26 45 -6 4 26 -29
5784 -29 16 -16 -13 25 -28 36 1 -10 36 -42 23 -16 -36 25 -33 12 -17 -36 33 -32 -9 7 -33 34 -21 -4 19 -42 15 -29 -15
5815 -15 31 -47 35 -6 -33 39 -33 23 11 -26 54 -23 -15 27 -17 52 -14 23 16 -24 38 -16 -32 29 -38 2 -15 -20 29 -44 38 -11
5847 -11 -28 30 -42 22 -6 -29 34 -14 6 11 -19 30 -11 11 19 -29 36 -8 -8 27 -33 36 -1 -24 40 -21 11 9 -10 45 -32 22
5879 22 6 -31 25 -30 -12 1 -36 18 -31 -5 24 -50 23 -33 -21 16 -43 21 -6 -27 28 -33 24 -2 -20 33 -19 13 3 -19
5909 -19 22 -17 15 17 -33 50 -10 6 11 -16 27 -1 -20 24 -42 6 -23 -19 19 -34 14 -8 -19 7 -27 9 1 -37 29 -24 -5 6
5941 6 -22 7 -9 6 24 -38 13 -10 5 43 -22 28 4 -14 38 -20 27 6 -17 32 -23 0 11 -41 30 -25 1 16 -30 22 -11
5972 -11 -16 6 -36 13 -14 -29 11 -35 9 1 -38 16 -10 15 17 -26 18 -20 12 8 -13 24 -22 3 20 -14 37 -20 1 15 -23 14
6004 14 -12 -21 19 -32 9 -12 -21 7 -26 0 -3 -37 9 -26 -8 30 -24 30 -26 -17 24 -36 19 -18 -22 16 -35 22 6 -5 24 -13 24
6037 24 -2 -7 31 -25 13 18 -12 35 -15 9 25 -19 19 -17 -12 8 -29 3 -18 -22 4 -34 5 -7 -16 11 -38 7 -11 -25 21 -27 11
6070 11 17 -18 28 -29 -10 2 -31 17 -9 0 13 -16 19 11 -15 24 -23 10 6 -16 19 -21 -1 -7 -20 16 -26 -1 9 -34 6 -27 -18
6103 -18 -4 -30 17 -18 -15 6 -11 0 -14 -14 28 -43 18 -9 -19 24 -23 26 0 -4 27 -18 3 9 -37 1 6 -5 9 -17 36 -22 -16
6136 -16 4 -27 22 -9 -12 24 -11 3 -16 -31 8 -38 9 3 -23 31 -25 -6 12 -21 8 2 -6 21 -16 21 11 -1 30 6 17 -4
6168 -4 7 19 -11 5 23 -20 19 -9 20 16 -12 16 -14 -4 -4 -28 15 4 -5 17 -26 1 -15 -7 14 -20 5 7 -18 21 -2 1 7 -15
6202 -15 15 -22 11 16 -15 12 6 8 20 -4 36 -13 -4 24 -21 29 3 -9 12 -20 5 -6 -18 21 -20 0 7 -25 15 -35 -8 -4 -6 25
6236 25 -27 9 6 -30 7 -6 -11 20 -21 18 -5 1 16 -5 6 12 -9 28 -26 14 8 -13 23 -8 -2 10 0 3 -6 -10 9 -19 -1 -17 -8
6271 -8 11 -17 3 -3 -17 2 -35 3 -4 -6 20 -15 6 27 -10 11 -7 17 -3 -12 15 12 15 30 4 22 -11 3 34 -8 1 2 -16 27 -19
6306 -19 11 15 -25 8 -36 14 -13 -31 7 -10 -16 -8 -36 2 -18 -3 8 -18 19 -10 1 20 -4 -6 4 9 21 -3 8 1 -5 23 -7 12
6340 12 2 8 21 -20 -4 24 -21 16 13 -23 0 -20 -4 -14 -2 19 -16 2 -7 -8 13 -22 10 -6 -38 8 -21 8 25 -8 15 -15
6372 -15 -3 10 -21 14 1 3 10 -6 22 2 0 24 -15 12 5 -17 8 -17 2 -10 -13 13 -1 -4 8 -20 5 -10 -9 14 -5 -2 -8 -13 21
6407 21 -27 -1 17 -26 23 -18 3 11 -1 24 -10 0 -1 -24 20 -12 -10 32 -10 10 1 -4 1 -14 33 -9 -1 1 -20 9 5 -10 24 -18 5
6442 5 -3 -16 13 -27 -11 1 -22 4 8 13 12 -13 24 -7 -10 18 -25 11 5 -2 22 -11 5 20 -7 18 -28 1 7 -19 16 9 7 -2 -24 26
6478 26 -19 -7 11 -23 5 -3 -27 11 -34 3 -14 -8 -10 -19 13 -23 -8 11 0 10 14 -29 17 -7 8 19 -13 7 10 3 22 -9 11 -5
6512 -5 1 17 -2 3 10 -4 20 -33 -9 -14 -16 -3 -14 -15 -5 -27 -5 -14 -18 6 -10 -23 -8 -3 -7 -37 -5 -11 -8 2 -13 1 11 -6 10 -15 16
6549 16 9 -23 31 -6 4 8 -2 15 5 -7 8 -17 11 -20 -8 8 -21 -11 -6 -5 16 -29 18 2 -4 -3 -19 5 6 -16 6 -10 -5 4 -15
6584 -15 10 -3 28 -6 -11 21 6 3 11 -5 16 11 2 20 -10 8 17 -11 19 -4 8 11 -10 -6 -18 -7 2 -34 4 -18 -5 9 2 8 -8 -6
6620 -6 -14 -19 5 -1 -9 10 -10 10 -6 1 26 10 16 -1 -12 17 -12 0 15 1 18 1 -4 16 -22 10 -17 -17 11 -9 -4 -13 -27 8 -12 -8
6656 -8 -24 -12 0 -17 5 -14 -26 -7 -33 -4 -2 -32 0 -14 -12 10 -13 0 -1 -1 9 -14 17 4 2 13 -9 7 -10 -5 9 -4 -5 -7 -12
6691 -12 13 -11 -8 8 -33 -3 -19 3 3 -33 -1 0 1 7 -13 -11 -3 -11 8 -12 2 -3 -12 10 1 8 13 -19 13 -2 11 19 -15 11 4 -11 7 -21
6729 -21 4 -4 -3 -3 -6 -14 0 -15 -3 -26 -13 -3 -27 0 -31 0 -5 -10 0 -13 -13 3 -34 -4 3 -6 -3 -14 -2 -3 -9 26 5 -2 12 -1 21
6766 21 -8 8 20 0 20 4 -8 2 1 -2 2 -18 2 -6 -10 -17 -22 -3 -31 4 -10 -6 6 16 10 9 -5 14 -15 -6 10 -10 16 -12 -3 14
6802 14 -10 -1 -12 -1 5 -20 13 10 -5 23 -3 12 -8 -8 25 6 17 19 -1 4 -11 -5 -5 -12 7 -3 -4 11 -18 11 -1 -2 -2 -19 2 -17
6838 -17 2 14 -4 4 3 1 -5 3 15 -2 -11 11 3 -6 17 -2 12 -13 13 0 -1 3 2 -12 -3 -12 6 -5 -16 -2 -36 -2 -3 -3 7 -28 -8 -13
6876 -13 -13 10 -6 3 10 -11 18 2 5 8 -1 13 -3 18 32 -10 17 5 9 5 1 2 21 4 4 -2 -4 4 2 -1 -4 -5 -3 -13 5 -5 -2 -3 -8 -11 -17 -23 -6
6919 -6 11 3 -5 4 -1 -11 10 4 3 23 7 1 14 -19 22 -13 8 4 -8 5 -4 -22 1 7 10 0 -13 2 -14 12 -9 -25 16 -15 -3 -1 -28
6956 -28 -3 11 -18 -5 -21 -5 -16 -15 16 -24 -4 9 -9 4 -15 2 -1 4 17 -8 3 12 -14 5 1 4 -5 -11 14 -8 -8 -1 -22 6 -4
6991 -4 -14 -1 -20 -6 2 -9 -20 -33 -18 -4 -5 -15 5 2 11 -4 1 -10 7 2 -4 8 -1 10 9 -2 11 10 4 17 -1 11 17 14 14 -6 17 11
7029 11 -2 7 -14 3 -5 -19 6 -6 0 -6 -25 -11 -21 -9 8 -24 -4 -6 -8 -9 -8 4 -13 -13 -3 -14 -13 12 -8 6 -1 22 10 -5 6 5
7065 5 16 1 -14 -6 -9 6 20 -17 7 4 2 2 -23 -14 1 -12 0 0 -14 -4 -22 -12 -20 -7 1 -19 -9 -16 -4 16 -3 -2 -6 8 4 -8 13
7102 13 7 -8 11 12 20 -6 -4 0 12 -8 11 -34 -5 -5 3 9 -24 -5 -7 -3 1 -8 8 -5 -26 -14 -27 -4 0 -10 -8 -9 -1 -19 -13 -1 -11 0 -12
7141 -12 2 13 -3 -1 7 0 7 1 -2 16 -3 14 3 9 -5 -14 8 10 8 0 -9 9 -8 0 5 -5 1 4 -18 3 -12 -2 -4 -7 -10 6 10 -9 -3 9 18
7182 18 -1 7 -3 0 6 10 14 -4 21 4 5 4 6 6 0 -3 3 -11 1 -6 16 15 2 8 2 -22 9 -5 -7 -7 -14 18 0 -9 1 -17 4 2 -4 -5 -4 7
7224 7 17 14 2 5 12 4 9 19 4 6 20 0 13 25 -6 5 -14 1 15 -8 35 1 2 -3 0 3 0 1 8 -12 8 -1 -9 -5 -8 9 -5 -9 -3 -7 0
7265 0 15 -14 3 -6 -7 -1 -7 -3 17 -5 12 15 5 9 12 8 3 2 15 8 5 -2 8 3 2 4 0 0 5 2 1 -5 -8 -20 -18 -2 -4 12 1 -24 10 2 -1 7 -2 11
7311 11 -12 0 -5 -7 8 5 -3 21 14 9 16 3 22 4 6 16 13 23 -4 1 4 1 4 0 6 -14 -5 -3 1 -11 -9 -22 4 -12 -5 5 4 5 -2 -3 2 7 1 -1
7355 -1 -7 6 15 6 9 -6 17 0 13 29 2 18 3 -3 12 1 3 -10 -6 0 -16 -5 -7 -1 10 -15 -8 -1 -19 -6 -13 -11 6 -3 -19 -5 -11 5 -17
7394 -17 12 3 7 8 -8 -7 10 10 4 13 2 1 15 17 25 -2 6 -24 -1 -5 -22 9 7 -10 -3 -9 -11 -13 -8 -6 -12 5 -30 -14 -10 -7 -5 -21 -13 -9 -6 -5 8 13
7438 13 8 -2 4 7 4 -2 -2 31 6 -2 4 -12 8 -5 11 25 6 5 -9 -13 14 -6 11 1 -2 3 -7 -7 -3 -22 -2 -18 0 -8 -12 -19 6 -7 -4
7477 -4 -25 -13 3 0 13 4 -10 10 17 1 -7 3 6 -9 16 -1 -6 10 5 -8 7 -2 4 -16 6 1 -8 18 -13 -16 -3 -11 0 -11 -13 -2 -25 5
7515 5 -19 -8 16 -8 1 12 -6 4 3 -7 4 0 8 2 6 -11 18 21 17 -15 20 -4 1 6 16 -1 -4 -4 7 8 2 -4 -9 -12 7 -7 -10 -8 -11 -2 -4 -4
7557 -4 -12 10 -9 -2 -21 -4 -11 -3 2 -12 10 -10 9 13 8 10 -7 6 -13 1 0 11 -9 25 -4 18 -1 3 20 -8 0 -3 -8 1 -8 -22 3 -14
7595 -14 -3 -6 -11 -15 -28 -17 -11 -17 -7 -21 -12 -16 -1 9 0 -6 0 7 -13 6 6 7 -15 0 2 4 22 3 18 17 11 6 0 -3 4 -12 9 -18 -22 -2 -1 6
7637 6 -5 7 5 -11 1 -10 -1 21 -23 -8 7 -6 -8 -14 -3 -6 -4 3 2 4 16 3 8 10 12 -15 -2 12 11 -1 2 9 12 15 5 4 -4 -14 -19 -15 9
7678 9 -18 -22 8 -3 -12 -25 -17 -20 -10 -15 -2 -13 -15 -28 -7 -19 -3 -5 -1 2 11 17 2 11 14 15 -25 8 -3 11 19 7 2 3 1 -6 -11 8 -11 1 4
7719 4 -13 2 -1 -11 -3 -24 1 -5 -21 1 -4 -3 -9 -15 0 -9 -8 10 13 -4 -3 -1 17 -7 7 8 2 13 -2 -1 -2 -1 -12 20 -7 11 10 -1 1 -1 -1
7760 -1 -1 -7 -13 -26 8 -10 -16 -1 -8 -17 7 -1 -2 8 18 4 16 -8 2 -8 -7 4 -1 -10 14 -1 7 10 -10 11 1 -4 3 -3 -8 22 10 32 -4
7799 -4 1 13 -19 -7 -2 -10 1 -9 7 4 -1 -6 -2 4 -8 -11 -13 -25 -13 -6 -10 -5 -9 9 24 3 9 7 4 -2 5 6 11 19 16 1 2 9 -13 -3 -7 4 -10 -2
7843 -2 -4 3 4 -2 -9 -1 -8 -1 -15 -10 12 -13 -14 -6 -14 -11 -9 13 -9 -10 7 -2 15 7 -8 -3 6 7 20 6 16 10 3 9 -2 -13 -4 21 -2 -22 2 -3 10
7886 10 11 -5 -16 0 -25 -5 -18 -11 5 -4 -8 -7 -2 -32 0 -5 -2 -16 -1 -3 4 -14 -11 -3 14 16 -6 18 4 22 11 18 21 17 19 -6 3 16 6
7925 6 6 1 1 1 32 -4 -9 18 4 -3 -1 -5 -4 2 -1 -24 -22 -7 -6 -5 -3 -6 7 -20 -6 1 -5 5 -7 5 10 -5 7 30 8 15 5 14 10 17 6 7 -2
7968 -2 -13 -7 3 3 8 2 -2 17 -4 4 -7 -13 0 -6 -21 0 -24 -10 -16 -4 -1 5 -20 7 -26 -8 -12 2 -3 0 -3 9 -10 0 13 6 -14 0 12
8007 12 -7 21 6 16 19 15 -8 -1 -5 0 -7 -13 -9 -11 3 -12 -26 0 -18 -14 3 -14 -8 5 1 5 -6 2 7 15 -8 -14 -1 15 11 -5 11 10 15 3
8047 3 7 11 19 3 21 -7 4 7 0 3 19 10 -5 -8 0 -3 -14 3 -10 -15 -7 -9 13 2 6 1 -10 -7 7 -6 11 7 3 8 -8 -1 1 1 8 -6 1 13 2
8090 2 9 10 4 7 6 -2 -5 -2 1 15 5 -11 11 -1 2 -6 -9 -7 7 -18 -16 -8 -4 -21 -22 -18 2 3 9 -4 9 2 -19 13 1 21 0 5 5 8 13 11 20 8
8134 8 7 23 15 5 2 0 11 7 1 25 -4 11 0 -12 7 8 -4 -7 -8 -16 -17 -5 8 -16 -12 -4 -11 -5 -9 16 -1 5 3 -11 -3 -9 16 2 12 -11 -6
8175 -6 -3 12 4 0 6 1 4 -3 -1 15 4 0 -12 -11 -6 -5
8191e
##END NTUPLES=NMR FID
##END=
