##TITLE=1H_ES-ZN-MeOH
 
 8 sc, 
 22.11.2022
##JCAMPDX= 6.0         $$ Bruker NMR JCAMP-DX V2.0
##DATA TYPE= NMR FID
##DATA CLASS= NTUPLES
##ORIGIN= UXNMR, Bruker Analytische Messtechnik GmbH
##OWNER= root
$$ XWIN-NMR		Version 3.5
$$ Tue Nov 22 16:41:31 2022 Russian Standard Time (UT+4h)  she@DPX200
##.OBSERVE FREQUENCY= 200.1313499994
##.OBSERVE NUCLEUS= ^1H
##.DELAY= (6, 6)
##.ACQUISITION MODE= SIMULTANEOUS
##.ACQUISITION SCHEME= undefined
##.AVERAGES= 8
##.DIGITISER RES= 18
##SPECTROMETER/DATA SYSTEM= spect
##.PULSE SEQUENCE= zg30
##.SOLVENT NAME= CDCl3
##.SHIFT REFERENCE= (INTERNAL, CDCl3, 0, 15.7039)
##AUDIT TRAIL= $$ (NUMBER, WHEN, WHO, WHERE, WHAT)
$$ ##TITLE= Audit trail, XWIN-NMR		Version 3.5
$$ ##JCAMPDX= 5.01
$$ ##ORIGIN= Bruker BioSpin GmbH
$$ ##OWNER= she
$$ F:/spectra/data/she/nmr/H-F/1/audita.txt
$$ ##AUDIT TRAIL=  $$ (NUMBER, WHEN, WHO, WHERE, WHAT)
(   1,<2022-11-22 16:40:16.84 +0400>,<she>,<DPX200>,
      <created by zg, POWCHK disabled, PULCHK disabled
       configuration hash MD5:
       00 E9 B6 7A A2 85 ED C7 34 08 36 98 17 FE 4E 26
       data hash MD5: 16K
       DA FF 0C 54 E4 A5 2C 03 DC 8E 65 67 53 9A 94 17>)
$$ ##END=
$$ 
$$ hash MD5
$$ A8 C8 91 71 3A 39 76 5B 12 9E E2 05 2B D9 C3 01
##$RELAX= 
##$RELAX= 
##$RELAX= 
##$RELAX= 
##$RELAX= 
##$RELAX= 
$$ Bruker specific parameters
$$ --------------------------
##$DU= <F:/spectra>
##$EXPNO= 1
##$NAME= <H-F>
##$PROCNO= 1
##$TYPE= <nmr>
##$USER= <she>
##$AMP= (0..31)
100 100 100 100 100 100 100 100 100 100 100 100 100 100 100 100 100 100 
100 100 100 100 100 100 100 100 100 100 100 100 100 100 
##$AQSEQ= 0
##$AQ_mod= 1
##$AUNM= <au_zg>
##$AUTOPOS= <>
##$BF1= 200.13
##$BF2= 200.13
##$BF3= 200.13
##$BF4= 200.13
##$BF5= 200.13
##$BF6= 200.13
##$BF7= 200.13
##$BF8= 200.13
##$BYTORDA= 1
##$CFDGTYP= 0
##$CFRGTYP= 5
##$CHEMSTR= <none>
##$CNST= (0..31)
1 1 145 1 1 1 1 1 1 1 1 1 1 1 1 1 1 1 1 1 1 1 1 1 1 1 1 1 1 1 1 1 
##$CPDPRG= <>
##$CPDPRG1= <>
##$CPDPRG2= <>
##$CPDPRG3= <>
##$CPDPRG4= <mlev>
##$CPDPRG5= <mlev>
##$CPDPRG6= <mlev>
##$CPDPRG7= <mlev>
##$CPDPRG8= <mlev>
##$CPDPRGB= <>
##$CPDPRGT= <>
##$D= (0..31)
0 1.2 0 0 0 0 0 0 0 0.06 0 0.03 0 0 0 0 0.0002 0 0 0 0 0 0 0 0 0 0 0 0 
0 0 0 
##$DATE= 1669120816
##$DBL= (0..7)
120 120 120 120 120 120 120 120 
##$DBP= (0..7)
150 150 150 150 150 150 150 150 
##$DBP07= 0
##$DBPNAM0= <>
##$DBPNAM1= <>
##$DBPNAM2= <>
##$DBPNAM3= <>
##$DBPNAM4= <>
##$DBPNAM5= <>
##$DBPNAM6= <>
##$DBPNAM7= <>
##$DBPOAL= (0..7)
0.5 0.5 0.5 0.5 0.5 0.5 0.5 0.5 
##$DBPOFFS= (0..7)
0 0 0 0 0 0 0 0 
##$DE= 6
##$DECBNUC= <off>
##$DECIM= 32
##$DECNUC= <off>
##$DECSTAT= 4
##$DIGMOD= 1
##$DIGTYP= 9
##$DL= (0..7)
0 120 120 120 120 120 120 120 
##$DP= (0..7)
150 150 150 150 150 150 150 150 
##$DP07= 0
##$DPNAME0= <>
##$DPNAME1= <>
##$DPNAME2= <>
##$DPNAME3= <>
##$DPNAME4= <>
##$DPNAME5= <>
##$DPNAME6= <>
##$DPNAME7= <>
##$DPOAL= (0..7)
0.5 0.5 0.5 0.5 0.5 0.5 0.5 0.5 
##$DPOFFS= (0..7)
0 0 0 0 0 0 0 0 
##$DQDMODE= 0
##$DR= 18
##$DS= 0
##$DSLIST= <SSSSSSSSSSSSSSS>
$$ [...]
##$SUBNAM2= <"">
##$SUBNAM3= <"">
##$SUBNAM4= <"">
##$SUBNAM5= <"">
##$SUBNAM6= <"">
##$SUBNAM7= <"">
##$SUBNAM8= <"">
##$SUBNAM9= <"">
##$SW= 18.0517283424941
##$SWIBOX= (0..15)
0 0 2 0 0 0 0 0 0 0 0 0 0 0 0 0 
##$SW_h= 3612.71676300578
##$TD= 16384
##$TD0= 1
##$TE= 0
##$TE2= 300
##$TE3= 300
##$TEG= 300
##$TL= (0..7)
0 120 120 120 120 120 120 120 
##$TP= (0..7)
150 150 150 150 150 150 150 150 
##$TP07= 0
##$TPNAME0= <>
##$TPNAME1= <>
##$TPNAME2= <>
##$TPNAME3= <>
##$TPNAME4= <>
##$TPNAME5= <>
##$TPNAME6= <>
##$TPNAME7= <>
##$TPOAL= (0..7)
0.5 0.5 0.5 0.5 0.5 0.5 0.5 0.5 
##$TPOFFS= (0..7)
0 0 0 0 0 0 0 0 
##$TUNHIN= 0
##$TUNHOUT= 0
##$TUNXOUT= 0
##$USERA1= <user>
##$USERA2= <user>
##$USERA3= <user>
##$USERA4= <user>
##$USERA5= <user>
##$V9= 5
##$VALIST= <valist>
##$VCLIST= <CCCCCCCCCCCCCCC>
##$VD= 0
##$VDLIST= <DDDDDDDDDDDDDDD>
##$VPLIST= <PPPPPPPPPPPPPPP>
##$VTLIST= <TTTTTTTTTTTTTTT>
##$WBST= 1024
##$WBSW= 4
##$XGAIN= (0..3)
0 0 0 0 
##$XL= 0
##$YL= 0
##$YMAX_a= 743794
##$YMIN_a= -718728
##$ZGOPTNS= <>
##$ZL1= 120
##$ZL2= 120
##$ZL3= 120
##$ZL4= 120
##$ABSF1= 10
##$ABSF2= 0
##$ABSG= 5
##$ABSL= 3
##$ALPHA= 0
##$AQORDER= 0
##$ASSFAC= 0
##$ASSFACI= 0
##$ASSFACX= 0
##$ASSWID= 0
##$AUNMP= <proc_1d>
##$AZFE= 0.1
##$AZFW= 0.1
##$BCFW= 1
##$BC_mod= 2
##$BYTORDP= 1
##$COROFFS= 0
##$CY= 11.3945322036743
##$DATMOD= 1
##$DC= 2
##$DFILT= <>
##$DTYPP= 0
##$F1P= 2.36226072786647
##$F2P= -0.459571619588291
##$FCOR= 0.5
##$FTSIZE= 0
##$FT_mod= 4
##$GAMMA= 1
##$GB= 0.15
##$INTBC= 1
##$INTSCL= 1
##$ISEN= 128
##$LB= 0.24
##$LEV0= 0
##$LPBIN= 0
##$MAXI= 10000
##$MC2= 0
##$MEAN= 0
##$ME_mod= 0
##$MI= 1.114404
##$NCOEF= 0
##$NC_proc= 0
##$NLEV= 6
##$NOISF1= 3.799351
##$NOISF2= 2.8
##$NSP= 1
##$NTH_PI= 0
##$NZP= 0
##$OFFSET= 15.70392
##$PC= 1
##$PHC0= -17945.04
##$PHC1= 8.80072
##$PH_mod= 1
##$PKNL= yes
##$PPARMOD= 0
##$PSCAL= 0
##$PSIGN= 0
##$REVERSE= no
##$SF= 200.130013532006
##$SI= 16384
##$SIGF1= 3
##$SIGF2= 2
##$SINO= 400
##$SIOLD= 16384
##$SREGLST= <1H.CDCl3>
##$SSB= 0
##$STSI= 0
##$STSR= 0
##$SW_p= 3612.71676300578
##$SYMM= 0
##$S_DEV= 0
##$TDeff= 0
##$TDoff= 0
##$TI= <>
##$TILT= no
##$TM1= 0
##$TM2= 0
##$TOPLEV= 0
##$USERP1= <user>
##$USERP2= <user>
##$USERP3= <user>
##$USERP4= <user>
##$USERP5= <user>
##$WDW= 1
##$XDIM= 8192
##$YMAX_p= 0
##$YMIN_p= 0
$$ End of Bruker specific parameters
$$ ---------------------------------
##NTUPLES= NMR FID
##VAR_NAME=  TIME,          FID/REAL,        FID/IMAG
##SYMBOL=    X,             R,               I
##VAR_TYPE=  INDEPENDENT,   DEPENDENT,       DEPENDENT
##VAR_FORM=  AFFN,          ASDF,            ASDF
##VAR_DIM=   8192,          8192,            8192
##UNITS=     SECONDS,       ARBITRARY UNITS, ARBITRARY UNITS
##FACTOR=    0.0002768,     1,               1
##FIRST=     0,             0,               0
##LAST=      2.2672688,     0,               0
##MIN=       0,             -718728,         0
##MAX=       2.2672688,     743794,          0
$$ Real data points
##PAGE= N=1
##DATA TABLE= (X++(R..R)), XYDATA
0@%%%%%%%%%%qJ6j6J6k4L2l2M0n6O9p7Q8j06J30j52J73k04K39k74L11l54M07m65
33b47N23n87O64p46Q34r32J038j156J282j417J571j743J923k116K333k574K835
50A485l122L439l793M187m626N125n696O354p119Q025r117J0467j2181J4432j7543
65i683K2122k9514M3380p7840L13317M82012q87134l32132N91945M4457n62688
76d01758L57201P21496m69055r02198L62954P78230k56623m53905M22388J82433
86C41163p24215j88545Q95448L09038p67296k79465N38090j3078m69822L41623
96a7059O26808m56887p66455L42701O68103k55371l67950L87078J33774o57871
106c63129j28766Q00306K39264o90744k08282M80109m5503m16354L39550N44516
$$ y = [0, 0, 0, 0, 0, 0, 0, 0, 0, 0, 0, -8, 8, -8, 8, -16, 16, -16, 24, -32, 37, -40, 48, -58, 72, -80, 93, -111, 128, -146, 165, -189, 218, -247, 276, -311, 353, -393, 441, -491, 547, -609, 673, -744, 827, -916, 1007, -1109, 1224, -1350, 1485, -1637, 1802, -1991, 2196, -2430, 2695, -3001, 3353, -3766, 4259, -4858, 5609, -6572, 7860, -9683, 12439, -17075, 26305, -51535, 261782, 743794, -143340, -475472, 116473, 160930, -401758, -44557, 676939, 207884, -694314, -331360, 446870, 190247, -263658, 158730, 341163, -383052, -571597, 323851, 632889, -134407, -413872, 124218, 111140, -358682, -17059, 609749, 152862, -613593, -270892, 397211, 141840, -226110, 160968, 294742, -363129, -491895, 308411, 547675, -143069, -351351, 128758, 83255, -333099, 6451, 550967]
116E50967m40767o64767L42031N72498k58695l03915L68240Q8683n98891p8453
126d23069P19999J72923o16473j48247M21545p2688l53929L29464M58995m16554
136G1966n60943L23842M77920k41932k38747L30383M6360n28789l6774O32892
146B76178J22635n38678j04586L62620q8037k99356L14497L90758l91482m81143
156d36594L08227M07498k33317j93720L09608K0063m84576q801N75969Q3795m89682
167a41530o7420L28541j04499k66634L06823L42821l74979m19190K98063L49656
177B51652k26314j54738K88538m281m39429J6658N16291N0830m33998l8781K83776
188A10204j12063k22465K91097K86836l50233l54223K77908K92300k08617j16998
$$ y = [550967, 110200, -554567, -212536, 359962, 101267, -202648, 165592, 254275, -344616, -423069, 296930, 469853, -146620, -294867, 126678, 53990, -299939, 29525, 488520, 71966, -488977, -165135, 312785, 70853, -167894, 162489, 208849, -319940, -356714, 276178, 398813, -139865, -244451, 118169, 30132, -269224, 45273, 436031, 44549, -436594, -128367, 279131, 45814, -147906, 161702, 181765, -302811, -311612, 264357, 348152, -141530, -208950, 119591, 15092, -251542, 55281, 398102, 23123, -396067, -98004, 251652, 25338, -129400, 159138, 154857, -284572, -267914, 248377, 299207, -134791, -173572, 110204, -1859, -224324, 66773, 353609, 3376, -350847, -72939, 219361, 10744, -106254]
198a06254K59887k7570l93179M0000M62309K1558l88055j3150K50366j21323j91080
209b06491K83746K46089l38941l06206K73619K49902k07880q8936K49864m6501
219A08265l67340O1793M28045o954l57684J2638K26846j32329j65637K78559K09990
230B96192l27407k62047K64132K09985j97664o2228K28839o2805l31052P7115
240a66940L83718k4743l17066K5788J94440j31406j35615K63193J74876l06881
250d0636k23201K47381J76858j84157m1775K10802p3822l03846Q7974L52365m0100
261A67843k90802M0581J76294j37498j19344K59221J52648k99723j95090K43870
271b000J50683j82720k4197K03348q4778k85221R9415L26529n4829k66207N2961
$$ y = [-106254, 153633, 126063, -267116, -227116, 235193, 256751, -131304, -144454, 105912, -15411, -206491, 77255, 323344, -15597, -321803, -48184, 201718, -6162, -95098, 154766, 108265, -259075, -197282, 230763, 223809, -133875, -121237, 105609, -26720, -192357, 86202, 296192, -31215, -293262, -29130, 180855, -16809, -79037, 149802, 86997, -244055, -166940, 216778, 192035, -125031, -99243, 95197, -36209, -171824, 91369, 266245, -40636, -263837, -16456, 160402, -23755, -65530, 145272, 71450, -232396, -144422, 207943, 167843, -122959, -82378, 93916, -43582, -162926, 96295, 248943, -50780, -245870, -2000, 148683, -34037, -58234, 145114, 60336, -224885, -125470, 201059, 146230, -119977, -67016]
282f7016J56329j39316r9364K48811J26984k83479j65128K28415J24653j67546
292c6657q387J82175r2098k54934J05207K92061o2365k35918N7910J33259j35462
303e5209p8748K35976J03057k68502j38536K17564J01868j59685N912J70871j00658
314C3910k36590J14846K70196p5731k17210P0517J19445j40587o5028K32453Q4079
325A90300k61447j15160K11829Q0799j53976J9192J59377j07291k16040J20044
335g2373K44409q1808j93174P3383J00485j34480m8132K16571O4895k41238r4339
346a65801J93245O4096j37402K7066J40467j07941j92055J19349K18453q3278
356G6199j71377P4542Q5285j30522l5810K06695N0186k29962p6778J85449M8218
$$ y = [-67016, 89313, -50003, -149367, 99444, 226428, -57051, -222179, 6236, 130889, -36657, -45044, 137131, 45033, -209901, -104694, 187367, 125002, -110916, -53006, 80253, -55209, -133957, 102019, 205076, -63426, -201962, 15602, 117470, -42215, -36303, 134568, 33910, -202680, -87834, 182362, 106631, -110579, -40062, 79383, -61204, -126232, 106221, 190300, -71147, -186307, 25522, 106321, -47655, -28463, 130914, 23623, -192417, -72373, 172036, 90228, -102946, -29563, 70922, -63558, -111690, 104881, 169776, -71462, -165801, 27444, 91540, -45862, -18796, 121671, 13730, -178325, -58976, 159477, 76199, -95178, -20636, 64649, -65873, -101683, 105012, 155198, -74764, -151542, 33907, 82125]
367H2125j32478L7185J33236j13567j78893J25379K01507r1892j55853Q2221P3332
378F2302j31793k4355K00160L5320k19512n9289J75343L3460j22351M4757J19024
389A13066j14811j58525J24634J78266r1364j35433P9254N8088j22324j1692J84235
400A03394K1586k01794m4762J60298K2276j09862M9646J05350j15264j41446J25400
411b5178J60047r4666j20313Q2628M7249j21867j838J79232R061j95522k9697
422a10864J55770Q635j06229N8588R8817j20257j29723J29609J45223r9460j06572
433g6463Q5333L6655j18771P379J69616j285j82669j8736J43314P37r4551O0360
445A0919Q5502j16756j13283J24392J27806r4756r2159P9925K6931j10031J4518
$$ y = [82125, -50353, -13168, 120068, 6501, -172392, -47013, 154494, 62602, -93251, -11030, 62302, -69491, -93846, 106314, 141634, -77878, -137167, 38176, 71636, -50715, -5958, 113066, -1745, -160270, -35636, 142630, 51266, -84167, -4913, 53175, -69149, -80841, 103394, 124980, -76814, -121576, 38722, 60998, -48864, 782, 106132, -9132, -150578, -25178, 134869, 40203, -80110, 2518, 49767, -72100, -73938, 105294, 114355, -81167, -110864, 44906, 53541, -52688, 5900, 104717, -15540, -145263, -15654, 129569, 30109, -76463, 8870, 45525, -73246, -65867, 103749, 102464, -80205, -98941, 44373, 45110, -49441, 10919, 96421, -20335, -133618, -9226, 118580, 23824, -68335, 11590, 38521, -71510, -56992]
456e6992J57395r059j69931r872J33278o732q7109O4266P7590j18036j02705J26215
468a692J15610r8706q1237Q4037J8484j10993K2484J54124j9070j64621J957J28259
480D8636j7083q2060P0188O9988j19906r1072J26418J01962r8419o9240Q1515
491B0927R832j03656K9125J42039k5798j50697Q379J15590k0489p0985O8758N8473
503H1498j14809p7928J20851Q8688r4151n8648P7471K771r7577L4693J33569l2534
515F3894j42010J6571J08901k8010o5807P3488N2246j17219o8866J23110P7821
526I4119r7277m8663P9803m933r6463M1258J28129l9611j34201K3984J01171l3214
538A4102n8677P4161M4141j13495n8699J17302O7041r1195m0166P2819r523q6863
$$ y = [-56992, 100403, 91344, -78587, -88459, 44819, 38087, -49022, 15244, 92834, -25202, -127907, -1692, 113918, 15212, -66025, 18012, 36496, -74497, -52013, 102111, 83041, -81580, -79623, 48636, 31553, -50507, 19681, 89669, -30237, -121309, 5109, 107071, 8652, -60588, 20927, 30759, -72897, -43772, 98267, 72469, -78228, -69849, 45741, 25252, -45733, 23025, 81498, -33311, -111239, 9612, 98300, 4149, -54499, 22972, 25743, -71834, -37141, 96428, 63894, -78116, -61545, 47356, 19346, -46461, 27027, 79273, -37946, -106812, 16298, 94119, -3158, -51821, 27982, 23049, -73414, -32156, 95973, 56362, -77839, -53855, 47316, 14102, -44575, 29586, 73727, -39768, -98467, 18835, 85876, -5319, -45485, 27334, 17811, -69052]
550f9052M3152J15692m0998j21271K5543R0304l3336n0238P1282L6232j08388
561d1078m9655J12533N7408q8309l2025P0776j5327q3351M8123J09913m7357j14611
573g2960L3369Q4552m0428m5233P5568K9907j09925m0671J13016M7005q8639k2865
585c7304O9641k1792p8648N2739J01461n1633j04524L6994P5302m1328l7237P2157
597C5828K1812j02987l1739J05042L8469q1172j7004O2137k4186o9748N3215R1009
609H0676n2263r4352L8322O7236m2050l1137P0964J5833j00395k4331J02730L0196
621F1429q0253r495O1531k9967o7430N8160Q6176n7753q8206M4397O1409m6876
633f878k5961P2701J0142r8936j7296R9653K2739p6729l856N7172l2505o0969
$$ y = [-69052, -25900, 89792, 48794, -72477, -46934, 43370, 10034, -40204, 31078, 67310, -41078, -90733, 21800, 79208, -9101, -41126, 29650, 14323, -69028, -20905, 89008, 41651, -72960, -39591, 44961, 4533, -40700, 34868, 64775, -45150, -85821, 27195, 74200, -14439, -37304, 32337, 10545, -68103, -15364, 86097, 34464, -70060, -33066, 42236, 908, -36329, 35828, 57640, -45347, -77086, 27956, 66425, -14747, -31751, 30386, 6200, -63548, -10333, 80676, 28413, -65939, -27617, 39619, -2431, -33568, 37396, 53229, -47166, -71497, 31233, 61429, -18824, -28319, 33212, 3245, -64185, -6025, 80151, 22398, -65808, -21411, 39998, -6878, -32839, 39862, 50004, -48932, -66228, 33425, 56164, -20565, -24421, 32751, 246, -60723]
645f0723N8180P7508n6798p8966M2852N3729m3762k0354O6976N385r1175j2323
657e9471R1868J7938p0310n72N1628l3690n4875N8445P0370n7917p1805M5219
669a3172M7771m6007j5384O7696p3r0501n171R0955R779o9789O790N0519l9242
682e829n1603O2761O4578o1964o4860M8774M1366m7550j0003O5949n261q5790
694d9432K61Q5030M910o3829R294M4445l8658m4575O0056N6546n8658n7186M5429
707f367L5642m3576o296O0591q196p9433L612P9106J257n9360J2238M0950m0344
720a0176m0588O1151N1327o0374n1397M8127L0329m6031j709O1315j2929p8254
732d9209R363P6922m931n7091J7324L8220m3147l6427O1881M5485o0047m5078
$$ y = [-60723, -2543, 74965, 18167, -60799, -17947, 35782, -7980, -28334, 38642, 44027, -47148, -59471, 32397, 50335, -19975, -20547, 31081, -2609, -57484, 961, 71331, 13414, -58391, -13172, 34599, -11408, -26792, 40904, 40831, -49670, -54841, 36114, 45893, -23896, -17106, 33413, -5829, -57432, 5329, 69907, 7943, -56917, -8143, 33223, -14327, -24330, 41619, 36358, -49432, -49171, 35859, 40769, -23060, -13766, 30679, -7979, -52554, 7502, 64048, 5390, -51796, -6367, 29275, -14301, -20597, 39994, 31798, -47635, -44023, 35083, 36340, -23020, -10782, 30168, -10176, -50764, 10387, 61714, 1340, -50057, -1930, 28399, -17632, -19341, 41974, 29045, -49209, -39846, 37076, 32145, -24946, -7622, 30598, -12549, -48976, 12905, 58390, -1657, -46735]
744d6735M7081K5182m3465J606N6436j5135p1365J1205O9617o167n0659J6865
756e534L2632m0454l0736N7891L9371n6315l9316M4180K0833m0653M582N2796
768C9277j8023o6980J5059O5555j0779m7461K0990K9655m3464k6663O0184L3682
780E1032n8694l2905M6584J4980m1973R591N1827k2726o3873J9952O1401j5093
792B0103m3339K3417K5450m3186k1738N7783K8104n5383k7751M2865J1594l7383
804a9464J0934M5871k2922n7000J9935N4899j4864l8154K2226K1354m0735j7716
816c5636N4795K3605n3032k3217M1495P781l6272J3962M3998k6049n4134K3911
828a8793N1736j9428l5254K6241J8402m3313j3888N6109J8558n3680j7819M1743
$$ y = [-46735, 346, 25528, -17937, -16331, 40105, 24970, -46395, -35190, 34427, 28260, -22399, -5534, 27098, -13356, -44092, 13799, 53170, -3145, -42461, 1719, 22552, -18101, -13519, 39277, 21254, -45726, -30667, 34888, 24109, -23352, -2362, 27293, -16171, -42834, 17350, 51032, -7662, -40567, 6017, 20997, -20976, -11385, 40442, 17716, -46157, -26205, 35196, 20103, -23236, 181, 25631, -17555, -39293, 18490, 46594, -8789, -36540, 6325, 17919, -19464, -8530, 37341, 14419, -42581, -22646, 32253, 17389, -20765, 1461, 22815, -17920, -35636, 19159, 42764, -10268, -33485, 8010, 15791, -20481, -6519, 37479, 11430, -42704, -18793, 32943, 13515, -21739, 4502, 22904, -20409, -34297, 21812, 40370, -13310, -31129, 10614]
840A0614L220l5369J7099M1265k8162m9793K5521M6914k0224l0998K5392J4801
852B0280m0364j0428N1705J5075m9056j4975L7467J847l1144J7041L6521k7555
864F414m4730K5249M2371k0409k7487K5350J1904l9733p104N0834J0883m8662
876a5120j0288L7554k530l0914K0924L5102l1436m1999K9488L9027k4489k4171
888a8852K8241Q579m0855l261N0386O586m7322o379L5729n068k8329K1720L1430
901C2605l0977l7605K8389L4851k2811k1056K5587O506l7006j695M5975N030m3268
914a5475n093L2500n608k5603K1589K8534l0813l4363K8886L1689k4006j8301
926a6064K6846L896l7706J473M6084J023m3244o15L2450r778k4961K4942K6728
$$ y = [10614, 13834, -21535, -4436, 36829, 8667, -41126, -15605, 31309, 11085, -19913, 5479, 20280, -20084, -30512, 21193, 36268, -12788, -27763, 9704, 11551, -19593, -2552, 33969, 6414, -38316, -13067, 29304, 8895, -18592, 6758, 18662, -21071, -28175, 22659, 33542, -15120, -25408, 12146, 9616, -21298, -374, 34728, 3292, -38707, -9219, 29808, 5319, -18852, 9389, 17968, -22887, -26148, 24238, 30824, -16498, -22877, 12852, 7784, -20545, 1175, 32605, 1628, -35977, -7588, 27263, 4452, -16604, 8983, 15489, -21517, -23212, 22763, 27793, -15475, -20568, 11932, 6324, -19279, 2310, 30844, 31, -34332, -5446, 26243, 2237, -16064, 10782, 14678, -23028, -21555, 24529, 25552, -17692, -18307, 14143, 4365, -20596, 4346, 31074]
939C1074l3558l1349L1221K8270k5798j5157K7358J222l6517L904M3570j248m0245
952a7253R89K9410r972k1843K3662K3240l1416k7726K8997K5115k3538j3029K4776
965A1412j05l3480N197M0448k943l7586K864K7424j1613j9957K5036K0778l2944
978e469k4548L1028K1598k5782r614K6512l543l4120R028M0088p259l6656P015
991a1722K6151j4812j8143K6894J8107l3671k1275L1027J8492k5079p378K4805
1003A3396m782l1282R600L6523p362l3199O543K3292j3405j5766K4633J5840l1090
1016g059j9006K8809J6508k3419n938K3314n868k9569J0920L4683r369l1534R053
1029h475K1846j5893j4126K6729J3467l2985j5773L0668J2884k5020k505K4117
$$ y = [31074, -2484, -33833, -2612, 25658, -140, -15297, 12061, 13283, -23234, -19330, 24240, 22992, -17253, -16264, 13146, 3174, -18669, 4993, 28233, -3183, -30909, -1912, 23203, -335, -13364, 11412, 11307, -22173, -16976, 23472, 20529, -17057, -14193, 13231, 1618, -18339, 6697, 27475, -5469, -30017, 1011, 22609, -3173, -12787, 13725, 10182, -23938, -14910, 25178, 17919, -18737, -11722, 14429, -383, -18526, 8368, 26475, -7196, -28471, 2556, 21048, -4031, -11409, 13396, 8614, -22668, -13068, 23455, 16093, -17106, -10563, 12729, -676, -16442, 8191, 24031, -7059, -26065, 2744, 19252, -4167, -10105, 13209, 7341, -22228, -11308, 23375, 14006, -17528, -8475, 13371, -2522, -16648, 10081, 23548, -9437, -25210, 5458, 18342, -6678, -9183, 14934]
1041A4934q994k9171J3932L3196j2216k9553J1297J9773j6901j1927K6318J1064
1053B1752l1591j3315K8793J0988k2874j623K1488q870k6023J3309K9956j1504
1065A0486k6783J0462J7694j5695j0267K4843R237l0192j1233K7937Q816k2512
1077g207M29K1084j0921k5163J5748K8584j4505k5135J3596J5948j8401q177K6792
1090A2672O505l1430p981K8697N575k2684L005K0525j2743k3601J6920K6340j5101
1103F699k2849J3477J4093j7316o763K4683N377k8755p124K6037N255k0360K639
1116d907J8292j1757k1382J5846K4180j4404k1016J3154J2662j7062n467K4370
1128A2509L718k8533m852K6061K600k0489N326J8112j4381k0463J8536K2540j7122
$$ y = [14934, 5940, -23231, -9299, 23897, 11681, -17872, -6575, 13198, -3703, -15630, 10688, 21752, -9839, -23154, 5639, 16627, -6247, -7870, 13618, 4748, -21275, -7966, 21990, 10486, -16297, -5835, 11859, -3836, -14103, 10740, 19977, -10215, -21448, 6489, 15305, -7207, -6778, 14306, 3385, -21778, -6030, 22554, 8049, -17086, -3490, 12458, -5943, -14120, 12672, 19177, -12253, -20234, 8463, 14038, -8646, -5641, 14884, 2141, -21460, -4540, 21800, 6699, -16150, -2673, 11420, -5896, -12659, 12024, 17401, -11354, -18478, 7559, 12814, -7546, -4907, 13385, 1628, -19754, -3908, 20272, 5868, -15148, -1994, 10668, -6394, -11861, 12509, 16227, -12306, -17158, 8903, 11503, -8986, -3660, 14452, 71, -20392, -1856, 20684, 3562]
1141C562j9007J5618J0547j8777l211K5025J282k8292k406K5275O38j9364O365
1154b745J6566j4449j8450J7898K0342j6060j7177J4157R406j6820k606K2614
1166A2676Q79k5850k023K3206L78j7693O332J5043j4307j6781J8043J8499j6733
1179A669j5273J5123P527j7676n06K3142j764k6050J126K3200k891j7410R308
1192d75J4173j6772j5140K0049J6313j8339j2975J6097N481j7716J149K2203l070
1205A0978k4489K066K1444l204j5741Q738J2562j5418j3527J8297J4831j6542
1217ej1953J4410N002j5992J303K0450l345k2815K614K0124l980j4664R552J1456
1231A2157j6305j1972J9368J2795j7884r648J5805K571j6952L871K0709o167k2461
$$ y = [3562, -15445, 173, 10720, -8057, -11268, 13757, 15039, -13253, -15659, 9616, 10254, -9110, -2745, 13821, -628, -19078, -1180, 19162, 3102, -14075, 82, 9488, -7332, -9938, 12676, 13555, -12295, -14318, 8888, 9266, -8427, -2095, 12948, -1359, -18140, -97, 18402, 1669, -13604, 1519, 9046, -8630, -9136, 14006, 12242, -13808, -12682, 10518, 7627, -9783, -475, 13698, -3074, -18214, 1835, 18148, -191, -13166, 2931, 8412, -9304, -8155, 14048, 10978, -13511, -11445, 9999, 6795, -8946, -208, 12354, -3064, -16591, 1706, 16537, -5, -11958, 2452, 7454, -8538, -7235, 13215, 9870, -12945, -10331, 9793, 5813, -8851, 701, 12157, -4148, -16120, 3248, 16043, -1841, -11489, 4316, 6887, -10065, -6194, 14515, 8348, -14113]
1244a4113N586J9360o656j3625J1533R974j7427j0112J9823J0778j7813p942J5177
1257D543J516j5723M322J8921o144k0498N234J7588n848j2262J0237Q899j5802
1270e017r093J8225R866j6561p164J4214Q90j4793M944J7918p133j9444O657J6605
1284A0114p574j1158J1861P503j7269p159J9538P426j7708m583J5005j496j5043
1297a0543P166J7419r134j8368Q329J5282q634r901J2153O266j6707o001J8440
1310E767O526j6379m184J3577j256j3457O350J5764q079j6835P277J4116p583
1323A604r148J1069N702j5680n293J7629N533j5888l051J3299k470j3124P771
1336b047J5083r830j5788R275J2844r614p635J2748L882j6826l150J8309L238
$$ y = [-14113, -8527, 10833, 4177, -9448, 2085, 12059, -5368, -15480, 4343, 15121, -2692, -10634, 4543, 6059, -9664, -5342, 13579, 7435, -13063, -7829, 9759, 3911, -8351, 1886, 10785, -5017, -14110, 4115, 13981, -2580, -9744, 4470, 5360, -9433, -4489, 13429, 6296, -13148, -6491, 10114, 2540, -8618, 3243, 10746, -6523, -13682, 5856, 13282, -4426, -9009, 5996, 4500, -10543, -3377, 14042, 4908, -13460, -5131, 10151, 1517, -8384, 3769, 10035, -6672, -12673, 5767, 12293, -4086, -8270, 5307, 4051, -9406, -3056, 12708, 4629, -12206, -4929, 9187, 1604, -7544, 3525, 9227, -6453, -11746, 5883, 11416, -4472, -7523, 5776, 3306, -9818, -2047, 13036, 3206, -12582, -3307, 9537, -77, -7712, 5036, 8918, -7908, -11058, 7251, 10489]
1349A0489j6174r07J3158m126j2462Q848J3935j0379j4425R379J1644r196o796
1362g012J1713L408j5329k910J6607L283j4641j304J1853l335j1307P869J2818
1375A1713r497j3439Q826J0781q894o061J1568K517j5214j663J6528J651j4636
1388e820O08J1732n295j0817R806J1837j1434j1990J0646R122j0356m359J2414
1401F094Q56j5384mJ6180J50j3955J585J0896n606r850R503J0751j0695j1016
1415a0495R648Q494r137m212J0983J033j3862l32J4819M44j2841J242J0076n268
1429E92r069R239R875j0716r972J0011P339r659k928J1443n29j4056J598J4734
1443G902j707j2594L446R528p233q095J0857Q463j1951q361J0878N760j0020j644
$$ y = [10489, -5685, -6592, 6566, 2440, -10022, -1174, 12761, 2382, -12043, -2664, 8980, -216, -7012, 4701, 8109, -7220, -10130, 6477, 9760, -4881, -6185, 5668, 2333, -8974, -1105, 11713, 2216, -11223, -2397, 8384, -510, -6571, 4997, 7514, -7700, -9363, 7165, 8816, -5820, -5212, 6520, 1225, -9592, 214, 12051, 617, -11373, -727, 8395, -1961, -6320, 6094, 6950, -8434, -8438, 7742, 7892, -6063, -4478, 6418, 812, -9038, 465, 11216, 521, -10495, -847, 7647, -1490, -5702, 5281, 6314, -7548, -7880, 6939, 7383, -5458, -4216, 5860, 592, -8477, 762, 10637, -79, -10051, -40, 7299, -2360, -5288, 6155, 5626, -8430, -6832, 7902, 6195, -6399, -2953, 6575, -658, -8753, 2104, 10567, -1384, -9745, 1133, 6893, -3127, -4771]
1457d771J1247j522j3336K275J3732j991j1627L240Q679o451p369R666P864j0670
1471a034p961R657N705q954j817J0187j238j2334K138J2902k120j0945L574Q086
1485E846o934o620J0241O803j1393o526J0463M078r671q0J0573l067j2281M026
1499d542J2494m018j0231N134P190p976n607J0732N708j1429n520J0150L398r074
1513c591J07R747k798j1316L457J1542l169r571M116O831o779n443R491N619j0346
1528b103n459R384L341q520J85R282l085j0771M047J0925m096q891N220O008p871
1543b404m315J0467M091j1170l671R982J497q803J896R129m611j0172N319J0120
1557G355n092q004N714N238p847l634R978L618j0428l470R177J683q010J324Q345
$$ y = [-4771, 6476, 4954, -8382, -6107, 7625, 5634, -5993, -2753, 5926, -525, -7894, 1772, 9636, -1034, -8995, 662, 6367, -2587, -4404, 5783, 4545, -7789, -5651, 7251, 5131, -5814, -2240, 5846, -1088, -7708, 2533, 9336, -2057, -8583, 1880, 5958, -3713, -3793, 6780, 3713, -8568, -4542, 7952, 3934, -6297, -1163, 6027, -1949, -7556, 3176, 8884, -2545, -8065, 2085, 5483, -3591, -3484, 6263, 3465, -7851, -4394, 7148, 3979, -5592, -1476, 5355, -1424, -6867, 2624, 8243, -2103, -7562, 1822, 5163, -3357, -3172, 6110, 3025, -7746, -3699, 7226, 3130, -5761, -541, 5467, -2404, -6719, 3748, 7839, -3331, -7002, 2980, 4477, -4326, -2430, 6699, 2088, -8084, -2765, 7355, 2263, -5741, -27, 5211, -2636, -6270, 3708, 7326, -3102, -6572, 2605, 4288, -3722, -2398, 5947]
1572E947l736r486M413R546m189p712M908N131p133l550R382L350j0002k998Q956
1587B827J025p882K154Q073m765q919N596Q752n532o681O187L874q102k149J0031
1602D489J785j0305j433Q997l26p617L112P564n319q235N812Q037n387o174N739
1617G39L681p385k212R107K077r431j873Q222L54p089K352P130m562p867N242
1632a515P690n070n866N592L338p359j621R092J153r404o71Q178j047o864L791
1647e83O588n984o948O596O516o259m559O486J982p767l49R113Jr107J97P760
1663C683j543o364L842O035n633o486O020O258n590m592N720K295o962q31Q361
1678D213M83q520k21P359j195o067L544N751n513o046O119N643n861l834O095
$$ y = [5947, 2211, -7275, -2862, 6684, 2495, -5217, -309, 4822, -2311, -5861, 3521, 6871, -3131, -6129, 2827, 3852, -4030, -1876, 6197, 1432, -7487, -1891, 6861, 1329, -5352, 835, 4709, -3393, -5542, 4489, 6274, -4031, -5464, 3533, 3207, -4410, -1298, 6266, 947, -7288, -1476, 6561, 1174, -5000, 739, 4420, -2965, -5177, 3930, 6007, -3424, -5297, 2925, 3279, -3810, -1458, 5672, 1110, -6757, -1515, 6175, 1105, -4761, 831, 4169, -3190, -4811, 4281, 5434, -3970, -4641, 3537, 2490, -4374, -583, 6005, 21, -6927, -331, 6185, -74, -4633, 1853, 3835, -3932, -4281, 4832, 4833, -4274, -4077, 3683, 2140, -4224, -382, 5653, 20, -6466, -446, 5812, 222, -4370, 1350, 3645, -3317, -4148, 4213, 4696, -3824, -4045, 3314, 2119, -3948, -404, 5347, -166, -6212, -93, 5550, -311, -4145, 1950]
1693A950J347p206L44Q411r12q349J287P009k684n470M845M882o543m966O870
1708H15M499o314k796O197N49p020Q63P969j151p848J253O569k311n184M173M750
1724E013n721m981O064M650n634l092N631R56o515N19P531r93p496J325O270k542
1740I85m843M589M150o196m098O589L541o143j829O002m50o567J967P292k478
1755B511o969K672N572l623m057N254L330o495l318O628K868n943j478N647m22
1770B177o157J679O845j967o663K047N483k889m158M501L525n811l518O096L070
1785D260n633j580N459m70n939J929O557k468o248K727M928l690l404N251K532
1800D211o457k245O576J634n904j60N463j774n668L056O025l334n642L346M329
$$ y = [1950, 3297, -3909, -3565, 4846, 3934, -4415, -3128, 3881, 1197, -4273, 572, 5454, -1089, -6055, 815, 5314, -1000, -3796, 2401, 2950, -4070, -3207, 4762, 3611, -4237, -2984, 3585, 1274, -3910, 263, 5013, -708, -5689, 375, 5025, -609, -3701, 1930, 2886, -3629, -3110, 4421, 3428, -4068, -2743, 3527, 985, -3858, 731, 4881, -1315, -5413, 1176, 4717, -1426, -3255, 2747, 2297, -4270, -2303, 4989, 2511, -4458, -1786, 3786, 163, -3894, 1360, 4690, -1805, -5123, 1505, 4373, -1570, -3048, 2599, 2177, -3980, -2301, 4544, 2577, -4086, -2039, 3444, 555, -3603, 898, 4423, -1388, -4906, 1190, 4260, -1373, -2953, 2506, 2036, -3903, -1974, 4583, 2115, -4133, -1406, 3522, -168, -3572, 1679, 4211, -2246, -4491, 2085, 3719, -2185, -2345, 3118, 1344, -4324, -1268, 4757, 1423, -4219, -873, 3456]
1815C456l989k868N212K148o176k054O184J719n545m92N177j245n407K416N847
1830D383k717n597K859M368l560k993M898K175n990j881O097J327n493R7N005
1845B978j970n093L285N318l714m842L856L425m435j844N504R05o291o08O170
1860B644J28n351J072M731k675m669L715M836l859m478L757L289m146j925N097
1875B166J150n842r98N819O41n168M99M635k085m640L200M849l552m444L631L156
1891C017m143j674N146P04n892k91N779k66m988J530M258l140m024M208L996m431
1907b11l443M319K146m608o26N274k17n777M68N542q10m709J775L982l074l845
1923c814L979L878m062l514L918K384m176j061M903K55n508K6N390m46m634J484
$$ y = [3456, -533, -3401, 1811, 3959, -2217, -4271, 1913, 3632, -1913, -2405, 2772, 1527, -3880, -1464, 4383, 1666, -3931, -1072, 3296, -264, -3257, 1641, 3816, -2174, -4055, 2042, 3369, -2124, -2027, 2978, 1008, -4085, -800, 4518, 804, -4038, -182, 3243, -1192, -3036, 2468, 3373, -2918, -3526, 2644, 2772, -2579, -1507, 3224, 549, -4120, -405, 4431, 572, -3906, -149, 3140, -1006, -2931, 2166, 3316, -2526, -3524, 2295, 2936, -2232, -1733, 2902, 817, -3823, -623, 4226, 674, -3770, -139, 3017, -1126, -2800, 2346, 3050, -2842, -3133, 2646, 2380, -2608, -1078, 3180, 40, -3984, 224, 4220, -211, -3654, 665, 2811, -1797, -2423, 2851, 2634, -3143, -2675, 2867, 2057, -2652, -877, 3105, 31, -3814, 165, 4043, -19, -3533, 385, 2769, -1407, -2468, 2435, 2690, -2818, -2792, 2598, 2152, -2482, -998]
1939i98L938k912l706L933L616m191l039M130J732m316k86M961o85n388J098N062
1955B949j526m141K511L238l707k897M513K751m532k230M226J125m285J46M741
1970B882q98n086J070M820j299m027K068L286l158l075L932L071m061k642L890
1985G73J541m010k64M547n44m964Q98M728j328l877K238L045l430k620M241K397
2001C371m344j780M109N50m053P68M360j607m572J909M153k166l234K844K369
2016B677l783j956M337J841m279j422L941M65l869O18M181j274m458J472M176
2031B667j682l398K362K647l320k326M034K146m078j657L838N83l789O27M095
2046B749j462m256J830L833k147k921K847J994l752j468M299J165m220o21L819
$$ y = [-998, 2940, 28, -3678, 255, 3871, -320, -3359, 771, 2503, -1813, -2099, 2862, 2177, -3211, -2113, 2949, 1423, -2718, -207, 3031, -676, -3573, 940, 3691, -841, -3071, 1155, 2280, -2005, -1859, 2882, 1984, -3102, -2032, 2788, 1489, -2538, -470, 2816, -342, -3417, 515, 3586, -475, -3117, 773, 2314, -1696, -1960, 2587, 2043, -2921, -2023, 2705, 1377, -2500, -262, 2783, -647, -3267, 974, 3371, -973, -2753, 1356, 1906, -2147, -1379, 2981, 1374, -3198, -1289, 2864, 698, -2536, 308, 2677, -1106, -3062, 1275, 3116, -1163, -2585, 1356, 1821, -2048, -1430, 2751, 1477, -2981, -1509, 2667, 985, -2413, -51, 2596, -724, -3050, 984, 3130, -948, -2605, 1233, 1816, -1973, -1346, 2749, 1287, -2969, -1139, 2694, 547, -2374, 473, 2467, -1285, -2753, 1546, 2711, -1509, -2130, 1689]
2061A689m04l573J487L693k141l788K311L380k448k526K926J743l649j343M069
2076A426J277m038q60L693rl555R90L766j621l935J886L562k080k788K677J980
2092B371l499j478M012J208m006o45L639l84l411J506L440k245l398K509K900
2107B519k677j955L116J033l720n17M052K46l860J78L409j010l099J904L103k418
2123C04l105K515K740k566j954K911J233l501q59L915O68l798k93L427n33l192
2139b088J456L251k117l250K342K829k503j970K924J066l504m94L817J58l645
2154a728L55L148j208k736K107K625k660k497K805J978k790j143L026L37l440
2169a821J16L639k91l399N89K944j243k624K004K579k440k571K515K209k517j533
$$ y = [1689, 1285, -2288, -801, 2892, 751, -3037, -726, 2654, 206, -2320, 606, 2349, -1300, -2643, 1426, 2703, -1335, -2195, 1498, 1489, -2066, -1076, 2690, 1069, -2866, -980, 2582, 502, -2286, 391, 2371, -1128, -2606, 1406, 2614, -1392, -2037, 1602, 1218, -2193, -687, 2753, 508, -2890, -381, 2519, -158, -2113, 1003, 2036, -1684, -2201, 1851, 2097, -1763, -1585, 1824, 814, -2285, -381, 2722, 304, -2801, -286, 2454, -112, -2066, 845, 2078, -1423, -2282, 1633, 2301, -1497, -1790, 1637, 1104, -2088, -632, 2619, 502, -2748, -406, 2423, -80, -2050, 874, 1940, -1564, -2058, 1759, 1917, -1728, -1373, 1775, 567, -2169, -62, 2563, -97, -2594, 211, 2189, -601, -1744, 1282, 1619, -1821, -1705, 1934, 1643, -1756, -1167, 1777, 534, -2090, -86, 2493, 53, -2518, -3, 2206, -311, -1844]
2185a844K833P83l298l62L575J34l466L06L008j038k688J922K552k480k360K585
2201A62J880k629j045K890J50l189L70L352o85l042J063K482j692k018K367J829
2217B245k756j677K763J242k638n60K742j19l029M77L188o36k966Q81K511j412
2233B56k184K058K116k498k012K545J653k563r36K728K26l046K58L193n39k967
2249a712R60K428j588j956K260J710k640j481K667R91k583j93K612n60k764R75
2265h74K781j170k434J394J912j884j472K405J277k662j173K619Q09k490k19K556
2281A375l62k788P19K885q75k661J134K204j632j811K223J614k566j443K618J009
2297A643k555k68K562m63k690R10K721j180k354J470J769j939j237K439R06k687
$$ y = [-1844, 989, 1772, -1526, -1888, 1687, 1821, -1645, -1339, 1669, 631, -2057, -135, 2417, -63, -2423, 162, 2042, -587, -1632, 1258, 1408, -1781, -1411, 1941, 1256, -1786, -723, 1759, 67, -1951, 416, 2245, -511, -2188, 575, 1817, -821, -1381, 1361, 1242, -1787, -1310, 1878, 1242, -1724, -843, 1668, 256, -1928, 130, 2246, -252, -2264, 281, 1934, -629, -1565, 1163, 1389, -1657, -1399, 1794, 1255, -1712, -752, 1676, 88, -1868, 392, 2102, -538, -2019, 648, 1639, -944, -1137, 1475, 915, -1849, -874, 1907, 737, -1697, -303, 1609, -275, -1747, 658, 1935, -727, -1900, 719, 1528, -962, -1181, 1375, 1013, -1775, -1056, 1829, 954, -1707, -573, 1631, -1, -1812, 411, 2025, -541, -1984, 634, 1643, -912, -1180, 1382, 919, -1771, -861, 1860, 680, -1674, -204, 1565, -374, -1611, 828, 1734, -953]
2313i53o42K561K09k358M31K283j059k298J364K285j483j976J636J486j984j078
2329a576K379R03k597p65K547M39k404J17K410o82k556J079K530j235k251J488
2345a74J733j905j267K375R69k608p16K559K34k341M23K210j061k208J450K075
2361A748j605j654J769J046k061n61K373K81k505m5K336k99k061P97J920j254
2377B25j958J553J893j616j602J698J198k015p76K350N56k532l78K452K5k264
2393a191N06K191j084k170J417K079j597j696J751J124k041n80K337K38k454N6
2409a114K251m22j946R66J719j484j596J750J403j803j015J829N10j993l8K180
2425A197j85k234L30K068n91j812J011J658j408j642J630J589j727j286J790Q40
$$ y = [-953, -1595, 966, 1175, -1183, -752, 1531, 472, -1826, -462, 1823, 340, -1636, 0, 1486, -498, -1576, 803, 1706, -891, -1656, 891, 1330, -1074, -957, 1453, 771, -1785, -706, 1824, 589, -1662, -174, 1559, -346, -1613, 762, 1731, -877, -1593, 966, 1200, -1141, -718, 1492, 431, -1777, -327, 1748, 143, -1511, 258, 1304, -757, -1318, 1055, 1336, -1169, -1214, 1122, 823, -1238, -441, 1479, 225, -1733, -180, 1713, 97, -1505, 193, 1391, -624, -1400, 950, 1506, -1026, -1404, 1048, 1073, -1191, -685, 1506, 422, -1748, -331, 1748, 151, -1545, 206, 1330, -711, -1291, 1046, 1284, -1170, -1114, 1137, 715, -1231, -265, 1454, -30, -1626, 124, 1527, -276, -1291, 538, 1048, -945, -983, 1197, 1012, -1222, -892, 1176, 585, -1227, -216, 1442, 34, -1608, 22, 1611, -116, -1402, 388, 1228]
2441A228k008m35K275J48k369O0K227l92j995R27J767j407j639J714J424j775
2457b50j025J821M76j970M0K113l65k081N83J832q85j475J309J199j647j072J808
2474D11R11j793n84J769J49j865K22K010m25k053N67J872p86j634J150J454j542
2491a67j373J772J234j824q93J832M51k001K2K147l32k122N50J902q61j534J269
2508G2J251j671j017J836P97j826l91J749j20j756N55J804q25j698R37J456j142
2525A1j088J408Q45j692p19J789O12j804l05J714n1j807M38J896o24j900P71J720
2543A214j012j411J322J190j668j023J864Q13j843m58J805l5j811M73J839p63
2559D96j748R57J440j165j038J447P08j708m67J768K45j661Q2J520m96j475Q38
$$ y = [1228, -780, -1215, 1060, 1208, -1161, -1101, 1126, 734, -1261, -334, 1433, 26, -1613, 101, 1525, -250, -1275, 546, 1022, -948, -908, 1205, 840, -1241, -658, 1174, 289, -1186, 123, 1322, -325, -1397, 411, 1322, -471, -1055, 714, 863, -1002, -780, 1230, 805, -1248, -681, 1191, 405, -1229, -79, 1375, -167, -1540, 232, 1466, -358, -1251, 581, 1032, -969, -947, 1200, 868, -1254, -704, 1198, 337, -1197, 72, 1323, -348, -1365, 471, 1268, -558, -949, 800, 680, -1076, -521, 1283, 458, -1240, -303, 1153, 11, -1077, 331, 1176, -516, -1235, 554, 1166, -638, -943, 771, 720, -1087, -649, 1247, 623, -1277, -506, 1214, 202, -1209, 113, 1303, -365, -1388, 476, 1289, -554, -1012, 793, 758, -1053, -580, 1259, 496, -1252, -295, 1145, -20, -1058, 389, 1097, -611, -1078, 690, 935, -726, -644, 876, 380, -1095, -257]
2576b57J449r86j374J087J140j226q35J425O31j663m95J750L64j701q9J647k79
2593E88j673O55J688q55j634R96J393j180j053J434P60j698n02J759K75j691P2
2610f66J536m96j440Q72J353j078j180J158Q75j261n02J414J80j527j3J549j41
2627F33j428L92J255o65j199R36J173j063j099J122R01j213o34J416M03j591k80
2644i41J682J03j591J40J505n21j419Q31J368j036j241J121R80j263n88J432K26
2661G88j528k4J547k07j359M52J157p67r98J037Q93j163p14J147M79j212j46J272
2679F54n9j370K19J377l43j238M97J117p83j018R90J015j136r17J178O90j258
2696c85m16J393J72j530K2J542j85j441M53J250p66j096J026R77j179p87J223
$$ y = [-257, 1192, 206, -1168, -81, 1059, -167, -1002, 423, 1054, -609, -1104, 646, 1010, -691, -780, 867, 588, -1085, -430, 1258, 403, -1231, -235, 1158, -22, -1075, 359, 1119, -579, -1081, 678, 953, -738, -666, 870, 374, -1066, -194, 1159, 81, -1099, 59, 934, -327, -829, 585, 765, -762, -775, 774, 633, -795, -403, 852, 187, -1012, -76, 1097, 34, -1065, 57, 958, -255, -889, 527, 930, -661, -941, 741, 844, -747, -607, 898, 377, -1042, -211, 1157, 121, -1120, 1, 981, -282, -870, 562, 788, -740, -764, 783, 576, -783, -331, 826, 59, -939, 98, 991, -172, -886, 261, 740, -472, -618, 654, 595, -775, -556, 821, 478, -760, -263, 854, 71, -947, 43, 1058, -78, -995, 183, 873, -385, -801, 592, 764, -766, -744, 798, 613, -828, -375, 875, 109, -987, 39, 1016, -163, -950, 273]
2713B73M68j216j20J270j51j317L57J228n01j040O98Q03r19o39J087N63j163m28
2731g47J143K06j127K8J187k28j264L52J274m73j157O37R97q55r18J089Q36j228
2749b48p02J251M93j311j38J358j15j436L25J357m93j151O83R48r34p32J145N46
2767H46j196l50J145P7j081K11J083m54j082N83R85o77p72P82N76r57m36J108
2785C91L35j165k48J121Q7j109J66J156l67j220M94J191o32j018P73Q71r93p01
2803h68J180N69j279l88J276R9j202J91J178m14j171O22J010p09q09Q65N30r87
2821c07l50J105J74j099k6J015j96r35M45Q83o22q57P09P61p44o31Q71M16r80
2840c68l19J135K20j151j16J143p4j121L35J100n41j090O68J035q10q31R46O04
$$ y = [273, 741, -475, -595, 675, 524, -793, -436, 792, 291, -749, -51, 752, -167, -806, 281, 844, -319, -747, 396, 602, -525, -497, 690, 462, -802, -450, 824, 351, -806, -169, 828, -27, -945, 144, 980, -248, -950, 301, 794, -517, -655, 703, 588, -848, -523, 834, 341, -810, -127, 821, -113, -845, 300, 846, -350, -700, 445, 522, -559, -348, 735, 281, -801, -218, 767, 90, -682, 100, 676, -281, -717, 391, 726, -439, -687, 434, 521, -588, -422, 734, 367, -853, -359, 832, 200, -818, -45, 826, -167, -868, 312, 881, -398, -786, 490, 589, -613, -422, 756, 342, -829, -207, 803, 94, -715, 150, 680, -307, -657, 448, 622, -477, -503, 512, 316, -619, -174, 709, 87, -770, -61, 700, -44, -675, 196, 612, -368, -687, 448, 668, -483, -599, 544, 470, -651, -316, 784, 243, -847, -179, 856, 46, -785, 161, 765]
2858G65j099l80J179K22j218k1J121k13j013M84R34p13q23Q05O58q31m74R14K12
2877E09r85j7J019j07j005K40R00l78p97N58P78p24p47Q06O84q77n16R67L30j087
2897d49j47J148P3j228J00J152k89j079N39J015p49r48Q82P73r60n41J042K70
2915F04j107o0J162j31j077K67R42m72p95O89O61q31n52R02L97q89k07R26rr67
2935e47J63J007k65r65L68Q85n35p88O98P45q62o81R50N72j021l72J072J82j191
2954e85L1J229j95j198L53J082n76r19P81P86r67o26J027M44j027j84J025o8j042
2973f29K70J029m34q92N51P40o87n65Q41M08r37k87R51J86r46j8R66k13r54L26
2993b94R96m59r48N64Q58p39p20Q86O08j027n12J113L69j133j26J120j26j139
$$ y = [765, -334, -714, 465, 687, -531, -552, 569, 356, -657, -173, 761, 48, -775, 30, 688, -143, -617, 297, 509, -476, -493, 526, 419, -586, -346, 554, 176, -621, -63, 715, -9, -756, 50, 734, -143, -659, 308, 638, -449, -596, 552, 625, -603, -503, 649, 360, -719, -180, 835, 86, -862, 20, 793, -167, -708, 334, 604, -503, -563, 599, 468, -609, -342, 600, 128, -667, 22, 683, -148, -700, 202, 599, -290, -497, 429, 420, -547, -384, 623, 358, -607, -239, 646, 111, -677, 21, 766, -96, -777, 173, 745, -276, -648, 424, 606, -585, -554, 675, 480, -718, -365, 717, 141, -778, 3, 789, -178, -804, 223, 667, -360, -544, 481, 413, -629, -359, 670, 236, -656, -105, 635, -52, -617, 224, 632, -305, -592, 359, 545, -401, -419, 547, 334, -620, -294, 702, 243, -705, -141, 717, -22, -742, 144, 752, -275, -787, 326, 695, -438, -564, 556, 430, -709]
3011g09L49J090m81j014O69Q32q25o03R41M39j041k65J047N8r71J63R12l63q77
3030f49N50P90o60o66P16N06q10l37R08K18r94j17J017l7r63J74R70l79r50N22
3050a91R41o58q48P58P22q97n23J030L69j138k05J160Lj103K28J019m43r41O08
3069a09Q65p42o76Q10M63q98k45R71M5r74P7R45k45q30M08P39n86o71P09N68p39
3090a15n08Q39L14q70j92R83L9j022P4J016j93r81L67R28n69q63P12Q19q38o60
3110g20R19M71r98k62J070O5j096J09J045k89r28M78P84o46o80P95N31q36l91
3129e79Q60J57q73L8R01j87q77K88Q19m06p04N37O18o98n35P94M76q63l45Q81
3149C02K10r29l6J005r4j050K34J008l84r30N56Q23p34p04Q58N80r50m15R76K01
$$ y = [-709, -360, 730, 249, -765, -96, 736, -89, -692, 249, 688, -353, -618, 429, 487, -484, -321, 591, 228, -649, -99, 691, 31, -635, 81, 587, -223, -560, 348, 566, -428, -545, 472, 435, -528, -354, 616, 237, -713, -191, 750, 92, -756, 2, 724, -173, -696, 334, 703, -435, -640, 520, 523, -580, -352, 667, 224, -717, -109, 756, 14, -662, 148, 611, -287, -532, 439, 484, -490, -413, 532, 287, -543, -135, 604, 18, -653, 56, 624, -115, -623, 216, 530, -340, -532, 451, 490, -532, -458, 558, 365, -616, -249, 679, 110, -753, -41, 778, -60, -720, 199, 670, -328, -590, 480, 545, -551, -442, 603, 314, -614, -136, 648, 2, -678, 117, 648, -188, -579, 281, 438, -435, -397, 504, 317, -560, -272, 547, 141, -563, -26, 592, -106, -641, 153, 629, -234, -579, 302, 512, -417, -453, 552, 458, -592, -358, 650, 266, -664, -108, 715, -19, -723, 135, 715, -235, -650, 326, 527]
3169E27r94L4R77j91r75L75Q37m82p19O45N45p56m06Q34K66q41j28Q30l5q27K20
3190b64Q22l22q24M44P31n22o35O55N35p63m70Q79L45r17k35R38P9r75J13R89
3210F03k71r90M27R01n75p55P00O16q48m71R24L24r55j06R02q3q69K70Q42m35
3230A51p51N21O24n93m65O96L14p57k17Q17J13q31J3Q09j75p78L26P84m73p42
3250f14N63O78o62n68P68M45r17l16R61K08r71m5R72j57r44L35R20n05q08N86
3270g1P10p17n09P90L41q67j78R03K5q58J15Q02k99p15M67O35n58n62O20M41o62
3291a47l14P15J98q08n1Q20n7q22J82P73k89p62M36P39n80o76O54O08p59m77Q69
3312B52L03r31j66R88J4r33J30Q97l26q05M85P05n98o07O89M58p41k86P72J13
$$ y = [527, -467, -433, 544, 353, -622, -247, 590, 108, -611, 34, 579, -177, -583, 251, 517, -324, -452, 378, 343, -484, -264, 558, 236, -588, -144, 587, 65, -570, 85, 620, -143, -613, 266, 611, -306, -541, 397, 476, -499, -386, 603, 332, -658, -231, 670, 95, -660, 40, 656, -192, -663, 261, 585, -370, -476, 426, 343, -526, -256, 586, 151, -600, -79, 545, -48, -513, 183, 497, -260, -477, 340, 453, -378, -365, 444, 269, -509, -183, 601, 128, -614, -51, 627, -35, -603, 165, 610, -307, -623, 338, 546, -425, -470, 502, 345, -599, -264, 656, 151, -657, -71, 639, -78, -587, 203, 544, -323, -501, 402, 427, -431, -316, 486, 187, -528, -61, 574, 16, -546, 74, 515, -147, -461, 254, 452, -356, -407, 413, 356, -466, -284, 489, 200, -562, -126, 613, 33, -643, 11, 619, -140, -617, 252, 555, -376, -542, 446, 460, -473, -343, 554, 228, -577, -92, 613, 15, -592, 97, 555, -186, -472, 300, 413]
3332D13q03L7P80j65p04K59O44l96n48M81N13o00m33O59L26p03j97P47P4p78J5
3353c79Q50j61q25K74P63l86p17N53O46o53n76P35M58q13k82Q70J08q81K7Q95
3373E06j74q16K95P00m51n78N50M97o49l66O73K22o57j09O86m5o96J79O53k25
3393A95o21L24N48m46m77N53L95o17l21O65K39p23j09P57Lq07J62P85k37p81L62
3414a51O91n05n82O35M93p28l99P54K61p88n7P60q6p49K00P15l34n89L98M97n04
3435f8l81N88K73o12j80O19O6o06M1O48j89o29K81N85l29n36M16M55n09l83O13
3456A63L18o99k14P21J20p51RP67j62p53K76P19l91o55N04N29n98l96O63L08p31
3477b53j66P03M2o85J14O36k29n99L41N22l97m31M67L15n29j92N62J25n98l5N88
$$ y = [413, -390, -353, 427, 262, -442, -183, 461, 65, -483, -2, 511, -89, -522, 137, 463, -240, -437, 310, 384, -394, -379, 471, 310, -515, -241, 522, 136, -581, -28, 618, -35, -611, 124, 582, -231, -513, 357, 465, -416, -389, 506, 332, -484, -189, 511, 60, -518, 32, 529, -120, -486, 187, 409, -248, -357, 329, 284, -412, -233, 420, 195, -426, -102, 446, 0, -477, 76, 471, -146, -467, 198, 437, -286, -395, 362, 365, -442, -280, 505, 268, -513, -151, 540, 35, -547, 88, 581, -147, -546, 208, 469, -319, -376, 384, 298, -451, -251, 464, 130, -459, -61, 436, -68, -449, 139, 412, -200, -380, 239, 305, -301, -260, 388, 199, -430, -149, 436, 107, -429, -13, 442, -67, -450, 163, 481, -218, -432, 289, 409, -342, -333, 434, 272, -481, -205, 514, 123, -532, -28, 501, -97, -493, 170, 478, -253, -419, 284, 326, -359, -245, 391, 162, -437, -96, 426, 29, -402, 65, 380, -149, -341, 221, 346, -252, -287, 301]
3498C01l6n88J48N85k80n48L51N21m28m83N34L68o14k80O95J76p27r9P57l1p28
3519d06J66O96l08o40M14N67m83m61N48L17n96k00O52R2o56L1O13j41n38K36M81
3540C84l38m30M02L61m37k85M88J82n39q0N35K0n68O6N77j60n61K53N47l69n12
3561d64M45M66n19l78N80K64o29j44O84M0p09P4O80j72o12L02N39m08m65M73L76
3582D23n24k75N50J37n46k5N53o1n46J61M69k43l98L12L59l93l16M26K69m68j83
3603c19N04Q6n43NN69o2n92J48N91k70n27L64M77m57m11N48L26n87k39O46J06
3624C63o58K0O58j32o15K24N40l23m57M00L72m74k93N19J96n37o4M76Ln13J21
3645a74M74j90m49K61M00l22l40L99K77m55k17N05J59n43p1N66k9n74J23N74k01
$$ y = [301, 265, -323, -175, 410, 130, -418, -67, 454, 26, -457, 77, 445, -169, -449, 246, 422, -305, -404, 353, 322, -406, -240, 456, 148, -492, -78, 489, 6, -455, 93, 410, -186, -386, 266, 358, -298, -267, 346, 205, -333, -97, 384, 46, -384, 18, 379, -58, -343, 145, 327, -212, -292, 243, 263, -305, -239, 338, 178, -383, -130, 417, 48, -464, -19, 447, -72, -450, 130, 394, -235, -379, 305, 345, -364, -290, 390, 218, -394, -92, 447, 39, -426, 47, 423, -101, -376, 174, 311, -235, -260, 293, 232, -314, -153, 316, 73, -325, -13, 346, -47, -363, 63, 332, -136, -319, 185, 271, -272, -267, 302, 240, -352, -204, 387, 117, -410, -46, 431, -26, -437, 111, 437, -150, -389, 257, 363, -295, -275, 383, 251, -364, -140, 400, 77, -380, 20, 392, -82, -375, 144, 340, -197, -261, 215, 218, -295, -174, 300, 110, -339, -78, 322, 0, -340, 59, 336, -119, -336, 169, 328, -215, -286, 280, 251, -323, -200, 374, 173]
3666A73n80L19N19l98m35M88L38n58k64O09J48o14m3N95o8n70J83N11k70m56L27
3687d6L92m20k62M40J89m52j28M92K5m73N5M52j36m31K26M16k91l89L63L22m12
3708f8k46M55K07n50r4N66M5n93L8N81j64n58K74N22l72m59M14M05n10k69N30
3729A54J73n65p1N72k1n49J32M94k22m49L29L63l61k96M07J92m07j17M34L3m42
3750b17K6M49r9m11J62L94k34l74K93L63l73k99M16K45m88j45N14O6n67QN59p7
3772B11n57J96N01k87m46L70L88m18l16M54K17m90q4M77J6m87P9M53j54l89K18
3793d8L34k75k80L32K20l71j52L69Q2l72k3M08o3m18J08L99j46l88K36L38l22
3814c2k98L86K52m19k09M64J45m88o0N06m4m98J00M99j83m36K68L85l53k97L90
$$ y = [173, -407, -88, 431, 33, -402, 86, 424, -134, -398, 211, 359, -255, -298, 297, 229, -341, -158, 353, 83, -373, -46, 346, -74, -336, 104, 293, -159, -287, 205, 230, -243, -188, 264, 128, -303, -77, 339, 48, -341, 22, 344, -68, -314, 141, 348, -202, -296, 270, 315, -278, -240, 341, 177, -381, -107, 415, 43, -416, -2, 403, -107, -376, 154, 327, -238, -309, 263, 242, -307, -175, 319, 97, -352, -23, 340, -21, -317, 90, 282, -125, -242, 192, 225, -217, -191, 258, 159, -252, -90, 304, 70, -304, -11, 352, -21, -320, 96, 341, -147, -292, 222, 288, -279, -271, 288, 211, -346, -150, 351, 64, -382, -12, 376, -42, -358, 96, 313, -177, -261, 216, 232, -255, -176, 277, 123, -266, -48, 286, 11, -269, 63, 283, -88, -240, 129, 211, -161, -184, 224, 161, -257, -149, 250, 104, -284, -48, 290, -32, -330, 56, 308, -111, -320, 144, 289, -199, -259, 247, 203, -295, -195, 304, 121, -315, -47, 338, -15, -312, 78]
3835G8K24l94j53M12M2l87J6L94j08l71J71L33k17k94K75K08k88j86L46J13l66
3856a52n8L61Rl79O2L86j15l99J87L89k54l38L01L00l46k43M03J91m57j22M89
3877B15K9m80O2M47j31m33J97M05k74l03L09K29l57j49L62Q9l88j4L75m6l47R9
3899a04L11j51k99K20K47k48k09K80J64l05j35L61P2l87pL92m2l82J13L86j99
3920G8l70K68L30l19k88L74K34m30j55M62P3m83K2M24r4l92J54L87k36l38K84
3941a5K73l16j91L34J17l34n9L48%l57N6L24r9l04J84K68k25k49K80K00l09j47
3963b21L29J23l83l5L69J0l88O1L79j36l82K13L49k86l03L30K64l76k05M13J03
3984B28m19j9M05k7m20J30L55j72l23K47K47k64k08L16J15k95o9K96L1l09L3L29
$$ y = [78, 302, -92, -245, 167, 209, -178, -162, 232, 124, -247, -76, 257, 40, -254, 21, 229, -59, -245, 101, 214, -152, -210, 151, 160, -219, -157, 229, 114, -285, -98, 291, 37, -301, 0, 300, -46, -289, 114, 305, -152, -274, 215, 244, -236, -174, 273, 142, -291, -94, 311, 37, -266, 43, 272, -85, -234, 128, 217, -171, -185, 190, 144, -203, -104, 207, 56, -243, -23, 224, -24, -233, 47, 211, -94, -229, 132, 204, -183, -190, 202, 160, -222, -109, 277, 78, -292, -24, 306, -13, -301, 73, 307, -123, -278, 184, 257, -226, -204, 220, 126, -266, -112, 275, 39, -299, -15, 258, -58, -249, 85, 202, -132, -191, 157, 157, -200, -144, 180, 81, -223, -39, 229, 4, -245, 35, 235, -74, -221, 108, 231, -152, -187, 182, 192, -196, -135, 244, 108, -274, -61, 288, 2, -301, 29, 293, -83, -288, 125, 228, -191, -210, 195, 168, -252, -122, 233, 61, -262, -15, 232, -32, -240, 76, 191, -104, -173, 123, 154, -155, -122, 207]
4006B07r7l18J51K76j87k62K61J98k73j79L09J60l64q4L70K2l90L2M00j08m00
4027b76J78L70k53l22L07K82l56k13L82J32l75p1M02ql85P9L61j23l19J83K53
4048B28k28k05K46J82k81j13K92N4l09j0L05l2l20J10K93j55k83J93K57k43k27
4069b46K92K01l65j47L86P7l82j6L94m5m11J44L90k08l55K66L20l30k37L74J52
4090B54l82r6L98J1l47L8L36j07l13J55K93k15k43K43J89k76j42K98J02l23m7
4111a74L22j1l13P5L02j41l26K18K90k45k62L08K15l47j73L92J08m20l7M33l6
4132A78m35J33M06k04l50K64K96l01k55L36J89l79j08L96J9l73L1L63r4l54J70
4153g2K85k01k58K44K14k86j53L20R1l22n1L52nl65O1L69j32l43J96L18k56k76
$$ y = [207, 110, -208, -57, 219, 32, -230, 31, 229, -44, -223, 86, 246, -118, -202, 168, 190, -200, -168, 232, 124, -276, -98, 272, 19, -303, 4, 286, -70, -283, 99, 231, -144, -215, 187, 179, -206, -127, 234, 111, -208, -25, 228, 0, -205, 41, 223, -58, -171, 121, 175, -134, -144, 161, 129, -191, -81, 212, 57, -226, -33, 224, -19, -246, 46, 247, -118, -265, 121, 198, -184, -200, 194, 149, -262, -118, 272, 64, -291, -25, 295, -35, -272, 102, 254, -128, -224, 174, 185, -162, -124, 212, 105, -208, -53, 240, 25, -218, 25, 214, -62, -204, 94, 196, -127, -174, 148, 137, -176, -101, 201, 60, -266, -48, 242, -3, -265, 43, 258, -89, -262, 130, 238, -182, -219, 214, 178, -257, -124, 282, 78, -272, -8, 288, -13, -268, 68, 257, -122, -230, 166, 185, -188, -157, 206, 112, -242, -72, 213, 12, -246, -2, 212, -74, -227, 93, 184, -138, -189, 163, 158, -207, -146, 223, 91, -252, -56, 262, 6, -270]
4175b70L00K61l59k15L95J54m41o4M58k4m36R6M02j62l78K52L17l11k62L39J99
4196B51l74j24L81K8l75O3L55r2l58J65L11k07k75K54K13k71j80L44J23l54q6
4217b08L83L0m03N6L97j34l75J90L68k65l26L12K92l76k15M08J55m74o0M52j3
4238A94m48Q9M31j67l85K14L55k96k93L34K22l62j59L99Q0l76rL78p4l61J51L34
4260B51j86l23K65K48k90k02L20J74l76r8L93M6m16RM20r4m03J58M02k50l66L03
4282a5L30l61k70M10J77m34j01M44M1m64N6M32j27m06K16L49k49l06L31K33l55
4303f9j73L87P9l73k3L83m3l77Q6L79j74l32K26L15l08k45K93K35l62j69M01R3
4325B29m25k5M49m7m51J18M42k15l80K71L37l20l01L82K24m20j35M42O8m66K8
$$ y = [-270, 30, 291, -68, -283, 112, 266, -175, -239, 219, 195, -241, -145, 257, 95, -283, -31, 286, -25, -287, 52, 251, -123, -247, 134, 162, -213, -150, 205, 113, -245, -80, 231, 24, -251, 3, 216, -55, -235, 109, 232, -122, -208, 175, 205, -198, -142, 255, 121, -254, -64, 304, 39, -287, 25, 317, -59, -274, 134, 289, -185, -245, 207, 194, -254, -165, 266, 99, -286, -72, 283, -13, -306, 28, 250, -112, -271, 128, 208, -168, -177, 201, 127, -234, -83, 251, 65, -258, 7, 255, -35, -237, 83, 257, -119, -217, 176, 222, -194, -185, 235, 141, -262, -104, 298, 48, -318, -15, 315, -46, -316, 94, 271, -163, -264, 180, 221, -243, -187, 245, 118, -288, -72, 277, 28, -278, 53, 286, -69, -242, 145, 224, -149, -172, 211, 168, -209, -123, 256, 82, -250, -24, 291, -17, -262, 31, 266, -96, -265, 136, 229, -196, -221, 228, 181, -270, -152, 290, 75, -305, -34, 303, -17, -318, 64, 288, -132, -267, 175, 243, -223, -195]
4346a95M55j01m32J72L67k01l42K97K73l56j95L68J33m06o0M01j9l82O6M03j44
4367A02l54J73L37k61l00L34K50l54k46M24J48m28p3M59%m74J08M24j52m28K55
4388e6L68k89l31L66K59m23j83M32J17m58KM36o2m37J28M04j91l63K66K97l16
4409c4k45L47J96m02j05L96L6m09M5L95r7l77J50L87k39l34K89K78l12k65M08
4430A08J64m12j14M55L4m73M3M71j25m47J91M35k86l64L35L02m04j97L86J53m45
4451a90m9M41l2m13J28L50j55l61K23L21k88k49L11K06l52j47M10M0l73%M00n8
4473A63m02J22L89j96l54K45L52l24k75L65J93l93j46M41O7m72RM67q3m52J73
4494a11M11k58l65L09L14l81k12L78J58l93q1L98J6l99N5L92j19l64J88L39k53
$$ y = [-195, 260, 159, -273, -101, 266, 65, -277, 20, 293, -63, -258, 110, 243, -163, -223, 178, 159, -223, -157, 246, 102, -252, -79, 258, -3, -303, 31, 281, -73, -319, 105, 253, -175, -248, 211, 211, -263, -155, 269, 117, -311, -56, 312, 23, -308, 58, 317, -106, -289, 143, 260, -198, -196, 240, 178, -259, -131, 273, 82, -281, -15, 282, -34, -279, 68, 264, -138, -243, 153, 189, -220, -175, 220, 123, -254, -104, 283, 44, -290, -1, 277, -35, -300, 108, 272, -140, -254, 201, 235, -238, -195, 276, 151, -296, -105, 330, 44, -320, 15, 317, -87, -284, 102, 255, -190, -239, 202, 170, -243, -115, 235, 80, -281, -58, 263, -25, -274, 37, 243, -109, -256, 154, 194, -179, -179, 221, 163, -239, -117, 272, 76, -278, -33, 319, -5, -280, 85, 278, -115, -261, 180, 247, -225, -216, 251, 168, -284, -111, 300, 42, -323, -14, 300, -81, -293, 85, 243, -150, -231, 167, 183, -216, -161, 231, 112, -252, -64, 275, 22]
4515B2k87K86K50l18j80L49J27l88n6M05k5m14R5L91j38m22K44L63l05k96L39
4536D2K43l63k16M28J22m63l5M50j3m51J05M19j80l94K49L39k86l02L65K09l70
4557a02j35L81J10m31NM06n8l94J30L49j90l11K15K88k82k48L57J76m08j18M11
4578A51O8m33K0M33j05m19J60M09k34l67K95L36l60k71M18J89m57r5M49M0m51
4599b24M9M43j30m10J98L76k75l00L09K59l65j97L84J42m17n0M17m0l86P7M03
4620B63j55l64J85L28k67k91L35K31l57j88M09J08m16m4M44k6m68J26M44j73m30
4641c06K65L52l17k98L69K53m25j76M66Q6m56qM54q5m37J42M19k18l79K84L07
4662B92l49k31L83J60l99j11M24L8m36M4M18j11l92J73L86k63l32L02L04l62k33
$$ y = [22, -265, 21, 271, -47, -227, 122, 249, -139, -195, 210, 185, -229, -134, 257, 119, -303, -59, 304, -1, -297, 42, 285, -78, -294, 134, 256, -207, -242, 208, 195, -256, -151, 268, 88, -306, -57, 282, -4, -306, 59, 268, -102, -237, 144, 254, -177, -172, 234, 176, -218, -88, 261, 71, -240, -25, 263, -19, -267, 90, 266, -142, -260, 151, 219, -214, -194, 239, 134, -285, -125, 284, 50, -317, -22, 314, -46, -317, 101, 290, -167, -262, 187, 227, -224, -175, 268, 138, -272, -74, 302, 27, -273, 36, 295, -70, -267, 117, 259, -158, -208, 209, 169, -217, -140, 263, 108, -256, -71, 257, -10, -301, 34, 265, -92, -280, 129, 237, -179, -223, 221, 195, -273, -147, 297, 124, -306, -41, 311, -6, -304, 65, 318, -107, -283, 183, 269, -187, -195, 259, 174, -263, -121, 298, 80, -299, -15, 292, -57, -288, 95, 255, -144, -255, 169, 207, -229, -185, 233, 122, -270, -97, 289, 26, -306, -4, 300, -62, -295]
4683b95M03J62m44o7M55J7m88R3M74j63m55K50L81l03l52L71K79m05k11M36J30
4704B68m75k0M58n7m35R5M34j81l83K62L27l06k81L59K05l76j49M08Q1m33KM26
4726B29n4m22J21M18k17l76K82L41l48k91M13K18m54j30M80O0n06L6M92j29m62
4747b99J78M35k72l83L48L13m00k39M18J84m39j07M70rm49P9M34j42m06K14L72
4768C00k75l22L53K25l62j99M26J11m28m8M53l4m58J01M38j84l99K44L77l11l42
4789c34M00K53m39j99M80J01m98j8M99o3n06J55M81k38m06L02L54l61k85M23K05
4810C06m32j51M53O1m67L6M69j09m47J75M10k28l78L05L19l69k55M20J76m50j08
4831b64M63K6m68M8M91j59m61K24M24k99l79L89L04m25k56M72J83n06j00N49j6
$$ y = [-295, 108, 270, -174, -241, 214, 231, -257, -164, 310, 147, -308, -58, 323, 20, -332, 39, 318, -87, -298, 138, 268, -207, -227, 231, 174, -261, -166, 268, 87, -296, -34, 293, -13, -294, 65, 270, -106, -255, 153, 234, -199, -197, 229, 175, -247, -126, 292, 75, -301, -19, 322, -26, -317, 96, 314, -140, -270, 210, 270, -236, -200, 292, 163, -299, -121, 314, 42, -341, 7, 320, -80, -319, 99, 283, -156, -263, 207, 198, -251, -172, 262, 120, -286, -72, 300, 25, -297, 56, 281, -81, -280, 146, 257, -171, -219, 234, 200, -258, -157, 281, 97, -302, -58, 319, 8, -334, 66, 319, -120, -319, 161, 262, -236, -254, 245, 182, -324, -169, 312, 74, -332, -30, 324, -37, -322, 101, 306, -126, -277, 176, 237, -230, -194, 275, 166, -281, -106, 304, 76, -302, 3, 322, -47, -302, 118, 294, -156, -264, 199, 225, -243, -195, 296, 137, -324, -100, 324, 25, -354, 35, 339, -86, -342, 130, 313, -193, -293, 256, 240]
4852B40n38J29M75j76m53K44M29l37l36L70K90m37j83M39J14m74l1M76m5m62J15
4873a51M45k11m07K79L59l36k83L70K29m54j45M98N5m88LN00r3n01J92M86k91
4894E6m10L58L62m13l05M69K21n16j12N05M1n00M0N13j45m73K30M24l05l88L58
4915A0L11l77k75M59J53m63r0M92k0m66Q7M37j53m29K58L75l04l48L73L06m34
4936i8k16M84J18m81n4N03m6n16J39N16k29m65L16L84l70l25M31K75m90j85M98
4957A89R8n21KN02r0m85J57M53k47m05L20L51l74k84M12K18m49j20M59M5m61K6
4979b04M63j11m42K07M05k72l72L37L34m01k77M61J82n00r0N05K2n11Q8M96j76
5000A44m84K63M17l17l83L98L12m67k24M81J43m84p7N13n4m43R5M55j83m22K65
$$ y = [240, -298, -169, 306, 130, -323, -79, 350, 13, -323, 47, 337, -100, -283, 156, 270, -204, -235, 241, 196, -266, -151, 294, 83, -324, -45, 314, -22, -305, 65, 294, -160, -305, 193, 248, -240, -237, 263, 170, -331, -139, 347, 56, -354, 4, 366, -47, -352, 117, 338, -178, -290, 215, 256, -244, -204, 309, 164, -309, -79, 345, 40, -348, 10, 321, -56, -331, 128, 281, -182, -272, 220, 200, -266, -179, 258, 105, -324, -66, 309, 5, -343, 30, 336, -98, -314, 170, 288, -193, -247, 256, 210, -306, -167, 349, 120, -345, -29, 355, -15, -340, 91, 366, -124, -309, 189, 287, -234, -232, 270, 180, -305, -148, 305, 58, -347, -27, 324, -50, -334, 78, 296, -153, -273, 186, 231, -230, -204, 259, 148, -294, -87, 318, 46, -326, 11, 345, -56, -333, 128, 310, -190, -280, 225, 247, -264, -176, 320, 144, -340, -77, 340, 23, -360, 38, 350, -117, -341, 140, 283, -201, -278, 235, 181, -262, -167, 288, 105, -317, -52]
5021e2L56l07l08L69K52m16j87M55J08m62k6M68o5m58J33M48k16m10K81L76l63
5042b4l17M36K26m62j58M99N9n13M1M80j02m91J96M59k72m15L44L54m08k67M52
5063A17J98m89q9M73K6m60L0M58j19m48K41L73k74l48L36L04l98k20M12J69m35
5084a43j20M89j9m59Q2M44j38m60K53M00l29l58M04K91m54k08M93J07m91n1N22
5105B55l3m97J20M69j97m27K69L81l47l14M09K25m35j67M71Q2m67pM56o2m48J14
5127a50M36j95l91K75L51l64k85L98J96m26j23M52O7m73J0M89j21m52J82M38k63
5148E1l85L33L35l83k75M56J80m86r9M95K4m94P6M69j36m62K17M04k82l57L39
5169B0K89l82k23M35J41m31j07M56j0m31Q3M06j24m35K20L98l09l07L37K70l99
$$ y = [-52, 304, -3, -311, 58, 310, -106, -293, 162, 270, -192, -218, 250, 185, -273, -140, 308, 92, -318, -37, 339, -24, -341, 95, 321, -141, -299, 200, 259, -254, -213, 267, 165, -326, -130, 329, 57, -358, -14, 340, -68, -335, 117, 315, -174, -263, 210, 236, -224, -194, 264, 145, -303, -62, 311, 37, -311, 25, 329, -69, -289, 123, 292, -143, -263, 226, 207, -252, -170, 274, 136, -324, -71, 329, 0, -358, 46, 337, -117, -325, 168, 275, -216, -267, 255, 222, -275, -155, 314, 117, -310, -41, 340, -7, -321, 88, 313, -122, -289, 182, 264, -203, -210, 246, 184, -264, -150, 286, 91, -300, -25, 326, -38, -323, 75, 271, -155, -278, 174, 241, -232, -222, 267, 146, -306, -124, 314, 51, -334, -1, 334, -49, -324, 132, 312, -174, -273, 222, 246, -248, -172, 297, 161, -301, -84, 320, 38, -319, 20, 309, -73, -296, 139, 280, -151, -258, 198, 188, -243, -160, 246, 122, -313, -93, 305, -4, -311, 26, 296, -103]
5190a03k00M52J27m68m0M78n5m79J58M48k19m02K81L57l54l14M20K39m55j59M80
5211A92P6m88kM90r0m58J48M28k43l92L08L26l31k75L73K05l97j34M19P8m57L0
5233a94M34j04m30J93M05k55l43K95L23l84k46M14J78m49r2M56J6m81P0M80j52
5254A34m53K37M16l07l49L45K86m30j87M30J48m61p0M69l0m30Q8M28j56m04K38
5275e8L65k96l42L63K59l85k02M38J26m46k6M34m1m33J11M32k02l97K69L48l21
5296dl03L91K35m60j49M65Q6m95J7M90j11m74J82M38k51m12L41L37l86k53M12
5317I6J90m44j05M66L4m58M0M42j08m32J92L87k37l67L07L05l56k48M08J77m34
5338a45r8M49om41O5M56j65m14K18L90k99l46L70K72m32j82M59J23m88n0N09m3
$$ y = [-103, -303, 149, 276, -192, -232, 246, 191, -288, -130, 318, 99, -303, -22, 335, -19, -333, 87, 326, -129, -288, 192, 268, -220, -222, 268, 178, -280, -132, 296, 53, -339, -31, 295, -36, -311, 62, 267, -130, -264, 155, 233, -224, -194, 240, 136, -294, -101, 304, 49, -294, 1, 324, -60, -306, 108, 286, -163, -255, 201, 217, -264, -194, 286, 134, -319, -82, 334, 27, -322, 23, 309, -121, -308, 122, 270, -191, -261, 208, 178, -252, -164, 264, 108, -296, -58, 307, 11, -331, 32, 291, -94, -296, 142, 268, -178, -204, 230, 189, -244, -133, 299, 97, -300, -31, 317, -4, -307, 84, 319, -141, -290, 175, 261, -234, -217, 273, 162, -312, -130, 308, 57, -355, -14, 323, -63, -316, 96, 286, -158, -263, 203, 237, -221, -181, 261, 153, -279, -87, 300, 63, -304, 3, 308, -48, -296, 112, 289, -145, -243, 206, 200, -241, -176, 280, 115, -299, -81, 309, 10, -336, 34, 306, -126, -308, 151, 274, -214, -264, 245, 202]
5360B02m95J55M55k15m16K72L71l42k91L76K53m39j70M73P4m59KM57p5m71J74
5381a09L98k08l91K86L38l35k78L66K19m22j24M43M1m78N1M69j29m45K07M19k79
5402C9l71L38L32m11k52M56J67m78r0N12rm86R0M80j73m54K45L99l01l41L60K64
5424C16l92k25M34J40m66n2M62k1m63R8M31j64m03K44L63l10l22L70K56m14j93
5445c11M68J12m81j7M77p4m66J48M62k22m21L24L32l51l01M22K17m63j50N03M5
5466B53m80J9M86j09m65J90L90k31l56K96L10l66k44L80K06m32j20M38O3m74M2
5487b04M42r4m33K00M03k67l53L38K76l63k47M41J57m75o3M92k7m73R0M64j81
5508A23m33K68L71l29l29L90K67m29k09M77R3m68l0M84o1m77J41M38j92m04K67
$$ y = [202, -293, -138, 317, 102, -314, -42, 329, -13, -304, 72, 325, -114, -284, 189, 263, -196, -194, 263, 188, -283, -109, 289, 81, -310, -24, 314, -21, -299, 67, 286, -136, -260, 183, 224, -254, -203, 266, 137, -308, -101, 318, 39, -332, 6, 338, -73, -325, 131, 298, -180, -270, 242, 233, -253, -163, 317, 144, -310, -65, 334, 33, -308, 52, 316, -76, -301, 133, 273, -193, -245, 217, 196, -267, -169, 262, 98, -305, -61, 302, -8, -330, 40, 296, -118, -311, 157, 269, -212, -229, 248, 174, -292, -144, 318, 96, -325, -1, 331, -20, -321, 101, 318, -145, -295, 208, 253, -227, -208, 278, 169, -296, -106, 284, 53, -303, -7, 303, -63, -307, 73, 279, -153, -273, 165, 228, -246, -204, 238, 144, -289, -89, 314, 47, -306, 32, 308, -55, -302, 139, 296, -179, -242, 250, 223, -250, -160, 304, 123, -310, -42, 329, 0, -329, 61, 328, -101, -310, 167, 260, -208, -238, 246, 185, -292, -151, 287, 95, -309, -42]
5529d2L63l43k93L75K53m34j35M06J08m48j9M67o8m38J36M18k45l83L13L35l66
5550d0k63M02J94m55j11M66L7m71L7M66j10m59K20L84k72l52L40L12m09k48M53
5571A21J50m42r0M76J2m68O3M69j49m29K11M00k79l44L44K60l67k24M15J64m55
5592a62o0M62l0m56R8M36j69m17K52L47k98l16L81K45m47j58M60Q8m78qM78q0
5614A68m53J60M45k41m08L16L29l41k79M13J95m16j35M32N4m34JM63r9m10J43
5635i7L87k13l75K97K94l31k66M04J83m30j27M43M6m44M7M39j39m06K07L75l05
5656a1l14L42K87l86k17M17J49m52m1M54l9m46J05M41j87m12K48L68l08l04L45
5677C9K51l72j90M29J15m39n5M30l4m20J11L97j75l65K20L33k75l07L79K00l94
$$ y = [-42, 321, -22, -315, 60, 313, -121, -256, 150, 258, -190, -209, 258, 190, -248, -112, 306, 61, -322, -9, 326, -40, -303, 99, 293, -162, -273, 193, 230, -241, -204, 262, 152, -307, -87, 297, 25, -327, 13, 325, -84, -332, 121, 271, -171, -261, 215, 227, -241, -178, 291, 142, -287, -76, 324, 45, -299, 45, 305, -62, -286, 129, 293, -162, -222, 240, 210, -246, -148, 288, 119, -298, -46, 301, 3, -313, 68, 313, -134, -292, 168, 256, -222, -230, 248, 168, -285, -125, 320, 79, -329, -13, 316, -25, -304, 109, 304, -112, -247, 185, 239, -195, -194, 269, 170, -240, -97, 290, 77, -298, -1, 293, -38, -304, 100, 283, -147, -274, 169, 215, -229, -182, 257, 118, -288, -81, 294, -11, -325, 17, 304, -82, -299, 118, 267, -185, -226, 228, 189, -257, -152, 289, 102, -310, -62, 306, -2, -306, 39, 290, -82, -272, 157, 272, -167, -222, 208, 174, -246, -135, 262, 87, -278, -58, 275, 0, -307, 72, 272, -122]
5698a22j52M16Q8m47PM43p5m29J66M05k37l55K86L25l57k55L83K00m28j05M40
5719A97L1m66P3M21j27l90J76L71k57l40L20K77l49k29L77J46l78j04M25K3m12
5740b15M3L99j00l92J85L51k55l03L06K47l27k09L95J36m13n8M23k6m25J14L99
5761B75j66l66K21L24k90l05L67K37m12j48M15Q6m31pM30p7l97J00L98j88l58
5782b92K47L23k92k71L47K00l66j55M10P6l80k6M08n3m00J18L71j92l33K53L08
5803C01l38k28L51J86m05j14M39K7m19K5M26j21m03J92L64k35l32L08K49l40k07
5824b74L81J36m06o5M11J5m19P5L90j35l64J93L26k26k97K75K64l29k09L69J48
5845B59m09m6L91Nl97P1L83j53l52K02L16k61k84L21K11l56j60L96P2l99lM00
$$ y = [-122, -274, 142, 230, -217, -210, 233, 158, -271, -105, 300, 63, -292, -6, 319, -38, -293, 90, 290, -138, -243, 197, 228, -238, -165, 256, 129, -261, -85, 286, 29, -311, 9, 286, -63, -292, 85, 231, -147, -251, 174, 197, -215, -172, 227, 127, -265, -80, 271, 16, -287, 19, 266, -61, -270, 125, 261, -152, -210, 213, 187, -238, -124, 275, 109, -257, -36, 288, -2, -307, 60, 297, -115, -263, 152, 238, -193, -200, 230, 153, -244, -144, 254, 66, -292, -45, 278, -14, -285, 62, 262, -104, -259, 151, 227, -153, -179, 229, 176, -224, -106, 265, 73, -260, -7, 301, -37, -265, 86, 272, -133, -247, 192, 219, -200, -175, 251, 130, -273, -81, 283, 48, -284, 24, 273, -67, -274, 107, 243, -163, -228, 183, 198, -221, -146, 244, 109, -255, -62, 264, 38, -259, 16, 280, -49, -258, 111, 259, -150, -196, 195, 200, -197, -126, 257, 104, -248, -46, 270, 9, -275, 46, 257, -99, -259, 137, 209, -190, -193, 207]
5867B07m8m01J19L97k09l47K53L06k75k69L44J73l57j11L75N8l80oL91n8l76J16
5889i8L73j98l22K18K95k86k45L28J87l57j20L79K5l92M7L86j05l65J53L43k21
5910B5l07K90K51l23j97L69J15l74o6M16j9l96R9L66j47l47K08L15k70k68L19
5931E9J97l09j88L68J04l69m4L64j3l80P4L74j41l42J85L16k54k54K84J95l19
5952i3j54L66R2l91j3L88l9l66J03L72j90l22K40K82l00k31L50J55l65j00L87
5973A71M0l79J5L89r9l77J47L43k00l09K52K57l01k02L45J41l58j00L63M5l61
5994a78J1L76r2l46J49L25j96l06K57K59l24j70L39J27l57o1L83j5l74Q3L69j58
6016A01l50K28K99k80k55L08K15l64j33L60Q0l85k6L93n8l70J11L61j70l20K25
$$ y = [207, 159, -242, -123, 274, 65, -282, -29, 277, 2, -267, 77, 250, -107, -218, 157, 215, -165, -171, 220, 162, -214, -98, 275, 77, -245, -27, 268, -18, -263, 65, 252, -105, -225, 154, 179, -213, -166, 220, 115, -250, -97, 246, 25, -282, 8, 259, -64, -261, 108, 223, -151, -217, 199, 180, -216, -117, 249, 102, -245, -37, 278, 8, -260, 59, 256, -53, -241, 127, 231, -138, -182, 182, 169, -211, -137, 237, 96, -246, -61, 255, 1, -253, 31, 226, -93, -247, 119, 211, -180, -193, 195, 156, -210, -107, 265, 75, -247, -7, 275, -25, -256, 94, 249, -116, -216, 171, 211, -168, -153, 236, 137, -240, -93, 250, 50, -259, -7, 250, -51, -253, 92, 233, -125, -225, 138, 183, -178, -167, 209, 117, -229, -80, 245, 49, -257, 0, 259, -65, -235, 104, 231, -126, -187, 196, 181, -193, -110, 259, 101, -249, -21, 278, -2, -257, 51, 266, -98, -231, 129, 209, -176, -202, 191, 133, -237, -126, 235, 65, -255, -30]
6037c0K90k87k22K88K10l43j42L66O2l70nL89n6l59J08L45j81l11K47K85k98k34
6059b48L31J70l59r7L67K6l82M6L64j02l46J62L16k35k71K73K37l22j88L64J20
6080B26l71p1L85j7l51M8L75j16l42J59L25k23k62K67K03k66j87L20J31l52o1
6101a80L63ml50O0L36j25l27J72K98k40k54K82K05l35j30L50O8l91J8L81p3l44
6123b20J31L26j81l19K50K68k84k29L31J67l32j07L38N9l68K3L52p2l31J24L05
6144B31j63k80K01K51k58k21K88J82l19j15L42L2l47K6L39p7l62J67L00k02k66
6165b51K73K12k93j64L20J12l45l3L35j4l43R7L29j62k89J68K78k18k49K94J74
6186B31k93j46L11J14l66j6L31j8l42Q4L12j21l00J72K72k16k38K53J77k83j46
$$ y = [-30, 260, -27, -249, 39, 249, -94, -236, 130, 192, -178, -183, 206, 150, -209, -101, 244, 63, -248, -1, 284, -14, -248, 83, 253, -106, -203, 164, 190, -192, -146, 218, 116, -230, -68, 248, 13, -258, 15, 252, -70, -258, 106, 226, -145, -216, 169, 152, -199, -151, 224, 108, -234, -75, 250, 27, -235, 32, 235, -31, -218, 102, 233, -119, -180, 183, 179, -171, -111, 225, 100, -227, -55, 243, 3, -251, 31, 236, -99, -229, 121, 189, -202, -184, 197, 124, -220, -89, 237, 56, -263, -13, 255, -29, -258, 73, 240, -92, -199, 139, 198, -170, -147, 205, 133, -198, -74, 231, 68, -212, -11, 240, -18, -239, 49, 231, -88, -203, 139, 171, -176, -150, 189, 112, -250, -83, 217, 15, -251, 22, 234, -59, -223, 97, 209, -136, -169, 166, 152, -191, -94, 235, 73, -216, -48, 230, 12, -237, 57, 231, -62, -208, 103, 217, -149, -165, 166, 148, -194, -110, 202, 81, -219, -47, 225, 9, -229, 24, 201, -82, -228]
6207b28L15Q2l07k5L21n4k99R7L01j48k58K00K24k39j97K95J42l20p3L21K3l39
6229a66L9L18q6k95J35K74j83k60K27K17k56j66K58J44l01q2L08K5l04J9L09p3
6251A01l03J42K73j77k51K20K02k56j53K77J29l20k9K93ok99N2K99j14k81J70
6272c1K53k00k29K48J65k76j21L10N7l06j9L17l9l28J13K67j40k56J93K29k10
6293ck00K30J67k76r3K61P8k76n0L09j7l04Q9K87j52k40J78K27k16j85K47J31
6315A92k68q4K98K8l08K7K88q4k63J35K35j91k15K12J94k62j17K75O4k88l0K84
6337A22jk72L8K81q6k69J52K33j77k23K26J77k27j53K67J16k96n3K94j3k69J8
6359a15K84r5k56J58K14j78k03K10J63k45j26K92M8k81NK80m9k82J03K42j27k22
$$ y = [-228, 87, 169, -138, -163, 158, 104, -195, -98, 203, 55, -203, -3, 221, -18, -215, 80, 222, -98, -171, 150, 173, -166, -127, 191, 105, -190, -55, 219, 36, -224, 3, 220, -36, -202, 56, 200, -101, -183, 125, 150, -154, -135, 174, 101, -202, -60, 213, 36, -215, 5, 207, -49, -202, 75, 204, -116, -145, 148, 142, -157, -105, 194, 80, -201, -31, 222, 22, -207, 41, 206, -70, -191, 119, 176, -130, -149, 168, 129, -199, -86, 181, 41, -215, -22, 207, -3, -203, 27, 194, -82, -175, 86, 164, -112, -162, 147, 130, -174, -85, 202, 50, -190, -12, 215, -1, -186, 61, 192, -76, -160, 138, 166, -142, -115, 173, 89, -174, -39, 196, 5, -210, 2, 196, -66, -183, 92, 156, -132, -162, 122, 121, -151, -113, 168, 82, -187, -35, 198, 21, -202, 24, 201, -26, -179, 88, 204, -92, -145, 149, 136, -133, -115, 169, 74, -182, -24, 190, 12, -191, 19, 182, -63, -189, 103, 151, -130, -125, 155, 106, -176, -73, 169, 42, -180]
6381a80J78J88j95j89K44J27k62o7K71K7k66J3K57l6k54R5K30j14k28J37K09j92
6403gj79K36J31k40r2K66K5k51NK55n5k56R5K37j48k11J74J93k13j35K40R9k82
6426a13l7K77j2k53O4K39r4k21J26K01j53j80J98J41k45r2K44Q2k64k9K65k4k66
6449a46P0K34j01k26J33J87j45j89J86J58k08j13K32P5k76k2K73l7k46Q3K41j21
6471D2k26J67J83j69j65K28Q7k13o5K50J0k55M4K33n8k35J18J94j38j84J63J66
6493A77k04j42K21J15k41n1K30K7k56J0K37m8k27R9K10j19k09J73J61k00j12K02
6515E3R7k46j8K27J2k46L8K46j19j88J33J92j68j65K03J11k28p0K26L8k16j3K51
6538A50n3k39P8K16j11j86J20J75j62j56J90J29k27p5K18N6k16lK01pk24N2K20
$$ y = [-180, -2, 186, -9, -198, 46, 173, -89, -156, 115, 142, -124, -111, 146, 110, -144, -49, 181, 67, -161, -24, 185, -7, -186, 50, 181, -59, -151, 115, 140, -111, -106, 149, 94, -162, -67, 170, 22, -189, -15, 178, -35, -170, 70, 169, -113, -150, 127, 115, -138, -74, 165, 71, -150, -24, 177, 24, -156, 42, 183, -62, -154, 90, 172, -92, -121, 144, 120, -146, -76, 158, 57, -169, -36, 151, 6, -183, 3, 161, -47, -160, 72, 147, -129, -151, 122, 85, -161, -78, 163, 42, -184, -17, 166, -3, -168, 60, 147, -66, -131, 119, 129, -126, -82, 151, 93, -142, -24, 170, 32, -152, 11, 177, -27, -169, 52, 167, -74, -125, 105, 132, -124, -114, 123, 75, -152, -53, 157, 38, -171, 2, 163, -37, -149, 53, 150, -96, -114, 113, 125, -121, -83, 163, 44, -144, -11, 181, 13, -152, 51, 162, -66, -136, 90, 128, -88, -101, 150, 97, -142, -64, 152, 41, -145, -25, 150, -12, -168, 22, 151, -76, -151, 67, 123, -93, -96, 105, 98, -126, -74, 146]
6561A46q0k04J21J88j60j53J87J13k10o9K15L3k33K4K12n9k16R8K04j43j61J74
6583B7J32j96j20K22P1k46k1K38pk27M8K01o7j97J17J78j41j57J65J30j77j06
6605a33K10N4k04n2K27J3k17K2K23p6k03J15J76j33j60J78J04j94p1K03L3k18
6627a03J2K20n7j83M8J93j11j75J51J38j48j31K01R7k25m8K12K6j99OK10m4k02
6650a12O0J96j00j77J45J44j64j38K02R5j88p6K03K4k19K1K11n8k04R9J68j13
6672A9j60J57J14j74j00K00O0k17JK01j5k20P6J88r3j71J48J38j31j52J68J13
6694A50j90p9K11L0k02OJ87ok15N4J77p2j95J19J51j21j58J79R5j73p5J80O5k24
6718a06nK05k6j81O1J89j08j45J23J36j60j23K12O2j92m9K16Lk08L3J92o0j87
$$ y = [146, 66, -138, -17, 171, 11, -142, 45, 158, -52, -121, 94, 127, -106, -82, 130, 71, -145, -47, 157, 14, -147, 27, 159, -37, -157, 65, 136, -110, -131, 107, 100, -127, -79, 122, 55, -142, -25, 153, 12, -145, 20, 150, -27, -133, 77, 131, -73, -125, 102, 115, -102, -80, 143, 67, -136, -21, 155, 22, -138, 40, 144, -50, -121, 82, 115, -103, -91, 129, 72, -111, -63, 130, 19, -156, -5, 133, -15, -146, 55, 152, -73, -121, 91, 117, -82, -76, 134, 90, -112, -52, 144, 44, -133, 12, 156, -8, -146, 56, 151, -37, -113, 90, 114, -105, -84, 127, 69, -135, -36, 132, 19, -141, 16, 130, -44, -144, 56, 116, -101, -100, 101, 86, -134, -58, 130, 37, -134, 14, 152, 21, -131, 37, 150, -40, -119, 92, 122, -80, -74, 113, 107, -108, -54, 123, 51, -144, -25, 126, 5, -153, 26, 121, -52, -127, 53, 118, -106, -111, 94, 68, -113, -52, 137, 29, -116, 7, 143, -17, -140, 72, 134, -58, -107, 109, 112, -96, -63, 129, 69, -118]
6741a18J07J77j38j61J57J14j83q6J84M8j91k5K18l4j81M8J70o3j70R3J53j24
6763ej29J38J08j57q3J83N6j81l0J90j4j82P0J53p7j52J19J40j44j20J72O8j74
6786e1m1J86J6j91J4J79n1j73O0J79j07j43J05J29j26j33J81P3j68m3J58L1j67
6809h3mJ65k1j59P4J43p9j46J11J32j44r9J66P3j70l4J60Kj64K7J77o3j62Q2J31
6834A15j11j01J12R9j49r0J77L5j59kJ66m4j41L3J47n7j49J03J22r5j17J28R7
6857A19j70n5J57N1j64k3J81j4j66N4J45p7j31J01J39j37j10J24P6j37o6J70J2
6880G9j60J3J50l6j37N4J46j02j28J29R0j47n5J55M2j45k7J46mj53M1J49o1j27
6904h8O3J43j08r6Q4J27j31r2J48M0j39k0J57mj65K7J44m5j27O2J31j02j15J30
$$ y = [-118, -11, 166, 28, -133, 24, 138, -45, -131, 53, 101, -90, -115, 103, 69, -112, -64, 106, 43, -127, -34, 119, -5, -134, 4, 112, -45, -128, 55, 111, -70, -100, 90, 76, -106, -36, 117, 40, -112, 7, 147, 3, -117, 55, 123, -51, -92, 94, 110, -81, -67, 112, 61, -112, -52, 127, 20, -123, -18, 111, -15, -148, 33, 106, -62, -105, 53, 84, -83, -87, 78, 57, -102, -28, 115, 36, -110, 1, 133, -11, -110, 56, 129, -41, -75, 85, 87, -77, -50, 127, 64, -98, -16, 115, 4, -97, 15, 114, -35, -125, 52, 87, -72, -74, 92, 48, -93, -60, 87, 30, -119, -16, 106, 11, -106, 22, 119, -51, -106, 51, 102, -62, -85, 96, 82, -84, -30, 115, 38, -93, 8, 147, 10, -100, 24, 100, -37, -103, 67, 79, -81, -68, 82, 46, -91, -37, 109, 7, -121, 8, 98, -49, -104, 51, 93, -52, -79, 67, 63, -90, -49, 100, 39, -88, -25, 118, 10, -86, -2, 125, -6, -98, 50, 90, -49, -69, 88, 84, -81, -54, 90, 45, -82, -20, 111, 9, -106, 24]
6928B4N5j25m5J37L0j39LJ35k6j31O2J16q1j04R9Q9j09q9J51K6j17k3J29Pj41
6953f7RJ44l2j43P9J17r0j02R3Q1j15o8J22O5j39l8J24K4j38lJ33l1j19P0J14
6978I0p4j18J16O0j01o1J46K7j54J6J30j3j40M3J38p5j18J03J09j09q6J09M4j17
7002c5n0J35K0j30jJ22j2j29L2J07m6j02P1J02j01p1R6N5j04k9J07L9j30lJ19
7027F2j0j25M3J14n5j07Q0R4r9p6J19M3j16k3J32pj35K8J19n2j07N7J12j02q4
7052i5J18N2j03n4J19K0j13k1J26J1j39K9J07l0j09N4R0m7q4Q5P0j04l7Q5N1j06
7078b5k3J19k0j17L2J21o6q1N5J01q9p1Q9N1j07l3J18Qj18KJ39n7r8M8R3m7q9
7105f5O1P9q2o7J02L4r3l9J24K5j16J2R8k7j19M2J11m0q7N5R1r7o9R1O0j04k3
$$ y = [24, 79, -46, -91, 46, 76, -63, -60, 75, 49, -82, -20, 96, 15, -89, 10, 99, -10, -99, 52, 78, -39, -62, 67, 74, -67, -58, 86, 54, -89, -10, 107, 17, -85, 8, 89, -26, -94, 28, 93, -46, -84, 40, 64, -74, -77, 56, 25, -94, -24, 90, 16, -102, 14, 74, -27, -88, 58, 85, -69, -53, 77, 64, -76, -33, 105, 30, -88, 15, 124, 15, -71, 38, 82, -35, -85, 50, 70, -60, -61, 61, 49, -80, -48, 59, 13, -89, -18, 84, -17, -88, 8, 63, -41, -70, 37, 76, -54, -57, 62, 52, -73, -30, 84, 29, -78, 2, 96, -3, -79, 40, 83, -33, -56, 76, 69, -66, -38, 81, 29, -78, -21, 91, -11, -95, 23, 75, -28, -82, 37, 57, -56, -77, 49, 60, -79, -50, 57, 27, -82, -28, 62, 15, -69, 16, 86, -18, -55, 30, 81, -25, -48, 71, 51, -66, -34, 87, 21, -60, -5, 96, 7, -64, 25, 76, -31, -64, 54, 62, -56, -54, 85, 28, -70, -22, 71, 24, -65, -4, 75, -7, -74, 28, 62, -31, -70, 54, 79, -37, -25, 73, 46, -73, -31, 80, 40, -47, 8, 99, 2, -67, 24, 84, -20, -43]
7132d3R4Jj04KJ29n8r2N9P5r0n3Q5N0p9o1J20K6j21J5J14rj23L5R6m1j13P8Q7
7160G9o1q0Q1P9j14m2R6L7j15j0J13qj07L0Q5l8q3N2Q2q5p6R4N3q4n0J05J5j10
7188f2K1J16n6p7L9Q3o5p9P6Q1r7m7Q5M2q2k0J07k1r2M2Q1k5j09M3R0n1r1P3P8
7217H3j03m8R7L9r1k7R0Qj03QR7j1j06M4Q5o5p1R2K8o6m5J06L3j13j1J05j0r9
7245e4L6J00o9q3Q1Q4r2n9P9M9r4k8J13jj02j9J20l7q7L8Q3m5r2O7O9p2o5J00
7273B0L2r5l4J03K9j16NJ00j1r5M5R4o8p7Q7N3j01m3J16K8r6j2J07k6p1J5R0o0
7301A9p6O3P2o2q5Q3M9r1m5J03J3q7j3R4or7K7R3n8o9P3N2l3r5R6N6j04k0R2J6
7331F0r5LR3k2r1M3Q6l8r2O8O7n8p3Q5L4j09j6J12k2q8L0O4j7j04O4Q4p8p4Q5
$$ y = [-43, 51, 52, -52, -50, 79, 21, -71, -12, 63, -27, -80, 5, 55, -24, -85, 35, 61, -60, -45, 69, 60, -63, -28, 68, 27, -86, -8, 79, 18, -62, 19, 98, -16, -58, 38, 75, -40, -50, 63, 55, -52, -22, 63, 25, -58, -6, 76, -9, -85, 9, 62, -22, -72, 33, 48, -62, -41, 75, 19, -58, -19, 64, -1, -80, -4, 77, -20, -67, 18, 60, -22, -42, 65, 44, -48, -6, 75, 50, -59, -16, 74, 23, -68, 5, 83, -20, -68, 29, 68, -23, -50, 40, 48, -55, -47, 50, 39, -67, -23, 62, -3, -74, 18, 46, -20, -65, 41, 74, -39, -50, 55, 45, -54, -18, 82, 13, -70, 11, 95, 3, -56, 23, 72, -22, -50, 63, 62, -40, -59, 61, 24, -63, -25, 58, 13, -79, -12, 57, -15, -80, 20, 52, -43, -77, 26, 55, -61, -56, 44, 33, -62, -17, 77, 9, -68, 19, 72, -29, -72, 44, 72, -24, -36, 71, 45, -26, -11, 79, 19, -57, 6, 78, 16, -69, 14, 63, -28, -73, 30, 43, -44, -57, 37, 31, -66, -39, 54, -4, -73, 0, 52, 19, -76, 20, 76, -28, -48, 44, 60, -35, -32, 61, 39, -52, -9, 77, 39, -53, 15, 82, 24, -49, 36, 70, -39, -55, 57, 35, -53, -23, 41, 24, -80, -16, 68, -10, -84, 1]
7360AO4q3l8P9L2p9k5J00J3j14K7Q9k7q8M0P9m1q0P3O1r3m3Q6L8p5m2J04j4q2
7389c8LQ2k2q5N6P3p1o1P8M4r2l4R5Or9K4Q8l4q5L7J06m6q5O5O7p0p1J10J5q0
7419b4k9R5J6q1j2Q9jr8L8Q5n8p8Q2M8p0m9N6M9r8k1R9j5p5PJ06l0r6N5P2p2n2
7450f2O0O9j04j7R5L3j12lR5Rr9J2J04o2o2M2P1m8p4Q0M6q6l1P9K4q5j3Q5nr8
7480e7M0P7n0o5N7M3l4p8P9M3q0l2J11or1J5R1m2o5M8N0n6m9O5L7n2k3P7J4q3
7510a6rP9pp0QQ1m4p5L1Q3m0q9P0O1p8m3P6K8p2k7Q8Pp7J9O6j9q9O0N7l9q1P7
7542A6N1r7oR4j4p3NP2Kr7N2P1m7r6Q0M6n4o6Q7L5q2k2N9J7o8qQ9k3p4L4O1n2
7574ho2N5P1m4n3M8N7r2k3R7J2p8k4R4j5p6O1L2l2n8N1N3q6l3Q6J2o4lN9jo8n
$$ y = [1, 65, -18, -56, 23, 55, -24, -49, 51, 64, -50, -23, 66, 39, -49, -9, 70, 29, -51, 22, 83, -10, -53, 33, 71, -4, -46, 58, 44, -38, -35, 47, 25, -60, -4, 69, -2, -63, 15, 59, -33, -67, 28, 34, -65, -41, 47, 13, -72, -35, 71, 25, -60, 5, 72, 2, -69, 41, 56, -24, -53, 42, 58, -23, -35, 54, 53, -45, -7, 78, 20, -58, 24, 72, 2, -47, 9, 58, -40, -61, 38, 23, -52, -45, 61, 31, -65, -10, 62, -10, -62, -2, 67, -37, -54, 41, 74, -38, -41, 54, 63, -36, -24, 80, 18, -44, -2, 69, 21, -53, 27, 73, -13, -44, 35, 59, -26, -39, 46, 41, -57, -17, 60, 10, -55, 2, 45, 11, -67, 12, 55, -25, -57, 54, 48, -43, -28, 63, 21, -44, 4, 54, -2, -51, 14, 51, -1, -24, 53, 67, -16, -25, 54, 47, -23, -15, 66, 22, -53, -22, 61, 21, -68, 2, 63, -15, -58, 18, 46, -26, -53, 35, 42, -35, -16, 50, 31, -58, 2, 59, 20, -61, 16, 67, -30, -36, 58, 44, -29, -24, 48, 50, -47, 5, 76, 29, -67, 13, 59, 5, -61, 26, 61, -21, -43, 16, 33, -35, -43, 46, 23, -51, -17, 44, -8, -70, -15, 56, 12, -41, 7, 64, -28, -51, 46, 58, -20, -44, 50, 35, -41, 20, 52, 20, -38, 13, 66, -20, -53, 33, 45, -19, -22, 37, 36, -32, -37]
7606c7R6m2o2M4M2m6n0O3M2o8l2O6J8o3ON1Mp3L0P8l3o1L1O1n4m8N7N4o2l6M5
7637B1M2r6lP9lq0K8P8o0n6N3L6m6l2M8L8n6l2P1Lp8j0R2l2n6L7O1n6l4M7L7m7
7669fl4O6L6p6j4Q5j9n5nP1lp6K7O2m4m4L7N6p6l4O2K7q4j4J01j4p0mQ6l4n2K6
7701a6O8n9k9L6N3p8k5Q4mm8%P7j4o6NQ4m4o3M4N3m8m5P1Lk9n6P3L0p9%O0rp8
7734d9K9O3l1p5N0N9o1m4P2K9o8mN7K2q4j2R8j3p3K4P5m8o1N3M7n6l4P9jn8JN1
7766C7K1j01L9N2l1o1K1P7l8n1K5N4m9m0O0J7m6l6P7J3r3J2R6l3p0L6O4l7o3M8
7796@O2m8m5P0J4p5MP5j5o2jP5l7m5L7N1m6p0N6N0n6l7O1L3q4lP0k2o9L1Q0n3
7828An9N9L7k8o3O1L3n4l9P4J3o2kQ2oo9J0P1l6p4N8M8n3l5O3K0n7j7P2op7MO0
$$ y = [-37, 59, 17, -45, -1, 41, -5, -55, 8, 50, -18, -50, 16, 34, -29, -23, 28, 32, -41, -11, 67, 34, -27, 4, 65, 11, -37, 20, 74, 12, -24, 21, 63, -33, -36, 43, 40, -40, -12, 66, 6, -50, 3, 39, -7, -39, 9, 47, -9, -41, 30, 33, -45, -55, 37, 5, -51, -14, 47, -9, -43, 4, 41, -6, -40, 26, 62, -14, -28, 57, 38, -17, -22, 49, 46, -30, -3, 59, 15, -29, 8, 64, -12, -46, 16, 43, -41, -55, 46, 32, -38, -42, 44, 10, -42, -16, 52, -7, -36, 0, 53, -25, -50, 34, 30, -18, -18, 59, 45, -21, -16, 68, 24, -39, 5, 58, 10, -35, 36, 39, 10, -46, 27, 57, -22, -22, 38, 29, -49, -20, 43, 12, -63, -13, 46, -15, -59, 13, 42, -26, -30, 27, 49, -35, -47, 51, 38, -35, -11, 64, 16, -45, 8, 55, -1, -35, 44, 43, -15, -14, 37, 58, -43, -4, 48, 17, -44, -23, 54, 16, -35, -10, 44, -5, -45, 15, 32, -14, -50, 27, 40, -53, -41, 55, 22, -48, -12, 52, 15, -48, 0, 62, 14, -31, 39, 53, -22, -18, 57, 42, -20, -21, 54, 17, -28, 9, 60, 14, -56, 0, 50, -6, -43, 18, 51, -33, -36, 34, 12, -57, -26, 54, 1, -58, 1, 38, 10, -53, 8, 41, -13, -52, 22, 35, -27, -29, 53, 47, -22, -12, 59, 23, -51, 7, 55, 2, -33, 30, 50, -7, -24, 48, 42, -35, -31, 29]
7861B9lo3M7L1m8n3O7L5p3l9Q7L5o9m6Q0J0o6J0O6j7p4M9M9l2o0O0O0o6n6Q8J
7892C9m4k6P0Pp1qQ8j1j15N7O8m8o1N0L3m6l1Q4np3j5R6j9o4K2P2m7n4L3O6n7
7923a0m3N7N1n9m6R2Pp7%Q1Pr9N0N2l2p2M4N5n4n3P0M2o2n0Q5J7r5kQ2j3q2K2
7955c5Q3l5o9N3N3o5l8Q0J2o6qO9Qq5RQ5k0p7M8P3n7o5P5L4o6k5O2J4n8rN0K9
7987E9j04J1Q2m3o4L6O5n1n6P6K5o5l6P0L6r4RP3j1p3J8Q2n0m3L6P3n3n3O2N7
8017G4q9k1P2Po5qP6j8o4J7O1j5q1M1N6o1l9P0L0o7k0P5op3NP8Jq9J9P8l5o3M4
8050a0P5p4m1P1J4n8l8J10j3o5J2P1j1r4M4O8l9p6P4L9p0l9Q7J9p1k7P8j7n5J5
8080b1N5m2m1J8Q2o5l2M2N3n4l8O1L7q4k8Q5Op7L1R1n0p8N6N2l1n5M4K5n6k1Q8
$$ y = [29, 26, -37, 10, 41, -7, -60, 7, 42, -31, -70, 17, 52, -17, -63, 17, 27, -39, -29, 37, 20, -54, -5, 44, 12, -48, 12, 72, 6, -50, 38, 39, -5, -31, 39, 46, -25, -33, 55, 44, -71, -14, 54, 6, -55, -5, 28, -18, -49, 35, 30, -43, -58, 38, 19, -45, -23, 49, 2, -52, -19, 47, -10, -53, 4, 55, -4, -50, 42, 49, -28, -28, 53, 60, -39, 11, 63, 31, -41, 3, 58, 4, -49, 21, 63, 1, -49, 36, 53, -42, -44, 38, 25, -57, -35, 48, 13, -56, -3, 50, -15, -53, 27, 39, -27, -35, 34, 42, -43, -34, 51, 31, -46, 2, 75, 18, -47, 28, 62, -4, -29, 33, 47, -11, -20, 30, 59, -45, -34, 48, 5, -59, -23, 42, -9, -65, 11, 36, -29, -65, 5, 41, -53, -44, 29, 18, -55, -37, 45, -5, -48, -12, 61, 8, -45, 17, 74, -15, -36, 36, 43, -22, -30, 46, 28, -36, -19, 42, 27, -54, -13, 43, -18, -57, 13, 43, -24, -44, 31, 25, -48, -43, 35, 36, -53, -34, 44, 9, -54, -10, 65, -9, -50, 21, 35, -23, -61, 49, 36, -29, -17, 54, 43, -51, -7, 61, 22, -54, 20, 59, -11, -50, 37, 56, -15, -42, 36, 19, -36, -21, 34, -8, -49, -31, 51, -14, -46, -4, 49, -5, -43, 18, 55, -29, -57, 28, 34, -43, -12, 79, 29, -49, 7, 59, 28, -27, 17, 42, -14, -35, 53]
8111E3j3p1k0P5po5L0N8l0n6M6L3n1l1M1J9m1j3N8K4p4rP3jq0L7P9o0l5K2O8n9
8143@m7O6M0o8m0Q6J0q3%P4k0n0J4O1l8n5O8J0m2k4N3K6o5k0O4j5m9QP0k4p9M3
8175b6P7m5o4M7O8p0k8P3jn1j0P6Rq1OQ0
$$ y = [53, 40, -31, -51, 24, 17, -48, -18, 40, 10, -46, 0, 33, -18, -49, -8, 11, -30, -43, 15, 39, -35, -44, 29, 28, -52, -15, 64, 4, -31, -9, 59, 0, -47, 19, 59, -9, -49, 37, 47, -36, -36, 38, 18, -32, -18, 43, 5, -50, 18, 28, -14, -38, 15, 41, -24, -44, 20, 5, -44, -36, 34, 10, -69, -26, 51, 6, -58, -11, 57, -13, -41, 32, 31, -20, -30, 46, 55, -26, -20, 60]
8191F0
$$ Imaginary data points
##PAGE= N=2
##DATA TABLE= (X++(I..I)), XYDATA
0@%%%%%%%QqQj6J6k4L2m0N6p0P8r1J15j44J71j98K35k80L28l79M41n13N90o73
31c58P65q72R94j122J263j423J598j788J996k225K478k754L048l373L732m120
47b161M544n011N522o083O701p382Q140q989R938j1013J2244j3660J5314j7277
61i173J9653k2601K6362l1353L8351m8925O6938j05560L29136m07799n39004Q03354
73A19379J65665n03009J40780O49554m75686q15411M16504Q95338l00164o15485
83c22535K95056L00414n81069j45588Q37018K58198q68878l22595O42037J61851
93B53909m75786J95340N27693m31951p19603M18016P50281k76432n30152K93127
103D442K25113n20028j04179P60378J85377p72710k54073N81403J02264m19635
$$ y = [0, 0, 0, 0, 0, 0, 0, 0, 8, 0, 8, -8, 8, -16, 16, -24, 32, -38, 40, -51, 64, -80, 91, -107, 128, -152, 176, -203, 238, -275, 315, -358, 407, -465, 529, -593, 670, -753, 845, -943, 1053, -1172, 1306, -1448, 1600, -1773, 1959, -2161, 2383, -2628, 2894, -3189, 3512, -3870, 4270, -4719, 5219, -5794, 6450, -7210, 8104, -9173, 10480, -12121, 14241, -17112, 21239, -27686, 39252, -66308, 262828, -144971, -683975, 119379, 285044, -217965, -77185, 572369, 96683, -718728, -302224, 593114, 292950, -322535, -27479, 272935, -308134, -453722, 383296, 641494, -227384, -549979, 92058, 253909, -221877, -26537, 501156, 69205, -650398, -232382, 517899, 241467, -288685, 4442, 229555, -290473, -394652, 365726, 551103, -221607, -475680, 105723, 207987, -211648]
113b11648K04534M65364m22017o21919M05616O49878k82967m47519K87355J75006
123B01683m82255n8305O86043J27017o93260j86312N15365N6709l62828K11861
133A5718L92326m01094n24976L83422N46782k67589l66837K62954J23660m28002
143b63636j8930O04189Q0535o08005j36352M47534K5274l08813K10592L32290
153C64678l77859m49114L61707M68742k57330l08383K50753R0179l95510N806
163b46331N51084M6835n52805r5798M06546l358k77847K13991K93198l63288l92645
174d20418L47431M06178k50381k59160K38939O0213l62475K8869M96417J7201
184C02814m93105o2692L56709k3003k35309K08898K43989l40795l30628L24083
$$ y = [-211648, -7114, 458250, 36233, -585686, -180070, 469808, 186841, -260678, 26677, 201683, -280572, -338877, 347166, 474183, -219077, -405389, 109976, 166685, -196143, 15718, 408044, 6950, -518026, -134604, 412178, 144589, -222248, 40706, 164366, -263636, -282566, 321623, 402158, -205847, -342199, 105335, 130609, -178204, 32388, 364678, -13181, -462295, -100588, 368154, 110824, -197559, 53194, 143373, -252137, -246331, 304753, 351588, -201217, -297015, 109531, 106173, -171674, 42317, 335515, -27773, -420418, -72987, 333191, 82810, -176350, 62589, 122802, -239673, -210804, 285613, 302814, -190291, -252983, 103726, 80723, -154586, 54312, 298301, -42494, -373122, -49039]
194d9039L42768k32790k11143K17471L1340l24799N0486M44294r431m41565l3415
205b15823L17578m1469k04762K08814K08708l29597k85024L15733K95823k31650
215C8331j75624K13633R289l06814O9578M12654l5024m08061m549K91149o0932
226D3630j81718K11038J78460l19712k43776L04756K52169k22865j41928J99278
236G9332j1189k77967Q4317L70819n1876l64312J2274K54831o7841j51646K02211
247G8953J46385l00347k05909K85505K14807k08483j14818J84552k5884k55370
257b00609R4130L40450o5031l34529K8406K32915p9082j35585K02798J27793k93663
268h2007j80104K79725J86545k06749r2633J81168l9391k42400J04478L17241
$$ y = [-49039, 293729, 60939, -150204, 67267, 98607, -226192, -175706, 268588, 259157, -182408, -215823, 101755, 60286, -144476, 64338, 273046, -56551, -341575, -25842, 269981, 38331, -137293, 76340, 85629, -221185, -151607, 261047, 226023, -182038, -186587, 104562, 43630, -138088, 72950, 251410, -68302, -312078, -7322, 244847, 21982, -119946, 79332, 68143, -209824, -125507, 245312, 193436, -170876, -158602, 96229, 28388, -123258, 78953, 225338, -75009, -280918, 4587, 219394, 10911, -103907, 80645, 54761, -200609, -106479, 233971, 168940, -165589, -137183, 95732, 16650, -118935, 83863, 211656, -82007, -262111, 17614, 204159, -2590, -95223, 85945, 46554, -195846, -91368, 225873]
278B25873p8310l08399M3086K10726q6949j16485J98121J05374k79288j51569
288b37820K63404J57383j92005p1335J63770n0235k16555J10204K83763q5051
298A25523k75119N0191J84247q8035r5537J89229Q3528k64349j25711K50127J31771
309A65865j83299n2628J55011o0898k01711J18531K62842r6680k54165O4052J68241
320H5161r7520q2611J89738O7545k58250j03938K43427J08634j78180l5159J47154
331H6001p0288j85695J23836K38827j02482k28445O9344J46779r6456o5318J78367
342I4470M9814k39301q3430K23553Q9036j60971k2629J30024p3940j64225J23053
353c4546K13128j02821k03887P1289J28372r5519n2259J71133L6804k27968o6983
$$ y = [225873, 147563, -160836, -117750, 92976, 6027, -110458, 87663, 193037, -86251, -237820, 25584, 182967, -9038, -80373, 83397, 33162, -183393, -73189, 210574, 125523, -149596, -99405, 84842, -3193, -98730, 90499, 174027, -90322, -216033, 34094, 165865, -17434, -70062, 84949, 24051, -177660, -59129, 203713, 107033, -147132, -83080, 85161, -12359, -94970, 94768, 162313, -95937, -199875, 43552, 152186, -25994, -61153, 86001, 15713, -169982, -46146, 192681, 90199, -138246, -68902, 77877, -18579, -83897, 94470, 144284, -95017, -178447, 45106, 134142, -26829, -49458, 80566, 6626, -157599, -34546, 178582, 75761, -128126, -56837, 71535, -23984, -76243, 94890, 131694, -96274, -163257]
364a63257K13699P1568j55038r412J24657q1319j54119J28283J97459j10204j87074
375a24757Q0141J14732j00523m1154J68275K3869k18796n0315K03121N4700j45333
386c6040J998J13047q5275j36814J28014J74973j09639j64639P8963R6966r4620
397c3066k7751J55212J0965k01243l5850J86427M1282j31924J0165J00436q7425
408a2772j21464J28132J56809j11706j47542Q2816Q4145r6441j7995J52267Q9
419I6338j95098k1718J80823K6347j28204K1619R5855r4059j12335J32306J43020
430A44894j16272j32763Q7098P1952r6642q432J45770r563j83329j0712J67859
441E9860J6368j16326K6640Q3702r2838r7409J27497J25629j11285j16393Q2361
$$ y = [-163257, 50442, 122010, -33028, -42440, 82217, 898, -153221, -24938, 172521, 62317, -124757, -44616, 70116, -30407, -71561, 96714, 120583, -98213, -148528, 54593, 109293, -36040, -34042, 79005, -6270, -143084, -15070, 159903, 50264, -114375, -35412, 61554, -33066, -60817, 94395, 105360, -95883, -131733, 54694, 95976, -35948, -25783, 74653, -12772, -134236, -6104, 150705, 38999, -108543, -25727, 58418, -38023, -56018, 96249, 96338, -98760, -120478, 60345, 86692, -41512, -19893, 75962, -18097, -130432, 1874, 144894, 28622, -104141, -17043, 54909, -41733, -50165, 95605, 86042, -97287, -107999, 59860, 76228, -40098, -13458, 70244, -22594, -120003, 7494, 133123, 21838, -94555, -12194]
452a2194N9969q9836m13J35017j6688j70364k225J56233P822j07857L2448P6456
464F8368r5110q8268J28647J13935j14195j04528Q6808N0387r2736P397J33798
475I4503k5478j65722Q948J50913l731j03063M0749P0477r8754p8607J29358J00860
487A20453j14213r1233Q5757M0015q7995J4738J23874l2015j52230J5745J37358
498F0254q992r1365M1793N9467r5133o6283J23639Q7283j09237p9049Q1927L1274
510C5578q3149K0695J16421l7932j43318K3378J29549j7238q5667M8079N4091
521F0487r8497n8686J25732P6998j11955o8270Q4965K2407q4038K7580J13088
532H9811m4617j36315L0809J21554k3926p8332N1165M6718r6753m9546J20630
$$ y = [-12194, 47775, -42061, -42474, 92543, 75855, -94509, -96734, 59499, 67321, -40536, -8088, 68368, -26742, -115010, 13637, 127572, 13377, -91151, -4343, 46044, -46692, -39295, 94503, 69025, -96697, -87749, 63164, 59433, -43630, -2881, 67596, -31158, -109765, 19593, 120453, 6240, -84993, 764, 40779, -47216, -32478, 91396, 59381, -92849, -77104, 60254, 51262, -40103, 1690, 61157, -33976, -100259, 23380, 110663, 1426, -77623, 4304, 35578, -47571, -26876, 89545, 51613, -91705, -68327, 61222, 43984, -41683, 6396, 60487, -38010, -96696, 29036, 106034, -5921, -74191, 10774, 33181, -50857, -23277, 89811, 45194, -91121, -60312, 61242, 37316, -41016, 10149, 56867, -39886, -89432, 31198]
543C1198O6221j05952n8314P8666J5835p5928L0552J01891m6016j23274L2400
554e2721J09418k5038o8819M9861L8853r2541m1132J15345N6688j02094m9182
565f1362P6451Q949p3422L5647R7194n1477j16774L9629J03097l2851o3624N5731
577A7188L3443r5264l3504J16135M6666j02508l9085P6321J117p0672M0943R0476
589H1256n5818j07159M3768R3216l5414n5085N4522K5598q9851k4965J08367L7656
601G6091r4722l1633O9016k987o2578M2105Q0657n6197r6545M4859Q3937l6647
613A5356m8168N4363J9808q7767j8316J05686K9612r3095k3538O8495r584o1373
625d8521M7259P7072o1268r0852N0766P7824m2396m2754N7786J4558q7797j1968
$$ y = [31198, 97419, -8533, -66847, 11819, 27654, -48274, -17722, 84169, 38153, -85121, -52721, 56697, 31659, -37160, 12701, 51554, -40987, -82119, 33226, 89914, -12180, -61362, 15089, 24038, -49384, -13737, 83457, 31980, -84794, -45165, 57932, 25081, -38543, 17188, 50631, -44633, -78137, 37998, 84664, -17844, -56929, 19392, 20509, -50163, -9220, 81256, 25438, -81721, -37953, 55263, 19849, -35236, 19286, 44884, -44967, -69932, 38435, 76091, -18631, -50264, 18752, 15765, -46813, -4708, 75949, 19752, -76793, -31934, 52003, 15356, -32812, 21551, 41359, -46408, -64724, 40962, 70574, -22521, -46059, 22436, 12852, -48521, -1262, 75810, 14542, -76310, -25544, 52280, 9884, -32870, 24916, 39474, -48323, -60291]
637f0291J03219K2124q9754j6712O4707j3775n6063M8380O9397o0654q1600M9558
649b1464O9165m0265l6142N3415R596q0860p167R5148J7119q2585j2505N8892
661B2347j5932n0449M8866O2754o1184p4256N1375O2524m2785l0822N5015M567
673C2020q0772r09R4213R262q1874m536N8251k2414m8385N3655N8122o5298o7655
686f6320N5341N5654m5515k5011N4971n63p7392M414Q8707L908p5899o33N2364
699B4026k3383m1926N1848N0485o2130n9577N2055M8815m2024k0334N0339l725
711B4469p1369P508Q2324K99p0625K780M8522k5678l8346N3059M5881o3389n3955
724e8520N4302M3177m4765j5489N2081q211p1138J2703Q0544n827o8379Q645M6120
$$ y = [-60291, 42928, 65052, -24702, -41414, 23293, 9518, -46545, 1835, 71232, 10578, -71022, -21464, 47701, 7436, -28706, 24709, 34305, -46555, -53722, 41426, 58545, -24040, -36545, 22347, 6415, -44034, 4832, 67586, 6402, -67854, -16479, 46045, 3260, -27562, 27453, 32020, -48752, -49661, 44552, 53814, -28060, -32596, 25655, 3241, -45144, 8511, 66633, 1335, -66320, -10979, 44675, -840, -25851, 29120, 28557, -48835, -44421, 44286, 48194, -27705, -28338, 24026, 643, -41283, 10565, 61050, -1080, -60657, -8602, 40213, -1811, -22145, 28194, 24469, -46900, -39392, 42932, 43231, -27394, -24614, 23908, -1770, -40116, 12943, 58824, -4565, -58520, -4218, 38959, -5806, -21295, 30786, 22575, -48563, -35860, 44684, 38857, -29522, -20877, 25243]
737B5243k9673l5009N4716M0790o3474m7605N3639L7258m3106j1254M8406j0861
749A9070o5066J4658P3237p490o1432R165M0218k8078k9504N1228L4865n9465
761h594m1550N0372L2104m0400p689M5252j3617o0961J7956O8842j1803n7779
773b7867J3691L7264l1668k6097N3703K9977o1716l5330N2862K5866m2418k332
785a4065M5486j8342n8810K2771O5046j6600n3577J7238L3149l2733k1588N2235
797B0210K4625n8734k9767M9347K1478l8391K0M0238j8990n2271K2796N8177j6511
810B2227m7685J6588K8644l0893j7672M9371K0372n5941k5134M7501J7231l7264
822a2655L356L8838k1949m9847K6307N5061k0897m4622K1033K5832l4247j4379
$$ y = [25243, -4430, -39439, 15277, 56067, -7407, -55012, -1373, 35885, -7221, -18475, 29931, 19070, -45996, -31338, 41899, 34409, -27023, -17858, 22360, -5718, -35222, 16006, 50871, -8594, -50144, 228, 32332, -8068, -15757, 29495, 15878, -45083, -27127, 41715, 29912, -27867, -14176, 23088, -8580, -34677, 19026, 49003, -12713, -48043, 4819, 30685, -11733, -14065, 31421, 13079, -45731, -22960, 42086, 25486, -28091, -10853, 22296, -10437, -32025, 20210, 44835, -13899, -43666, 5681, 27159, -11232, -11212, 29026, 10036, -42235, -19439, 38738, 22227, -25458, -8870, 19774, -11119, -28791, 20580, 40952, -14989, -40123, 7378, 24609, -12655, -9299, 29539, 7590, -42257, -15950, 39111, 18214, -26408, -5375, 20457, -13790, -28169]
834b8169N1238J5897n6816j9774M8006J2109l7080P230L7076k4499m6202K8126
846a2858N0317k2191m0027K1126K1957l2330j0940M7426J2410n2193j6490M3539
858I746R903l2858P792L2622k4004m1224K7591M5437k2190l5994K1282J8853l1990
871a5034p936M6590Q658n1508j1926M3390N357l2935J1902L1868k7819l9097L1680
884f810M2270k6500l2607K4917J5569l4047m396M6843M537n0533p700M1863K001
897A5407l0816J3557K8765k7911l4970L0862L7818k5128k8875K2772J3030l0754
909a6243k636M2615K986m6194o259L8215J065k7876J3683K6011k7651l1880L0988
922c176L4573k6034k5937K4122J0423l1789J68M2984o23m6220j867L8186l355
$$ y = [-28169, 23069, 38966, -17850, -37624, 10382, 22491, -14589, -7359, 29717, 5218, -40984, -12858, 37459, 15268, -24759, -3633, 18324, -14006, -24946, 22480, 34890, -17303, -33793, 9746, 19649, -13209, -5417, 27205, 3201, -38023, -10432, 35005, 12815, -23179, -1897, 16956, -15034, -22970, 23620, 32278, -19230, -31156, 12234, 17591, -15344, -3442, 28426, 607, -38490, -6810, 35460, 8960, -23647, 1270, 16839, -17208, -21604, 25239, 29776, -20757, -28457, 13406, 15407, -15409, -1852, 26913, -998, -35968, -5106, 32712, 7584, -21291, 1481, 14511, -16243, -18879, 23736, 26722, -19472, -25731, 12484, 13549, -14327, -644, 25367, -2284, -34164, -3176, 31397, 5363, -20574, 3548, 13971, -17818, -17650, 25334, 24711, -21509, -23376, 14810, 11455]
935A1455k7641J7456K4841l0628k9447L3512L1235k8157k2573K5335P549l1459
947a8522K667M1050l011m3335J56L5154m354k4606J6938K1552k8858k5803L1287
960C15K7740k5942j9909K2993N860k8623L900L7865m470m0406J998L2886o150
973H057k2777J8386J9450l0228k2962L3010K4363k8179j6415K5086K470k9862
985a9601P510L7989q599l9703O348L1776r902k1275K0897J7228l1473j9908L3352
998D639K1044k7847j3674K3916P78k7563Q346L4690q925l6072O181K8576q981
1011E108j8691J9032J4918k8951j7597L0882J8850k5898j1977K2366l90k5987
1023a8335R472L2866j0584l4276Q498K7044j1538j7240K1328J2960l0904j4785
$$ y = [11455, -16186, 1270, 26111, -4517, -33964, -452, 30783, 2626, -19947, 5388, 12937, -18522, -15855, 25195, 22184, -21151, -20995, 14159, 9805, -14801, 2137, 23689, -5169, -30972, 315, 28055, 2113, -17796, 5197, 11057, -17566, -13666, 24199, 19729, -20677, -18679, 14207, 8057, -14720, 3666, 23116, -7112, -30074, 2936, 27299, -880, -17295, 7791, 10261, -19601, -12091, 25898, 17299, -22404, -16056, 15720, 5818, -15457, 5440, 22668, -8805, -28713, 4639, 25683, -2164, -15838, 8078, 8856, -18707, -10361, 24329, 15404, -20668, -14487, 14089, 5108, -13583, 5449, 20367, -8584, -26181, 4701, 23551, -2347, -14324, 8042, 7652, -18335, -8863, 24003, 13419, -20857, -12359, 14685, 3147, -14093, 7235, 20195, -10709, -25494]
1035b5494L2766J5361k7703q390K3691l686k6211J2503L1863j3500l2496J1129
1047a0167K4992j3221j5137K1623J0695k9926j2313L1056J3120k5698o985K1313
1059I352l995k3329J2065K8615j2853k9406J0414K2540j2232j3326K0268Q999
1071A7112k8464j0348K9933J0941k5117m867K0986n998k2738J4297K7441j5546
1083G632k7852J3515K0878j5218j1444K2599O588l0006p290L0917P594k5645j874
1096i606K0851q236k1612J5727K5495j6463k5520J3786J8800j4635r831K0921
1108I677N355k7520o307K8204O952k3144j887J8604p498j9442J4655K3286j5552
1121E383k3501J3324J7186j4414q521K0707L895k7244m312K8072M454k3242Q15
$$ y = [-25494, 7272, 22633, -5070, -13460, 10231, 6545, -19666, -7163, 24700, 11200, -21296, -10167, 14825, 1604, -13533, 8090, 18785, -11141, -23454, 7602, 20722, -4976, -11961, 9352, 5357, -17972, -5907, 22708, 9855, -19551, -9137, 13403, 1171, -12155, 8113, 17112, -11352, -21700, 8233, 19174, -5943, -10810, 10176, 4178, -18560, -4263, 23178, 7632, -20220, -6705, 14173, -1045, -12489, 10110, 16698, -13308, -20598, 10319, 17913, -7732, -9606, 11245, 3009, -18603, -2876, 22619, 6156, -19364, -5578, 13222, -1413, -11244, 9677, 15032, -12488, -18795, 9409, 16361, -6783, -8670, 9934, 2436, -17006, -2351, 20935, 5383, -18118, -4794, 12392, -2022, -10543, 10164, 14059, -13185, -17497, 10575, 15029, -8213, -7398]
1134g398J8639j0160j8893J7275K1963j8268k1601J5984J5068j6557o342K1859
1146A1569J583k7393j844K7501K195k2284K338J7310j0690j7110J6974J9796j7394
1159B551j9561J4756J3558j4832n507J9641J094k4895j445K5203J872k0431K445
1172e551J5792j0577j5540J6920J8041j7786j7669J5604J1693j5821l548K0366
1184A1924j266k5252J501K5273j419k0299N615J5227j3300j4268J9133J6055j9610
1197f86j5346J6918R498j6345j726J9915k730k3948K619K3615k096j8579N484
1210c407J3614j2278j2681J7512J4500j7803j4060J5200Q758j4665j461J8168
1222A1397k902k2192L029K2075k766j7412O291J2586j3111j1402J8504J2687j9053
$$ y = [-7398, 11241, 1081, -17812, -537, 21426, 3158, -18443, -2459, 12609, -3948, -10290, 11569, 13152, -14241, -16085, 11416, 13611, -8673, -6335, 10975, 285, -16825, 149, 19945, 2551, -17010, -2254, 11304, -3528, -9035, 10606, 11700, -13195, -14640, 10563, 12435, -7996, -5551, 10241, -336, -15876, 1044, 19085, 1299, -16370, -766, 10927, -4894, -8442, 11924, 10658, -14594, -13093, 12180, 10761, -9538, -3923, 11304, -1996, -16264, 2869, 18924, -686, -16032, 886, 10384, -5961, -7687, 12228, 9498, -14450, -11831, 11784, 9688, -8891, -3407, 10207, -2071, -14752, 2760, 17260, -543, -14603, 597, 9355, -5310, -6771, 11397, 8495, -13697, -10668, 11407, 8641, -8771, -2480, 10106, -3005, -14407, 4097, 16784, -2269]
1235b269j1859J6595O369j5867J036J8758n578k2130N970K1509n691j6486Q672
1248i71J1324j4679r679J9244J0701j9213r941J6264M983j4946J757J7221n772
1261F293k0180N769J9597n080j4969P630J0122j3179q656J7604R696j7765r065
1274a2183J5159M312j4046K322J6298o569j9154O994J8578o712j3954R348Q920
1287I313j4743o991J8983P479j9009o507J6190J777j4599M669J6116q654j8285
1300a4261Q827J7326q130j2608J0034P670j4575n827J8124O461j7781n842J4823
1313D241J662j3065M084J4495p685j6710P788J5968p070j1696Q969P037j3496
1326e478n173J7164N576j7115m781J4476N22j2835N396J4032r261j5835R665J4811
$$ y = [-2269, -14128, 2467, 8836, -7031, -5995, 12763, 7185, -14945, -8975, 12534, 6843, -9643, -971, 10353, -4326, -14005, 5239, 15940, -3273, -13214, 3050, 8033, -6913, -5156, 12065, 6293, -13887, -8118, 11479, 6399, -8570, -940, 9182, -3997, -12653, 4951, 14647, -3118, -12183, 2976, 7288, -6758, -4436, 11862, 5293, -13861, -6867, 11711, 4999, -8955, 393, 9313, -5430, -12421, 6562, 14041, -4968, -11475, 4715, 6492, -8107, -3438, 12678, 4024, -14261, -5434, 11892, 3762, -8846, 1188, 8858, -5717, -11544, 6580, 13041, -4740, -10582, 4241, 5903, -7162, -3078, 11417, 3732, -12978, -5190, 10778, 3708, -7988, 981, 8018, -5478, -10651, 6513, 12089, -5026, -9807, 4669, 5191, -7644, -2248, 11784, 2523, -13312, -3647, 11164]
1340A1164r133j0308J0861N420j4910l232J8067L324j7570k485J4526j424j2417
1353h117O739J3118j0079j4532J0013J3476q994r291J0151M751j3628k832J6411
1366G186L209j5958k703J3128q20j1201N846J1970r135j3458R312J2548q602q491
1380g169R922L986j3446j844J6306J764j5912q68J3053k735j0969P807J1230j1046
1394G9j2235J1191J0973j0255o800J1101K269j3971j23J6184J63j5378L66J2320
1408E884l415j0049P783J0183j0501j1151J0279J0144r151o408R788K332j2484
1421f766m05J4708M76j4127N6J1379l065r264P452R381j0361j0207J0516R024
1435H797r626n196J0301R04j2808J345J4763j592j3971K282J0986n168q544R231
$$ y = [11164, 2031, -8277, 2584, 8004, -6906, -10138, 7929, 11253, -6317, -8802, 5724, 4300, -8117, -1378, 11740, 1661, -12871, -2858, 10618, 1624, -7667, 2484, 7235, -6393, -9225, 7186, 10395, -5563, -8266, 4862, 4042, -7159, -1313, 10657, 1522, -11936, -2624, 9924, 1322, -7169, 2753, 6739, -6707, -8551, 7755, 9519, -6393, -7261, 5792, 3057, -7912, -105, 11125, 79, -12156, -965, 10008, -247, -7047, 4054, 6323, -7648, -7771, 8413, 8576, -6802, -6436, 5884, 2469, -7580, 203, 10386, -115, -11266, -987, 9157, 6, -6402, 3386, 5718, -6766, -7171, 7537, 8013, -6114, -6058, 5321, 2256, -7008, 444, 9825, -536, -10743, -227, 8797, -829, -6025, 4276, 5180, -7628, -6283, 8480, 6888, -7083, -4801, 6185, 1017, -7527, 1704]
1449A704Q186j1765q647J1545P384j0243l742J0372k07j2341K180J3857k077j2948
1463f742K311J0082m670p754Q243P511j0487q154J0287P152r098l817R325L9j1329
1478g101J957J2954k101j2193K581R471n098p116Q777O614j1151o892J1061N601
1492G364r893k120R891j742j1474L806J2690m015j1598M322Q650o399o131R504
1506B855N555j1407n800J0920M747r440j698R197j697j0545L369J1684l260j0790
1520f310L400Q144n311n922Q322N433j0232n726R993M695q819j660Q707j836j0060
1535g182L782J1129m073j0132M426P401o365m975R328M113j1122m050J0714K840
1549E834r265J69Q767l470r682N198J0442n242r265N199O573o657m198R054L478
$$ y = [1704, 9890, -1875, -10522, 1023, 8407, -1836, -5578, 4794, 4587, -7754, -5574, 8283, 6206, -6742, -4431, 5651, 981, -6773, 1470, 8981, -1506, -9660, 627, 7779, -1319, -5136, 4189, 4228, -7101, -5144, 7810, 5709, -6484, -3903, 5568, 470, -6646, 2131, 8745, -2406, -9298, 1763, 7364, -2529, -4649, 5242, 3500, -7974, -4168, 8522, 4507, -7091, -2769, 5881, -518, -6649, 2855, 8410, -2997, -8797, 2123, 6870, -2570, -4268, 4929, 3232, -7313, -3944, 7740, 4480, -6310, -2910, 5234, -77, -5999, 2323, 7756, -2476, -8202, 1791, 6486, -2333, -3993, 4714, 2878, -7182, -3400, 7729, 3656, -6476, -2050, 5351, -1014, -5989, 3339, 7452, -3670, -7720, 2994, 5834, -3431, -3262, 5505, 2035, -7647, -2449, 7993, 2751, -6514, -1315, 5258, -1399, -5597, 3457, 6935]
1564F935j0462l665R928K806q482k23P991k714q949M303R731m283q833M353O377
1579D813n886m150Q384L346r966l294R601K241q319N15P797l621q526N401R061
1594G397n562p927N663N276p030k829R182J876j0426j720R780P44q173J671P415
1609E337m404p905N771Q339n600p310N401M895o435k771Q359K035r502k086Q930
1624C054J320p573R53O939l600p497N076P984n171o960N180M587o369k301Q327
1639C949J313r498j021Q925j7p415K374O561n038o765O475O923o474n677O220
1654H35L264p034j025Q541Q4r335J2Q558p24o965K644O049m887o265O017O534
1670F303n806n575N505L412o232j417P747N87q629m87Q056l01o642K342N762m657
$$ y = [6935, -3527, -7192, 2736, 5542, -2940, -3163, 4828, 2114, -6835, -2532, 7199, 2916, -5917, -1564, 4813, -1073, -5223, 3161, 6507, -3459, -6753, 2848, 5089, -3230, -2715, 5082, 1461, -7065, -1664, 7397, 1835, -6092, -429, 4847, -2183, -5012, 4170, 6046, -4380, -6100, 3680, 4424, -3749, -2078, 5337, 933, -6972, -1201, 7138, 1538, -5772, -371, 4524, -1911, -4682, 3677, 5712, -3790, -5876, 3054, 4374, -3199, -2246, 4693, 1093, -6404, -1328, 6656, 1485, -5475, -295, 4292, -2077, -4378, 3949, 5262, -4236, -5257, 3668, 3651, -3764, -1390, 5171, 133, -6632, -157, 6766, 292, -5385, 835, 4099, -2935, -3960, 4581, 4665, -4670, -4658, 3900, 3176, -3789, -1145, 4904, 17, -6248, -231, 6303, 497, -5078, 427, 3839, -2393, -3810, 3937, 4524, -4105, -4592, 3464, 3163, -3479, -1137, 4625, -32]
1686c2n914N994O044o039m880N854K548o553l46P919p48q591J059P774j848o175
1702c934L743N047n845m914O864M877o616l786O132J667o524L16P539j077q110
1717d621J145P300j623n822L205M865n093m854O083M952n875m021N507K051o011
1732b812q0P102q53p715J118O997j808n508L535M374n529m094O552L952o428k782
$$ y = [-32, -5946, 48, 6092, 53, -4827, 1027, 3575, -2978, -3324, 4595, 3847, -4744, -3685, 4089, 2241, -3934, -191, 4856, -989, -5903, 961, 5838, -778, -4564, 1568, 3235, -3289, -2973, 4566, 3489, -4621, -3476, 3824, 2201, -3621, -416, 4449, -644, -5498, 585, 5537, -338, -4359, 1148, 3199, -2812, -2892, 4210, 3357, -4358, -3240, 3757, 1949, -3559, -24, 4350, -1179, -5273, 1279, 5231, -1197, -3979]
$$ [...]
8191B9
##END NTUPLES=NMR FID
##END=
